##TITLE=AC1743_SEN00016_9276489_UbsbA2z0AU
##JCAMPDX= 6.0         $$ Bruker NMR JCAMP-DX V2.0
##DATA TYPE= NMR SPECTRUM
##DATA CLASS= NTUPLES
##ORIGIN= BRUKER
##OWNER= Administrator
$$ 1.72 TOPSPIN		Version 2.1
$$ 2015-07-15 02:29:49.588 -0700  Administrator@X
$$ Compression mode = diff/dup
##.OBSERVE FREQUENCY= 400.02188249412
##.OBSERVE NUCLEUS= ^1H
##.ACQUISITION MODE= SIMULTANEOUS (DQD)
##.ACQUISITION SCHEME= undefined
##.AVERAGES= 64
##.DIGITISER RES= 22
##SPECTROMETER/DATA SYSTEM= spect
##.PULSE SEQUENCE= noesygpps1d.comp
##.SOLVENT NAME= COFFEE_meoh
##.SHIFT REFERENCE= INTERNAL, COFFEE_meoh, 1, 14.96108
##AUDIT TRAIL= $$ (NUMBER, WHEN, WHO, WHERE, PROCESS, VERSION, WHAT)
$$ ##TITLE= Audit trail, TOPSPIN		Version 2.1
$$ ##JCAMPDX= 5.01
$$ ##ORIGIN= Bruker BioSpin GmbH
$$ ##OWNER= Administrator
$$ $$ E:\/data/COFFEE/nmr/AC1743_SEN00016_9276489_UbsbA2z0AU/12/pdata/1/auditp.txt
$$ ##AUDIT TRAIL=  $$ (NUMBER, WHEN, WHO, WHERE, PROCESS, VERSION, WHAT)
(   1,<2015-07-15 02:29:44.354 -0700>,<Administrator>,<X>,<go>,<TOPSPIN 2.1>,
      <created by zg
	started at 2015-07-15 02:18:14.838 -0700,
	POWCHK enabled, PULCHK disabled,
       configuration hash MD5:
       21 0F 79 D6 B3 7B B4 F6 88 20 88 DB 03 48 BD 9F
       data hash MD5: 64K
       88 0B E5 9E 14 D1 8E 9C DF 9D 5A 31 14 9D BF 8D>)
(   2,<2015-07-15 02:29:47.775 -0700>,<Administrator>,<X>,<proc1d>,<TOPSPIN 2.1>,
      <Start of raw data processing
       efp LB = 0.3 FT_mod = 6 PKNL = 1 PHC0 = 0 PHC1 = 0 SI = 128K 
       data hash MD5: 128K
       6E 48 6C 21 35 7F 30 17 5C E1 D6 F0 EA 35 A5 DC>)
(   3,<2015-07-15 02:29:48.682 -0700>,<Administrator>,<X>,<proc1d>,<TOPSPIN 2.1>,
      <pk PHC0 = -86.28662 PHC1 = 0 
       data hash MD5: 128K
       3C 1E 9E 74 0B 69 46 15 27 99 AB C4 A4 63 94 AB>)
(   4,<2015-07-15 02:29:49.057 -0700>,<Administrator>,<X>,<proc1d>,<TOPSPIN 2.1>,
      <abs ABSG = 1 
       data hash MD5: 128K
       2A 58 A2 56 BE 05 FE C6 C7 70 98 3F 6A 3C 6A AA>)
(   5,<2015-07-15 02:29:49.166 -0700>,<Administrator>,<X>,<proc1d>,<TOPSPIN 2.1>,
      <abs ABSG = 2 
       data hash MD5: 128K
       E8 21 0A B1 EC 00 B9 28 FE 36 D5 F2 17 C7 2A 7C>)
(   6,<2015-07-15 02:29:49.244 -0700>,<Administrator>,<X>,<proc1d>,<TOPSPIN 2.1>,
      <abs ABSG = 3 
       data hash MD5: 128K
       E7 C0 35 29 FE 39 B6 C4 C5 1F 3D 98 A5 53 BB DD>)
(   7,<2015-07-15 02:29:49.338 -0700>,<Administrator>,<X>,<proc1d>,<TOPSPIN 2.1>,
      <abs ABSG = 4 
       data hash MD5: 128K
       A1 06 9C 75 2A 8E BF 85 5A 8D B3 97 B5 33 93 B4>)
(   8,<2015-07-15 02:29:49.416 -0700>,<Administrator>,<X>,<proc1d>,<TOPSPIN 2.1>,
      <abs ABSG = 5 
       data hash MD5: 128K
       7A F6 61 D7 8B 72 48 F3 EA 41 62 91 91 74 A5 0A>)
$$ ##END=
$$ 
$$ $$ hash MD5
$$ $$ 85 BE EE 32 67 21 11 09 CE AF B1 BA 6A 57 85 6B
##$RELAX= 
##$RELAX= 
##$RELAX= 
##$RELAX= 
##$RELAX= 
##$RELAX= 
##$RELAX= 
##$RELAX= 
$$ Bruker specific parameters
$$ --------------------------
##$DU= <E:\>
##$EXPNO= 12
$$ [...]
##$TP07= 0
##$TPNAME0= <>
##$TPNAME1= <>
##$TPNAME2= <>
##$TPNAME3= <>
##$TPNAME4= <>
##$TPNAME5= <>
##$TPNAME6= <>
##$TPNAME7= <>
##$TPOAL= (0..7)
0.5 0.5 0.5 0.5 0.5 0.5 0.5 0.5
##$TPOFFS= (0..7)
0 0 0 0 0 0 0 0
##$TUNHIN= 0
##$TUNHOUT= 0
##$TUNXOUT= 0
##$USERA1= <user>
##$USERA2= <user>
##$USERA3= <user>
##$USERA4= <user>
##$USERA5= <user>
##$V9= 5
##$VALIST= <valist>
##$VCLIST= <CCCCCCCCCCCCCCC>
##$VD= 0
##$VDLIST= <DDDDDDDDDDDDDDD>
##$VPLIST= <PPPPPPPPPPPPPPP>
##$VTLIST= <TTTTTTTTTTTTTTT>
##$WBST= 2048
##$WBSW= 25
##$XGAIN= (0..3)
0 0 0 0
##$XL= 0
##$YL= 0
##$YMAX_a= 6196755
##$YMIN_a= -11904595
##$ZGOPTNS= <>
##$ZL1= 120
##$ZL2= 120
##$ZL3= 120
##$ZL4= 120
##$ABSF1= 14.96108
##$ABSF2= -5.597102
##$ABSG= 5
##$ABSL= 3
##$ALPHA= 0
##$AQORDER= 0
##$ASSFAC= 0
##$ASSFACI= 0
##$ASSFACX= 0
##$ASSWID= 0
##$AUNMP= <proc_prof1d_extract.lims>
##$AXLEFT= 0
##$AXNAME= <>
##$AXNUC= <1H>
##$AXRIGHT= 0
##$AXTYPE= 0
##$AXUNIT= <>
##$AZFE= 0.1
##$AZFW= 0.1
##$BCFW= 0
##$BC_mod= 0
##$BYTORDP= 0
##$COROFFS= 0
##$CY= 15
##$DATMOD= 1
##$DC= 0
##$DFILT= <>
##$DTYPP= 0
##$F1P= 0
##$F2P= 0
##$FCOR= 0.5
##$FTSIZE= 131072
##$FT_mod= 6
##$GAMMA= 0
##$GB= 0
##$INTBC= 1
##$INTSCL= 1
##$ISEN= 128
##$LB= 0.3
##$LEV0= 0
##$LPBIN= 0
##$MAXI= 10000
##$MC2= 0
##$MEAN= 0
##$ME_mod= 0
##$MI= 0
##$NCOEF= 0
##$NC_proc= -2
##$NLEV= 6
##$NOISF1= 0
##$NOISF2= 0
##$NSP= 0
##$NTH_PI= 0
##$NZP= 0
##$OFFSET= 14.96108
##$PC= 1
##$PHC0= -86.28662
##$PHC1= 0
##$PH_mod= 1
##$PKNL= yes
##$PPARMOD= 0
##$PPDIAG= 0
##$PPIPTYP= 0
##$PPMPNUM= 2147483647
##$PPRESOL= 1
##$PSCAL= 4
##$PSIGN= 0
##$PYNMP= <proc.py>
##$REVERSE= no
##$SF= 400.020009602912
##$SI= 131072
##$SIGF1= 0
##$SIGF2= 0
##$SINO= 400
##$SIOLD= 131072
##$SPECTYP= <>
##$SREGLST= <1H.CDCl3>
##$SSB= 0
##$STSI= 131072
##$STSR= 0
##$SW_p= 8223.68421052631
##$SYMM= 0
##$S_DEV= 0
##$TDeff= 65536
##$TDoff= 0
##$TI= <>
##$TILT= no
##$TM1= 0
##$TM2= 0
##$TOPLEV= 0
##$USERP1= <user>
##$USERP2= <user>
##$USERP3= <user>
##$USERP4= <user>
##$USERP5= <user>
##$WDW= 1
##$XDIM= 131072
##$YMAX_p= 443634625
##$YMIN_p= -12621
##$CURPLOT= <Network HP LaserJet P1505>
##$CURPRIN= <$Network HP LaserJet P1505>
##$DFORMAT= <normdp>
##$LAYOUT= <+/1D_H.xwp>
##$LFORMAT= <normlp>
##$PFORMAT= <normpl>
##$SURQMSG= 1
$$ End of Bruker specific parameters
$$ ---------------------------------
##NTUPLES= NMR SPECTRUM
##VAR_NAME=  FREQUENCY,     SPECTRUM/REAL,   SPECTRUM/IMAG
##SYMBOL=    X,             R,               I
##VAR_TYPE=  INDEPENDENT,   DEPENDENT,       DEPENDENT
##VAR_FORM=  AFFN,          ASDF,            ASDF
##VAR_DIM=   131072,        131072,          131072
##UNITS=     HZ,            ARBITRARY UNITS, ARBITRARY UNITS
##FACTOR=    0.0627417313425164, 1,          1
##FIRST=     8223.62146879497, 1977,         -56138
##LAST=      0,             4483,            -55762
##MIN=       0,             -12621,          0
##MAX=       8223.62146879497, 443634625,    0
$$ Real data points
##PAGE= N=1
##DATA TABLE= (X++(R..R)), XYDATA
$$ [...]
63913C155272k66094k50569k32650k12584j91299j70112j50105j31822j15397
$$ 3155272 2889178 2638609 2405959 2193375 2002076 1831964 1681859 1550037 1434640
63904A434640j00817q8029p6865o7020n8256n0535m3895l8256l3523k9752k7042
$$ 1434640 1333823 1245794 1168929 1101909 1043653 993118 949223 910967 877444 847692 820650
63893H20650k5319k4409k4152k4216k3971k2955k1495k0301j9457j8329j6661
$$ 820650 795331 770922 746770 722554 698583 675628 654133 633832 614375 596046 579385
63882E79385j5054j3969j2763j0472p266m387k612j418Q1J961L625M827N986P494
$$ 579385 564331 550362 537599 527127 519861 515474 512862 511444 511525 513486 517111 521938 527924 535418
63868E35418R098J0230J0760J1111J1620J2103J2267J2273J2446J2566J1953J0331
$$ 535418 544516 554746 565506 576617 588237 600340 612607 624880 637326 649892 661845 672176
63856F72176Q220O193M223K058n3j498k039k121k524l928o589r972j2892j4473
$$ 672176 680396 686589 690812 692870 692817 691319 689280 687159 684635 680707 674118 664146 651254 636781
63842F36781j5065j5880j7537j9344k0141j9606j8517j7827j7744j7736j7289
$$ 636781 621716 605836 588299 568955 548814 529208 510691 492864 475120 457384 440095
63831D40095j6460j5576j4657j3450j2056j1058j0776j0722j0183r105p963o974
$$ 440095 423635 408059 393402 379952 367896 356838 346062 335340 325157 316052 308089 301115
63819C01115n960m985m470m522m590m132l254k403j696r15k3O57Q06M30k06q54
$$ 301115 295155 290170 285700 281178 276588 272456 269202 266799 265103 264188 264165 264822 265628 266058 265852 264998
63803B64998j427k011k718l515m151m343l937k989j781q00n21j029j909k608k876
$$ 264998 263571 261560 258842 255327 251176 246833 242896 239907 238126 237326 236805 235776 233867 231259 228383
63788B28383k795k514k151j831j631j441j122p85o92p93o76j71K58J08l70m36
$$ 228383 225588 223074 220923 219092 217461 216020 214898 214113 213421 212628 211952 211781 212039 212147 211777 211341
63772B11341N1L40k05j197j715j400n99L16J229J905J906J154K22k48k53l16p80
$$ 211341 211392 211732 211527 210330 208615 207215 206616 206932 208161 210066 211972 213126 213348 213100 212847 212531 211751
63755B11751j404j645j267n70p0R7K84Q28J580K136K416K663K997L271L374L338
$$ 211751 210347 208702 207435 206865 206795 206892 207176 208004 209584 211720 214136 216799 219796 223067 226441 229779
63739B29779L165K794K317J894J468Q81K90P8K54M32M99Q75J836L022L924M509
$$ 229779 232944 235738 238055 239949 241417 242298 242588 242666 242920 243352 243851 244726 246562 249584 253508 258017
63723B58017N066N678O181O368O029N032L653K471J731J074J65p82j442j909k432
$$ 258017 263083 268761 274942 281310 287339 292371 296024 298495 300226 301300 301465 300683 299241 297332 294900
63708B94900k909l113l149l212l115k524j512m64M25J126J472J341J048J116J666
$$ 294900 291991 288878 285729 282517 279402 276878 275366 274902 275327 276453 277925 279266 280314 281430 283096
63693B83096K413L071L471L404K857K265K105K245K078J293J92p09j097j010q33
$$ 283096 285509 288580 292051 295455 298312 300577 302682 304927 307005 308298 308490 307781 306684 305674 304841
63678C04841r32j088o32M99J376J246O23M31N82L59j32m5P30J337J386J369J374
$$ 304841 303909 302821 302189 302688 304064 305310 305933 306364 306946 307305 307173 307128 307858 309195 310581 311950 313324
63661C13324N67j337l156l684l329l340l950m314m000l501l294l259l234l365
$$ 313324 313891 312554 309398 305714 302385 299045 295095 290781 286781 283280 279986 276727 273493 270128
63647B70128l589l346k240o99M61J001J392J988K435K220J588J460K361L779M852
$$ 270128 266539 263193 260953 260254 260715 261716 263108 265096 267531 269751 271339 272799 275160 278939 283791
63632B83791N322N549N819O085O242O258O093N886O096P020Q254R139R697J0580
$$ 283791 289113 294662 300481 306566 312808 319066 325159 331045 337141 344161 352415 361554 371251 381831
63618C81831J2089J3832J5361J6671J7903J9195K0885K3313K6119K8358K9520
$$ 381831 393920 407752 423113 439784 457687 476882 497767 521080 547199 575557 605077
63607F05077K9923K9843K8820K6237K2141J7066J1480N775M46m119p791j0350
$$ 605077 635000 664843 693663 719900 742041 759107 770587 776362 776808 772689 764898 754548
63595G54548j1325j0556q708o951o352p481j0145j3303j5781j7398j8892k0586
$$ 754548 743223 732667 723959 717008 710656 703175 693030 679727 663946 646548 627656 607070
63583F07070k1739k1670k0745j9701j8548j6815j4488j1983r527p196n250l763
$$ 607070 585331 563661 542916 523215 504667 487852 473364 461381 451854 444658 439408 435645
63571D35645k192lK465M354N344N711N620N122M728N102O113O910P124P314Q078
$$ 435645 433453 433450 435915 440269 445613 451324 456944 462066 466794 471896 478009 484919 492043 499357 507435
63556E07435R344J0857J2716J5055J7647K0224K2972K6276L0044L3592L6060L6818
$$ 507435 516779 527636 540352 555407 573054 593278 616250 642526 672570 706162 742222 779040
63544G79040L5480L1792K5686J7551Q405l82p630j2599j4906j4592j2451r837
$$ 779040 814520 846312 871998 889549 897954 897572 889942 877343 862437 847845 835394 825557
63532H25557p774o394n440n071n862q275j2345j7584k2890k6969k9293l0435l1064
$$ 825557 817783 811389 805949 800878 795016 786741 774396 756812 733922 706953 677660 647225 616161
63519F16161l0948k9463k6765k3836k1459j9719j8355j7036j5379j3289j1222
$$ 616161 585213 555750 528985 505149 483690 463971 445616 428580 413201 399912 388690
63508C88690r688q529p240n817m678l893l179k632k667l118l261k858k464k380
$$ 388690 379002 370473 363233 357416 352738 348845 345666 343034 340367 337249 333988 331130 328666 326286
63494C26286k092j176r9M18L47J08q1j49J84J039J903K164J984K101K774L464
$$ 326286 324194 323018 322919 323337 323684 323792 323711 323562 323746 324785 326688 328852 330836 332937 335711 339175
63478C39175L714L763M062M436M225L184J838Q22J10p63j910k973l765m518n184
$$ 339175 342889 346652 350714 355150 359375 362559 364397 365219 365329 364566 362656 359683 355918 351400 346216
63463C46216n116l949k420j664j829k037j573n44O74J861K768L111L062L205L818
$$ 346216 341100 337151 334731 333067 331238 329201 327628 327084 327758 329619 332387 335498 338560 341765 345583
63448C45583M635N494O639Q089R267R719R793J0180J1054J2101J3175J4460J6170
$$ 345583 350218 355712 362351 370440 379707 389426 399219 409399 420453 432554 445729 460189 476359
63435D76359J8348K0871K3275K4590K3774K0563J5900J1471Q588P438P367P903
$$ 476359 494707 515578 538853 563443 587217 607780 623680 635151 643739 651177 658544 666447
63423F66447R235J1607J4694J8069K1834K6107L0189L3046L4460L4766L3461K9382
$$ 666447 675682 687289 701983 720052 741886 767993 798182 831228 865688 900454 933915 963297
63411I63297K2555J4718P378M31o405j1831j4034j3090j1031r652r310r812j1311
$$ 963297 985852 1000570 1007948 1008379 1001974 990143 976109 963019 951988 942336 933026 923214 911903
63398I11903j3949j7381k1125k4908k8362l0909l2196l2404l1900l0875k9390
$$ 911903 897954 880573 859448 834540 806178 775269 743073 710669 678769 647894 618504
63387F18504k7473k5048k2079j8861j5915j3485j1330r051o452l645j026R14K135
$$ 618504 591031 565983 543904 525043 509128 495643 484313 475262 468810 465165 464139 465053 467188
63374D67188L334N345Q146J0778J2362J2935J3158J3503J3968J4447J5156J6516
$$ 467188 470522 475867 484013 494791 507153 520088 533246 546749 560717 575164 590320 606836
63362F06836J8580K0759K2406K3739K5668K8532L1421L3187L3641L3101L1154
$$ 606836 625416 646175 668581 692320 717988 746520 777941 811128 844769 877870 909024
63351I09024K6831K0154J2561N491p75o396j0810j3030j2939j1609j0339r762
$$ 909024 935855 956009 968570 974061 973286 966890 956080 943050 930111 918502 908163 898401
63339H98401r943j0956j3077j6444k0658k4818k8050l0026l0853l0551k8930k6080
$$ 898401 888458 877502 864425 847981 827323 802505 774455 744429 713576 683025 654095 628015
63327F28015k2675j9475j6669j3943j1106q385o040m105k696k426m034p488j1595
$$ 628015 605340 585865 569196 555253 544147 535762 529722 525617 522921 520495 516461 508973 497378
63314D97378j4839j6469j6664j5789j4010j1653r430p895o994o376n856n203l961
$$ 497378 482539 466070 449406 433617 419607 407954 398524 390629 383635 377259 371403 366200 362239
63301C62239k057l45K34q0j33M67P99J4j485k755l588m375n095n253m753m130
$$ 362239 360182 359837 360071 359991 359858 360325 361124 361138 359653 356898 353310 348935 343840 338587 333834 329704
63285C29704l775l497k973k290j757j517j477j416j055l35K88J16q71j730j528
$$ 329704 325929 322432 319459 317169 315412 313895 312418 311002 309947 309612 309900 310016 309145 307415 305887
63270C05887n11J98M0k79K05J451K545K905K826K842L002L061L025L143L471L801
$$ 305887 305376 305574 305614 305335 305540 306991 309536 312441 315267 318109 321111 324172 327197 330340 333811 337612
63254C37612L984M162M515N005N402N612N844O436P407Q303Q711Q854R361J0385
$$ 337612 341596 345758 350273 355278 360680 366292 372136 378572 385979 394282 402993 411847 421208 431593
63240D31593J1433J2258J3429J5513J8095K0272K1880K3438K4961K5766K5715
$$ 431593 443026 455284 468713 484226 502321 522593 544473 567911 592872 618638 644353
63229F44353K5777K6695K7792K7832K6773K5804K5758K6269K6603K6652K6776
$$ 644353 670130 696825 724617 752449 779222 805026 830784 857053 883656 910308 937084
63218I37084K7073K7271K7201K7000K6812K6473K5467K3195J9319J4000P788J283
$$ 937084 964157 991428 1018629 1045629 1072441 1098914 1124381 1147576 1166895 1180895 1188683 1189966
63206A189966n177j1535j7794k3793k9094l3105l5355l5804l4870l3153l1045
$$ 1189966 1184789 1173254 1155460 1131667 1102573 1069468 1034113 998309 963439 930286 899241
63195H99241k8546k5499k1982j8422j5225j2358r442o219k791N67L718O685R512
$$ 899241 870695 845196 823214 804792 789567 777209 767767 761548 758757 759324 763042 769727 779239
63182G79239J2199J4690J6899J8764K0281K1382K1935K1962K1807K1794K1803
$$ 779239 791438 806128 823027 841791 862072 883454 905389 927351 949158 970952 992755
63171I92755K1484K0857K0292J9791J8772J6742J3839J0345O151J157m180r307
$$ 992755 1014239 1035096 1055388 1075179 1093951 1110693 1124532 1134877 1141028 1142185 1138005 1128698
63159A128698j4438k0164k6217l1249l4227l5523l6225l6738l6551l5255l3190
$$ 1128698 1114260 1094096 1067879 1036630 1002403 966880 930655 893917 857366 822111 788921
63148G88921l1027k9023k6985k4728k2312j9788j7100j4375j2144j0882j0336
$$ 788921 757894 728871 701886 677158 654846 635058 617958 603583 591439 580557 570221
63137E70221r586p924n467k877p74M46O99M94P75K024L704N031N977O983P884
$$ 570221 560635 552711 547244 544367 543593 544039 544738 545232 546007 548031 551735 556766 562743 569726 577610
63122E77610P959P161O438O432O574N952M556L073J794M38j034k080k166j396
$$ 577610 585569 592730 599168 605600 612174 618126 622682 625755 627549 627987 626953 624873 622707 621311
63108F21311m21L4l23j090j475j092m30k46n87q41o76n12q67j582j998j779j246
$$ 621311 620890 620924 620601 619511 618036 616944 616514 616268 615681 614840 614164 613652 612785 611203 609205 607426 606180
63091F06180r38r72j014p57k65K45P52J349J933K318K627L232M179N015N418N588
$$ 606180 605242 604270 603256 602499 602234 602479 603231 604580 606513 608831 611458 614690 618869 623884 629302 634890
63075F34890N873O331O956P851Q809R188Q812Q622R672J1661J3290J4058J4862
$$ 634890 640763 647094 654050 661901 670710 679898 688710 697332 707004 718665 731955 746013 760875
63062G60875J6578J8881K0958K2804K5157K8402L2055L5352L8100M0852M4270
$$ 760875 777453 796334 817292 840096 865253 893655 925710 961062 999162 1040014 1084284
63051A084284M8223N1762N4232N6154N8418O0887O2590O3249O3575O3777O2988
$$ 1084284 1132507 1184269 1238501 1294655 1353073 1413960 1476550 1539799 1603374 1667151 1730139
63040A730139O0860N8709N8013N8441N8546N7927N7480N7566N7273N5624N2454
$$ 1730139 1790999 1849708 1907721 1966162 2024708 2082635 2140115 2197681 2254954 2310578 2363032
63029B363032M7690M0788L1481K0336Q058n215j9400l3737m7176n9135o9348p7291
$$ 2363032 2410722 2451510 2482991 2503327 2511385 2506170 2486770 2453033 2405857 2346722 2277374 2200083
63017B200083q2408q4783q5034q3551q0211p4865o7747n9435n0565m1650l2908
$$ 2200083 2117675 2032892 1947858 1864307 1784096 1709231 1641484 1582049 1531484 1489834 1456926
63006A456926k4339j6083q523j834M312J0317J6088K1270K5856L0092L3747L6148
$$ 1456926 1432587 1416504 1407981 1406147 1410459 1420776 1436864 1458134 1483990 1514082 1547829 1583977
62994A583977L7140L7562L8313L9265L9546L8793L7645L6871L6370L5215L2501
$$ 1583977 1621117 1658679 1696992 1736257 1775803 1814596 1852241 1889112 1925482 1960697 1993198
62983A993198K7922K1793J4735P251o58r438j9317k9751l9738m8684n6624o3544
$$ 1993198 2021120 2042913 2057648 2064899 2064241 2054803 2035486 2005735 1965997 1917313 1860689 1797145
62971A797145o8890p2082p3199p2792p1165o8266o4234n9658n5200n1217m7763
$$ 1797145 1728255 1656173 1582974 1510182 1439017 1370751 1306517 1246859 1191659 1140442 1092679
62960A092679m4631m1376l7699l3957l0960k9042k7640k6047k4305k2916k1945
$$ 1092679 1048048 1006672 968973 935016 904056 875014 847374 821327 797022 774106 752161
62949G52161k0919j9632j8450j7637j6818j5553j4152j3395j3355j3126j1940
$$ 752161 731242 711610 693160 675523 658705 643152 629000 615605 602250 589124 577184
62938E77184j0194q888q259p588o414n259m777m687m186l138k226j905j859j667
$$ 577184 566990 558102 549843 542255 535841 530582 525805 521118 516932 513794 511568 509663 507804 506137
62924E06137j476j576j762j598j132q99j204j797k255k464k565k708k956l302
$$ 506137 504661 503085 501323 499725 498593 497694 496490 494693 492438 489974 487409 484701 481745 478443
62910D78443l589l530k963k120j496j444j916k597l164l378l095k380j533p94
$$ 478443 474854 471324 468361 466241 464745 463301 461385 458788 455624 452246 449151 446771 445238 444444
62896D44444q6P28J327J112O4r46j073m98p5j68l68l17k74n55r26q74l49K01M57
$$ 444444 444358 445086 446413 447525 447589 446643 445570 445072 444997 444829 444461 444144 443870 443315 442389 441515 441166 441367 441824
62877D41824O20J066J775K215J870P91l94j075j133q69o28o64j066j561j551o85
$$ 441824 442444 443510 445285 447500 449370 450161 449767 448692 447559 446690 446062 445398 444332 442771 441220 440535
62861D40535O17J540J754J630J656J953K402K791K810K285J546J259J703K429
$$ 440535 441152 442692 444446 446076 447732 449685 452087 454878 457688 459973 461519 462778 464481 466910
62847D66910K752K412J669R87O29L49l68j500k173j670o00k79r63j532j196n52
$$ 466910 469662 472074 473743 474730 475359 475708 475340 473840 471667 469997 469397 469118 468155 466623 465427 464875
62831D64875m09m14K53J393K013J801J457J549J859K003K039K196K498K874L309
$$ 464875 464466 464052 464305 465698 467711 469512 470969 472518 474377 476380 478419 480615 483113 485987 489296
62816D89296L705L878L802L687L771M158M830N547N866N606N197N229N725O211
$$ 489296 493001 496879 500681 504368 508139 512297 517127 522674 528540 534146 539343 544572 550297 556508
62802E56508O541P136Q286R629J0510J0685J0505J0585J1391J3016J5234J7782
$$ 556508 563049 570185 578471 588100 598610 609295 619800 630385 641776 654792 670026 687808
62790F87808K0587K3627K6831L0262L4274L9138M4652N0437N6476O2939O9558
$$ 687808 708395 732022 758853 789115 823389 862527 907179 957616 1014092 1077031 1146589
62779A146589P5678Q1083Q6245R1569R6660J00602J02719J02783J00653R6088
$$ 1146589 1222267 1303350 1389595 1481164 1577824 1678426 1781145 1883928 1984581 2080669
62769B080669Q8872P8972O6497N1644L4712J6228k937k1730l9233n4863o8321
$$ 2080669 2169541 2248513 2315010 2366654 2401366 2417594 2414657 2392927 2353694 2298831 2230510
62758B230510p9496q8481r5356r9888j01670j00817r8173r4574r0179q4907p9163
$$ 2230510 2151014 2062533 1967177 1867289 1765619 1664802 1566629 1472055 1381876 1296969 1217806
62747A217806p3539o8031o2211n6178n0670m6033m1707l7032l2154k7788k4374
$$ 1217806 1144267 1076236 1014025 957847 907177 861144 819437 782405 750251 722463 698089
62736F98089k1770j9547j7315j4942j2633j0711r191p783o392n267m505l690k328
$$ 698089 676319 656772 639457 624515 611882 601171 591980 584197 577805 572538 568033 564343 562015
62723E62015n36R86J694J759J871K543L641M676N568O889R169J2137J4938J7124
$$ 562015 561479 562465 564159 565918 567789 570332 573973 578649 584217 591106 600275 612412 627350 644474
62709F44474J9070K1415K4413K7858L1383L4763L8164M2046M6627N1491N6072
$$ 644474 663544 684959 709372 737230 768613 803376 841540 883586 930213 981704 1037776
62698A037776O0403O4983O9914P4694P8913Q2525Q5204Q5970Q3912P8941P1539
$$ 1037776 1098179 1163162 1233076 1307770 1386683 1469208 1554412 1640382 1724294 1803235 1874774
62687A874774O2063N0613L7285K2271N997j0577k6143l9950n2219o3302p2787
$$ 1874774 1936837 1987450 2024735 2047006 2053003 2042426 2016283 1976333 1924114 1860812 1788025
62676A788025p9859q4313q6606q7026q5501q2280p8180p3840o9127o3611n7393
$$ 1788025 1708166 1623853 1537247 1450221 1364720 1282440 1204260 1130420 1061293 997682 940289
62665I40289n1151m5528m0723l6635l3147l0139k7438k4840k2237j9694j7373
$$ 940289 889138 843610 802887 766252 733105 702966 675528 650688 628451 608757 591384
62654E91384j5436j3959j2880j2045j1355j0859j0557j0093q905o854m629l216
$$ 591384 575948 561989 549109 537064 525709 514850 504293 494200 485295 478441 473812 470596
62642D70596k933l157l001k156j090n43p75j259j205n45q6n07j489k188k323k287
$$ 470596 467663 464506 461505 459349 458259 457716 456941 455682 454477 453932 453846 453339 451850 449662 447339 445052
62626D45052k337k271j885j186j47J151K151K279J928K228L588N192O287P091
$$ 445052 442715 440444 438559 437373 437226 438377 440528 442807 444735 446963 450551 455743 462030 469121
62612D69121P897Q108P191N927N705O732P972Q856J0046J2247J5108J7700J9621
$$ 469121 477018 485126 492317 498244 503949 510681 518653 527509 537555 549802 564910 582610 602231
62599F02231K1196K3013K5567K9044L3179L7442M1476M5161M8196N0060N0579
$$ 602231 623427 646440 672007 701051 734230 771672 813148 858309 906505 956565 1007144
62588A007144N0106M8862M6415M2181L6226K9178K1394J2636K686p951j8133k6731
$$ 1007144 1057250 1106112 1152527 1194708 1230934 1260112 1281506 1294142 1296828 1288877 1270744 1244013
62576A244013l3254l7940m1402m4135m6254m7604m8002m7298m5365m2226l8301
$$ 1244013 1210759 1172819 1131417 1087282 1041028 993424 945422 898124 852759 810533 772232
62565G72232l4371l1086k8467k6042k3445k0754j8256j6060j4125j2457j1046
$$ 772232 737861 706775 678308 652266 628821 608067 589811 573751 559626 547169 536123
62554E36123r731q359p086o241n812n320m335k971j707q36k18L86R84J403J592
$$ 536123 526392 518033 510947 504706 498894 493574 489239 486268 484561 483725 483507 483893 484877 486280 487872
62539D87872J699J743J460P15n5j71M90J372K050K683L474M207M842O042Q394
$$ 487872 489571 491314 492774 493489 493434 493263 493753 495125 497175 499858 503332 507539 512381 518423 526817
62524E26817J1318J3549J4658J5501J7082J9658K2919K6380K9474L2012L4703
$$ 526817 538135 551684 566342 581843 598925 618583 641502 667882 697356 729368 764071
62513G64071L8425M2782M6270M8262M9869N2101N4031N3811N0969M6604M1599
$$ 764071 802496 845278 891548 939810 989679 1041780 1095811 1149622 1200591 1247195 1288794
62502A288794L5712K8589K0661J2735N351j155o414j0185j2300j2320r708m797
$$ 1288794 1324506 1353095 1373756 1386491 1391842 1390687 1384273 1374088 1361788 1349468 1339760 1334963
62490A334963Q78N821J0089J5090K1748K9299L6194M1884M7039N1980N5517N5786
$$ 1334963 1335841 1341662 1351751 1366841 1388589 1417888 1454082 1495966 1543005 1594985 1650502 1706288
62478A706288N1809M3860L2737J9644O505m843j4428k4343l6518n0467o3722p4034
$$ 1706288 1758097 1801957 1834694 1854338 1860843 1856000 1841572 1817229 1780711 1730244 1666522 1592488
62466A592488q0700q4150q5079q4053q1498p7741p3091o7776o1905n5576m9053
$$ 1592488 1511788 1427638 1342559 1258506 1177008 1099267 1026176 958400 896495 840919 791866
62455G91866m2500l5759k8896k2793j8437j5504j2564r007n823l993l017j833
$$ 791866 749366 713607 684711 661918 643481 627977 615413 606406 600583 596590 593573 591740
62443E91740l55R41K215L917N636O458O363O170O192N896M862L197R74j702m102
$$ 591740 591385 592326 594541 598458 604094 610552 616915 623085 629277 635173 640035 643232 644206 642504 638402
62428F38402n351n766o693q709j0838j1926j1940j1451j0600r319q005p189o808
$$ 638402 633051 627285 620592 611883 601045 589119 577179 565728 555128 545809 537804 530615 523807
62415E23807o386n841n612n927o364o248n431m476l982l813l361k546k053k230
$$ 523807 517421 511580 505968 500041 493677 487429 481998 477522 473540 469727 466366 463820 461767 459537
62401D59537k322j459K4R97J051Q43J067J777K719L551L782L260K680K875L602
$$ 459537 457215 455756 455780 456777 457828 458671 459738 461515 464234 467785 471567 474827 477507 480382 483984
62386D83984L854L381K994L240L786M319N015N766N960N586N571O372P141P012
$$ 483984 487838 491219 494213 497453 501239 505558 510573 516339 522299 527885 533456 539828 546969 553981
62372E53981O495O639P536Q559R636J1178J3017J4486J5642J7454K0581K4549
$$ 553981 560476 567115 574651 583210 592846 604024 617041 631527 647169 664623 685204 709753
62360G09753K8486L2148L5925M0070M4293M8006N0785N2472N2928N1825M8783
$$ 709753 738239 770387 806312 846382 890675 938681 989466 1041938 1094866 1146691 1195474
62349A195474M3632L6494K7775J8266Q982N96o767j2981j7639k0830k3711k7364
$$ 1195474 1239106 1275600 1303375 1321641 1330623 1331219 1324452 1311471 1293832 1273002 1249291 1221927
62337A221927l1377l4424l6093l6981l7075l5412l1751k7386k3691k0812j8287
$$ 1221927 1190550 1156126 1120033 1083052 1045977 1010565 978814 951428 927737 906925 888638
62326H88638j5978j3795j1560r808r664j1094j2450j2737j3202j5312j8184j9640
$$ 888638 872660 858865 847305 837497 827833 816739 804289 791552 778350 763038 744854 725214
62314G25214j9210j8343j7914j7373j6363j5491j4961j3914j1863r698q512q181
$$ 725214 706004 687661 669747 652374 636011 620520 605559 591645 579782 570084 561572 553391
62302E53391p762o770n436m153l158k496j998j457r83q26q68o71o8O73J282J679
$$ 553391 545629 538859 533423 529270 526112 523616 521618 520161 519178 518352 517484 516813 516745 517418 518700 520379
62286E20379J757J535J449J973K905L624M075M779N791O458O504O592P414Q736
$$ 520379 522136 523671 525120 527093 529998 533622 537697 542476 548267 554725 561229 567821 575235 583971
62272E83971R827J0381J0572J0636J0796J1345J2370J3662J5170J7275K0287K3934
$$ 583971 593798 604179 614751 625387 636183 647528 659898 673560 688730 706005 726292 750226
62260G50226K7657L1167L4493L7826M1525M5953N0813N4936N7111N7051N5071
$$ 750226 777883 809050 843543 881369 922894 968847 1019660 1074596 1131707 1188758 1243829
62249A243829N1150M4855L6309K6668J7380R151J807n072j1711j8254k4950l1952
$$ 1243829 1294979 1339834 1376143 1402811 1420191 1429342 1431149 1426077 1414366 1396112 1371162 1339210
62237A339210l8974m5265n0036n2841n3693n2924n0967m8104m4405l9990l5293
$$ 1339210 1300236 1254971 1204935 1152094 1098401 1045477 994510 946406 902001 862011 826718
62226H26718l0895k7015k3488k0231j7368j4830j2309r831p900o714n696m349
$$ 826718 795823 768808 745320 725089 707721 692891 680582 670751 662851 656137 650441 646092
62214F46092l091k596k622k270j310m02j8J27M37R32J624K680L918M707M730M427
$$ 646092 643001 640405 637783 635513 634203 633801 633783 633910 634347 635279 636903 639583 643501 648208 652938 657365
62198F57365M413M865N673O709P613P835P336O826O936P479P941Q255Q579Q733
$$ 657365 661778 666643 672316 679025 686638 694473 701809 708635 715571 723050 730991 739246 747825 756558
62184G56558Q484Q208Q485R061Q917P586N836M699M217L694K949K795M061O548
$$ 756558 765042 773250 781735 790796 799713 807299 813135 817834 822051 825745 828694 831489 835550 842098
62170H42098R303J1785J4386J7759K1979K6589L1075L4982L7776L9002L8586L6610
$$ 842098 851401 863186 877572 895331 917310 943899 974974 1009956 1047732 1086734 1125320 1161930
62158A161930L2948K7548K0982J4231P813J663m132r055j2937j6461k0388k4604
$$ 1161930 1194878 1222426 1243408 1257639 1265452 1267115 1262983 1253928 1240991 1224530 1204142 1179538
62146A179538k8297l0845l2203l2662l2650l2514l2112l0687k7676k3525j9390
$$ 1179538 1151241 1120396 1088193 1055531 1022881 990367 958255 927568 899892 876367 856977
62135H56977j6000j3179j0490p969o097n304n568o336o786o398n435m671m533
$$ 856977 840977 827798 817308 809339 803242 797938 792370 786034 779248 772850 767415 762744 758211
62122G58211m614m138k831j129M45J858L335M677N114L999J542j360l881n689
$$ 758211 753597 749459 746628 745499 745944 747802 751137 755814 760928 764927 766469 765109 761228 755539
62108G55539o739p037o730o179n805n892o564p696q880r694j0086j0219r946q799
$$ 755539 748800 741763 735033 728854 723049 717157 710593 702897 694017 684323 674237 664018 654072 645273
62094F45273o701m324k417j050K04J554K793L719M314M650M914N514O736Q317
$$ 645273 638572 634248 631831 630781 630985 632539 635332 639051 643365 648015 652929 658443 665179 673496
62080F73496R715J0863J2293J4283J6327J7722J8431J8964J9608K0211K0668K1195
$$ 673496 683211 694074 706367 720650 736977 754699 773130 792094 811702 831913 852581 873776
62068H73776K1872K2354K2339K2131K2395K3406K4807K6021K6538K5747K3034
$$ 873776 895648 918002 940341 962472 984867 1008273 1033080 1059101 1085639 1111386 1134420
62057A134420J8361J2558O678J209l830q239j1586j3902j5937j8507k1760k5322
$$ 1134420 1152781 1165339 1172017 1173226 1169396 1161157 1149571 1135669 1119732 1101225 1079465 1054143
62045A054143k8869l2218l4970l6526l6654l5872l5002l4380l3615l2125k9826
$$ 1054143 1025274 993056 958086 921560 884906 849034 814032 779652 746037 713912 684086
62034F84086k7149k4566k2237k0104j8100j6182j4287j2403j0597q915p408o298
$$ 684086 656937 632371 610134 590030 571930 555748 541461 529058 518461 509546 502138 495840
62022D95840n966o480p270p527p002o203n727n555n191m389l469k891k691k540
$$ 495840 489874 483394 476124 468597 461595 455392 449665 444110 438919 434530 431061 428170 425479 422939
62008D22939k257j946j540o89P21K245L379M202N038N785O100O078N999N537M128
$$ 422939 420682 418736 417196 416507 417228 419473 422852 427054 432092 437877 443977 450055 456054 461591 465719
61993D65719K259J362J945K676K078L68j205k220l261m664o090p202p858p770
$$ 465719 467978 469340 471285 473961 476039 476407 475202 472982 469721 465057 458967 451765 443907 436137
61979D36137o897o027o022o474o104m638l252k899l198l378l387l469l410k957
$$ 436137 429240 423213 417191 410717 404613 399975 396723 393824 390626 387248 383861 380392 376982 374025
61965C74025k429k237k183j857j352j090j144j248j279j272j131o74J73J397K878
$$ 374025 371596 369359 367176 365319 363967 362877 361733 360485 359206 357934 356803 356129 356302 357699 360577
61950C60577M122M483L980L506L835M756N662O552P793R209J0159J0542J1030
$$ 360577 364699 369182 373162 376668 380503 385259 390921 397473 405266 414475 424634 435176 446206
61937D46206J2098J3316J3889J3559J2728J1866J1118J0385R617Q821P914O703
$$ 446206 458304 471620 485509 499068 511796 523662 534780 545165 554782 563603 571517 578220
61925E78220N137L390J595l33k356m022m885n140n374n674n465m321k503m83J608
$$ 578220 583357 586747 588342 588009 585653 581631 576746 571606 566232 560558 555093 550772 548269 547786 549394
61910E49394L828O090Q198R933J0905J0763R778Q838Q477Q173O968M552J544j125
$$ 549394 553222 559312 567510 577443 588348 599111 608889 617727 626204 634377 641345 645897 647441 646316
61896F46316k902l893m652n577o470o913o948p009p191p157o777o312n820n120
$$ 646316 643414 639521 634869 629292 622822 615909 608961 601952 594761 587604 580827 574515 568695 563575
61882E63575m500m677n745o881p542q209r340j0256r958q551p072o108n306m129
$$ 563575 559075 554398 548653 541772 534230 526021 516681 506425 496467 487916 480844 474736 469430 465301
61868D65301k537r43J74P19J218K301L769M754M977N230O176P528Q891J0555J2733
$$ 465301 462764 461821 461995 462714 463932 466233 470002 474756 479733 484963 491139 498667 507558 518113 530846
61853E30846J4826J6368J7933J9991K1656K1850K1177K1131K1736K1508J9717
$$ 530846 545672 562040 579973 599964 621620 643470 664647 685778 707514 729022 748739
61842G48739J7219J4736J1805P954L711j39l419o081p715q184q074p897p342n827
$$ 748739 765958 780694 792499 800453 804164 804025 800606 794525 786810 778626 770552 762655 755313 749486
61828G49486l397o31K077M768P568J0185J1729J1327R213O779M973L087Rl834
$$ 749486 746089 745458 747535 752303 759871 770056 781785 793112 802325 809104 814077 817164 817173 813339
61814H13339o976r052j1023j3217j4677j4847j4544j4606j4805j4806j4997j5536
$$ 813339 806363 797311 786288 773071 758394 743547 729003 714397 699592 684786 669789 654253
61802F54253j5650j4851j3945j3803j3846j2876j0849q849p659p200p017o553
$$ 654253 638603 623752 609807 596004 582158 569282 558433 549584 541925 534725 527708 521155
61790E21155n334l657k599k703l183l077k556k203j833j132q06j619k716k465
$$ 521155 515821 512164 509565 506862 503679 500602 498046 495843 494010 492878 492072 490453 487737 485272
61776D85272r13P9n63j812k215j679r50l28K91P84R97J133J427J771K101K719
$$ 485272 484359 484438 483875 482063 479848 478169 477219 476891 477182 477966 478963 480096 481523 483294 485395 488114
61760D88114L797M870N372N354N347N546N502M578K578P1j911k727k797l110m083
$$ 488114 491911 496781 502153 507507 512854 518400 523902 528480 531058 531129 529218 526491 523694 520584 516501
61745E16501n192n848o125o388o540o169n219m194l600l352k894j878o64M3J6
$$ 516501 511309 505461 499336 492948 486408 480239 475020 470826 467226 463874 460980 459102 458438 458481 458497
61730D58497k91m40m66l47M51K174L883M250L228K093J745J797J630J375J383
$$ 458497 458206 457766 457300 456953 457404 459578 463461 467711 470939 473032 474777 476574 478204 479579 480962
61715D80962J481J451J576J947J776K93j918l428l632l254l175l566m183m718
$$ 480962 482443 483894 485470 487417 489193 489486 487568 484140 480508 477254 474079 470513 466330 461612
61701D61612m765m108l301l305m251n152n145m454l773l266k801k606l028l776
$$ 461612 456847 452739 449438 446133 441882 436730 431585 427131 423358 420092 417291 414685 411657 407881
61687D07881m123l812l241k803k561k525k691k691j996p29J85k3j055j919j943
$$ 407881 403758 399946 396705 393902 391341 388816 386125 383434 381438 380709 380894 380871 379816 377897 375954
61672C75954j269n37k89n22o61j96O56J191J248J442K172K841K707K099K096L048
$$ 375954 374685 374148 373859 373337 372676 372480 373136 374327 375575 377017 379189 382030 384737 386836 388932 391980
61656C91980M048M057L049J813J021O92M17n7n14n18m6L79M35N41J263K405L251
$$ 391980 396028 400085 403134 404947 405968 406660 407077 407020 406506 405988 405942 406321 406756 407297 408560 410965 414216
61639D14216L597L815L970L558K428J257P12O14L61k95j259k467l745m651m972
$$ 414216 417813 421628 425598 429156 431584 432841 433553 434167 434528 434233 432974 430507 426762 422111 417139
61624D17139n049n207n167m536l585k944k667k225j432p46n86q20j077j178j151
$$ 417139 412090 406883 401716 397180 393595 390651 387984 385759 384327 383581 382995 382175 381098 379920 378769
61609C78769j080j114j378j823k333k910l516l806l444k705k396k977l995m576
$$ 378769 377689 376575 375197 373374 371041 368131 364615 360809 357365 354660 352264 349287 345292 340716
61595C40716m313l571l025k969l043k671j793r66o86q16r74j098j265j269r08
$$ 340716 336403 332832 329807 326838 323795 321124 319331 318365 317679 316863 315889 314791 313526 312257 311349
61580C11349n21o18j047j191r58r17j306j607j371q38l40K59J103J805J924J621
$$ 311349 310828 310210 309163 307972 307014 306097 304791 303184 301813 300975 300635 300894 301997 303802 305726 307347
61564C07347J324J149J061J275J820K073J478N39L75J243K266K623K285J468K00
$$ 307347 308671 309820 310881 312156 313976 316049 317527 318066 318441 319684 321950 324573 326858 328326 328526
61549C28526j121j549o11Q34J458R91L27K50O52J049J286J525J830K094K208K153
$$ 328526 327405 325856 325245 326079 327537 328528 328855 329105 329757 330806 332092 333617 335447 337541 339749 341902
61533C41902J985J835J755J559R55k6r27j352j405j513j843k094j896j237m84
$$ 341902 343887 345722 347477 349036 349991 349965 349038 347686 346281 344768 342925 340831 338935 337698 337214
61518C37214n5r4l94n91m21J37R45J783K373K459K033J448J158J305J599J595
$$ 337214 337159 337065 336671 336080 335659 335796 336741 338524 340897 343356 345389 346837 347995 349300 350899 352494
61502C52494J049J34o44p77k55K80J63m94q64m21L90P89P16Q31J500K253K469
$$ 352494 353543 353677 353033 352256 352001 352281 352444 351950 351086 350665 351055 351844 352560 353391 354891 357144 359613
61485C59613K222K093K309K509K358K019J845J873J826J507R67L36l42j072j823
$$ 359613 361835 363928 366237 368746 371104 373123 374968 376841 378667 380174 381141 381477 381135 380063 378240
61470C78240k450k697k394j714j073o42j98L24M18m18j825k835l017k765k349
$$ 378240 375790 373093 370699 368985 367912 367270 367072 367396 367814 367396 365571 362736 359719 356954 354605
61455C54605j379L42K053K780K530K095J852J495Q85M70O58J297J974K474K757
$$ 354605 353226 353568 355621 358401 360931 363026 364878 366373 367258 367728 368386 369683 371657 374131 376888
61440C76888K865K953L099L051K580K090K293L108L516K841J612P97O01N92N42
$$ 376888 379753 382706 385805 388856 391436 393526 395819 398927 402443 405284 406896 407693 408294 408886 409428
61425D09428N50N47L72K69P10J688K625L090L233L388L542L389K759J882J297
$$ 409428 409978 410525 410897 411166 411876 413564 416189 419279 422512 425900 429442 432831 435590 437472 438769
61410D38769J365J810J901J223J39o97j068j212j352j590k030k610k900k586k043
$$ 438769 440134 441944 443845 445068 445207 444510 443442 442230 440878 439288 437258 434648 431748 429162 427119
61395D27119j960k347k448j796q66m92r44j832k600k858k513j878j484j549j707
$$ 427119 425159 422812 420364 418568 417702 417210 416266 414434 411834 408976 406463 404585 403101 401552 399845
61380C99845j457o89L39J349K071K176J533N94J48N56J412K042K156J897J460
$$ 399845 398388 397699 398038 399387 401458 403634 405167 405761 405909 406465 407877 409919 412075 413972 415432
61365D15432R69N84L94J98k41o51l53Q07K028K506K546L155M651O277P252P596
$$ 415432 416401 416985 417379 417577 417336 416685 416332 417139 419167 421673 424219 427374 432025 438302 445554 453150
61349D53150P674P521O965O068N079M259L889M053M273L855K891K262K337K404
$$ 453150 460824 468345 475310 481378 486457 490716 494605 498658 502931 506786 509677 511939 514276 516680
61335E16680J895J402J590J867J202j27r16r61j291k378l383l546l171k731k037
$$ 516680 518575 519977 521567 523434 524636 524509 523593 522632 521341 518963 515580 512034 508863 506132 504095
61320E04095r63q9K17O19J812L265L887L609L407L911M863N933P271R006J0721
$$ 504095 503132 503043 503260 503879 505691 508956 512843 516452 519859 523770 528633 534566 541837 550843 561564
61305E61564J1767J1842J1192J0353R691Q998P679N484K890N05j633l771n679
$$ 561564 573331 585173 596365 606718 616409 625407 633086 638570 641460 641965 640332 636561 630882
61292F30882o721o785o614p038q082r065r425r263r083r073q812p796o198m805
$$ 630882 624161 617376 610762 603724 595642 586577 577152 567889 558806 549733 540921 533125 526927 522122
61278E22122m114l781l113j883m50P34J431J617J466J273J215J255J388J818K659
$$ 522122 518008 514227 511114 509231 508781 509515 510946 512563 514029 515302 516517 517772 519160 520978 523637
61263E23637L677M493N012N403N787O173O516O606O049M660K852J374O17L55Q2
$$ 523637 527314 531807 536819 542222 548009 554182 560698 567304 573353 578013 580865 582239 582856 583211 583293
61248E83293m20r28j056p84o19j061j868k241j809j067o53o32p25q35q69m44O42
$$ 583293 582873 581945 580889 580105 579486 578425 576557 574316 572507 571440 570787 570155 569430 568595 567726 567282 567924
61231E67924J902K631K855L231M067M936N319N192M906M800N024N492N921O128
$$ 567924 569826 572457 575312 578543 582610 587546 592865 598057 602963 607763 612787 618279 624200 630328
61217F30328O216O314O313O095N770N339M431K900J422Q02Q59P54M81J050K907
$$ 630328 636544 642858 649171 655266 661036 666375 670806 673706 675128 675930 676789 677543 678024 679074 681981
61202F81981M972N900N802N970P217R154J0998J2527J3918J5047J5297J4125J1682
$$ 681981 686953 692853 698655 704625 711842 720996 731994 744521 758439 773486 788783 802908 814590
61189H14590Q743N965L448J129o75j550j723k009k939m284n538o510p261p862
$$ 814590 823333 829298 832746 833875 833200 831650 829927 827918 824979 820695 815157 808647 801386 793524
61175G93524q446r202j0091j0738j0787j0211r217q160p589p944q963r767r810
$$ 793524 785078 775876 765785 755047 744260 734049 724832 716672 709083 701139 692176 682409 672599
61162F72599r427r174q976q355p198n879m683l526k221p03R74K662M172N393O241
$$ 672599 663172 653998 645022 636667 629469 623590 618907 615381 613160 612457 613431 616093 620265 625658 631899
61147F31899O372N318L168Q57p19j627k485l272l116j421J289L906N735O790P425
$$ 631899 638271 643589 646757 647614 646895 645268 642783 639511 636395 634974 636263 640169 645904 652694 660119
61132F60119Q071R184J0992J3240J5381J7161J8793K0483K1983K3009K3969K5821
$$ 660119 668190 677374 688366 701606 716987 734148 752941 773424 795407 818416 842385 868206
61120H68206K8906L2316L4810L6146L7038L7989L8842L9490M0263M1240M1832
$$ 868206 897112 929428 964238 1000384 1037422 1075411 1114253 1153743 1194006 1235246 1277078
61109A277078M1538M0692L9836L8762L6824L4018L0896K7467K3008J7267J1139
$$ 1277078 1318616 1359308 1399144 1437906 1474730 1508748 1539644 1567111 1590119 1607386 1618525
61098A618525N641O37m836j1206j7842k3771k8512l2102l4852l7190l9434m1310
$$ 1618525 1624166 1624803 1619967 1608761 1590919 1567148 1538636 1506534 1471682 1434492 1395058 1353748
61086A353748m1954m0820l8557l6561l5493l4697l3277l1296k9412k7700k5596
$$ 1353748 1311794 1270974 1232417 1195856 1160363 1125666 1092389 1061093 1031681 1003981 978385
61075I78385k2969k0487j8658j7112j5280j3285j1670j0551r570q540p635o968
$$ 978385 955416 934929 916271 899159 883879 870594 858924 848373 838803 830263 822628 815660
61063H15660o446o019n712n323m469l025j334J86J505K896M438N744O370O542
$$ 815660 809214 803195 797483 792160 787691 784666 783332 783518 785023 787919 792357 798101 804471 811013
61049H11013P183Q888J1035J2458J2938J3409J4510J5752J6513J7167J8430K0142
$$ 811013 818196 827084 838119 850577 863515 876924 891434 907186 923699 940866 959296 979438
61037I79438K1447K2001K2270K2729K3514K4735K6450K8295K9833L1300L3378
$$ 979438 1000885 1022886 1045156 1067885 1091399 1116134 1142584 1170879 1200712 1232012 1265390
61026A265390L6080L8417L9452L9295L8978L9682M2176M6554N2475N9777O8731
$$ 1265390 1301470 1339887 1379339 1418634 1457612 1497294 1539470 1586024 1638499 1698276 1767007
61015A767007P9295R0518J01402J12305J24981J41550J64016J94381K34225K84274
$$ 1767007 1846302 1936820 2038222 2150527 2275508 2417058 2581074 2775455 3009680 3293954
61005C293954L45294M18954N06669O08473P25386Q62892J029367J229473J458696
$$ 3293954 3639248 4058202 4564871 5173344 5898730 6761622 7790989 9020462 10479158
60996A0479158J698982J908664K012738J919274J574959J024707M14161q2563
$$ 10479158 12178140 14086804 16099542 18018816 19593775 20618482 21032643 20950080
60988B0950080l53496l84884k33003J4222K46230L34051J73122k48533q23815
$$ 20950080 20596584 20211700 19978697 19992919 20239149 20573200 20746322 20497789 19673974
60979A9673974j381069j778643j962781j957890j822344j614685j381746j155909
$$ 19673974 18292905 16514262 14551481 12593591 10771247 9156562 7774816 6618907
60971F618907r54202p81668o37843n20401m25184l47259k83518k32921j94046
$$ 6618907 5664705 4883037 4245194 3724793 3299609 2952350 2668832 2435911 2241865
60962B241865j64155j40915j23188j09644r8174q7404p7474o8642o0248n1752
$$ 2241865 2077710 1936795 1813607 1703963 1605789 1518385 1440911 1372269 1312021 1260269
60952A260269m3670l6712l0845k6039k3051k2489k3613k4880k5478k5691k5910
$$ 1260269 1216599 1179887 1149042 1123003 1099952 1077463 1053850 1028970 1003492 977801 951891
60941I51891k5924k5186k3522k1453j9855j9136j8929j8799j8888j9240j9007
$$ 951891 925967 900781 877259 855806 835951 816815 797886 779087 760199 740959 721952
60930G21952j7269j4570j2534j1825j1523j0762r860r328q850p998p098o658o542
$$ 721952 704683 690113 677579 665754 654231 643469 633609 624281 615431 607433 600335 593677 587135
60917E87135o423o381o413o018n019m137l953l934l374k667k615k983k880k301
$$ 587135 580712 574331 567918 561900 556881 552744 548791 544857 541483 538816 536201 533218 530338 528037
60903E28037k088k454k721k634k846l729m620m768m364m162m476m998n290n118
$$ 528037 525949 523495 520774 518140 515294 511565 506945 502177 497813 493651 489175 484177 478887 473769
60889D73769m458l465k397j464q54o98q71r61p33n29q42j597k174k134j568q14
$$ 473769 469311 465846 463449 461985 461131 460433 459562 458601 457868 457339 456497 454900 452726 450592 449024 448210
60873D48210j87R7J22L73J214K290K820K550K034J875K080K292K385K592L144
$$ 448210 448023 448120 448242 448615 449829 452119 454939 457489 459523 461398 463478 465770 468155 470747 473891
60858D73891L875M191L529J983L21p30j068r60n92j58o9n18j052j107q65j027
$$ 473891 477766 481957 485486 487469 487790 487060 485992 485032 484440 484282 484213 483695 482643 481536 480671 479644
60842D79644j808k755l612m675o093p404q099q263q304q382q396q245p793o823
$$ 479644 477836 475081 471469 466794 460701 453297 445198 436935 428631 420249 411853 403608 395815 388992
60828C88992n450m281l791l623l009j878j064j149j579j403o06j52o26j502j991
$$ 388992 383542 379261 375470 371847 368838 366960 365896 364747 363168 361765 361159 361007 360381 358879 356888
60813C56888j991j728j059O7Q57M10p91j191j46J373K356K911L329L140K124J314
$$ 356888 354897 353169 352110 352177 353034 353444 352653 351462 351316 352689 355045 357956 361285 364425 366549 367863
60797C67863J717K625K548J519J065J798K470J846M53l29j65op91k409l909m400
$$ 367863 369580 372205 374753 376272 377337 379135 381605 383451 383904 383575 383410 383404 382613 380204 376295 371895
60781C71895l817k903k397k381k594l013l639l980l471k362j541j350j299r97
$$ 371895 368078 365175 362778 360397 357803 354790 351151 347171 343700 341338 339797 338447 337148 336151
60767C36151o91n62k07P27J821K296J920J175O58N69P26Q32P46N11J36m18r34
$$ 336151 335460 334898 334691 335418 337239 339535 341455 342630 343288 343857 344583 345415 346161 346672 346808 346390 345456
60750C45456r49l14N40J226J953K989L900L937K989J613K98p93j568k134k871
$$ 345456 344507 344193 344733 345959 347912 350901 354801 358738 361727 363340 363638 362845 361277 359143 356272
60735C56272l785m020k901j112O8M26P18J085R57M42N17J409K073J794J266J442
$$ 356272 352487 348467 345566 344454 344522 344948 345666 346751 347708 348150 348667 350076 352149 353943 355209 356651
60719C56651K196K755K628J690J28j286j674j226j048j536j912j782j909k788
$$ 356651 358847 361602 364230 365920 366048 364762 363088 361862 360814 359278 357366 355584 353675 350887
60705C50887l601l542l060k830k501j611q05r61j721k141k170k283k248j513m68
$$ 350887 347286 343744 340684 337854 335353 333742 332937 331976 330255 328114 325944 323661 321413 319900 319432
60690C19432j7j77k51q1K3K75J083J934J925J324J330K214K968L045L133L814
$$ 319432 319415 319238 318987 318906 318929 319204 320287 322221 324146 325470 326800 329014 331982 335027 338160 341974
60674C41974M566M670M264L870L482K671J231o31k440l638l987l791l472l018
$$ 341974 346540 351210 355474 359344 362826 365497 366728 366097 363657 360019 356032 352241 348769 345751
60660C45751k255j419r05o43l66j89j90K40J686L521M448M155L473K924K236J480
$$ 345751 343496 342077 341172 340529 340163 339974 339784 340024 341710 345231 349679 353834 357307 360231 362467 363947
60644C63947J305J678J463p3k208l771m453m559m200l461k730k294j953j501j083
$$ 363947 365252 366930 368393 368320 366112 362341 357888 353329 349129 345668 342938 340644 338691 337190 336107
60629C36107p10k5J003J689J486P15p8q39j548j597n35R27J499Q52r4m56k78n6
$$ 336107 335397 335372 336375 338064 339550 340265 340187 339348 337800 336203 335668 336595 338094 338946 338852 338396 338118 338062
60611C38062L8J32K39K28J80M54J226K088K362J922J359J129R50L88k65l06L33
$$ 338062 338100 338232 338471 338699 338879 339333 340559 342647 345009 346931 348290 349419 350369 350757 350492 350186 350519
60594C50519J051J508J887K205K135J673J356J590K215K902L318K964J587Jm55
$$ 350519 351570 353078 354965 357170 359305 360978 362334 363924 366139 369041 372359 375323 376910 376911 376456
60579C76456M09J321J313Q67Q22J137J554K528M379O180O787O629P251R101J0935
$$ 376456 376865 378186 379499 380366 381188 382325 383879 386407 390786 396966 403753 410382 417633 426734 437669
60564D37669J1541J1097J0431R802Q859P291N106K561N9k113m053n892p178p133
$$ 437669 449210 460307 470738 480540 489399 496690 501796 504357 504416 502303 498250 492358 485180 478047
60550D78047n656l627j990q42K89J641L094M543N962P210Q149R043J0423J2400
$$ 478047 472391 468764 466774 465932 466221 467862 470956 475499 481461 488671 496820 505863 516286 528686
60536E28686J4373J5767J6894J8643K1188K3376K3728K1835J8492J4586J0301
$$ 528686 543059 558826 575720 594363 615551 638927 662655 684490 702982 717568 727869
60525G27869N443J49m927r052j1913j3778j5058j5686j5131j3281j0985r235q054
$$ 727869 733312 733461 728534 719482 707569 693791 678733 663047 647916 634635 623650 614415 606361
60512F06361o696m840k855j016P75K296K970K931L423N532R025J2956J6902K0974
$$ 606361 599665 594825 591970 590954 591729 594025 596995 599926 603349 608881 617906 630862 647764 668738
60498F68738K5078K8855L2206L5300L8131M0482M2053M2323M0671L7179L2950
$$ 668738 693816 722671 754877 790177 828308 868790 910843 953166 993837 1031016 1063966
60487A063966K9005K5221K0979J6512J2662R330N206p34q219j6467k5207l4291
$$ 1063966 1092971 1118192 1139171 1155683 1168345 1177675 1182881 1182147 1173928 1157461 1132254 1097963
60475A097963m2841m9506n3433n4602n3363n0185m5846m1348l7336l3729l0083
$$ 1097963 1055122 1005616 952183 897581 844218 794033 748187 706839 669503 635774 605691
60464F05691k6231k2428j9000j6058j3638j1853j0717r929r119q271p645p261
$$ 605691 579460 557032 538032 521974 508336 496483 485766 475837 466718 458447 450802 443541
60452D43541o799o062n190m381l680l201l119l210k828j694m36J18o3l04k00j8
$$ 443541 436742 430680 425490 421109 417429 414228 411109 407899 405071 403377 402941 403059 402996 402692 402492 402474
60436D02474j49o34j252j782k042j916j487r92o25m21l22k59k47l94p38j007p91
$$ 402474 402325 401691 400439 398657 396615 394699 393212 392220 391595 391174 390852 390593 390346 389952 389214 388207 387416
60419C87416p4O73J085J303J605J918K049K031J908J404L23q21j179n27N29J307
$$ 387416 387342 388015 389100 390403 392008 393926 395975 398006 399914 401318 401641 400820 399641 399114 399643 400950
60403D00950J625J631J591J871K630L389L357K461J661J868K862L631L609L155
$$ 400950 402575 404206 405797 407668 410298 413687 417044 419505 421166 423034 425896 429527 433136 436291
60389D36291K869K868K876K733K573K579K749K885K792K489K247K308K539K519
$$ 436291 439160 442028 444904 447637 450210 452789 455538 458423 461215 463704 465951 468259 470798 473317
60375D73317K026J356R23P44O25O88J218J900J895R95J49L07J162J734J809J971
$$ 473317 475343 476699 477622 478366 478991 479679 480897 482797 484692 485687 485836 486143 487305 489039 490848 492819
60359D92819K373K460K100K057K927M253N176N489N577N710N821N653M900L470
$$ 492819 495192 497652 499752 501809 504736 508989 514165 519654 525231 530941 536762 542415 547315 550785
60345E50785J852P70K63m30j770l234m032m022l555k906k304k055k122k090j968
$$ 550785 552637 553407 553670 553240 551470 548236 544204 540182 536627 533721 531417 529362 527240 525150 523182
60330E23182k461l806m958m770l555k649k657k980k954k530j846r66j65K25M34
$$ 523182 520721 516915 511957 507187 503632 500983 498326 495346 492392 489862 488016 487050 486885 487110 487544
60315D87544J185K778M773O591Q009Q916R096Q502P467O560O341P069Q384R441
$$ 487544 488729 491507 496280 502871 510880 519796 528892 537394 544861 551421 557762 564831 573215 582656
60301E82656R753R692R756R615Q394N692J822k719p365j1282j3808j4997j5227
$$ 582656 592409 602101 611857 621472 629866 635558 637380 634661 627296 616014 602206 587209 571982
60288E71982j4421j2448j0007q131o827n225l184j716j543k202k987l834m762
$$ 571982 557561 545113 535106 526975 520148 514923 511739 510023 508480 506278 503291 499457 494695
60275D94695n303n194m919m935m841m075k865j927j552j642k181k981l343k718
$$ 494695 489392 484198 479279 474344 469503 465428 462563 460636 459084 457442 455261 452280 448937 446219
60261D46219j506o03l03k76l44n69o40l2J103J920J956J640J530J547J336R15
$$ 446219 444713 444110 443807 443531 443187 442618 441978 441946 443049 444969 446925 448565 450095 451642 452978 453893
60245D53893N27J82k00l62P9R28J368Q39k79j092j100m73M16J352K161K621K695
$$ 453893 454420 454602 454402 454040 454119 455047 456415 457254 456975 455883 454783 454310 454726 456078 458239 460860 463555
60228D63555K653K747K942L132L451M052M735N108N128N207N719O605P528Q255
$$ 463555 466208 468955 471897 475029 478480 482532 487267 492375 497503 502710 508429 515034 522562 530817
60214E30817Q744Q960Q734P928O829O209O597P548P998P496O677O244O037N494
$$ 530817 539561 548521 557255 565183 572012 578221 584818 592366 600364 607860 614537 620781 626818 632312
60200F32312M698M229M227M165L588K544J281l7j273k349l342m270m906n158n416
$$ 632312 637010 641239 645466 649631 653219 655763 657044 657007 655734 653385 650043 645773 640867 635709 630293
60185F30293o098o983p463p300o633n576m363l728m171m972m795l446k136j799
$$ 630293 624195 617212 609749 602449 595816 590240 585877 582149 577978 573006 568211 564765 562629 560830
60171E60830j996j845j297r05r77j427k054k508k395j796j267j072q18j75N34
$$ 560830 558834 556989 555692 554787 553810 552383 550329 547821 545426 543630 542363 541291 540473 540298 540832
60156E40832Q42P85O71O47Q16J283J764J624P84R6K97J053J593J788J966K090
$$ 540832 541674 542459 543130 543777 544593 545876 547640 549264 550048 550144 550441 551494 553087 554875 556841 558931
60140E58931J958J973K880M622O154O587O085N506N492O027O569O481N550M091
$$ 558931 560889 562862 565742 570364 576518 583105 589190 594696 600188 606215 612784 619265 624815 628906
60126F28906K583J313N24M97J233K155K610K543K396K459K605K625K491K253J887
$$ 628906 631489 632802 633326 633823 635056 637211 639821 642364 644760 647219 649824 652449 654940 657193 659080
60111F59080J318M73o14j718k534k984l280l613l957m211m261l912l063k031j380
$$ 659080 660398 660871 660257 658539 656005 653021 649741 646128 642171 637960 633699 629787 626724 624693 623313
60096F23313j262j226q25j36M54O31K57n65j415j902k152k500k731k343j706j966
$$ 623313 622051 620825 620000 619864 620318 620949 621206 620641 619226 617324 615172 612672 609941 607598 605892 603926
60080F03926l433m843m916l968l279l494m394n643o843p283o663n756n541n824
$$ 603926 600493 595650 590734 586766 583487 579993 575599 569956 563113 555830 549167 543411 537870 532046
60066E32046n676m917m212l783l205k428k007k048j960j502j171j221j140n44
$$ 532046 526370 521453 517241 513458 510253 507825 505818 503770 501810 500308 499137 497916 496776 496232
60052D96232K17Q29J617K866M130M890N297N733O116O261O487P097P594P151N761
$$ 496232 496449 497278 498895 501761 505891 510781 516078 521811 527927 534188 540675 547772 555366 562517 568278
60037E68278M216L046K037Q74l19j252j898k456l108l902m786n740o928q515j0131
$$ 568278 572494 575540 577577 578451 578132 576880 574982 572526 569418 565516 560730 554990 548062 539547 529416
60022E29416j0893j0363r265q670q593q071o711n366m880m847m294l172k266j880
$$ 529416 518523 508160 498895 490225 481632 473561 466850 461484 456604 451757 447463 444291 442025 440145
60008D40145j466p70m76j147k170k370j435j26P18Q75N53J48J82R12J838K164
$$ 440145 438679 437909 437433 436286 434116 431746 430311 430185 430903 431778 432331 432479 432661 433573 435411 437575
59992D37575J861J768K394L235L603L639L883M282M269L680K926K180J014q42
$$ 437575 439436 441204 443598 446833 450436 454075 457958 462240 466509 470189 473115 475295 476309 475467
59978D75467k799l866l731l097k907l366l899l994l739l420k880j810n10K90M16
$$ 475467 472668 468802 465071 461974 459067 455701 451802 447808 444069 440649 437769 435959 435449 435739 436155
59963D36155M82Q67J204J247J568K610L611L387J988O79K73M23N79P85J154J407
$$ 436155 436637 437504 438708 439955 441523 444133 447744 451131 453119 453798 454071 454494 455073 455858 457012 458419
59947D58419J437J676K293K548J667R7q94p98l96n71j176j321n05R10K250L281
$$ 458419 459856 461532 463825 466373 468040 468137 467243 466445 466049 465478 464302 462981 462476 463386 465636 468917
59931D68917M314N633O940P512O967N667M228K863J374l47k161l891n264n726
$$ 468917 473231 478864 485804 493316 500283 505950 510178 513041 514415 514068 511907 508016 502752 497026
59917D97026m831l040j590j242j445j128l6J197K017K413K503K296J941J670J345
$$ 497026 492195 489155 487565 486323 484878 483750 483714 484911 486928 489341 491844 494140 496081 497751 499096
59902D99096O19l41q49o12j37Q3J95M52O84Q46J488K990M712N610N504N006M505
$$ 499096 499715 499374 498525 497913 497776 497859 498054 498506 499190 500036 501524 504514 509226 514836 520340 525346 529851
59885E29851L972L576L633L978M065L780L507L446L450L509L709L788L418K829
$$ 529851 533823 537399 541032 545010 549075 552855 556362 559808 563258 566767 570476 574264 577682 580511
59871E80511K380J660o1k446m227m833m872m792m232l098k147j796j321p0J342
$$ 580511 582891 584551 584490 582044 577817 572984 568112 563320 559088 555990 553843 552047 550726 550656 551998
59856E51998J918J761J846K658L828M771N217N349N791P071Q864J0216J0629J0256
$$ 551998 553916 555677 557523 560181 564009 568780 573997 579346 585137 592208 601072 611288 621917 632173
59842F32173Q947O247K791M30K64J469K838M313N978O738N500K908M64j486l453
$$ 632173 641120 647367 650158 650588 650852 652321 655159 659472 665450 672188 677688 680596 681060 679574 676121
59827F76121n092n456m822m704n873p569q788r235q917p905o639n528m249k372
$$ 676121 671029 665573 660751 656047 650174 642605 633817 624582 615665 607760 601121 595593 591344 588972
59813E88972n95j30q93j503j282r94j365k006k267k167j929j468p94k26J45N47
$$ 588972 588377 588247 587354 585851 584569 583575 582210 580204 577937 575770 573841 572373 571579 571353 571498 572045
59797E72045Q57N61l31j130j376j255q78j36O04N83j85p35o08n12j059j719j723
$$ 572045 572902 573463 573132 572002 570626 569371 568493 568357 568961 569544 569359 568624 568016 567504 566445 564726 563003
59780E63003j260j063j345j859k456l015l076k239p42P38J658J835J442R50P89
$$ 563003 561743 560680 559335 557476 555020 552005 548929 546690 545948 546686 548344 550179 551621 552571 553360
59765E53360Q92J018J394K393L581L892L108K404K998M821O847Q148Q358P693
$$ 553360 554252 555270 556664 559057 562638 566530 569638 572042 575040 579861 586708 594856 603214 610907
59751F10907O830O305N915N226M581M711N381N490M736M008L754L312K415K004
$$ 610907 617737 624042 629957 635183 639764 644475 649856 655346 660082 664090 667844 671156 673571 675575
59737F75575K627L266K956K466L020M168M385L310J981J128N91K36K10K46j24
$$ 675575 678202 681468 684424 686890 689910 694078 698463 701773 703754 704882 705473 705709 705919 706165 706041
59722G06041o33o04k38n36j758k977l380l185k948k750k459k138j742r91J86J436
$$ 706041 705408 704804 704566 704030 702272 699295 695915 692730 689782 687032 684573 682435 680693 679702 679888 681324
59706F81324K500L498M471N115N245N226N595O495P641Q658R331R745J0208J0827
$$ 681324 683824 687322 691793 696908 702153 707379 712974 719469 727110 735768 745099 754844 765052 775879
59692G75879J1056J0048P574M378J509n32j878k840l504l786l641l314l325m106
$$ 775879 786935 796983 804557 808935 810444 809912 808034 805194 801690 797904 794263 790949 787624 783518
59678G83518n543o988p810p967p951q151q344q032p236o615o555o510n726m400
$$ 783518 777975 770987 763177 755210 747259 739108 730764 722732 715496 708881 702326 695816 690090 685690
59664F85690l468l284l169k427j219j20O19J040J254J597K514L829M536L936K589
$$ 685690 682222 678938 675769 673342 672123 672003 672622 673662 674916 676513 679027 682856 687392 691328 693917
59649F93917J634J393J232N41p95k715n131p607r389r995r549q566p591o999o836
$$ 693917 695551 696944 698176 698717 697922 695207 690076 682469 673080 663085 653536 644970 637379 630380 623544
59634F23544o766o346n427m273l417l338m057m911n071m532m222m886o119o901
$$ 623544 616778 610432 605005 600732 597315 593977 589920 585009 579938 575406 571184 566298 560179 553278
59620E53278o789o148n372m481l552l040l332m135m528l804k202o67J48M55P52
$$ 553278 546489 540341 534969 530488 526936 523896 520564 516429 511901 508097 505895 505228 505376 505831 506583
59605E06583J023R11N17M00P68J184J228R58O10L81O12J549K753L374L276L191
$$ 506583 507606 508517 509034 509434 510202 511386 512614 513572 514182 514563 515175 516724 519477 522851 526127 529318
59589E29318L456L361K240N77o93j404k001k562k773k609k406k329k375k703l445
$$ 529318 532774 536135 538375 538952 538259 536855 534854 532292 529519 526910 524504 522175 519800 517097 513652
59574E13652m233m383l606k317j350j394k391l335l157k018j165j229j418q79
$$ 513652 509419 505036 501430 499113 497763 496369 493978 490643 487486 485468 484303 483074 481656 480777
59560D80777n8R6l49n39k17J47M36J074K106K905L045K797K665K833L215L595
$$ 480777 480719 480815 480466 479927 479710 479857 480293 481367 483473 486378 489423 492220 494885 497718 500933 504528
59544E04528L782L983M869O866R497J1922J4043J6438J9144K0973K0131J5543
$$ 504528 508310 512293 517162 524028 533525 545447 559490 575928 595072 616045 636176 651719
59532F51719P746j046q057j1648j2014j0298p461m253j576l6N81P64M51n91j889
$$ 651719 659465 658419 650362 638714 626700 616402 608941 604688 603112 603076 603657 604421 604872 604281 602392
59517F02392k581k565k639l413m643n764o529p042p490p854p734o694n041l819
$$ 602392 599811 597246 594607 591194 586551 580787 574258 567216 559726 551872 544138 537444 532403 528584
59503E28584l612l788l459k702k151j782j038Q1R82J482K015K773L374L531L417
$$ 528584 524972 521184 517725 515023 512872 511090 510052 510133 511115 512597 514612 517385 520759 524290 527707
59488E27707L243L050K951L098L423L761M153M630M918M818M645M727M813M574
$$ 527707 530950 534000 536951 540049 543472 547233 551386 556016 560934 565752 570397 575124 579937 584511
59474E84511M321M468M615M007K702J410L77o56j511j684j319j120j233j124n57
$$ 584511 588832 593300 597915 601922 604624 606034 606411 605755 604244 602560 601241 600121 598888 597764 597207
59459E97207K11J269L019N136O618P094P215P458P525P142O539N804M679L380
$$ 597207 597418 598687 601706 606842 613460 620554 627769 635227 642752 649894 656433 662237 666916 670296
59445F70296K624K413J671l16k915n114o593p296o801m997k768j184m06k6K9l48
$$ 670296 672920 675333 677004 676688 673773 668659 662066 654770 647969 642972 640204 639020 638614 638588 638617 638269
59429F38269p35m82L64J171J730K652M588P442J0478J3069J5158J6975J8497J9477
$$ 638269 637534 637052 637416 638587 640317 642969 647557 654999 665477 678546 693704 710679 729176 748653
59415G48653K0100K1183K3356K6295K8996L0254K8478K2028J1030j374j0870j5223
$$ 748653 768753 789936 813292 839587 868583 898837 927315 949343 960373 958999 948129 932906
59403I32906j5025j1682o212J57N941J0523J3830J4452R787o88j3479k3749k9226
$$ 932906 917881 906199 899987 900144 906085 916608 930438 944890 954677 953989 940510 916761 887535
59390H87535l0644k9426k6508k2792j9135j5750j2553r930q289p154n681l944
$$ 887535 856891 827465 800957 778165 759030 743280 730727 720797 712508 705354 699673 695729
59378F95729k760k339k030j413p01j4Q62J745J976J425R22J224K082K737L006
$$ 695729 692969 690630 688600 687187 686486 686472 687334 689079 691055 692480 693402 694626 696708 699445 702451
59363G02451L348M055M852N361N653O142P122Q436R688J0609J1196J1624J2149
$$ 702451 705799 709854 714706 720067 725720 731862 738984 747420 757108 767717 778913 790537 802686
59350H02686J2979J4087J5110J5599J5326J4284J2623J0758R189P838N864K693
$$ 802686 815665 829752 844862 860461 875787 890071 902694 913452 922641 930479 936343 939036
59338I39036r97l935n784p317r078j0757j2046j3288j4832j6347j7237j7316j6803
$$ 939036 938039 934104 928320 921003 911925 901168 889122 875834 861002 844655 827418 810102 793299
59325G93299j6016j5356j5075j4789j3748j1898j0158r288q949q314p200o157
$$ 793299 777283 761927 746852 732063 718315 706417 696259 686971 678022 669708 662508 656351
59313F56351n711n866o162o025n319m606m359m016k475K86K947M587N869P916
$$ 656351 650640 644774 638612 632587 627268 622662 618303 614287 611812 612098 615045 619632 625501 633417
59299F33417J0684J3096J4265J3760J1152O271j32o535j1512j4243j4590j3168
$$ 633417 644101 657197 671462 685222 696374 702645 702513 695978 684466 670223 655633 642465
59287F42465j1052q935o721m158j486R31L102M994O088O071N717O255P963R996
$$ 642465 631413 622478 615757 611599 610113 611044 614146 619140 625228 631299 637016 643271 651234 661230
59273F61230J1571J2677J3517J3942J3717J2942J1914J0820R777Q946Q362P688
$$ 661230 672801 685478 698995 712937 726654 739596 751510 762330 772107 781053 789415 797103
59261G97103O424M512K576J311O32k03j527k764l295l288l254l184k876k647k960
$$ 797103 803527 808039 810615 811926 812558 812355 810828 808064 804769 801481 798227 795043 792167 789520 786560
59246G86560l491l558l276l363l830l952l624l534l841l824l206k734k960l493
$$ 786560 783069 779511 776235 772872 769042 765090 761466 757932 754091 750267 747061 744327 741367 737874
59232G37874l995m763n812o478o607o998p892q223p360o396o509p041o555n075
$$ 737874 733879 729116 723304 716826 710219 703221 695329 687106 679746 673350 666841 659800 653245 648170
59218F48170l818l287l019k781k699k388j283K84J439K047K590L026K876K300
$$ 648170 644352 641065 638046 635265 632566 630178 628895 629179 630618 632665 635255 638281 641157 643457
59204F43457J978J962J744J349J289J481J314Q40O90P81K86q76j679j517j035
$$ 643457 645435 647397 649141 650490 651779 653260 654574 655414 656104 656885 657171 656295 654616 653099 652064
59189F52064r92j179j080p80o75p82q87r27r25r13j144j837k561k512j645r36
$$ 652064 651072 649893 648813 648033 647358 646576 645689 644762 643837 642924 641780 639943 637382 634870 633225 632289
59173F32289j187k065k673k513j632l85N52M45o14j493j232j66N73M00l91j395
$$ 632289 631102 629037 626364 623851 622219 621834 622386 622831 622217 620724 619492 619326 619899 620299 619908 618513
59157F18513k477l417l818l670l613m258n431o398o677o370n793n181m782m716
$$ 618513 616036 612619 608801 605131 601518 597260 591829 585431 578754 572384 566591 561410 556628 551912
59143E51912m627l917k695k037k801m465n687n813n245m549l915l383k882k116
$$ 551912 547285 543368 540673 538636 535835 531370 525683 519870 514625 510076 506161 502778 499896 497780
59129D97780r98j02J36M49J896M086N494N690N922P056Q378R109R696J0593J1048
$$ 497780 496782 496680 496816 497265 499161 503247 508741 514431 520353 527409 535787 544896 554592 565185 576233
59114E76233J0421R728J0348J1860J2572J1864J0670R879R403Q789P751O106M021
$$ 576233 586654 596382 606730 618590 631162 643026 653696 663575 672978 681767 689518 695624 699645
59101F99645K242J347R53L44m39r09j200j912l064m010m220l559k112m30M71J36
$$ 699645 701887 703234 704187 704531 704092 703183 701983 700071 697007 692997 688777 685218 683106 682676 683147 683283
59085F83283o09p56m81o47j497k691m167n906p314p839p849p910p678o667n489
$$ 683283 682674 681918 681437 680790 679293 676602 672435 666529 659215 651376 643527 635617 627939 621272 615783
59070F15783n032m854l932k674k512l582m464m359l895l577l053k380k392l166
$$ 615783 610751 605897 601965 599291 596779 593197 588733 584374 580479 576902 573849 571469 569077 565911
59056E65911l550k943k298k469k802k298j242n41k09M37J459K175K190J814J517
$$ 565911 562361 559418 557120 554651 551849 549551 548309 547768 547559 547996 549455 551630 553820 555634 557151
59041E57151J439J454J358J002M39q9k50K64J482K864L652L829M282N542O929
$$ 557151 558590 560044 561402 562404 562843 562754 562504 562768 564250 567114 570766 574595 578877 584419 591348
59026E91348P599P816Q328R006R223R225R849J0933J1226J0017P831N442L182
$$ 591348 598947 606763 615091 624097 633320 642545 652394 663327 674553 684570 692401 697843 701025
59013G01025J305Qj035k262l301l406k780k393k429k016o54J176K964M684O098
$$ 701025 702330 702338 701303 699041 695740 692334 689554 687161 684732 682716 682062 683238 686202 690886 696984
58998F96984O689O523O185N645M290K255N30n36j608k937l783l769l595l788l864
$$ 696984 703673 710196 716381 722026 726316 728571 729101 728565 726957 724020 720237 716468 712873 709085 705221
58983G05221l367k676k128j253L47K188L617M695N828P165Q739J0523J1997J2441
$$ 705221 701854 699178 697050 695797 696144 698332 701949 706644 712472 719637 728376 738899 750896 763337
58969G63337J1993J1583J1557J1322J0554R699Q872P496N545L956L129K091Kk545
$$ 763337 775330 786913 798470 809792 820346 830045 838917 846413 851958 855914 859043 861134 861136 858591
58955H58591m546o000p453q904j0109j1231j2375j3038j2793j2012j1286j0661
$$ 858591 854045 848045 840592 831688 821579 810348 797973 784935 772142 760130 748844 738183
58943G38183r964r302q683p772o481n223m228l292k542k499k974k911j885p84
$$ 738183 728219 718917 710234 702462 695981 690758 686530 683238 680696 678197 675223 672312 670427 669643
58929F69643l85k75J54O42P82Q56J061P89l19j432j543q14qP03J525K277K751
$$ 669643 669258 668983 669137 669779 670561 671417 672478 673267 672948 671516 669973 669159 669151 669854 671379 673656 676407
58912F76407L338M387N512O221O722P358P921Q220Q803J0254J2252J3979J4950
$$ 676407 679745 684132 689644 695865 702587 709945 717866 726086 734889 745143 757395 771374 786324
58899G86324J4968J3913J2174J0574R340P912O261N392N870O963Q037R667J2240
$$ 786324 801292 815205 827379 837953 847293 855205 861466 866858 872728 879691 887728 897395 909635
58886I09635J4567J5176J4174J2612J0797Q592O540N264M182K285k20k363m057
$$ 909635 924202 939378 953552 966164 976961 985553 992093 997357 1001539 1003824 1003604 1001241 997184
58873I97184n877p481p764o640n304m653m489m452m650n207n982o920q059r217
$$ 997184 991307 983826 976062 969422 964118 959465 954976 950524 945874 940667 934685 927765 919706 910489
58859I10489j0235j1354j2739j3857j4086j3675j3387j3388j3249j2838j2427
$$ 910489 900254 888900 876161 862304 848218 834543 821156 807768 794519 781681 769254
58848G69254j2096j1701j1305j1029j0706j0257j0039j0222j0210r481q502q051
$$ 769254 757158 745457 734152 723123 712417 702160 692121 681899 671689 662208 653706 645655
58836F45655p979p527o591n809n539n515n379m875l703j889j30Q89J351J936K894
$$ 645655 637676 630149 623558 617749 612210 606695 601316 596441 592738 590849 590719 591608 592959 594895 597789
58821E97789L971M915N487N435N029N053N679N889M880L417K802K979K716J448
$$ 597789 601760 606675 612162 617597 622626 627679 633358 639247 644127 647544 650346 653325 656041 657489
58807F57489n8q90j030j153j873l182m336m613m364m635n539n949n333m780n317
$$ 657489 657431 656541 655511 654358 652485 649303 644967 640354 635990 631355 625816 619867 614534 609754 604437
58792F04437o210o089m925l719k885k121j320m07J132L362N139N506N330O162
$$ 604437 598227 592138 587213 583494 580609 578488 577168 576761 577893 581255 586394 591900 597230 603392
58778F03392P918R144R244Q904Q464P352N191K221j408n523r088j0768j0581r896
$$ 603392 611310 620454 629698 638602 647066 654418 659609 661830 660422 654899 645811 635043 624462 614566
58764F14566r639r519r138q732q498q054p018n514l936k610j786j480j457j623
$$ 614566 604927 595408 586270 577538 569040 560986 553968 548454 544518 541908 540122 538642 537185 535562
58750E35562k093k528k021l54J367K130K422L254M443N055N024N061N295N261
$$ 535562 533469 530941 528920 528566 529933 532063 534485 537739 542182 547237 552261 557322 562617 567878
58736E67878N009N089N579O066O401O528O055M919M044M192M747M758M575N038
$$ 567878 572887 577976 583555 589621 596022 602550 608605 613524 617568 621760 626507 631265 635840 640878
58722F40878N720N536M784M881O216P828R061J0015J0422R694Q214P038O204M652
$$ 640878 646598 652134 656918 661799 668015 675843 684904 694919 705341 715035 723249 730287 736491 741143
58708G41143K014r40l634o168q419j0051j1501j3570j5931j7449j8022j8585j9177
$$ 741143 743157 742217 738583 732415 723996 713945 702444 688874 672943 655494 637472 618887 599710
58695E99710j8681j6853j4946j3805j2729j0867q494o313m594l545l417l806l818
$$ 599710 581029 564176 549230 535425 522696 511829 503335 497022 492428 488883 485466 481660 477842
58682D77842l355l115l132k542j186k12m25j136j240n50M92J601K591L325M075
$$ 477842 474487 471372 468240 465698 464512 464300 463875 462739 461499 460949 461441 463042 465633 468958 473033
58667D73033N415P405R492J1232J2408J2567J1314R019O337L168q61n108q309
$$ 473033 478448 485853 495345 506577 518985 531552 542866 551885 558222 561390 560529 555421 547112
58654E47112j0167j1335j1921j1423j0127r050q274o863m747l193k858k769j884
$$ 547112 536945 525610 513689 502266 492139 483089 474815 467952 463205 460012 457154 454385 452501
58641D52501n03N11R29R45P00M70O19J015J223J384J975K649K391R80o60j709
$$ 452501 451998 452509 453438 454383 455083 455553 456172 457187 458410 459794 461769 464418 466809 467789 467129 465420
58625D65420k061j729p21L42O65M10M28Q58J196J557K583M066N053N352N549N564
$$ 465420 463359 461630 460909 461251 461916 462326 462754 463612 464808 466365 468948 473014 478067 483419 488968 494532
58609D94532M680L137K133K044K072J836J822K000J634P56K58K06l87j698k600
$$ 494532 499212 502349 504482 506526 508598 510434 512256 514256 515890 516646 516904 517110 516723 515025 512425
58594E12425k514k211k192j759l05J756L865N961P824Q999R617J0202J0533J0081
$$ 512425 509911 507700 505508 503749 503444 505200 509065 515026 522850 531849 541466 551668 562201 572282
58580E72282R414R601J0257R959Q668P849Q043Q340Q518R536J1418J2845J3485
$$ 572282 581696 591297 601554 611513 620181 628030 636073 644413 652931 662467 673885 686730 700215
58567G00215J4751J7509K0933K4232K7527L0414L1751L1562L1012K9801K5981
$$ 700215 714966 732475 753408 777640 805167 835581 867332 898894 929906 959707 985688
58556I85688J9303J2338P046K556k292o505q752r538r857r387p832o399o316p261
$$ 985688 1004991 1017329 1024375 1026931 1024639 1018134 1009382 999844 989987 980600 972768 966369 960053 952792
58542I52792q644j0992j4591j8323k1253k3884k6452k7602k6379k3975k1890j9862
$$ 952792 944148 933156 918565 900242 878989 855105 828653 801051 774672 750697 728807 708945
58530G08945j7198j4689j3355j2544j1054r148p744o696n347l961l140k721k398
$$ 708945 691747 677058 663703 651159 640105 630957 623213 616517 611170 607209 604069 601348 598950
58517E98950k496l014l035k159j342j250j127l52K94J13k19o4p6p62j292j013
$$ 598950 596454 593440 590405 588246 586904 585654 584527 584175 584469 584582 584363 584299 584223 583461 582169 581156
58501E81156o89q82p38K46Q91L29k51M51J672K085K084K839M348N985P769R559
$$ 581156 580467 579585 578847 579093 579984 580313 580062 580513 582185 584270 586354 589193 593541 599526 607295 616854
58485F16854J0328R846R718J1306J3881J6208J8361K0375K0902J9057J6118J3585
$$ 616854 627182 637028 646746 658052 671933 688141 706502 726877 747779 766836 782954 796539
58473G96539J0970P385L655Q86j614m771p459p917o457m703l196j566j1J294L139
$$ 796539 807509 814894 818549 819435 817821 813050 805591 797674 791217 786514 783318 781752 781741 783035 786174
58458G86174N915Q399R581J0414J1969J3271J2821J0928Q599N435O80m796r524
$$ 786174 792089 800488 810069 820483 832452 845723 858544 869472 878071 883506 884186 879390 869866
58445H69866j3346j6585j8532j8570j7534j6291j4398j1628r164p617n780l065
$$ 869866 856520 839935 821403 802833 785299 769008 754610 742982 733818 726201 720421 717356
58433G17356j061o77r1K150M400M959N426P847J0722J1330J0256R887R901P968
$$ 717356 716295 715618 715527 717677 722077 727036 732462 740309 751031 762361 772617 782504 792405 800373
58419H00373L957j06l464o731r308j0046r834j0424j1264j0537q678p755p895
$$ 800373 804330 804224 800760 794029 784721 774675 764841 754417 743153 732616 723938 716183 708288
58406G08288p379n835m483l610k549j663j605j277P68L509M707M335M034M017
$$ 708288 700909 695074 690591 686981 684432 682769 681164 679887 680655 684164 688871 693206 697240 701257
58392G01257L297K195J795J612N61n67m04K42j96q83Q5K238L700M640O471Q546
$$ 701257 704554 706749 708544 710156 710717 710150 709746 709988 709792 708909 708994 711232 714932 719572 726043 734589
58376G34589R028Q296Q202Q725Q628Q496R738J1360J1328J0326J0632J2083J2718
$$ 734589 743617 751913 760115 768840 777468 785964 795702 807062 818390 828716 839348 851431 864149
58363H64149J2615J3354J4395J3920J2564J2403J2797J1292Q106N693M299K120
$$ 864149 876764 890118 904513 918433 930997 943400 956197 967489 975595 981288 985587 987707
58351I87707m56j119j0L08n83n22J045K360L001M377O512Q004R175J1547J4420
$$ 987707 987251 986132 986122 986430 985847 985325 986370 988730 991731 996108 1002620 1010624 1019799 1031346 1045766
58336A045766J5684J5723J6596J7919J7658J6464J6764J7929J6970J3801J1161
$$ 1045766 1061450 1077173 1093769 1111688 1129346 1145810 1162574 1180503 1197473 1211274 1222435
58325A222435R510O767L128J253J482J579J304K491M584N103M597O074R284J0862
$$ 1222435 1231945 1238712 1241840 1243093 1244575 1246154 1247458 1249949 1254533 1259636 1264233 1270307 1279591 1290453
58311A290453J0404J1010J3325J4608J4348J5222J7570J8467J7337J7068J8435
$$ 1290453 1300857 1311867 1325192 1339800 1354148 1369370 1386940 1405407 1422744 1439812 1458247
58300A458247J8785J7397J6810J7704J7799J6904J7588J9791K0411J9316K0026
$$ 1458247 1477032 1494429 1511239 1528943 1546742 1563646 1581234 1601025 1621436 1640752 1660778
58289A660778K3086K4741K3721K3441K5668K7761K8110K8722L0476L1315L0928
$$ 1660778 1683864 1708605 1732326 1755767 1781435 1809196 1837306 1866028 1896504 1927819 1958747
58278A958747L1965L4921L7168L8381M1350M6213M9707N1265N3910N7900N9932
$$ 1958747 1990712 2025633 2062801 2101182 2142532 2188745 2238452 2289717 2343627 2401527 2461459
58267B461459N9747O0994O4247O5988O5797O7417P1361P3654P3461P4468P7230
$$ 2461459 2521206 2582200 2646447 2712435 2778232 2845649 2917010 2990664 3064125 3138593 3215823
58256C215823P7978P6545P7322Q0664Q1832Q0414Q1897Q7721R2947R6120J01942
$$ 3215823 3293801 3370346 3447668 3528332 3610164 3690578 3772475 3860196 3953143 4049263 4151205
58245D151205J11308J18606J22134J27417J36682J45014J50501J58015J69096
$$ 4151205 4262513 4381119 4503253 4630670 4767352 4912366 5062867 5220882 5389978
58236E389978J78544J85090J94737K09345K22809K32930K45730K63605K80995
$$ 5389978 5568522 5753612 5948349 6157694 6380503 6613433 6859163 7122768 7403763
58227G403763K96441L16560L43144L69146L92635M21244M57450M93713N28175
$$ 7403763 7700204 8016764 8359908 8729054 9121689 9542933 10000383 10494096 11022271
58218A1022271N70046O23040O79142P35834Q02942Q84928R73911J068432J180914
$$ 11022271 11592317 12215357 12894499 13630333 14433275 15318203 16292114 17360546 18541460
58209A8541460J318012J473121J647694J859190K118358K421622K777242L215413
$$ 18541460 19859472 21332593 22980287 24839477 26957835 29379457 32156699 35372112
58201C5372112L762397M432873N260462O303771P605460R176690J1036675J3230982
$$ 35372112 39134509 43567382 48827844 55131615 62737075 71913765 82950440 96181422
58193I6181422J5799622J8779571K2256372K6335157L0986758L5906340M0427576
$$ 96181422 111981044 130760615 153016987 179352144 210338902 246245242 286672818
58186B86672818M3358890M2877593L7042370K5095090Q587864q968857k3927691
$$ 286672818 330031708 372909301 409951671 435046761 443634625 434665768 410738077
58179D10738077l4248735l9802806m1479504m0311571l7226589l3084108k8598640
$$ 410738077 376489342 336686536 295207032 254895461 217668872 184584764 155986124
58172A55986124k4231252k0230689j6735188j3794756j1367135r373618p755364
$$ 155986124 131754872 111524183 94788995 80994239 69627104 60253486 52498122
58165E2498122o460151n416733m560026l858672l292573k826909k430645k097795
$$ 52498122 46037971 40621238 36061212 32202540 28909967 26083058 23652413 21554618
58157B1554618j827888j604122j409259j244351j113180j004307r05032q17842
$$ 21554618 19726730 18122608 16713349 15468998 14355818 13351511 12446479 11628637
58149A1628637p47494o85817o23891n66167n18825m76260m31871l90647l58687
$$ 11628637 10881143 10195326 9571435 9005268 8486443 8010183 7578312 7187665 6828978
58140F828978l31081l01915k76139k60040k49296k37099k25357k17671k09722
$$ 6828978 6497897 6195982 5919843 5659803 5410507 5173408 4948051 4730380 4520658
58131D520658j96582j81941j70944j61175j49115j38103j31499j25266j15453
$$ 4520658 4324076 4142135 3971191 3810016 3660901 3522798 3391299 3266033 3150580
58122C150580j06105j01832r9257r3633q7397q4412q1884p5800o8761o5000o2755
$$ 3150580 3044475 2942643 2843386 2749753 2662356 2577944 2496060 2420260 2351499 2286499 2223744
58111B223744n8591n4267n2647n1595m8347m5241m5081m5371m3072m0383m0139
$$ 2223744 2165153 2110886 2058239 2006644 1958297 1913056 1867975 1822604 1779532 1739149 1699010
58100A699010m0038l7081l3264l1382k9657k5917k2758k3105k4799k4703k4040
$$ 1699010 1658972 1621891 1588627 1557245 1527588 1501671 1478913 1455808 1431009 1406306 1382266
58089A382266k4713k4679k2061j9566j9735k0137j8265j6883j9115k2400k2868
$$ 1382266 1357553 1332874 1310813 1291247 1271512 1251375 1233110 1216227 1197112 1174712 1151844
58078A151844k1802k2294k3173k1814j9671j9478k0006j8761j7046j7194j7669
$$ 1151844 1130042 1107748 1084575 1062761 1043090 1023612 1003606 984845 967799 950605 932936
58067I32936j5943j3489j3027j3419j2114j0098r663r821q584p326q228r824r671
$$ 932936 916993 903504 890477 877058 864944 854846 845183 835362 826778 819452 811224 801400 791729
58054G91729r062j0439j2427j2114j0276r632r822q655o704o194o756o433n524
$$ 791729 782667 772228 759801 747687 737411 727779 717957 709302 702598 696404 689648 683215 677691
58041F77691n580o057n672n487p005q775q502o976o471o930p050p303q473r128
$$ 677691 672111 666054 660382 654895 647890 639115 630613 623637 617166 610236 603186 595883 587410 578282
58027E78282q023p020q133r762r498q488r056j0076q900o237m835m735l905k391
$$ 578282 570259 563239 555106 545344 535846 527358 518302 508226 499326 493089 488254 483519 479614 477223
58013D77223j902k269j976j245j203j145O9J204O23m20J35J315J006O2P81K592
$$ 477223 475321 473052 471076 469831 468628 467483 467552 468756 469379 468959 469094 470409 471415 471477 472258 474850
57997D74850L221K864L321M077L274J625J334J864P47j924l702m045m636n820
$$ 474850 478071 480935 484256 488333 491607 493232 494566 496430 497177 495253 491551 487506 482870 477050
57983D77050o269o006o254o597n548l675k907l185k910k237k561l267k422m14
$$ 477050 470781 464775 458521 451924 446376 442701 439794 436609 433699 431462 428901 425634 423212 422798
57969D22798N15J04M8M78p9j384j658j108j835l939n050m150k835k304k057j938
$$ 422798 423313 423417 423465 423943 423864 422480 420822 419714 417879 413940 408890 404740 401905 399601 397544 395606
57953C95606k661l870m213l679l464l445k394o39J85N2N39J810K377K023K242
$$ 395606 392945 389075 384862 381183 377719 374274 371880 371241 371426 371478 372017 373827 376204 378227 380469
57938C80469L441M332M508N107O545P793Q282Q340P679N622K805N29j433m164
$$ 380469 383910 388242 392750 397857 404402 412195 420477 428817 436496 442118 444923 445452 444019 439855
57924D39855p115q773r413j0513j1768j1568j0275r938j0698j0482q623o772n885
$$ 439855 432740 423967 414554 404041 392273 380705 370430 360492 349794 339312 330689 323917 318032
57911C18032n084m051l639l620k545m78P89Q02J058K055K485K018K078L060L485
$$ 318032 312948 308897 305258 301638 299093 298615 299404 300206 301264 303319 305804 307822 309900 312960 316445
57896C16445K805K437L019L264K545K029K186J683L8j046m52N60P00O45J204J472
$$ 316445 319250 321687 324706 327970 330515 332544 334730 336413 336451 335405 334953 335513 336213 336858 338062 339534
57880C39534N46o22p70l30m31j042j401j315j009n14N8M80J029K173L490M149
$$ 339534 340080 339458 338688 338358 337927 336885 335484 334169 333160 332646 332704 333184 334213 336386 339876 344025
57864C44025M404N121N930N676M715M647N509N541M245L377M014M860M488L288
$$ 344025 348429 353550 359480 365156 369871 374518 380027 385568 389813 393190 397204 402064 406552 409840
57850D09840K169J084p5p46q64j339k439l272l421l604m077m082l604l813n007
$$ 409840 412009 413093 413018 412272 411408 410069 407630 404358 400937 397333 393256 389174 385570 381757 376750
57835C76750n853n464m519l564k112k47P58M61J12N94J254J660K549L907M213
$$ 376750 370897 365433 360914 357350 355238 354991 355749 356210 356322 356916 358170 359830 362379 366286 370499
57820C70499K869J542J613K160J954J696K457L452L227J898M67j049l089n058
$$ 370499 373368 374910 376523 378683 380637 382333 384790 388242 391469 393367 393834 392785 389696 384638
57806C84638n996o046n922n616m816l906l404l138k897l123l947m408l686k393
$$ 384638 378642 372596 366674 361058 356242 352336 348932 345794 342897 339774 335827 331419 327733 325340
57792C25340j629j516j547j581j658j555j290j268j335o66P96J883J941J833K377
$$ 325340 323711 322195 320648 319067 317409 315854 314564 313296 311961 311295 312091 313974 315915 317748 320125
57777C20125K987K843K291K019J840J317O98K54m33j549k332k258k080k735l960
$$ 320125 323112 325955 328246 330265 332105 333422 334120 334374 333941 332392 330060 327802 325722 322987 319027
57762C19027m865n170n077m622l922l347k903k158j202p11o90k80P74J697K217
$$ 319027 314162 308992 303915 299293 295371 292024 289121 286963 285761 285050 284360 284080 284854 286551 288768
57747B88768L055M339N052M844M819N555N969N187M103L776L808L521L389L892
$$ 288768 291823 296162 301214 306058 310877 316432 322401 327588 331691 335467 339275 342796 346185 350077
57733C50077M267L793L122K957K622J477M26M21O61m7j111j196n19k42l04K46
$$ 350077 354344 358137 361259 364216 366838 368315 368741 369162 369823 369776 368665 367469 366950 366708 366404 366650
57717C66650J255J593R85J28p12j725k503k457k139k644l823m396l805k753j942
$$ 366650 367905 369498 370483 370611 369899 368174 365671 363214 361075 358431 354608 350212 346407 343654 341712
57702C41712j340o71K77J773L731N398O121O114N786M877L078R35q03k213l650
$$ 341712 340372 339701 339978 341751 345482 350880 357001 363115 368901 373778 376856 377791 376988 374775 371125
57687C71125m685m672l891l162k667k017j166l62M47J416K436L625N579Q446J1431
$$ 371125 366440 361768 357877 354715 352048 350031 348865 348503 348950 350366 352802 356427 362006 370452 381883
57672C81883J3995J6808K0634K5127K9682L4617M0209M5050M6470M2280L1616
$$ 381883 395878 412686 433320 458447 488129 522746 562955 608005 654475 696755 728371
57661G28371J5085m684k3428l7609m6265m9989m9211m4574l8028l1879k7002k3015
$$ 728371 743456 738772 715344 677735 631470 581481 532270 487696 449668 417789 390787 367772
57649C67772j9549j6316j2782r053o414n611n416m276k585j799j970j884j201
$$ 367772 348223 331907 319125 310072 303658 298047 292631 288355 285770 283971 282001 280117 278916
57636B78916o90o01m83m56j078k011k270j752j182p21QO33K66r80k046k489k705
$$ 278916 278226 277625 277142 276686 275608 273597 271327 269575 268393 267672 267680 268313 268579 267599 265553 263064 260359
57619B60359k687j947p39n1j98n26n72m76k53K00N08K28k03m0M43L59k47n35l36
$$ 260359 257672 255725 254986 254935 254737 254211 253639 253163 252910 253110 253618 253846 253643 253603 254046 254405 254158 253623 253287
57600B53287k67m76n64o71j305k174k452k196k183k469k401j985j815j663p03
$$ 253287 253020 252544 251980 251309 250004 247830 245378 243182 240999 238530 236129 234144 232329 230666 229963
57585B29963P67J349N89m03o75m77k46N1K25k54j189j668j469j388j839k232k111
$$ 229963 230730 232079 232668 232265 231590 231113 230867 230918 231143 230889 229700 228032 226563 225175 223336 221104 218993
57568B18993j779j489j086p54r73j502j532j060q84j027n41O93J440J002K83K48
$$ 218993 217214 215725 214639 213885 212912 211410 209878 208818 207934 206907 206366 207059 208499 209501 209784 210032
57552B10032O15Q81J439K621L704L893L558L436L300K456J053n7m82m82j91N85
$$ 210032 210647 211528 212967 215588 219292 223185 226743 230179 233479 235935 236988 236931 236449 235967 235776 236361
57536B36361J760K670K596J403k70j515j977k047k106j909j147j96L47N43Q16
$$ 236361 238121 240791 243387 244790 244520 243005 241028 238981 236875 234966 233819 233623 233970 234513 235329
57521B35329J095J048R03J110J496J640J863K699L666L797L210K860K831K321
$$ 235329 236424 237472 238375 239485 240981 242621 244484 247183 250849 254646 257856 260716 263547 265868
57507B65868J381J062J545J679Q91J24K69R57J536K006K316J902P63j28k38k85
$$ 265868 267249 268311 269856 271535 272426 272550 272819 273776 275312 277318 279634 281536 282299 282171 281933 281648
57491B81648q96j471j259n57N6P05J522J748P11q44j444o56O74J618J962J974
$$ 281648 280752 279281 278022 277465 277521 278226 279748 281496 282207 281363 279919 279263 279937 281555 283517 285491
57475B85491J934J819J225o9j482k053j596q25k41K70P16Q17P64J161J852J944
$$ 285491 287425 289244 290469 290400 288918 286865 285269 284444 284203 284473 285189 286006 286770 287931 289783 291727
57459B91727J311J008J617K348K426K318K724L302L343K922K512K190J971K236
$$ 291727 293038 294046 295663 298011 300437 302755 305479 308781 312124 315046 317558 319748 321719 323955
57445C23955L056L678L494K856K335J897J482J599K437L206L254L110L487L974
$$ 323955 327011 330689 334183 337039 339374 341271 342753 344352 346789 349995 353249 356359 359846 363820
57431C63820L742K938K278J822J264J025J770L089L804L555L107L082L303L407
$$ 363820 367562 370500 372778 374600 375864 376889 378659 381748 385552 389107 392214 395296 398599 402006
57417D02006L358L172K864K701L069L954M939N642N868N605N104M749M479L770
$$ 402006 405364 408536 411400 414101 417170 421124 426063 431705 437573 443178 448282 453031 457510 461280
57403D61280K481J342J102J676K503L231L596L338K805L075M555O068O255N445
$$ 461280 463761 465103 466205 467881 470384 473615 477211 480549 483354 486429 490984 497052 503307 508752
57389E08752N112N711O248O033N762O399P772Q778Q701P913P349P487P898P850
$$ 508752 513864 519575 525823 531856 537618 544017 551789 560567 569268 577181 584530 592017 599915 607765
57375F07765P180O312N521M705L926L544L563L481L137L069L645M417M847N056
$$ 607765 614945 621257 626778 631483 635409 638953 642516 645997 649134 652203 655848 660265 665112 670168
57361F70168N334N516N454N634O558P873Q894R601J0464J1457J2049J1965J1492
$$ 670168 675502 681018 686472 692106 698664 706537 715431 725032 735496 746953 759002 770967 782459
57348G82459J1103J1173J1810J2566J2657J1908J1126J1097J1639J2141J2560
$$ 782459 793562 804735 816545 829111 841768 853676 864802 875899 887538 899679 912239
57337I12239J3177J3741J3618J2772J1933J1785J2335J3057J3361J3065J2616
$$ 912239 925416 939157 952775 965547 977480 989265 1001600 1014657 1028018 1041083 1053699
57326A053699J2624J3104J3537J3744J4092J4694J5119J5126J4986J4743J4044
$$ 1053699 1066323 1079427 1092964 1106708 1120800 1135494 1150613 1165739 1180725 1195468 1209512
57315A209512J3120J2984J4001J5181J5653J5866J6509J7114J6925J6388J6534
$$ 1209512 1222632 1235616 1249617 1264798 1280451 1296317 1312826 1329940 1346865 1363253 1379787
57304A379787J7386J8152J8616J9139J9593J9513J9174J9403K0299K1133K1483
$$ 1379787 1397173 1415325 1433941 1453080 1472673 1492186 1511360 1530763 1551062 1572195 1593678
57293A593678K1603K1751K1968K2505K3625K5017K6128K6925K7637K8060K7918
$$ 1593678 1615281 1637032 1659000 1681505 1705130 1730147 1756275 1783200 1810837 1838897 1866815
57282A866815K7669K8023K8822K9323K9467K9961L1161L2708L4199L5406L6020
$$ 1866815 1894484 1922507 1951329 1980652 2010119 2040080 2071241 2103949 2138148 2173554 2209574
57271B209574L6004L6045L6811L7851L8163L7688L7326L7561L8019L8366L8605
$$ 2209574 2245578 2281623 2318434 2356285 2394448 2432136 2469462 2507023 2545042 2583408 2622013
57260B622013L8550L7946L7244L7343L8376L9612M0541M1313M2088M2782M3427
$$ 2622013 2660563 2698509 2735753 2773096 2811472 2851084 2891625 2932938 2975026 3017808 3061235
57249C061235M4014M4138M3672M3543M4690M6513M7523M7522M7717M8611M9193
$$ 3061235 3105249 3149387 3193059 3236602 3281292 3327805 3375328 3422850 3470567 3519178 3568371
57238C568371M8676M7625M6814M6182M5536M5289M5781M6684M7654M8814N0113
$$ 3568371 3617047 3664672 3711486 3757668 3803204 3848493 3894274 3940958 3988612 4037426 4087539
57227D087539N1083N1760N2950N5036N7310N9063O0520O2047O3213O3421O2862
$$ 4087539 4138622 4190382 4243332 4298368 4355678 4414741 4475261 4537308 4600521 4663942 4726804
57216D726804O2109O1168N9593N7162N4049N0644M7443M4667M1817L8288L4615
$$ 4726804 4788913 4850081 4909674 4966836 5020885 5071529 5118972 5163639 5205456 5243744 5278359
57205E278359L2300L2054L3046L4255L5618L7355L9163M0839M2828M5321M7585
$$ 5278359 5310659 5342713 5375759 5410014 5445632 5482987 5522150 5562989 5605817 5651138 5698723
57194E698723M9058N0355N2256N4259N5157N4683N3603N2510N1421N0343M9424
$$ 5698723 5747781 5798136 5850392 5904651 5959808 6014491 6068094 6120604 6172025 6222368 6271792
57183F271792M8530M7301M5471M2818L9171L4953L1148K8058K4737K0420J5918
$$ 6271792 6320322 6367623 6413094 6455912 6495083 6530036 6561184 6589242 6613979 6634399 6650317
57172F650317J2529J0012O855K430k237n895q224r387r484q771p779o774n623
$$ 6650317 6662846 6672858 6679713 6682143 6679906 6674011 6665787 6656400 6646916 6638145 6630366 6623592 6617969
57159F617969m299l078k090j153j16J130K897N351P907R573R923R119O985L057
$$ 6617969 6613670 6610592 6608502 6607349 6607233 6608363 6611260 6616611 6624518 6634091 6644014 6653133 6660118 6663175
57145F663175k195p088j0336j2460j4989j8680k2949k6709k9199l0152k9729k8433
$$ 6663175 6660980 6653892 6643556 6631096 6616107 6597427 6574478 6547769 6518570 6488418 6458689 6430256
57133F430256k6988k6233k6947k9438l3189l7339m1490m5676m9448n1631n1342
$$ 6430256 6403268 6377035 6350088 6320650 6287461 6250122 6208632 6162956 6113508 6061877 6010535
57122F010535m8806m4897m0307l5532l1196k7745k4942k2069j8415j3417o662
$$ 6010535 5961729 5916832 5876525 5840993 5809797 5782052 5757110 5735041 5716626 5703209 5696547
57111E696547J808J1583K2640L5732N1784P1356R5163J24530J60855K05167K58901
$$ 5696547 5698355 5709938 5732578 5768310 5820094 5891450 5986613 6111143 6271998 6477165 6736066
57100F736066L24535M04666N00996O14924P48169R01161J071020J252448J440567
$$ 6736066 7060601 7465267 7966263 8581187 9329356 10230517 11301537 12553985 13994552
57091A3994552J631924J823575K012761K196583K369340K520423K637488K710866
$$ 13994552 15626476 17450051 19462812 21659395 24028735 26549158 29186646 31897512
57083C1897512K729733K671977K503004K190907J725088J123002M27020k99618
$$ 31897512 34627245 37299222 39802226 41993133 43718221 44841223 45268243 44968625
57075D4968625r81643j554044j987402k292502k498895k630017k696180k701754
$$ 44968625 43986982 42432938 40445536 38153034 35654139 33024122 30327942 27626188
57067B7626188k651119k549468k404055k226190k029430j825369j622495j428036
$$ 27626188 24975069 22425601 20021546 17795356 15765926 13940557 12318062 10890026
57059A0890026j248007j085404r40492q13134p03285o09518n29103m59954m01067
$$ 10890026 9642019 8556615 7616123 6802989 6099704 5490186 4961083 4501129 4100062
57050D100062l51135l08264k71274k39879k13411j90556j70475j52992j37563
$$ 4100062 3748927 3440663 3169389 2929510 2716099 2525543 2355068 2202076 2064513
57041B064513j23243j09821r7868q7541p8326o9976o2635n5951m9094m1790l4352
$$ 2064513 1941270 1831449 1733581 1646040 1567714 1497738 1435103 1379152 1330058 1288268 1253916
57030A253916k6693j8285r259o28O561J1469J3010J0202K920q416k3274l9894
$$ 1253916 1227223 1208938 1199679 1199051 1205612 1217081 1230091 1240293 1243213 1234797 1211523 1171629
57018A171629n4335o2655o4352o2181n8471n3295m6455l9255l3196k8356k4100
$$ 1171629 1117294 1054639 990287 928106 869635 816340 769885 730630 697434 669078 644978
57007F44978k0408j7520j5166j3081j1560j0853j0517j0041r517r229r185r385
$$ 644978 624570 607050 591884 578803 567243 556390 545873 535832 526315 517086 507901 498516
56995D98516r921j0419j0165r081p872o872n568l574j213J217L867O555Q408Q786
$$ 498516 488595 478176 468011 458930 451058 444186 438618 435044 433831 435048 438915 445470 453878 462664
56981D62664P775N400J289m272r781j3669j5500j5674j4687j3149j1715j0377
$$ 462664 470439 475839 477128 472856 463075 449406 433906 418232 403545 390396 378681 368304
56969C68304q445n687k781l40J801L896N718P147Q599J0480J2850J5813J9245
$$ 368304 359859 354172 351391 351051 352852 356748 362466 369613 378212 388692 401542 417355 436600
56956D36600K1763K1189J6633R321R50p592j5355k0695k2702k2279k0791j8466
$$ 436600 458363 479552 496185 505506 506456 498864 483509 462814 440112 417833 397042 378576
56944C78576j5123j1491q500n954l107l1K742N471Q926J3096J7301K1327K5426
$$ 378576 363453 351962 343462 337508 334401 334370 337112 342583 351509 364605 381906 403233 428659
56931D28659K9237L1464L0661K5794J6559M011r222k0210k7388l0823l1379l0165
$$ 428659 457896 489360 520021 545815 562374 566385 557163 536953 509565 478742 447363 417198
56919D17198k8303k6382k4190k1411j8288j5264j2407r760p717o508n712m867
$$ 417198 388895 362513 338323 316912 298624 283360 270953 261193 253476 246968 241256 236389
56907B36389m160l944l974l707k984k013j001k43rN0P58K228L525M041M477N748
$$ 236389 232229 228285 224311 220604 217620 215607 214606 214363 214354 214404 215162 217390 220915 224956 229433 235181
56891B35181P685R592J1486J3832J6524J8911K0524K0982J9606J5815R808K476
$$ 235181 242866 252458 263944 277776 294300 313211 333735 354717 374323 390138 399946 402422
56879D02422m916j0744j3608j3567j2177j0700q959o393l288j70L076O570R770
$$ 402422 397506 386762 373154 359587 347410 336710 327751 321358 318070 317900 320976 327546 337316
56866C37316J2389J5225J9080K3608K8193L3055L8303M2502M3345L9395L0371
$$ 337316 349705 364930 384010 407618 435811 468866 507169 549671 593016 632411 662782
56855F62782J6746L76j5268k7069l4306l7803l7764l3909k7181j9763j3269p913
$$ 662782 679528 679904 664636 637567 603261 565458 527694 493785 466604 446841 433572 425659
56843D25659l092K138Q694J6455K4060L0747L7679M6222N5712O4241P0626P3595
$$ 425659 422567 424705 433399 449854 473914 504661 542340 588562 644274 708515 779141 852736
56831H52736O9909N5980L1953K618k5928m9230o4703p1527p1213o6732o0168n2020
$$ 852736 922645 978625 1010578 1013196 987268 938038 873335 801808 730595 663863 603695 551675
56819E51675m2792l3773k5787j8481j1312m188L112J0959J9110K6968L4752M2976
$$ 551675 508883 475110 449323 430842 419530 415342 418454 429413 448523 475491 510243 553219
56807E53219N0537N4561N2545M3660K8124P126j6025l6329m9941n6198n6660n3241
$$ 553219 603756 658317 710862 754522 782646 789772 773747 737418 687477 631279 574619 521378
56795E21378m7583m0970l4019k6972k0409j4864r799m208J696O696J0611J4611
$$ 521378 473795 432825 398806 371834 351425 336561 326762 322554 324250 330946 341557 356168
56783C56168J9192K3385K6461K8648K9351K6319J8007N767p320j8829k7467l2431
$$ 356168 375360 398745 425206 453854 483205 509524 527531 533298 525978 507149 479682 447251
56771D47251l3781l2821l0921k8310k4797k0967j7748j5261j3033j0998r486q499
$$ 447251 413470 380649 349728 321418 296621 275654 257906 242645 229612 218614 209128 200629
56759B00629p650o655n469m228l281k935k906k566j913j623j903k050j547q30
$$ 200629 192979 186324 180855 176627 173346 170411 167505 164939 163026 161403 159500 157450 155903 155073
56745A55073n01m88m02j61J38M08L42k95r92q97j72R2l65l78Q18K196K278J124
$$ 155073 154572 154084 153682 153521 153659 154067 154409 154114 153122 152225 152053 152145 151780 151402 152220 154416 156694 157818
56727A57818L1j81K18O27P38N79M42N80P89O75M05N32J005J129P50O27J141J589
$$ 157818 157849 157668 157886 158513 159251 159830 160272 160852 161641 162316 162721 163253 164258 165387 166137 166764 167905 169494
56709A69494J238L81k40l80r1P09J872K748K843K344J673J019N09L01K49Q9O0
$$ 169494 170732 171113 170873 170493 170402 171111 172983 175731 178574 180918 182591 183610 184119 184420 184669 184758 184818
56692A84818O32J517J860J510J104Q32K49m48k82Q35J649J369P21N30N06K20N0
$$ 184818 185450 186967 188827 190337 191441 192273 192522 192074 191792 192627 194276 195645 196366 196896 197402 197622 197672
56675A97672K17K8q71j574j242m25rQ0J70j57j108j768j425r60j488k433k410
$$ 197672 197889 197917 197046 195472 194230 193805 193796 193876 194046 193889 192781 191013 189588 188628 187140 184707 182297
56658A82297j451p54o76m98RK55J04J53O08R06O25l5p17j096p90K33J251J499
$$ 182297 180846 180092 179416 178918 178927 179182 179286 179439 180047 180953 181578 181543 180826 179730 178940 179173 180424 181923
56640A81923J087O24L08Q1K07Q30J265P22m82j333j529j560j613j347p43k59p7
$$ 181923 183010 183634 183942 184023 184230 185060 186325 187047 186565 185232 183703 182143 180530 179183 178440 178181 178104
56623A78104P7K68K15m7p4K53M19n4r62j621j568j058q83j493k311k278j094M64
$$ 178104 178181 178449 178664 178617 178543 178796 179215 179161 178199 176578 175010 173952 173069 171576 169265 166987 165893 166357
56605A66357J516J814J443O24p0j00J78j64j093j428n62O19J133J176J306J398
$$ 166357 167873 169687 171130 171754 171684 171584 171762 171598 170505 169077 168515 169134 170267 171443 172749 174147
56589A74147J250J227J436J147L1r12p36L5L88L58N08O79N53O75J574K542K625
$$ 174147 175397 176624 178060 179207 179238 178326 177590 177625 178013 178371 178879 179558 180111 180786 182360 184902 187527
56572A87527K273K556L265L307K615K196K492L095L950N409P160Q484R584J1360
$$ 187527 189800 192356 195621 198928 201543 203739 206231 209326 213276 218685 225845 234329 243913 255273
56558B55273J3693J5227J4971J3030R731N277N93k765m069m038l672l258k796
$$ 255273 268966 284193 299164 312194 321925 327202 327795 325030 320961 316923 313251 309993 307197
56545C07197k547k692k934k948k825k902l356m036m487m293l623l188l429m001
$$ 307197 304650 301958 299024 296076 293251 290349 286993 282957 278470 274177 270554 267366 263937 259936
56531B59936m329m259l920l478l301l724m308m134l171k426k224j595j23Q21J1
$$ 259936 255607 251348 247428 243950 240649 236925 232617 228483 225312 222886 220662 219067 218944 219765 219776
56516B19776j602k169j487q21q25j122j444j766j675r25k90n66j225j280j011
$$ 219776 218174 216005 214518 213697 212872 211750 210306 208540 206865 205940 205650 205084 203859 202579 201568
56501B01568j361k066j982r91p3L67P73J165J050O38O93J237J620J807K243K569
$$ 201568 200207 198141 196159 195168 195095 195462 196235 197400 198450 199088 199781 201018 202638 204445 206688 209257
56485B09257J950O60p5J09M54N52O96P10j2j073j223l02L47j71j167j577j231
$$ 209257 211207 211867 211792 211901 212355 212907 213603 214313 214301 213228 212005 211703 212050 211879 210712 209135 207904
56468B07904n17K34O17L25k21k48K76O57O31N93P19P76P54Q56R42Q26Q60J293
$$ 207904 207387 207621 208238 208563 208342 208094 208370 209027 209658 210251 210970 211746 212500 213356 214298 215124 215984 217277
56450B17277J543J067N50Q87J568J458Q04Q08J514J788J253O63L41j12o16o86
$$ 217277 218820 219887 220437 221324 222892 224350 225154 225962 227476 229264 230517 231180 231521 231409 230793 230107
56434B30107o46j215j981j988j625j982k549j699L74J520R01J05L77Q49N41N0
$$ 230107 229461 228246 226265 224277 222652 220670 218121 216422 216796 218316 219217 219322 219699 220548 221089 221139
56418B21139J62M64M62O56J371J909J772J474J345Q07k92j010q37o00r54j201
$$ 221139 221301 221765 222227 222883 224254 226163 227935 229409 230754 231561 231269 230259 229422 228822 227868 226667
56402B26667o00L64Q85J015J024O62r3m87pQ63J477J840K025J744R71K03l00o26
$$ 226667 226067 226431 227316 228331 229355 230017 229924 229437 229430 230293 231770 233610 235635 237379 238350 238553 238253 237627
56384B37627n37K96J276J377P23L47L37j08p57l73R74J614R07K22N50J036Q27
$$ 237627 237090 237386 238662 240039 240762 241109 241446 241338 240581 240208 241182 242796 243703 243925 244475 245511 246338
56367B46338N61R53J505J731K115K832L014K262J414R28Q1j275j853r35L39Q57
$$ 246338 246899 247852 249357 251088 253203 256035 259049 261311 262725 263653 263734 262459 260606 259671 260010 260867
56351B60867J072J546J590P52P8M62J151J219J079J240J056K43J31J679L558L935
$$ 260867 261939 263485 265075 265827 265905 266367 267518 268737 269816 271056 272112 272355 272486 274165 277723 281658
56335B81658L115K663K968L342L652M175M493M066L341L038K945K568K177K122
$$ 281658 284773 287436 290404 293746 297398 301573 306066 310132 313473 316511 319456 322024 324201 326323
56321C26323J915J152M44L87M61P0l38k53j43l89k61P93J896K055J724J811K168
$$ 326323 328238 329390 329834 330221 330682 330752 330414 330161 330018 329629 329368 330161 332057 334112 335836 337647 339815
56304C39815K294K566L492M682N738P088Q717R270P788N364L668K841K152J674
$$ 339815 342109 344675 348167 352849 358587 365675 374392 383662 391450 396814 400482 403323 405475 407149
56290D07149J885K509L143M145N701O947P271P462Q299R129R200R151R802J0509
$$ 407149 409034 411543 414686 418831 424532 431479 438750 446212 454511 463640 472840 481991 491793 502302
56276E02302J0320R669R484R628R663J0087J1346J2676J3406J4256J5960J7805
$$ 502302 512622 522291 531775 541403 551066 561153 572499 585175 598581 612837 628797 646602
56264F46602J9126K0903K4111K7810L0691L3372L7174M1762M6044N0574N6849
$$ 646602 665728 686631 710742 738552 769243 802615 839789 881551 927595 978169 1035018
56253A035018O4882P3378Q1768R0381R9225J08187J17703J27668J36499J42814
$$ 1035018 1099900 1173278 1255046 1345427 1444652 1552839 1670542 1798210 1934709 2077523
56243B077523J47051J49917J50374J46978J39989J30223J16936R8985P7245N3785
$$ 2077523 2224574 2374491 2524865 2671843 2811832 2942055 3058991 3157976 3235221 3289006
56233C289006K9453M242k0743m3778o4251q2174r6802j07626j15765j22420j26906
$$ 3289006 3318459 3322701 3301958 3258180 3193929 3111755 3014953 2907327 2791562 2669142 2542236
56222B542236j28105j26803j24520j21091j15717j09328j03476r7826r1202q4261
$$ 2542236 2414131 2287328 2162808 2041717 1926000 1816672 1713196 1615370 1524168 1439907
56212A439907p8569p3847o8695o3413n9385n6216n2105m6785m1676l7420l3609
$$ 1439907 1361338 1287491 1218796 1155383 1095998 1039782 987677 940892 899216 861796 828187
56201H28187l0463k8415k6452k3269j9657j7343j6013j4012j1462r973r611q911
$$ 828187 797724 769309 742857 719588 699931 682588 666575 652563 641101 631128 621517 612606
56189F12606p690p170p309o670n025l655l025k478k109k599l237k610j085l27
$$ 612606 604916 597746 590437 583767 578742 575087 572062 569584 567475 564876 561639 559029 557944 557617
56175E57617m41l2J059J677J797K521L611L691K953L045M179M855M695N051O490
$$ 557617 557176 557144 558203 559880 561677 564198 567809 571500 574453 577498 581677 586532 591227 596278 602768
56160F02768P986Q959R857J0610J0597J0316J0931J2224J3037J3541J4842J6660
$$ 602768 610754 619713 629570 640180 650777 661093 672024 684248 697285 710826 725668 742328
56148G42328J7821J8805K1340K5621L0513L6181M3822N2911O1437O8939P6560
$$ 742328 760149 778954 800294 825915 856428 892609 936431 989342 1050779 1119718 1196278
56137A196278Q4026Q9162R0534Q8120Q1691P1284N9321M9411M2833L8426L5552
$$ 1196278 1280304 1369466 1460000 1548120 1629811 1701095 1760416 1809827 1852660 1891086 1926638
56126A926638L4274L2873K8401K0218J0421P73q332j6217k2198k7514l4237m2446
$$ 1926638 1960912 1993785 2022186 2042404 2052825 2053598 2045266 2029049 2006851 1979337 1945100 1902654
56114A902654n0918n9955p0393q0337q6364q7681q6000q1783p4207o4395n4896
$$ 1902654 1851736 1791781 1721388 1641051 1554687 1467006 1381006 1299223 1225016 1160621 1105725
56103A105725m6109l6786k7806k1517j7552j3342q779o167n472m006j167P70J146
$$ 1105725 1059616 1022830 995024 973507 955955 942613 933834 927667 922195 918189 917022 917792 918938
56090I18938J913L548M167L485L584N038O162O677Q070R935J0134R086R497J1412
$$ 918938 920851 924399 928566 932051 935635 940673 946835 953512 961582 971517 981651 990737 1000234 1011646
56076A011646J2053J1089J1277J3195J4233J3717J4116J6075J7144J6653J6909
$$ 1011646 1023699 1034788 1046065 1059260 1073493 1087210 1101326 1117401 1134545 1151198 1168107
56065A168107J8435J8844J7727J7609J8830J8589J6435J5463J6581J6896J5432
$$ 1168107 1186542 1205386 1223113 1240722 1259552 1278141 1294576 1310039 1326620 1343516 1358948
56054A358948J5008J6703J7832J7328J7676J9682K0685J9983K0422K2690K3702
$$ 1358948 1373956 1390659 1408491 1425819 1443495 1463177 1483862 1503845 1524267 1546957 1570659
56043A570659K2722K3144K6005K7785K7127K7592L1010L4265L5516L7495M1617
$$ 1570659 1593381 1616525 1642530 1670315 1697442 1725034 1756044 1790309 1825825 1863320 1904937
56032A904937M4889M5844M7457N1017N3229N2582N2385N4249N4940N3056N2292
$$ 1904937 1949826 1995670 2043127 2094144 2147373 2199955 2252340 2306589 2361529 2414585 2466877
56021B466877N4652N7028N8023O1167O7565P2506P3521P4687P8740Q2184Q2756
$$ 2466877 2521529 2578557 2636580 2697747 2765312 2837818 2911339 2986026 3064766 3146950 3229706
56010C229706Q4322Q9501R4717R7435J01014J07406J12650J14773J18444J26508
$$ 3229706 3314028 3403529 3498246 3595681 3696695 3804101 3916751 4031524 4149968 4276476
56000D276476J34660J39884J46154J56183J65822J72472J80552J92786K04654
$$ 4276476 4411136 4551020 4697174 4853357 5019179 5191651 5372203 5564989 5769643
55991E769643K13572K24497K40393K56593K70847K88736L12623L36080L56283
$$ 5769643 5983215 6207712 6448105 6704698 6975545 7264281 7576904 7912984 8269267
55982H269267L80480M12604M45712M75833N10587N55156O03213O51389P08559
$$ 8269267 8649747 9062351 9508063 9983896 10494483 11049639 11652852 12304241 13012800
55973A3012800P80280Q58929R40739J037039J156417J292412J442533J622041
$$ 13012800 13793080 14652009 15592748 16629787 17786204 19078616 20521149 22143190
55965B2143190J844561K108085K416717K797152L277154L870167M600183N516878
$$ 22143190 23987751 26095836 28512553 31309705 34586859 38457026 43057209 48574087
55957D8574087O663251Q052488R698404J1639479J3912463J6546071J9612974
$$ 48574087 55237338 63289826 72988230 84627709 98540172 115086243 134699217
55950A34699217K3230103K7432938L2033106L6529737L9947214M0643353L6598513
$$ 134699217 157929320 185362258 217395364 253925101 293872315 334515668 371114181
55943C71114181K6548152J1292770o136551k1900620l3236467l9319543m0818271
$$ 371114181 397662333 408955103 402818552 380917932 347681465 308361922 267543651
55936B67543651l9008541l5209320l0553175k5847864k1526390j7754263j4577759
$$ 267543651 228535110 193325790 162772615 136924751 115398361 97644098 83066339
55929H3066339j1976755r868373q152962o763406n651398m756034m019357l413124
$$ 83066339 71089584 61221211 53068249 46304843 40653445 35897411 31878054 28464930
55921B8464930k922384k519240k175547j884269j645584j445785j269022j115794
$$ 28464930 25542546 23023306 20847759 18963490 17317906 15872121 14603099 13487305
55913A3487305r91144q86768p91594p08062o41907n86669n33331m84986m47628
$$ 13487305 12496161 11609393 10817799 10109737 9467830 8881161 8347830 7862844 7415216
55904G415216m16011l82402l50294l26243l06416k83771k60897k43653k29268
$$ 7415216 6999205 6616803 6266509 5940266 5633850 5350079 5089182 4845529 4616261
55895D616261k12217j95199j83303j73522j60538j46925j37684j30346j20143
$$ 4616261 4404044 4208845 4025542 3852020 3691482 3544557 3406873 3276527 3156384
55886C156384j09426j02587r6931q7848p8163p3441p2502p1086p0336p3166p6415
$$ 3156384 3046958 2944371 2847440 2759592 2681429 2607988 2535486 2464400 2394064 2320898 2244483
55875B244483p5054p0698o8152o6987o3886n9940n8246n7332n3964m9566m7331
$$ 2244483 2169429 2098731 2030579 1963592 1899706 1839766 1781520 1724188 1670224 1620658 1573327
55864A573327m5821m1894l7007l4448l3058k9728k5467k3241k2368k0594j9138
$$ 1573327 1527506 1485612 1448605 1414157 1381099 1351371 1325904 1302663 1280295 1259701 1240563
55853A240563k0269k2390k2692k2178k3171k4542k4278k3958k5772k7834k7274
$$ 1240563 1220294 1197904 1175212 1153034 1129863 1105321 1081043 1057085 1031313 1003479 976205
55842I76205k5201k4040k2891k0231j8056j8426j8907j6547j3382j2883j3785
$$ 976205 951004 926964 904073 883842 865786 847360 828453 811906 798524 785641 771856
55831G71856j2779j0672j0412j1338j0762r211q936r152p847o402p375r489r671
$$ 771856 759077 748405 737993 726655 715893 706682 697746 688594 680747 674345 666970 657481 647810
55818F47810q378q151q633p865o773p430q427o848l585j862j735p01J331K330
$$ 647810 639432 631281 622648 614783 608010 600580 592153 585305 581720 579858 578123 577422 578753 581083
55804E81083K408L338M711M844M568N853P604O938L862O78k245o044r740j1272
$$ 581083 583491 586829 591540 596384 600952 606805 614409 621347 625209 625887 623642 617598 607858 596586
55790E96586j1338j2246j3624j3219j1160r474q187n968l947m808q381j1840j3839
$$ 596586 585248 573002 559378 546159 534999 525525 517338 511370 507423 502615 494234 482394 468555
55777D68555j4965j4804j2385r030p090o193m275j632l86n20k46K13r08l057l790
$$ 468555 453590 438786 426401 417371 410281 404088 399813 398181 397795 397275 397029 397242 396334 393277 389487
55762C89487k931k617l285l219k127j573j768j271p5K49m62q89j174k739n151
$$ 389487 386556 383939 380654 377435 375308 373735 371967 370696 370621 370870 370408 369519 368345 365606 360455
55747C60455o352o097o148o965p222o648o386o481n840m731m517m948m518l411
$$ 360455 354103 348006 341858 334893 327671 321023 314637 308156 302316 297585 293068 288120 283602 280191
55733B80191l217l827l558k277j523j597j429j160k001l562m246m145m551m975
$$ 280191 276974 273147 269589 267312 265789 264192 262763 261603 259602 256040 251794 247649 243098 238123
55719B38123l787j658r85j871k089j084n76r22m57R46J203k76j439j045k55N7
$$ 238123 234336 232678 231693 229822 227733 226649 226073 225151 224694 225640 226843 226567 225128 224083 223828 223885
55703B23885N79J253O86j111k218j983j991k916l215k080r56q35o31N12J574J651
$$ 223885 224464 225717 226403 225292 223074 221091 219100 216184 212969 210889 209933 209098 208467 208979 210553 212204
55687B12204J417J455J104R1n92l97L4M82J519K670K457R50L6L40K32j144k300
$$ 212204 213621 215076 216180 216271 215679 215282 215316 215798 217317 219987 222444 223394 223430 223770 224002 222858 220558
55670B20558k002j250j292j661j509j117p74K02K194M379O056P452Q535Q611P712
$$ 220558 218556 217306 216014 214353 212844 211727 210953 211155 213349 217728 223784 231236 239771 248382 256094
55655B56094O824O080M473J942o9q04j187j918k440k551l171m661o034o633o962
$$ 256094 262918 268998 273471 275413 275344 274540 273353 271435 268995 266444 263273 258612 252578 245945 238983
55640B38983p208o775n802n381n592n255m230l858m433m451l272k306k384k221
$$ 238983 231775 225000 219198 213817 208225 202970 198740 194882 190449 185998 182726 180420 178036 175815
55626A75815q64L98K10o05o14p3m8m90p31q13j035j080p28n28q84j414j814k283
$$ 175815 174951 175349 175559 174954 174340 174267 174219 173729 172998 172185 171150 170070 169342 168814 167930 166516 164702 162419
55608A62419k627k301j712j920k631k324r12k46j074j723r69j19p02j949k263
$$ 162419 159792 157491 155779 153859 151228 148904 147992 147746 146672 144949 143980 143861 143159 141210 138947
55593A38947j651j034m47M37J112J120J063J490J810J594J688K705L619L351K693
$$ 138947 137296 136262 135815 136252 137364 138484 139547 141037 142847 144441 146129 148834 152453 155804 158497
55578A58497L082M355N203N228N164N601O605Q161R983J1382J2037J2192J1655
$$ 158497 161579 165934 171137 176365 181529 187130 193735 201896 211879 223261 235298 247490 259145
55565B59145R595O000K180r48l858o910r289j0379j0905j1429j1019q865o164
$$ 259145 268740 274740 276920 275972 272114 265204 255915 245536 234631 223202 212183 203318 197154
55552A97154m913n485o595p013o275m456k348j153j164j383j093p75p74l91O63
$$ 197154 192241 186756 180161 173148 166873 162417 160069 158916 157752 156369 155276 154501 153727 153336 153999
55537A53999J217L77q22r00j17K05k27p03r51j222j457j478j564j874j929j519
$$ 153999 155216 155593 154771 153871 153754 153959 153732 153029 152078 150856 149399 147921 146357 144483 142554 141035
55521A41035j375j966k518k256j739j850k269k190j814j846k167k148j798j460
$$ 141035 139660 137694 135176 132920 131181 129331 127062 124872 123058 121212 119045 116897 115099 113639
55507A13639r94k51K33J21N1N24P15l06j867k531k088j401p71J59J209J706J587
$$ 113639 112645 112394 112627 112748 112799 113323 114038 113732 111865 109334 107246 105845 105074 105233 106442 108148 109735
55490A09735J387J183O16j68n07j68M14P67O79J59m24n22j31J49J42M20J153J555
$$ 109735 111122 112305 112921 112753 112246 112078 112492 113259 113938 114097 113673 113151 113020 113169 113311 113731 114884 116439
55472A16439J114M98L67K64m42j332j700j729j858j732q86R5K45m04j038j191
$$ 116439 117553 118051 118418 118682 118240 116908 115208 113479 111621 109889 109003 109098 109343 108939 107901 106710
55456A06710r11l83m1m13j130r76L06J280Q05l09p39n93o70p45j66O72Q81N48
$$ 106710 105799 105416 105375 104962 103832 102856 103162 104442 105247 104938 104199 103606 102936 102191 102025 102697 103578 104126
55438A04126K70l8n48n22N80J760J855J480J869K451J670j93j137l97O54P59J42
$$ 104126 104396 104358 103810 103288 103868 105628 107483 108963 110832 113283 114953 114760 113623 113226 113880 114639 114781
55421A14781o35j461j885j146M63J534J404R56J110J664K040K139J939J211L3
$$ 114781 114146 112685 110800 109654 110117 111651 113055 114011 115121 116785 118825 120964 122903 124114 124147
55406A24147j104k007k819l232k598j057L22Q29P09L28k99q92p67J69J040J088
$$ 124147 123043 121036 118217 114985 112387 111330 111652 112481 113190 113518 113219 112327 111560 111729 112769 113857
55390A13857N41M2j95k53p5L98R42J180Q86Q7q98j565j677j527j516j565j321
$$ 113857 114398 114440 114245 113992 113917 114315 115257 116437 117323 117410 116512 114947 113270 111743 110227 108662 107341
55373A07341p27m5M77O06J38o80j088o72N0L47J69j46n70j136j438j170p43o82
$$ 107341 106614 106569 107046 107652 107790 107110 106022 105350 105400 105747 105916 105770 105200 104064 102626 101456 100713 100031
55355A00031p67n27j69j43k09J35O45P19N50Q22J405J387M45p39j454j524r36
$$ 100031 99264 98737 98568 98425 98216 98351 98996 99715 100265 101087 102492 103879 104324 103585 102131 100607 99671
55338I9671J97J248J457R19L87J58j48n97o25J2O70O08p6o19m64K49Q84R54N90
$$ 99671 99868 101116 102573 103492 103879 104037 103889 103292 102667 102679 103349 103957 103881 103262 102798 103047 103931 104885 105475
55319A05475K34m4n46j213j534j358j136j010m91N54J408J603J607J741J414L20
$$ 105475 105709 105665 105119 103906 102372 101014 99878 98868 98377 98931 100339 101942 103549 105290 106704 107024
55303A07024n21j62O05L76p07j275q60k85r9N5M54Q34J004J050R06N12K57M19
$$ 107024 106503 106341 106946 107322 106615 105340 104480 104195 104096 104151 104605 105439 106443 107493 108399 108911 109168 109587
55285A09587M98k6o76o20k3L16L10M24N17M7p48j078q74p00n69r3L93J65m88n26
$$ 109587 110085 110059 109383 108763 108740 109056 109366 109790 110307 110354 109606 108528 107654 106954 106385 106292 106685 106850 106362 105836
55265A05836J31M29j24q25r94o54O6J077J682J019n69j666j501o10L16J118J573
$$ 105836 105967 106396 106272 105447 104453 103799 103865 104942 106624 107643 107074 105408 103907 103297 103613 104731 106304
55248A06304J319O44L47N27M78j3l42k48k56o59j064j199j257j199o85Q0L63j6
$$ 106304 107623 108267 108614 109141 109619 109606 109264 109016 108760 108101 107037 105838 104581 103382 102697 102777 103140 103124
55230A03124m91p08p69m94L78J249J133K11l42j64r5m52n06K0L27J5j30M26R94
$$ 103124 102633 101925 101156 100662 101040 102289 103422 103633 103291 103127 103032 102580 102074 102094 102421 102436 102306 102732 103726
55211A03726Q46L36O2o6k31j59J83K64k3m3L39K82n42j133o71K05N34M74N84O15
$$ 103726 104572 104908 104970 104904 104673 104514 104697 104961 104938 104895 105234 105516 104974 103841 103170 103375 103909 104383 104967 105582
55191A05582J15m89n68m69q20j266r89j38M45O29J026J663J754R63Ml41k00k58
$$ 105582 105697 105208 104640 104171 103351 102085 101096 100958 101403 102032 103058 104721 106475 107438 107442 107101 106901 106643
55173A06643p55j195r37J2R59J257R48N19K44J27J89L82L33j66n68k33M79N85
$$ 106643 105888 104693 103756 103768 104727 105984 106932 107451 107695 107822 108011 108393 108726 108560 107992 107759 108238 108823
55155A08823Lk73L02R67P47l32j528k229k186j466n17J62N32Q01P83J56o82r11
$$ 108823 108826 108553 108855 109822 110569 110237 108709 106480 104294 102828 102311 102473 103005 103806 104589 104745 104063 103152
55137A03152m25J37N07R39J229P81j31l85L63J097R94M29j5m23q61q61k34M49
$$ 103152 102727 102864 103371 104310 105539 106320 106189 105804 106167 107264 108258 108687 108672 108249 107388 106527 106293 106742
55119A06742Q13J151J522J373O90L71P65R24J77o84o87k13p8n7N03J287J455J001
$$ 106742 107555 108706 110228 111601 112291 112662 113427 114351 114528 113844 113157 112944 112866 112809 113312 114599 116054 117055
55101A17055N92M20K44J43L65O21M23j65p44j168j315q22K22R19P11L70R44K091
$$ 117055 117647 118067 118311 118454 118819 119440 119863 119698 118954 117786 116471 115649 115871 116790 117501 117871 118815 120906
55083A20906K510J728N38k56o44r67j296j406j038j89O41Q15L38j17j40K8J70
$$ 120906 123416 125144 125682 125426 124782 123815 122519 121113 120075 119886 120527 121342 121680 121563 121423 121451 121621
55066A21621M39O71L14m96o98J75J080Q51k09r81j095r39p21m20k49l11k28J50
$$ 121621 122060 122731 123045 122549 121851 122026 123106 123957 123748 122767 121672 120733 120012 119592 119343 119032 118804 118954
55048A18954K10m93j314j369p77k71q7q1l65r41j167n83K47O19Q10J346J729J126
$$ 118954 119164 118671 117357 115988 115211 114940 114853 114772 114407 113466 112299 111716 111963 112582 113392 114738 116467 117593
55030A17593q1p44o71o32q38p22j87J37mj67j47k03k61J01O91P12k1p00o46p2
$$ 117593 117512 116768 116097 115465 114627 113905 113718 113855 113851 113684 113537 113334 113073 113174 113865 114577 114556 113856 113210 113138
55010A13138N13R23J049P29K50L47J307K434K760K083J032L74L02L19k27j301
$$ 113138 113651 114574 115623 116352 116602 116949 118256 120690 123450 125533 126565 126939 127241 127560 127333 126032
54994A26032k130k052j219k45M48O38J76o69j127p17J76Q66J142J054N80kk0O09
$$ 126032 123902 121850 120631 120386 120834 121472 121648 120979 119852 119135 119311 120177 121319 122373 122953 122951 122931 123540
54976A23540Q47j12j497j906j117q6N70R45J061Q10N55P20Q59K60o16n26N99J298
$$ 123540 124387 124275 122778 120872 119755 119669 120239 121184 122245 123055 123610 124330 125189 125449 124833 124307 124906 126204
54958A26204O48m71p50j60M25O21P12P99N87o2q47j388j547j337p29K21J098J277
$$ 126204 126852 126381 125631 125471 125896 126517 127229 128028 128615 128553 127706 126318 124771 123434 122705 122926 124024 125301
54940A25301O47pJ32P44O78m04j450j433n44M56J325K076K314J819J322J752K984
$$ 125301 125948 125941 126073 126817 127495 127091 125641 124208 123664 124120 125445 127521 129835 131654 132976 134728 137712
54923A37712M090M607M730M596M198L871L902L825K852J022p84j917k400k549
$$ 137712 141802 146409 151139 155735 159933 163804 167706 171531 174383 175405 174621 172704 170304 167755
54909A67755k749l430m575n413n246m301l198j988n49N36N73o5l79k06k22n84
$$ 167755 165006 161576 157001 151588 146342 142041 138843 136855 136306 136842 137415 137350 136971 136765 136543 135959
54893A35959p18m42k20j32L27J210J781J573J017P79J049J678K374K714K539K393
$$ 135959 135241 134799 134579 134447 134774 135984 137765 139338 140355 141134 142183 143861 146235 148949 151488 153881
54877A53881K962M127N174N713N722M904K965M56j645l161m613n917o298n573
$$ 153881 156843 160970 166144 171857 177579 182483 185448 185904 184259 181098 176485 170568 164270 158697
54863A58697m563l923l469k912k337j789j130n46m08n37m24k19o32j681k503k597
$$ 158697 154134 150211 146742 143830 141493 139704 138574 138028 137620 137083 136659 136440 135808 134127 131624 129027
54847A29027k309j923j252l89J10J46K39N06L71l23r20j037j037j070o49K38O35
$$ 129027 126718 124795 123543 123154 123264 123410 123649 124155 124526 124203 123283 122246 121209 120139 119490 119728 120363
54830A20363j1q78r12k63K36L10K76K90L51N67Q60Q18L55M2K63N66L79n5q7L80
$$ 120363 120352 119474 118562 118299 118535 118845 119121 119411 119762 120329 121189 122007 122362 122404 122667 123233 123612 123557 123470 123850
54810A23850R17J277J465J364Q39Q6m85o66n25k41RJ79M38Q52J044N97k30p36
$$ 123850 124767 126044 127509 128873 129712 129798 129313 128647 128122 127881 127890 128069 128507 129359 130403 131000 130770 130034
54792A30034p30o48o53m16N9J39m97j228j217l55P85J564J618J080N66N46P03
$$ 130034 129304 128656 128003 127587 127646 127785 127288 126060 124843 124488 125273 126837 128455 129535 130101 130647 131350
54775A31350M85J95P73K358L982M804M876M470L673K936L091M207N286N511N087
$$ 131350 131835 132030 132803 135161 139143 143947 148823 153293 156966 159902 162993 167200 172486 177997 183084
54760A83084M443L466K050N50r01k672m686n979o003n486n297n141m292k951j982
$$ 183084 187527 190993 193043 193593 192692 190020 185334 179355 173352 167866 162569 157428 153136 150185 148203
54745A48203j693j775j999k184j865q49K31N65J93k48m40l90L7Q69J592J677J355
$$ 148203 146510 144735 142736 140552 138687 137838 138069 138634 138827 138579 138139 137749 137786 138655 140247 141924 143279
54728A43279J230J403J618J960K663L469L882L942M064M154L592K118K66j201
$$ 143279 144509 145912 147530 149490 152153 155622 159504 163446 167510 171664 175256 177374 177640 176439
54714A76439j935k144k370l032l898m296m052l799l998m120l419k133j173q31
$$ 176439 174504 172360 169990 166958 163060 158764 154712 150913 146915 142795 139376 137243 136070 135239
54700A35239n75j01J80j26o86q88n89k37k69o61j023j068q63o07l01K24R44J556
$$ 135239 134664 134563 134743 134617 133931 133043 132454 132217 131948 131287 130264 129196 128333 127726 127425 127649 128593 130149
54682A30149J658R37n74k145k682j849o32j76l55k79J60K78J8J16O25N63m99j537
$$ 130149 131807 132744 132170 130025 127343 125494 124862 124686 124331 124052 124212 124490 124508 124624 125249 125812 125313 123776
54664A23776j533q26l51k82k75l40o21p77l51N25J339J807J896J611J147P35J77
$$ 123776 122243 121417 121066 120784 120509 120169 119548 118771 118420 118945 120284 122091 123987 125598 126745 127480 127657
54647A27657q38j781j598k84Q58J019Q62J062J136O20K24N85R00J19j194j613
$$ 127657 126819 125038 123440 123156 124014 125033 125895 126957 128093 128713 128937 129522 130422 130541 129347 127734
54631A27734r08j2O30J254J657J278L22l87o50q71r36k88R11J735J698J124L60
$$ 127734 126826 126814 127444 128698 130355 131633 131955 131568 130918 130047 129111 128823 129734 131469 133167 134291 134651
54614A34651m34q33m50K52L70j59n75m91k13P6M88P58M30k42m90k29j64n53q07
$$ 134651 134217 133384 132934 133186 133556 133397 132822 132331 132118 132194 132682 133440 133870 133628 133138 132909 132745 132192 131385
54595A31385n27m3K39L50L73K74K18M12N49J77m65p14n84o41q46n54K19O20L53
$$ 131385 130858 130815 131054 131404 131777 132051 132269 132681 133230 133407 132942 132228 131644 131003 130157 129603 129822 130442 130795
54576A30795J27L74N20P1m73m55q4L8k06m47l29L76J587K518K175O27q52j293
$$ 130795 130922 131296 131816 131887 131414 130959 130875 130913 130707 130260 129931 130307 131894 134412 136587 137214 136362 135069
54558A35069j034q23o82k87K44N90Q14J014Q54J07o56n98L20J379J969K051J877
$$ 135069 134035 133212 132530 132243 132487 133077 133891 134905 135759 135866 135210 134612 134932 136311 138280 140331 142208
54541A42208J755J852J887J267o8j285j562j118q04r17j043r54r72j338j749j783
$$ 142208 143963 145815 147702 148969 148901 147616 146054 144936 144132 143215 142172 141218 140246 138908 137159 135376
54525A35376j449j069q55p74o19j71O29J466J826J525R24M92L21K19J62K61L31
$$ 135376 133927 132858 132003 131229 130610 130439 131068 132534 134360 135885 136809 137301 137622 137841 138003 138264 138595
54508A38595o5r09j430r61J75J077J386J430J322O90m50j247r86o0N47M61J70
$$ 138595 138530 137621 136191 135230 135405 136482 137868 139298 140620 141310 140860 139613 138627 138567 139114 139575 139745
54491A39745K55P98J418J587J028L8p21r17p98o39l92p5Mj64oQ30J788K106J813
$$ 139745 140000 140798 142216 143803 144831 144869 144148 143231 142433 141794 141402 141327 141331 141167 141161 141991 143779 145885 147698
54472A47698J449J194R09P67J094J691J996J806J379R14M48J02m6j84m17n71p12
$$ 147698 149147 150341 151250 152017 153111 154802 156798 158604 159983 160897 161345 161447 161401 161217 160800 160229 159517
54455A59517j380k676l599l200j987j283j382j399p87K3N54Q80J085R50M82M3
$$ 159517 158137 155461 151862 148662 146675 145392 144010 142611 141824 141847 142401 143281 144366 145316 145798 145841
54439A45841k12m46o61o77n78n68m63n9K24r1n06j10Q67J236P29M38J074J916
$$ 145841 145629 145183 144522 143845 143267 142699 142236 142177 142401 142310 141804 141694 142561 143797 144526 144964 146038 147954
54421A47954K032J504Q32O2p80j224j071r02j149j250n06P36J531J612J494J494
$$ 147954 149986 151490 152322 152384 151604 150380 149309 148407 147258 146008 145502 146238 147769 149381 150875 152369
54405A52369J393J015O21N82R48J318J187M94k14m37l99o10q90n54M40J269J392
$$ 152369 153762 154777 155398 155980 156928 158246 159433 159927 159713 159276 158877 158267 157377 156823 157263 158532 159924
54388A59924J160R88O58p3q25j042p20k44J12K45J76K13O82J330J526J198R33
$$ 159924 161084 162072 162730 162657 161832 160790 160070 159826 159938 160183 160359 160572 161254 162584 164110 165308 166241
54371A66241R70Q90O44R72K159L215L063J990J115Q25N90K5o45j076j127p43q5
$$ 166241 167211 168101 168745 169717 171876 175091 178154 180144 181259 182084 182674 182699 182054 180978 179851 179108 179023
54354A79023M03L61n1m03n22m94m66o75j349k254k693k303j496q52m63k46l54
$$ 179023 179426 179787 179736 179333 178811 178317 177851 177176 175827 173573 170880 168577 167081 166229 165766 165520 165166
54337A65166p89j092r71q84j341j977k009j356o60l20j06K51O85J013J098P88
$$ 165166 164377 163285 162314 161430 160089 158112 156103 154747 154087 153767 153661 153912 154597 155610 156708 157496
54321A57496J22m37m35l6J36j68n40n45k90k09m79q12q52o22n06o55p32l94J44
$$ 157496 157618 157181 156746 156710 156846 156678 156138 155593 155303 155094 154615 153803 152951 152329 151823 151168 150436 150042 150186
54302A50186M15M68P39J183J178M51m96j134j449j493r93Q8J115J461J236R67
$$ 150186 150601 151069 151808 152991 154169 154620 154124 152990 151541 150048 149055 149143 150258 151719 152955 153922
54286A53922Q52P39N56L61K62M65J084J635J348K82n34m98k88o35j032n69M02
$$ 153922 154774 155513 156069 156430 156692 157157 158241 159876 161224 161506 160972 160474 160186 159551 158519 157950 158352
54269A58352O79N8l82L2O36O73N02R96K120K919K807K251J985J955J440K09r65
$$ 158352 159031 159089 158707 158739 159375 160048 160550 161546 163666 166585 169392 171643 173628 175583 177023 177232 176267
54252A76267j228p67m83p44j049r98q00o46k79L88Q47O67J41k25m44p55j007r09
$$ 176267 175039 174272 173789 173045 171996 170998 170198 169552 169273 169661 170508 171175 171316 171091 170647 169892 168885 167976
54234A67976n87l22o7K80L97o3p67j040p21k56J8J60K68L10K02j72r12j759k074
$$ 167976 167389 167067 167000 167280 167677 167614 166847 165807 165086 164830 164848 165008 165276 165586 165788 165616 164704 162945 160871
54215A60871j566p66l18r5M60J300J733J364N72l7k66k92l60n29n87k71L67R02
$$ 160871 159305 158539 158221 158126 158586 159886 161619 162983 163555 163518 163252 162960 162600 162071 161484 161213 161580 162482
54197A62482R71N46k28j159j833j797j149n01j62J89O91Q96O36N34J065J637J495
$$ 162482 163453 163999 163771 162612 160779 158982 157833 157332 157170 157359 158050 158946 159582 160116 161181 162818 164313
54180A64313J035J236K018K176J039o00j472j145k51K65k0p14j130j176j345j686
$$ 164313 165348 166584 168602 170778 171817 171217 169745 168600 168349 168614 168594 167880 166750 165574 164229 162543
54164A62543j494m36O45Q10L15J6Mj64k90K50J208J588J090M12%m60j042j208
$$ 162543 161049 160613 161258 162068 162383 162399 162403 162239 161949 162199 163407 164995 166085 166497 166497 166037 164995 163787
54146A63787q00m95p11r16o00j98l72r03j046o27p9L43P63J194J410J380J404
$$ 163787 162987 162492 161781 160865 160265 160067 159695 158792 157746 157119 157040 157383 158146 159340 160750 162130 163534
54129A63534J634J804J567J024O94R21J451J761J796K066K854L676L749K852J481
$$ 163534 165168 166972 168539 169563 170257 171178 172629 174390 176186 178252 181106 184782 188531 191383 192864
54114A92864L55L5O45J549J612L07j501k473k368k120k409k857k865k571k453
$$ 192864 193219 193254 193899 195448 197060 197367 195866 193393 191025 188905 186496 183639 180774 178203 175750
54099A75750k420j804l55J181J713R62k35q83q57p45q39q20m75m8L35R21J640
$$ 175750 173330 171526 171171 172352 174065 175027 174792 173909 173052 172307 171468 170648 170173 170125 170460 171381 173021
54082A73021J816J152M16M46R43J054P80Q90J605K279K400K103J621J013N10M71
$$ 173021 174837 175989 176405 176851 177794 178848 179628 180518 182123 184402 186802 188905 190526 191539 192049 192520
54066A92520P67Q12L75j57m11m72n71p25q24p33l24K59M52q3q39r72l25N92J478
$$ 192520 193287 194099 194474 194317 193906 193434 192863 192138 191314 190581 190257 190516 190968 190885 190046 189074 188749 189341 190819
54047A90819K413L239L534L346L236L431L575L543L825M771N939O535O224N335
$$ 190819 193232 196471 200005 203351 206587 210018 213593 217136 220961 225732 231671 238206 244430 249765
54033B49765M525M343M790N263N198M727M335M062L562K831K203J643P67l22r15
$$ 249765 254290 258633 263423 268686 273884 278611 282946 287008 290570 293401 295604 297247 298014 297692 296777
54018B96777o84k00j73n71q80r16j110k011l577m921n051m037l102l173l838m176
$$ 296777 296093 295893 295720 295149 294269 293353 292243 290232 286655 281734 276683 272646 269544 266371 262533 258357
54002B58357m028l707l055j837p55p92j689k250k111k010k176j864q31K4J40K68
$$ 258357 254329 250622 247567 245730 244975 244183 242494 240244 238133 236123 233947 232083 231252 231276 231416 231684
53986B31684J306L036M733O148P266P858P926P867P556O007K716j361m828p236
$$ 231684 232990 236026 240759 246907 254173 262031 269957 277824 285380 291387 294103 292742 287914 280678
53972B80678q733r136q291o886n884n413m920m149l244k221j099k97k15n67p02
$$ 280678 271945 262809 254518 247632 241748 236335 231415 227266 224022 221801 220702 220405 220190 219623 218921
53957B18921m45m4M12R69J393J432J297J387J676J881K028K303K532K441K256
$$ 218921 218476 218432 218844 219813 221206 222638 223935 225322 226998 228879 230907 233210 235742 238183 240439
53942B40439K454K982L349L420L508L742L911M019M384M963N161M595L634K861
$$ 240439 242893 245875 249224 252644 256152 259894 263805 267824 272208 277171 282332 286927 290561 293422
53928B93422K317J714J171J196J865K483K447K188K723M252N751O220N861N598
$$ 293422 295739 297453 298624 299820 301685 304168 306615 308803 311526 315778 321529 327749 333610 339208
53914C39208N843O310O721P045P083O557N601M613L598K219M84j064j941j955
$$ 339208 345051 351361 358082 365127 372210 378767 384368 388981 392579 394798 395282 394218 392277 390322
53900C90322j109N8L87q15k675l742l897m190m886n161m954n420o873p817p079
$$ 390322 389213 389271 389658 388843 386168 382426 378529 374339 369453 364292 359338 353918 347045 339228 332149
53885C32149n617m983n133n070m701m597m574m062l422l474l973l975l492l418
$$ 332149 326532 321549 316416 311346 306645 302048 297474 293412 289990 286516 282543 278568 275076 271658
53871B71658l864l977l472l058l058k958k583k561l083l277k553j610j431j895
$$ 271658 267794 263817 260345 257287 254229 251271 248688 246127 243044 239767 237214 235604 234173 232278
53857B32278k172j948j543j202r34q56j095j418j451j218j131j354j540j253n37
$$ 232278 230106 228158 226615 225413 224479 223623 222528 221110 219659 218441 217310 215956 214416 213163 212626
53842B12626J35L77L02K56K73M8m32o21k6J038J698J430N26l38p00n64k60j28
$$ 212626 212761 213138 213440 213696 213969 214017 213585 212964 212938 213976 215674 217104 217630 217292 216592 216028 215768 215640
53824B15640k20l33k95q6K89P64J047Q56M44L89P50Q92N62M83J382K825L733L778
$$ 215640 215420 215087 214792 214706 214995 215759 216806 217662 218106 218495 219245 220137 220699 221182 222564 225389 229122 232900
53806B32900L601L797M350N014N611N881N570M883M454M612M985M975M459L838
$$ 232900 236501 240298 244648 249662 255273 261154 266724 271607 276061 280673 285658 290633 295092 298930
53792B98930L507L400L104K423J706J368J296J037N19N1m01j249k443l253l299
$$ 298930 302437 305837 308941 311364 313070 314438 315734 316771 317290 317341 316940 315691 313248 309995 306696
53777C06696l086l150l303l305l537m289m981m948m532m423m375l666k538k022
$$ 306696 303610 300460 297157 293852 290315 286026 281045 276097 271565 267142 262767 259101 256563 254541
53763B54541k306k468k051j775k333l325l965m076l855l221k087q78j74P6L91
$$ 254541 252235 249767 247716 245941 243608 240283 236318 232242 228387 225166 223079 222201 222027 222103 222494
53748B22494Q52Q45q5j417k042j502m90J06L04O71J086P52m10j216p02N43J235
$$ 222494 223346 224191 224106 222689 220647 219145 218655 218761 219065 219736 220822 221574 221164 219948 219246 219789 221024
53731B21024J055O86N61N04M26M89N83M49L50Q35J767K319K127J736J683J786
$$ 221024 222079 222765 223326 223830 224256 224745 225328 225777 226127 226962 228729 231048 233175 234911 236594 238380
53715B38380J655J356J201J194J100Q84Q62J403K491L490L618K888K286K625L485
$$ 238380 240035 241391 242592 243786 244886 245770 246632 248035 250526 254016 257634 260522 262808 265433 268918
53700B68918L853L532L235L416L749L862L821L691L243K413J560R83N22r3p84
$$ 268918 272771 276303 279538 282954 286703 290565 294386 298077 301320 303733 305293 306276 306798 306705 305921
53685C05921j232j230q39l54j19k03k73n4K29J73j99n06n53m24j79Q8J03k91p66
$$ 305921 304689 303459 302620 302266 302147 301944 301671 301617 301846 302019 301820 301314 300761 300337 300158 300246 300349 300058 299292
53666B99292r05q24q77r73p59l85l33n82n68r6L59M26L57N74J069J475J449J011
$$ 299292 298387 297563 296686 295713 294954 294569 294236 293654 293086 292990 293349 293775 294132 294706 295775 297250 298699 299710
53648B99710O33Q60J581J971J555R37R39J488J982K386L040L676L653K999K329
$$ 299710 300343 301203 302784 304755 306310 307247 308186 309674 311656 314042 317082 320758 324411 327410 329739
53633C29739J809J169O69R35J702J876J065M9m96p28p51j45J098K161K511K580
$$ 329739 331548 332717 333386 334321 336023 337899 338964 339013 338517 337789 337038 336893 337991 340152 342663 345243
53617C45243K803K796K214J650J884K738L409L489L164K760K593K892L415L541
$$ 345243 348046 350842 353056 354706 356590 359328 362737 366226 369390 372150 374743 377635 381050 384591
53603C84591L010K226J554R17L49K72Q40J539J906K013J954J533Q49M56M38J07
$$ 384591 387601 389827 391381 392298 392647 392919 393759 395298 397204 399217 401171 402704 403553 404009 404447 404554
53587D04554p79j328q50j39m57j732k787k960k593k120j606j182j150j533k042
$$ 404554 403775 402447 401597 401458 401001 399269 396482 393522 390929 388809 387203 386021 384871 383338 381296
53572C81296k434k586k351j845j611j972k425k229j375m52K05O69R01Q00O72R90
$$ 381296 378862 376276 373925 372080 370469 368497 366072 363843 362468 362016 362221 362890 363791 364591 365263 366253
53556C66253J628J907J498P75K23p7k09j18J80L95K45j37k60K15J130K030K690
$$ 366253 367881 369788 371286 372061 372284 372207 371998 371880 372060 372455 372700 372563 372303 372518 373648 375678 378368
53539C78368L326M139M892N174M974M661M472M398M463M708N003N371O345Q267
$$ 378368 381694 385833 390725 395899 400873 405534 410006 414404 418867 423575 428578 433949 440294 448561
53525D48561J0310J1068J0302R311R275J0124J1277J2581J3947J4899J5231J5499
$$ 448561 458871 469939 480241 489552 498827 508951 520228 532809 546756 561655 576886 592385
53513E92385J6213J7128J7948J9068K0820K2554K3344K3205K2867K2697K2553
$$ 592385 608598 625726 643674 662742 683562 706116 729460 752665 775532 798229 820782
53502H20782K2371K2143K1558K0439J9243J8528J8182J7738J7181J6740J6287
$$ 820782 843153 865296 886854 907293 926536 945064 963246 980984 998165 1014905 1031192
53491A031192J5665J5300J5684J6495J6939J6786J6372J5892J5404J5284J5854
$$ 1031192 1046857 1062157 1077841 1094336 1111275 1128061 1144433 1160325 1175729 1191013 1206867
53480A206867J6658J6936J6596J6049J5310J4135J2804J1764J0689Q849O388M219
$$ 1206867 1223525 1240461 1257057 1273106 1288416 1302551 1315355 1327119 1337808 1346657 1353045 1357264
53468A357264K621R63j125l334n599q302j1172j3095j3546j3348j3433j3578j3132
$$ 1357264 1359885 1360848 1359723 1356389 1350790 1342488 1331316 1318221 1304675 1291327 1277894 1264316 1251184
53455A251184j2347j2170j3043j4562j6097j7247j7781j7637j7034j6403j6166
$$ 1251184 1238837 1226667 1213624 1199062 1182965 1165718 1147937 1130300 1113266 1096863 1080697
53444A080697j6507j7092j7079j5903j4022j2465j1461j0117p734m856k590j299
$$ 1080697 1064190 1047098 1030019 1014116 1000094 987629 976168 966051 958317 953461 950871 949572
53432I49572n56o1J03Q5N15J778L374M452M873N381O495P760Q497R078J0628J3329
$$ 949572 949016 948955 949058 949143 949658 951436 954810 959262 964135 969516 976011 983771 992268 1001346 1011974 1025303
53416A025303J5878J7180J7804J9010K0841K2208K2633K2805K3324K3943K4397
$$ 1025303 1041181 1058361 1076165 1095175 1116016 1138224 1160857 1183662 1206986 1230929 1255326
53405A255326K5090K6405K8000K9336L0507L2014L4052L6445L9056M1793M4320
$$ 1255326 1280416 1306821 1334821 1364157 1394664 1426678 1460730 1497175 1536231 1578024 1622344
53394A622344M6268M7608M8617M9492N0188N0587N0660N0470N0094M9477M8395
$$ 1622344 1668612 1716220 1764837 1814329 1864517 1915104 1965764 2016234 2066328 2115805 2164200
53383B164200M6764M4967M3551M2514M1151L8798L5541L1994K8556K5168K1719
$$ 2164200 2210964 2255931 2299482 2341996 2383147 2421945 2457486 2489480 2518036 2543204 2564923
53372B564923J8348J5138J1684P344J963l853r465j4942k0746k6812l2406l6937
$$ 2564923 2583271 2598409 2610093 2617437 2619400 2615547 2606082 2591140 2570394 2543582 2511176 2474239
53360B474239m0426m3050m4856m6061m7115m8071m8412m7822m6643m5237m3449
$$ 2474239 2433813 2390763 2345907 2299846 2252731 2204660 2156248 2108426 2061783 2016546 1973097
53349A973097m1201l9024l7360l5924l4418l3378l3448l4286l5003l5323l5351
$$ 1973097 1931896 1892872 1855512 1819588 1785170 1751792 1718344 1684058 1649055 1613732 1578381
53338A578381l4616l2525k9623k7197k5558k3826k1536j9327j7732j6325j4574
$$ 1578381 1543765 1511240 1481617 1454420 1428862 1405036 1383500 1364173 1346441 1330116 1315542
53327A315542j2757j1574j1391j2157j3444j4425j4519j4203j4404j5002j4829
$$ 1315542 1302785 1291211 1279820 1267663 1254219 1239794 1225275 1211072 1196668 1181666 1166837
53316A166837j3442j1794j0785j0172r463q863q515p739o013l990k599j706n72
$$ 1166837 1153395 1141601 1130816 1120644 1111181 1102318 1093803 1086064 1080051 1076061 1073462 1071756 1071184
53303A071184Q29J986L015M558O611Q464R869J1415J3528J5783J7507J8610J9471
$$ 1071184 1072013 1073999 1077014 1081572 1088183 1096647 1106516 1117931 1131459 1147242 1164749 1183359 1202830
53290A202830K0436K1572K2740K3625K3871K3313K2139K0783J9581J8453J7030
$$ 1202830 1223266 1244838 1267578 1291203 1315074 1338387 1360526 1381309 1400890 1419343 1436373
53279A436373J5164J3213J1469R536O829L546N05k051m696p621j0093j1599j2754
$$ 1436373 1451537 1464750 1476219 1485755 1492584 1496130 1496635 1494584 1489888 1482267 1472174 1460575 1447821
53266A447821j4380j6302j7864j9158k0767k2599k3898k4372k4462k4506k4378
$$ 1447821 1433441 1417139 1399275 1380117 1359350 1336751 1312853 1288481 1264019 1239513 1215135
53255A215135k4113k4152k4668k5175k5103k4405k3414k2436k1670k1232k1040
$$ 1215135 1191022 1166870 1142202 1117027 1091924 1067519 1044105 1021669 999999 978767 957727
53244I57727k0871k0630k0434k0352k0245j9936j9411j8747j8037j7327j6626
$$ 957727 936856 916226 895792 875440 855195 835259 815848 797101 779064 761737 745111
53233G45111j5901j5098j4153j2931j1390r806q643q049p760p570p646q106q643
$$ 745111 729210 714112 699959 687028 675638 665832 657189 649140 641380 633810 626164 618058 609415
53220F09415q948r244r979j1110j2101j2619j2859j3117j3386j3430j3090j2355
$$ 609415 600467 591223 581244 570134 558033 545414 532555 519438 506052 492622 479532 467177
53208D67177j1284r957q546p410o955p187p439o978n958n389n968p231q210q531
$$ 467177 455893 445936 437390 429980 423025 415838 408399 401421 395463 390074 384106 376875 368665 360134
53194C60134q469q244p783p102o441n971n683n515n391n160m774m419m232m016
$$ 360134 351665 343421 335638 328536 322095 316124 310441 304926 299535 294375 289601 285182 280950 276934
53180B76934l536k940k548k291j792j028m78n16r38j260j223r01m65j02Jk58p45
$$ 276934 273398 270458 267910 265619 263827 262799 262321 261805 260867 259607 258384 257483 257018 256916 256917 256659 255914
53163B55914j148j231j073r34r00p45l37N7Q7j32k02j31l82j083j659j523q63
$$ 255914 254766 253535 252462 251528 250628 249883 249546 249603 249690 249558 249356 249225 248843 247760 246101 244578 243715
53146B43715m38p47j537j998j443p1R62P23l13p74j50O69Q76P95J000J236J029
$$ 243715 243277 242530 240993 238995 237552 237481 238443 239166 238853 238079 237929 238598 239474 240269 241269 242505 243534
53129B43534P13Q66J269J342J259J569J990J750J016Q03J371J808J557J258J578
$$ 243534 244247 245113 246382 247724 248983 250552 252542 254292 255308 256111 257482 259290 260847 262105 263683
53114B63683K143K211J769J288R51O24K65k04r91j968k507k246j670j422j431
$$ 263683 265826 268037 269806 271094 272045 272669 272934 272730 271739 269771 267264 265018 263348 261926 260495
53099B60495j273j059j255j786j970j480p86n09p17j064j362j668j961j902j142
$$ 260495 259222 258163 256908 255122 253152 251672 250886 250377 249660 248596 247234 245566 243605 241703 240561
53084B40561J33J092R44k09j409j821j423o93L4O72J068J071P68M21J33j38l77
$$ 240561 240694 241786 242730 242521 241112 239291 237868 237175 237209 237881 238949 240020 240788 241209 241342 241204 240827
53067B40827n54q22j340j864j861j182m24k98p50r17j29J200J933J461L79k37
$$ 240827 240273 239451 238111 236247 234386 233204 232780 232482 231732 230815 230686 231886 233819 235280 235659 235422
53051B35422o8L27M43M23N45N93K12l99o34k79K13L42J20j22k15k31k44k22j01
$$ 235422 235354 235681 236124 236547 237092 237685 237897 237498 236864 236585 236798 237140 237260 237138 236923 236692 236448 236226 236125
53032B36125J14L52M75L98K02R7J86L54M20K86l5m40o64m18K28P61P56L72J13
$$ 236125 236239 236591 237066 237464 237666 237763 237949 238303 238723 239009 238974 238534 237870 237452 237680 238441 239197 239569 239682
53013B39682J22J47J36M11R81J221O99M1K80J412K216J810P84L37O59P70p2j315
$$ 239682 239804 239951 240087 240498 241479 242700 243399 243440 243720 245132 247348 249158 249942 250279 250938 251708 251636 250321
52995B50321j752r22L93J020N74k58m93J76J237K018K316K342K268K017J490Q29
$$ 250321 248569 247647 248040 249060 249634 249376 248883 249059 250296 252314 254630 256972 259240 261257 262747 263576
52979B63576M17O00J304J945J807P67m77j018n97K60R38J339J702K004J875J129
$$ 263576 263993 264593 265897 267842 269649 270416 269939 268921 268324 268584 269522 270861 272563 274567 276442 277571
52963B77571J99k21M5M40L50k28q72j325j623j746j601j343j301j472j466j193
$$ 277571 277770 277549 277594 278034 278384 278156 277284 275959 274336 272590 270989 269646 268345 266873 265407 264214
52947B64214j097j422j660j254n36k59m09k19N47J081P11r1m42k43l9nJ17K22
$$ 264214 263117 261695 260035 258781 258245 257986 257577 257358 257905 258986 259697 259606 259164 258921 258882 258877 258994 259216
52929B59216j02n96l81O65J390R42J22K33J094J307L98n37n77k17l27q04j022
$$ 259216 259114 258518 258137 258802 260192 261134 261256 261489 262583 263890 264288 263751 263174 262957 262630 261826 260804
52912B60804r60r62q86l87J78N2p73j423j234m09M52Q30M68m23j024o56L62J061
$$ 260804 259844 258882 257996 257609 257787 257839 257066 255643 254409 254000 254452 255282 255750 255327 254303 253647 254009 255070
52894B55070J001N50R0l02m68j72L15M38K22K25M66L03m18q98n13M17J304J952
$$ 255070 256071 256621 256711 256409 255941 255769 256084 256522 256744 256969 257435 257738 257320 256422 255909 256326 257630 259582
52876B59582K203J821J196J302K263K869K297J393J346J858J841J314J296K023
$$ 259582 261785 263606 264802 266104 268367 271236 273533 274926 276272 278130 279971 281285 282581 284604
52862B84604K524J976N87j022k394l199l340l247l433l785l869l743l776l768
$$ 284604 287128 289104 289691 288669 286275 283076 279736 276489 273056 269271 265402 261659 257883 254115
52848B54115l128j904q68n08o02q55j266j754k076k210k262j991j130j48J21k93
$$ 254115 250987 249083 248215 247707 247105 246250 244984 243230 241154 238944 236682 234691 233561 233413 233534 233241
52832B33241m54J22Q13Q74L72j77m44k58L96J020Q50j73j145j276o75J41R04J396
$$ 233241 232787 232909 233722 234596 234968 234791 234347 234089 234485 235505 236355 236182 235037 233761 233086 233227 234131 235527
52814B35527J260N71J42O22J591K048J588O54k12r03j561k241k759k892k659k335
$$ 235527 236787 237358 237500 238122 239713 241761 243349 244003 243791 242888 241327 239086 236327 233435 230776 228441
52798B28441k022j398l22N63M78l65r68r53r16j198j177l60O47R37N96M60Q70
$$ 228441 226419 225021 224699 225262 225740 225375 224407 223454 222538 221340 220163 219803 220450 221387 221983 222443 223313
52781B23313J319J233O47J06J48P71J248Q63j20o65l23J79J00k58k49m0k75q98
$$ 223313 224632 225865 226512 226618 226766 227537 228785 229648 229528 228863 228540 228719 228819 228561 228312 228272 227997 227099
52763B27099j179q43m18l41l13J82J089J782J722J043M18L36N86P28Q93J584K687
$$ 227099 225920 225077 224659 224318 224005 224187 225276 227058 228780 229823 230241 230577 231163 231891 232784 234368 237055
52746B37055L355L158K608K156J496N35K28J402L099L385J745l08j215r18k63
$$ 237055 240410 243568 246176 248332 249828 250363 250591 251993 255092 258477 260222 259914 258699 257781 257518
52731B57518K23M41L09l8j32J77L22k13j000j175p39o37j401k333k390j504n35
$$ 257518 257741 258182 258491 258453 258321 258498 258820 258607 257607 256432 255693 255056 253655 251322 248932 247428 246893
52714B46893r9k3N2J33J67L12M99K36n77j049l25J015J521Q80L05O85J380J432
$$ 246893 246794 246771 246823 246956 247123 247435 247934 248170 247593 246544 246219 247234 248755 249635 249940 250625 252005 253437
52696B53437R91P17N13r6q33r56n20k91n01n58j42L05L91L52M97O56N25J52k17
$$ 253437 254428 255145 255658 255562 254729 253773 253253 252962 252461 251903 251761 252066 252457 252809 253306 253962 254487 254639 254422
52677B54422m72n55m06j52j15m10p00n90n8N49Q74Q54P74R20J155J013M58J54
$$ 254422 253950 253395 252989 252837 252722 252312 251612 251022 250964 251513 252387 253241 254015 254935 256090 257103 257561 257715
52659B57715O46J490J773J357J025J428K407L364L727L053J271r59k645l392l540
$$ 257715 258361 259851 261624 262981 264006 265434 267841 271205 274932 277985 279256 278297 275652 272260 268720
52644B68720l337k606j385k93J26Lk55m86n87l08L25P36M45k21n13j61N27J184
$$ 268720 265383 262777 261392 261099 261225 261228 260973 260487 259900 259592 259917 260653 261098 260877 260364 260203 260730 261914
52626B61914J631J740J474J011N42K0o16j135j241r66n73k02N2k2m19o71l88P1
$$ 261914 263545 265285 266759 267770 268312 268332 267716 266581 265340 264374 263801 263599 263651 263629 263210 262539 262151 262222
52608B62222P6k37p2P49J392J171M98J45J57J16P3M26J011J140O56K10K58M51
$$ 262222 262298 262061 261989 262738 264130 265301 265799 265944 266101 266217 266290 266716 267727 268867 269523 269733 269991 270442
52590B70442M21M79J013J630J713J442J517J903J797R75K45J98L24n4o77q79p50
$$ 270442 270863 271342 272355 273985 275698 277140 278657 280560 282357 283332 283577 283775 284099 284045 283368 282489 281739
52573B81739q39j109j038o90o47q71o41J48N61rq93j215j167j430j895j924j531
$$ 281739 280900 279791 278753 278063 277416 276545 275904 276052 276613 276604 275711 274496 273329 271899 270004 268080 266549
52556B66549j345j449j272o85k63j90K20J344K384K342J402N50J97p6m84o50l11
$$ 266549 265204 263755 262483 261798 261535 261345 261565 262909 265293 267635 269037 269587 269784 269708 269224 268574 268263
52539B68263K04N36P49R14P41O5n95n21K84J079J295J077Q74Q09O57K71j99m80
$$ 268263 268467 269003 269752 270666 271407 271472 270877 270356 270640 271719 273014 274091 274965 275774 276431 276702 276503 276023
52521B76023m86l38p3N00J491K521K944K562J819J226Q84Q14J265K272L212L357
$$ 276023 275537 275199 275126 275626 277117 279638 282582 285144 286963 288189 289073 289887 291152 293424 296636 299993
52505B99993K674J617L58j135k455l018k994l129l479l260k288j582j890k490
$$ 299993 302667 304284 304642 303507 301052 298034 295040 291911 288432 285172 282884 281302 279412 276922
52491B76922k326j625j307j264n74P53J497R78Nl94k31j0K84Q58J332J117L92
$$ 276922 274596 272971 271664 270400 269826 270579 272076 273054 273059 272665 272434 272424 272708 273566 274898 276015 276407
52474B76407o0J31N82Q50R03Q79Q39R49J493K463L394L826L789L626L482L145
$$ 276407 276347 276478 277060 277910 278813 279692 280531 281480 282973 285436 288830 292656 296445 300071 303553 306698
52458C06698K424J419M16m38j220k009k725l204l449l635l866l959l664l040k428
$$ 306698 309122 310541 310957 310519 309299 307290 304565 301361 297912 294277 290411 286452 282788 279748 277320
52443B77320k012j576r08l10l32r77j537j430r43p34q15n27M28J442J695J117
$$ 277320 275308 273732 272824 272514 272182 271205 269668 268238 267295 266561 265746 265219 265647 267089 268784 269901
52427B69901L47m1J6K63M74O33Q45J110J208R99Q51J359K528L578L865L640L494
$$ 269901 270248 270207 270223 270486 270960 271593 272438 273548 274756 275755 276606 277965 280493 284071 287936 291576 295070
52410B95070L456L218L056L786N613P615Q648Q403P315N787L864J560q72l024
$$ 295070 298526 301744 304800 308586 314199 321814 330462 338865 346180 351967 355831 357391 356519 353495
52396C53495m614n621o219o479o186n120l528k058j162p62n39l63k69k38j74j2
$$ 353495 348881 343260 337041 330562 324376 319256 315728 313670 312508 311746 311207 310844 310575 310337 310163 310151
52380C10151L22Q78J546K055K328K662L324M076M443M479M803N664O333N848M251
$$ 310151 310473 311351 312897 314952 317280 319942 323266 327342 331785 336264 341067 346731 353064 358912 363163
52365C63163K530J341L38r28k022k154j424p70o27l85M73J416J632J285J251J774
$$ 363163 365693 367034 367372 366444 364422 362268 360844 360074 359447 359062 359535 360951 362583 363868 365119 366893
52349C66893K154J875J386J400J844K020J611J142J317K217L299M119M796N677
$$ 366893 369047 370922 372308 373708 375552 377572 379183 380325 381642 383859 387158 391277 396073 401750
52335D01750O739P565P905P974Q182Q765R731J0874J1826J2432J3115J4474J6322
$$ 401750 408489 416054 423959 431933 440115 448880 458611 469485 481311 493743 506858 521332 537654
52322E37654J7661J7961J7939J8525J9479J9776J9049J7966J7219J6986J7401
$$ 537654 555315 573276 591215 609740 629219 648995 668044 686010 703229 720215 737616
52311G37616J8723K0656K2129K2243K1153J9770J8876J8711J9053J9358J9101
$$ 737616 756339 776995 799124 821367 842520 862290 881166 899877 918930 938288 957389
52300I57389J8231J7108J5956J4637J3040J1222R049O230K999K29j569k945m715
$$ 957389 975620 992728 1008684 1023321 1036361 1047583 1056632 1062862 1065861 1066090 1064521 1061576 1056861
52287A056861o790q444r435j0145j0651j0405r152p509o287n526m613l177j455
$$ 1056861 1050071 1041627 1032192 1022047 1011396 1000991 991839 984330 978043 972517 967904 964727 963272
52274I63272J65J612L071M660O293P780Q964R846J0547J1187J1764J2298J3013
$$ 963272 963437 965049 968120 972780 979073 986853 995817 1005663 1016210 1027397 1039161 1051459 1064472
52261A064472J4159J5493J6324J6339J6166J6697J7832J8495J7954J6601J5195
$$ 1064472 1078631 1094124 1110448 1126787 1142953 1159650 1177482 1195977 1213931 1230532 1245727
52250A245727J3869J2320J0516Q616O394L418k76m070p286r515j0667j1128j1666
$$ 1245727 1259596 1271916 1282432 1291048 1297442 1300860 1300584 1296514 1289228 1279713 1269046 1257918 1246252
52237A246252j2623j3496j3818j4162j5321j6683j6633j4790j2725j1876j1823
$$ 1246252 1233629 1220133 1206315 1192153 1176832 1160149 1143516 1128726 1116001 1104125 1092302
52226A092302j1359j0338r447q713p537n981m859m460m126l335k366j575p65K88
$$ 1092302 1080943 1070605 1061158 1052445 1044908 1038927 1034068 1029608 1025482 1022147 1019781 1018206 1017441 1017729
52212A017729J288J926K539L664N146O201O230N313L918K619J988K341L422M570
$$ 1017729 1019017 1020943 1023482 1027146 1032292 1038493 1044723 1050036 1053954 1056573 1058561 1060902 1064324 1068894
52198A068894N342N831O328O906P425P748P745P321O634O057N641M746K660l79
$$ 1068894 1074236 1080067 1086395 1093301 1100726 1108474 1116219 1123540 1130174 1136231 1141872 1146618 1149278 1148899
52184A148899l209m956n898o892q231r442r988r804r122q165p102o114n367m937
$$ 1148899 1145690 1140734 1134836 1127944 1119713 1110271 1100283 1090479 1081357 1073192 1066090 1059976 1054609 1049672
52170A049672m769m633m206l283j925m01R05J665J927K225K977L796L866L115
$$ 1049672 1044903 1040270 1036064 1032781 1030856 1030455 1031360 1033025 1034952 1037177 1040154 1043950 1047816 1050931
52156A050931K392K171J793O10p80j291q86m00j02M70J305J676J384J212J670
$$ 1050931 1053323 1055494 1057287 1057897 1057117 1055826 1054940 1054540 1054438 1054908 1056213 1057889 1059273 1060485 1062155
52141A062155K116J728O87j86m86l28J71R69J946L098M670O693Q726J0465J2280
$$ 1062155 1064271 1065999 1066686 1066500 1066014 1065686 1065857 1066826 1068772 1071870 1076540 1083233 1091959 1102424 1114704
52126A114704J4668J7444J9974K2020K3875K5695K7167K7877K7793K7282K6822
$$ 1114704 1129372 1146816 1166790 1188810 1212685 1238380 1265547 1293424 1321217 1348499 1375321
52115A375321K6659K6679K6621K6384K5905K4843K2807K0000J7215J5067J3470
$$ 1375321 1401980 1428659 1455280 1481664 1507569 1532412 1555219 1575219 1592434 1607501 1620971
$$ [...]
##END NTUPLES=NMR SPECTRUM
##END=
