##TITLE=AC1744_SEN00017_9276535_fUiwmSTxca
##JCAMPDX= 6.0         $$ Bruker NMR JCAMP-DX V2.0
##DATA TYPE= NMR SPECTRUM
##DATA CLASS= NTUPLES
##ORIGIN= BRUKER
##OWNER= Administrator
$$ 1.72 TOPSPIN		Version 2.1
$$ 2015-07-14 21:00:40.400 -0700  Administrator@X
$$ Compression mode = diff/dup
##.OBSERVE FREQUENCY= 400.02188249412
##.OBSERVE NUCLEUS= ^1H
##.ACQUISITION MODE= SIMULTANEOUS (DQD)
##.ACQUISITION SCHEME= undefined
##.AVERAGES= 64
##.DIGITISER RES= 22
##SPECTROMETER/DATA SYSTEM= spect
##.PULSE SEQUENCE= noesygpps1d.comp
##.SOLVENT NAME= COFFEE_meoh
##.SHIFT REFERENCE= INTERNAL, COFFEE_meoh, 1, 14.96088
##AUDIT TRAIL= $$ (NUMBER, WHEN, WHO, WHERE, PROCESS, VERSION, WHAT)
$$ ##TITLE= Audit trail, TOPSPIN		Version 2.1
$$ ##JCAMPDX= 5.01
$$ ##ORIGIN= Bruker BioSpin GmbH
$$ ##OWNER= Administrator
$$ $$ E:\/data/COFFEE/nmr/AC1744_SEN00017_9276535_fUiwmSTxca/12/pdata/1/auditp.txt
$$ ##AUDIT TRAIL=  $$ (NUMBER, WHEN, WHO, WHERE, PROCESS, VERSION, WHAT)
(   1,<2015-07-14 21:00:35.400 -0700>,<Administrator>,<X>,<go>,<TOPSPIN 2.1>,
      <created by zg
	started at 2015-07-14 20:49:05.713 -0700,
	POWCHK enabled, PULCHK disabled,
       configuration hash MD5:
       21 0F 79 D6 B3 7B B4 F6 88 20 88 DB 03 48 BD 9F
       data hash MD5: 64K
       29 A4 42 A1 5A 17 2F 44 C1 D5 3D 9B 7E 60 C0 88>)
(   2,<2015-07-14 21:00:38.494 -0700>,<Administrator>,<X>,<proc1d>,<TOPSPIN 2.1>,
      <Start of raw data processing
       efp LB = 0.3 FT_mod = 6 PKNL = 1 PHC0 = 0 PHC1 = 0 SI = 128K 
       data hash MD5: 128K
       1B B4 1F EB 5F EB F2 CA 2F EA B7 D1 A2 38 F5 3A>)
(   3,<2015-07-14 21:00:39.494 -0700>,<Administrator>,<X>,<proc1d>,<TOPSPIN 2.1>,
      <pk PHC0 = -87.75879 PHC1 = 0 
       data hash MD5: 128K
       5F 97 00 5F F3 ED F7 F4 0F A3 66 CD 02 9B 48 55>)
(   4,<2015-07-14 21:00:39.885 -0700>,<Administrator>,<X>,<proc1d>,<TOPSPIN 2.1>,
      <abs ABSG = 1 
       data hash MD5: 128K
       16 F2 B1 FC 3E E8 EE 93 C0 69 F3 07 33 59 60 91>)
(   5,<2015-07-14 21:00:39.979 -0700>,<Administrator>,<X>,<proc1d>,<TOPSPIN 2.1>,
      <abs ABSG = 2 
       data hash MD5: 128K
       C8 E2 0C 83 83 AF 86 CA E7 8F C3 A7 D1 C5 21 E2>)
(   6,<2015-07-14 21:00:40.072 -0700>,<Administrator>,<X>,<proc1d>,<TOPSPIN 2.1>,
      <abs ABSG = 3 
       data hash MD5: 128K
       12 7A DB 6F CE D8 B7 7A 7C 8A C6 CA 0D 2D 59 CC>)
(   7,<2015-07-14 21:00:40.150 -0700>,<Administrator>,<X>,<proc1d>,<TOPSPIN 2.1>,
      <abs ABSG = 4 
       data hash MD5: 128K
       2C 44 12 F4 2D E4 24 98 75 B9 59 8B 2A 9D 59 21>)
(   8,<2015-07-14 21:00:40.229 -0700>,<Administrator>,<X>,<proc1d>,<TOPSPIN 2.1>,
      <abs ABSG = 5 
       data hash MD5: 128K
       33 12 3D 1A D3 A1 21 B6 50 51 3B DB BF 99 B7 5B>)
$$ ##END=
$$ 
$$ $$ hash MD5
$$ $$ 64 1E 94 2E 93 4A 48 00 AD 23 3C BF F8 2F DC D3
##$RELAX= 
##$RELAX= 
##$RELAX= 
##$RELAX= 
##$RELAX= 
##$RELAX= 
##$RELAX= 
##$RELAX= 
$$ Bruker specific parameters
$$ --------------------------
##$DU= <E:\>
##$EXPNO= 12
$$ [...]
##$TP07= 0
##$TPNAME0= <>
##$TPNAME1= <>
##$TPNAME2= <>
##$TPNAME3= <>
##$TPNAME4= <>
##$TPNAME5= <>
##$TPNAME6= <>
##$TPNAME7= <>
##$TPOAL= (0..7)
0.5 0.5 0.5 0.5 0.5 0.5 0.5 0.5
##$TPOFFS= (0..7)
0 0 0 0 0 0 0 0
##$TUNHIN= 0
##$TUNHOUT= 0
##$TUNXOUT= 0
##$USERA1= <user>
##$USERA2= <user>
##$USERA3= <user>
##$USERA4= <user>
##$USERA5= <user>
##$V9= 5
##$VALIST= <valist>
##$VCLIST= <CCCCCCCCCCCCCCC>
##$VD= 0
##$VDLIST= <DDDDDDDDDDDDDDD>
##$VPLIST= <PPPPPPPPPPPPPPP>
##$VTLIST= <TTTTTTTTTTTTTTT>
##$WBST= 2048
##$WBSW= 25
##$XGAIN= (0..3)
0 0 0 0
##$XL= 0
##$YL= 0
##$YMAX_a= 6512836
##$YMIN_a= -11965809
##$ZGOPTNS= <>
##$ZL1= 120
##$ZL2= 120
##$ZL3= 120
##$ZL4= 120
##$ABSF1= 14.96088
##$ABSF2= -5.597301
##$ABSG= 5
##$ABSL= 3
##$ALPHA= 0
##$AQORDER= 0
##$ASSFAC= 0
##$ASSFACI= 0
##$ASSFACX= 0
##$ASSWID= 0
##$AUNMP= <proc_prof1d_extract.lims>
##$AXLEFT= 0
##$AXNAME= <>
##$AXNUC= <1H>
##$AXRIGHT= 0
##$AXTYPE= 0
##$AXUNIT= <>
##$AZFE= 0.1
##$AZFW= 0.1
##$BCFW= 0
##$BC_mod= 0
##$BYTORDP= 0
##$COROFFS= 0
##$CY= 15
##$DATMOD= 1
##$DC= 0
##$DFILT= <>
##$DTYPP= 0
##$F1P= 0
##$F2P= 0
##$FCOR= 0.5
##$FTSIZE= 131072
##$FT_mod= 6
##$GAMMA= 0
##$GB= 0
##$INTBC= 1
##$INTSCL= 1
##$ISEN= 128
##$LB= 0.3
##$LEV0= 0
##$LPBIN= 0
##$MAXI= 10000
##$MC2= 0
##$MEAN= 0
##$ME_mod= 0
##$MI= 0
##$NCOEF= 0
##$NC_proc= -2
##$NLEV= 6
##$NOISF1= 0
##$NOISF2= 0
##$NSP= 0
##$NTH_PI= 0
##$NZP= 0
##$OFFSET= 14.96088
##$PC= 1
##$PHC0= -87.75879
##$PHC1= 0
##$PH_mod= 1
##$PKNL= yes
##$PPARMOD= 0
##$PPDIAG= 0
##$PPIPTYP= 0
##$PPMPNUM= 2147483647
##$PPRESOL= 1
##$PSCAL= 4
##$PSIGN= 0
##$PYNMP= <proc.py>
##$REVERSE= no
##$SF= 400.02000968428
##$SI= 131072
##$SIGF1= 0
##$SIGF2= 0
##$SINO= 400
##$SIOLD= 131072
##$SPECTYP= <>
##$SREGLST= <1H.CDCl3>
##$SSB= 0
##$STSI= 131072
##$STSR= 0
##$SW_p= 8223.68421052631
##$SYMM= 0
##$S_DEV= 0
##$TDeff= 65536
##$TDoff= 0
##$TI= <>
##$TILT= no
##$TM1= 0
##$TM2= 0
##$TOPLEV= 0
##$USERP1= <user>
##$USERP2= <user>
##$USERP3= <user>
##$USERP4= <user>
##$USERP5= <user>
##$WDW= 1
##$XDIM= 131072
##$YMAX_p= 397934166
##$YMIN_p= -11113
##$CURPLOT= <Network HP LaserJet P1505>
##$CURPRIN= <$Network HP LaserJet P1505>
##$DFORMAT= <normdp>
##$LAYOUT= <+/1D_H.xwp>
##$LFORMAT= <normlp>
##$PFORMAT= <normpl>
##$SURQMSG= 1
$$ End of Bruker specific parameters
$$ ---------------------------------
##NTUPLES= NMR SPECTRUM
##VAR_NAME=  FREQUENCY,     SPECTRUM/REAL,   SPECTRUM/IMAG
##SYMBOL=    X,             R,               I
##VAR_TYPE=  INDEPENDENT,   DEPENDENT,       DEPENDENT
##VAR_FORM=  AFFN,          ASDF,            ASDF
##VAR_DIM=   131072,        131072,          131072
##UNITS=     HZ,            ARBITRARY UNITS, ARBITRARY UNITS
##FACTOR=    0.0627417313425164, 1,          1
##FIRST=     8223.62146879497, 1080,         -55766
##LAST=      0,             3395,            -55594
##MIN=       0,             -11113,          0
##MAX=       8223.62146879497, 397934166,    0
$$ Real data points
##PAGE= N=1
##DATA TABLE= (X++(R..R)), XYDATA
$$ [...]
61619C86187j86J25k20p50m79M76R92N16l56j060j831l009m310n272n872o200
61603C58751o020n174m147l658l792l961l673l039k463k180k202k525l149l889
61589C08879m345m283l906l519l046k235j340j059j497j812j332n84m84q87q17
61574B77733l4N20M1j093j908j829r44K01P68J81j119j891j466m39K43M39N49
61557B69952O28L73k35q39j174j152o13M73J582J929J344M59p0j60p7P1K75L82
61539B73148K83K90Q51J801K273J761R89J147K187K636J457m65j418j080p59j415
61523B83686k373k413j441m78l07p80j321j581j551j333j011o16j66K40M37L13
61507B69305q4n96r93j070q84q10j132j598j630r87m7O20P05K61l23m93m8N44
$$ y = [386187, 386001, 386126, 385906, 385156, 384677, 385153, 386145, 386661, 386305, 385245, 383414, 380405, 376095, 370823, 364951, 358751, 352731, 347557, 343410, 339752, 335960, 331999, 328326, 325287, 322824, 320644, 318442, 315917, 312768, 308879, 304534, 300251, 296345, 292826, 289780, 287545, 286205, 285146, 283649, 281837, 280505, 279921, 279437, 278550, 277733, 277699, 278219, 278260, 277167, 275259, 273430, 272486, 272687, 273455, 273636, 272517, 270626, 269160, 268721, 268964, 269403, 269952, 270580, 270953, 270718, 269879, 268705, 267553, 266940, 267413, 268995, 270924, 272268, 272727, 272657, 272497, 272420, 272491, 272766, 273148, 273431, 273721, 274572, 276373, 278646, 280407, 281396, 282543, 284730, 287366, 288823, 288358, 286940, 285860, 285101, 283686, 281313, 278900, 277459, 276981, 276674, 275894, 274573, 272992, 271441, 270108, 269097, 268481, 268315, 268555, 268992, 269305, 269221, 268625, 267632, 266562, 265678, 264868, 263736, 262138, 260508, 259521, 259474, 260094, 260799, 261060, 260737, 260244, 260196, 260740]
61489B60740O85M19K42K45J11q4J39P28J023R23J265K397L260K704J181J25L9
61472B76142K11O9j69k40k83l15j08K11Q1o13j225j185o84j87K42P15J061J045
61454B74768Q51Q94J234J497J344Q71N44P09J114J051K36o27n81L41J194J445
61438B86885J569K068K671K981L243L784M166L738K799K316K536K624J913P48
61424C24041j36m79m05m3M04N94N02N59J044J613J846J888K033K024J316%j159
61407C35642j611j489j181r23r05j256j758j979j865j804j987k064j733j151n06
61392C13430L81J556K389K137R60j58n17l22j73l26n62n42j29M75Q62Q56P31Q93
61374C21941J326J622J559J402J573K115K629K638K081J456J360J866K453K638
$$ y = [260740, 261425, 261844, 262086, 262331, 262442, 262358, 262497, 263225, 264248, 265171, 266436, 268833, 272093, 274797, 275978, 276103, 276142, 276353, 276422, 276253, 276013, 275730, 275415, 275307, 275518, 275599, 274986, 273761, 272576, 271892, 271705, 271947, 272662, 273723, 274768, 275619, 276513, 277747, 279244, 280588, 281459, 282003, 282712, 283826, 284877, 285113, 284486, 283905, 284246, 285440, 286885, 288454, 290522, 293193, 296174, 299417, 303201, 307367, 311105, 313904, 316220, 318756, 321380, 323293, 324041, 323905, 323426, 323021, 322978, 323382, 323976, 324478, 325037, 326081, 327694, 329540, 331428, 333461, 335485, 336801, 336801, 335642, 334031, 332542, 331361, 330438, 329533, 328277, 326519, 324540, 322675, 320871, 318884, 316820, 315087, 313936, 313430, 313811, 315367, 317756, 319893, 320853, 320695, 320178, 319856, 319683, 319357, 318795, 318253, 318124, 318599, 319461, 320317, 321048, 321941, 323267, 324889, 326448, 327850, 329423, 331538, 334167, 336805, 338886, 340342, 341702, 343568, 346021, 348659]
61360C48659K445K104J627R54K96K1L22J220K690M462N940O794P370Q086Q620
61345D01610Q318P245O147N356M456L223K193J958K396K940L188K954K193J216
61331D55393N77L72Mj033k470l681m377m474l757k312j002p65j412j670o19J348
61315D30122L042L683L368K730K342K482L225M609O495Q395R765J0543J1119J1603
61301E13523J1560J0702R440Q300P108N345L063Q91q28k282l538m241m225l950
61287E50868m003m460m939n089m825m370m194m591n155n024l939k622j813j302
61273D94542m63O05J184J121J096J578K173K318K052J667J196P58R67K314M360
61258E17468O187P434Q241Q415P539N961M739M245L654K235M27r26j770k601l450
$$ y = [348659, 351104, 353208, 354835, 355789, 356085, 356106, 356428, 357648, 360338, 364800, 370740, 377534, 384904, 392990, 401610, 409928, 417173, 423320, 428676, 433132, 436355, 438548, 440506, 442902, 445842, 449030, 451984, 454177, 455393, 455970, 456342, 456346, 455313, 452843, 449162, 444785, 440311, 436554, 434242, 433240, 432475, 431063, 429393, 428774, 430122, 433164, 436847, 440215, 442945, 445287, 447769, 450994, 455603, 462098, 470493, 480258, 490801, 501920, 513523, 525083, 535785, 545225, 553525, 560633, 565978, 569041, 569932, 569104, 566822, 563284, 559043, 554818, 550868, 546865, 542405, 537466, 532377, 527552, 523182, 518988, 514397, 509242, 504218, 500279, 497657, 495844, 494542, 494079, 494684, 495868, 496989, 498085, 499663, 501836, 504154, 506206, 507873, 509069, 509827, 510794, 513108, 517468, 523655, 531089, 539330, 547745, 555284, 561245, 565984, 570229, 573883, 576118, 576545, 575619, 573849, 571248, 567798]
61243E67798l925l992l986l975l739l282k823k417k075k070k524k828k261j052
61229E26849j48J89P05J907L250L969M125M357M961N660O106O211O174O312O798
61214E87425P478Q026Q253Q042P232N891M558L769L423L129L029L574M579N288
61200F63696N473N726O453P376Q310R667J1688J3848J5516J6608J7107J6493J4367
61187H12328J1292Q377O257M879L987L278K370J155k8r14j840l296n172o878q063
61172H27732q835r447j0073j0817j1613j2254j2655j2960j3287j3607j3989j4543
61160F83652j5038j5004j4467j3992j3784j3255j1877r884p734n473l199j505
61148E58440p17k06P05J515J108o41k654m019m722n023m910m379l640k772j596
$$ y = [567798, 563873, 559881, 555895, 551920, 548181, 544899, 542076, 539659, 537584, 535514, 532990, 530162, 527901, 526849, 526701, 526890, 527595, 529502, 532752, 536721, 540846, 545203, 550164, 555824, 561930, 568141, 574315, 580627, 587425, 594903, 602929, 611182, 619224, 626456, 632347, 636905, 640674, 644097, 647226, 650255, 653829, 658408, 663696, 669169, 674895, 681348, 688724, 697034, 706701, 718389, 732237, 747753, 764361, 781468, 797961, 812328, 823620, 831997, 838254, 843133, 847120, 850398, 852768, 853923, 853895, 852981, 851141, 847845, 842673, 835795, 827732, 818897, 809450, 799377, 788560, 776947, 764693, 752038, 739078, 725791, 712184, 698195, 683652, 668614, 653610, 639143, 625151, 611367, 598112, 586235, 576351, 568617, 563144, 559945, 558440, 557723, 557517, 558222, 559737, 560845, 560204, 557550, 553531, 548809, 543786, 538876, 534497, 530857, 528085, 526489]
61133E26489j57J107J836K126K356K954M335O655R453J1841J3323J4259J5378
61120F11955J6959J8664K0114K1363K2689K4015K4884K5062K4850K4567K4135
61109H59257K3496K3041K2912K2301K0306J7342J4711J2771J0598P594M270J025
61097A039624k583o624j0109j2380j4304j6992k0127k2583k4013k4757k4811k4115
61085H36226k3346k3137k2908k1643j9637j8158j7458j6457j4496j2240j0501
61074F36245r209p939o657n545m630l888l298k656j735o75K35J024J892K746L410
61059E99320M094N104O224O950P187P275P559Q423J0242J2726J4792J5800J6456
61046G22152J7743J9482K0872K1962K3446K5373K7158K8678L0209L1544L2237
$$ y = [526489, 526332, 527439, 529275, 531401, 533757, 536711, 541046, 547701, 557154, 568995, 582318, 596577, 611955, 628914, 647578, 667692, 689055, 711744, 735759, 760643, 785705, 810555, 835122, 859257, 882753, 905794, 928706, 951007, 971313, 988655, 1003366, 1016137, 1026735, 1034329, 1038599, 1039624, 1037041, 1030417, 1020308, 1007928, 993624, 976632, 956505, 933922, 909909, 885152, 860341, 836226, 812880, 789743, 766835, 745192, 725555, 707397, 689939, 673482, 658986, 646746, 636245, 627036, 619097, 612440, 606895, 602265, 598377, 595079, 592423, 590688, 590013, 590248, 591272, 593164, 595910, 599320, 603414, 608518, 614742, 621692, 628879, 636154, 643713, 652136, 662378, 675104, 689896, 705696, 722152, 739895, 759377, 780249, 802211, 825657, 851030, 878188, 906866, 937075, 968619, 1000856]
61035A000856L2612L3428L4704L5892L7059L8778M0945M2798M3959M4567M4686
61024A430284M4609M5360M7780N1564N6355O2944P1898Q1793R0819R9545J10136
61013B193087J23660J40622J63346J94628K34106K79262L30118L89606M59695
61004D508130N42109O43954P77840R54939J182095J461235J770828K031584K105579
60995A5978293J870570J326931O32044J3183l65228m61961l21526k0903L30838
60986A8982241N75056N47143J79754m32247j082434j579467j839365j884139j783616
60977A1682926j606483j403376j205546j026237q66883p26471o05481n03219m16667
60968C322563l43484k83511k36339j99761j71434j49951j33507j19479j06311
$$ y = [1000856, 1033468, 1066896, 1101600, 1137492, 1174551, 1213329, 1254274, 1297072, 1341031, 1385598, 1430284, 1474893, 1520253, 1568033, 1619597, 1675952, 1738896, 1810794, 1892587, 1983406, 2082951, 2193087, 2316747, 2457369, 2620715, 2815343, 3049449, 3328711, 3658829, 4048435, 4508130, 5050239, 5694193, 6472033, 7426972, 8609067, 10070302, 11841130, 13872714, 15978293, 17848863, 19175794, 19807838, 19821021, 19455793, 18993832, 18672306, 18651403, 18982241, 19557297, 20104440, 20284194, 19851947, 18769513, 17190046, 15350681, 13466542, 11682926, 10076443, 8673067, 7467521, 6441284, 5574401, 4847930, 4242449, 3739230, 3322563, 2979079, 2695568, 2459229, 2259468, 2088034, 1938083, 1804576, 1685097, 1578786]
60959A578786r4335q4000p4619o5503n6925m9215m2151l5850l1226k8908k8418
60948I87636k8761k9003k8273k6276k3954k2534k1759k0298j7904j5811j4733
60937G38330j4038j3333j3241j3958j4426j3926j3201j3027j2796j1627r927q654
60925E86176p814o854n922n594n714n583n064m589m243l755l261l218l566l659
60911E17340l147k351j681j139n71j6L49N02O19Q65J116R85K92n81j081j197j370
60894E08934j715j788j326p25m89n38l77K15R48J398J436J360J559K029K345K296
60878E15562K304K849L774M588N290O212P214P661P408P096P312P993Q847R843
60864F03953J1041J2378J3803J5213J6127J6023J5136J4410J4405J4746J4927
$$ y = [1578786, 1484451, 1400451, 1325832, 1260329, 1203404, 1154189, 1112038, 1076188, 1044962, 1016054, 987636, 958875, 929872, 901599, 875323, 851369, 828835, 807076, 786778, 768874, 753063, 738330, 724292, 710959, 697718, 683760, 669334, 655408, 642207, 629180, 616384, 604757, 594830, 586176, 578362, 571508, 565586, 559992, 554278, 548695, 543631, 539042, 534799, 531044, 527783, 524565, 520999, 517340, 514193, 511842, 510161, 509022, 508451, 508435, 508784, 509286, 509905, 510770, 511886, 512871, 513163, 512582, 511501, 510304, 508934, 507219, 505431, 504105, 503380, 502891, 502353, 501976, 502191, 503139, 504537, 505973, 507333, 508892, 510921, 513266, 515562, 517866, 520715, 524489, 529077, 534367, 540579, 547793, 555454, 562862, 569958, 577270, 585263, 594110, 603953, 614994, 627372, 641175, 656388, 672515, 688538, 703674, 718084, 732489, 747235, 762162]
60853G62162J5116J5778J6931J8118J8891J8998J8372J7143J5527J3659J1755
60842I42450J0339R706R172P518M426Q93k060m406o627q849j1020j3337j5850
60829I22355j8019j9295j9879k0379k0867k0879k0261j9453j8912j8635j8387
60818G07389j8095j7862j7717j7507j7029j6282j5411j4339j2715j0496q392p218
60806E34326o869o483n611m645l989l484k912k490k419k407k133j806j761j790
60792D85527j459q69n63p42j076j359j858k817l884m322l813k835k170k093k205
60777D53462k120k029k361l080l719m019m167m350m394m006l085j807o24j23n65
60762D13013j510k250k573k847l314l742l812l487k968k577k612k964k960k055
$$ y = [762162, 777278, 793056, 809987, 828105, 846996, 865994, 884366, 901509, 917036, 930695, 942450, 952789, 962495, 971667, 979185, 983611, 984504, 982444, 978038, 971411, 962562, 951542, 938205, 922355, 904336, 885041, 865162, 844783, 823916, 803037, 782776, 763323, 744411, 725776, 707389, 689294, 671432, 653715, 636208, 619179, 602897, 587486, 573147, 560432, 549936, 541544, 534326, 527457, 520974, 515363, 510718, 506729, 503245, 500333, 497843, 495424, 493017, 490884, 489078, 487317, 485527, 484068, 483199, 482636, 481894, 480818, 479459, 477601, 474784, 470900, 466578, 462765, 459930, 457760, 455667, 453462, 451342, 449313, 446952, 443872, 440153, 436134, 431967, 427617, 423223, 419217, 416132, 414325, 413701, 413578, 413013, 411503, 409253, 406680, 403833, 400519, 396777, 392965, 389478, 386510, 383933, 381321, 378357, 375397, 373342]
60748C73342o20M63R13J194J579J770J589J307J062N82k43j100j797k462k980
60733C74599k863k023r88j13Q01J629J535J37j616k482k364k014j702j131m18
60718C60987k86j090k290l108l290l172l231l658m148m177l567k671j893j318
60704C23088j027j300k142k858k665j592m19J67N5m82j016j077m51N34J203J133
60688C11151N09r5k15J50O68J176J857K677L027K417J418J187J998K952L250L026
60672C37153K712K371K089K195K625K698K103J500J505J749J632J377J518J850
60658C65077J834J688K075K890L325L097K807K994L530L971L935L220K079J279
60644D03801J226J180Q4j965l819m826n400n989o363o246n877n476m777l507k001
$$ y = [373342, 372722, 373185, 374098, 375292, 376871, 378641, 380230, 381537, 382599, 383181, 382938, 381838, 380041, 377579, 374599, 371736, 369713, 368725, 368612, 369413, 371042, 372577, 372714, 371098, 368616, 366252, 364238, 362536, 361405, 360987, 360701, 359611, 357321, 354213, 350923, 347751, 344520, 340862, 336714, 332537, 328970, 326299, 324406, 323088, 322061, 320761, 318619, 315761, 313096, 311504, 311085, 311252, 311307, 310825, 309809, 308732, 308281, 308815, 310018, 311151, 311660, 311565, 311350, 311500, 312168, 313344, 315201, 317878, 320905, 323322, 324740, 325927, 327925, 330877, 334127, 337153, 339865, 342236, 344325, 346520, 349145, 351843, 353946, 355446, 356951, 358700, 360332, 361709, 363227, 365077, 366911, 368599, 370674, 373564, 376889, 379986, 382793, 385787, 389317, 393288, 397223, 400443, 402522, 403801, 405027, 406207, 406291, 404326, 400507, 395681, 390281, 384292, 377929, 371683, 365806, 360330, 355553, 352046, 350045]
60629C50045r31p10j314k314k972k754j971j491j631j752j173j6J103J776J891
60614C35786J458P11J19j10j97k13K59J434K547K496J171l21r42p60n27o16p26
60597C41569m56K43J132J921K360K338K076J974K134K183J816J266R10O05j08
60582C61963j144j812j708j210q06m32J88R01J350J583K054L056M481O043P484
60567C81991Q639R516J0222J0698J0714J0235R510Q620P274N239K680j54l096
60554D72088n653o991o822n911n162m508l361j699nJ600L382N263O787P827Q654
60539D65489R395J0032J0836J2056J3128J3002J1386Q921O119K899n54l400n043
60526E54266n719n739m935l444k328k528l521l832k771j010L94R55P79K90J19
$$ y = [350045, 349114, 348404, 347090, 344776, 341804, 339050, 337079, 335588, 333957, 332205, 331032, 331016, 332119, 333895, 335786, 337244, 337955, 338074, 337964, 337767, 337554, 337813, 339247, 341794, 344290, 345461, 345140, 344198, 343438, 342911, 342295, 341569, 341113, 341356, 342488, 344409, 346769, 349107, 351183, 353157, 355291, 357474, 359290, 360556, 361466, 362071, 361963, 360819, 359007, 357299, 356089, 355283, 354851, 355039, 355940, 357290, 358873, 360927, 363983, 368464, 374507, 381991, 390630, 400146, 410368, 421066, 431780, 442015, 451525, 460145, 467419, 472658, 475338, 475184, 472088, 466435, 459444, 452622, 446711, 441549, 437041, 433680, 431981, 431976, 433576, 436958, 442221, 449008, 456835, 465489, 474884, 484916, 495752, 507808, 520936, 533938, 545324, 554245, 560364, 563263, 562709, 559309, 554266, 548547, 542808, 537873, 534429, 532101, 529573, 526052, 522220, 519449, 518439, 518833, 519788, 520567, 520857, 520976]
60511E20976P03J727K288J915J176J110K190M110O438R110J2172J5350J8280K1105
60497F18650K4404K8398L2452L5730L8100L9938M1131M0754L7928L2616K5329
60486I95430J6376N814o017j8174k9384l8397m4245m6618m6145m4100m1461l8357
60474F64722l4585l0485k6902k4224k1939j9419j6765j4494j2665j0932r324q307
60462D34681p924p445o222m448k860k032k097k740l211k887k150k160l359m697
60448C80449m885l957k916k286j777j136n52j94oJ7j59l17k70k45n58j028j264
60431C58916j343j522j537r54j79j23p99j102l35Q81J584J652J498J297J050J011
60415C59995J411K029K444K513K272J661P55k6k59K6M73Q06Q99O90L11O5P1J50
$$ y = [520976, 521679, 523406, 525694, 527609, 528785, 529895, 532085, 536195, 542633, 551743, 563915, 579265, 597545, 618650, 643054, 671452, 703904, 739634, 777734, 817672, 858803, 899557, 937485, 970101, 995430, 1011806, 1017620, 1011603, 993429, 964045, 925648, 881403, 834785, 788640, 744540, 703079, 664722, 630137, 599652, 572750, 548526, 526587, 507168, 490403, 475909, 463244, 452312, 442988, 434681, 426757, 419312, 413090, 408642, 405782, 403750, 401653, 398913, 395702, 392815, 390665, 388505, 385146, 380449, 375564, 371607, 368691, 366405, 364628, 363492, 362940, 362746, 362740, 362757, 362598, 362281, 362011, 361766, 361208, 360180, 358916, 357573, 356051, 354514, 353560, 353381, 353258, 352459, 351357, 351022, 351903, 353487, 355139, 356637, 357934, 358984, 359995, 361406, 363435, 365879, 368392, 370664, 372325, 373080, 373054, 372795, 372821, 373294, 374100, 374999, 375689, 376000, 376065, 376136, 376286]
60397C76286J98L69O97R10R19J124J836K632K748K062J214Q27R58J341J810K290
60381C98221K636K660K352J863J339Q84P00J077J965K724K725K175J897K066J843
60366D27127O77n83o89K58R91Q76N89Q27J363J696J877K123K322K452K949M034
60350D48889N134N606N699O140O977P505P198O072M238J765q37k654l249l140
60336D95343l120l382l594l606l648l799l722l163k482k298k688l103l126k904
60322D50708k692k386j892j466j270r29j06P68J068J009J330K027K373K338K940
60307D53820M780P129R146J1218J4207J7834K0717K1825K1174J9210J6156J2083
60295F29299P065J179n337j1770j7058k0296k1104j9755j7148j4431j2276j0582
$$ y = [376286, 376484, 376853, 377550, 378460, 379379, 380503, 382339, 384971, 387719, 389781, 390995, 391822, 392780, 394121, 395931, 398221, 400857, 403517, 405869, 407732, 409071, 409955, 410655, 411732, 413697, 416421, 419146, 421321, 423218, 425284, 427127, 427804, 427221, 426532, 426790, 427781, 428657, 429246, 430073, 431436, 433132, 435009, 437132, 439454, 441906, 444855, 448889, 454023, 459629, 465328, 471468, 478445, 485950, 493148, 499220, 503458, 505223, 504386, 501732, 498483, 495343, 492223, 488841, 485247, 481641, 477993, 474194, 470472, 467309, 464827, 462529, 459841, 456738, 453612, 450708, 448016, 445630, 443738, 442272, 441002, 440073, 439967, 440735, 441803, 442812, 444142, 446169, 448542, 450880, 453820, 458600, 465729, 474875, 486093, 500300, 518134, 538851, 560676, 581850, 601060, 617216, 629299, 636364, 637543, 632206, 620436, 603378, 583082, 561978, 542223, 525075, 510644, 498368, 487786]
60283D87786r051p753o892o297n654m985m477l999l305k619k452k810l097k931
60269D21464k594k465k472k347k060j695j193o00l16o31j160j184o37k34m47p70
60253D00659m28M66J028Q07L05J78M63Q27J126J296J081L82l64o29m71l46l92
60236D05988l96k70n2M05J176J814J833J607K071L330M379M413L710K936K234
60221D35178J512J046J201J885K753L624M319M503M104L641L670M175M793N357
60207D81761N785N803N262M472L840L372K961K827L209L806M064L855L459K962
60193E37438K139Q98m88j596k042j673q82n29j164k373l243l328k925k561k604
60178E15067l156l924m309l991l358k927k563j691k88Q81J071K90q56j756k155
$$ y = [487786, 478735, 470982, 464090, 457793, 452139, 447154, 442677, 438678, 435373, 432754, 430302, 427492, 424395, 421464, 418870, 416405, 413933, 411586, 409526, 407831, 406638, 406038, 405722, 405091, 403931, 402747, 402110, 401876, 401429, 400659, 400231, 400697, 401725, 402532, 402837, 403015, 403478, 404305, 405431, 406727, 407808, 408190, 407826, 407197, 406726, 406380, 405988, 405592, 405322, 405270, 405675, 406851, 408665, 410498, 412105, 414176, 417506, 421885, 426298, 430008, 432944, 435178, 436690, 437736, 438937, 440822, 443575, 447199, 451518, 456021, 460125, 463766, 467436, 471611, 476404, 481761, 487546, 493349, 498611, 503083, 506923, 510295, 513256, 516083, 519292, 523098, 527162, 531017, 534476, 537438, 539577, 540475, 539987, 538391, 536349, 534676, 533794, 533265, 532101, 529728, 526485, 523157, 520232, 517671, 515067, 511911, 507987, 503678, 499687, 496329, 493402, 490839, 489148, 488860, 489741, 490812, 491102, 490246, 488490, 486335]
60163D86335k172k040j787j232m41R0J2l21j95N79J525K085K033J412M98j16J61
60146D86426J356K806L764L952L598L147K983L289M045N090O114O610O204N129
60132E44513M087L430K779J734N55k27o46j164j847k201j898j197n51j50N5J49
60116E47421K25L42M16K73j18n32o86m76j29j65r96k399l559l815l275k543k077
60099E27907j971k127k343k328j924j275o41j34K20M05N44Q71J366J700J786K072
60083E24128K966M201N011M844L679J984N61j3j25q65k678m681n839o230o532
60068E20411o712o151m892l828l588l942m380m628m506l945l305l135l442l661
60054D60296l455l043k678k269j673q91J46J478K753L457L641L914M536N033M928
$$ y = [486335, 484163, 482123, 480336, 479104, 478663, 478753, 478765, 478444, 478249, 478828, 480353, 482438, 484471, 485883, 486381, 486265, 486426, 487782, 490588, 494352, 498304, 501902, 505049, 508032, 511321, 515366, 520456, 526570, 533180, 539384, 544513, 548600, 552030, 554809, 556543, 557098, 556871, 556225, 555061, 553214, 551013, 549115, 547918, 547367, 547217, 547272, 547421, 547646, 547988, 548404, 548677, 548559, 548027, 547341, 546865, 546736, 546571, 545575, 543176, 539617, 535802, 532527, 529984, 527907, 525936, 523809, 521466, 519138, 517214, 515939, 515298, 515164, 515384, 515789, 516333, 517204, 518570, 520270, 522056, 524128, 527094, 531295, 536306, 541150, 544829, 546813, 547374, 547361, 547236, 546371, 543693, 539012, 533173, 526943, 520411, 513699, 507548, 502656, 498828, 495240, 491298, 486918, 482290, 477784, 473839, 470534, 467399, 463957, 460296, 456841, 453798, 451120, 448851, 447178, 446287, 446433, 447911, 450664, 454121, 457762, 461676, 466212, 471245, 476173]
60039D76173M397L908L657L504L141K183N47j079j701j185n55q44k052l535m871
60024D81688n940o558o645o592o887p460p723p277o278n200m427m036l712k988
60010C99965j790o03K%j41J0M76R17R02L05m42o77k96P5q9m11j28Q10J665J981
59990D02531K178K790L609M043L990L808L506K674J299Q4l81l24k95m27o85j327
59974D27073k441l292l003j819q94p66q63o65m12l26q8L23K57m84r11j84R68J213
59956D13686N69L14J074K136K654K630K551K721L114L355K861J515R0o09p45r21
59940D36995j020n93j50p78k339l279k693j509j065j433j803j747j349p28j42
59925D16367qk50j30O85J478J539J260J397J795J784J505J788K766L631L885L929
$$ y = [476173, 480570, 484478, 488135, 491639, 494780, 496963, 497510, 496431, 494730, 493545, 492990, 492146, 490094, 486559, 481688, 475748, 469190, 462545, 455953, 449066, 441606, 433883, 426606, 420328, 415128, 410701, 406665, 402953, 399965, 398175, 397572, 397574, 397574, 397433, 397443, 397919, 398836, 399738, 400043, 399601, 398924, 398628, 398703, 398614, 398203, 398075, 398885, 400550, 402531, 404709, 407499, 411108, 415151, 419141, 422949, 426455, 429129, 430428, 430512, 430131, 429807, 429512, 429085, 428400, 427073, 424632, 421340, 418337, 416518, 415624, 414858, 413995, 413330, 412918, 412592, 412504, 412827, 413084, 412600, 411689, 411505, 412473, 413686, 414255, 414569, 415643, 417779, 420433, 423063, 425614, 428335, 431449, 434804, 437665, 439180, 439270, 438661, 437916, 436995, 435975, 435382, 435232, 434454, 432115, 428836, 426143, 424634, 423569, 422136, 420333, 418586, 417237, 416509, 416367, 416359, 416109, 415979, 416664, 418142, 419681, 420941, 422338, 424133, 425917, 427422, 429210, 431976, 435607, 439492, 443421]
59909D43421M220M556M649M724N043N242M781L730K639J717P21l36r60r08o30
59894D82609n70m00M39J569J879J071L28R18K597L967M141L455K740K479K677
59879E09899L008L019K615K293K548L050K895J691l5j580k775l853m956n972o560
59864E05287o365n427m237l188k218j333j015j425j555j86K422M665N607N936
59850D96968O712Q090R558J0573J0506Q780N662K354j71j837k648k083o3K135
59836E54536K805J440j115l739n686o563o440n879n352m784m004l322l168l432
59822E05297l705l852l917l765l369l187l570m020l693k595j586j224j155p95
59808D64864l3Q57J621K063K017J449N56l50r99j321j533j928k489k858k799k498
$$ y = [443421, 447641, 452197, 456846, 461570, 466613, 471855, 476636, 480366, 483005, 484722, 485443, 485107, 484147, 483239, 482609, 482039, 481639, 482078, 483647, 485526, 486597, 486925, 487843, 490440, 494407, 498548, 502003, 504743, 507222, 509899, 512907, 515926, 518541, 520834, 523382, 526432, 529327, 531018, 530983, 529403, 526628, 522775, 517819, 511847, 505287, 498922, 493495, 489258, 486070, 483852, 482519, 481504, 480079, 478524, 478338, 480760, 485425, 491032, 496968, 503680, 511770, 521328, 531901, 542407, 551187, 556849, 559203, 559032, 557195, 554547, 552464, 552401, 554536, 557341, 558781, 557666, 553927, 548241, 541678, 535238, 529359, 524007, 519223, 515219, 511897, 508729, 505297, 501592, 497740, 493823, 490058, 486689, 483502, 479932, 475912, 472219, 469624, 468038, 466814, 465659, 464864, 464831, 465688, 467309, 469372, 471389, 472838, 473394, 473044, 472045, 470724, 469191, 467263, 464774, 461916, 459117, 456619]
59792D56619k259k167k235k544k964l105k813k453k364k347k041j541j179r38
59778D25669o30m47q01j556j939j340M5J438K141K018J503J158J141J210J269
59763D30879J580K252K780K563J685Q82P02J050J501J813K073K473L042L601M000
59748D62876M265M372M081L335K626K480K635K372J698J380J688J930J668J486
59734D98892J923K436K253J663J483J674J581J229J372K195K947K993K457J687
59720E26785Q48J89M7K84L72J94J85M56N28K00N8N46J155J096M76J34N09J218
59702E35280J756K045K214K236J976J437Q35N93J142K438L543L189J071j563l032
59687E55160k858j938j188o07J48R15J182P96k0j113k354l368l825l905m023m190
$$ y = [456619, 454360, 452193, 449958, 447414, 444450, 441345, 438532, 436079, 433715, 431368, 429327, 427786, 426607, 425669, 425039, 424592, 423791, 422235, 420296, 418956, 419001, 420439, 422580, 424598, 426101, 427259, 428400, 429610, 430879, 432459, 434711, 437491, 440054, 441739, 442621, 443323, 444373, 445874, 447687, 449760, 452233, 455275, 458876, 462876, 467141, 471513, 475594, 478929, 481555, 484035, 486670, 489042, 490740, 492120, 493808, 495738, 497406, 498892, 500815, 503251, 505504, 507167, 508650, 510324, 511905, 513134, 514506, 516701, 519648, 522641, 525098, 526785, 527633, 527822, 527869, 528153, 528525, 528719, 528904, 529360, 529888, 530088, 530146, 530692, 531847, 532943, 533419, 533553, 534062, 535280, 537036, 539081, 541295, 543531, 545507, 546944, 547779, 548372, 549514, 551952, 555495, 558684, 559755, 558192, 555160, 552302, 550364, 549176, 548569, 548717, 549632, 550814, 551610, 551590, 550477, 548123, 544755, 540930, 537025, 533002, 528812]
59671E28812m208m227m507m726m346l618l361l669l705l022k157j592j069l93
59657D84212m8l22n59p4Q34J499J921K393K638K247J592J330J258O03o47j617
59641D97260j851j915k468l284l556k884j701q45p18q57n51J58N22K00k64l94
59625D76852n44j145j801j858j418j104j107j177j300j663k141k424k536k610
59611D54024k407j635n45L39Q80J232J386J358J435J689J611Q84N0l00m69r72
59595D58560j409j076j93N29J140J970K284R91j259k277j158M95P45l89j597k177
59579D55179k362k436k476k660l118l606l696l167k098q20J09L10N0m9J68K92
59563D29620J12j15k35m34p48q44n30m6L27N42O21O45R14J651K521K951K940K997
$$ y = [528812, 524604, 520377, 515870, 511144, 506798, 503180, 499819, 496150, 492445, 489423, 487266, 485674, 484605, 484212, 484164, 483842, 483283, 483209, 484043, 485542, 487463, 489856, 492494, 494741, 496333, 497663, 498921, 499524, 498877, 497260, 495409, 493494, 491026, 487742, 484186, 481302, 479601, 478756, 478038, 477181, 476630, 476788, 477310, 477510, 477246, 476852, 476308, 475163, 473362, 471504, 470086, 468982, 467875, 466698, 465398, 463735, 461594, 459170, 456634, 454024, 451617, 449982, 449437, 449776, 450656, 451888, 453274, 454632, 456067, 457756, 459367, 460251, 460301, 460001, 459532, 458560, 457151, 456075, 455882, 456411, 457551, 459521, 461805, 462796, 461537, 459260, 458102, 458597, 459342, 458953, 457356, 455179, 452817, 450381, 447905, 445245, 442127, 438521, 434825, 431658, 429560, 428740, 428849, 429159, 429209, 429160, 429328, 429620, 429732, 429617, 429382, 428948, 428200, 427356, 426826, 426780, 427107, 427649, 428270, 428915, 429829, 431480, 434001, 436952, 439892, 442889]
59545D42889L353L815M378N273O409P474Q772J1198J5041J9165K1442J9878J3782
59532E82869M723l869r004j0223q996o590l585r12M32R14K065M050N083L951J710
59517E62618J0j011k059l085l662m194n348o780p594p789q107q637q618p660o297
59502D81787n145m236l330k473j967j973k227k166j582r80q93r27j82J321K464
59487D57491K530K010J571J148O35N67J332K385L048L522M311N336O297P334Q404
59472E07921Q616P213M844K836J587O43k6k1M03M56J08K40J271K652L887N138
59456E47768O478P381P501P325P547Q196Q849R329R817J0381J0683J0071P896
59443F59222M012q65n524r124j1589j3175j3847j3302j1490r006o876n843n758
$$ y = [442889, 446242, 450057, 454435, 459708, 466117, 473591, 482363, 493561, 508602, 527767, 549209, 569087, 582869, 587592, 583723, 574719, 564496, 555500, 548910, 545325, 544413, 544845, 545759, 547824, 551874, 556957, 560908, 562618, 562628, 561617, 559558, 556473, 552811, 548617, 543269, 536489, 528895, 521106, 512999, 504362, 495744, 488084, 481787, 476642, 472406, 469076, 466603, 464636, 462663, 460436, 458270, 456688, 455708, 454815, 453888, 453706, 455027, 457491, 460021, 462031, 463602, 464750, 465385, 465952, 467284, 469669, 472717, 476239, 480550, 485886, 492183, 499517, 507921, 516537, 523750, 528594, 531430, 533017, 533660, 533634, 533613, 534016, 534472, 534580, 534820, 536091, 538743, 542630, 547768, 554246, 561627, 569128, 576453, 584000, 592196, 601045, 610374, 620191, 630572, 641255, 651326, 659222, 663234, 662369, 656845, 647721, 636132, 622957, 609110, 595808, 584318, 575312, 568436, 562593, 556835]
59430E56835n797n376m680m150l665k584n36K074M495O367P947R661J1594J3505
59416E85690J5215J6778J8324K0122K2657K5813K7526K4282J4381N47j1832j9235
59404G40268k1903k1525j8731j3525o677M78O812J0924J0717M851n326j6178k4116
59391F46069k7331k6087k2299j8491j6047j4354j2167r456p200n720m335k648
59379D79934j219o44n86j82R47K313L056K820K198K163K909L691L975M144M648
59364E10167N122N005M559M467M782N174N775O909Q141Q670Q645R131J0582J2234
59350F09363J3293J3937J4741J5747J6547J6956J7124J7243J7241J6687J5058
59339G83937J2314R138O244L611P88k219m953p267r460j1637j3500j4863j5861
$$ y = [556835, 551038, 545662, 540982, 536832, 533167, 530583, 530047, 532121, 536616, 542983, 550930, 560591, 572185, 585690, 600905, 617683, 636007, 656129, 678786, 704599, 732125, 756407, 770788, 771335, 759503, 740268, 718365, 696840, 678109, 664584, 657907, 658385, 665197, 676121, 686838, 691689, 686363, 670185, 646069, 618738, 592651, 570352, 551861, 535814, 521460, 509293, 499837, 492637, 486917, 482582, 479934, 478715, 478071, 477485, 477303, 478250, 480563, 483619, 486439, 488637, 490800, 493709, 497400, 501375, 505519, 510167, 515289, 520294, 524853, 529320, 534102, 539276, 545051, 551960, 560101, 568771, 577416, 586547, 597129, 609363, 622656, 636593, 651334, 667081, 683628, 700584, 717708, 734951, 752192, 768879, 783937, 796251, 805389, 811633, 815244, 816032, 813813, 808860, 801593, 792133, 780496, 766996, 752133, 736272]
59326G36272j6481j6365j5360j3931j2822j2428j2522j2443j1610j0041q262o636
59314E87371n098l674k753k367j780m28J179K262L067M470O545Q571J0491J3071
59300F20927J6269J8290J6970J1727L941m059j0172j3468j4510j4517j3980j2482
59288F04936r964p422n866n081m027k300o25J26O2J74J188K714L756M059M516
59273E86246N956P934R271R487R087Q561P895P104O500O050N099L131M80k073
59259F70728m120n786p261q493r225r280q839q442q469q649q348p352o095n085
59245E65284m354l576k517j272j13Q40J787K912L961M501M685N130N864O005M998
59230E94135L519K420J400l79k746m696n881o869p885q398q122p545p110o677
$$ y = [736272, 719791, 703426, 688066, 674135, 661313, 648885, 636363, 623920, 612310, 602269, 594007, 587371, 582273, 578599, 575846, 573479, 571699, 571271, 572450, 574712, 577779, 582249, 588794, 597365, 607856, 620927, 637196, 655486, 672456, 684183, 688124, 684065, 673893, 660425, 645915, 631398, 617418, 604936, 594972, 587550, 581684, 576603, 572576, 570276, 569651, 569777, 569839, 570013, 571201, 573915, 577671, 581730, 586246, 592202, 600136, 609407, 618894, 627981, 636542, 644437, 651541, 658041, 664091, 669190, 672321, 672801, 670728, 666608, 660822, 653561, 645068, 635843, 626563, 617724, 609282, 600813, 592164, 583816, 576464, 570369, 565284, 560930, 557354, 554837, 553565, 553452, 554292, 556079, 558991, 562952, 567453, 572138, 577268, 583132, 589137, 594135, 597654, 600074, 601474, 601095, 598349, 593653, 587772, 580903, 573018, 564620, 556498, 548953, 541843, 535166]
59216E35166o049n241m078k289l15Q29Q25M47L40K26j80l30L70J547K333K500
59200E26101K422K275J950J520J213J008P00L44K90P78J758K895L692L775L308
59185E54029K887K886L129L303L334L194K756K071J479J205J162J272J604J989
59171E86300J998J619J551K385L865N316O479P454Q131Q219P712O841N685M205
59157F57760K581J107k41j690l135m109m475m772n592o772p476p130o070n117
59143F04869m712m626m485m246m050l928l932m273m995n579n286l959k242r34
59129E47622l45k51l35n40r53j347j078K01J806K620K575K830M114N674O506O820
59113E75919P444Q271Q534Q283Q375Q958R130Q338P105O072N279M719M666M988
$$ y = [535166, 529117, 523876, 519798, 517509, 517194, 518023, 518848, 519295, 519635, 519861, 519681, 519351, 519721, 521268, 523601, 526101, 528523, 530798, 532748, 534268, 535481, 536489, 537189, 537533, 537823, 538601, 540359, 543254, 546946, 550721, 554029, 556916, 559802, 562931, 566234, 569568, 572762, 575518, 577589, 579068, 580273, 581435, 582707, 584311, 586300, 588298, 589917, 591468, 593853, 597718, 603034, 609513, 616967, 625098, 633317, 641029, 647870, 653555, 657760, 660341, 661448, 661207, 659517, 656382, 652273, 647798, 643026, 637434, 630662, 623186, 616056, 609986, 604869, 600157, 595531, 591046, 586800, 582750, 578822, 574890, 570617, 565622, 560043, 554757, 550798, 548556, 547622, 547277, 547026, 546691, 546151, 545198, 543851, 542773, 542974, 544780, 547400, 549975, 552805, 556919, 562593, 569099, 575919, 583363, 591634, 600168, 608451, 616826, 625784, 634914, 643252, 650357, 656429, 661708, 666427, 671093, 676081]
59099F76081M879L864K405J079j84j603k878l632l990m158l870k804j289j21J16
59084F63895o34k008l353m126m411m688n053n186n222n853p179q164p883o784
59070E93351o025o007o196o094n613m740l554k585k451l050l552l382k799k398
59056E34905k353k379k252k012j720j249n58qo6o11r64p64m19l81m22j78P0j32
59038E18507m83k60N40J248J657K123K575K381J565J170J986L641N331O744P826
59023E56551Q316Q148P791P764Q102Q562Q871Q598P421N748M446L654K594Q77
59009F47443p96j686k003k220k135j287J85J802L407N037O478P477Q028Q097P499
58994F85326O420N500N004M471L603K776K186J241n50k700m439n728o784p253
$$ y = [676081, 680960, 684824, 687229, 688308, 688124, 686521, 683643, 680011, 676021, 671863, 667993, 665189, 663900, 663779, 663895, 663261, 661253, 657900, 653774, 649363, 644675, 639622, 634436, 629214, 623361, 616182, 608018, 600135, 593351, 587326, 581319, 575123, 569029, 563416, 558676, 555122, 552537, 550086, 547036, 543484, 540102, 537303, 534905, 532552, 530173, 527921, 525909, 524189, 522940, 522382, 522374, 522308, 521697, 520733, 519969, 519550, 519169, 518747, 518569, 518639, 518507, 518024, 517764, 518304, 519552, 521209, 523332, 525907, 528288, 529853, 531023, 533009, 536650, 541981, 548725, 556551, 564867, 573015, 580806, 588570, 596672, 605234, 614105, 622703, 630124, 635872, 640318, 643972, 646566, 647443, 646647, 644961, 642958, 640738, 638603, 637316, 637501, 639303, 642710, 647747, 654225, 661702, 669730, 677827, 685326, 691746, 697246, 702250, 706721, 710324, 713100, 715286, 716527, 715977, 713277, 708838, 703110, 696326, 689073]
58980F89073o685n398m029k589p37J273K812L775M625N645O811Q103R400J0244
58966G22323J0370J0216J0381J0790J0925J0615J0073R349Q308O925N195L058
58954H28528O99j537l822o825j0470j3461j4723j4678j4376j4022j3194j1926
58942G10193j0554q967p021n312m550m475m361m214m432m693m333l596l350l596
58928F36739l467k668j853j439j136q04p20p80m10M69J290J835K560L591M299
58913F37506M270L957M013M578N506O692P902Q784R349R916J0503J0834J0999
58900G34809J1372J1746J1300R743P897O779O589O846P059P085P376Q910J2263
58887H49774J6554J9954K1486K1716K1436K0444J8143J4658J0730O873L145m28
$$ y = [689073, 682388, 676990, 672961, 670372, 669635, 670908, 673720, 677495, 682120, 687765, 694576, 702679, 712079, 722323, 732693, 742909, 753290, 764080, 775005, 785620, 795693, 805042, 813350, 820275, 825470, 828528, 829227, 827690, 823868, 817043, 806573, 793112, 778389, 763711, 749335, 735313, 722119, 710193, 699639, 690672, 683651, 678339, 673789, 669314, 664953, 660739, 656307, 651614, 647281, 643685, 640335, 636739, 633272, 630604, 628751, 627312, 626176, 625372, 624652, 623872, 623462, 623931, 625221, 627056, 629616, 633207, 637506, 641776, 645733, 649746, 654324, 659830, 666522, 674424, 683208, 692557, 702473, 712976, 723810, 734809, 746181, 757927, 769227, 778970, 786867, 793646, 800235, 807081, 814140, 821225, 828601, 837511, 849774, 866328, 886282, 907768, 929484, 950920, 971364, 989507, 1004165, 1014895, 1021768, 1024913, 1024485]
58875A024485l785o985j0096j2939j5249j6924j7943j8165j7507j6264j5020j4181
58863H59427j3630j2947j1962j1025j0600j0729j1166j1889j2936j3703j3224
58852G25616j1543j0083r945j0444j0189r061q097p736p359o635o197o629p608
58839F14090q475q904q733p706n955m250l325l217l464l646l518k919j928r31
58825E47119l14j22K9O25J821L160M006M327M721N496O174O274O018N737N084
58810F00155L578J630J62n34q35r26p24n12p70j415j944k298k768l241l377l478
58794E82703m171n223n658n218m640m262l443j794k7J065J625K205K818L206L485
58779E62671L936M490M916N193N381N358M982M129K468k90l636o275p327p171
$$ y = [1024485, 1020700, 1013715, 1003619, 990680, 975431, 958507, 940564, 922399, 904892, 888628, 873608, 859427, 845797, 832850, 820888, 809863, 799263, 788534, 777368, 765479, 752543, 738840, 725616, 714073, 703990, 694045, 683601, 673412, 664351, 656254, 648518, 641159, 634524, 628327, 621698, 614090, 605615, 596711, 587978, 580272, 574317, 570067, 566742, 563525, 560061, 556415, 552897, 549978, 548050, 547119, 546805, 546683, 546712, 547337, 549158, 552318, 556324, 560651, 565372, 570868, 577042, 583316, 589334, 595071, 600155, 603733, 605363, 605525, 604991, 604156, 603230, 602506, 601994, 601224, 599809, 597865, 595567, 592799, 589558, 586181, 582703, 578532, 573309, 567651, 562433, 557793, 553531, 550088, 548294, 548267, 549332, 550957, 553162, 555980, 559186, 562671, 566607, 571097, 576013, 581206, 586587, 591945, 596927, 601056, 603524, 603234, 599598, 593323, 585996, 578825]
58765E78825o772o528o148n408m635m411m968n735n655m196k034l90K34L24N07
58750E23010R40J475J902K024J932K091K765L513L851M185N255O764P455O753
58736E73915N448M535M160M004M031M339M741M958M971M974N180N697O288O393
58722F43634N787M958M437M056L494L133L524M308M714M867N471O346O547N911
58708G11187N147M257K372m94k986m392n675p771j0086j1681j2849j4344j5890
58695F36795j6600j6337j5617j4603j3111j1280r503p972o852o399o421o126n181
58682E00793m338m317m656m419l548k641j863r60k7N83J006J708K717L665M459
58667D88162N377O588Q121J0057J2184J3631J3474J1705R053O036K662r35m171
$$ y = [578825, 572053, 565525, 559377, 553969, 549334, 544923, 539955, 534220, 528565, 524369, 522335, 521945, 522179, 522503, 523010, 523950, 525425, 527327, 529351, 531283, 533374, 536139, 539652, 543503, 547688, 552943, 559707, 567162, 573915, 579363, 583898, 588058, 592062, 596093, 600432, 605173, 610131, 615102, 620076, 625256, 630953, 637241, 643634, 649421, 654379, 658816, 662872, 666366, 669499, 673023, 677331, 682045, 686912, 692383, 698729, 705276, 711187, 716334, 720591, 722963, 722469, 719483, 715091, 709416, 701645, 691559, 679878, 667029, 652685, 636795, 620195, 603858, 588241, 573638, 560527, 549247, 539744, 531772, 524920, 518521, 512100, 505974, 500793, 496455, 492138, 487482, 483063, 479515, 476874, 475011, 474051, 474024, 474607, 475613, 477321, 480038, 483703, 488162, 493539, 500127, 508248, 518305, 530489, 544120, 557594, 569299, 578352, 584388, 587050, 586115, 581944]
58654E81944o443p582p833p631p382p245p067o618n838m801l635k543j701j061
58640E04564l96L61J011J326J214P82M84Q99J986K859K830K397K413K621K020
58625E27371O36k54J45J196K037K640L227L602L730M235N525P009P810P817P520
58610E84246P169O559N330L245O11j480k031j458j255k128l245l654l523l490
58596E84896l671l866l985l720k633j056p0M8M56K142M573O641Q075R101R585
58581F06516R501R511J0014J0234R277P549O156N367M771M468M946N981O799P257
58567G08347Q008R507J1629J4129J6780J9050K0453K1160K1685K1981K1432J9690
58555I13851J6941J3453R378N056J055k143m303n377n548n256m951m946n466o573
$$ y = [581944, 575501, 567919, 560086, 552455, 545073, 537828, 530761, 524143, 518305, 513504, 509869, 507326, 505625, 504564, 504168, 504529, 505540, 506866, 508080, 508862, 509346, 510245, 512231, 515090, 517920, 520317, 522730, 525351, 527371, 528007, 527753, 527898, 529094, 531131, 533771, 536998, 540600, 544330, 548565, 554090, 561099, 568909, 576726, 584246, 591415, 597974, 603304, 606549, 607160, 605680, 603649, 602191, 600936, 598808, 595563, 591909, 588386, 584896, 581225, 577359, 573374, 569654, 567021, 565965, 565895, 565943, 566399, 568541, 573114, 579755, 587830, 596931, 606516, 616017, 625528, 635542, 645776, 655053, 662602, 668758, 674125, 678896, 683364, 688310, 694291, 701090, 708347, 716355, 725862, 737491, 751620, 768400, 787450, 807903, 829063, 850748, 872729, 894161, 913851, 930792, 944245, 953623, 958679, 959734, 957591, 953288, 947911, 942363, 937107, 932156, 927210, 921744, 915171]
58541I15171q011r518j1268j3521j5883j7573j8396j8718j8480j7182j5002j2900
58529G38719j1303r644p602n709m280k799r83N40J271J676K263K762K855K862
58515G10628K968K703J899J237J123R58L13k71m33r29k310l701m074l863m116
58500G02132m766m990m637m137l586k895k361k096j509k68Q95J281J448K220L258
58485F79989L704L653L922M843O283Q251J0530J2335J3248J3787J4189J3624J1591
58472G99949R107P178N152K002j618m131n184n527n435m694l626k663j410N41
58458G89641K450L539M474O281Q359R265Q939Q511Q302P679O564N495M305K327
58444H76131l42l096n929q919j1087j1360j0314r347q494o712m016j637j53R72
$$ y = [915171, 907160, 897642, 886374, 872853, 856970, 839397, 821001, 802283, 783803, 766621, 751619, 738719, 727416, 717772, 710170, 704461, 700181, 697382, 696399, 696939, 698210, 699886, 702149, 704911, 707766, 710628, 713596, 716299, 718198, 719435, 720558, 721516, 721829, 721558, 721125, 720196, 717886, 714185, 710111, 706248, 702132, 697366, 692376, 687739, 683602, 680016, 677121, 674760, 672664, 671155, 670887, 671782, 673063, 674511, 676731, 679989, 683693, 687346, 691268, 696111, 702394, 710645, 721175, 733510, 746758, 760545, 774734, 788358, 799949, 809056, 816234, 821386, 823388, 821770, 817639, 812455, 806928, 801493, 796799, 793173, 790510, 789100, 789641, 792091, 795630, 800104, 806385, 814744, 824009, 832948, 841459, 849761, 857440, 864004, 869499, 873804, 876131, 875789, 872693, 866764, 857845, 846758, 835398, 825084, 815737, 807243, 800531, 796515, 794878, 794725, 795697]
58430G95697K129L303M835P026R183J0460J1315J2655J3974J3940J2473J0556
58418I07546Q424N590K442n1j914l787n268n484n009n269o240o708o570o843p413
58403H63446o965n328l803k941j937m99O03J259K326L895M956N194N371N647N258
58388H76482M210L581L691L602K846K107J816J616J472J878K663L100L310M094
58374I16468N319N983N945O003O318O393O496P360Q594R141R177R685J0458J0572
58360A023912J0577J1849J3863J4574J3606J2592J2108J0845Q317N893M445L271
58348A145852J999J485K118L227M593O624Q714R549R380R755J0865J1525J1890
58335A237576J3463J6101J7798J8072J8686K0223K0906J9743J8091J6942J5420
$$ y = [795697, 797826, 801129, 805964, 812990, 822173, 832633, 843948, 856603, 870577, 884517, 896990, 907546, 915970, 921560, 924002, 923951, 922037, 918250, 912982, 907498, 902489, 897220, 890980, 884272, 877702, 870859, 863446, 856481, 851153, 847350, 844409, 842472, 841973, 842576, 843835, 846161, 850056, 855012, 860206, 865577, 871224, 876482, 880692, 884273, 887964, 891566, 894412, 896519, 898335, 899951, 901423, 903301, 905964, 909064, 912374, 916468, 921787, 927770, 933715, 939718, 946036, 952429, 958925, 966285, 974879, 984020, 993197, 1002882, 1013340, 1023912, 1034489, 1046338, 1060201, 1074775, 1088381, 1100973, 1113081, 1123926, 1132243, 1138136, 1142581, 1145852, 1147851, 1149336, 1151454, 1154681, 1159274, 1165898, 1174612, 1184161, 1193541, 1203296, 1214161, 1225686, 1237576, 1251039, 1267140, 1284938, 1303010, 1321696, 1341919, 1362825, 1382568, 1400659, 1417601, 1433021]
58324A433021J3180J1614J1267J0571Q593O803O722P850R158J0578J1882J2210
58312A553449J1755J1967J3214J4346J5115J6648J8862K0112K0125K0602K2060
58301A738255K2971K2870K3269K4436K4459K2845K1860K2800K3991K4136K4524
58290A996416K6185K7794K8334K9029L0810L2508L3394L4801L7455L9791M0699
58279B357216M1283M2384M3068M3149M4313M7068M9417N0229N0969N2612N3891
58268B875599N4237N5310N7905O0422O2012O4061O7169O9996P2390P5938Q0132
58257C595171Q2139Q1775Q2384Q5183Q7478Q8238R0325R4925R9089J01489J05334
58246D593530J12576J20435J26750J33633J42461J50608J56682J63721J73590
$$ y = [1433021, 1446201, 1457815, 1469082, 1479653, 1488246, 1495049, 1501771, 1509621, 1518779, 1529357, 1541239, 1553449, 1565204, 1577171, 1590385, 1604731, 1619846, 1636494, 1655356, 1675468, 1695593, 1716195, 1738255, 1761226, 1784096, 1807365, 1831801, 1856260, 1879105, 1900965, 1923765, 1947756, 1971892, 1996416, 2022601, 2050395, 2078729, 2107758, 2138568, 2171076, 2204470, 2239271, 2276726, 2316517, 2357216, 2398499, 2440883, 2483951, 2527100, 2571413, 2618481, 2667898, 2718127, 2769096, 2821708, 2875599, 2929836, 2985146, 3043051, 3103473, 3165485, 3229546, 3296715, 3366711, 3439101, 3515039, 3595171, 3677310, 3759085, 3841469, 3926652, 4014130, 4102368, 4192693, 4287618, 4386707, 4488196, 4593530, 4706106, 4826541, 4953291, 5086924, 5229385, 5379993, 5536675, 5700396, 5873986]
58237E873986J83588J92079K01850K14180K25753K35496K48004K65701K84100
58228G924737K99749L16227L37112L59902L82450M08350M39990M73485N06650
58219A1448652N44682N91440O42906O96090P56196Q27669R06926R91981J090133
58210A8496675J207741J342024J492091J667647J877091K118781K395578K726449
58202C3324077L132305L623966M216494M938325N809157O825561P988304R329717
58194G9187906J0900774J2761199J5012309J7812818K1319214K5598351L0529183
58187B13121754L5571507L9422060M0009942L5314197K4713644R781062o286084
58180C91648082k0205534k9943053l5070642l6316000l4890908l1974608k8437897
$$ y = [5873986, 6057574, 6249653, 6451503, 6665683, 6891436, 7126932, 7374936, 7640637, 7924737, 8224486, 8540713, 8877825, 9237727, 9620177, 10028527, 10468517, 10942002, 11448652, 11993334, 12584774, 13227680, 13923770, 14679966, 15507635, 16414561, 17406542, 18496675, 19704416, 21046440, 22538531, 24206178, 26083269, 28202050, 30597628, 33324077, 36456382, 40080348, 44296842, 49235167, 55044324, 61869885, 69858189, 79187906, 90088680, 102849879, 117862188, 135675006, 156994220, 182592571, 213121754, 248693261, 288115321, 328125263, 363439460, 388153104, 397934166, 391648082, 371442548, 341499495, 306428853, 270112853, 235221945, 203247337, 174809440]
58173A74809440k4794577k1309979j8127388j5318926j2894581j0830403r099414
58166F2434172p668863o488516n506027m687689m011203l449618k977305k582038
58158B5062913k256429j984614j749776j547328j378341j235985j109511r96005
58150A2804924q97407q10664p30519o57774n95682n41809m91523m45768m07838
58141G225940l76146l47326l22827l05297k91583k76059k58206k40985k24646
58132D582865k07912j92324j79796j68409j55742j43588j34619j27290j18905
58123C154280j10729j05221j01071r5772r0376q7012q4335q0083p5490p2625o9987
58112B181579o5311o0233n7544n6243n3764n0865m9726m9339m7353m4589m3240
$$ y = [174809440, 150014863, 128704884, 110577496, 95258570, 82363989, 71533586, 62434172, 54765309, 48276793, 42770766, 38083077, 34071874, 30622256, 27644951, 25062913, 22806484, 20821870, 19072094, 17524766, 16146425, 14910440, 13800929, 12804924, 11907517, 11096853, 10366334, 9708560, 9112878, 8571069, 8079546, 7633778, 7225940, 6849794, 6502468, 6179641, 5874344, 5582761, 5306702, 5048496, 4807511, 4582865, 4374953, 4182629, 4002833, 3834424, 3678682, 3535094, 3400475, 3273185, 3154280, 3043551, 2938330, 2837259, 2741487, 2651111, 2564099, 2479764, 2399681, 2324191, 2251566, 2181579, 2116268, 2056035, 1998491, 1942248, 1888484, 1837619, 1787893, 1738554, 1691201, 1646612, 1603372]
58101A603372m2377l9636l5784l3401l2449l1153k9779k9646k9856k8811k7506
58090A242974k7591k7659k5391k1874j9954j9577j8657j7266j7105j7857j7866
58079A012177j7536j8419j9817j9842j8964j8945j9218j7868j5501j4426j4649
58068H16992j4173j2766j1961j1731j0627q944q453r044q817p467o626o912p420
58055F92051q040r487j1095j1245j0015q921q249p037n492m855n083n020m690
58042E92822n043n769n694n032m969n378n297n136n993p187p112o145o135p293
58028E10639q168q419q950r465q689p002o156o262n679m089l071l236l300k569
58014D25584j992k212k664l044l764m449l948k215m84O35J559K207J933J089Q09
$$ y = [1603372, 1560995, 1521359, 1485575, 1452174, 1419725, 1388572, 1358793, 1329147, 1299291, 1270480, 1242974, 1215383, 1187724, 1162333, 1140459, 1120505, 1100928, 1082271, 1065005, 1047900, 1030043, 1012177, 994641, 976222, 956405, 936563, 917599, 898654, 879436, 861568, 846067, 831641, 816992, 802819, 790053, 778092, 766361, 755734, 746790, 738337, 729293, 720476, 713009, 706383, 699471, 692051, 684011, 674524, 663429, 652184, 642169, 633248, 624999, 617962, 612470, 607615, 602532, 597512, 592822, 587779, 582010, 576316, 571284, 566315, 560937, 555640, 550504, 544511, 537324, 530212, 524067, 517932, 510639, 502471, 494052, 485102, 475637, 466948, 459946, 453790, 447528, 441849, 437760, 434689, 431453, 428153, 425584, 423592, 421380, 418716, 415672, 411908, 407459, 403511, 401296, 400812, 401447, 403006, 405213, 407146, 408235, 409044]
57999D09044J146J175Q67J004J387J061K76J75O08L21p95j705k365l614n040n253
57983C98292m388l932m006l313j907j403j992k005j074r94k455l586k982j834
57969C62421j598j690j059j95Qn1L43Q14P55M88N08N43K62n5k84q10j485j427
57951C57488m34N46R50J320J997K424K346K382K834L161L270L903N218O349O932
57936D00686P638Q584Q786P874O825O148M875K352m73k622m547o930r105r966
57922D20125r467q295o909n755n535o373p445q045q176p736o346m477l384l208
57908C28974k477l13K191L690M360M965N355N078M420L692K474O13r18j226p13
57893C60165j33O29J888L105L577L421L046K439J766J684K139J881K16j706k476
$$ y = [409044, 410190, 411365, 412232, 413236, 414623, 415684, 415960, 416135, 416743, 417064, 416269, 414564, 412199, 408585, 403545, 398292, 393904, 389972, 385966, 382653, 380746, 379343, 377351, 375346, 374272, 373278, 370823, 367237, 364255, 362421, 360823, 359133, 358074, 357879, 357887, 357836, 358179, 358993, 359748, 360236, 360744, 361287, 361549, 361494, 361210, 360400, 358915, 357488, 357054, 357600, 358550, 359870, 361867, 364291, 366637, 369019, 371853, 375014, 378284, 382187, 387405, 393754, 400686, 408324, 416908, 425694, 433568, 440393, 446541, 451416, 453768, 453295, 450673, 446126, 439196, 430091, 420125, 410658, 402363, 395454, 389699, 384164, 377791, 370346, 362301, 354125, 346389, 340043, 335566, 332182, 328974, 326497, 326184, 328375, 332065, 336425, 341390, 346745, 351823, 356243, 359935, 362409, 363022, 362104, 360878, 360165, 360032, 360661, 362549, 365654, 369231, 372652, 375698, 378137, 379903, 381587, 383726, 385607, 385823, 384117, 381641]
57878C81641k334k379k770l025l344m238n388o068o276o313n812m366k633j671
57864C25024j536j542j447j372j051l05K13q0m50K91J884K912K809K438K554K863
57848C33205K879K755K875L177L230K653J385j64j328j775j793j824k021k372
57834C40882k763k691j596J37J192R14K20K83J019J632K035K736L680M227M179
57819C56086M096M541N539O680P331O839N021K382l65k756m542n638o271o646
57805C72297o392n020l023j644j296j181q43r28j763k449k249j869k207k787k608
57790C36038j899j643j906j848j159l17L73R93J409J415J364J829K758L621M223
57775C45251M718N119N364N543N526M870L664K759K497J956L72j498k479k755
$$ y = [381641, 379307, 376928, 374158, 371133, 367789, 363551, 358163, 352095, 345819, 339506, 333694, 329328, 326695, 325024, 323488, 321946, 320499, 319127, 318076, 317771, 317984, 317904, 317454, 317745, 319629, 322541, 325350, 327788, 330342, 333205, 336084, 338839, 341714, 344891, 348121, 350774, 352159, 351995, 350667, 348892, 347099, 345275, 343254, 340882, 338119, 335428, 333832, 333969, 335161, 336075, 336295, 336578, 337597, 339229, 341264, 344000, 347680, 351907, 356086, 360182, 364723, 370262, 376942, 384273, 391112, 396133, 398515, 398150, 395394, 390852, 385214, 378943, 372297, 365905, 360885, 357862, 356218, 354922, 353741, 352898, 351970, 350207, 347758, 345509, 343640, 341433, 338646, 336038, 334139, 332496, 330590, 328742, 327583, 327266, 327639, 328632, 330041, 331456, 332820, 334649, 337407, 341028, 345251, 349969, 355088, 360452, 365995, 371521, 376391, 380055, 382814, 385311, 387267, 387639, 386141, 383662, 380907]
57761C80907l284m005m044l339k722k546k465k471k826l065k321p58M67P93P62
57746C49083Q02O43K11J32Q08J704J881R60n69j629j385j61P95Q44O56Q17O58
57729C56250m84j743j854j170r81j230p12O30J448J269J176J775K186J754J243
57714C59557J490K107K381K419K480K177J204Q1o04j006j354j235k91J009J992
57699C72407K659L304L841M159M557N138N181L834J197j780m166n523n853n596
57685C83359n320n090m451l188j633r7J452K931M062N141P060J0080J3293J5927
57671D23526J8540K2239K7309L3378M0296M7663N3422N3951M6224L0069Q660j2930
57659G92347l0113m0672m4908m4317m0468l4983k9583k5318k1914j8428j4562
$$ y = [380907, 377623, 373618, 369574, 366235, 363513, 360967, 358502, 356031, 353205, 350140, 347819, 347061, 347528, 348321, 349083, 349885, 350528, 350739, 350871, 351679, 353383, 355264, 356224, 355655, 354026, 352641, 352480, 353275, 354119, 354775, 355592, 356250, 355766, 354023, 352169, 350999, 350018, 348788, 348076, 348706, 350154, 351423, 352599, 354374, 356560, 358314, 359557, 361047, 363154, 365535, 367954, 370434, 372611, 373815, 373896, 373292, 372286, 370932, 369697, 369406, 370415, 372407, 375066, 378370, 382211, 386370, 390927, 396065, 401246, 405080, 406277, 404497, 400331, 394808, 388955, 383359, 378039, 372949, 368498, 365310, 363677, 363580, 365032, 367963, 372025, 377166, 384226, 394306, 407599, 423526, 442066, 464305, 491614, 524992, 565288, 612951, 666373, 720324, 766548, 796617, 805277, 792347, 762234, 721562, 676654, 632337, 591869, 556886, 527303, 501985, 480071, 461643, 447081]
57648D47081j0948q301o650n447m193k884j934j590j517j186n26O4L99O57R40
57633D03965J148J375J904K584K821K355J616J079P27L96Q1l16r72j578j443m58
57617D15284O31J286J807K411K514J652N29K15P62J425J919K517L067K999K318
57602D41336J704J514J450J400J750K483K782K108J137Q91J295J409R24N80Q87
57587D63650J208O99k86n00N16J822K275J793J045N24L77P00J349J727J426Q79
57571D79204P83J025R94P70J055J906K445K193J870K331L408M313M611M351L734
57556E14993L177L199L793M299M339M335M681M976M723M285M279M435L905K642
57542E72061J629J679K600L640M256M321M066L904M083M421M604M608M575M449
$$ y = [447081, 436133, 427832, 421182, 415735, 411542, 408658, 406724, 405134, 403617, 402431, 401905, 401969, 402368, 403025, 403965, 405113, 406488, 408392, 410976, 413797, 416152, 417768, 418847, 419574, 419970, 420051, 419735, 418763, 417185, 415742, 415284, 415915, 417201, 419008, 421419, 423933, 425585, 426114, 426329, 427091, 428516, 430435, 432952, 436019, 439018, 441336, 443040, 444554, 446004, 447404, 449154, 451637, 454419, 456527, 457664, 458555, 459850, 461259, 462183, 462763, 463650, 464858, 465557, 465271, 464771, 465287, 467109, 469384, 471177, 472222, 472746, 473123, 473823, 475172, 476899, 478325, 479204, 479987, 481012, 482006, 482776, 483831, 485737, 488182, 490375, 492245, 494576, 497984, 502297, 506908, 511259, 514993, 518170, 521369, 525162, 529461, 533800, 538135, 542816, 547792, 552515, 556800, 561079, 565514, 569419, 572061, 573690, 575369, 577969, 581609, 585865, 590186, 594252, 598156, 602239, 606660, 611264, 615872, 620447, 624896]
57528F24896M144L893L988M240M187L815L608L845M263M530M681M941N386N887
57514F86304O231O226N910N629N736O219O773P182P403P375O987O323N633N080
57500G75011M692M557M785N193N284M762M023L900M752N902O247N503M536M238
57486H43385M410M293L883L985M895N892O352O616P212P815P788P283P031P120
57472I27960O877N984N084N003N857P125Q227Q806Q733Q205P722P749Q303Q961
57458A030596R271R164Q952Q880Q784Q380P780P501P814Q439Q929R182R361R567
57444A152600R769R915J0034J0294J0881J1600J1788J1087J0192J0143J0876J1278
57432A280457J0866J0534J1111J2045J2366J2184J2335J2881J3090J2705J2331
$$ y = [624896, 629040, 632933, 636921, 641161, 645348, 649163, 652771, 656616, 660879, 665409, 670090, 675031, 680417, 686304, 692535, 698761, 704671, 710300, 716036, 722255, 729028, 736210, 743613, 750988, 757975, 764298, 769931, 775011, 779703, 784260, 789045, 794238, 799522, 804284, 808307, 812207, 816959, 822861, 829108, 834611, 839147, 843385, 847795, 852088, 855971, 859956, 864851, 870743, 877095, 883711, 890923, 898738, 906526, 913809, 920840, 927960, 934837, 940821, 945905, 950908, 956765, 963890, 972117, 980923, 989656, 997861, 1005583, 1013332, 1021635, 1030596, 1039867, 1049031, 1057983, 1066863, 1075647, 1084027, 1091807, 1099308, 1107122, 1115561, 1124490, 1133672, 1143033, 1152600, 1162369, 1172284, 1182318, 1192612, 1203493, 1215093, 1226881, 1237968, 1248160, 1258303, 1269179, 1280457, 1291323, 1301857, 1312968, 1325013, 1337379, 1349563, 1361898, 1374779, 1387869, 1400574, 1412905]
57421A412905J2469J2933J3296J3345J3000J2381J2017J2413J3363J4142J4370
57410A556634J4257J4045J3857J4017J4808J5780J5976J5156J4205J4040J4541
57399A717316J5023J5260J5569J6059J6370J6240J5996J6211J6942J7622J7829
57388A896437J7918J8534J9566K0202K0131J9970K0184K0233J9506J8543J8457
57377B109681J9411K0474K0941K0962K0938K1016K1280K1748K2084K1945K1715
57366B342195K2173K3316K4196K4129K3425K2717K2224K1983K2135K2549K2741
57355B593783K2559K2489K2883K3323K3288K3011K3169K3936K4879K5667K6433
57344B855420K7390K8361K8905K8839K8584K8747K9279K9406K8712K7942K8079
$$ y = [1412905, 1425374, 1438307, 1451603, 1464948, 1477948, 1490329, 1502346, 1514759, 1528122, 1542264, 1556634, 1570891, 1584936, 1598793, 1612810, 1627618, 1643398, 1659374, 1674530, 1688735, 1702775, 1717316, 1732339, 1747599, 1763168, 1779227, 1795597, 1811837, 1827833, 1844044, 1860986, 1878608, 1896437, 1914355, 1932889, 1952455, 1972657, 1992788, 2012758, 2032942, 2053175, 2072681, 2091224, 2109681, 2129092, 2149566, 2170507, 2191469, 2212407, 2233423, 2254703, 2276451, 2298535, 2320480, 2342195, 2364368, 2387684, 2411880, 2436009, 2459434, 2482151, 2504375, 2526358, 2548493, 2571042, 2593783, 2616342, 2638831, 2661714, 2685037, 2708325, 2731336, 2754505, 2778441, 2803320, 2828987, 2855420, 2882810, 2911171, 2940076, 2968915, 2997499, 3026246, 3055525, 3084931, 3113643, 3141585, 3169664]
57333C169664K8897K9251K8718K8037K7784K7592K7125K6860K7200K7619K7426
57322C476173K6927K6934K7513K8055K8322K8667K9229K9666K9716K9502K9208
57311C789912K8958K9041K9753L0890L1837L2257L2403L2652L2995L3185L3111
57300D136994L2899L2753L2792L3003L3366L3987L4950L6008L6696L6888L7005
57289D517341L7388L7794L7785L7420L7133L7113L7248L7587L8345L9382M0145
57278D934681M0316M0191M0229M0479M0657M0643M0597M0644M0596M0138L9241
57267E378412L8400L8227L8760L9227L8761L7288L5555L4332L3775L3588L3483
57256E779808L3305L2914L2282L1636L1236L1001L0615L0115L0008L0607L1446
$$ y = [3169664, 3198561, 3227812, 3256530, 3284567, 3312351, 3339943, 3367068, 3393928, 3421128, 3448747, 3476173, 3503100, 3530034, 3557547, 3585602, 3613924, 3642591, 3671820, 3701486, 3731202, 3760704, 3789912, 3818870, 3847911, 3877664, 3908554, 3940391, 3972648, 4005051, 4037703, 4070698, 4103883, 4136994, 4169893, 4202646, 4235438, 4268441, 4301807, 4335794, 4370744, 4406752, 4443448, 4480336, 4517341, 4554729, 4592523, 4630308, 4667728, 4704861, 4741974, 4779222, 4816809, 4855154, 4894536, 4934681, 4974997, 5015188, 5055417, 5095896, 5136553, 5177196, 5217793, 5258437, 5299033, 5339171, 5378412, 5416812, 5455039, 5493799, 5533026, 5571787, 5609075, 5644630, 5678962, 5712737, 5746325, 5779808, 5813113, 5846027, 5878309, 5909945, 5941181, 5972182, 6002797, 6032912, 6062920, 6093527, 6124973]
57245F124973L1790L1574L1345L1289L0937L0084K9415K9612L0258L0237K9095
57234F460609K7349K5566K3729K1644J9365J7030J4741J2772J1500J0906J0545
57223F655756J0145R858R746R509R050Q866R464J0625J1641J2135J2377J2869
57211F782041J3834J4988J5757J5812J5486J5269J5067J4355J3210J2452J2522
57200F940793J2783J2442J1559J0549R192O962M072J408n56k070l456m783o272
57187F992623q271j0622j2720j4397j6280j8934k2089k5014k7336k9230l1043
57176F776687l3045l5286l7505l9360m0899m2514m4275m5719m6580m7341m8568
57165F315595m9993n0784n0618m9906m8923m7369m5037m2392m0083l8159l6191
$$ y = [6124973, 6156763, 6188337, 6219682, 6250971, 6281908, 6311992, 6341407, 6371019, 6401277, 6431514, 6460609, 6487958, 6513524, 6537253, 6558897, 6578262, 6595292, 6610033, 6622805, 6634305, 6645211, 6655756, 6665901, 6675759, 6685505, 6695014, 6704064, 6712930, 6722394, 6733019, 6744660, 6756795, 6769172, 6782041, 6795875, 6810863, 6826620, 6842432, 6857918, 6873187, 6888254, 6902609, 6915819, 6928271, 6940793, 6953576, 6966018, 6977577, 6988126, 6997318, 7004280, 7008352, 7009760, 7009204, 7007134, 7003678, 6998895, 6992623, 6984352, 6973730, 6961010, 6946613, 6930333, 6911399, 6889310, 6864296, 6836960, 6807730, 6776687, 6743642, 6708356, 6670851, 6631491, 6590592, 6548078, 6503803, 6458084, 6411504, 6364163, 6315595, 6265602, 6214818, 6164200, 6114294, 6065371, 6018002, 5972965, 5930573, 5890490, 5852331, 5816140]
57154E816140l3963l1576k9094k6560k4379k3136k2909k3154k3552k4582k6939
57143E526296l0660l5036l9245m2756m5365m7115m8193m8584m7942m5931m2605
57132E052864l8376l3772k9462k6085k3797k2221k1108k0632k0608j9956j7698
57121D779149j4302j1109q486n404q73M990J1613J8794K6520L4683M3542N4076
57109D933193O7316Q3761J03742J27935J57202J92413K34854K86444L49085M24414
57099F960359N14785O24051P56543R15184J100872J313348J551880J815087K100638
57090A7652747K405043K722750L044335L354696L632466L851097L981226L993642
57082D4638002L862680L570999L115734K513045J796754J010970K01828n87284
$$ y = [5816140, 5782177, 5750601, 5721507, 5694947, 5670568, 5647432, 5624523, 5601369, 5577817, 5553235, 5526296, 5495636, 5460600, 5421355, 5378599, 5333234, 5286119, 5237926, 5189342, 5141400, 5095469, 5052864, 5014488, 4980716, 4951254, 4925169, 4901372, 4879151, 4858043, 4837411, 4816803, 4796847, 4779149, 4764847, 4753738, 4745252, 4739848, 4738975, 4743965, 4755578, 4774372, 4800892, 4835575, 4879117, 4933193, 5000509, 5084270, 5188012, 5315947, 5473149, 5665562, 5900416, 6186860, 6535945, 6960359, 7475144, 8099195, 8855738, 9770922, 10871794, 12185142, 13737022, 15552109, 17652747, 20057790, 22780540, 25824875, 29179571, 32812037, 36663134, 40644360, 44638002, 48500682, 52071681, 55187415, 57700460, 59497214, 60508184, 60710012, 60122728]
57074F0122728j318164j961235k499387k928350l252124l476695l606114l642710
57066C7437949l590433l458707l263395l023775k758157k481855k207643j945997
57058A4707987j704058j485146j289973j118170r68677q39668p28971o34477n53965
57049E384882m84970m25314l73563l28719k89771k55807k26238k00417j77432
57040B622651j56631j38183j22532j09397r7755q6702p5740o4307n1761l7910
57030A681733k2788n713J3836L2932M3536L6757J0522k7256o3875r0016j03240
57019A506428j05676j00688r1644q1616p2528o4735n7785n1310m5142l9279l4100
57008G61925l0093k7115k4535k2247k0785k0087j9096j7185j5115j3872j3209
$$ y = [60122728, 58804564, 56843329, 54343942, 51415592, 48163468, 44686773, 41080659, 37437949, 33847516, 30388809, 27125414, 24101639, 21343482, 18861627, 16653984, 14707987, 13003929, 11518783, 10228810, 9110640, 8141963, 7302295, 6573324, 5938847, 5384882, 4899912, 4474598, 4101035, 3772316, 3482545, 3226738, 3000500, 2800083, 2622651, 2466020, 2327837, 2205305, 2095908, 1998153, 1911451, 1835711, 1771404, 1719643, 1681733, 1658945, 1653232, 1667068, 1700000, 1743536, 1780293, 1790815, 1763559, 1699684, 1609668, 1506428, 1400752, 1300064, 1208420, 1126804, 1054276, 989541, 931756, 880446, 835304, 796025, 761925, 731832, 704717, 680182, 657935, 637150, 617063, 597967, 580782, 565667, 551795, 538586]
56997E38586j2266j1002j0012r277q229o873n825n191m262k477NK791N707Q608
56983D80283J1160J2761J2356Q744J857o312j2951j6743j8393j8994j8744j7506
56971D17518j5644j3745j2002j0296q553o616m186j255J654M060O180Q751J2340
56958C78206J6876K1465K4452K3943J8876R906p92j0641j7840k1798k2833k1705
56946C98115j9402j6947j4894j2971j0562p616m685k065N21L301O123R075J2795
56933C40788J7637K3018K7927L1426L2128K8128J8635N500p759j8361k5287k8668
56921D45112k9339k8687k7759k6313k3601j9968j6712j4428j2474j0307q329p109
56909B20086o525o053n313m166k834j970j957k092j286L65J563J564J156J472
$$ y = [538586, 526320, 515318, 505306, 496029, 487800, 480927, 475102, 469911, 465649, 463172, 463177, 465968, 471675, 480283, 491443, 504204, 516560, 525304, 527161, 520849, 507898, 491155, 472762, 453768, 435024, 417518, 401874, 388129, 376127, 365831, 357278, 350662, 346476, 345221, 346875, 350935, 357115, 365866, 378206, 395082, 416547, 440999, 464942, 483818, 493724, 492932, 482291, 464451, 442653, 419820, 398115, 378713, 361766, 346872, 333901, 323339, 315723, 311038, 308973, 309494, 312795, 318918, 327993, 340788, 358425, 381443, 409370, 440796, 472924, 501052, 519687, 525187, 517428, 499067, 473780, 445112, 415773, 387086, 359327, 333014, 309413, 289445, 272733, 258305, 245831, 235524, 227195, 220086, 213561, 207508, 202195, 198029, 195195, 193225, 191268, 189176, 187890, 188255, 189818, 191382, 192538, 194010]
56895A94010K637L997N137O160P385R065J1165J3346J5422J7696K0115K1384J9778
56882C47297J4961Q279J221n374j0608j3361j3484j2252j0933r503p307m270r03
56869B83763K377N376Q011J0578J3724J7742K2344K7308L2854L8856M4043M6264
56857E53240M3343L4033J9065J612j4142k5450l1873l4045l2642k8746k3976j9378
56845D41041j4754r553l777K266Q340J4021J8976K3972L0657L9797N0495O1423
56833F62904P1327P7437P5072O0949L6762Q267j8828m1147n6805o4654o5167o0892
56821F85225n4894m8786m2451l5324k7602k0209j3773p845j408O010J4079K2365
56809D75387L0635L8484M5204M9881N0745M4798K9902P997j4998l3375m5107n0951
$$ y = [194010, 196647, 200644, 205781, 211941, 219326, 228391, 239556, 252902, 268324, 286020, 306135, 327519, 347297, 362258, 370537, 371758, 366384, 355776, 342415, 328931, 316679, 305746, 296243, 288936, 284666, 283763, 286140, 291516, 299527, 310105, 323829, 341571, 363915, 391223, 424077, 462933, 506976, 553240, 596583, 630616, 649681, 651293, 637151, 611701, 579828, 545783, 513141, 484395, 460419, 441041, 426287, 416734, 412957, 415223, 423563, 437584, 456560, 480532, 511189, 550986, 601481, 662904, 734231, 811668, 886740, 947689, 984451, 992718, 973890, 932743, 875938, 811284, 746117, 685225, 630331, 581545, 539094, 503770, 476168, 455959, 442186, 434341, 432933, 438943, 453022, 475387, 506022, 544506, 589710, 639591, 690336, 735134, 765036, 773033, 758035, 724660, 679553, 628602]
56797F28602n1910m8849m3345l7087l0725k4409j8842j4626j1110p185k866J071
56785C38719M643Q697J3647J9247K5085L0072L1781K7899J8531O140o642j8104
56773D99715k6828l1706l2989l2154l0309k7597k4256k1099j8567j6263j3862
56762B24085j1671r997q641p374o265n272m194l240k988l529m215m471m272l716
56748A44240k741j549o98m82n73n01j37L83Q40R44O14J72l0p2k14l24j45P3j55
56729A39645p63j168j016m02N05J453K007K024J998K282K276J277j68p61k53L22
56713A49258K55j1J02M07M88L48J83J19L57R85J467J048l4n25K85J556J951J229
56695A59468L19R4N25R55R49P76R66J517J826J554J081P97M85j41p54r64r99j183
$$ y = [628602, 576692, 527843, 484498, 447411, 416686, 392277, 373435, 358809, 347699, 340514, 337648, 338719, 343362, 352059, 365706, 384953, 410038, 440110, 471891, 499790, 518321, 524461, 517819, 499715, 472887, 441181, 408192, 376038, 345729, 318132, 293876, 272777, 254210, 237947, 224085, 212414, 202417, 193776, 186402, 180137, 174865, 170671, 167431, 164443, 160914, 156699, 152228, 147956, 144240, 141499, 139950, 139252, 138770, 138197, 137696, 137559, 137942, 138782, 139726, 140340, 140512, 140482, 140410, 140196, 139872, 139727, 139800, 139645, 138882, 137714, 136698, 136296, 136801, 138254, 140261, 142285, 144283, 146565, 148841, 150118, 149950, 149189, 148936, 149258, 149513, 149502, 149604, 150011, 150499, 150847, 151030, 151149, 151506, 152491, 153958, 155006, 154972, 154447, 154732, 156288, 158239, 159468, 159787, 159881, 160406, 161361, 162310, 163086, 164052, 165569, 167395, 168949, 170030, 170827, 171312, 171171, 170417, 169453, 168454, 167271]
56677A67271j228q25m42o85j185j169p05l75q8O26J362J172Q3r06j282j302r35
56660A59387Q9J166J186K88j25N43J318J404J299J588J881J765J641J882K097
56645A77409J925J743J833J746J195P37Q29R57M65m01r23q09p4J233K575K879
56629A93319J718K0j031j299j348j464j613j918k393k644k358j758j219q03m99
56614A74710l99l32J1L27j86j566k713k778k140j486p79J37P66O49K42K70O60
56597A65393Q73Q03O63M06j8k54k5L72O17Q90J307J443J137J049J592J932J078
56580A79258m69j297j010n25m87n53l10pJ9k4L07J151K249L106L232K602J915
56563A89157K069L304N114O957Q709J0372J1638J1855J0491P666M265J392l67
$$ y = [167271, 166043, 165218, 164776, 164091, 162906, 161737, 161032, 160657, 160569, 161195, 162557, 163729, 163812, 162906, 161624, 160322, 159387, 159476, 160642, 161828, 162116, 161991, 162534, 163852, 165256, 166555, 168143, 170024, 171789, 173430, 175312, 177409, 179334, 181077, 182910, 184656, 185851, 186588, 187417, 188374, 188839, 188438, 187515, 186706, 186632, 187865, 190440, 193319, 195037, 195057, 194026, 192727, 191379, 189915, 188302, 186384, 183991, 181347, 178989, 177231, 176012, 175209, 174710, 174311, 173979, 173990, 174317, 174131, 172565, 169852, 167074, 164934, 163448, 162669, 162806, 163572, 164221, 164463, 164733, 165393, 166266, 167069, 167732, 168138, 168120, 167866, 167841, 168213, 168830, 169720, 171027, 172470, 173607, 174656, 176248, 178180, 179258, 178789, 177492, 176482, 175957, 175470, 174917, 174607, 174600, 174619, 174595, 174902, 176053, 178302, 181408, 184640, 187242, 189157, 191226, 194530, 199644, 206601, 215310, 225682, 237320, 249175, 259666, 267332, 271597, 272989, 272622]
56550B72622j105j259j327j721k384k696k324j929k399l432l805l096k181j813
56536B41151j745j640j821k482k948k578j726j114q17n87o04j126j767j961j795
56521B16440j734j769j498r15m83m68p27r81j043q89p73j030j552j797j541j188
56505A98052j075r64n68r1Q5j00n29j052j299q53K9N19L19N2J85K97o9n59o62
56486A91717n76p15q46l88O77J794K396K142J086l2k25N32J116P07j53n12k80
56469A98440R5O04J412K139K206J733J325J178J025Q10P97J083J407J460J135
56454B16849O02K52K70L01p3n29l58M05Q57M59l44q87r25m54L11O74J06p71q57
56435B15888k43Pj97J71J153J378M08k52M86J587J734J332J250J017p1j161r42
$$ y = [272622, 271517, 270258, 268931, 267210, 264826, 262130, 259806, 257877, 255478, 252046, 248241, 245145, 242964, 241151, 239406, 237766, 235945, 233463, 230515, 227937, 226211, 225097, 224280, 223693, 223089, 221963, 220196, 218235, 216440, 214706, 212937, 211439, 210524, 210041, 209573, 208846, 207865, 206822, 205933, 205160, 204130, 202578, 200781, 199240, 198052, 196977, 196013, 195445, 195354, 195439, 195339, 194810, 193758, 192459, 191606, 191635, 192154, 192473, 192525, 192710, 193007, 192938, 192379, 191717, 191141, 190426, 189580, 189192, 189869, 191663, 194059, 196201, 197287, 197255, 197030, 197562, 198678, 199385, 199232, 198720, 198440, 198535, 199139, 200551, 202690, 204896, 206629, 207954, 209132, 210157, 210967, 211764, 212847, 214254, 215714, 216849, 217451, 217703, 217973, 218274, 218201, 217672, 217314, 217719, 218576, 219035, 218691, 217804, 216879, 216425, 216736, 217410, 217516, 216745, 215888, 215645, 215652, 215455, 215626, 216779, 218157, 218565, 218313, 218799, 220386, 222120, 223452, 224702, 225719, 225648, 224487, 223545]
56418B23545K21R30Q44O80O67M77K06J11r3n75n93L46J255R20k42q96p11k66L06
56399B27132J122J576J102M18N46J048P72p8k73L58P79N34K38L17O32J146J806
56382B39175J994J343P47J229K230K484K122K226K647K129O20l91j22N84Q78R62
56366B60857J111J034O78N24O60N64Q3k72k35j10m7J43M19N62P32J159J473J237
56348B70572Q68J059J562J636J351J295J360J047P00J093J931K156J641J360J843
56333B91474K707L585M409M785M295L272K372J660J081J228K381L404L036J761
56319C31450R25N81r2q07n46M15Q37P12J110J982K124J413J054J400J542J306
56303C45406J741L140M386M703M487M087L353K609K493K621K105J439J989L527
$$ y = [223545, 223766, 224696, 225540, 226220, 226887, 227364, 227570, 227681, 227588, 227013, 226420, 226766, 228021, 228941, 228699, 227803, 227092, 226826, 227132, 228254, 229830, 230932, 231350, 231896, 232944, 233716, 233638, 233365, 233723, 234502, 235036, 235274, 235591, 236223, 237369, 239175, 241169, 242512, 243259, 244488, 246718, 249202, 251324, 253550, 256197, 258326, 258946, 258555, 258433, 259017, 259895, 260857, 261968, 263002, 263680, 264204, 264864, 265428, 265511, 265239, 265004, 264894, 264847, 264990, 265409, 265971, 266703, 267862, 269335, 270572, 271440, 272499, 274061, 275697, 277048, 278343, 279703, 280750, 281450, 282543, 284474, 286630, 288271, 289631, 291474, 294181, 297766, 302175, 306960, 311255, 314527, 316899, 318559, 319640, 320868, 323249, 326653, 329689, 331450, 332375, 332956, 332864, 332057, 331511, 331926, 332763, 333475, 334585, 336567, 338691, 340104, 341158, 342558, 344100, 345406, 347147, 350287, 354673, 359376, 363863, 367950, 371303, 373912, 376405, 379026, 381131, 382570, 384559, 388086]
56289C88086M306L850L538M028M288L870L923N103O386O941P380Q189Q631Q281
56275D66800Q046Q688R685J0441J1204J2083J2550J2680J3410J4877J5965J6243
56263F12672J6819J8499K0668K2786K5460K9096L2974L6602M0647M5644N1105
56252I52972N6737O3193P0765P8620Q6154R3803J01733J09088J15239J20524J24894
56241A973722J27207J26673J23701J18541J10311R8197Q2518O3961M2920K0266
56231B888017k453k4147m4468o2718p7787q9538r8841j05908j10105j11606j11520
56220B048926j10089j06535j01131r5444r0087q4206p7701p1893o7196o2312n6553
56209A125779n0950m6119m1130l5559l0730k7798k6347k5768k6092k6619k5735
$$ y = [388086, 392392, 396242, 399780, 403808, 408096, 411966, 415889, 420992, 427378, 434319, 441699, 449888, 458519, 466800, 474846, 483534, 493219, 503660, 514864, 526947, 539497, 552177, 565587, 580464, 596429, 612672, 629491, 647990, 668658, 691444, 716904, 746000, 778974, 815576, 856223, 901867, 952972, 1009709, 1072902, 1143667, 1222287, 1308441, 1402244, 1503977, 1613065, 1728304, 1848828, 1973722, 2100929, 2227602, 2351303, 2469844, 2580155, 2678352, 2760870, 2824831, 2867751, 2888017, 2885564, 2861417, 2816949, 2754231, 2676444, 2586906, 2488065, 2382157, 2272052, 2160446, 2048926, 1938837, 1832302, 1731171, 1635727, 1545640, 1461434, 1383733, 1311840, 1244644, 1182332, 1125779, 1074829, 1028710, 987580, 952021, 921291, 893493, 867146, 841378, 815286, 788667, 762932]
56198G62932k3220k0748j9119j7090j3958j1059r452q299o851n891n771n130l169
56185F13175j191m22j93L03M81O9K22J400K147J602J120J796K494K103J635K154
56169F28895K700K300K096L323M977N608N749O468P148O852O405P057Q372R307
56155G07257J0067J1196J2241J2916J4034J5875J7335J8151J9933K3419K6936
56144H89360K9402L2585L8234M5192N1624N8035O5669P3761Q0680Q5933Q8810
56133A539285Q7138P9968O9845O0161N2108M6182M4102M6220M9056M8440M3563
56122B166068L5539K4325J0132m011j4642k1759k7669l3640m0361m9596o1919
56111A982467p4091q2003q5152q5450q3184p7401o8960n9880n0545m0500l0957
$$ y = [762932, 739712, 718964, 699845, 682755, 668797, 657738, 648286, 639987, 633136, 627245, 621474, 616344, 613175, 611984, 611562, 611369, 611672, 612153, 612222, 612444, 613844, 615991, 617593, 618713, 620509, 623003, 625106, 626741, 628895, 631595, 633895, 635991, 639314, 644291, 649899, 655648, 662116, 669264, 676116, 682521, 689578, 697950, 707257, 717324, 728520, 740761, 753677, 767711, 783586, 800921, 819072, 839005, 862424, 889360, 918762, 951347, 989581, 1034773, 1086397, 1144432, 1210101, 1283862, 1364542, 1450475, 1539285, 1626423, 1706391, 1776236, 1836397, 1888505, 1934687, 1978789, 2025009, 2074065, 2122505, 2166068, 2201607, 2225932, 2236064, 2232053, 2217411, 2195652, 2167983, 2134343, 2093982, 2044386, 1982467, 1908376, 1826373, 1741221, 1655771, 1572587, 1495186, 1426226, 1366346, 1315801, 1275301, 1244344]
56100A244344k3659j8214j3267r124o620m791k375k08N99J249L191N214N617N495
56086A187451O690Q215Q082P068P219Q193Q533Q988J0972J3185J3480J2745J3255
56073A314076J4481J4292J3207J3645J5845J7957J9339K0483K0880K0117J9772
56062A504094K1179K2749K2670K2280K3452K4899K4737K4396K5845K7266K5990
56051A769557K3677K3802K5909K7047K7198K8408L0251L0971L1592L3939L6289
56040B088640L5930L4416L5180L7582L8556L8504M0130M3018M4794M6210M9525
56029B532485N3427N5110N5802N8488O1919O2845O2348O3729O5998O6059O5615
56018C203825O8883P4870P9031Q1232Q4977Q9937R2758R4276R8440J04842J09599
$$ y = [1244344, 1220685, 1202471, 1189204, 1180080, 1173460, 1168669, 1166294, 1166086, 1166685, 1167934, 1171125, 1176339, 1181956, 1187451, 1194141, 1202356, 1210438, 1217506, 1224725, 1232918, 1241451, 1250439, 1261411, 1274596, 1288076, 1300821, 1314076, 1328557, 1342849, 1356056, 1369701, 1385546, 1403503, 1422842, 1443325, 1464205, 1484322, 1504094, 1525273, 1548022, 1570692, 1592972, 1616424, 1641323, 1666060, 1690456, 1716301, 1743567, 1769557, 1793234, 1817036, 1842945, 1869992, 1897190, 1925598, 1955849, 1986820, 2018412, 2052351, 2088640, 2124570, 2158986, 2194166, 2231748, 2270304, 2308808, 2348938, 2391956, 2436750, 2482960, 2532485, 2585912, 2641022, 2696824, 2755312, 2817231, 2880076, 2942424, 3006153, 3072151, 3138210, 3203825, 3272708, 3347578, 3426609, 3507841, 3592818, 3682755, 3775513, 3869789, 3968229, 4073071, 4182670]
56007D182670J12849J18072J24955J30331J35056J42467J51403J58353J64912
55998E421068J75020J86787J95535K02847K13587K26210K35837K44602K58604
55989G360097K76626K92815L08388L29230L53946L76566L99236M29304M65483
55980A0591691N00440N35578N79087O30778O83754P39799Q07415Q85917R68140
55971A6922599J057755J166442J295229J437495J599267J796542K034231K309839
55963B9619399K636735L040195L532379M117128M816168N659368O650913P780554
55955F7852839R070421J0578691J2367076J4516054J7171102K0511701K4644806
55948A76712690K9504055L4675123L9037124M0558308L6919541K6997473J2074302
$$ y = [4182670, 4295519, 4413591, 4538546, 4668877, 4803933, 4946400, 5097803, 5256156, 5421068, 5596088, 5782875, 5978410, 6181257, 6394844, 6621054, 6856891, 7101493, 7360097, 7636723, 7929538, 8237926, 8567156, 8921102, 9297668, 9696904, 10126208, 10591691, 11092131, 11627709, 12206796, 12837574, 13521328, 14261127, 15068542, 15954459, 16922599, 17980354, 19146796, 20442025, 21879520, 23478787, 25275329, 27309560, 29619399, 32256134, 35296329, 38828708, 42945836, 47762004, 53421372, 60072285, 67852839, 76923260, 87501951, 99869027, 114385081, 131556183, 152067884, 176712690, 206216745, 240891868, 279928992, 320487300, 357406841, 384404314, 396478616]
55941C96478616m488264j8998526k9155620l4534319l5964548l4700799l1919120
55934B06717420k8499433k4962669k1554322j8401736j5594267j3165789j1091879
55927G3447325r337198p877449o675079n675006m836698m143151l573714l095587
55919B8233443k687257k344945k060216j813527j594586j407907j253077j118091
55911A3953837r96303q92169q05962p29103o58283n98921n51137n06773m63374
55902G751812m27152l99156l71829l42313l16295k95730k75053k52461k33203
55893D838620k18720k03665j86472j72165j61983j50705j36808j25128j17017
55884C365957j08033r7949r2952r4865r7656r7561r7428r8098r4965q6653p8596
$$ y = [396478616, 391990352, 372991826, 343836206, 309301887, 273337339, 238636540, 206717420, 178217987, 153255318, 131700996, 113299260, 97704993, 84539204, 73447325, 64110127, 56232678, 49557599, 43882593, 39045895, 34902744, 31329030, 28233443, 25546186, 23201241, 21141025, 19327498, 17732912, 16325005, 15071928, 13953837, 12957534, 12065365, 11259403, 10530300, 9872017, 9273096, 8721959, 8215186, 7751812, 7324660, 6925504, 6553675, 6211362, 5895067, 5599337, 5324284, 5071823, 4838620, 4619900, 4416235, 4229763, 4057598, 3895615, 3744910, 3608102, 3482974, 3365957, 3257924, 3159975, 3067023, 2972158, 2874502, 2776941, 2679513, 2581415, 2486450, 2399797, 2321201]
55873B321201p4375p1345o7909o6957o8736o8240o3408n8707n7090n5411n1236
55862A617787m7284m5392m2759l7819l3824l2924l2412l0204k8486k8722k8477
55851A229484k6439k5314k6568k7403k5982k4741k5468k5956k4469k2977k3027
55840I51140k2808k1087j9671j9497j8564j6151j4731j5280j5135j2946j1216
55829G64054j1429j1168q836o820p079p796p297p253r012j0643j0649j0923j2998
55816F42151j4850j4385j2841j1884j0539p862n526m944m696l414k370k652k593
55803E43595o02K081L850N271O967P615O352M643L664K355m0k148l106m251o242
55788E70004p366o579n467n270n001m434n772r947j4301j6326j6857j7275j6547
$$ y = [2321201, 2246826, 2175481, 2107572, 2040615, 1971879, 1903639, 1840231, 1781524, 1724434, 1669023, 1617787, 1570503, 1525111, 1482352, 1444533, 1410709, 1377785, 1345373, 1315169, 1286683, 1257961, 1229484, 1203045, 1177731, 1151163, 1123760, 1097778, 1073037, 1047569, 1021613, 997144, 974167, 951140, 928332, 907245, 887574, 868077, 849513, 833362, 818631, 803351, 788216, 775270, 764054, 752625, 741457, 732621, 725801, 718722, 710926, 703629, 696376, 687364, 676721, 666072, 655149, 642151, 627301, 612916, 600075, 588191, 577652, 569790, 564264, 559320, 554624, 551210, 548840, 546188, 543595, 542993, 545074, 548924, 554195, 561162, 568777, 575129, 579772, 583436, 585791, 585751, 583603, 580497, 576246, 570004, 562638, 556059, 550592, 545322, 540321, 535887, 530115, 520168, 505867, 489541, 472684, 455409, 438862]
55775D38862j3759j0699r119p882n552l319k720k723j841r03j117j518r55n23
55761C76232j455k644k718k561l206l412k002n86j135k700l386l775n513p946
55747C33193r154r110r155r348q806p742o909o044m810m056m212l927k276q03
55733B46841j176k331k252j171o33p53q17j345l027m686m758l875l632l819l243
55718B09323k302k267k702k157q83m69j067j272n55J99M95P29J019J091J267K079
55702B02528L065L177K151N15j304k950l867m050m361n167n552m850l851l521
55688A71963l670l912m627n703n742l893j253Q98K908N347P185P157N754M287
55674A76699L024J783J170J515J772J084L58O26J169R97R12K097L821M528M306
$$ y = [438862, 425103, 414404, 405285, 397403, 391851, 388532, 385812, 383089, 381248, 380345, 379228, 377710, 376755, 376232, 374777, 372133, 369415, 366854, 363648, 360236, 358234, 357648, 356513, 353813, 350427, 346652, 341139, 333193, 324039, 314929, 305774, 296426, 287620, 279878, 272969, 266925, 262115, 258059, 253847, 249920, 247644, 246841, 245665, 243334, 241082, 239911, 239278, 238525, 237708, 236363, 233336, 228650, 223892, 220017, 216385, 212566, 209323, 207021, 204754, 202052, 199895, 199012, 198543, 197476, 196204, 195649, 195848, 196343, 197072, 198091, 199182, 200449, 202528, 205593, 208770, 210921, 211436, 210132, 207182, 203315, 199265, 194904, 189737, 184185, 179335, 175484, 171963, 168293, 164381, 159754, 154051, 148309, 144416, 143163, 144061, 146969, 152316, 159501, 166658, 172412, 176699, 179723, 181506, 182676, 184191, 185963, 187047, 187405, 188031, 189200, 190197, 191109, 193206, 197027, 201555, 205861]
55659B05861M217M109L134J668P67M32J43L22J354K086J266l17j042j004j355
55644B21641j981j945j639k221l428m036m056m431m969m651l650l055k899k397
55630A76283j852k262l206l226k186j373j269j144q41j026j524j247m3R17Q81
55615A56882K61m49j164j616j573j550k102k644k310j581j555j941j542n15l08
55600A36293j298k217k174j681j403j265j102j027r09n33k74n86r94o14M95J567
55584A22278K357K999L074K184J152J232K365L457M110M782N581O295P246Q720
55570A77832J0003J0347J0374J0890J0938Q904N189J799n92l099o198q824j0165
55557B17398j0536j0263r303q230p882p897p145n669m567l951k884j498j067j688
$$ y = [205861, 210078, 214187, 217321, 218989, 219756, 220188, 220331, 220653, 222007, 224093, 225359, 225042, 224000, 222996, 221641, 219660, 217715, 216076, 213855, 210427, 206391, 202335, 197904, 192935, 188284, 184634, 181579, 178680, 176283, 174431, 172169, 168963, 165737, 163551, 162178, 160909, 159765, 158924, 157898, 156374, 155127, 155084, 156001, 156882, 157143, 156694, 155530, 153914, 152341, 150791, 148689, 146045, 143735, 142154, 140599, 138658, 137116, 136601, 136293, 134995, 132778, 130604, 128923, 127520, 126255, 125153, 124126, 123217, 122684, 122410, 121824, 120830, 120216, 120711, 122278, 124635, 127634, 130708, 132892, 134044, 135276, 137641, 141098, 145208, 149990, 155571, 161866, 169112, 177832, 187835, 198182, 208556, 219446, 230384, 239288, 244477, 246276, 245684, 242585, 236387, 227563, 217398, 206862, 196599, 187296, 179066, 171184, 163287, 156142, 150473, 145906, 141955, 139071, 137573, 136506, 134818]
55543A34818j918j234q34j319j489m42Q88J342J171J038P38m9q42j161j285j431
55527A27991j207n80l70j059j971k343k289k209k078j910j941j948j334l69k26
55512A06157j288k402k466j703q82k28K46L22J11J17K94o1j011j558j153n28m35
55495I3532m84j16K72M8m92n74o8N19Q13P57M21N3r5j81n78j097j099n08J7J26
55475I1266K07N51R06J089J206J052K06r42j238l33O91P40n8r41j503j595j030
55458I0274j3P23P25K55k48n78n04Q8O56M90r3j05M37L46p68j710j567j090j294
55439H6024j744j354k19O18O70L69J31j1j1K57O76R56R17N43Nk04L40J265J644
55420I0872J180O24O77J104J328J283J231J205J079Q04K69o25j512j736j227o70
$$ y = [134818, 132900, 131666, 130832, 129513, 128024, 127582, 128470, 129812, 130983, 132021, 132759, 132710, 131868, 130707, 129422, 127991, 126784, 126204, 125834, 124775, 122804, 120461, 118172, 115963, 113885, 111975, 110034, 108086, 106752, 106383, 106157, 104869, 102467, 100001, 98298, 97416, 97188, 97434, 97756, 97867, 97984, 98278, 98217, 97206, 95648, 94495, 93967, 93532, 93048, 92932, 93204, 93252, 92760, 92186, 92118, 92637, 93450, 94207, 94628, 94681, 94586, 94405, 93827, 92730, 91631, 91123, 91140, 91266, 91473, 92024, 92930, 94019, 95225, 96277, 96483, 95541, 94303, 93970, 94661, 95401, 95343, 94402, 92899, 91304, 90274, 90261, 90984, 91709, 91964, 91716, 91138, 90634, 90722, 91378, 91868, 91775, 91670, 92107, 92453, 91685, 89975, 88408, 87318, 86024, 84280, 82926, 82707, 83325, 83995, 84364, 84495, 84484, 84473, 84730, 85406, 86362, 87279, 87822, 87827, 87623, 87963, 89228, 90872, 92052, 92676, 93353, 94457, 95785, 97068, 98299, 99504, 100583, 101387, 101656, 101031, 99519, 97783, 96556, 95886]
55404I5886n75p71r79j220j373j015j33O41Q75Q53Q85P96M13L5p4r4k21k84j18
55385I3527J51M31P60R06N20j87n47m50m81q52j021o78k76j68m5L17N37L85K86
55366I3115N35P07M33R3J29K31j34q55j414j576j378r11m81n30r80j165p54j77
55348H4888J62M47Q11Q44K76m23o47l91N5N68R67Q96L82J8J36L64L13J12j39p17
55328H8922j552j860j112R4P34N19k5k57J67J050J580J047j14p14m09r2l19n02
55310H7157j55J19k76p95o44j14K8j92j95P8K61L44M76M03Jj13O31J575J484K48
55290I0321q96r01n5N68K73o40j233r81m38n14j036q20N40J827J792Q38K53L25
55272H9223K85k66p34m65M28J232J298O22%L17J399K050J503L75k63j97Rm3k91
$$ y = [95886, 95311, 94540, 93561, 92341, 90968, 89953, 89820, 90461, 91336, 92189, 93074, 93870, 94283, 94318, 94244, 94150, 93929, 93645, 93527, 93678, 94109, 94869, 95775, 96295, 96108, 95561, 95111, 94630, 93778, 92757, 92079, 91803, 91635, 91590, 91907, 92444, 92829, 93115, 93650, 94357, 94790, 94883, 95012, 95243, 95109, 94254, 92840, 91264, 89886, 88975, 88494, 87964, 86984, 85819, 85065, 84888, 85050, 85497, 86308, 87152, 87428, 87005, 86358, 85967, 86022, 86590, 87557, 88453, 88835, 88853, 88989, 89353, 89666, 89778, 89639, 88922, 87370, 85510, 84398, 84492, 85226, 85745, 85720, 85463, 85630, 86680, 88260, 89307, 89193, 88479, 88070, 87978, 87659, 87157, 87002, 87121, 86845, 86050, 85406, 85292, 85320, 85128, 84933, 85011, 85272, 85616, 86092, 86495, 86496, 86383, 87014, 88589, 90073, 90321, 89425, 88524, 88469, 89037, 89310, 88670, 87437, 86456, 86018, 85504, 84468, 83648, 84188, 86015, 87807, 88645, 88898, 89223, 89508, 89242, 88508, 88043, 88471, 89703, 91001, 91623, 91623, 91940, 93339, 95389, 96892, 97267, 97004, 96807, 96816, 96773, 96482]
55253I6482n10m36L1M84L13l50o24j89J66k12p95p94l93l05o14q67q28n18O7N87
55233I0695L43o84j398r71o4J33m72j052j172r41l82M41R82Q68N43N05L35m62
55215H7247j209q45L75J133R30N11N18P61R30R51O08k92j251j449q43j18M56J179
55197H9592J933K019J237K83k28m16n59n35k15J80L95M21L02M1k29l29l30l96
55179I3166m11j81J09J05j51l62n22p75r01n46J29N81O64O64O63M88K06P4L1j68
55159I2863m04l14Q6M95R24J528J972J663O98j44m10l64l22k53j79l00n51n87
55141I6401l44j70k25l02k92l20l16J9N75P35K11m34m65Q6N13L92J30L78J067
55122I7639J309N23o01q74k05K93j4m51l20r7m81j007o91L49J016Q13L21J39J90
$$ y = [96482, 95972, 95536, 95567, 96051, 96364, 96014, 95390, 95201, 95367, 95155, 94360, 93566, 93173, 92868, 92254, 91387, 90559, 90041, 90108, 90695, 91038, 90354, 88956, 87985, 87921, 88054, 87582, 86530, 85358, 84417, 84035, 84476, 85458, 86326, 86869, 87374, 87709, 87247, 86038, 85193, 85568, 86701, 87631, 88142, 88660, 89421, 90351, 91302, 91910, 91618, 90367, 88918, 88075, 87957, 88413, 89592, 91525, 93544, 94781, 95064, 94836, 94420, 93861, 93326, 93111, 93291, 93686, 94107, 94409, 94450, 94221, 93892, 93562, 93166, 92755, 92574, 92683, 92788, 92637, 92275, 91753, 90978, 90077, 89531, 89660, 90241, 90905, 91569, 92232, 92720, 92926, 93000, 93031, 92863, 92459, 92145, 92231, 92726, 93650, 95178, 97150, 98813, 99511, 99367, 98957, 98593, 98271, 98018, 97839, 97539, 96988, 96401, 96057, 95887, 95662, 95360, 95068, 94748, 94432, 94451, 95026, 95761, 95972, 95538, 95073, 95159, 95672, 96064, 96194, 96572, 97639, 98948, 99471, 98870, 97996, 97791, 98084, 98070, 97619, 97299, 97202, 96721, 95714, 95023, 95372, 96388, 97201, 97522, 97661, 97851]
55103I7851J81J9k41m07j25N89J115J026Q28J139J582J354N74L0j91o75j329j310
55085A02010m86K04J28j95j42P3Qj33J19P41J289J389R68K56k24r0M29P30O23
55066A07697M24L42K54O0j90n03q27r16p31p33j165j381o51N97J272J102P42N16
55048A05909J82j16J14O25N38j58m17K21Q51O82J50p7k10o77j125j034o67o44
55030A04147r83j293j530j819j847j145J30J231J631J461J166R84P34J39n97p39
55014A01670N3R87R88J92k17L08R87R65L34m51j341k245k532j703k20R02J118
54997I9795O39L8r9M49J220J503J210R40J017J101R46P65N80l1j014j448p85K12
54979A07038N09K39J97L84R3o94j049l98O35J100R07P62J150J728J788J198N88
$$ y = [97851, 98032, 98051, 97810, 97403, 97278, 97867, 98982, 100008, 100836, 101975, 103557, 104911, 105485, 105515, 105324, 104649, 103320, 102010, 101524, 101728, 101856, 101661, 101519, 101592, 101600, 101467, 101586, 102327, 103616, 105005, 105973, 106229, 106005, 105915, 106344, 107074, 107697, 108121, 108463, 108717, 108777, 108587, 108084, 107257, 106341, 105610, 104877, 103712, 102331, 101680, 102277, 103549, 104651, 105393, 105909, 106091, 105975, 106089, 106714, 107252, 107094, 106677, 106898, 107749, 108431, 108581, 108504, 108294, 107617, 106492, 105458, 104791, 104147, 103164, 101871, 100341, 98522, 96675, 95530, 95660, 96891, 98522, 99983, 101149, 102133, 102867, 103006, 102409, 101670, 101723, 102710, 103698, 103890, 103673, 103981, 104968, 105933, 106267, 105816, 104475, 102230, 99698, 97995, 97775, 98677, 99795, 100434, 100472, 100373, 100822, 102042, 103545, 104755, 105695, 106712, 107813, 108759, 109524, 110104, 110073, 109059, 107611, 106826, 107038, 107547, 107786, 107983, 108367, 108460, 107766, 106717, 106319, 106954, 108054, 108961, 109723, 110873, 112601, 114389, 115587, 116175]
54962A16175N68R27R71N17Q4K3Lm55j244j795j654q29K43R65J130J150J422J563
54944A19764Q58n47j544j423o93k47l34o81j073j295r33J91J595K559K773K419
54928A21389J816J253R37R64J385K256L354M002L799L398L813M921N448M691L400
54913A66826K487J729L72j592l440m633n124n047m641m207l799l178k360j816
54899A31577j800j946j827j494j107n81K3K79R1O9O85J438J503Q36J51L4O19J791
54881A30341L113L879L735L154K870L056L408L729L980M019L734L179K265O78
54867A75140j431l109l577l313l487m445n320n173m010k637j796j584j540j249
54853A32469q92j036j878k912l479l345k736k117j923k076j843o80P98J374P84
$$ y = [116175, 116743, 117670, 118641, 119158, 119242, 119265, 119268, 118813, 117569, 115774, 114120, 113291, 113534, 114499, 115629, 116779, 118201, 119764, 120622, 120075, 118531, 117108, 116415, 116168, 115834, 115153, 114080, 112785, 111852, 112043, 113638, 116197, 118970, 121389, 123205, 124458, 125395, 126359, 127744, 130000, 133354, 137356, 141155, 144553, 148366, 153287, 158735, 163426, 166826, 169313, 171042, 171414, 169822, 166382, 161749, 156625, 151578, 146937, 142730, 138931, 135753, 133393, 131577, 129777, 127831, 126004, 124510, 123403, 122822, 122845, 123124, 123215, 123284, 123969, 125407, 126910, 127746, 127897, 127931, 128550, 130341, 133454, 137333, 141068, 144222, 147092, 150148, 153556, 157285, 161265, 165284, 169018, 172197, 174462, 175140, 173709, 170600, 167023, 163710, 160223, 155778, 150458, 145285, 141275, 138638, 136842, 135258, 133718, 132469, 131577, 130541, 128663, 125751, 122272, 118927, 116191, 114074, 112151, 110075, 108232, 107552, 108350, 109724, 110508]
54838A10508p0n35q30j023n51O17J394J036L07L10Q48R56M32k23q60j560j850
54821A08906j169nN12J70j39K26R13J298J164O17m1l13P4P33J017Q04L91m8l86
54802A14724k58M80J247J414J193J108Q62k36j837k584j772j70R74J130N77k4
54786A16828m6N29R11M92j09K26J433K224J872J089Q15J042J282J444J646J768
54770A33446J734J875K451L198L744M155M661N090N012M386L649L210L027K601
54756A82239J306j063l925o153o849n973m304k932k575l149l897m080l541k600
54742A32504j718j284j450j806j570m49Q40J304P32k70j044j217n45R25K585L545
54726A31082L380K455J656J851L200M725N113M308L701M149M580L446R59j273
$$ y = [110508, 110438, 109903, 109073, 108050, 107499, 108116, 109510, 110546, 110853, 111163, 112011, 112967, 113399, 113176, 112316, 110756, 108906, 107737, 107732, 108244, 108414, 108275, 108501, 109414, 110712, 111876, 112493, 112452, 112139, 112213, 112946, 113963, 114767, 115158, 115110, 114724, 114466, 114946, 116193, 117607, 118800, 119908, 120770, 120534, 118697, 116113, 114341, 114171, 115145, 116275, 116852, 116828, 116782, 117311, 118222, 118714, 118605, 118831, 120264, 122488, 124360, 125449, 126264, 127306, 128588, 130032, 131678, 133446, 135180, 137055, 139506, 142704, 146448, 150603, 155264, 160354, 165366, 169752, 173401, 176611, 179638, 182239, 183545, 182482, 178557, 172404, 165555, 159582, 155278, 152346, 149771, 146622, 142725, 138645, 135104, 132504, 130786, 129502, 128052, 126246, 124676, 124227, 125067, 126371, 127103, 126833, 125789, 124572, 124027, 124952, 127537, 131082, 134462, 136917, 138573, 140424, 143624, 148349, 153462, 157770, 161471, 165620, 170200, 173646, 174605, 173332]
54712A73332k449l154l876m314m319m299m301l732k463j323r22q91p48p34j168
54697A34639j637j515q65k68p3k62o45q79p03m66q82j929k581k096j022l63k67
54680A18186k11K4K24L81O21O82J42p72j238q13N6O36O32K38k32n60o95p18p14
54661A15869o19k93K85R06J272J198P80L66K35L18L45K46K47M57O50N25J17k22
54643A22682j70K54P21Q69O35K71rk14l72l33J1M00M17r0q81j535j634r72J34
54624A20184R48J005N21k9m23n32j51N02O10k80j434j799j374r11n65J53J178
54607A17603J760J660J388J097K94r05j400o33M29O04P1k21m3J37J71L04M45K94
54589A23055K5R4L94L98Q3k0K01J53m94j162j127n53k56n87j062j078o15o3L69
$$ y = [173332, 170883, 167729, 163853, 159539, 155220, 150921, 146620, 142888, 140425, 139102, 138180, 137289, 136541, 135807, 134639, 133002, 131487, 130622, 130354, 130281, 130019, 129374, 128495, 127792, 127326, 126444, 124515, 121934, 119838, 118816, 118453, 118186, 117975, 117999, 118223, 118604, 119225, 119907, 120049, 119277, 118039, 117226, 117282, 117918, 118550, 118788, 118556, 117996, 117301, 116583, 115869, 115250, 114957, 115242, 116148, 117420, 118618, 119398, 119764, 119999, 120317, 120662, 120908, 121155, 121612, 122262, 122787, 122904, 122682, 122512, 122766, 123487, 124356, 124991, 125262, 125253, 125039, 124667, 124334, 124345, 124745, 125162, 125072, 124191, 122656, 121022, 120050, 120184, 121132, 122137, 122658, 122629, 122206, 121674, 121523, 122025, 122635, 122355, 120921, 119122, 117748, 116837, 116272, 116425, 117603, 119363, 121023, 122411, 123508, 123802, 122897, 121497, 120864, 121293, 121897, 121968, 121747, 121704, 121841, 122012, 122316, 122761, 123055, 123080, 123174, 123568, 123966, 124049, 124029, 124230, 124383, 123889, 122727, 121600, 121047, 120791, 120204, 119142, 118064, 117449, 117386, 117755]
54570A17755O77P53M39LL6O82J375J604J502J300P82j31p53m60J87J43n26q16
54552A24552m93l84p17n10P41J999K124J485J121J125Q95M77M78R52J294J199
54536A36338R02N76L07L58P90R69L34n59o94j66j02r02j597j289l52K51J83k18
54518A35129n68o58m82l69o83j189j151m50L8l52j019r39j49L15j12q51j095p06
54500A24709l2O63J254J509J200M17m66j073j199q31j65M73Q77J133J431J721
54484A31621J732J320O81J56j07j90k14j68N1M02O18M60Q4l4K97O38M94J04J91
54465A38136Q90J390R71l7p28p86o46o27n01n3M13M26o0o26q57o62k52O0Q2j27
54445A36406l05k04J72N01L75k68r49j084o20k8L44O01Q73R56O43J35j87j80O0
$$ y = [117755, 118432, 119185, 119624, 119627, 119663, 120345, 121720, 123324, 124826, 126126, 126908, 126777, 126024, 125564, 125751, 125894, 125368, 124552, 124059, 123675, 122958, 122448, 123189, 125188, 127312, 128797, 129918, 131043, 131938, 132415, 132893, 133845, 135139, 136338, 137240, 137816, 138123, 138481, 139271, 140240, 140574, 140015, 139321, 139155, 139053, 138151, 136554, 135265, 134913, 135164, 135347, 135129, 134561, 133903, 133421, 133052, 132369, 131180, 130029, 129579, 129617, 129265, 128246, 127307, 127158, 127473, 127361, 126510, 125415, 124709, 124677, 125340, 126594, 128103, 129303, 129720, 129254, 128181, 126982, 126151, 125986, 126459, 127336, 128469, 129900, 131621, 133353, 134673, 135354, 135510, 135403, 135213, 134999, 134831, 134882, 135284, 135902, 136362, 136446, 136412, 136709, 137347, 137841, 137945, 138136, 139026, 140416, 141387, 141350, 140622, 139836, 139190, 138563, 138062, 138009, 138422, 138848, 138788, 138162, 137305, 136643, 136391, 136451, 136533, 136406, 136101, 135897, 136069, 136570, 136945, 136677, 135728, 134644, 134024, 133996, 134340, 134941, 135814, 136770, 137413, 137548, 137361, 137181, 137241]
54426A37241L99N90M11P7J66P59J158Q97M99N91P76L06n01o29k8K00n04j322j270
54407A39816m38M92J201J697J845J514R08L76J10K18O95J213J283Q61L76R5r4
54390A52168k18j33k4l31r55j211q49m35m23n21l91k84m46n41k61Rk02n95n06
54371A43851J69R78J602J934J783J074J82l34l42q2K52N97Q83J020R33M97k12
54354A54785o72m21J64K90LJ50Q49J129O16L99J331K493K553J882J870K684L156
54337A73261K784K396K598K821K277R57o71k212l262l490l133k863k912k870k494
54322A63187k171k249k411k063j083M4O77N47Nl15k07r0l08n89o30p16j118j264
54304A49246m02J038J681Q90n27j464j643j394j053q51r03r71o64rN88R81J349
$$ y = [137241, 137640, 138230, 138641, 138718, 138884, 139643, 140801, 141698, 142197, 142788, 143564, 143870, 143369, 142740, 142712, 142912, 142408, 141086, 139816, 139378, 139870, 141071, 142768, 144613, 146127, 147035, 147411, 147521, 147739, 148434, 149647, 150930, 151791, 152167, 152262, 152168, 151950, 151817, 151793, 151462, 150507, 149296, 148447, 148012, 147589, 147068, 146677, 146393, 145947, 145406, 145145, 145154, 144952, 144357, 143851, 144020, 144998, 146600, 148534, 150317, 151391, 151573, 151239, 150897, 150815, 151067, 151664, 152547, 153567, 154500, 154997, 154785, 154113, 153692, 153856, 154146, 154149, 154299, 155148, 156277, 156893, 157292, 158623, 161116, 163669, 165551, 167421, 170105, 173261, 176045, 178441, 181039, 183860, 186137, 187094, 186423, 184211, 180949, 177459, 174326, 171463, 168551, 165681, 163187, 161016, 158767, 156356, 154293, 153210, 153254, 153931, 154478, 154483, 154168, 153961, 153871, 153563, 152974, 152344, 151628, 150510, 149246, 148844, 149882, 151563, 152453, 151926, 150462, 148819, 147425, 146372, 145521, 144618, 143647, 142983, 142974, 143562, 144543, 145892]
54287A45892J614J419Q50N59Q50J209J037M08k10n70o80n87m07l06k74j37J30
54270A50797L95O58R42R60M40k49l52K63R92J408J631J598Q98k98r75n38K70L93
54252A59233j08l97j67J68L58N59P63O66K47n4O7L67L41k17j002j387r99k23J40
54233A58355j14k37L95J250J215J03j162j757j817j821j815j523r26k51L13O29
54217A50837N45J56m4L08R34J243J117R44Q84O00r9q18j063q74n72k01L30P56
54199A54983P08L85L39N35L12n38j316j458j346j558j840j561q66m55l29L20J735
54182A48050K832K404O57r61j352q36n54j077j803j737o72O08J255J122N87J5
54166A48538l37k83O4K89J92O5P9j36q39j417j067K4Q69J049J070J290J305P29
$$ y = [145892, 147506, 148925, 149775, 150334, 151184, 152393, 153430, 153838, 153628, 153058, 152378, 151791, 151384, 151078, 150804, 150667, 150797, 151192, 151850, 152792, 153752, 154192, 153943, 153591, 153854, 154846, 156254, 157885, 159483, 160381, 160083, 159108, 158570, 158840, 159233, 159125, 158728, 158561, 158729, 159087, 159646, 160409, 161075, 161322, 161268, 161335, 161702, 162043, 161826, 160824, 159437, 158438, 158215, 158355, 158241, 158004, 158399, 159649, 160864, 160967, 159805, 158048, 156231, 154410, 152595, 151072, 150146, 149895, 150208, 150837, 151382, 151538, 151494, 151802, 152736, 153979, 155096, 156040, 156924, 157524, 157425, 156607, 155544, 154670, 154098, 153897, 154227, 154983, 155691, 156076, 156415, 156950, 157262, 156724, 155408, 153950, 152604, 151046, 149206, 147645, 146779, 146324, 145995, 146315, 148050, 150882, 153286, 153943, 152982, 151630, 150794, 150240, 149163, 147360, 145623, 144951, 145559, 146814, 147936, 148523, 148538, 148201, 147918, 147982, 148271, 148463, 148528, 148607, 148471, 147632, 146215, 145148, 145172, 146041, 147090, 148160, 149450, 150755, 151484]
54148A51484j18p14j011j179j098n99R9N65O80O18M97L35K57M50R17J414J646
54131A54243J527J240J077J085R66M89j23m72n20n37n29j85N54J239J423J163
54115A62640Q32O59O07N36L73J55j2j26l80q66j312j300p41M4O06O22J10m38l80
54096A61629K54O45K57l05j94L25K77m29p87k56M69N84K98K82O79J192J657J943
54078A68520J706P89l08q83p16p2P08J287J302P95L37L98O97O27J93OL82Q82Q60
54059A77510K29m49n61J4Q55J475J761J931K223K745L506M371N081N544O040O893
54043B19168Q094R488J0949J2009J1649R229N566K295J86j249k432l003k697k084
54029B77168j830j832j635j250r55p33m37k48m01p17p45l26L10P69O38k73j635
$$ y = [151484, 151366, 150652, 149641, 148462, 147364, 146765, 146864, 147429, 148109, 148727, 149224, 149559, 149816, 150266, 151183, 152597, 154243, 155770, 157010, 158087, 159172, 160138, 160627, 160504, 160032, 159512, 158975, 158446, 158261, 158815, 160054, 161477, 162640, 163472, 164131, 164738, 165274, 165647, 165802, 165790, 165664, 165284, 164418, 163106, 161806, 161065, 161109, 161715, 162337, 162447, 162009, 161629, 161883, 162528, 162785, 162480, 162286, 162611, 162888, 162459, 161672, 161416, 161885, 162469, 162767, 163049, 163728, 164920, 166577, 168520, 170226, 171015, 170707, 169824, 169108, 169036, 169744, 171031, 172333, 173128, 173465, 173863, 174560, 175187, 175380, 175386, 175768, 176650, 177510, 177739, 177290, 176729, 176743, 177598, 179073, 180834, 182765, 184988, 187733, 191239, 195610, 200691, 206235, 212275, 219168, 227262, 236750, 247699, 259708, 271357, 280586, 286152, 288447, 288633, 287384, 284952, 281949, 279252, 277168, 275338, 273506, 271871, 270621, 269666, 268933, 268496, 268248, 267847, 267130, 266385, 266059, 266369, 267138, 267776, 267503, 265868]
54012B65868k806l549m125m593m581m007l389l093k819k312j989k290k889l152
53998B20274k962k553j993j402j274j798k279j911r64l70m30o54p45q61r36n36
53982A98606L58J083J038K88o48j266j288q72o03q44j214j107n98k62j82J41P94
53965A93424J106O19j53l21L49J331J958J920J348P04M64O83R91J070J014J141
53949B07648J591K090K156J580Q35P89J717K805L003K326J872K481L803M808M973
53934B44477M690M697N277O028O347O119N830N957O467P032P505P915Q183Q130
53920C34654P644O596M741K204j37j164n90Q23K109K858L110K909K257J318N17
53905C69849L42R25J698J680M67j111j729r84K11P96P67R62J948L509N246P169
$$ y = [265868, 263062, 259513, 255388, 250795, 246214, 242207, 238818, 235725, 232906, 230594, 228605, 226315, 223426, 220274, 217312, 214759, 212766, 211364, 210090, 208292, 206013, 204102, 203138, 202768, 202338, 201684, 200939, 200078, 199142, 198606, 198964, 200047, 201085, 201373, 200725, 199459, 198171, 197299, 196696, 195852, 194638, 193531, 192933, 192671, 192489, 192630, 193424, 194530, 195149, 194996, 194675, 195024, 196355, 198313, 200233, 201581, 202285, 202749, 203432, 204423, 205493, 206507, 207648, 209239, 211329, 213485, 215065, 215900, 216689, 218406, 221211, 224214, 226540, 228412, 230893, 234696, 239504, 244477, 249167, 253864, 259141, 265169, 271516, 277635, 283465, 289422, 295889, 302921, 310426, 318341, 326524, 334654, 342298, 348894, 353635, 355839, 355702, 354538, 353948, 354771, 356880, 359738, 362848, 365757, 368014, 369332, 369849, 370191, 371116, 372814, 374494, 374961, 373850, 372121, 371137, 371348, 372144, 372911, 373873, 375821, 379330, 384576, 391745]
53889C91745R205J0255Q440K924m686j1358j5204j6578j6710j6114j4746j2979
53877C14194j1452j0220q853p361o309n934n750n255m539l988l770l814l990m048
53863B28911l677k828j892j341j297j492j592j444j134q78q01r04j203j752k346
53848B04330k449j703m97L47M88M12P11J271J443R17J50k10j53k43p34j149r28
53831B02003k26L46N16M38J80k67n61k86K89M53J86K49Q49J121N20j30K01J172
53813B07053J573J091O06Q86J779K738L415L678L542L254L058K966K998L399M141
53798B46177M549L990K822K055K189K850L409L487K992K242J887K179K485K083
53784B85396J204O82P63Q64M01p32k315l828m500m121l537l660m206m222l599
$$ y = [391745, 400950, 411205, 419645, 422569, 417883, 406525, 391321, 374743, 358033, 341919, 327173, 314194, 302742, 292522, 283669, 276308, 269999, 264065, 258315, 253060, 248521, 244533, 240763, 236949, 232959, 228911, 225234, 222406, 220514, 219173, 217876, 216384, 214792, 213348, 212214, 211336, 210535, 209631, 208428, 206676, 204330, 201881, 200178, 199681, 200028, 200516, 200928, 201639, 202910, 204353, 205270, 205420, 205210, 205057, 204814, 204080, 202931, 202003, 201777, 202123, 202639, 203077, 203257, 202990, 202429, 202143, 202432, 202885, 203071, 203320, 204169, 205290, 205810, 205680, 205881, 207053, 208626, 209717, 210323, 211209, 212988, 215726, 219141, 222819, 226361, 229615, 232673, 235639, 238637, 242036, 246177, 250726, 254716, 257538, 259593, 261782, 264632, 268041, 271528, 274520, 276762, 278649, 280828, 283313, 285396, 286600, 287282, 288045, 288909, 289310, 288578, 286263, 282435, 277935, 273814, 270277, 266617, 262411, 258189, 254590]
53769B54590l060k884k678k411k537l025l344l493l871m054l044j112k9o53j618
53754B16777j385m72m41j467k283k142j533j028n37O7M52L25p6l19l07k23j77
53737B05231o0J58K28q2m44j28R71J871J650P39L61Q49J374J353J153J223J423
53720B17870J541J724J940J793J283J047J394J767J597J080O49M37O17J521K805
53705B39065L323K515J274P85J109J641K245L073L855M252M476M786M811M200
53691B81410L399K945K478J399N0p69j071j406j664j315o51n37j004j223r69r07
53675B80165j247j276o19L6m2o88j330j660j404k64J373K347J941P16k90p43r56
53658B76059j126j225j296j349j202p39k08J17L15O14R93J257J364J384J345J257
$$ y = [254590, 251530, 248646, 245968, 243557, 241020, 237995, 234651, 231158, 227287, 223233, 220189, 219077, 219048, 218395, 216777, 215392, 214920, 214479, 213012, 210729, 208587, 207054, 206026, 205489, 205556, 206008, 206333, 206257, 205938, 205631, 205408, 205231, 205171, 205329, 205557, 205475, 205031, 204903, 205874, 207745, 209395, 210134, 210495, 211344, 212718, 214071, 215224, 216447, 217870, 219411, 221135, 223075, 224868, 226151, 227198, 228592, 230359, 231956, 233036, 233685, 234122, 234739, 236260, 239065, 242388, 244903, 246177, 246962, 248071, 249712, 251957, 255030, 258885, 263137, 267613, 272399, 277210, 281410, 284809, 287754, 290232, 291631, 291681, 290912, 289841, 288435, 286771, 285456, 284805, 284268, 283264, 282041, 281072, 280165, 278918, 277642, 277023, 277059, 277017, 276329, 274999, 273339, 271935, 271671, 273044, 275391, 277332, 278048, 277758, 277015, 276059, 274933, 273708, 272412, 271063, 269861, 269122, 268914, 269031, 269346, 269960, 270953, 272210, 273574, 274958, 276303, 277560]
53642B77560J158R32L57m41q14k14J076K078K020J047K4k87J40P88J291J707K110
53625B90532K295K199K196K577K990K901K471K362K757L193L373L472L569L440
53611C30327L096K965L232L549L649L737L953L987L588L032K648K374K136K218
53597C74491K746L197K990K288J608R97K54k53K28J739L369M268M446M346M172
53582D10886L874L462K943K163Q87r33l070n031o239o428n941n390n065m825m554
53567C76739m292l879k961j570l37J77J35O5J77L56N83Q65R66P21N25R38J720
53550C70928J928J179K51N0M72Q13Q99J171J781K284K365K365K782L634M538N285
53534D02725N959O547O715O190N356N204O390Q382R880J0225R997J0097J0685
$$ y = [277560, 278718, 279650, 280007, 279566, 278752, 278538, 279614, 281692, 283712, 284759, 284783, 284496, 284636, 285424, 286715, 288422, 290532, 292827, 295026, 297222, 299799, 302789, 305690, 308161, 310523, 313280, 316473, 319846, 323318, 326887, 330327, 333423, 336388, 339620, 343169, 346818, 350555, 354508, 358495, 362083, 365115, 367763, 370137, 372273, 374491, 377237, 380434, 383424, 385712, 387320, 388317, 388571, 388318, 388546, 390285, 393654, 397922, 402368, 406714, 410886, 414760, 418222, 421165, 423328, 424215, 423282, 420212, 415181, 408942, 402514, 396573, 391183, 386118, 381293, 376739, 372447, 368568, 365607, 364037, 363700, 363877, 364012, 364077, 364254, 364610, 365193, 366058, 367024, 367745, 368270, 369208, 370928, 372856, 374035, 374286, 374336, 374808, 375621, 376520, 377691, 379472, 381756, 384121, 386486, 389268, 392902, 397440, 402725, 408684, 415231, 421946, 428136, 433492, 438696, 445086, 453468, 463348, 473573, 483570, 493667, 504352]
53521E04352J1381J2109J3047J4007J4561J4793J5222J5945J6539J7000J8020
53510F66976J9893K1807K2716K2597K2231K2068K1884K1426K0855K0445K0219
53499I03117K0007J9742J9543J9539J9572J9213J8333J7483J7329J7701J7753
53488A109332J7162J6555J6489J6647J6506J6237J6329J6685J6811J6613J6386
53477A291752J6099J5360J4045J2470J0847R115P313N654M097K238k16l099n945
53464A379730q352j0177j1538j2578j3106j2792j1836j1156j1430j2363j3324
53453A251078j4346j5850j7607j8785j9061j8919j8706j8124j6953j5669j4888
53442A062170j4578j4193j3316j1836r780p357n051l401k616k428k236j412K06
$$ y = [504352, 515733, 527842, 540889, 554896, 569457, 584250, 599472, 615417, 631956, 648956, 666976, 686869, 708676, 731392, 753989, 776220, 798288, 820172, 841598, 862453, 882898, 903117, 923124, 942866, 962409, 981948, 1001520, 1020733, 1039066, 1056549, 1073878, 1091579, 1109332, 1126494, 1143049, 1159538, 1176185, 1192691, 1208928, 1225257, 1241942, 1258753, 1275366, 1291752, 1307851, 1323211, 1337256, 1349726, 1360573, 1369688, 1377001, 1382655, 1386752, 1388990, 1388774, 1385675, 1379730, 1371378, 1361201, 1349663, 1337085, 1323979, 1311187, 1299351, 1288195, 1276765, 1264402, 1251078, 1236732, 1220882, 1203275, 1184490, 1165429, 1146510, 1127804, 1109680, 1092727, 1077058, 1062170, 1047592, 1033399, 1020083, 1008247, 998467, 991110, 986059, 982658, 980042, 977614, 975378, 973966, 974172]
53429I74172K080L450M134M608N309O169O967P751Q664R618J0455J1305J2470
53416A067152J3981J5507J6710J7632J8613J9930K1524K3123K4564K5893K7162
53405A291791K8281K9156K9901L0866L2488L4991L8001M0628M2268M3376M4907
53394A686654M6944M8493M8884M8736M8992M9606M9834M9441M8802M8092M7072
53383B221550M5649M3983M2086L9828L7332L4788L2013K8664K4772K0623J6320
53372B587608J2065Q511N988L549k87n924j2549j9456k6395l2706l7333m0144
53360B442927m2183m4159m5592m5953m5671m5378m4995m4191m3072m1679l9627
53349A960427l6892l4390l2936l2302l2002l2354l3770l5529l6305l5674l4122
$$ y = [974172, 976252, 979702, 983836, 988444, 993753, 999922, 1006889, 1014640, 1023304, 1032922, 1043377, 1054682, 1067152, 1081133, 1096640, 1113350, 1130982, 1149595, 1169525, 1191049, 1214172, 1238736, 1264629, 1291791, 1320072, 1349228, 1379129, 1409995, 1442483, 1477474, 1515475, 1556103, 1598371, 1641747, 1686654, 1733598, 1782091, 1830975, 1879711, 1928703, 1978309, 2028143, 2077584, 2126386, 2174478, 2221550, 2267199, 2311182, 2353268, 2393096, 2430428, 2465216, 2497229, 2525893, 2550665, 2571288, 2587608, 2599673, 2608184, 2614172, 2617721, 2617434, 2611510, 2598961, 2579505, 2553110, 2520404, 2483071, 2442927, 2400744, 2356585, 2310993, 2265040, 2219369, 2173991, 2128996, 2084805, 2041733, 2000054, 1960427, 1923535, 1889145, 1856209, 1823907, 1791905, 1759551, 1725781, 1690252, 1653947, 1618273, 1584151]
53338A584151l1896k8977k6042k4237k3679k3059k1123j7955j4555j1829j0275
53327A350524j0058j0862j1973j2890j3670j4508j5211j5415j5147j4809j4627
53316A201354j4319j3507j2327j1329j0576r270o757l778j935j803k200j759m83
53303A111311P55J693K873M650O773Q862J0693J2158J3445J5116J7408J9616K0803
53290A246156K1074K1458K2531K3778K4358K3880K2360K0095J7778J6067J4793
53279A474328J3102J0639Q051N947L986J479j462m029n795p166q768j0833j3236
53266A466243j5755j8090j9825k0702k0990k1305k1949k2561k2730k2789k3483
53255A236064k4793k5683k5395k4464k3906k3762k3152k1664j9943j8900j8876
$$ y = [1584151, 1552255, 1523278, 1497236, 1472999, 1449320, 1426261, 1405138, 1387183, 1372628, 1360799, 1350524, 1340466, 1329604, 1317631, 1304741, 1291071, 1276563, 1261352, 1245937, 1230790, 1215981, 1201354, 1187035, 1173528, 1161201, 1149872, 1139296, 1130026, 1123269, 1119491, 1117556, 1115753, 1113553, 1111794, 1111311, 1112066, 1113759, 1116632, 1121282, 1128055, 1136917, 1147610, 1159768, 1173213, 1188329, 1205737, 1225353, 1246156, 1267230, 1288688, 1311219, 1334997, 1359355, 1383235, 1405595, 1425690, 1443468, 1459535, 1474328, 1487430, 1498069, 1506120, 1512067, 1516053, 1517532, 1516070, 1512041, 1506246, 1499080, 1490312, 1479479, 1466243, 1450488, 1432398, 1412573, 1391871, 1370881, 1349576, 1327627, 1305066, 1282336, 1259547, 1236064, 1211271, 1185588, 1160193, 1135729, 1111823, 1088061, 1064909, 1043245, 1023302, 1004402, 985526]
53244I85526j9648k0661k1144k0551j9202j8093j7861j8201j8366j7828j6437
53233G77534j4460j2553j1265j0365r146p570o525o676p549q211q465q832r655
53220F56262j0715j1658j2419j3167j4057j4992j5578j5458j4739j3879j3127
53209E06473j2342j1463j0707j0164r591q927q548q681q885q557p732o991o788
53196C87097p187p995q815r105q630p709o822o118n525n028m497l643k558j953
53182C01512k317l115l447l197k888k605j933r48l98o47j137j271j154j179j333
53167B73943j403j408j417j274q77n35o15j006j250j061n16R5L70m3j106k249
53151B59648k780k390j357m00k77j063j822j538m53J00n07j281j047j10K92j71
$$ y = [985526, 965878, 945217, 924073, 903522, 884320, 866227, 848366, 830165, 811799, 793971, 777534, 763074, 750521, 739256, 728891, 719745, 712175, 705650, 698974, 691425, 683214, 674749, 665917, 656262, 645547, 633889, 621470, 608303, 594246, 579254, 563676, 548218, 533479, 519600, 506473, 494131, 482668, 471961, 461797, 452206, 443279, 434731, 426050, 417165, 408608, 400876, 393885, 387097, 379910, 371915, 363100, 353995, 345365, 337656, 330834, 324716, 319191, 314163, 309666, 306023, 303465, 301512, 299195, 296080, 292633, 289436, 286548, 283943, 282010, 281062, 280664, 280017, 278880, 277609, 276455, 275276, 273943, 272540, 271132, 269715, 268441, 267564, 267029, 266414, 265408, 264158, 263097, 262581, 262676, 263046, 263003, 261897, 259648, 256868, 254478, 253121, 252721, 252444, 251381, 249559, 248021, 247568, 247668, 247161, 245880, 244833, 244723, 245015, 244844]
53135B44844o09l12M05Q96J015R23O74K95o6l16m93n08k22J77K21j93n69m11K48
53116B45999J066J750K039J685P95o8m19l60l47o45j143j545j604j325j044j078
53100B43756j269j185q09o09p52q02n04k64m36n49J2R13J214P04J32M2R5j86n90
53081B38913n65p1M39P02R72J556K246K383J556J61q74j052p45n94p38r13j057
53064B42319j306j520j332p68l32k46q1N87J395J543P93j94n27N9J027J579J282
53047B44278L55n85j013q71n61n95j108j742k065k032j838j430n62M99R10K24
53031B31864q70j264o64L10J034J378J451J368J269J150P23r7p55o29N2N02N76
53014B37398Q62J507J804J316O28M44N65L84o8k64o9J52K39M08P09Q05L93l90
$$ y = [244844, 244235, 243923, 244328, 245224, 246239, 247162, 247836, 248131, 248065, 247749, 247256, 246748, 246526, 246703, 246924, 246731, 246162, 245751, 245999, 247065, 248815, 250854, 252539, 253334, 253266, 252847, 252487, 252140, 251495, 250352, 248807, 247203, 245878, 244834, 243756, 242487, 241302, 240493, 239884, 239132, 238330, 237826, 237562, 237126, 236577, 236589, 237502, 238716, 239420, 239552, 239594, 239689, 239503, 238913, 238348, 238277, 238716, 239418, 240390, 241946, 244192, 246575, 248131, 248292, 247418, 246366, 245621, 245027, 244289, 243376, 242319, 241013, 239493, 238161, 237393, 237061, 236815, 236734, 237321, 238716, 240259, 241052, 240858, 240331, 240390, 241417, 242996, 244278, 244633, 244048, 243035, 242164, 241603, 241008, 239900, 238158, 236093, 234061, 232223, 230793, 230231, 230730, 231640, 231864, 230994, 229730, 229066, 229376, 230410, 231788, 233239, 234607, 235876, 237026, 237749, 237652, 236897, 236268, 236320, 236822, 237398, 238260, 239767, 241571, 242887, 243515, 243959, 244524, 244908, 244840, 244576, 244507, 244659, 244898, 245306, 246015, 246820, 247213, 246823]
52996B46823j048j119n36K44O23M55J01q3NN31J682L007L350K100K28o27N4J312
52978B57102K079K217K128J993J719J357J176J360J759J900J350K34o63n49N51
52963B75713J734K028J151l70j694k277k218j963j745j483j202j205j580j880
52949B63009j707j309j136j014l88O85J400J232N80J18l8j14n2L77R47R58J04
52932B63652j035j593j435j230j516k031k181j882j590j552j489j057k89M75Q74
52917B46121O54p2o56m01N37J159P85k03j014j377j405j056m16r8o11j486j718
52900B38743j140n47m39l48K32Q98Q81J86l15Q7J124J874J741J030N35N84P14
52883B45840L88k23n19k87R1K25J05n8o6K46Q30J314J277P17j2n24m57N80K420
$$ y = [246823, 245775, 244656, 244120, 244364, 244987, 245442, 245543, 245460, 245465, 245996, 247678, 250685, 254035, 256135, 256363, 255736, 255790, 257102, 259181, 261398, 263526, 265519, 267238, 268595, 269771, 271131, 272890, 274790, 276140, 276374, 275711, 275162, 275713, 277447, 279475, 280626, 280256, 278562, 276285, 274067, 272104, 270359, 268876, 267674, 266469, 264889, 263009, 261302, 259993, 258857, 257843, 257455, 258140, 259540, 260772, 261352, 261470, 261432, 261318, 261266, 261643, 262590, 263548, 263652, 262617, 261024, 259589, 258359, 256843, 254812, 252631, 250749, 249159, 247607, 246118, 245061, 244772, 245247, 246121, 246775, 246703, 246047, 245646, 246183, 247342, 248127, 247924, 246910, 245533, 244128, 243072, 242656, 242558, 241947, 240461, 238743, 237603, 237056, 236617, 236269, 236501, 237399, 238280, 238466, 238151, 238238, 239362, 241236, 242977, 244007, 244542, 245126, 245840, 246228, 246005, 245486, 245199, 245290, 245515, 245620, 245562, 245496, 245742, 246572, 247886, 249163, 249880, 249868, 249344, 248887, 249467, 251887]
52864B51887L902L776K225Q07N59Q42M57p29j912k572k819k715k096j212q21j377
52848B48202k448l234l352k868j910o63M34Q91O22no55j268j746j786j272o41
52832B28301m33n90n41l2N31O39K88j74m95o21n23j87K85O26M53m43j569j757
52814B23758l66J587K295J385M53R12K135K506J620M32l57r71j680k271k551k611
52798B26276k464k048j548j164n82M96J411J082m15j671j686r20k95J1K43L90
52782B17116L80M24O19O74M75L51M19L01p8j34L86Q16O85O02J069J207j7j704
52764B23591j749K60K253K279P71m64o21l29l02m77m97l13j29n4qJ76N67J049
52746B26003J450J755K023K154J903J301P52O32Q66J050Q97M43n5l01j73J66M32
$$ y = [251887, 255789, 259565, 261790, 262597, 263156, 263998, 264455, 263726, 261814, 259242, 256423, 253708, 251612, 250400, 249579, 248202, 245754, 242520, 239168, 236300, 234390, 233727, 234161, 235052, 235674, 235669, 235014, 233746, 232000, 230214, 228942, 228301, 227868, 227278, 226737, 226705, 227236, 227875, 228163, 227989, 227494, 226873, 226350, 226163, 226448, 227074, 227527, 227084, 225515, 223758, 223392, 224979, 227274, 228659, 229112, 230024, 232159, 234665, 236285, 236717, 236360, 235389, 233709, 231438, 228887, 226276, 223812, 221764, 220216, 219052, 218470, 218966, 220377, 221459, 221044, 219373, 217687, 216767, 216472, 216483, 216726, 217116, 217496, 217920, 218539, 219213, 219688, 220039, 220458, 220759, 220681, 220547, 220933, 221749, 222434, 223036, 224105, 225312, 225295, 223591, 221842, 222102, 224355, 226634, 227405, 226941, 226320, 225991, 225689, 225212, 224715, 224402, 224273, 224219, 224211, 224387, 224954, 226003, 227453, 229208, 231231, 233385, 235288, 236589, 237341, 237973, 238839, 239889, 240786, 241229, 241174, 240873, 240700, 240866, 241298]
52729B41298N86Q66J322J565J244O13J94m7p00j804k394j642j39O55K33m52m99
52712B40899k72n51j108j035k61J76m01j306j385n03L71M29n6k21K92R05R03L62
52694B37238RJ63L83K80J78M15N91J38o03p18m5O63R62J221J708J962J535O75
52676B46755j67r42j582j573n77Q04J513J151K08n94q26m47J46L32j06p25j024
52659B42346j003q28l13P05J802K302K168J951J921J722R62k46j409k094k159
52644B47827j774j242o98n1O13Q83N19p9k75N2M69O09N11M06M85Q05J198J313
52626B51571J037P16P41J042J252J182Q04J8j086j909j826j008k71jK11P55J284
52609B54512J193M35m66j043j205r35j14J190K412K772K056R77M95Q18J262J119
$$ y = [241298, 241884, 242750, 244072, 245637, 246881, 247494, 247688, 247641, 246941, 245137, 242743, 241101, 240962, 241617, 241850, 241398, 240899, 240627, 240076, 238968, 237933, 237672, 237848, 237447, 236141, 234756, 234253, 234624, 235053, 234997, 234776, 235068, 235973, 236876, 237238, 237247, 237410, 237793, 238073, 238251, 238666, 239257, 239395, 238792, 238074, 238029, 238692, 239654, 240875, 242583, 244545, 246080, 246755, 246588, 245646, 244064, 242491, 241914, 242718, 244231, 245382, 245590, 244996, 244170, 243723, 243869, 244201, 244095, 243370, 242346, 241343, 240515, 240202, 240907, 242709, 245011, 247179, 249130, 251051, 252773, 253735, 253489, 252080, 249986, 247827, 246053, 244811, 244113, 244062, 244675, 245558, 246077, 245998, 245723, 245775, 246244, 246853, 247364, 247770, 248255, 249060, 250258, 251571, 252608, 253324, 254065, 255107, 256359, 257541, 258345, 258363, 257277, 255368, 253542, 252534, 252263, 252262, 252473, 253228, 254512, 255705, 256140, 255674, 254631, 253426, 252491, 252377, 253567, 255979, 258751, 260807, 261784, 262279, 263097, 264359, 265478]
52593B65478M38k29n01l87m5L77P93J192J596J851J697J157O31L87K44l0k77k03
52575B74169R6L02L51M46O44P06L62n02j729k802l051k286j067j63J49J4m06r47
52557B64286j286j181p64k84K20O29M90l87j280j161kJ091J160L68m71q18o57
52540B59953j95L69Q34R67N93k01q82q33n0P42R26P14O73Q91J021R40Q07O22K64
52521B68155q1p8J75K30k0k16p9L22Q79J525J976J968J796K092K899L477L210
52504B88230K239J044j46j247k121k787l442l983l853k756j248k73j70m83o49
52489B68355n67m72m72m11j47J76K55O4j01m8R9K41N13R23J102Q13L94L01N11
52470B71529P89J228J926K413K169J500J167J244J208R89J092J462J313L98m48
$$ y = [265478, 265916, 265687, 265186, 264799, 264754, 265131, 265924, 267116, 268712, 270563, 272260, 273417, 274048, 274435, 274679, 274649, 274372, 274169, 274265, 274567, 274918, 275364, 276008, 276714, 277076, 276574, 274845, 272043, 268992, 266706, 265639, 265476, 265625, 265639, 265233, 264286, 263000, 261819, 261055, 260771, 260991, 261620, 262110, 261723, 260443, 259282, 259280, 260371, 261531, 261899, 261428, 260610, 259953, 259758, 260127, 260961, 261928, 262521, 262320, 261438, 260605, 260555, 261297, 262223, 262937, 263610, 264501, 265522, 266462, 267269, 267891, 268155, 268074, 267996, 268171, 268401, 268381, 268165, 268086, 268408, 269287, 270812, 272788, 274756, 276552, 278644, 281543, 285020, 288230, 290469, 291513, 291367, 290120, 287999, 285212, 281770, 277787, 273934, 271178, 269930, 269657, 269487, 269004, 268355, 267788, 267316, 266844, 266433, 266286, 266462, 266717, 266781, 266680, 266632, 266731, 266972, 267485, 268408, 269510, 270323, 270717, 271018, 271529, 272318, 273546, 275472, 277885, 280054, 281554, 282721, 283965, 285173, 286162, 287254, 288716, 290029, 290427, 289979]
52455B89979n37k77l44o20o96q43j604k785l607l787l718l656l321k438j193j1
52439B60542Q62J395J568J320P20O5l12m23o29j125j591j626j314r85n92J42J048
52422B59065J600J689J717J805J667J381J543K245K722K510K332L140M720O042
52408B94178O715P383Q670J0339J1567J1628J0214P412L613n94m513p418q869
52395C50325r021q409p423o249n179m528m129l434k307j255o80l95j32J03L75
52380B97662J009J921K390J966J178Q56J155J758K583L672M707N301N545N774
52366C37477N952N712M815L225J101q96j787j283k29M88R30J474J808J510J104
52351C61401J416K121K092J204O28J176K319L171L515L533L342L242L701M652
$$ y = [289979, 289442, 289165, 288821, 288201, 287505, 286662, 285058, 282273, 278666, 274879, 271161, 267505, 264184, 261746, 260553, 260542, 261404, 262799, 264367, 265687, 266407, 266472, 266160, 265737, 265108, 263983, 262392, 260766, 259452, 258467, 257875, 258017, 259065, 260665, 262354, 264071, 265876, 267543, 268924, 270467, 272712, 275434, 277944, 280276, 283416, 288136, 294178, 300893, 308276, 316946, 327285, 338852, 350480, 360694, 368106, 371719, 371125, 366612, 359194, 350325, 341304, 332895, 325472, 319223, 314044, 309516, 305387, 301953, 299646, 298391, 297711, 297316, 297184, 297287, 297662, 298671, 300592, 302982, 304948, 306126, 306982, 308137, 309895, 312478, 316150, 320857, 326158, 331703, 337477, 343429, 349141, 353956, 357181, 358282, 357386, 355599, 354316, 354087, 354575, 355505, 356979, 358787, 360297, 361401, 362817, 364938, 367030, 368234, 368862, 370038, 372357, 375528, 379043, 382576, 385918, 389160, 392861, 397513]
52337C97513N425N803O382P515Q581R027R461J0891J3190J5209J6273J6833J7583
52324E39686J8615J9630K0489K1264K2034K2759K3246K3136K2272K1090K0425
52313G74646K0693K1430K1844K1687K1333K1081K0799K0300J9726J9209J8428
52302A001176J6938J4952J3327J2621J2471J2002J0600Q159M972J603j341l616
52290A103864n371o657p253p241p341q155r331r926r470q264o730n047l422k186
52276A007470j364n61O55K424M700P328R920J1986J3353J4236J4792J4943J4709
52263A114591J4471J4602J4967J5078J4707J4226J4217J4803J5406J5251J4112
52252A276431J2473J0919R535P940N810L190L97k285m826p397r967j2054j3172
$$ y = [397513, 402938, 408741, 415123, 422638, 431219, 440246, 449707, 460598, 473788, 488997, 505270, 522103, 539686, 558301, 577931, 598420, 619684, 641718, 664477, 687723, 710859, 733131, 754221, 774646, 795339, 816769, 838613, 860300, 881633, 902714, 923513, 943813, 963539, 982748, 1001176, 1018114, 1033066, 1046393, 1059014, 1071485, 1083487, 1094087, 1102246, 1107218, 1108821, 1107480, 1103864, 1098493, 1091836, 1084583, 1077342, 1070001, 1061846, 1052515, 1042589, 1033119, 1024855, 1018125, 1013078, 1009656, 1007470, 1006106, 1005545, 1006200, 1008624, 1013324, 1020652, 1030572, 1042558, 1055911, 1070147, 1084939, 1099882, 1114591, 1129062, 1143664, 1158631, 1173709, 1188416, 1202642, 1216859, 1231662, 1247068, 1262319, 1276431, 1288904, 1299823, 1309358, 1317298, 1323108, 1326298, 1326695, 1324410, 1319584, 1312187, 1302220, 1290166, 1276994]
52239A276994j3523j3944j4959j6167j6805j6567j5695j4567j3511j2813j2496
52228A115947j2209j1572j0561r417q403p768p567p367o508m937l345k177j049
52215A023067M53J948K834L212L500L646L459L425M120N085N263M556L906L828
52201A072302L875L791M101N060N960O114N862N909O187O065N396M625M037L395
52187A142679K358Q89p37k138l074l685m419n594p067q338q984q962q624q318
52173A075986p893o857n182l646k980l009l035k740k125r59Q39K497L019K589
52159A046504K428L068L700L487K678J969J607J544J832K347K702K804K906K904
52145A082480K374J622J665K620L094K106O19J17M16K75l33k0J929M619O913Q636
$$ y = [1276994, 1263471, 1249527, 1234568, 1218401, 1201596, 1185029, 1169334, 1154767, 1141256, 1128443, 1115947, 1103738, 1092166, 1081605, 1072188, 1063785, 1056017, 1048450, 1041083, 1034575, 1029638, 1026293, 1024116, 1023067, 1023520, 1025468, 1028302, 1031514, 1035014, 1038660, 1042119, 1045544, 1049664, 1054749, 1060012, 1064568, 1068474, 1072302, 1076177, 1079968, 1084069, 1089129, 1095089, 1101203, 1107065, 1112974, 1119161, 1125226, 1130622, 1135247, 1139284, 1142679, 1145037, 1145926, 1145189, 1143051, 1139977, 1136292, 1131873, 1126279, 1119212, 1110874, 1101890, 1092928, 1084304, 1075986, 1068093, 1061236, 1056054, 1052408, 1049428, 1046419, 1043384, 1040644, 1038519, 1037560, 1038399, 1040896, 1043915, 1046504, 1048932, 1052000, 1055700, 1059187, 1061865, 1063834, 1065441, 1066985, 1068817, 1071164, 1073866, 1076670, 1079576, 1082480, 1084854, 1086476, 1088141, 1090761, 1093855, 1095961, 1096580, 1096697, 1097113, 1097388, 1097055, 1097035, 1098964, 1103583, 1110496, 1119132]
52129A119132J0133J1627J3474J6192J9695K3030K5392K6972K8397K9779L0763
52118A354586L1222L1372L1330L0973L0220K9186K7980K6566K4842K2862K0830
52107A661969J8882J6913J4701J2288J0056Q372P260O368N177L221M88k334m429
52094A758932n904p853j1033j4857j8172k0652k2685k4152k4161k2318j9517j7092
52082A550536j5462j3959j1732q556m990j995k66M05J063K722N491Q618J1307
52069A523182J3347J4970J6359J7477J8302J8906J9243J9068J8319J7434J6916
52058A713523J6617J5855J4268J2215J0192Q226O109L828J435j246m341p562j0482
52045A778637j3117j5828j8638k1031k2497k3108k3390k3767k4133k4020k3176
$$ y = [1119132, 1129265, 1140892, 1154366, 1170558, 1190253, 1213283, 1238675, 1265647, 1294044, 1323823, 1354586, 1385808, 1417180, 1448510, 1479483, 1509703, 1538889, 1566869, 1593435, 1618277, 1641139, 1661969, 1680851, 1697764, 1712465, 1724753, 1734809, 1743181, 1750441, 1756809, 1761986, 1765207, 1765695, 1763361, 1758932, 1753028, 1745175, 1734142, 1719285, 1701113, 1680461, 1657776, 1633624, 1609463, 1587145, 1567628, 1550536, 1535074, 1521115, 1509383, 1500827, 1495837, 1493842, 1493576, 1493981, 1495044, 1497766, 1503257, 1511875, 1523182, 1536529, 1551499, 1567858, 1585335, 1603637, 1622543, 1641786, 1660854, 1679173, 1696607, 1713523, 1730140, 1745995, 1760263, 1772478, 1782670, 1790896, 1797005, 1800833, 1802268, 1801022, 1796681, 1789119, 1778637, 1765520, 1749692, 1731054, 1710023, 1687526, 1664418, 1641028, 1617261, 1593128, 1569108, 1545932]
52034A545932k1942k0875k0061j9142j8024j7147j6868j6958j7025j7008j6913
52023A343969j6512j5742j5063j4828j4582j3666j2358j1630j1720j1729j0888
52012A195251r606q897r167j0047j1069j2108j3231j4484j5867j7374j8961k0526
52000A033914k1806k2386k1953k0623j8898j7224j5691j4231j2982j2294j2370
51989H43456j2962j3471j3464j3028j2576j2404j2591j3178j4038j4635j4432
51978F96677j3731j3521j4175j4722j3926j1748r166o880m851k964j403k22R10
51965E90278K281L816N238O224O417N695M491L412K494J215o77k818m720o168
51951F17178p001p021o414n806n554n293m470l040j329N56K713N021P074Q594
$$ y = [1545932, 1523990, 1503115, 1483054, 1463912, 1445888, 1428741, 1411873, 1394915, 1377890, 1360882, 1343969, 1327457, 1311715, 1296652, 1281824, 1267242, 1253576, 1241218, 1229588, 1217868, 1206139, 1195251, 1185645, 1176748, 1167581, 1157534, 1146465, 1134357, 1121126, 1106642, 1090775, 1073401, 1054440, 1033914, 1012108, 989722, 967769, 947146, 928248, 911024, 895333, 881102, 868120, 855826, 843456, 830494, 817023, 803559, 790531, 777955, 765551, 752960, 739782, 725744, 711109, 696677, 682946, 669425, 655250, 640528, 626602, 614854, 605688, 598808, 593957, 590993, 589590, 589368, 590278, 592559, 596375, 601613, 607837, 614254, 619949, 624440, 627852, 630346, 631561, 630884, 628066, 623346, 617178, 610177, 603156, 596742, 590936, 585382, 580089, 575619, 572579, 571250, 571806, 574519, 579540, 586614, 595208]
51937E95208R635J0321J0598J0297R329P759N675L067%l152n792p667r161j0832
51923F25285j2708j4250j4971j4893j4402j3804j3016j1617r441p137n818n817
51911D87411o129n509l801j691M21K578M518N767O492P437Q757R746R954R726
51897E35677R280Q118O005L823K687K647K871K678J701m46l750p314j0006j1559
51883E42412j2274j2006j0289p487m753k676p53J453L472M730N489O268O799O273
51869E26658M485K082l30k693m998o835p792q052q169q263p758o058l376p03J094
51854D69292J923K214K207J751P52n00j615k500l295m016m477m554m353m057l785
51839D44987l574l409l186k801k307j824j217j55J303K403K383J445N76L64L80
$$ y = [595208, 604843, 615164, 625762, 636059, 645388, 653147, 658822, 661889, 661889, 658737, 652945, 645278, 636117, 625285, 612577, 598327, 583356, 568463, 554061, 540257, 527241, 515624, 506183, 499046, 493228, 487411, 481282, 475773, 471972, 470281, 470702, 473280, 477798, 483565, 490057, 497494, 506251, 515997, 525951, 535677, 544957, 553075, 559080, 562903, 565590, 568237, 571108, 573786, 575487, 575041, 571291, 563977, 553971, 542412, 530138, 518132, 507843, 500356, 495603, 492927, 492174, 493627, 497099, 501829, 507318, 513586, 520385, 526658, 531143, 533225, 532895, 530202, 525204, 518369, 510577, 502525, 494356, 486093, 478335, 472277, 468901, 468198, 469292, 471215, 473429, 475636, 477387, 478139, 477639, 476024, 473524, 470229, 466213, 461736, 457182, 452829, 448772, 444987, 441413, 438004, 434818, 432017, 429710, 427886, 426669, 426514, 427817, 430220, 432603, 434048, 434624, 434988, 435368]
51824D35368k0p57j271j448j725k352k935k890k076q94N0M16M29O96J497K308
51808D24396K301J330O7q42j415j997k618k994k947k565j992j297o24k79n52j371
51792D06601k241k668k615k377k006j247j91M25P1p40r81m67K8l9k19J60R78J491
51774C93963J274P36P23J750L507N157O246P153Q370R547R795Q888P410N700L392
51759D73611K90k941n499p246q387q845q556p915p304o508n256m000l425l378
51745C94641l013j982p53L12J527L248N156O578P332P950R092J0676J1642J0759
51731D63165P951M572K103Q51K85K09Q62J908K247J174q29k831m494n946o967
51716D64260o911n483l267j315m08o44j598k678l348l153j842M25K982M961N715
$$ y = [435368, 435348, 434591, 433320, 431872, 430147, 427795, 424860, 421970, 419894, 419000, 419050, 419466, 419895, 420591, 422088, 424396, 426697, 428027, 428094, 427252, 425837, 423840, 421222, 418228, 415281, 412716, 410724, 409427, 408803, 408524, 407972, 406601, 404360, 401692, 399077, 396700, 394694, 393447, 393256, 393681, 393752, 393012, 392031, 391564, 391592, 391553, 391334, 391494, 392472, 393963, 395237, 395973, 396696, 398446, 401953, 407110, 413356, 420509, 428879, 438426, 448221, 457109, 464519, 470219, 473611, 473901, 470960, 465461, 458215, 449828, 440983, 432427, 424512, 417208, 410700, 405444, 401444, 398019, 394641, 391628, 389646, 388893, 389205, 390732, 393980, 399136, 405714, 413046, 420996, 430088, 440764, 452406, 463165, 471116, 475688, 477791, 478642, 478927, 479136, 479998, 481906, 484153, 485327, 484498, 481667, 477173, 471227, 464260, 457349, 451866, 448599, 447284, 446876, 446232, 444634, 441956, 438608, 435455, 433613, 434038, 437020, 441981, 447696]
51701D47696M976K934K71j982l021k750j637j52J554L409N014N462L838K14l882
51686D61944o491o984o437o087o006n632m938m314l608k287m63J001J598J671
51672D12967J682J619J387J229J503K380L907N922P689Q159O912M520J798r12
51658D60762l467n358n903m854k640k8K426M857P794J1015J2852J1466O904J195
51644D97021l796p760j0919j2779j2828j1751j0796j0179r100p250n351m084l241
51631C87187k227q66N37J580K047K101K226K654K956K520J400K40o05j358k214
51616C98178k946l323l402l271k906k457k264k358k301j809j165p22k61P34K307
51601C72034L857M699M677M385M873O866R982J2846J4121J3347J0821P088K913
$$ y = [447696, 452672, 455606, 455877, 453895, 450874, 448124, 446487, 446335, 447889, 451298, 456312, 461774, 465612, 465826, 461944, 455453, 448469, 442032, 435945, 429939, 424307, 419369, 415055, 411447, 409160, 408697, 409698, 411296, 412967, 414649, 416268, 417655, 418884, 420387, 422767, 426674, 432596, 440285, 448444, 455356, 459876, 461674, 460762, 457295, 451937, 446034, 441180, 438540, 438512, 440938, 445795, 453589, 464604, 477456, 488922, 495826, 497021, 493225, 485465, 474546, 461767, 448939, 437188, 426392, 416213, 407113, 399863, 394512, 390428, 387187, 384960, 384094, 384631, 386211, 388258, 390359, 392585, 395239, 398195, 400715, 402115, 402355, 401750, 400392, 398178, 395232, 391909, 388507, 385236, 382330, 379873, 377609, 375251, 372950, 371141, 369976, 369254, 368993, 369727, 372034, 375891, 380590, 385267, 389652, 394525, 401391, 411373, 424219, 438340, 451687, 462508, 469596, 472509]
51588D72509o66k928m079m835n334m918l156o10J762L725N856Q632J1762J4513
51574D92233J6315J6965J6530J5556J5143J6212J8324J9582J8232J4439J0261
51563F69792P884Q224J1049J5840K2097K9155L6133M1891M4936M3747L7940K9031
51551I97719J9521J0973L281m269j1810j8990k5639l1682l6694m0082m1746m2076
51539G78506m1314l9267l5856l1632k7504k4044k1199j8556j5877j3353j1450
51528D98454j0333r587q594p186n757m731m182l941l871l901l997m164m279m023
51514D19908l241k440k388l114l747l624l090k799k658k141j341j002j411j957
51500C84955j931j282l80N13J307J924K414K967L671M365M863N064M853M145L083
$$ y = [472509, 471843, 468915, 464836, 460001, 454667, 449749, 446593, 445983, 447745, 451470, 457326, 465958, 477720, 492233, 508548, 525513, 542043, 557599, 572742, 588954, 607278, 626860, 645092, 659531, 669792, 677676, 685900, 696949, 712789, 734886, 764041, 800174, 842065, 887001, 930748, 968688, 997719, 1017240, 1028213, 1031494, 1027225, 1015415, 996425, 970786, 939104, 902410, 862328, 820582, 778506, 737192, 697925, 662069, 630437, 602933, 578889, 557690, 539134, 523257, 509904, 498454, 488121, 478534, 469940, 462754, 456997, 452266, 448084, 444143, 440272, 436371, 432374, 428210, 423931, 419908, 416667, 414227, 411839, 408725, 404978, 401354, 398264, 395465, 392807, 390666, 389325, 388323, 386912, 384955, 383024, 381742, 381362, 381875, 383182, 385106, 387520, 390487, 394158, 398523, 403386, 408450, 413303, 417448, 420531]
51485D20531J885M82j274k977l797l553l129l421m278m961n243n510n899o042
51471C72814n657m894m022l199k604k373k314k058j642j545j935k257j914j030
51457C35370j71N73J601K878L582L180K439K725M278N859O467O769Q299J1552
51443C95401J5591J9168K1385K1315J8105J2115N264k25l162l369j363J305K243
51430E03773L0m303q391j0927j2197j2623j2022j0480q810p628o665n484m343
51417C99930l777l763l684k974j566M7J094J235J058J363J953J842Q41Q7N50J740
51401C95976K595K998L537M167M194L531L125L839N529P431R008J0156J0954J1563
51387D78603J2198J3056J4311J6194J8942K2522K6585L0727L4888L9467M4938
$$ y = [420531, 422416, 422898, 421624, 418647, 414850, 411297, 408168, 404747, 400469, 395508, 390265, 384755, 378856, 372814, 367157, 362263, 358241, 355042, 352438, 350065, 347751, 345693, 344051, 342506, 340571, 338314, 336400, 335370, 335199, 335772, 337373, 340251, 343833, 347013, 349452, 352177, 356455, 362314, 368781, 375550, 383849, 395401, 410992, 430160, 451545, 472860, 490965, 503080, 508344, 508119, 504957, 501588, 500225, 501530, 503773, 503803, 499500, 491109, 480182, 467985, 455362, 443340, 432860, 424050, 416422, 409757, 404273, 399930, 396153, 392390, 388706, 385732, 384166, 384213, 385307, 386542, 387600, 388963, 390916, 392758, 393599, 393686, 394236, 395976, 398571, 401569, 405106, 409273, 413467, 416998, 420123, 423962, 429491, 436922, 445930, 456086, 467040, 478603, 490801, 503857, 518168, 534362, 553304, 575826, 602411, 633138, 668026, 707493, 752431]
51376G52431N1149N6871O0259N9901N5407M7203L6294K4317J3038L187o017j5611
51364A138429k5387l4069m0821m5986n0338n4031n6321n6099n2798m7228m1347
51353F34004l6688l3042k9121k4379j9661j5997j3511j1728j0304r081p834o494
51341D16164n382m894n032n389n425m685l146j504p39j050j483j057m9L23n84
51326C76068k034k792k473j824j722k240k766k854k675k547k382j846r03J13Q87
51311C48010J244J045L21m93r13r37q77o64P6J169J734J259L62L1M88J148J435
51294C54438J160L96n20r50l92R69K413L344L585L207K386J493R80J072J624K253
51278C77458K544K259J499N18n71j723k532k379j271p5M73N86Q44J197J224J051
$$ y = [752431, 803580, 860451, 920710, 980611, 1036018, 1083221, 1119515, 1143832, 1156870, 1160057, 1154040, 1138429, 1113042, 1078973, 1038152, 992166, 941828, 887797, 831476, 775377, 722579, 675351, 634004, 597316, 564274, 535153, 510774, 491113, 475116, 461605, 449877, 439573, 430492, 422658, 416164, 410782, 405888, 400856, 395467, 390042, 385357, 382211, 380707, 379968, 378918, 377435, 376378, 376329, 376652, 376068, 374034, 371242, 368769, 366945, 365223, 362983, 360217, 357363, 354688, 352141, 349759, 347913, 347010, 347123, 348010, 349254, 350299, 350620, 350127, 349214, 348277, 347400, 346736, 346812, 347981, 349715, 350974, 351336, 351367, 351855, 353003, 354438, 355598, 355994, 355474, 354524, 354132, 355101, 357514, 360858, 364443, 367650, 370036, 371529, 372509, 373581, 375205, 377458, 380002, 382261, 383760, 384278, 383707, 381984, 379452, 377073, 375802, 375727, 376200, 376786, 377630, 378827, 380051, 381102]
51262C81102J167J406R70l58j745k390k468k568k720k504j826j145r28j253j809
51247C62931k109j801r88j29M66Q61J103R16J00r35j458j213o34k73k68m48o59
51230C55462q18p26j61Q03J643J794J216M35p6l45o19q35o81j18N44J100J617
51213C60235K028J950J213K75k48k30M9M95J248K178K776K732K354K215K484K753
51197C84507K410J222l72j484j494o62J66M89N98R49J396J387P80J2m97p76r93
51180C87638j124j113j114j257j393j310j099r77r09p24n08n13o75o13j81L53
51164C74481P00Q68R85J106J287J535J608J262P54O91J151J474J154M62j46o94
51148C88678j243j367p55k0r1r46j705j950k111k481k575j828l90J099K079K301
$$ y = [381102, 382269, 383675, 384645, 384287, 382542, 380152, 377684, 375116, 372396, 369892, 368066, 366921, 365993, 364740, 362931, 360822, 359021, 358033, 357904, 358370, 359231, 360334, 361250, 361350, 360415, 358957, 357744, 357110, 356837, 356569, 356121, 355462, 354644, 353918, 353757, 354560, 356203, 357997, 359213, 359648, 359572, 359227, 358608, 357773, 357092, 356974, 357518, 358618, 360235, 362263, 364213, 365426, 365701, 365453, 365223, 365272, 365767, 367015, 369193, 371969, 374701, 377055, 379270, 381754, 384507, 386917, 388139, 387767, 386283, 384789, 384127, 384293, 384782, 385380, 386329, 387725, 389112, 389892, 389904, 389407, 388631, 387638, 386514, 385401, 384287, 383030, 381637, 380327, 379228, 378251, 377342, 376618, 376110, 375597, 374922, 374309, 374128, 374481, 375181, 376049, 377034, 378140, 379427, 380962, 382570, 383832, 384586, 385277, 386428, 387902, 389056, 389518, 389372, 388678, 387435, 386068, 385313, 385293, 385202, 384256, 382551, 380601, 378490, 376009, 373434, 371606, 371216, 372315, 374394, 376695]
51132C76695J910J507J647K047J878R71J72J39M82N39M25O54J096J146P54N31
51116C92593P82J089J046R22J207J833K178J874J330J282J845K311K098J612J681
51101D15683K246K348J618R91J408K439K965K817K809L238L320K341O17r85j961
51086D41894k209j767r55m46o62j227j386r09k74j7k01m84m81m1O63J294J655
51069D34447J855K062K311K588L056L925N160O532P971R624J1427J2762J2732
51056E16452J0908P808M729L040L467N783R075J2321J4779J6052J6088J5282J4281
51043F50065J3351J1945R227N148P65k626m408m749m267l965n016p991j2224j6271
51029F28984j8973j9884j9055j6981j4594j2608j0794q420n411k371M33L166N295
$$ y = [376695, 378605, 380112, 381759, 383806, 385684, 386655, 386827, 386966, 387448, 387987, 388412, 389066, 390162, 391308, 392062, 392593, 393375, 394464, 395510, 396432, 397639, 399472, 401650, 403524, 404854, 406136, 407981, 410292, 412390, 414002, 415683, 417929, 420277, 421895, 422886, 424294, 426733, 429698, 432515, 435324, 438562, 441882, 444223, 444840, 443855, 441894, 439685, 437918, 436963, 436517, 435855, 434628, 433242, 432333, 432059, 432042, 431841, 431357, 430876, 430835, 431498, 432792, 434447, 436302, 438364, 440675, 443263, 446319, 450244, 455404, 461936, 469907, 479531, 490958, 503720, 516452, 527360, 535168, 539897, 542937, 546404, 552187, 561262, 573583, 588362, 604414, 620502, 635784, 650065, 663416, 675361, 684588, 689736, 690501, 687875, 683467, 678718, 674451, 670486, 665470, 657479, 645255, 628984, 610011, 590127, 571072, 554091, 539497, 526889, 516095, 507675, 502264, 499893, 500326, 503492, 508787]
51016E08787N608M086K731L402N466O769O547O043O338P035P474P950Q972J0223
51002E97431J1112J1764J2645J3563J3987J4048J4458J5318J5867J5606J5081
50991G50880J5117J5709J6085J5675J4630J3442J2444J1802J1693J2225J3198
50980I02900J4078J4287J3541J2082J0658J0169J1118J3416J6792K1245K6803
50969A067089L2991L9027M4690N0479N6660O2556O7254P0744P3783P6754P9201
50958A721228Q0512Q0502P9106P5984P0803O3795N5743M7445L9247L0992K2417
50947B367774J3628N304j646o571r247r950r678j0124j2685j7282k2365k6305
50935B260853k8558k9535k9844k9978l0387l1351l2856l4807l7321m0606m4540
$$ y = [508787, 514395, 518481, 521212, 524614, 530080, 536849, 543396, 549439, 555777, 562812, 570286, 578236, 587208, 597431, 608543, 620307, 632952, 646515, 660502, 674550, 689008, 704326, 720193, 735799, 750880, 765997, 781706, 797791, 813466, 828096, 841538, 853982, 865784, 877477, 889702, 902900, 916978, 931265, 944806, 956888, 967546, 977715, 988833, 1002249, 1019041, 1040286, 1067089, 1100080, 1139107, 1183797, 1234276, 1290936, 1353492, 1420746, 1491490, 1565273, 1642027, 1721228, 1801740, 1882242, 1961348, 2037332, 2108135, 2171930, 2227673, 2275118, 2314365, 2345357, 2367774, 2381402, 2386706, 2385060, 2378489, 2369242, 2359292, 2349614, 2339490, 2326805, 2309523, 2287158, 2260853, 2232295, 2202760, 2172916, 2142938, 2112551, 2081200, 2048344, 2013537, 1976216, 1935610, 1891070]
50924A891070m8616n2267n5214n7489n9200o0230o0162n8659n5975n2817m9647
50913A280794m6312m2459l8142l3725k9516k5681k2431j9891j7866j6020j4289
50902I74462j2875j1822j0860r751q546p433o481n647m814l817k529j082K19J249
50888H90273K139K893L214L074L144M181N963P385P743P499P473P779Q044Q363
50874I69167R320J1072J3002J4474J5475J6268J6943J7605J8697K0694K3593K6965
50862A173275L0472L4126L8101M2464M7092N1818N6879O3113P1356Q1489R2433
50851A782618J03235J13748J24133J34272J44097J53847J63415J71822J78077
50842C069264J82255J84885J85519J82642J74984J62193J44356J21906R6203O9275
$$ y = [1891070, 1842454, 1790187, 1734973, 1677484, 1618284, 1558054, 1497892, 1439233, 1383258, 1330441, 1280794, 1234482, 1192023, 1153881, 1120156, 1090640, 1064959, 1042528, 1022637, 1004771, 988751, 974462, 961587, 949765, 938905, 929154, 920608, 913175, 906694, 901047, 896233, 892416, 889887, 888805, 889024, 890273, 892412, 895305, 898519, 901593, 904737, 908918, 914881, 922266, 930009, 937508, 944981, 952760, 960804, 969167, 978487, 989559, 1002561, 1017035, 1032510, 1048778, 1065721, 1083326, 1102023, 1122717, 1146310, 1173275, 1203747, 1237873, 1275974, 1318438, 1365530, 1417348, 1474227, 1537340, 1608696, 1690185, 1782618, 1885853, 1999601, 2123734, 2258006, 2402103, 2555950, 2719365, 2891187, 3069264, 3251519, 3436404, 3621923, 3804565, 3979549, 4141742, 4286098, 4408004, 4504207, 4573482]
50832D573482M2524J6383q469l0463m8328o2217p2748p9441q1020p7197o9330
50821D103176n9286m8342l7456k7960k1392j8792k0518k6557l6653m9887o4592
50810C691741p9152r2995j06416j19282j30370j38329j42891j44611j43657j39686
50800B454352j32776j23787j13591j02705r1767q1562p2184o2865n3138m3676
50790A576301l5377k8223k1639j5608j0578o669l676j704r40r01o91j84j39j000
50776A448972k240l258m321o012q162r981j1136j2115j3493j5243j6963j8464
50764A327584j9797k0918k1681k2071k2121k1560j9961j7425j4738j2519j0505
50753A124288q156n628l497j648P38L947P193R720J1864J4504J7993K2114K6662
$$ y = [4573482, 4616006, 4632389, 4623920, 4593457, 4545129, 4482912, 4410164, 4330723, 4249703, 4172506, 4103176, 4043890, 3995548, 3958092, 3930132, 3908740, 3889948, 3869430, 3842873, 3806220, 3756333, 3691741, 3612589, 3519594, 3413178, 3293896, 3163526, 3025197, 2882306, 2737695, 2594038, 2454352, 2321576, 2197789, 2084198, 1981493, 1889726, 1808164, 1735980, 1673115, 1619977, 1576301, 1540924, 1512701, 1491062, 1475454, 1464876, 1458207, 1454531, 1452827, 1451887, 1450986, 1450295, 1450111, 1449972, 1448972, 1446732, 1443474, 1439153, 1433141, 1424979, 1414998, 1403862, 1391747, 1378254, 1363011, 1346048, 1327584, 1307787, 1286869, 1265188, 1243117, 1220996, 1199436, 1179475, 1162050, 1147312, 1134793, 1124288, 1116132, 1110504, 1107007, 1105359, 1106097, 1110044, 1117237, 1126957, 1138821, 1153325, 1171318, 1193432, 1220094]
50740A220094L1516L6389M1221M6577N3012O0132O6948P3158P9351Q5733R1417
50729A885548R5417R7846R9484J00438R9967R7720R4448R0983Q6816Q0293P0141
50718B899101N6376L9646K0524k7k0067l7426n1058o0965o7005o8584o5726n9644
50706B585145n1786m2931l3578k4599j6859j0594n774k898k878o218j2666k1481
50694B352883l1741m2585n3435o3822p2875p9340q2449q2402p9805p5097o8850
50683A620482o1942n4875m7380l9302l1327k4112j7243r964k587L844R129J4111
50671A358834J9251K3918K7308K9210K9726K8991K7406K5527K3460K0953J8199
50660A632783J5881J4335J3285J2590J2414J2480J2000J0767R595R110Q900Q485
$$ y = [1220094, 1251610, 1287999, 1329220, 1375797, 1428809, 1488941, 1555889, 1629047, 1708398, 1794131, 1885548, 1980965, 2078811, 2178295, 2278733, 2378700, 2476420, 2570868, 2661851, 2748667, 2828960, 2899101, 2955477, 2995123, 3015647, 3015620, 2995553, 2958127, 2907069, 2846104, 2779099, 2710515, 2644789, 2585145, 2533359, 2490428, 2456850, 2432251, 2415392, 2404798, 2399024, 2396126, 2393248, 2387030, 2374364, 2352883, 2321142, 2278557, 2225122, 2161300, 2088425, 2009085, 1926636, 1844234, 1764429, 1689332, 1620482, 1558540, 1503665, 1456285, 1416983, 1385656, 1361544, 1344301, 1334337, 1331750, 1335594, 1344723, 1358834, 1378085, 1402003, 1429311, 1458521, 1488247, 1517238, 1544644, 1570171, 1593631, 1614584, 1632783, 1648664, 1662999, 1676284, 1688874, 1701288, 1713768, 1725768, 1736535, 1746130, 1755240, 1764140, 1772625]
50648A772625Q423R617J1907J4263J6303J8833K2783K8131L3968L9256M3369M6283
50636B065761M8379M9915N0681N0316M8921M7111M5535M4669M5153M7805N2335
50625B596581N5612N1797L5661P164k7035n7109p5990q2603q0408p3621o4698
50614B285351n4424m3291l2349k2737j4794q082k371J874M139M488K981r91p970
50601B111824j7199k6944l6082m4661n2802n9828o4728o6991o6742o4623o1670
50590A549554n8713n5589n1529m6461m1339l6913l2874k8646k4423k0816j7936
50579A134315j5387j2860j0302p776n608m327m004l861k984j293N45K001L164
50566A071623M493O332Q529J0455J1675J2654J4340J6941J9648K1873K4069K6891
$$ y = [1772625, 1781048, 1790665, 1802572, 1816835, 1833138, 1851971, 1874754, 1902885, 1936853, 1976109, 2019478, 2065761, 2114140, 2164055, 2214736, 2265052, 2313973, 2361084, 2406619, 2451288, 2496441, 2544246, 2596581, 2652193, 2703990, 2739651, 2746815, 2719780, 2662671, 2586681, 2504078, 2423670, 2350049, 2285351, 2230927, 2187636, 2155287, 2132550, 2117756, 2109674, 2107303, 2109177, 2113316, 2117804, 2120785, 2119794, 2111824, 2094625, 2067681, 2031599, 1986938, 1934136, 1874308, 1809580, 1742589, 1675847, 1611224, 1549554, 1490841, 1435252, 1383723, 1337262, 1295923, 1259010, 1226136, 1197490, 1173067, 1152251, 1134315, 1118928, 1106068, 1095766, 1087990, 1082382, 1078055, 1074051, 1070190, 1067206, 1065913, 1066458, 1068459, 1071623, 1076116, 1082448, 1090977, 1101432, 1113107, 1125761, 1140101, 1157042, 1176690, 1198563, 1222632, 1249523]
50554A249523L0112L3034L5405L7181L7718L6180L2736K8637K5034K2260K0351
50543A588171J9605K0278K2138K4656K7495L0701L4493L8920M3717M8534N3343
50532A952051N8427O3877O9363P4647Q0083Q6357R3763J01838J09529J15596J19156
50521B924687J20131J19019J16092J11054J03460R3101P9841O3618M4921K4874
50511C800798M481j5826l5658n4296p1247q6588j00049j10224j15476j15397j10773
50500B989745j02424r0845p6769o1172m4664k7535j0356O071K1282L4976M6133
50489B684442N3065N4492N0083L9927K4207L756j9526m3140o4815q2956r6888
50478B602647j06766j12928j15385j14334j10970j06917j02739r7679r1059q3252
$$ y = [1249523, 1279635, 1312669, 1348074, 1385255, 1422973, 1459153, 1491889, 1520526, 1545560, 1567820, 1588171, 1607776, 1628054, 1650192, 1674848, 1702343, 1733044, 1767537, 1806457, 1850174, 1898708, 1952051, 2010478, 2074355, 2143718, 2218365, 2298448, 2384805, 2478568, 2580406, 2689935, 2805531, 2924687, 3044818, 3163837, 3279929, 3390983, 3494443, 3587544, 3667385, 3731003, 3775924, 3800798, 3805279, 3789453, 3753795, 3699499, 3628252, 3541664, 3441615, 3331391, 3215915, 3100518, 2989745, 2887321, 2796476, 2719707, 2658535, 2613871, 2586336, 2575980, 2582051, 2603333, 2638309, 2684442, 2737507, 2791999, 2842082, 2882009, 2906216, 2909972, 2890446, 2847306, 2782491, 2699535, 2602647, 2495881, 2382953, 2267568, 2153234, 2042264, 1935347, 1832608, 1734929, 1643870, 1560618]
50468A560618p5058o6928n9293n2883m7931m3467l8200l2041k6144k1502j8000
50457A079171j4840j1495q019m767j952N30K849M822O002O346O655P932J0341
50444A083575J3020J5030J6175J6727J6597J5248J2575R447O958N247L533J399
50432A215531m58j083l78R94K584M375O264P880R107J0300J1860J3886J6348J9264
50418A316474K2607K6295L0349L4816L9464M3858M7851N1689N5483N8843O1202
50407A788931O2313O2281O1260N9266N6225N2178M7413M2300L6818L0390K2408
50396B321783J2865K169r474k2089l5290m8020n9077o7657p3324p5847p5308p2195
50384A798536o7157o0710n3141m4615l5340k5767j6505p849M14Q471J5842K1586
$$ y = [1560618, 1485560, 1418632, 1359339, 1306456, 1258525, 1215058, 1176858, 1144817, 1118673, 1097171, 1079171, 1064331, 1052836, 1044817, 1040050, 1038098, 1038628, 1041477, 1046299, 1052301, 1058647, 1065302, 1073234, 1083575, 1096595, 1111625, 1127800, 1144527, 1161124, 1176372, 1188947, 1198394, 1205352, 1210599, 1214132, 1215531, 1215073, 1213990, 1213612, 1214606, 1217190, 1221565, 1227829, 1235709, 1244816, 1255116, 1266976, 1280862, 1297210, 1316474, 1339081, 1365376, 1395725, 1430541, 1470005, 1513863, 1561714, 1613403, 1668886, 1727729, 1788931, 1851244, 1913525, 1974785, 2034051, 2090276, 2142454, 2189867, 2232167, 2268985, 2299375, 2321783, 2334648, 2336817, 2327343, 2305254, 2269964, 2221944, 2162867, 2095210, 2021886, 1946039, 1870731, 1798536, 1731379, 1670669, 1617528, 1572913, 1537573, 1511806, 1495301, 1487452, 1487866, 1496337, 1512179, 1533765]
50372A533765K5011K5799K3587J8065R645l96j0728k0623k9758l7700m3832m7722
50360A445113m9430m9503m8652m7252m5309m3061m1206m0140l9252l7577l4987
50349I68744l2092k9156k5863k2230j8913j6330j4183j2043r842p539n055k740
50337G72758j158j37J208L101M624N147N367O155P176P668P941Q963J0809J2685
50323H52307J4374J6471J9081K1295K2200K1473J8751J3479O050j584p220j0094
50311I86583j0886j0502r446q011o398m583k559p37K82M30K59K03J26j30j35Q34
50295I35330K834N051O567P075O720N736M571M034M764O490Q340J0075J2699J7487
50281A037773K4327L0899L3446K8879J7098J712j2006k0513k3581k2964k0286
$$ y = [1533765, 1558776, 1584575, 1608162, 1626227, 1635872, 1635476, 1624748, 1604125, 1574367, 1536667, 1492835, 1445113, 1395683, 1346180, 1297528, 1250276, 1204967, 1161906, 1120700, 1080560, 1041308, 1003731, 968744, 936652, 907496, 881633, 859403, 840490, 824160, 809977, 797934, 788092, 780553, 775498, 772758, 771600, 771463, 772671, 775772, 780396, 785543, 790910, 797065, 804241, 811909, 819850, 828813, 839622, 852307, 866681, 883152, 902233, 923528, 945728, 967201, 985952, 999431, 1005481, 1003897, 996677, 986583, 975697, 965195, 955749, 947738, 941340, 936757, 934198, 933461, 933743, 934173, 934432, 934635, 934761, 934631, 934496, 935330, 938164, 943215, 949782, 956857, 963577, 969313, 973884, 977918, 982682, 989172, 997512, 1007587, 1020286, 1037773, 1062100, 1092999, 1126445, 1155324, 1172422, 1174134, 1162128, 1141615, 1118034, 1095070, 1074784]
50270A074784j6532j2724r922q483p865p430p025o742o450n825m678l071j286
50257I76751K31R57O02n96j868k446k186j590j092n57K72J029J095O56P78K162
50241I74198M369O549Q470J0352J2216J3920J5561J7283J8939K0446K2151K4328
50229A148782K6395K7367K6958K5653K3738K1058J7810J4929J3259J2822J3144
50218A371915J3773J4097J3112R981M751j869r292j7261k5329l2600l8145m1481
50206A261652m2488m1180l7851l3337k8664k4221j9583j4543j0206q472j0244
50195I90863j4485j9209k3012k5425k6348k5830k4300k2407k0492j8536j6594
50184G54225j4902j3457j1927j0155q497p460p127p132p013o524n678m668l724
$$ y = [1074784, 1058252, 1045528, 1035606, 1027123, 1019258, 1011828, 1004803, 998061, 991611, 985786, 981108, 978037, 976751, 976982, 977939, 978541, 977945, 976077, 973631, 971445, 969855, 968763, 968206, 968478, 969507, 970602, 971258, 972036, 974198, 978567, 985116, 993586, 1003938, 1016154, 1030074, 1045635, 1062918, 1081857, 1102303, 1124454, 1148782, 1175177, 1202544, 1229502, 1255155, 1278893, 1299951, 1317761, 1332690, 1345949, 1358771, 1371915, 1385688, 1399785, 1412897, 1422878, 1427629, 1425760, 1416468, 1399207, 1373878, 1341278, 1303133, 1261652, 1219164, 1177984, 1140133, 1106796, 1078132, 1053911, 1034328, 1019785, 1009579, 1001107, 990863, 976378, 957169, 934157, 908732, 882384, 856554, 832254, 809847, 789355, 770819, 754225, 739323, 725866, 713939, 703784, 695287, 687827, 680700, 673568, 666555, 660031, 654353, 649685, 645961]
50171F45961l036k744k854l038k740j663r4J373K321K569K061J122O05J353L346
50156F44542N696P523Q646R449J0369J1488J2347J2155J0481P786M993K622O02
50143G48699j111k314l017l585m108m102l114j333P77L080N568P812R144R469
50129G61865R437R681J0269J0964J1741J2769J4154J5864J7935K0457K3458K6934
50117I45528L0958L5538M0386M5090M9510N3653N7062N8764N8263N6347N4414
50106A485513N3065N1901N0667M9966N0475N1807N2407N0432M4579L4607K1427
50095A996846O533q857k3931l7641m8607n6139o0843o3697o4872o4044o1387n7590
50083A455771n3052m7816m2198l6716l1469k6323k1763j8763j7558j7189j6577
$$ y = [645961, 642925, 640181, 637327, 634289, 631549, 629886, 629792, 631165, 633486, 636055, 638116, 639238, 639843, 641196, 644542, 650238, 657761, 666407, 675856, 686225, 697713, 710060, 722215, 732696, 740482, 745475, 748097, 748699, 747588, 745274, 742257, 738672, 734564, 730462, 727348, 726015, 726792, 729872, 735440, 743252, 752396, 761865, 771302, 780983, 791252, 802216, 813957, 826726, 840880, 856744, 874679, 895136, 918594, 945528, 976486, 1012024, 1052410, 1097500, 1147010, 1200663, 1257725, 1316489, 1374752, 1431099, 1485513, 1538578, 1590479, 1641146, 1691112, 1741587, 1793394, 1845801, 1896233, 1940812, 1975419, 1996846, 2003379, 1994522, 1970591, 1932950, 1884343, 1828204, 1767361, 1703664, 1638792, 1574748, 1513361, 1455771, 1402719, 1354903, 1312705, 1275989, 1244520, 1218197, 1196434, 1177671, 1160113, 1142924, 1126347]
50072A126347j5530j4445j3574j2928j2517j2261j2012j1826j1968j2387j2590
50061I84309j2176j1271j0244r390q930q924r038q834q378q030p575o279m089
50048H71151k004p51J73J553L169M352N280O711Q628J0086J0537J0453J0483J0705
50034I50526J0913J1055J1035J0602R760Q914Q263P313N390K500n19k702l704
50021A029346l952m205m795n366n430n197n584p255r825j2120j3114j2580j1029
50008I28894r198p530o033m512k814p70J951N663J0283J5300K0157K4579K8550
49995A004520L2026L4780L6460L6957L6653L6074L5165L3147K9488K4822K0486
49984A360578J7271J5005J3388J2568J2608J2810J1903Q661K221p585j9665l1737
$$ y = [1126347, 1110817, 1096372, 1082798, 1069870, 1057353, 1045092, 1033080, 1021254, 1009286, 996899, 984309, 972133, 960862, 950618, 941228, 932298, 923374, 914336, 905502, 897124, 889094, 881519, 875240, 871151, 869147, 868396, 868569, 870122, 873291, 877643, 882923, 889634, 898262, 908348, 918885, 929338, 939821, 950526, 961439, 972494, 983529, 994131, 1003891, 1012805, 1021068, 1028381, 1033771, 1036271, 1035752, 1033050, 1029346, 1025394, 1021189, 1016394, 1011028, 1005598, 1000401, 994817, 987562, 977737, 965617, 952503, 939923, 928894, 919696, 912166, 906133, 901621, 898807, 898037, 899988, 905651, 915934, 931234, 951391, 975970, 1004520, 1036546, 1071326, 1107786, 1144743, 1181396, 1217470, 1252635, 1285782, 1315270, 1340092, 1360578, 1377849, 1392854, 1406242, 1418810, 1431418, 1444228, 1456131, 1464792, 1467013, 1459428, 1439763, 1408026]
49972A408026m1639m8667n3249n5612n5425n2852m9082m5320m1594l7169l1850
49961H95567k6440k1870j8333j5305j2180q767n403k597m31J625M067O591Q277
49948H04801Q507P418N533L361J470L57j01o90j961l614n118o622q728j1531j4484
49933G78598j7086j9148k0384k0382j9205j7409j5365j2993j0463q493p502o881
49921F03287n690l801j784KJ585K740K998K462J964K113K681L337M404O297Q471
49906F31066R748R764R492J0064J1585J3390J4965J6046J6102J4578J1729Q679
49894G77208O248M187J827r02l542n887q149j0424j2480j4119j5279j5775j5365
49881F87548j4308j3456j3455j4016j4208j3404j1776r988q601p711o970n943
$$ y = [1408026, 1366387, 1317720, 1264471, 1208859, 1153434, 1100582, 1051500, 1006180, 964586, 927417, 895567, 869127, 847257, 828924, 813619, 801439, 792672, 787269, 784672, 784241, 785866, 789933, 796524, 804801, 813308, 820726, 826259, 829620, 831090, 831447, 831346, 830656, 828695, 825081, 819963, 813341, 804613, 793082, 778598, 761512, 742364, 721980, 701598, 682393, 664984, 649619, 636626, 626163, 617670, 610168, 603287, 597597, 593796, 592012, 592014, 593599, 596339, 599337, 601799, 603763, 605876, 608557, 611894, 616298, 622595, 631066, 640814, 650578, 660070, 670134, 681719, 695109, 710074, 726120, 742222, 756800, 768529, 777208, 783456, 787643, 789470, 788568, 785026, 779139, 770990, 760566, 748086, 733967, 718688, 702913, 687548, 673240, 659784, 646329, 632313, 618105, 604701, 592925, 582937, 574336, 566625, 559655, 553712]
49869E53712m446k581n52J400K929L728L888L963M517N628O941Q150R341J0856
49855F07474J2788J4712J5967J6197J5428J3681J0918P544M565K766J909J090
$$ y = [553712, 549266, 546685, 546133, 547533, 550462, 554190, 558078, 562041, 566558, 572186, 579127, 587277, 596618, 607474, 620262, 634974, 650941, 667138, 682566, 696247, 707165, 714709, 719274, 722040, 723949, 725039]
$$ [...]
##END NTUPLES=NMR SPECTRUM
##END=
