##TITLE=AC1744_SEN00017_9276535_fUiwmSTxca
##JCAMPDX= 6.0         $$ Bruker NMR JCAMP-DX V2.0
##DATA TYPE= NMR SPECTRUM
##DATA CLASS= NTUPLES
##ORIGIN= BRUKER
##OWNER= Administrator
$$ 1.72 TOPSPIN		Version 2.1
$$ 2015-07-17 20:17:00.900 -0700  Administrator@X
$$ Compression mode = diff/dup
##.OBSERVE FREQUENCY= 400.02188249412
##.OBSERVE NUCLEUS= ^1H
##.ACQUISITION MODE= SIMULTANEOUS (DQD)
##.ACQUISITION SCHEME= undefined
##.AVERAGES= 8
##.DIGITISER RES= 22
##SPECTROMETER/DATA SYSTEM= spect
##.PULSE SEQUENCE= zg30
##.SOLVENT NAME= COFFEE_meoh
##.SHIFT REFERENCE= INTERNAL, COFFEE_meoh, 1, 14.98509
##AUDIT TRAIL= $$ (NUMBER, WHEN, WHO, WHERE, PROCESS, VERSION, WHAT)
$$ ##TITLE= Audit trail, TOPSPIN		Version 2.1
$$ ##JCAMPDX= 5.01
$$ ##ORIGIN= Bruker BioSpin GmbH
$$ ##OWNER= Administrator
$$ $$ E:\/data/COFFEE/nmr/AC1744_SEN00017_9276535_fUiwmSTxca/20/pdata/1/auditp.txt
$$ ##AUDIT TRAIL=  $$ (NUMBER, WHEN, WHO, WHERE, PROCESS, VERSION, WHAT)
(   1,<2015-07-17 20:16:53.822 -0700>,<Administrator>,<X>,<go>,<TOPSPIN 2.1>,
      <created by zg
	started at 2015-07-17 20:15:47.557 -0700,
	POWCHK enabled, PULCHK disabled,
       configuration hash MD5:
       21 0F 79 D6 B3 7B B4 F6 88 20 88 DB 03 48 BD 9F
       data hash MD5: 64K
       73 85 D7 39 5F 40 24 84 29 5D FA 53 5A 6C 59 8D>)
(   2,<2015-07-17 20:16:57.291 -0700>,<Administrator>,<X>,<proc1d>,<TOPSPIN 2.1>,
      <Start of raw data processing
       efp LB = 0 FT_mod = 6 PKNL = 1 PHC0 = 0 PHC1 = 0 SI = 32K 
       data hash MD5: 32K
       74 84 D5 FF 44 BA 2C 0B 4C 19 F0 D0 5B 72 31 C9>)
(   3,<2015-07-17 20:16:57.619 -0700>,<Administrator>,<X>,<proc1d>,<TOPSPIN 2.1>,
      <pk PHC0 = 87.96753 PHC1 = 0 
       data hash MD5: 32K
       42 D5 6B DB 14 90 FD 3B 80 54 BD 9B 08 58 B1 4F>)
(   4,<2015-07-17 20:16:57.713 -0700>,<Administrator>,<X>,<proc1d>,<TOPSPIN 2.1>,
      <abs ABSG = 1 
       data hash MD5: 32K
       2A 6D 4E 87 19 38 72 B3 2E FF 79 10 23 F5 AD 3F>)
(   5,<2015-07-17 20:16:57.775 -0700>,<Administrator>,<X>,<proc1d>,<TOPSPIN 2.1>,
      <abs ABSG = 2 
       data hash MD5: 32K
       D6 81 A9 F2 49 40 FD D4 E0 13 6A B9 45 40 A6 8D>)
(   6,<2015-07-17 20:16:57.838 -0700>,<Administrator>,<X>,<proc1d>,<TOPSPIN 2.1>,
      <abs ABSG = 3 
       data hash MD5: 32K
       2C BC 61 F2 97 C2 33 89 70 BA E8 7D 52 BD 80 B2>)
(   7,<2015-07-17 20:16:57.885 -0700>,<Administrator>,<X>,<proc1d>,<TOPSPIN 2.1>,
      <abs ABSG = 4 
       data hash MD5: 32K
       63 34 3C 20 BD EB 15 46 9F F8 8A 4B 90 66 6D 2B>)
(   8,<2015-07-17 20:16:57.932 -0700>,<Administrator>,<X>,<proc1d>,<TOPSPIN 2.1>,
      <abs ABSG = 5 
       data hash MD5: 32K
       19 CF F6 F1 F2 91 1B A9 1C 26 93 57 89 75 CC 72>)
$$ ##END=
$$ 
$$ $$ hash MD5
$$ $$ 93 A8 87 62 A8 19 E0 49 0B 9F C0 B1 AF 8D E8 55
##$RELAX= 
##$RELAX= 
##$RELAX= 
##$RELAX= 
##$RELAX= 
##$RELAX= 
##$RELAX= 
$$ Bruker specific parameters
$$ --------------------------
##$DU= <E:\>
##$EXPNO= 20
##$NAME= <AC1744_SEN00017_9276535_fUiwmSTxca>
$$ [...]
150 150 150 150 150 150 150 150
##$TP07= 0
##$TPNAME0= <>
##$TPNAME1= <>
##$TPNAME2= <>
##$TPNAME3= <>
##$TPNAME4= <>
##$TPNAME5= <>
##$TPNAME6= <>
##$TPNAME7= <>
##$TPOAL= (0..7)
0.5 0.5 0.5 0.5 0.5 0.5 0.5 0.5
##$TPOFFS= (0..7)
0 0 0 0 0 0 0 0
##$TUNHIN= 0
##$TUNHOUT= 0
##$TUNXOUT= 0
##$USERA1= <user>
##$USERA2= <user>
##$USERA3= <user>
##$USERA4= <user>
##$USERA5= <user>
##$V9= 5
##$VALIST= <valist>
##$VCLIST= <CCCCCCCCCCCCCCC>
##$VD= 0
##$VDLIST= <DDDDDDDDDDDDDDD>
##$VPLIST= <PPPPPPPPPPPPPPP>
##$VTLIST= <TTTTTTTTTTTTTTT>
##$WBST= 2048
##$WBSW= 25
##$XGAIN= (0..3)
0 0 0 0
##$XL= 0
##$YL= 0
##$YMAX_a= 595673
##$YMIN_a= -508093
##$ZGOPTNS= <>
##$ZL1= 120
##$ZL2= 120
##$ZL3= 120
##$ZL4= 120
##$ABSF1= 14.98509
##$ABSF2= -5.573092
##$ABSG= 5
##$ABSL= 3
##$ALPHA= 0
##$AQORDER= 0
##$ASSFAC= 0
##$ASSFACI= 0
##$ASSFACX= 0
##$ASSWID= 0
##$AUNMP= <proc_prof1d_extract_pilot.lims>
##$AXLEFT= 0
##$AXNAME= <>
##$AXNUC= <1H>
##$AXRIGHT= 0
##$AXTYPE= 0
##$AXUNIT= <>
##$AZFE= 0.1
##$AZFW= 0.1
##$BCFW= 0
##$BC_mod= 0
##$BYTORDP= 0
##$COROFFS= 0
##$CY= 15
##$DATMOD= 1
##$DC= 0
##$DFILT= <>
##$DTYPP= 0
##$F1P= 0
##$F2P= 0
##$FCOR= 0.5
##$FTSIZE= 32768
##$FT_mod= 6
##$GAMMA= 0
##$GB= 0
##$INTBC= 1
##$INTSCL= 1
##$ISEN= 128
##$LB= 0
##$LEV0= 0
##$LPBIN= 0
##$MAXI= 10000
##$MC2= 0
##$MEAN= 0
##$ME_mod= 0
##$MI= 0
##$NCOEF= 0
##$NC_proc= -8
##$NLEV= 6
##$NOISF1= 0
##$NOISF2= 0
##$NSP= 0
##$NTH_PI= 0
##$NZP= 0
##$OFFSET= 14.98509
##$PC= 1
##$PHC0= 87.96753
##$PHC1= 0
##$PH_mod= 1
##$PKNL= yes
##$PPARMOD= 0
##$PPDIAG= 0
##$PPIPTYP= 0
##$PPMPNUM= 2147483647
##$PPRESOL= 1
##$PSCAL= 4
##$PSIGN= 0
##$PYNMP= <proc.py>
##$REVERSE= no
##$SF= 400.02
##$SI= 32768
##$SIGF1= 0
##$SIGF2= 0
##$SINO= 400
##$SIOLD= 32768
##$SPECTYP= <>
##$SREGLST= <1H.CDCl3>
##$SSB= 0
##$STSI= 32768
##$STSR= 0
##$SW_p= 8223.68421052631
##$SYMM= 0
##$S_DEV= 0
##$TDeff= 65536
##$TDoff= 0
##$TI= <>
##$TILT= no
##$TM1= 0
##$TM2= 0
##$TOPLEV= 0
##$USERP1= <user>
##$USERP2= <user>
##$USERP3= <user>
##$USERP4= <user>
##$USERP5= <user>
##$WDW= 1
##$XDIM= 32768
##$YMAX_p= 340059663
##$YMIN_p= -692724
##$CURPLOT= <Network HP LaserJet P1505>
##$CURPRIN= <$Network HP LaserJet P1505>
##$DFORMAT= <normdp>
##$LAYOUT= <+/1D_H.xwp>
##$LFORMAT= <normlp>
##$PFORMAT= <normpl>
##$SURQMSG= 1
$$ End of Bruker specific parameters
$$ ---------------------------------
##NTUPLES= NMR SPECTRUM
##VAR_NAME=  FREQUENCY,     SPECTRUM/REAL,   SPECTRUM/IMAG
##SYMBOL=    X,             R,               I
##VAR_TYPE=  INDEPENDENT,   DEPENDENT,       DEPENDENT
##VAR_FORM=  AFFN,          ASDF,            ASDF
##VAR_DIM=   32768,         32768,           32768
##UNITS=     HZ,            ARBITRARY UNITS, ARBITRARY UNITS
##FACTOR=    0.250966925370066, 1,           1
##FIRST=     8223.43324360094, -76291,       282673
##LAST=      0,             119425,          -25878
##MIN=       0,             -692724,         0
##MAX=       8223.43324360094, 340059663,    0
$$ Real data points
##PAGE= N=1
##DATA TABLE= (X++(R..R)), XYDATA
$$ [...]
19472B5550L34084r4906d4993j38170M2263A3208J06825i1079p1634j88168f6817
$$ 25550 359634 264728 -44993 -183163 -140900 13208 120033 -91079 -162713 -350881 -66817
19460d07590J00599a42345L5047A28466g2785l23826J43578r2461a06419p4648
$$ -407590 -306991 -142345 -107298 128466 -72785 -396611 -253033 -345494 -106419 -181067
19450a81067j11835h1816n3246C32392b28234G3994b5440B64895E9444b1236k03132
$$ -181067 -292902 -81816 -135062 332392 -228234 73994 -25440 264895 59444 -21236 -224368
19439b24368B50568r2985a88027c8559B15444a84211O2063j24438j8887D9915
$$ -224368 250568 157583 -188027 -38559 215444 -184211 -122148 -246586 -265473 49915
19428a70492F0871d5182E023b71192A21886K14272c01149D9124j3381a17460E3971
$$ -170492 60871 -45182 5023 -271192 121886 336158 -301149 49124 35743 -117460 53971
19416d3890J0847B7197e2314A66888a52941l9917P3421H6262a94320a6653C17537
$$ -43890 -33043 27197 -52314 166888 -152941 -192858 -119437 86262 -194320 -16653 317537
19404I401J61004k3285F6183j0581c5253A71529A1571f5384D12623a00291L0401
$$ 9401 170405 147120 66183 55602 -35253 171529 11571 -65384 412623 -100291 -69890
19393f9890l11438G5048a3563B19767a66029j03359A3570K4701c5558k02497R3541
$$ -69890 -381328 75048 -13563 219767 -166029 -269388 13570 38271 -35558 -238055 -144514
19382a44514c0588H5688Q920b24436A3061J99949a81503I6210J4923c55222f2417
$$ -144514 -30588 85688 94608 -224436 13061 213010 -181503 96210 111133 -355222 -62417
19370A36175Q612A388L16404b3522B4463a86772A05016a07453k51759A35899c93462
$$ 136175 144787 1388 317792 -23522 24463 -186772 105016 -107453 -359212 135899 -393462
19358G5191c30942J30370D12905b72087A21422a26436o7271n4829h9369J8984
$$ 75191 -330942 -200572 412905 -272087 121422 -126436 -193707 -248536 -89369 -70385
19348g0385A7186a73019D3152J34509k9133c12390k5875Q6606b7580A2191J39999
$$ -70385 17186 -173019 43152 177661 148528 -312390 -338265 -251659 -27580 12191 152190
19337A52190a79429l5313E5450d17448L5856a32094j2999k42512h5273A81207
$$ 152190 -179429 -214742 55450 -417448 -381592 -132094 -145093 -387605 -85273 181207
19326i3172p9978A15189d18216J74398B80114C5092a2184l9232p5364n4394r0577
$$ -93172 -173150 115189 -418216 -243818 280114 35092 -12184 -51416 -126780 -181174 -271751
19315b71751B92i6197j05891A17569K3021c12200a35007j21779B33328b41946
$$ -271751 292 -96197 -202088 117569 140590 -312200 -135007 -256786 233328 -241946
19304A86517H5656a85327C8904g4921l06970A43029C4282b27752B91555C192e1736
$$ 186517 85656 -185327 38904 -74921 -381891 143029 34282 -227752 291555 3192 -51736
19292B5503a16944n8890j06508F3084K35007d00241L194P2137H1049J78759i7630
$$ 25503 -116944 -175834 -282342 63084 298091 -400241 -397047 -324910 81049 259808 -97630
19280B6193a81566A78254d47863a05668c1593m9483j20135B04820c8016n3837
$$ 26193 -181566 178254 -447863 -105668 -31593 -81076 -201211 204820 -38016 -91853
19270i1853l8627b56k11995b7857j71213A21588a27424k6708B70528a21734J5813
$$ -91853 -130480 -256 -212251 -27857 -199070 121588 -127424 -154132 270528 -121734 -105921
19259a05921A96046h104E2235Q9884a10743a0061k75442A20182E7135b38179i1222
$$ -105921 196046 -8104 52235 142119 -110743 -10061 -285503 120182 57135 -238179 -91222
19247A19074B4424a49051O1672F6902J02710r850b2769k82977a089l98247a45139
$$ 119074 24424 -149051 -87379 66902 169612 159762 -22769 -305746 -1089 -399336 -145139
19235I1966a59279q932l4405R5515D26773a66360Q2218L5054F168e7711r1865
$$ 91966 -159279 -168211 -202616 -107101 426773 -166360 -84142 -49088 6168 -57711 -149576
19224a49576a4951I7936L1313c86836e9909k47139k356G848J78414d7965m8956
$$ -149576 -14951 97936 129249 -386836 -59909 -307048 -309404 7848 186262 -47965 -96921
19213i6921L775r1496r4039B38145E6935k4358L0126m687a76232F7196b09382
$$ -96921 -93146 -184642 -278681 238145 56935 32577 62703 58016 -176232 67196 -209382
19201A12252B2196a56570A19825a14041d1921J5840k37264f9755k27072N0510
$$ 112252 22196 -156570 119825 -114041 -41921 -26081 -263345 -69755 -296827 -246317
19191b46317C0826a93727H0170i6194B7293P0275A4891d31087K06132i026A6243
$$ -246317 30826 -193727 80170 -96194 27293 97568 14891 -431087 -224955 -9026 16243
19179c51778L6164c330k98987a10135k5152k2021g4114J8788k09025b773j33618
$$ -351778 -315614 -3330 -302317 -110135 -135287 -157308 -74114 -55326 -264351 -2773 -136391
19168a36391l7624a4308G6026c5345K085r0767j2742L6577j71490C2119c47595
$$ -136391 -174015 -14308 76026 -35345 -33260 -124027 -136769 -100192 -271682 32119 -347595
19156c29825c4451J2844k47247c0634B23861a0264B20122H8412a66326o2835g5175
$$ -329825 -34451 -21607 -268854 -30634 223861 -10264 220122 88412 -166326 -229161 -75175
19144I9601B1326K635K9062b63742H2730h6735A47959D3760c58053A38465n7083
$$ 99601 21326 23961 53023 -263742 82730 -86735 147959 43760 -358053 138465 81382
19133H1382i1515J0435j31111d5184p2797r9761j6457m1774j37570J94791M8864
$$ 81382 -91515 -81080 -212191 -45184 -117981 -217742 -234199 -275973 -413543 -218752 -169888
19122a69888B8197J3589c1380B59760b61751k5359J40971B39196a61292j08043
$$ -169888 28197 41786 -31380 259760 -261751 -287110 -146139 239196 -161292 -269335
19112b69335R6694a6761B97627a48476e2982F5994b67941J09716k6503m4171E4789
$$ -269335 -172641 -16761 297627 -148476 -52982 65994 -267941 -158225 -184728 -228899 54789
19100E7125c73733A9567d86628B06972c2678j40084f7542l08907e4039C39390
$$ 57125 -373733 19567 -486628 206972 -32678 -172762 -67542 -376449 -54039 339390
19089a65989I8410l5320b30910N3504j84914I9799M0626m7556a29958e2931B24004
$$ -165989 98410 63090 -230910 -177406 -362320 99799 140425 92869 -129958 -52931 224004
19077a17693L0399C7849f03795a07413d1938G5084J3965R4963c65491A03738O9785
$$ -117693 -87294 37849 -603795 -107413 -41938 75084 89049 184012 -365491 103738 173523
19066A73523C3913b9670j26868g5302k2761A13751B0556O9630a81938C3402a87241
$$ 173523 33913 -29670 -156538 -75302 -98063 113751 20556 90186 -181938 33402 -187241
19054a90213A42062i6019a2373p7949a0554A85901a63909O2070K1243A22540a3566
$$ -190213 142062 -96019 -12373 -90322 -10554 185901 -163909 -101839 -80596 122540 -13566
19042E34a09533A55947g6161A80634a15802j12955h7635d0186A96683G8103D914
$$ 534 -109533 155947 -76161 180634 -115802 -228757 -87635 -40186 196683 78103 4914
19030a58975d439A83510c39804B18930a7332E4034a6356j24035K6152C6199f9205
$$ -158975 -4439 183510 -339804 218930 -17332 54034 -16356 -140391 -114239 36199 -69205
19018a21785A69003a43285N5225j91821M5266A4326J3838J33590J3147a95984
$$ -121785 169003 -143285 -88060 -279881 -234615 14326 28164 161754 174901 -195984
19007b16442j09041A07547a5594j32992A4781i3726K7651A2583K89496b60045
$$ -216442 -325483 107547 -15594 -148586 14781 -93726 -66075 12583 302079 -260045
18996a02328B0961a45449k90874J49104m5925m5905a65165l71778A49775a41097
$$ -102328 20961 -145449 -436323 -287219 -333144 -379049 -165165 -536943 149775 -141097
18985A07436D8662a70827A3034J53721o8784b69949A24885J0251a34210L4647
$$ 107436 48662 -170827 13034 166755 97971 -269949 124885 135136 -134210 -99563
18975i9563J5540H6016a37618B00901J21649d3677A28270P6757a36999A63989
$$ -99563 -84023 86016 -137618 200901 322550 -43677 128270 205027 -136999 163989
18964b34908c1490o8218A95849K4328a73554O7430B95601h7735b7925A17791a42196
$$ -234908 -31490 -99708 195849 220177 -173554 -106124 295601 -87735 -27925 117791 -142196
18952A29798b93407C63292G4305Q6045J87323b73061K6480I2557a19766k86266
$$ 129798 -293407 363292 74305 160350 347673 -273061 -246581 92557 -119766 -406032
18942d06032a97056B6782a3554m96635A39621E0885c8937q8184a3424A81918q442
$$ -406032 -197056 26782 -13554 -510189 139621 50885 -38937 -127121 -13424 181918 173476
18931A73476C8799a36667e2434k86981E8450a47109C53660a36882C01252h7462
$$ 173476 38799 -136667 -52434 -339415 58450 -147109 353660 -136882 301252 -87462
18920b81276a16838a4011G0821e1417A10340J94602A02535d1231j07616J0725
$$ -281276 -116838 -14011 70821 -51417 110340 304942 102535 -41231 -148847 -138122
18910a38122c7847q3751j1982j2523e0503l66707A02610g6063k019A05668K55815
$$ -138122 -37847 -121598 -133580 -146103 -50503 -417210 102610 -76063 -78082 105668 361483
18899C61483b47446L4703o154k5198j61681E9318M9171K8874a6482l36673E1918
$$ 361483 -247446 -212743 -218897 -244095 -405776 59318 108489 137363 -16482 -353155 51918
18887g7210k3906J2683n7618K4507C2535j6135M6597C976M2996a55603g3957k98454
$$ -77210 -101116 -88433 -146051 -121544 32535 16400 62997 3976 46972 -155603 -73957 -372411
18875c72411b3522o6691I4063l7765a93880c2420A43093e2437B3361O9554b53320
$$ -372411 -23522 -90213 94063 56298 -193880 -32420 143093 -52437 23361 92915 -253320
18863A32646h0705a323j24565i215B94182d4422o455A34995m4257O4618a80264
$$ 132646 -80705 -1323 -125888 -9215 294182 -44422 -50877 134995 90738 155356 -180264
18851B16473c0146j55494D6318c56131B36452G0372b39177j5087P9822J9209a2879
$$ 216473 -30146 -185640 46318 -356131 236452 70372 -239177 -254264 -174442 -155233 -12879
18839a11701a3030k58624a16523j00403R5768A76002b24506b688k77175b2333
$$ -111701 -13030 -271654 -116523 -216926 -121158 176002 -224506 -2688 -279863 -22333
18828c01197a33438K5491j83527M9732R9897J9266A85398a13341H0562a54332
$$ -301197 -133438 -107947 -291474 -241742 -141845 -122579 185398 -113341 80562 -154332
18817A79443C7851c8665A65840l7469b53127A36719a19166D0881F550K6871K5899
$$ 179443 37851 -38665 165840 128371 -253127 136719 -119166 40881 6550 33421 59320
18806E9320K9177l3687i8685d2433A98745J64174a15839a1888h62r9997a9402
$$ 59320 88497 54810 -98685 -42433 198745 362919 -115839 -11888 -862 -100859 -19402
18794b11607A6876K00314i0606A10108j7475l5896a40097A62788j8571h2942A64922
$$ -211607 16876 217190 -90606 110108 92633 56737 -140097 162788 144217 -82942 164922
18782B376Q4544b70917A1298Q5493h4865I5368c50838A9990R7218d4863l66272
$$ 2376 86920 -270917 11298 96791 -84865 95368 -350838 19990 117208 -44863 -411135
18771d11135C2485K3310b17455B16938C4622a83523A99534M2883B1488b33116
$$ -411135 32485 55795 -217455 216938 34622 -183523 199534 242417 21488 -233116
18760d4976j52863A38286b11244B09834a65710p6675L96g9195n0538l0812g2581
$$ -44976 -197839 138286 -211244 209834 -165710 -242385 -241989 -79195 -129733 -160545 -72581
18748b40824G5295O894J59926d09076a5363k4701j51842j84185B09891I8357h6434
$$ -240824 75295 82189 242115 -409076 -15363 -40064 -191906 -376091 209891 98357 -86434
18736a00807q7199A46023K1618b56241E3617a27930j60709k35763J49103R3757
$$ -100807 -188006 146023 167641 -256241 53617 -127930 -288639 -524402 -375299 -281542
18726b81542i2622A55167c69560D4263e4905o5683a3855A79511h4963B6368b25356
$$ -281542 -92622 155167 -369560 44263 -54905 -120588 -13855 179511 -84963 26368 -225356
18714a02229K0507l8357G2024a839A72685p4351a72676B29689a24934F834b04565
$$ -102229 -81722 -120079 72024 -1839 172685 98334 -172676 229689 -124934 6834 -204565
18702a2989m5543G036b59844J6277A31289b56314a05662B4674a92776B3762a10541
$$ -12989 -58532 7036 -259844 -243567 131289 -256314 -105662 24674 -192776 23762 -110541
18690A1104d6491k971j46097e1158G1846g3001j49696o3592A0461c644l3565o1382
$$ 11104 -46491 -49462 -195559 -51158 71846 -73001 -222697 -286289 10461 -3644 -37209 -98591
18678i8591k46091E201K8067b71527A25882e6093D9658i7541j91565C97059b29296
$$ -98591 -344682 5201 33268 -271527 125882 -56093 49658 -97541 -289106 397059 -229296
18666a94345g6226k63884a27002j8980j07226H354b04969B6620e0449A06966a07447
$$ -194345 -76226 -340110 -127002 -145982 -253208 8354 -204969 26620 -50449 106966 -107447
18654A37816f0101F1817b32103A79340B8470c70336f3360A33224O8431j4300a92314
$$ 137816 -60101 61817 -232103 179340 28470 -370336 -63360 133224 201655 187355 -192314
18642b1917j89044R5213I9268a09596C40443f8480o7171j98580A14422J1901a63719
$$ -21917 -210961 -115748 99268 -109596 340443 -68480 -135651 -334231 114422 126323 -163719
18630b10556G9399j9258a42373M930E7535d8187k8491k62488I181P2315N9610
$$ -210556 79399 60141 -142373 -137443 57535 -48187 -76678 -339166 9181 81496 141106
18619A41106d5816F8377a20013A48086c36233a34258c5321k08202A24506j5803
$$ 141106 -45816 68377 -120013 148086 -336233 -134258 -35321 -243523 124506 108703
18609A08703a09092j43697R8789N0695F4163Q4695a35205p2886A58441b05006
$$ 108703 -109092 -252789 -154000 -103305 64163 148858 -135205 -208091 158441 -205006
18598a19271B8677F477a34916m3150o3131j2230F3619M5081a82656h7897C0211
$$ -119271 28677 6477 -134916 -178066 -241197 -253427 63619 108700 -182656 -87897 30211
18586c7385m4572C24596A33169J04476b67272B55079h9029m703A08115d1004D3808
$$ -37385 -81957 324596 133169 237645 -267272 255079 -89029 -93732 108115 -41004 43808
18574a42566m4458b1045j0553A41093a49177e9339j25086B66223b48354A07876
$$ -142566 -187024 -21045 -31598 141093 -149177 -59339 -184425 266223 -248354 107876
18563d02090d0083G7971J97777I9921a89585h1779K6138H9312Q5176f7539A1381
$$ -402090 -40083 77971 275748 99921 -189585 -81779 -55641 89312 174488 -67539 11381
18551A23753D764O8337c99674a80040f2168K1555B07907a61173G8361b83649A12541
$$ 123753 4764 73101 -399674 -180040 -62168 -40613 207907 -161173 78361 -283649 112541
18539a65668k39854E7061J82821K0569c08006E8810b45269F8716b64849A09479
$$ -165668 -405522 57061 239882 260451 -308006 58810 -245269 68716 -264849 109479
18528D946a2097B51482a43457i748A57778c36301B98973e1534C7159a77596M3135
$$ 4946 -12097 251482 -143457 -9748 157778 -336301 298973 -51534 37159 -177596 -134461
18517a34461M2282L9330j36179h3253B3893J10372d20549a7160l0211A93805k0109
$$ -134461 -92179 -52849 -189028 -83253 23893 134265 -420549 -17160 -47371 193805 173696
18506A73696a01738A89704d8440A48980j618K09922a24292A6770b4261j31003
$$ 173696 -101738 189704 -48440 148980 147362 357284 -124292 16770 -24261 -155264
18496a55264R383C1627b00770A3194i8546B22191B084K60932I5252b10685N7261
$$ -155264 -145881 31627 -200770 13194 -98546 222191 2084 263016 95252 -210685 -153424
18485a53424e3045j21188B302a78249p581N5386a4535j55076d1615A22522b03381
$$ -153424 -53045 -174233 2302 -178249 -185830 -130444 -14535 -169611 -41615 122522 -203381
18473i8122A41038c3707m4881A51571D9142b60003B4606b01259F7502a35283N9425
$$ -98122 141038 -33707 -78588 151571 49142 -260003 24606 -201259 67502 -135283 -75858
18462g5858I4279a20327B23270a85613M7672p674f9522g146A05633D0866b11244
$$ -75858 94279 -120327 223270 -185613 -137941 -145615 -69522 -7146 105633 40866 -211244
18450E4340l858g0807B3599J29293m5449a22940b5489B04483c4893A27678a77439
$$ 54340 50482 -70807 23599 152892 107443 -122940 -25489 204483 -34893 127678 -177439
18438c99801d7054A56468O9525H2722a40709j49578Q897J24047O2303A22443n4546
$$ -399801 -47054 156468 225993 82722 -140709 -290287 -281390 -157343 -95040 122443 67897
18427F7897P4951F4217b31422c9166j90367g630B62908C0122g0423J7329n605
$$ 67897 142848 64217 -231422 -39166 -229533 -7630 262908 30122 -70423 -53094 -58699
18416e8699l1598F192d04911d219r2232m2695B92922b0667j33139P195A68795
$$ -58699 -90297 6192 -404911 -4219 -96451 -139146 292922 -20667 -153806 -146611 168795
18404A1885J15577Q7387a73932c6366o4299C17256A56558J57128j37443C1571
$$ 11885 127462 214849 -173932 -36366 -100665 317256 156558 313686 176243 31571
18393a20650B72670H7638M309c91723F1366b80686h560B7281e904G6391e22638
$$ -120650 272670 87638 91947 -391723 61366 -280686 -8560 27281 -5904 76391 -522638
18381a59359A03128a28505d6673j2197r000K1917j98963H0257i3618D0741b27888
$$ -159359 103128 -128505 -46673 -58870 -67870 -45953 -244916 80257 -93618 40741 -227888
18369g2827j87236J23023q2393b5503C0082d2528j73836A31081b99949B73310
$$ -72827 -260063 -137040 -219433 -25503 30082 -42528 -216364 131081 -299949 273310
18358A76369a79059L0493N9931p9781a9812D0652a75166J8424l3563A03551d3770
$$ 176369 -179059 -148566 -88635 -168416 -19812 40652 -175166 -156742 -190305 103551 -43770
18346C99628c04260c9339B45108A1177b43916A69959b04907j58584a67821p1772
$$ 399628 -304260 -39339 245108 11177 -243916 169959 -204907 -363491 -167821 -239593
18336b39593J01170g868k5987b110j13646j97091a36594f511m74j48165J074n8550
$$ -239593 -138423 -7868 -33855 -2110 -115756 -312847 -136594 -6511 -6985 -155150 -154076 -212626
18324b12626B5825K17117b45844D00774D6365J56223a6378F384R6521b25958C80623
$$ -212626 25825 242942 -245844 400774 46365 202588 -16378 6384 102905 -225958 380623
18312A12097a2757m7935C39568A09676c60002H7665e06605J75709B75341h637
$$ 112097 -12757 -60692 339568 109676 -360002 87665 -506605 -330896 275341 -8637
18301a31083I8553J54308b20592f2328j98817a20488B34691r3726a98991F0443
$$ -131083 98553 252861 -220592 -62328 -261145 -120488 234691 140965 -198991 60443
18290c15097h0892k180C0745a11451n5631G6716R1939h0334A56913K8444J08904
$$ -315097 -80892 -83072 30745 -111451 -167082 76716 168655 -80334 156913 185357 294261
18279B94261B400b21351J04156J5025j62348A0183a25107M7871J6265b3738A31690
$$ 294261 2400 -221351 -117195 -102170 -264518 10183 -125107 -77236 -60971 -23738 131690
18267a41903e8183m6556k66819B9744M0226L06923j37271C8164c0300j90937A9580
$$ -141903 -58183 -104739 -371558 29744 69970 376893 239622 38164 -30300 -221237 19580
18255A36495b37293p7249J02020I0443h4527K1686A37305a32272E4031H035K53172
$$ 136495 -237293 -314542 -212522 90443 -84527 -62841 137305 -132272 54031 8035 261207
18244B61207a42106g124A19599b1257A90108a4596B9476M1938C1073a62421C48380
$$ 261207 -142106 -7124 119599 -21257 190108 -14596 29476 71414 31073 -162421 348380
18232b57289O3422A03372D5629f7619l188j10450Q5722Q644j56329i8521L5694
$$ -257289 -193867 103372 45629 -67619 -70807 -181257 -95535 -86891 -243220 -98521 -62827
18221f2827G1892f0226j03285C14617F8522e3686p704D5210O747R6908B905a86881
$$ -62827 71892 -60226 -163511 314617 68522 -53686 -61390 45210 51957 148865 2905 -186881
18208a8326B04576d0737a926j29714D4175a47061C14014a39497e9329B24784n3007
$$ -18326 204576 -40737 -1926 -131640 44175 -147061 314014 -139497 -59329 224784 171777
18197A71777b28098A69039A3939b51346f6990K0188j53239D7783b35270j7010
$$ 171777 -228098 169039 13939 -251346 -66990 -46802 -200041 47783 -235270 -252280
18187b52280A12281a88024N4169E7093c0177j15093a8107r8575B15209B2226N89107
$$ -252280 112281 -188024 -133855 57093 -30177 -145270 -18107 -116682 215209 22226 611333
18176F11333B35724G4678a93634E4232L8782i4882j27010m0659H2041i0964B95376
$$ 611333 235724 74678 -193634 54232 93014 -94882 -221892 -262551 82041 -90964 295376
18164a78183A62440D0841a69464j32688C9723b32580M5647E8668n616f2946b1734
$$ -178183 162440 40841 -169464 -302152 39723 -232580 -186933 58668 53052 -62946 -21734
18152d043B04835a74980J2203c9771I5162h512A28139P8660d92553a84119L9988
$$ -4043 204835 -174980 -162777 -39771 95162 -8512 128139 206799 -492553 -184119 -144131
18141a44131L4591A64886o4755a08600C3896R1441c0980k21324N7584R603e1593
$$ -144131 -109540 164886 100131 -108600 33896 125337 -30980 -252304 -194720 -185117 -51593
18129a47535A40355a34683A4958K61747E768J61979A7724l3a95413C480J07095
$$ -147535 140355 -134683 14958 276705 5768 167747 17724 17691 -195413 3480 110575
18118A10575C0927h2849A2655b32955K6313J6769K9224B77297A2038a01352j33563
$$ 110575 30927 -82849 12655 -232955 -206642 -189873 -160649 277297 12038 -101352 -234915
18107b34915d0349g537c295j93308j30576B00113G8921M0258c98107J82163Q9135
$$ -234915 -40349 -7537 -3295 -196603 -327179 200113 78921 119179 -398107 -215944 -126809
18096a26809A65607l100f9017m7210A46020a06667k5889B97176b52642C0703a21760
$$ -126809 165607 162507 -69017 -116227 146020 -106667 -132556 297176 -252642 30703 -121760
18084a37610A6899O5130c1652A37983e6991A01477K55046b02026l1332c5423j1593
$$ -137610 16899 82029 -31652 137983 -56991 101477 356523 -202026 -233358 -35423 -47016
18073d7016m2524C6250a46433K2139j00720A92830a36583A83121d853H8073e3860
$$ -47016 -89540 36250 -146433 -124294 -225014 192830 -136583 183121 -4853 88073 -53860
18061A02737P616a11521N2303A07487b3051j50447d1160D1245L4625b73992A82189
$$ 102737 110353 -111521 -59218 107487 -23051 -173498 -41160 41245 75870 -273992 182189
18049b17122c2958j6181A44661m6805a16417q350D7902b64278e9521g923n7876
$$ -217122 -32958 -49139 144661 97856 -116417 -124767 47902 -264278 -59521 -7923 -65799
18038f5799A19621B8963b76014B2809d36327K02440A09755b7943A17237Q0526
$$ -65799 119621 28963 -276014 22809 -436327 -233887 109755 -27943 117237 197763
18028A97763g6140p5885G6415a31223p0725C5583g2113A47273b7410j52347r6780
$$ 197763 -76140 -152025 76415 -131223 -201948 35583 -72113 147273 -27410 -179757 -276537
18017b76537d530A59020g913D3833b15023J7105i478A54287C8476a37725A29622
$$ -276537 -4530 159020 -7913 43833 -215023 -197918 -9478 154287 38476 -137725 129622
18005H4646g6302K0963p5139G0864J25815a11976f749G3496N2406g4590K5184
$$ 84646 -76302 -55339 -130478 70864 196679 -111976 -6749 73496 125902 -74590 -49406
17994d9406m9188j22713g6143I0417B8198J46663a76726r7939f0451k5597j38592
$$ -49406 -98594 -221307 -76143 90417 28198 174861 -176726 -274665 -60451 -86048 -224640
17983b24640B37645d4247B24511c71010a29320d7047r7040A4272b02901j9461
$$ -224640 237645 -44247 224511 -371010 -129320 -47047 -144087 14272 -202901 -222362
17973b22362A82761a22249B6043c4235p8335j2535A22682b5147F8874N9867m1599
$$ -222362 182761 -122249 26043 -34235 -112570 -125105 122682 -25147 68874 128741 87142
17962H7142m1019j9107k439H444a46006B2688a12860p7107B93725j32682C2061
$$ 87142 46123 27016 24577 8444 -146006 22688 -112860 -189967 293725 161043 32061
17950a69090i517j48500f0709m56897J67866a30465A03233a16409r5252D6440
$$ -169090 -9517 -158017 -60709 -517606 -349740 -130465 103233 -116409 -211661 46440
17939a49374D45166c84492C6580N2141C5420c3741p7543A53532d5152o8001p8342
$$ -149374 445166 -384492 36580 88721 35420 -33741 -111284 153532 -45152 -113153 -191495
17928a91495d6785B96341b3556B6689h6337A29405i4483p8038A96870p1897a59721
$$ -191495 -46785 296341 -23556 26689 -86337 129405 -94483 -172521 196870 124973 -159721
17916f6614e16G8194q925J71445b24903O9666m5674P2513a7114o8489j12675A63088
$$ -66614 -516 78194 69269 240714 -224903 -155237 -200911 -128398 -17114 -85603 -198278 163088
17903g1907A5646K60113g7354A09125E3007K24465o5403c14961i3050A92778n4015
$$ -71907 15646 275759 -77354 109125 53007 277472 212069 -314961 -93050 192778 138763
17892A38763E7235k5943d5234A07374d45443a19856o1117A73639d27901B94284
$$ 138763 57235 31292 -45234 107374 -445443 -119856 -180973 173639 -427901 294284
17881C02920a55720G5623b97448B1409K61755I9484k9294O5918n0778a82369a0698
$$ 302920 -155720 75623 -297448 21409 283164 99484 70190 136108 85330 -182369 -10698
17869a97599A63912c06121C2212g6232D3981J67789i9974j57213a26438o2443
$$ -197599 163912 -306121 32212 -76232 43981 211770 -99974 -257187 -126438 -188881
17859a88881h6825A52647D4417a52696A00831Q8170A6136e4306l9701I917a44675
$$ -188881 -86825 152647 44417 -152696 100831 189001 16136 -54306 -94007 9917 -144675
17847a69563f7687p0533f0486A52549A9253b44160B7689K2226d1442G7607P3923
$$ -169563 -67687 -138220 -60486 152549 19253 -244160 27689 49915 -41442 77607 151530
17836A51530a70498A30730d1264I650a22635B18431J8690a14505B67964E6107
$$ 151530 -170498 130730 -41264 9650 -122635 218431 237121 -114505 267964 56107
17825c6938A38253g9284A45217b63277I8421f9946a0131A72212C6796a24688m0032
$$ -36938 138253 -79284 145217 -263277 98421 -69946 -10131 172212 36796 -124688 -164720
17814a64720C8447e1882l4144K063k01392C08500A06240L00700G9710a35466n826
$$ -164720 38447 -51882 -86026 -83963 -285355 308500 106240 406940 79710 -135466 -141292
17803a41292l3664j16293A38324a51705B556a67311q5094c3174l3596b5863B97863
$$ -141292 -174956 -291249 138324 -151705 2556 -167311 -252405 -33174 -66770 -25863 297863
17791C3132R6545i6180A14688a66706k0982a3230k4281B86049I6615J54648f1573
$$ 33132 129677 -96180 114688 -166706 -187688 -13230 -37511 286049 96615 251263 -61573
17779F6682c33176B29924i1604A64616a61248j658k83548A42996a62853C6665
$$ 66682 -333176 229924 -91604 164616 -161248 -162906 -446454 142996 -162853 36665
17768G4371K58356g9260A26951D0452P2418C4447M35122B30672f5158C68954A59754
$$ 74371 332727 -79260 126951 40452 112870 34447 469569 230672 -65158 368954 159754
17756D5365b72349A54502a63746E1711R3815k6695a47121N8389J4748E5493b13942
$$ 45365 -272349 154502 -163746 51711 145526 118831 -147121 -88732 -73984 55493 -213942
17744a27090E1966J30535a01285B7613a46628O0254I5761d1018C3603P8430D045
$$ -127090 51966 182501 -101285 27613 -146628 -86374 95761 -41018 33603 112033 4045
17732A38626O5252K1479a1696k05770B47597b76000B71087a30019A85303R4780
$$ 138626 203878 225357 -11696 -217466 247597 -276000 271087 -130019 185303 280083
17722B80083n7885J06683a1211k36758h5318q2095B35610c20353O5151N1886h1221
$$ 280083 222198 328881 -11211 -247969 -85318 -167413 235610 -320353 -255202 -203316 -81221
17710F4907j2143g701A05394m890d1786C7871b45090E7199i0256J8851A23606
$$ 64907 52764 -7701 105394 100504 -41786 37871 -245090 57199 -90256 -71405 123606
17698E0702a31836L2133B62127a28679a86E3624N3043l1308c42882C37698H552
$$ 50702 -131836 -99703 262127 -128679 -186 53624 106667 75359 -342882 337698 8552
17686B0590a7525B96602C0059a30024A35983J28444r7583a4974k50808A5531L65599
$$ 20590 -17525 296602 30059 -130024 135983 264427 166844 -14974 -265782 15531 381130
17675C81130n1239h237r3532d1626A25321Q1366f8929l1881o7140N7906G287e9009
$$ 381130 329891 -8237 -101769 -41626 125321 206687 -68929 -100810 -167950 -110044 7287 -59009
17662b9220A0925J94333b41120h9146D7504a08832A13774a36890B42300J14401
$$ -29220 10925 205258 -241120 -89146 47504 -108832 113774 -136890 242300 356701
17652C56701B4460d41604K2642B58855L5096b35228B18911J47014a57416H8576
$$ 356701 24460 -441604 -418962 258855 293951 -235228 218911 365925 -157416 88576
17641F9163d62727I120J61809J81956g0156q5257B72536F4025c226A74594M13804
$$ 69163 -462727 9120 170929 352885 -70156 -155413 272536 64025 -3226 174594 588398
17630E88398A04069c87166D68470A30056a67619A86412l8844E7698d82007A33419
$$ 588398 104069 -387166 468470 130056 -167619 186412 147568 57698 -482007 133419
17619d9081N57I3482a85230B5982K3517P2459j642E1329R0676c38791C39758B1931
$$ -49081 -48524 93482 -185230 25982 49499 121958 120316 51329 142005 -338791 339758 21931
17606a01222A80640g2989F4752E841b3082j18299A40895C6891K72703a52788G835
$$ -101222 180640 -72989 64752 5841 -23082 -141381 140895 36891 309594 -152788 7835
17594A78536I460J57179P8971H964J70205b00740m9318A99819P0490n5010p4329
$$ 178536 9460 166639 245610 8964 179169 -200740 -250058 199819 270309 215299 140970
17583A40970m6860I970b71047B26473b2305j73840f0302k81856A71784b4954D76302
$$ 140970 94110 9970 -271047 226473 -22305 -196145 -60302 -342158 171784 -24954 476302
17571C04615j0111r159j04987C3759P8205P517K36635h9696j58199H8438a0691
$$ 304615 294504 285345 180358 33759 111964 119481 356116 -89696 -247895 88438 -10691
17559C21871c7808D12527B0003D119c3094B49781a4521A73483c17916C06951b23679
$$ 321871 -37808 412527 20003 4119 -33094 249781 -14521 173483 -317916 306951 -223679
17547A65570k2871n6568d7347p752C44996A26536J16695h5207J2869m8532A53865
$$ 165570 142699 86131 -47347 -55099 344996 126536 243231 -85207 -72338 -120870 153865
17535g3180A92050B5087E243L7218K21745M31756c3469R304B32730a07973C99461
$$ -73180 192050 25087 5243 42461 264206 695962 -33469 -24165 232730 -107973 399461
17523e0339B84623r8500K38480I2779O0468B0690K5812J12306c9876A71306d77498
$$ -50339 284623 186123 424603 92779 153247 20690 46502 158808 -39876 171306 -477498
17511A05171P1078p9079K26727l5516j04587o7790a49404B53367C5433N33291
$$ 105171 176249 97170 323897 288381 183794 116004 -149404 253367 35433 568724
17501E68724g8072B79122g1447N849C03674h0738B54876b01298A25432L77337
$$ 568724 -78072 279122 -71447 -65598 303674 -80738 254876 -201298 125432 502769
17491E02769j90540j51589J01926A5126K34981l2990f199A85588j0439k4170k7858
$$ 502769 312229 160640 262566 15126 250107 217117 -6199 185588 175149 150979 123121
17480A23121B9048L73694j3961k6482b7713C71090j48751G818J89757N8894K10579
$$ 123121 29048 402742 388781 362299 -27713 371090 222339 7818 197575 256469 467048
17469D67048A6030M40534a0390B18358A6318K27832O084d1837m4506D13367A45583
$$ 467048 16030 456564 -10390 218358 16318 244150 250234 -41837 -86343 413367 145583
17457H6407K1282M30726E4425O2587D2945O5906P4517K19889a34475E35563j34896
$$ 86407 107689 538415 54425 117012 42945 108851 183368 403257 -134475 535563 400667
17446D00667j09704J83796j82183A07231J92533n5298K44722H7517K6686J77623
$$ 400667 290963 474759 292576 107231 299764 244466 489188 87517 114203 291826
17436B91826r6071Q8122K64779A09476a97491D48219A20089K78406j83069J8413
$$ 291826 195755 283877 548656 109476 -197491 448219 120089 398495 215426 233839
17426B33839O8877o2059H6025a3296I8458K3415j0509D0848A3475N9845a80626
$$ 233839 302716 240657 86025 -13296 98458 121873 111364 40848 13475 73320 -180626
17414A10383L05938K55018D4671M01464j59283j02562o40R2685A12488L61102
$$ 110383 416321 671339 44671 446135 286852 184290 183650 276335 112488 473590
17404D73590A53689J8980P6938N5476A45626P3990a0213A69839c3303A37678L16026
$$ 473590 153689 172669 249607 305083 145626 219616 -10213 169839 -33303 137678 453704
17393D53704o5272J08066a63k45034D16456a00133j02438B30384K5917M9417m9790
$$ 453704 388432 496498 -163 -245197 416456 -100133 -202571 230384 256301 305718 255928
17382B55928a10856A94816p8575K41128j78451L50744g8658C84797j75903k6724
$$ 255928 -110856 194816 116241 357369 178918 529662 -78658 384797 208894 182170
17372A82170J15991J72622G6721J00010h4426A6345M56663n7414j36466J09186
$$ 182170 298161 470783 76721 176731 -84426 16345 473008 415594 279128 388314
17362C88314q0204J82861B8899O08680k83883A67121G0363J69419J03250q1736
$$ 388314 308110 490971 28899 637579 353696 167121 70363 239782 343032 261296
17352B61296r6348J69142B7731L35924p4318p9764n7501O2973N3370K53678j19487
$$ 261296 164948 334090 27731 363655 289337 209573 152072 215045 268415 522093 402606
17341D02606b3356n6513H6438M2198N0373J27893J0996n5246j25719N5418E1569
$$ 402606 -23356 -79869 86438 128636 179009 306902 317898 262652 136933 192351 51569
17329C36454j5231L0201p9924J05266A13678L59033n5661B4236J16545k0499J13019
$$ 336454 321223 351424 271500 376766 113678 472711 417050 24236 140781 120282 233301
17318B33301J66272j22531n0205n3902j4005N90209A73784J00597A14743J52366
$$ 233301 399573 277042 226837 172935 158930 749139 173784 274381 114743 267109
17308B67109I8317K46565j55940D7377K30350D3283M08014J83823k87837j33804
$$ 267109 98317 344882 188942 47377 277727 43283 451297 635120 347283 213479
17298B13479n8359R9450K30828A27239C0396O05934q7849j84965N856j80036J34440
$$ 213479 155120 254570 485398 127239 30396 636330 548481 363516 369372 189336 323776
17287C23776L31119j43976A37747K19788A29957J76638k0203J02648j34012J48926
$$ 323776 654895 510919 137747 357535 129957 306595 286392 389040 255028 403954
17277D03954q0600K14761j33671A68604M4479K19780j3023q2699m3522M8112j36619
$$ 403954 323354 538115 404444 168604 213083 432863 419840 337141 293619 341731 205112
17266B05112L17183K00002I5185K89508K859K54045k99984j01485K70839o5277
$$ 205112 522295 722297 95185 384693 387552 641597 341613 240128 510967 445690
17256D45690A89999K65718j14852L9584E4630J97115J05851j21052J06507J14988
$$ 445690 189999 455717 340865 380449 54630 251745 357596 236544 343051 458039
17246D58039k4587j86158M41871B66456P9889n7964p5756J42161J09539M2985
$$ 458039 433452 247294 689165 266456 346345 288381 212625 354786 464325 507310
17236E07310P9840N7938q6082q7209l5579J37798k62249J19828o5344K18847L2652
$$ 507310 587150 645088 559006 471797 436218 574016 311767 431595 366251 585098 617750
17225F17750B45975L32547k75085r8515M55915A36480L55060k3931J18091A795
$$ 617750 245975 578522 303437 204922 660837 136480 491540 467609 585700 1795
17214E19794J9410K42627k78053j01033J89569J37788J31727B17717M07861A57835
$$ 519794 539204 781831 503778 402745 592314 730102 861829 217717 625578 157835
17203G59071q3719l11258K2042L86434j91961m7175K23174l02637J92446M7889
$$ 759071 675352 364094 386136 772570 580609 533434 756608 453971 646417 694306
17193F94306j21787j47949O7674k0645p3000J92757k57141M13659C28114K16222
$$ 694306 572519 424570 492244 471599 398599 591356 334215 747874 328114 544336
17183E44336J41843k11107J82099j36175M11931D52460J01969K62007k70170M16951
$$ 544336 686179 475072 657171 520996 932927 452460 554429 816436 546266 963217
17173I63217D54769J07626K31027j7631m5792M7061j27108K04982l71877K83576
$$ 963217 454769 562395 793422 775791 729999 777060 649952 854934 483057 766633
17163G66633r0980K9456j37015q8612J24777K47096l27139M21195m47372J88448
$$ 766633 675653 705109 568094 479482 604259 851355 524216 945411 498039 686487
17153F86487j08P3972Q4677j03813L6130J76138k95526K43768P2547l04166j830
$$ 686487 686379 760351 845028 741215 777345 953483 657957 901725 974272 670106 668276
17142F68276J11984J77690m60535j2437L05644j2322N8206J74457l65565M79843
$$ 668276 780260 957950 497415 484978 790622 778300 836506 1010963 645398 1125241
17132A125241k75613l2093J93703l10051J61615J22800k29822M81832k97312N2440
$$ 1125241 849628 817535 1011238 701187 862802 985602 755780 1237612 940300 992740
17122I92740l0507j67609K11271j99561J46735k06336J51679K52136m39281L22340
$$ 992740 962233 794624 1005895 806334 953069 746733 898412 1150548 711267 1033607
17112A033607j7703k22200K27129p9232j92319J5808R801J55977J58170m06968
$$ 1033607 1015904 793704 1020833 941601 749282 765090 774891 930868 1089038 682070
17102F82070J6647J26184L41648j84260K55377E66192P86670p0305k03152L17143
$$ 682070 698717 824901 1166549 982289 1237666 566192 1352862 1282557 1079405 1396548
17092A396548k75959Q1810R8626j61543q7948K74220j48068l12054L69789N3919
$$ 1396548 1120589 1202399 1301025 1139482 1051534 1325754 1177686 865632 1235421 1289340
17082A289340l68521J3318J52605N9055J37736J85165l89986K83441J1497P2085
$$ 1289340 920819 934137 1086742 1145797 1283533 1468698 1078712 1362153 1373650 1445735
17072A445735O9589o64077J69022J39912K34251J88923p2238l83906M92297j65811
$$ 1445735 1515324 851247 1020269 1160181 1394432 1583355 1511117 1127211 1619508 1453697
17062A453697J92877j23226j00234O1411K32974n20555L75626k13206K35523j50441
$$ 1453697 1646574 1523348 1423114 1484525 1717499 1196944 1572570 1359364 1594887 1444446
17052A444446j21127K17812L69251n04652K50422l38056L76945j49012j11230
$$ 1444446 1323319 1541131 1910382 1405730 1656152 1318096 1695041 1546029 1434799
17043A434799J6457L48392k65797L2178R7537l60936N58703l01814J52406L3414
$$ 1434799 1451256 1799648 1533851 1566029 1663566 1302630 1861333 1559519 1711925 1745339
17033A745339l1066M2614o7145N15581l94305K8473K89775l31413j23369L42947
$$ 1745339 1714273 1756887 1689742 2205323 1811018 1839491 2129266 1797853 1674484 2017431
17023B017431O1474k38143o5801J14303K69330j29657q4412j7954K99364k03535
$$ 2017431 2078905 1840762 1774961 1889264 2158594 2028937 1944525 1926571 2225935 2022400
17013B022400q5389L38114j69515o9420O062m3791k57804K12105L51452n8940
$$ 2022400 1937011 2275125 2105610 2036190 2042252 1998461 1740657 1952762 2304214 2245274
17003B245274l44700L72151p0529L16511j45394J81525n98945M59091k34661L21102
$$ 2245274 1900574 2272725 2202196 2518707 2373313 2554838 1955893 2414984 2180323 2501425
16993B501425M3549j19879j35531O9154K11836L76134l12803r2292k7918l6398
$$ 2501425 2544974 2425095 2289564 2358718 2570554 2946688 2633885 2541593 2513675 2477277
16983B477277J55778j23824J07989J73090l6184j81730k2609L58694k9060k47257
$$ 2477277 2633055 2509231 2617220 2790310 2754126 2572396 2549787 2908481 2879421 2632164
16973B632164J60084R0777j60834J51962o3979M92721q590m9292j98972L2031
$$ 2632164 2792248 2883025 2722191 2874153 2810174 3302895 3294305 3245013 3046041 3078072
16963C078072K89093j59316r1891K37636L2117J31180k66605J5585L11788J51551
$$ 3078072 3367165 3207849 3115958 3353594 3385711 3516891 3250286 3265871 3577659 3729210
16953C729210l31696J99735K31127n08931K82607K14991Q9742o0354p8023J36446
$$ 3729210 3397514 3597249 3828376 3319445 3602052 3817043 3906785 3846431 3768408 3904854
16943C904854j90846J68935J86816p3807L07626k88791R197q2630N62992j24383
$$ 3904854 3714008 3882943 4069759 3995952 4303578 4014787 4023984 3941354 4504346 4379963
16933D379963R5235M133O710Q9646R7564j51575J31109K18448m8280J57300k68497
$$ 4379963 4475198 4479331 4486041 4575687 4673251 4521676 4652785 4871233 4822953 4980253 4711756
16922D711756O58492j15939l16698L81910M6396l06119J36528n4767M94151j77832
$$ 4711756 5370248 5254309 4937611 5319521 5365917 5059798 5196326 5141559 5635710 5457878
16912E457878K38700J5408K4767K36187k59394L49155L36849k84087j86355K60936
$$ 5457878 5696578 5711986 5736753 5972940 5713546 6062701 6399550 6115463 5929108 6190044
16902F190044J8150P4316K32474Q5009j22419Q5491M09107k39761p472J72922
$$ 6190044 6208194 6282510 6514984 6599993 6477574 6563065 6972172 6732411 6724939 6897861
16892F897861K10674j71744M23422m3023P3077L43402l59348R5304N6500M33894
$$ 6897861 7108535 6936791 7360213 7317190 7390267 7733669 7374321 7469625 7526125 7960019
16882G960019L12095l21003K25092J63747L0589M49133k76113J95520J71428K37330
$$ 7960019 8272114 7951111 8176203 8339950 8370539 8819672 8543559 8739079 8910507 9147837
16872I147837j46038J75397p0253K63196J32775L72625j73930L59198J35413K9854
$$ 9147837 9001799 9177196 9106943 9370139 9502914 9875539 9701609 10060807 10196220 10226074
16862A0226074J43618L1550M90419n3631q3281K6814N04720K63479J99092k45419
$$ 10226074 10369692 10401242 10891661 10838030 10754749 10781563 11286283 11549762 11748854 11503435
16852A1503435M16706P6332L52056k41244M53554Q7209K11938M28906j52507N14176
$$ 11503435 11920141 11996473 12348529 12107285 12560839 12648048 12859986 13288892 13136385 13650561
16842A3650561l9529K25224K72988M42747P212J38536K33095J11900j82477O43015
$$ 13650561 13611032 13836256 14109244 14551991 14559203 14697739 14930834 15042734 14860257 15503272
16832A5503272O34785J09389j67460L79497J1325N52623R1120M90745r4042L74768
$$ 15503272 16138057 16247446 16079986 16459483 16470808 17023431 17114551 17605296 17511254 17886022
16822A7886022J77536M45196L76515Q1065K75924K25466K13647O72145K65201
$$ 17886022 18063558 18508754 18885269 18966334 19242258 19467724 19681371 20353516 20618717
16813B0618717L47934J07334R03707k94123M51584J57647N51583K66215O64258
$$ 20618717 20966651 21073985 21977692 21683569 22135153 22292800 22844383 23110598 23774856
16804B3774856K82521K77134O01701K57177J07162Q61083j39541O47494L91949
$$ 23774856 24057377 24334511 24936212 25193389 25300551 26161634 26022093 26669587 27061536
16795B7061536K57186Q83896M36452M52618L08501Q00321K64670N25506N56199
$$ 27061536 27318722 28202618 28639070 29091688 29400189 30200510 30465180 30990686 31546885
16786C1546885O93787O93195N46217M02196R63301R9048N08717R96704M73419
$$ 31546885 32240672 32933867 33480084 33882280 34845581 34944629 35453346 36450050 36923469
16777C6923469P61549N44008M45516R46800P75210Q63856N78717Q72192Q11221
$$ 36923469 37685018 38229026 38674542 39621342 40396552 41260408 41839125 42711317 43522538
16768D3522538J076707R78590P95934J286255N46994Q40253J163940R67066J241535
$$ 43522538 44599245 45577835 46373769 47660024 48207018 49047271 50211211 51178277 52419812
16759E2419812P63712J364438R88896J207277J208783J343302J216782J199081
$$ 52419812 53183524 54547962 55536858 56744135 57952918 59296220 60513002 61712083
16751F1712083J243277J560582J217960J381981J714211J549850J148053J923067
$$ 61712083 62955360 64515942 65733902 67115883 68830094 70379944 71527997 73451064
16743G3451064J314548J559747J585947J525687J733650J540769J801702J486785
$$ 73451064 74765612 76325359 77911306 79436993 81170643 82711412 84513114 85999899
16735H5999899J686279J659185J675488J797508J127459J197938K026709J100763
$$ 85999899 87686178 89345363 91020851 92818359 93945818 95143756 97170465 98271228
16727I8271228J172007J035268R00880O51471L27758M75200o51543n03204q60458
$$ 98271228 99443235 100478503 101379383 102030854 102358612 102833812 102182269 101679065 100818607
16718A00818607j315250k016410k052768k551872k919237l206027l228600l666460
$$ 100818607 99503357 97486947 95434179 92882307 89963070 86757043 83528443 79861983
16710G9861983l701495l674211l173351l933834l523078k928373l385666k766950
$$ 79861983 76160488 72486277 69312926 65379092 61856014 58927641 55541975 52775025
16702E2775025k819095k890720k709292k434297j863302k064307j880067j852156
$$ 52775025 49955930 47065210 44355918 41921621 40058319 37994012 36113945 34261789
16694C4261789j900592j268375j705093j304065j036629j364641j025404j259873
$$ 34261789 32361197 31092822 29387729 28083664 27047035 25682394 24656990 23397117
16686B3397117j018430n34776j089178p59072r80985o56993m89914q03457p85769
$$ 23397117 22378687 21843911 20754733 19995661 19014676 18357683 17867769 17064312 16278543
16677A6278543l36120q76750k05231r64218o97842L9828l19553k80114q44000
$$ 16278543 15942423 15065673 14860442 13896224 13198382 13238210 12918657 12638543 11794543
16668A1794543m55064k42090m28826m15610l64148K37476o38073K6041m00720
$$ 11794543 11339479 11097389 10668563 10252953 9888805 10126281 9488208 9514249 9113529
16659I113529j78088l17125j11537n05455k97907j92831N0748m54239k17088K32208
$$ 9113529 8935441 8618316 8506779 8001324 7703417 7510586 7561334 7107095 6890007 7122215
16649G122215k74067n44105K07195J59130n37855l7001m72010J73339j78414k33277
$$ 7122215 6848148 6304043 6511238 6670368 6132513 6095512 5623502 5796841 5618427 5385150
16639E385150k1912o8115k84235p695O443k83069j509p8549q582j09988K15283
$$ 5385150 5363238 5295123 5010888 5003193 5009636 4726567 4725058 4646509 4637927 4527939 4743222
16628D743222m21451j06363o1684M9494j87981k36052K77222n1565m04937J45809
$$ 4743222 4321771 4215408 4153724 4203218 4015237 3779185 4056407 4004842 3599905 3745714
16618C745714k83064m8401K73547j20537k67192j85591J56606K17582o00257J52902
$$ 3745714 3462650 3414249 3687796 3567259 3300067 3114476 3271082 3488664 2888407 3041309
16608C041309L52397n33211K95599l71977o7904k14507Q6670P7636k92284J68962
$$ 3041309 3393706 2860495 3156094 2784117 2716213 2501706 2588376 2666012 2373728 2542690
16598B542690K53807k55374j94863j31680O8954l4493K94162j93965L5431M4605
$$ 2542690 2796497 2541123 2346260 2214580 2283534 2249041 2543203 2349238 2384669 2429274
16588B429274o9916j91233J97609k52655K21933j34271k66336L5846k36253J97474
$$ 2429274 2359358 2168125 2365734 2113079 2335012 2200741 1934405 1970251 1733998 1931472
16578A931472J68751k99674P1057J13063J38508q2528J24460j61773O6960m77450
$$ 1931472 2100223 1800549 1871606 1984669 2123177 2040649 2165109 2003336 2070296 1592846
16568A592846K46935k39730M61764n64346J76812K3951k58783K39851k5370k29555
$$ 1592846 1839781 1600051 2061815 1497469 1674281 1698232 1439449 1679300 1653930 1424375
16558A424375l0326j07894O07185m32754Q4568k8538l72430K84146q5227J35811
$$ 1424375 1394049 1286155 1893340 1460586 1545154 1516616 1144186 1428332 1343105 1478916
16548A478916o7590J53262j86552k95980K62973J19462j81313J42527l37841K74561
$$ 1478916 1411326 1564588 1378036 1082056 1345029 1464491 1283178 1425705 1087864 1362425
16538A362425l3917m12730L15186k45060K02681K23626p3082J17634l00873K23822
$$ 1362425 1328508 915778 1230964 985904 1188585 1412211 1339129 1456763 1155890 1379712
16528A379712k47547J76989k21815J08021k30196o8687P22231l60816l67753p5157
$$ 1379712 1132165 1309154 1087339 1195360 965164 896477 1618708 1257892 890139 814982
16518H14982K37766P1994K11472j02424l24061K45557k19736Q4960j18273L18949
$$ 814982 1052748 1124742 1336214 1233790 909729 1155286 935550 1020510 902237 1221186
16508A221186k14558l13145L03871k96527R0890J95707J89430k07675Q7759l34259
$$ 1221186 1006628 693483 997354 700827 791717 987424 1176854 969179 1056938 722679
16498G22679K08845L998k44335M5125O1186K23404J3061p462l83413K61911l117
$$ 722679 931524 935522 691187 736312 797498 1020902 1033963 1026501 643088 904999 901882
16487I01882K7887m6959J14484l36857J46576k84344L26834j91723L25881j56639
$$ 901882 929769 882810 997294 660437 807013 522669 849503 657780 983661 827022
16477H27022j2196k23555J28834P7160k06581J66019k1482p0841J16024q4050
$$ 827022 814826 591271 720105 797265 590684 756703 735221 664380 780404 696354
16467F96354l43279K86521J35545j29000j46755K45268L5441q3515k35383J43805
$$ 696354 353075 639596 775141 646141 499386 744654 780095 696580 461197 605002
16457F05002J47833j30461M46460j53314M0021k25986m4448k6016n8433j77694
$$ 605002 752835 622374 1068834 915520 955541 729555 685107 659091 600658 422964
16447D22964K55508J31061j3727j37531r8240Q8975C10836L99014l34917N5590
$$ 422964 678472 809533 795806 658275 560035 649010 310836 709850 374933 430523
16437D30523K06068j96070J27325Q6854j76901K25870k34763K13079p3531j23578
$$ 430523 636591 440521 567846 654700 477799 703669 468906 681985 608454 484876
16427D84876p9461J39369r0108J80005J16024m5991A68975P17046l40972n613
$$ 484876 405415 544784 454676 634681 750705 704714 168975 886021 545049 539436
16417E39436m2426j15030K56436L7848k15317j15160K73419K6407l4653m5863
$$ 539436 497010 381980 638416 676264 460947 345787 619206 645613 610960 565097
16407E65097k5709j91233p9758J71943R0749O0602B78297J17022O0886j82202
$$ 565097 539388 348155 268397 440340 531089 591691 278297 395319 456205 274003
16397B74003L62977l07544K87199M5366l30585j60750L65320B48638P0276J9584
$$ 274003 636980 329436 616635 662001 331416 170666 535986 248638 318914 338498
16387C38498N1037Q7232k06650l9914J37358A73973L33387B30258A7728L23411
$$ 338498 389535 476767 270117 230203 367561 173973 507360 230258 17728 341139
16377C41139m1104M11920l36945A84586K24767j43551I842K86788L29812J78236
$$ 341139 300035 711955 375010 184586 409353 265802 9842 296630 626442 804678
16367H04678k91599k21174j43099M63796B65400N5314J38487P1326R9870k95592
$$ 804678 513079 291905 148806 612602 265400 320714 459201 530527 630397 334805
16357C34805J26769m3785j75254L5616l4450Q0217k5732E8128e0183A71617K70686
$$ 334805 461574 417789 242535 278151 243701 323918 298186 58128 -50183 171617 442303
16346D42303j14380A17665K87954a54379C86495A12934J13573F4330K49384M06226
$$ 442303 327923 117665 405619 -154379 386495 112934 226507 64330 313714 719940
16336G19940A83545k6053J95570j23177Q0866r886J06217K78903B64303k324J42863
$$ 719940 183545 157492 353062 229885 310751 300865 407082 685985 264303 261979 404842
16325D04842n2541q3596J69304r2137A44556L35327j54691p8012B1110K41282
$$ 404842 352301 268705 438009 345872 144556 479883 325192 247180 21110 262392
16315B62392b6768D61501r8407K47976A74842L44363A68397K32094L1576j53200
$$ 262392 -26768 461501 363094 611070 174842 519205 168397 400491 432067 278867
16305B78867K33437A92041E0708L42052j61417N967A10038d928B15232L9908R9191
$$ 278867 512304 192041 50708 392760 231343 237310 110038 -4928 215232 255140 354331
16294C54331A70752d8143B29848H0050N86850B94436l8632A27057J65176H4999
$$ 354331 170752 -48143 229848 80050 666900 294436 255804 127057 292233 84999
16283B52580G6326b1531B16212J0516r6051J1496c8928D46668F3687P528J51517
$$ 252580 76326 -21531 216212 226728 130677 142173 -38928 446668 63687 71215 222732
16272B22732m3468P4761A7146J07104d8973A42991o9082F669O0703J56934A01478
$$ 222732 179264 254025 17146 124250 -48973 142991 73909 6669 67372 224306 101478
16260G5646n138l89L35177A73638L0039J57402j03716j11912m0165J64751n458
$$ 75646 70508 70119 405296 173638 203677 361079 257363 145451 105286 270037 264579
16249B64579J2094a79529h4437D0630K2878K63382E3664Q1383K7886b5801B58883
$$ 264579 276673 -179529 -84437 40630 63508 326890 53664 135047 162933 -25801 258883
16237B98176a06067B49958E1418J99085I7793a6894B75629b6031k28882A20953
$$ 298176 -106067 249958 51418 250503 97793 -16894 275629 -26031 -254913 120953
16226b4325F84044c7190C30947F0463J32413L03585a01293j0159M7911B71781
$$ -24325 684044 -37190 330947 60463 192876 496461 -101293 -111452 -63541 271781
16215f6515F6375J4054b7710C16319J8376n3060G2168a02321A55445a39810A27485
$$ -66515 66375 80429 -27710 316319 334695 281635 72168 -102321 155445 -139810 127485
16203A33416b8478G0027M9055O3089H0038L68155I535K12990N9852A03321P077
$$ 133416 -28478 70027 119082 182171 80038 448193 9535 222525 282377 103321 110398
16192A10398g7520B1145L74726j15310Q0411g5599G3694a2387r7340B99652G900
$$ 110398 -77520 21145 395871 280561 360972 -75599 73694 -12387 -109727 299652 7900
16180c5071b909A03744a4323H3581J06325E4543c2580D4099K9264K24171a04145
$$ -35071 -2909 103744 -14323 83581 189906 54543 -32580 44099 73363 297534 -104145
16168a12379A0015M107O2661a85684G8713K39769p1067A02125L1773J47506o5978
$$ -112379 10015 14122 76783 -185684 78713 318482 247415 102125 133898 281404 215426
16157B15426b06375A95024c7806E05835F3779J05737o5016j2657k8008L1602J74394
$$ 215426 -206375 195024 -37806 505835 63779 169516 104500 91843 63835 95437 269831
16146B69831C3466b50514N5563e419A35748O7720h7944K4021B96899e1975D8059
$$ 269831 33466 -250514 -194951 -5419 135748 203468 -87944 -63923 296899 -51975 48059
16134A58097b15965G4066C5479r566f6100A07616f674j46067C25870a67769A75495
$$ 158097 -215965 74066 35479 25913 -66100 107616 -6674 -152741 325870 -167769 175495
16122A75318k2101J22431A8654J35898K28670A70965J98579H9598J10802F6033
$$ 175318 153217 275648 18654 154552 383222 170965 369544 89598 200400 66033
16111C56414A22848b4964B51953L92196b4428r6212N9741I0943l7536K16396A0668
$$ 356414 122848 -24964 251953 644149 -24428 -120640 -60899 90943 53407 269803 10668
16099A43967b50093G5203a08154M563G2784a83808I8495K86335r5896F6801R2676
$$ 143967 -250093 75203 -108154 -103591 72784 -183808 98495 384830 288934 66801 159477
16088A59477o6290m188K55544A44788P736b3059j41512L4026A22289a7283k66188
$$ 159477 93187 88999 344543 144788 152524 -23059 -164571 -130545 122289 -17283 -283471
16077b83471a02737A11663g8688A14541k4315d6946B79821b25300C29089a21766
$$ -283471 -102737 111663 -78688 114541 90226 -46946 279821 -225300 329089 -121766
16066C04777g7287k4142A37306J28356H5686a01677E1161P3740a6716A9047b35772
$$ 304777 -77287 -101429 137306 265662 85686 -101677 51161 124901 -16716 19047 -235772
16054a14536j0687a708C00935G8314c57412I9373a28088c2306j34689l5902M096
$$ -114536 -125223 -1708 300935 78314 -357412 99373 -128088 -32306 -166995 -202897 -198801
16043a98801j38716A11001K61577A14820a30955j86080Q8680A21324a00287c463
$$ -198801 -337517 111001 372578 114820 -130955 -317035 -228355 121324 -100287 -3463
16032A54443f8171a2961G8599K07200a7338n440B21942O480a34502r223A83466
$$ 154443 -68171 -12961 78599 285799 -17338 -22778 221942 228422 -134502 -143725 183466
16020c776A61825a02156F93J42367b3242j58631A53881G6763a00350q1838j64793
$$ -3776 161825 -102156 693 143060 -23242 -181873 153881 76763 -100350 -182188 -346981
16009c46981B7550c19238H6661a9375p4191c5168A70825A0604g5651B60606H7652
$$ -346981 27550 -319238 86661 -19375 -93566 -35168 170825 10604 -75651 260606 87652
15997a01915I772a17015J3497A16007a14798A99303l562G9337l8372K04418a66478
$$ -101915 9772 -117015 -103518 116007 -114798 199303 195741 79337 40965 245383 -166478
15985g631A59023a023j3433B42612F9175L2561C3971b64354B5556K8136g1898
$$ -7631 159023 -1023 -14456 242612 69175 101736 33971 -264354 25556 53692 -71898
15973D8643b0570q2124A95909b96864c9889j31930N5343j27318g5132j28749r0473
$$ 48643 -20570 -102694 195909 -296864 -39889 -171819 -116476 -243794 -75132 -203881 -294354
15962b94354A76685a21724J2674B97726D9172J89276C8255j8173J85423C830J79056
$$ -294354 176685 -121724 -109050 297726 49172 238448 38255 20082 205505 3830 182886
15951A82886a51993J0835F3561k0414O6003M6308b6362A13810D0531R9934a76518
$$ 182886 -151993 -141158 63561 43147 109150 155458 -26362 113810 40531 140465 -176518
15939E316O9518b5003k04281B04399b646k12440A30535d02j9660A99868c7911
$$ 5316 74834 -25003 -229284 204399 -2646 -215086 130535 -402 -20062 199868 -37911
15927d32897B72173A16002d9460A94142b12694J05324B55341h9147I0609b55477
$$ -432897 272173 116002 -49460 194142 -212694 -107370 255341 -89147 90609 -255477
15916B55150a76518A33730Q8734a22385r6295k18639C60178a42083B62230b87277
$$ 255150 -176518 133730 222464 -122385 -218680 -437319 360178 -142083 262230 -287277
15905a37070q2274H2722J68988j7616q7418C8157A6237K5037L50536F0994L2431
$$ -137070 -219344 82722 251710 234094 146676 38157 16237 41274 391810 60994 93425
15894I3425a20513l24232e4952r2438N1387d5063r3751C03339a00669M7056G3665
$$ 93425 -120513 -444745 -54952 -147390 -96003 -45063 -138814 303339 -100669 -53613 73665
15882A93267d86900B10453E6378h5698A46620o6345g277j51595B8083c5233A02488
$$ 193267 -486900 210453 56378 -85698 146620 80275 -7277 -158872 28083 -35233 102488
15870a56782A34805d38457B8708n566K0928b76783I814b01413o7187i0913o6117
$$ -156782 134805 -438457 28708 23142 44070 -276783 9814 -201413 -268600 -90913 -157030
15859a57030G3935B2983J18218E1339b3490G3107a79006C2485a2052m4561j44497
$$ -157030 73935 22983 141201 51339 -23490 73107 -179006 32485 -12052 -56613 -201110
15848b01110E5986J0913P8916F9340f6881b1032q0939k66758M523R6562f2900
$$ -201110 55986 66899 145815 69340 -66881 -21032 -101971 -368729 -364206 -267644 -62900
15836a75884j94168e0925B67631a71885G2675c47858d2440q1481B1904e0907A79218
$$ -175884 -370052 -50925 267631 -171885 72675 -347858 -42440 -123921 21904 -50907 179218
15824a0773k82481J46401c5653j45036M2851l9782B22911F6602b63129K7320h7351
$$ -10773 -293254 -146853 -35653 -180689 -137838 -177620 222911 66602 -263129 -235809 -87351
15812b01485k48068a71802I7161j558c7838O380j22857j94694B54136a53744A74623
$$ -201485 -449553 -171802 97161 95603 -37838 -31458 -154315 -349009 254136 -153744 174623
15800c8438A18339A7236a50954M5684l3475A40122P7069b97517r721A82195D8892
$$ -38438 118339 17236 -150954 -105270 -138745 140122 217191 -297517 -307238 182195 48892
15788d1147k40328C46779k7916c3675A45611a03628B3685b56013B02795a80183
$$ -41147 -281475 346779 318863 -33675 145611 -103628 23685 -256013 202795 -180183
15777I9983J54998a61522a9644A03516J1808n3416f1421A5387g6161J2756k63084
$$ 99983 254981 -161522 -19644 103516 115324 61908 -61421 15387 -76161 -63405 -326489
15766c26489h8694R21b9978k90292D33341g821l39042d0025A08553E1586K08547
$$ -326489 -88694 -87773 -29978 -320270 433341 -7821 -346863 -40025 108553 51586 260133
15755B60133j24899C5493b10176A28001b72285C7491M9115J89812C6615d0383
$$ 260133 135234 35493 -210176 128001 -272285 37491 86606 276418 36615 -40383
15744a38653B27503a79049H8022Q448a49430B10823K6268a20487A12773A572a72054
$$ -138653 227503 -179049 88022 96470 -149430 210823 237091 -120487 112773 1572 -172054
15732B13499a27892j25954C26853e4423h37r0325k01457J32742j9944d9829A03579
$$ 213499 -127892 -253846 326853 -54423 -837 -91162 -292619 -159877 -179821 -49829 103579
15720B44749b01147H4832N884a83694D1884b91615E3365Q8822P244b7215A65932
$$ 244749 -201147 84832 90716 -183694 41884 -291615 53365 142187 149431 -27215 165932
15708e1626J4396C30336b1983k20711d7170J0447j07807c3988A0439J54430D5288
$$ -51626 -37230 330336 -21983 -242694 -47170 -36723 -144530 -33988 10439 164869 45288
15696C9604b5182q9000d0635A8789J73723a03298l22650b7234B64990b59307F3483
$$ 39604 -25182 -114182 -40635 18789 192512 -103298 -425948 -27234 264990 -259307 63483
15684C15300A4752b42806O9101m0550n8755A11211e5706A49481j4420a54413F6591
$$ 315300 14752 -242806 -173705 -214255 -273010 111211 -55706 149481 135061 -154413 66591
15672a80743C26864j03975j09927a4854A13542b04130A92737c18942B8344M3253
$$ -180743 326864 222889 112962 -14854 113542 -204130 192737 -318942 28344 71597
15662G1597K3905L4276K28774F0237O590M2696A263a25701B64223a30323j90777
$$ 71597 95502 129778 358552 60237 66827 109523 1263 -125701 264223 -130323 -321100
15651c21100J15958B6253p44a10014g043A58492a11910a9760l7166B34510a85650
$$ -321100 -205142 26253 25509 -110014 -7043 158492 -111910 -19760 -56926 234510 -185650
15639G7945J78767a43543E8315L4720A556O8208h5572j8796B32307B4931J22764
$$ 77945 256712 -143543 58315 93035 1556 69764 -85572 -104368 232307 24931 147695
15628A47695f04734a19805B02417N8822a48270B81513A38302l2566P8726d2238
$$ 147695 -604734 -119805 202417 261239 -148270 281513 138302 105736 184462 -42238
15617b67561L2841C13480a80939B22147a33160A89244K07994c37691B34990B6403
$$ -267561 -234720 313480 -180939 222147 -133160 189244 397238 -337691 234990 26403
15606a65003P9305F6784b90688n6743J40039n301E8517J00164a3240D7965a17279
$$ -165003 -85698 66784 -290688 -347431 -207392 -212693 58517 158681 -13240 47965 -117279
15594B19628b87205J02725C9590a57816e1523k1681D9388b19299B7359m028K42580
$$ 219628 -287205 -184480 39590 -157816 -51523 -73204 49388 -219299 27359 23331 265911
15583B65911d0379p1687j43047a00185n5301I0504a18716m3578g7162A75708b89759
$$ 265911 -40379 -112066 -255113 -100185 -155486 90504 -118716 -162294 -77162 175708 -289759
15571A24956C8588J23052c37157A52759b87704i2681p2478H3522K40107b22895
$$ 124956 38588 161640 -337157 152759 -287704 -92681 -165159 83522 323629 -222895
15560C4047J41816h4565q0068I9973e5667C1105L21677A09001d0281j6445I9681
$$ 34047 175863 -84565 -164633 99973 -55667 31105 352782 109001 -40281 -56726 99681
15548A80245d7858G90a64691A64011B8249K67385A25148b14504B73651a41002
$$ 180245 -47858 790 -164691 164011 28249 295634 125148 -214504 273651 -141002
15537B69969i2769j02749B76346r7099M1142a82645A25231b36138i3934o9571
$$ 269969 -92769 -195518 276346 179247 220389 -182645 125231 -236138 -93934 -163505
15527a63505N1564A32290K42287a19846k07212D2493J61313h4462B8307a90341
$$ -163505 -111941 132290 374577 -119846 -327058 42493 203806 -84462 28307 -190341
15516g2665G2476g9114o1677r6305f4721A13566j9380b3704D17449a77281I6826
$$ -72665 72476 -79114 -140791 -237096 -64721 113566 94186 -23704 417449 -177281 96826
15504A54330a76411D0080a06790d7310r8478B69236e6084D72627b574A92940J0890
$$ 154330 -176411 40080 -106790 -47310 -145788 269236 -56084 472627 -2574 192940 203830
15493B03830f5336A02689O3750M2296c71512H5134O676Q460L1382a3891E2314
$$ 203830 -65336 102689 166439 208735 -371512 85134 91810 100270 131652 -13891 52314
15481A21887A5427J05430i4435L9393Q510p0544b2741C349J71651C4648b81085
$$ 121887 15427 120857 -94435 -55042 -46532 -117076 -22741 3349 175000 34648 -281085
15469b8958l77637a531A99768i1858B60621f7822E8236l515J28039a50613L3431
$$ -28958 -406595 -1531 199768 -91858 260621 -67822 58236 54721 182760 -150613 -117182
15458a17182A83906k0897b87612h520E079K90203j19605p1227m3727b07983B30648
$$ -117182 183906 163009 -287612 -8520 5079 295282 175677 104450 60723 -207983 230648
15446I2206K0374J47229j03162C436c9836j68672A13247a02232A08393a0644k35938
$$ 92206 112580 259809 156647 3436 -39836 -208508 113247 -102232 108393 -10644 -246582
15435b46582B37667q9531K3440C0105M2508B4070K57561i8523B23032h7751b4428
$$ -246582 237667 148136 171576 30105 72613 24070 281631 -98523 223032 -87751 -24428
15423c5767a0771A98837F2535O961L57285a2276m5052C3853J27563J11175L990
$$ -35767 -10771 198837 62535 69496 426781 -12276 -57328 33853 161416 272591 276581
15412B76581a95890A57636G0618a68001q3397D26330c22470A27920h4516H4397
$$ 276581 -195890 157636 70618 -168001 -251398 426330 -322470 127920 -84516 84397
15401A16825m4097d4249n9534D21268a15852B91808A26884b70855F551K70743
$$ 116825 72728 -44249 -103783 421268 -115852 291808 126884 -270855 6551 277294
15391B77294b11950D4402g9542a2382A49136f3443C1412K5389c0028A87124l7257
$$ 277294 -211950 44402 -79542 -12382 149136 -63443 31412 56801 -30028 187124 149867
15380A49867G2242a51444A51841e7258A61183e7535l01573g2565G0966a00460
$$ 149867 72242 -151444 151841 -57258 161183 -57535 -359108 -72565 70966 -100460
15369d7361l0856A63545L33b04802B46315a90039C5602K9747J67462D4809K98736
$$ -47361 -78217 163545 163878 -204802 246315 -190039 35602 65349 232811 44809 343545
15358C43545E6021J12531k6907e3554B10785l8850P8304d8324F5667L53919A22378
$$ 343545 56021 168552 141645 -53554 210785 171935 250239 -48324 65667 419586 122378
15346D46412o2204F7899M2877b3527o173B55651J02329r5149d5403A97446q8424
$$ 446412 384208 67899 110776 -23527 -29700 255651 357980 262831 -45403 197446 109022
15335A09022r081k6661J10471a07068B16293j05532d25755B2366K44804c7901
$$ 109022 99941 73280 183751 -107068 216293 110761 -425755 22366 267170 -37901
15324A62752P5379E88c8764D40977a13716C20393A29383P5323p3068J8070p3064
$$ 162752 238131 588 -38764 440977 -113716 320393 129383 204706 131638 149708 76644
15313G6644b65101e0355A65879J33409a08509A67214E127e0428p4750B23896b25717
$$ 76644 -265101 -50355 165879 299288 -108509 167214 5127 -50428 -125178 223896 -225717
15301A25170h0562a7159B44519A06203J12944F0314Q718i048B55726A20898b77641
$$ 125170 -80562 -17159 244519 106203 219147 60314 69032 -9048 255726 120898 -277641
15289A42869M8665d9469E3209J0131K2933h2965B92893D3848J56091L5748J6668
$$ 142869 191534 -49469 53209 63340 86273 -82965 292893 43848 199939 235687 252355
15278B52355A2081a6908A51636d345D61205A10507d1742B54411q4977F2604L8076
$$ 252355 12081 -16908 151636 -4345 461205 110507 -41742 254411 169434 62604 100680
15267A00680K7234a14983I0581A2761K13819K89035j50219j1943j08717o9548
$$ 100680 127914 -114983 90581 12761 226580 515615 365396 353453 244736 175188
15257A75188J1150o8880K64095n0494C4206B334J87180D8569N79849j54702B08013
$$ 175188 186338 117458 381553 331059 34206 2334 189514 48569 628418 473716 208013
15245D41440o6972j22783E3273K03778A7370L02864c9553I3677K6535K5260J93861
$$ 441440 374468 251685 53273 257051 17370 320234 -39553 93677 120212 145472 339333
15234C39333A07418g3761B03166E2254P2975E8486K26264B8001J79181O5575K35326
$$ 339333 107418 -73761 203166 52254 125229 58486 284750 28001 207182 272757 508083
15223E08083J44695A39418m5508Q2062J98307O8245a50700C68353E3573K14938
$$ 508083 652778 139418 93910 175972 374279 442524 -150700 368353 53573 268511
15213B68511k4840R8619a54751H0971K65538j7112A0891J09975k8827L32854E5190
$$ 268511 243671 342290 -154751 80971 346509 329397 10891 120866 92039 424893 55190
15201A66732i260F4313K23555g2733B65795m5599a66269A7012K9738a4583B65180
$$ 166732 -9260 64313 287868 -72733 265795 220196 -166269 17012 46750 -14583 265180
15189f2616A26825J6914b6670C07819i4073M5989H6073R3684J97257j71780c1210
$$ -62616 126825 143739 -26670 307819 -94073 -48084 86073 179757 377014 205234 -31210
15177c61433B76579o6734c2366j91207H8642J94826H6878K11757A48242N788P7377
$$ -361433 276579 209845 -32366 -223573 88642 283468 86878 298635 148242 154030 231407
15166B31407J42651A35265J78572c5568B21799J04580p2516a7114E27727j19486
$$ 231407 374058 135265 313837 -35568 221799 326379 253863 -17114 527727 408241
15156D08241A32250M1699J73532A32588J72310j22546J03648R5038I5538m2478
$$ 408241 132250 173949 347481 132588 304898 182352 286000 381038 95538 53060
15146E3060b0569l8039g366E45119g869A30409e3693B27208m0327o541L2316K45804
$$ 53060 -20569 -58608 -7366 545119 -7869 130409 -53693 227208 186881 180340 212656 458460
15134D58460A81308P1454f6285G6239L52009B00618K22578q3288J86653H4091
$$ 458460 181308 252762 -66285 76239 428248 200618 423196 339908 526561 84091
15123A85699J39799A21226J39944O4309q852k9726A21590c2369C74646p6016A41257
$$ 185699 325498 121226 261170 325479 316627 286901 121590 -32369 374646 298630 141257
15111A15089K96865A95994L25240D7792N0503P1891J91742j67547K4235K41317
$$ 115089 411954 195994 521234 47792 98295 170186 361928 194381 218616 459933
15101D59933A23407K58767A49788K53123R660j42769L33098A37031R4384Q9950
$$ 459933 123407 382174 149788 402911 412571 269802 602900 137031 231415 321365
15091C21365p9103e6862k7168B42730A6809J36764P1052j0827b62620B11172J49647
$$ 321365 242262 -56862 -84030 242730 16809 153573 224625 213798 -262620 211172 360819
15080C60819j05846a32000B71973O9200K73343j26234A57555L78127k7072G4106
$$ 360819 254973 -132000 271973 341173 614516 488282 157555 535682 508610 74106
15069i0187A78922K74924N5615B30897J34399j75065p8720K75306K99114A89034
$$ -90187 178922 453846 509461 230897 365296 190231 111511 386817 685931 189034
15058H9537N42561j38712m4606D1932K3045L11077j71571h6947B70989n4152J22833
$$ 89537 632098 493386 448780 41932 64977 376054 204483 -86947 270989 216837 339670
15047C39670A7571N35417j76821j49136K44616P9180A38994M35186B18998m5788
$$ 339670 17571 552988 376167 227031 471647 550827 138994 574180 218998 173210
15037A73210P0061M55908j42975j19711k13072N9172I9897K11305m3190H6183
$$ 173210 243271 699179 556204 436493 223421 282593 99897 311202 268012 86183
15026B05526r454b3285B91776M6302O5844J94980B49481p4311n099L70063k22834
$$ 205526 196072 -23285 291776 338078 403922 598902 249481 175170 170071 540134 317300
15015C17300j01029L08300B42554M2583J32822J36906J27545m1045B96998Q5595
$$ 317300 216271 524571 242554 285137 417959 554865 682410 641365 296998 382593
15005C82593J89704l9301K007J89412l01328K04298k64366R54K04008E9746P17827
$$ 382593 572297 532996 535003 724415 423087 627385 363019 363973 567981 59746 777573
14994G77573A56741J99944j2607J34174L25679k41073N0759j55116K0885J2417
$$ 777573 156741 356685 344078 478252 803931 562858 613617 458501 479386 491803
14984D91803j66843K07782m8513k9482Q1979R2980k89092K0202K00242j96947
$$ 491803 324960 532742 484229 454747 536726 629706 340614 360816 561058 364111
14974C64111J96368P0683j39767r9690M05821B68946K31440k03868J86221m4902
$$ 364111 560479 631162 491395 391705 797526 268946 500386 296518 482739 437837
14964D37837Q7478r9673R9603m4909L1771n710A77817L66492Q0866J22958l73442
$$ 437837 525315 425642 525245 480336 512107 506397 177817 544309 625175 748133 374691
14953C74691K67036K01026k03372N8173P5761l58238K44719l1133A20874M31003
$$ 374691 641727 842753 639381 697554 773315 415077 659796 628663 120874 551877
14943E51877j7402J42334M2941A74721N64017j35224B74829M37634j18215Q4976
$$ 551877 534475 676809 719750 174721 738738 603514 274829 712463 594248 679224
14933F79224k77868K70519B71443J60161K88560l31568J47018P3845M5743j52515
$$ 679224 401356 671875 271443 431604 720164 388596 535614 609459 655202 502687
14923E02687n0577J6961K95429o3562k7545l25216J72438n3955J50682k895A85843
$$ 502687 452110 469071 764500 700938 673393 348177 520615 466660 617342 614447 185843
14911F59620o0574p4531J061r5609J1345J83066B64718L20196J61138m2707N2719
$$ 659620 599046 524515 525576 429967 441312 624378 264718 584914 746052 703345 756064
14900G56064k23331K61176p5430N3401j74176M12913l02620p0517P2534K74761
$$ 756064 532733 793909 718479 771880 597704 1010617 707997 637480 710014 984775
14890I84775m69398L30000j945J03570N9481k44326J08615k85765P9785j07699
$$ 984775 515377 845377 843432 947002 1006483 762157 870772 585007 664792 557093
14880E57093J79031m9576n7957L15159m52369L94591M6387l40313L25359k49260
$$ 557093 736124 686548 628591 943750 491381 885972 932359 592046 917405 668145
14870F68145J26790K02885j52200j84847R0923N4962m1237L9547k62025L91303
$$ 668145 794935 997820 845620 660773 751696 806658 765421 804968 542943 934246
14860I34246m2008n4725j96152N4318J93117r414p8303J69986j22772M34416l6144
$$ 934246 892238 837513 641361 695679 888796 879382 801079 971065 848293 1282709 1246565
14849A246565k42747n00832N03790j80506m7438J81255k50807R5062K57625m61932
$$ 1246565 1003818 502986 1006776 826270 778832 960087 709280 804342 1061967 600035
14839F00035M98592J19950k32131K8188l00045L96990R7047q2406j8774n3823
$$ 600035 1098627 1218577 986446 1014634 714589 1111579 1208626 1126220 1107446 1053623
14829A053623J21885m50415K71182O1794j9149P044o5448M9621j77078l3019J77162
$$ 1053623 1175508 725093 996275 1058069 1038920 1045964 980516 1030137 853059 820040 997202
14818I97202M6637L9503J00108J3499J45025j82616j77725o9176R4432J29719
$$ 997202 1043839 1083342 1183450 1196949 1341974 1159358 981633 912457 1006889 1136608
14808A136608L64257n04473J8071L34873k22062J0193p8688J62208j56714L63629
$$ 1136608 1500865 996392 1014463 1349336 1127274 1137467 1058779 1220987 1064273 1427902
14798A427902o25720L58162k57715K87891N13675l88682j46927J33658J64260
$$ 1427902 802182 1160344 902629 1190520 1704195 1315513 1168586 1302244 1466504
14789A466504j35915l29475N93346k37684k9067K6486k62312j727M23223l49959
$$ 1466504 1330589 1001114 1594460 1356776 1327709 1354195 1091883 1090156 1513379 1163420
14779A163420K21845l2445O1924k7749k07129K22538k52847L25561k30875O87836
$$ 1163420 1385265 1352820 1414744 1386995 1179866 1402404 1149557 1475118 1244243 1932079
14769A932079n42785P6651L6124k09383K50959O5254J73599j79196J06068r5770
$$ 1932079 1389294 1465945 1502069 1292686 1543645 1608899 1782498 1603302 1709370 1613600
14759A613600l7314m0418j41829J15310K37621N7537O4957M6549j72603k45312
$$ 1613600 1576286 1535868 1394039 1509349 1746970 1804507 1869464 1916013 1743410 1498098
14749A498098J67872k7106P8608l3202K45822p0731l22476J98961j07079M13448
$$ 1498098 1665970 1638864 1717472 1684270 1930092 1859361 1536885 1735846 1628767 2042215
14739B042215k98797L7567J61828j16401l3463J80622j65669R585l8333J1172
$$ 2042215 1743418 1780985 1942813 1826412 1792949 1973571 1807902 1817487 1779154 1790326
14729A790326J46153R2251n9538L0401n1918K17451m45159N33950P6600k51911
$$ 1790326 1936479 2028730 1969192 1999593 1947675 2165126 1719967 2253917 2330517 2078606
14719B078606m8440J11603j5394k92420K18135j72115N22668j84840Q7151l29174
$$ 2078606 2030166 2141769 2126375 1833955 2052090 1879975 2402643 2217803 2304954 1975780
14709A975780Q0753M6887j14062L04933j44676R2022j45654O1320K95764k12805
$$ 1975780 2056533 2103420 1989358 2294291 2149615 2241637 2095983 2157303 2453067 2240262
14699B240262o6419K62667j17296m659J44099l7316J3593L72877l77181p9292
$$ 2240262 2173843 2436510 2319214 2314555 2458654 2421338 2434931 2807808 2430627 2351335
14689B351335K11262J18770J77228l48526r2480J50185M46225o37374K34091j02269
$$ 2351335 2562597 2681367 2858595 2510069 2417589 2567774 3013999 2376625 2610716 2508447
14679B508447Q355R0149J77067K1025r953k12693N8738J24100J27487k97710L23026
$$ 2508447 2516802 2606951 2784018 2805043 2795090 2582397 2641135 2765235 2892722 2595012 2918038
14668B918038k36150J68790J11605l44762Q13264l51417k50595K04560m6312O34764
$$ 2918038 2681888 2850678 2962283 2617521 3430785 3079368 2828773 3033333 2987021 3621785
14658C621785l29783L0235J70602m92284J94047j6137K24828m70375J67027J49724
$$ 3621785 3292002 3322237 3492839 3000555 3194602 3178465 3403293 2932918 3099945 3249669
14648C249669K91053k54515j94K42123J32683R0196l37376J69067j79102J3061
$$ 3249669 3540722 3286207 3286013 3528136 3660819 3751015 3413639 3582706 3403604 3416665
14638C416665J43520J46530q8275N42739q1979l61841K42685M1864k10834J45690
$$ 3416665 3560185 3706715 3618440 4161179 4079200 3717359 3960044 4001908 3791074 3936764
14628C936764K85277M4347m96082M31391j17076N0841J68679q9696k30460M86795
$$ 3936764 4222041 4266388 3770306 4201697 4084621 4135462 4304141 4214445 3983985 4470780
14618D470780k08866Q5570K28347l0740k2013k07853K98561J8333k11769P24662
$$ 4470780 4261914 4347484 4575831 4545091 4523078 4315225 4613786 4632119 4420350 5145012
14608E145012n30124K11695P9079K29635m3615m33864L87948q4097o7503J78415
$$ 5145012 4614888 4826583 4905662 5135297 5091682 4657818 5045766 4961669 4894166 5072581
14598E072581K65328n7398O2020J26894k72724P0905K54919q3146J43840j57554
$$ 5072581 5337909 5280511 5342531 5469425 5196701 5267606 5522525 5439379 5583219 5425665
14588E425665J62337M83014r0124n0910L68016m22845M82394K87222K2238m00986
$$ 5425665 5588002 6071016 5980892 5929982 6297998 5875153 6357547 6644769 6667007 6266021
14578F266021L55613N26022l09151J14131l9727j00108O15761n91766O26396k21768
$$ 6266021 6621634 7147656 6838505 6952636 6912909 6812801 7428562 6836796 7463192 7241424
14568G241424M53667N6030J72224K10335j67986K30872K83023J29396m8092J76536
$$ 7241424 7695091 7751121 7923345 8133680 7965694 8196566 8479589 8608985 8560893 8737429
14558H737429L06656K02153K89818K09490J59824M4426K40819N75714N94953P90992
$$ 8737429 9044085 9246238 9536056 9745546 9905370 9949796 10190615 10766329 11361282 12152274
14548A2152274K40758M82528P3995j251733j136321j662138p84491p63664o7441
$$ 12152274 12393032 12875560 12949555 11697822 10561501 8899363 8114872 7351208 7283767
14539G283767l16948J42616K16694O9220M9315K80982j15330P7199K32850J51933
$$ 7283767 6966819 7109435 7326129 7395349 7444664 7725646 7610316 7687515 7920365 8072298
14529H072298J33790k28765N8671K13959K8958N7231M40697o3610j08600K18628
$$ 8072298 8206088 7977323 8035994 8249953 8278911 8336142 8776839 8713229 8604629 8823257
14519H823257L8473J41928r2111L82162R3704k7315K6843M19943k52364L59253
$$ 8823257 8861730 9003658 8911547 9293709 9387413 9360098 9386941 9806884 9554520 9913773
14509I913773N9137l4372K47323K00663l56677P32727j97699K52110K7830q969
$$ 9913773 9972910 9938538 10185861 10386524 10029847 10762574 10564875 10816985 10844815 10835846
14499A0835846J54947M22718k6447l27346K91609J34151M33287o1452K88429m3454
$$ 10835846 10990793 11413511 11387064 11059718 11351327 11485478 11918765 11857313 12145742 12102288
14489A2102288L4776N12512O6228K45883q4032M15557L6684j78016M43249L00088
$$ 12102288 12137064 12649576 12715804 12961687 12877655 13293212 13329896 13151880 13595129 13895217
14479A3895217J56016K57789J00858Q1083Q146M09093O0589J72549J55998K99680
$$ 13895217 14051233 14309022 14409880 14490963 14499109 14908202 14968791 15141340 15297338 15597018
14469A5597018J49920M0026L03970J48870J19664K67137K64600L22566P4845N3362
$$ 15597018 15746938 15786964 16090934 16239804 16359468 16626605 16891205 17213771 17288616 17341978
14459A7341978J8017P23878j63868N9791K56082O12375K31409M8164L15110J29780
$$ 17341978 17359995 18083873 17920005 17979796 18235878 18848253 19079662 19127826 19442936 19572716
14449A9572716K85214O09730j69505K7150M17829M29913k7745R83418o5601p1727
$$ 19572716 19857930 20467660 20298155 20325305 20743134 21173047 21145302 22128720 22063119 21991392
14439B1991392Q44413k1883M12672Q1011K89525L28048K60244P23627J04341J86391
$$ 21991392 22835805 22813922 23226594 23307605 23597130 23925178 24185422 24909049 25013390 25199781
14429B5199781K42695M90525L68477M33157N51863L54523M82478K61784M08093
$$ 25199781 25442476 25933001 26301478 26734635 27286498 27641021 28123499 28385283 28793376
14420B8793376M32336O92275L29640L67819J59481O00404K37663P71655M3869
$$ 28793376 29225712 29917987 30247627 30615446 30774927 31375331 31612994 32384649 32428518
14411C2428518L35233L95361K16365M72076M40968K51672N98772M01064P58042
$$ 32428518 32763751 33159112 33375477 33847553 34288521 34540193 35138965 35540029 36298071
14402C6298071P81472J20254N92841O03274j02692J075409P21973M34709O53967
$$ 36298071 37079543 37199797 37792638 38395912 38293220 39368629 40090602 40525311 41179278
14393D1179278R92638N60637N05665L82092N42423N95892N70103O70820Q32253
$$ 41179278 42171916 42732553 43238218 43620310 44162733 44758625 45328728 45999548 46831801
14384D6831801J83158N51663P39240Q46415J078527P58530J115611N22446L83993
$$ 46831801 47014959 47566622 48305862 49152277 50230804 50989334 52104945 52627391 53011384
14375E3011384O46930Q93228M55653R90907O76117R28287P33679R29419R58928
$$ 53011384 53658314 54551542 55007195 55998102 56674219 57602506 58336185 59265604 60224532
14366F0224532O53732Q09338O51126J041810R58927J239115R49476R98451J101937
$$ 60224532 60878264 61687602 62338728 63380538 64339465 65578580 66528056 67526507 68628444
14357F8628444Q60236O38157J298618O85349Q84554J357600R00928J442075J066120
$$ 68628444 69488680 70126837 71425455 72110804 72995358 74352958 75253886 76695961 77762081
14348G7762081N28124J495343J015197J308434J052852J587132J236192J310835
$$ 77762081 78290205 79785548 80800745 82109179 83162031 84749163 85985355 87296190
14340H7296190J393788R28869J685870J629854J246650K434937J625951J171832
$$ 87296190 88689978 89618847 91304717 92934571 94181221 96616158 98242109 99413941
14332I9413941J794576J058216J195050J582056J852652K356794K026960J806237
$$ 99413941 101208517 102266733 103461783 105043839 106896491 109253285 111280245 113086482
14324A13086482J441589J136786K393229K612443K093007K070460K640749K343903
$$ 113086482 114528071 115664857 118058086 120670529 122763536 124833996 127474745 129818648
14316A29818648K012873K635854K719093K306671K135088L445995K570375L413994
$$ 129818648 131831521 134467375 137186468 139493139 141628227 145074222 147644597 151058591
14308A51058591K328416J999989K898236K931582K344710K459524L765356M709074
$$ 151058591 153387007 155386996 158285232 161216814 163561524 166021048 169786404 174495478
14300A74495478L437429K760179L395407M010918L411020M131349M312390K278068
$$ 174495478 177932907 180693086 184088493 188099411 191510431 195641780 199954170 202232238
14292B02232238M399499O210675N344683K888664J600118J694489N536577L919534
$$ 202232238 206631737 212842412 218187095 221075759 222675877 224370366 229906943 233826477
14284B33826477M570961M647852N318149N261858O847930P288627N137062K983042
$$ 233826477 238397438 243045290 248363439 253625297 260473227 267761854 272898916 275881958
14276B75881958M061711P505016J2329782J4079283R034451P221330P434522J725712
$$ 275881958 279943669 287448685 299778467 313857750 322892201 330113531 337548053 339273765
14268C39273765P85898o731475j1775095j5725352k2507769k4062043k2234868
$$ 339273765 340059663 333328188 321553093 305827741 283319972 259257929 237023061
14261B37023061j9603148j7648201j5138319j3440251j2457475j1022505r668956
$$ 237023061 217419913 199771712 184633393 171193142 158735667 147713162 138044206
14254A38044206q625172q320921p460288o611954n936041n537452m985678m828049
$$ 138044206 129419034 121098113 113637825 107025871 101089830 95552378 90566700 85738651
14246H5738651m191739l998820l633202l243537l137201k845687k736138k576616
$$ 85738651 81546912 77548092 73914890 70671353 67534152 64688465 61952327 59375711
14238E9375711k248301k252149k245907k066251k010566j429619j697869j811684
$$ 59375711 57127410 54875261 52629354 50563103 48552537 47122918 45425049 43613365
14230D3613365j355048j576631j569832j102800j110474j615069j031671j257220
$$ 43613365 42258317 40681686 39111854 38009054 36898580 35283511 34251840 32994620
14222C2994620p59096j087610r14725q33258r96946q66988n15772r97593q48001
$$ 32994620 32235524 31147914 30233189 29399931 28402985 27535997 27020225 26022632 25174631
14213B5174631n76532n93907o09973o84257o98542q54307k08011o21856o33172
$$ 25174631 24598099 24004192 23394219 22709962 22011420 21157113 20949102 20327246 19694074
14204A9694074m30062n0704q71824l52235k29249l27118l95163m92896k22520
$$ 19694074 19264012 19213308 18341484 17989249 17760000 17432882 17037719 16544823 16322303
14195A6322303l33267l87813j20464l93672k53297n59309n3344l02278m51159
$$ 16322303 15989036 15601223 15480759 15087087 14833790 14274481 14221137 13918859 13467700
14186A3467700J01001m46034o30691O17480p78031k06566l47913J05718k68359
$$ 13467700 13568701 13122667 12491976 13109456 12331425 12124859 11776946 11882664 11614305
14177A1614305l68532j87069l25253j91911m04504K45729m11967k62232m21024
$$ 11614305 11245773 11058704 10733451 10541540 10137036 10382765 9970798 9708566 9287542
14168I287542M22923k73133l76085k40173M16396j37102m67342j9100o3682m33006
$$ 9287542 9710465 9437332 9061247 8821074 9237470 9100368 8633026 8613926 8550244 8117238
14158H117238q6792k82054O8628k04203K44009l71787K50957o17464n0607Q1955
$$ 8117238 8030446 7748392 7817020 7612817 7856826 7485039 7735996 7118532 7067925 7149880
14148G149880l54874K79850l13412N7456j2065k52167k77585K68774k56502J66195
$$ 7149880 6795006 7074856 6761444 6818900 6806835 6554668 6277083 6545857 6289355 6455550
14138F455550j74652J09231m71143L2319N9297k03861l0125m3664q9141n5527
$$ 6455550 6280898 6390129 5918986 5951305 6010602 5806741 5776616 5732952 5643811 5588284
14128E588284o0512l0868L3494l10231m8438J20218J9748m16946K61665l33851
$$ 5588284 5527772 5496904 5530398 5220167 5171729 5291947 5311695 4894749 5156414 4822563
14118D822563M10094m04357J27642m3675P2942K5888q3332k7117o170o4234j89435
$$ 4822563 5232657 4828300 4955942 4912267 4985209 5011097 4927765 4900648 4894478 4830244 4640809
14107D640809N1414J50908l19971p3276J45270j12102R6173n01047j04921M02176
$$ 4640809 4692223 4843131 4523160 4449884 4595154 4483052 4579225 4078178 3973257 4375433
14097D375433p7185J48557j41356j1129j78527k7789q7956M5315O6344k12397
$$ 4375433 4298248 4446805 4305449 4294320 4115793 4088004 4000048 4045363 4111707 3899310
14087C899310r0559J76067J62511n16075q4596J93101j44063J82409k72341J68177
$$ 3899310 3808751 3984818 4147329 3631254 3546658 3739759 3595696 3778105 3505764 3673941
14077C673941k05098L9032l56573N43583j37206J47003k4055k49070N9059k73769
$$ 3673941 3468843 3507875 3151302 3694885 3557679 3704682 3680627 3431557 3490616 3216847
14067C216847P3623K81172m97032L38973k01941l3950o4141m101R2704p6185j94289
$$ 3216847 3290470 3571642 3074610 3413583 3211642 3177692 3113551 3109450 3202154 3125969 2931680
14056B931680K42213N17748o47101J38781l4100N7151l12668K53353j54899J36843
$$ 2931680 3173893 3691641 3044540 3183321 3149221 3206372 2893704 3147057 2992158 3129001
14046C129001j06440N0137q4409k01970L13105R6598k92744k07467R0799j35904
$$ 3129001 3022561 3072698 2988289 2786319 3099424 3196022 2903278 2695811 2786610 2650706
14036B650706M03406k03610J16098p4751K62L68613n61812M16433o7517j40496
$$ 2650706 3054112 2850502 2966600 2891849 2892111 3260724 2698912 3115345 3047828 2907332
14026B907332k18000J79975K75544k88760k2812m1272K6848K21273j7914j85378
$$ 2907332 2689332 2869307 3144851 2856091 2833279 2792007 2818855 3040128 3022214 2836836
14016B836836M45508O7961k71331N0028M28228m80025R6073N8281N8229M1819
$$ 2836836 3282344 3350305 3078974 3129002 3557230 3077205 3173278 3231559 3289788 3331607
14006C331607j1570K47655l21091K20044Q6016L0228L07461Q5916k103J49838
$$ 3331607 3320037 3567692 3246601 3466645 3552661 3582889 3890350 3976266 3974163 4124001
13996D124001k598N12240L31473l35706O10726j7412P00865N94297N20508M00480
$$ 4124001 4121403 4633643 4965116 4629410 5240136 5222724 5923589 6517886 7038394 7438874
13986G438874M18007o04513j124787j599405j040061l07674n43652j58423k68482
$$ 7438874 7856881 7252368 6127581 4528176 3488115 3180441 2636789 2478366 2209884
13977B209884j48174k37358K4242Q6210l28183L27569l18932K43369k16363j19622
$$ 2209884 2061710 1824352 1848594 1934804 1606621 1934190 1615258 1858627 1642264 1522642
13967A522642J33684K67865J48167n49866k28291N94920k93181l84562K85193
$$ 1522642 1656326 1924191 2072358 1522492 1294201 1889121 1595940 1211378 1496571
13958A496571q4095j13519L30395k6217J85544l88029K19125j84776j67961P7832
$$ 1496571 1412476 1298957 1629352 1603135 1788679 1400650 1619775 1434999 1267038 1344870
13948A344870N8353J91248J40768k20860o2207j77669j99632L69790l18578K62683
$$ 1344870 1403223 1594471 1735239 1514379 1452172 1274503 1074871 1444661 1126083 1388766
13938A388766O2685j88908J63331k53434n4016J0815M6328j34041K49840k4579
$$ 1388766 1451451 1262543 1425874 1172440 1118424 1129239 1175567 1041526 1291366 1266787
13928A266787k60392K31757J18456j48797n7851M7438j57624J72538k49013j2534
$$ 1266787 1006395 1238152 1356608 1207811 1149960 1197398 1039774 1212312 963299 950765
13918I50765K09109k62310K67034R5645k90977k03885N61672m8236K9914l48981
$$ 950765 1159874 897564 1164598 1260243 969266 765381 1327053 1278817 1308731 959750
13908I59750J10670J30184m5175m6790r5850L65139j60072l99345R3023J06750
$$ 959750 1070420 1200604 1155429 1108639 1012789 1377928 1217856 818511 911534 1018284
13898A018284J65319L27178n06282N2552K44010o16913L74112j69238J09304k66804
$$ 1018284 1183603 1510781 1004499 1057051 1301061 684148 1058260 889022 998326 731522
13888G31522J62302J1058J41748j67616K69821j45003j18494n4751j44803L71954
$$ 731522 893824 904882 1046630 879014 1148835 1003832 885338 830587 685784 1057738
13878A057738M5483L0389P946r5532l02951J52573n617Q6408k6555j59786J03188
$$ 1057738 1103221 1133610 1141556 1046024 743073 895646 890029 976437 949882 790096 893284
13867H93284K95123l00180k03008K53763k08785O5059J91413l64278j05357O49774
$$ 893284 1188407 888227 685219 938982 730197 795256 986669 622391 517034 1166808
13857A166808l81819j72013l9408M97434o1949l94304K80889l38213K77288o6313
$$ 1166808 784989 612976 573568 1071002 1009053 614749 895638 557425 834713 768400
13847G68400j11607l6431J91090j99446J90270n7155j2478L24119l98713J36507
$$ 768400 656793 620362 811452 612006 802276 745121 732643 1056762 658049 794556
13837G94556k28280j3865R0510K72503n5918j49555L268n0758L94916k81067J38084
$$ 794556 566276 552411 642921 915424 859506 709951 713219 662461 1057377 776310 914394
13826I14394l06916B86647K71767j07034m2459K52562J40186j82813K60261J88284
$$ 914394 607478 286647 558414 451380 408921 661483 801669 618856 879117 1067401
13816A067401m04167K4181M56q7560N2582k20560N78405D90757Q503j7278R3603
$$ 1067401 663234 687415 687871 600311 652893 432333 1010738 490757 499260 481982 575585
13805E75585j44847n4955J62752L00935k6657l00814K57527q4481k4686O3316
$$ 575585 430738 375783 538535 839470 812813 511999 769526 685045 660359 723675
13795G23675J208l10099K61650j98200L1775K17864q2092K0553O6759R9274l43866
$$ 723675 724883 414784 676434 478234 510009 727873 645781 666334 733093 832367 488501
13784D88501K13939j7345r4583r1338L35336B15258k697M09628k7700j59107J29341
$$ 488501 702440 685095 590512 499174 834510 215258 212561 622189 594489 435382 564723
13773E64723j4301K95661k50291P8611B79816K48517q5948J20229M777j08078
$$ 564723 550422 846083 595792 674403 279816 528333 442385 562614 567391 459313
13763D59313m7248L18263C31878K07818r8574M8595L1989m0089L4695F752L70756
$$ 459313 412065 730328 331878 539696 441122 489717 521706 481617 516312 6752 377508
13752C77508A49997L55775R6697B94503J29985L7207J50190J4128p7719j60882
$$ 377508 149997 505772 602469 294503 424488 461695 611885 626013 548294 387412
13742C87412K15979o9666A96107L53334k34062K06449j52451Q7221R8411j02458
$$ 387412 603391 533725 196107 549441 315379 521828 369377 456598 555009 452551
13732D52551J44742k5509K42195j14364l12460J57487J09840j84903r3516l2358
$$ 452551 597293 571784 813979 699615 387155 544642 654482 469579 376063 343705
13722C43705N4652A16730J37520j6652K26077K25088k63999p6381k8275K38334
$$ 343705 398357 116730 254250 237598 463675 688763 424764 348383 320108 558442
13712E58442B72368K9960K20859r2832J92286o9537K8020J07599j02013j23327
$$ 558442 272368 302328 523187 430355 622641 553104 581124 688723 586710 463383
13702D63383A11182K59314K60121H6013M13292B24534M25800j26994k37152P9436
$$ 463383 111182 370496 630617 86013 499305 224534 650334 523340 286188 365624
13692C65624K03131D5608J81686p4404L30709q4526j71130K58183b8041E95792
$$ 365624 568755 45608 227294 152890 483599 399073 227943 486126 -28041 595792
13681D29693j09241J16416L24840l71642J87559k46248j60546a24249C17736J87107
$$ 429693 320452 436868 761708 390066 577625 331377 170831 -124249 317736 504843
13671E04843j3200k00995j0577K59564k6964r9260q7546j364A05196J18555J11327
$$ 504843 491643 290648 280071 539635 512671 413411 325865 324501 105196 223751 335078
13660C35078J97694p3186l1154j35624J11803R5670r5514J00155k25144J14220
$$ 335078 532772 459586 428432 292808 404611 500281 404767 504922 279778 393998
13650C93998A54957M24481j94421j56022L61907j90826k5423r0820M4197K43473
$$ 393998 154957 579438 385017 228995 590902 400076 374653 283833 328030 571503
13640E71503l4432n6774j81897j09918k3692K61172R2847A80505N4267K12297
$$ 571503 537071 480297 298400 188482 164790 425962 518809 180505 234772 447069
13630D47069j37049m7507l3473J68836q6781B971J75281L51608A83934K4918M18640
$$ 447069 310020 262513 229040 397876 311095 2971 178252 529860 183934 208852 627492
13619F27492j81084n0631P3643p5787l1056j18570r6591O2892K40830C4575M29224
$$ 627492 446408 395777 469420 393633 362577 244007 147416 210308 451138 34575 463799
13608D63799q6741j81514K89082p5058A60825M2029P1437J06355j76809J77431
$$ 463799 377058 195544 484626 409568 160825 202854 274291 380646 203837 381268
13598C81268L3857F5669J91138j17030J2147L34141k33782Q7221H384M23259b4680
$$ 381268 415125 65669 256807 139777 151924 486065 252283 339504 8384 431643 -24680
13586A65108M1935F2379M52090j00054j21085H4334J44060r464G0627K06915K80896
$$ 165108 207043 62379 514469 414415 293330 84334 228394 218930 70627 277542 558438
13575E58438k02906h541B39285K44404j19512P4550A56516K18804n119d3115A73901
$$ 558438 355532 -8541 239285 483689 364177 438727 156516 375320 370201 -43115 173901
13563D47574j93867K12267A4952M55585r7304J53161G943M30166f2123I3498J1604
$$ 447574 253707 465974 14952 470537 373233 526394 7943 438109 -62123 93498 105102
13552A05102L02036j38801l950J70916a36150A39790K0555K05582H2560L67398
$$ 105102 407138 268337 264387 435303 -136150 139790 160345 365927 82560 449958
13542D49958A95112J63035I5535K01625j35870K32720j40040B7130L15768j47263
$$ 449958 195112 358147 95535 297160 161290 394010 253970 27130 342898 195635
13532A95635J12034A38290L1797M9241l405J51532A28561M42015j71252A63685
$$ 195635 307669 138290 170087 219328 215923 367455 128561 570576 399324 163685
13521A39559e5205B34033I3311K71256p4290H0364O7863K70153A86059J59649
$$ 139559 -55205 234033 93311 364567 290277 80364 148227 418380 186059 345708
13511C45708C0618O8152e9128A30638L5853J013g7006A57907J61259n4344A20141
$$ 345708 30618 98770 -59128 130638 166491 167504 -77006 157907 319166 264822 120141
13499E4559O3119N5563p5860Q0318B8992M287K78195l8697j05995n977K34953
$$ 54559 117678 173241 97381 177699 28992 33279 311474 272777 166782 160805 395758
13488C95758J5648G1085J86350J2236o5253g4279B43575E0682K19870j33876l9731
$$ 395758 411406 71085 257435 269671 204418 -74279 243575 50682 270552 136676 96945
13477I6945L47944p6379k9463C6530j473M1868J97217j28690c301A47014o3020
$$ 96945 444889 368510 339047 36530 35057 76925 274142 145452 -3301 147014 83994
13466H3994K61160J04976I2179K47127l5555j43403G0364M6416O153K03661M1665
$$ 83994 345154 450130 92179 339306 303751 160348 70364 116780 122933 326594 368259
13455C68259I4496r226J81242D4295J41028F8478a10673D87484I0703b4071B59304
$$ 368259 94496 85270 266512 44295 185323 68478 -110673 487484 90703 -24071 259304
13443f529p1854B36436j01878D1062L0990J89613A05856J74870j38037Q3415r5327
$$ -6529 -78383 236436 134558 41062 72052 261665 105856 280726 142689 226104 130777
13432A30777Q0198K69139j94147a11378B52237i7811A95291g8032A74261L2762
$$ 130777 210975 480114 285967 -111378 252237 -97811 195291 -78032 174261 207023
13422B07023r1841M1772J3440J31817l7936p0882K7379k2144a67825D8914L1351
$$ 207023 115182 156954 170394 302211 264275 193393 220772 198628 -167825 48914 80265
13411H0265A5049K31886j07934J39261j28079i174D27879g5032A76720K7208j8085
$$ 80265 15049 246935 139001 278262 150183 -9174 427879 -75032 176720 203928 185843
13400A85843E7620L41790A19296m4425L48799A61057N2617Q2227A20841J88947
$$ 185843 57620 399410 119296 74871 423670 161057 213674 295901 120841 309788
13390C09788H0361J68200R033D6938K83634A63185A1185e3669B47604r6662A8289
$$ 309788 80361 248561 257594 46938 330572 163185 11185 -53669 247604 150942 18289
13378b71667B11730J55953c2327D57268j00748k1069J03260A60654j1729K1358
$$ -271667 211730 367683 -32327 457268 356520 335451 438711 160654 148925 170283
13368A70283r93a83618G3175L44356j67607L56147A19154D6805P5273N63207k90430
$$ 170283 169290 -183618 73175 417531 249924 606071 119154 46805 122078 685285 394855
13357C94855g9723B46317i1232C80713E0912M02670J8755J27699A14490D4505
$$ 394855 -79723 246317 -91232 380713 50912 453582 472337 600036 114490 44505
13346A42046N4323q7945J53281q8309p7012J77403n8739O4210m7588G7442K1520
$$ 142046 196369 108424 261705 173396 96384 273787 215048 279258 231670 77442 98962
13335I8962K74307A18272k873J43636J11227E3184i8407D8827a9546A3539K2037
$$ 98962 373269 118272 115399 259035 370262 53184 -98407 48827 -19546 13539 35576
13324C5576c1925A14189c6276j07474A28961j2215d6360F6106K74618F5600a5645
$$ 35576 -31925 114189 -36276 -143750 128961 116746 -46360 66106 340724 65600 -15645
13312D16712d6950B62899I7186m1256J45008G5398g7510m5566L8247H1578R4805
$$ 416712 -46950 262899 97186 55930 200938 75398 -77510 -123076 -84829 81578 176383
13301A76383d5030I0242J8391J87352G2637k8961K94966r1631N2111j46595Q6465
$$ 176383 -45030 90242 108633 295985 72637 43676 338642 247011 299122 152527 238992
13290B38992O1448j33425n6858n4868e842q8621B58223i431C79200H2189A6570
$$ 238992 300440 167015 110157 55289 -5842 -94463 258223 -9431 379200 82189 16570
13278H8190O7883c9946C24825A14850k7023J39K01054a56858B62381o9658k3206
$$ 88190 156073 -39946 324825 114850 87827 87966 289020 -156858 262381 192723 169517
13267A69517c53895B38424b40026j9227A59228J54751A04022N4734D9869j7990
$$ 169517 -353895 238424 -240026 -259253 159228 313979 104022 158756 49869 31879
13257C1879L1771J52935e0819H5660j7517P6802J4275O1998A3524n878f1684a5597
$$ 31879 63650 216585 -50819 85660 68143 144945 159220 221218 13524 7646 -61684 -15597
13244A27239A0221K55401g3241p1011k35876G0800J31560C4564J72140p6098m2599
$$ 127239 10221 265622 -73241 -144252 -380128 70800 202360 34564 206704 130606 88007
13233H8007E295K16028q8821N5824f3612F589K23485J25077h612G0559J15470
$$ 88007 5295 221323 132502 188326 -63612 6589 230074 355151 -8612 70559 186029
13222A86029i2800B10254J4588a1829l7786a3948A90028j5771J42826C6588a1229
$$ 186029 -92800 210254 224842 -11829 -49615 -13948 190028 174257 317083 36588 -11229
13210A62403c4119B79499J4244i5243A12080C4589b6287A72401d4357A12777R5404
$$ 162403 -34119 279499 293743 -95243 112080 34589 -26287 172401 -44357 112777 208181
13199B08181K56958g95G5840B4951N988J50969b3639B59652a33483B52475C5747
$$ 208181 465139 -795 75840 24951 30939 181908 -23639 259652 -133483 252475 35747
13187a06286J091c6300A60873a19162D0616j3221d0977a9615P254p7172G7240
$$ -106286 -105195 -36300 160873 -119162 40616 27395 -40977 -19615 -12361 -89533 77240
13175e5163B02599b35831A04584h6734B1957b65518C27495a14806A03857a3343
$$ -55163 202599 -235831 104584 -86734 21957 -265518 327495 -114806 103857 -13343
13164B60108o3036h1921B82008a20789j6652A20510L0220g9877E8780J07369B5590
$$ 260108 197072 -81921 282008 -120789 -137441 120510 150730 -79877 58780 166149 25590
13152f2281l8148A06598a23408A66156J07237a38876A34576l4139K46686H2285
$$ -62281 -100429 106598 -123408 166156 273393 -138876 134576 100437 347123 82285
13141F5682J2211b4034j70109f2539H4001k0706a57141A83611a28180j59885h4999
$$ 65682 77893 -24034 -194143 -62539 84001 63295 -157141 183611 -128180 -288065 -84999
13129E9989c94735O0834A38670A1363c7648r0727D4078a48835B30742O7221q7328
$$ 59989 -394735 -333901 138670 11363 -37648 -128375 44078 -148835 230742 297963 210635
13118B10635j742E6160l960e2923A93647a31742D36338b53205d904k58910B57469
$$ 210635 208893 56160 52200 -52923 193647 -131742 436338 -253205 -4904 -263814 257469
13106A9697O4291a36026D8155Q6084h6779C73323A54410J43691o816K0905e4082
$$ 19697 83988 -136026 48155 134239 -86779 373323 154410 298101 291285 312190 -54082
13094B59404I4282a42125F8487Q3716J71206c68800C06506D7672A2467a89430
$$ 259404 94282 -142125 68487 152203 323409 -368800 306506 47672 12467 -189430
13083A65438J46070A9501f8930A22906J12472e1305B88742b92766A82139K83675
$$ 165438 311508 19501 -68930 122906 235378 -51305 288742 -292766 182139 465814
13073D65814l246C8651J6362a27746A92157r0370b5296j04829k19178c0409q5818
$$ 465814 462568 38651 55013 -127746 192157 101787 -25296 -130125 -349303 -30409 -116227
13062a16227H4137b01296F09458a7265q6391C02082j47510a12793H1166P6448
$$ -116227 84137 -201296 609458 -17265 -103656 302082 154572 -112793 81166 157614
13052A57614b62047B81106B2969d8963D10908f8182A47844J02021a07042C51536
$$ 157614 -262047 281106 22969 -48963 410908 -68182 147844 249865 -107042 351536
13041a37532k40144A05399b48285f2662K7907C87187B139O6061b48257A17356
$$ -137532 -377676 105399 -248285 -62662 -34755 387187 2139 68200 -248257 117356
13030C59291A20838a56488e8139A83527J80415d6094k51991g8040A97843l4632
$$ 359291 120838 -156488 -58139 183527 363942 -46094 -298085 -78040 197843 163211
13020A63211J72909a28114A34777a3088A96386e8712a2267C11254h784A20058
$$ 163211 336120 -128114 134777 -13088 196386 -58712 -12267 311254 -8784 120058
13009c0755A73372f6017F640J45898b3611k17031e0837B39776o9063D8288g944
$$ -30755 173372 -66017 6640 152538 -23611 -240642 -50837 239776 170713 48288 -7944
12997e5108B61108a11777H3091J08655a82072c7945A49734m3947a76684e6223
$$ -55108 261108 -111777 83091 191746 -182072 -37945 149734 105787 -176684 -56223
12986B50968a0279j88564F1468K33204A10652m3910L42593a3054I6602K6876P1875
$$ 250968 -10279 -198843 61468 294672 110652 66742 409335 -13054 96602 123478 195353
12975A95353f484A77565a38446B3465c4806H2189J4512K45434B9898P4655J20909
$$ 195353 -6484 177565 -138446 23465 -34806 82189 96701 342135 29898 104553 225462
12964B25462a46485r4419e1043C26606A36884K582l3895K4806l6730a0353D55859
$$ 225462 -146485 -240904 -51043 326606 136884 139466 105571 130377 93647 -10353 455859
12952C0052M9316a0817C42523A5840J56634K5032k0091q7075a08912o8160p1741
$$ 30052 79368 -10817 342523 15840 172474 197506 177415 90340 -108912 -177072 -248813
12941b48813m7205a21689B71733J01046a13657n1517I6496c29097C4260b7933
$$ -248813 -296018 -121689 271733 372779 -113657 -165174 96496 -329097 34260 -27933
12930A3218h9056A84551J69265C6417c16990A33319l1940b86519a14262B27275
$$ 13218 -89056 184551 353816 36417 -316990 133319 101379 -286519 -114262 227275
12919d9804n2773d9383q9146A59070D3088L2515K9377a16253A18193m0205e2719
$$ -49804 -102577 -49383 -138529 159070 43088 75603 104980 -116253 118193 77988 -52719
12907a73061C76134G1844Q0341c9971q9777A76306o7624J83030a28012p81q2528
$$ -173061 376134 71844 152185 -39971 -129748 176306 108682 291712 -128012 -128793 -211321
12896b11321A49659o4094P9637c30440A11328g9919A48710l4060h1479m2135c6465
$$ -211321 149659 85565 165202 -330440 111328 -79919 148710 114650 -81479 -123614 -36465
12884A80778i1996C83224b33827a10216a0281H036a07559o8837L6333l8556A21967
$$ 180778 -91996 383224 -233827 -110216 -10281 8036 -107559 -176396 -140063 -178619 121967
12872b06586Q3287A03954l7940b55264c4059H9367b85617J09351M6348c8339A72246
$$ -206586 -123299 103954 66014 -255264 -34059 89367 -285617 -176266 -129918 -38339 172246
12860A28878J838k5900b9438o5201A36686a34297e8361B905a03095C11897F4831
$$ 128878 130716 104816 -29438 -94639 136686 -134297 -58361 2905 -103095 311897 64831
12848A55826C4569J1686e2189A56718p7049h1972C09848L5296O740H845b33095
$$ 155826 34569 46255 -52189 156718 79669 -81972 309848 345144 351884 8845 -233095
12836a39666b5909o5580j7866B6026a65485M3112J8906l6536p815B5492a92240
$$ -139666 -25909 -91489 -109355 26026 -165485 -122373 -103467 -140003 -147818 25492 -192240
12824B9499J92351r6431d9660B81011a91681O3773d7481j0103A32887M5409o9932
$$ 29499 221850 125419 -49660 281011 -191681 -127908 -47481 -57584 132887 178296 108364
12813A08364J04196q7695L3077a30443C577c75849A95578d6402m7762k16492a9636
$$ 108364 212560 124865 157942 -130443 3577 -375849 195578 -46402 -94164 -310656 -19636
12801d2199a9208j26513f9942G6070R9979o2203o479b3986H9787M4572E7663Q1203
$$ -42199 -19208 -145721 -69942 76070 176049 113846 107367 -23986 89787 134359 57663 138866
12789A38866F4621a21056A65455G4805K19529I296i9494A27096a33217O1084l35178
$$ 138866 64621 -121056 165455 74805 294334 9296 -99494 127096 -133217 -72133 -407311
12778d07311C38970a3867B36959J0375J27036b7841m04659A1922g5706h500A59398
$$ -407311 338970 -13867 236959 247334 374370 -27841 -432500 11922 -75706 -8500 159398
12766d037D4275J62270D3889a33182j65397A09992b07576A62573A3430M9571a67664
$$ -4037 44275 206545 43889 -133182 -298579 109992 -207576 162573 13430 63001 -167664
12754E4621c2839j19913A18170d73067C3358R4981D7744a30339N4853B20184B2694
$$ 54621 -32839 -152752 118170 -473067 33358 128339 47744 -130339 -75486 220184 22694
12742b56493b8948J773j83368B9749P8388J32989F8601P9101F0754M6192k8679
$$ -256493 -28948 -27175 -210543 29749 108137 241126 68601 147702 60754 106946 78267
12731G8267c11703B69301d8124j50760F2398N9452B7308c8664A02747L41197D9165
$$ 78267 -311703 269301 -48124 -198884 62398 121850 27308 -38664 102747 443944 49165
12719F3891F825K32061E1142N5249J4210J13391j11237j42j3513a82281C6684
$$ 63891 6825 238886 51142 106391 120601 233992 122755 122613 109100 -182281 36684
12707A09917e2245k58753J52516H4501e9390a3108A44866E0730K98225b14775
$$ 109917 -52245 -310998 -158482 84501 -59390 -13108 144866 50730 348955 -214775
12696a77700A56026K36159D8615L22554A50740G4099h52B22195a83773E3145L8364
$$ -177700 156026 392185 48615 371169 150740 74099 -852 222195 -183773 53145 91509
12685I1509a2781A7284J5902J52660M1977O4608l3930H9994K8171b26613C12529
$$ 91509 -12781 17284 33186 185846 227823 292431 258501 89994 118165 -226613 312529
12673a6708B1278a13352i039r9978L4880E2531K05765j21424c0917k24609L1163
$$ -16708 21278 -113352 -9039 -109017 -74137 52531 258296 136872 -30917 -255526 -224363
12662b24363C9985a02529F6998k8085J58777J92519G908J12855J87025E9229L0526
$$ -224363 39985 -102529 66998 38913 197690 390209 7908 120763 307788 59229 89755
12651H9755K18063j45623l8004R9449J55791a20120C6500f7177G2855a73602l22
$$ 89755 307818 162195 124191 223640 379431 -120120 36500 -67177 72855 -173602 -173924
12640a73924Q1956G9293J46809a03462B2344J84138e1926B79305k7344b09442
$$ -173924 -91968 79293 226102 -103462 22344 206482 -51926 279305 251961 -209442
12629A30124c5586j05454k57421C25168j08566a77703B31903r5540g8138C79968
$$ 130124 -35586 -141040 -398461 325168 216602 -177703 231903 136363 -78138 379968
12618c4935C04199b37293j38880D0518h0333C27355C2426K19209E0787a5566B13827
$$ -34935 304199 -237293 -376173 40518 -80333 327355 32426 251635 50787 -15566 213827
12606A18287k3187j7450B2981K6422M225Q6216L0414g6193D8994R5297a72806
$$ 118287 95100 77650 22981 49403 53628 139844 170258 -76193 48994 144291 -172806
12594a37641A5825K96664B2927c72770A15961l67m6718B1474c12262a08623H0134
$$ -137641 15825 312489 22927 -372770 115961 115594 68876 21474 -312262 -108623 80134
12582a33298A04484f8174C0097J06884D3957c8843j22385l1278B47570n3140q1141
$$ -133298 104484 -68174 30097 136981 43957 -38843 -161228 -192506 247570 194430 113289
12571A13289a45606j8536k7433B5890a38707B42259r9543a63761b1489A47036
$$ 113289 -145606 -164142 -191575 25890 -138707 242259 142716 -163761 -21489 147036
12560A4124a97860I1191i6748l2461f0393A71375f6190A79384J7424e4429q4245
$$ 14124 -197860 91191 -96748 -129209 -60393 171375 -66190 179384 196808 -54429 -138674
12549a38674d9961A55615A426a01397H9433L16923b61233n3743C40540i3455a4273
$$ -138674 -49961 155615 1426 -101397 89433 406356 -261233 -314976 340540 -93455 -14273
12537A64836d6085j90346c3048B38024b07198P7650A67637c11236J55134f5574
$$ 164836 -46085 -236431 -33048 238024 -207198 -129548 167637 -311236 -156102 -65574
12526B21901j9276I8917d5601G9555j6513A0964h7060j17023p3208f2547B58495
$$ 221901 202625 98917 -45601 79555 63042 10964 -87060 -204083 -277291 -62547 258495
12514i6978A79243F7362a72852d7762O676l3073B9310M0114J96723a58543p6845
$$ -96978 179243 67362 -172852 -47762 -41086 -74159 29310 69424 266147 -158543 -235388
12503b35388E6355k3265Q4986D241b21760J09883N1114C4079a3173A5669a90764
$$ -235388 56355 33090 118076 4241 -221760 -111877 -60763 34079 -13173 15669 -190764
12491d4092E6576a04437H4104a08469H0204D59h5948A34953o5076a23647j29709
$$ -44092 56576 -104437 84104 -108469 80204 459 -85948 134953 69877 -123647 -253356
12480b53356I9368a15915B07843h110C3899M5575Q1832g710F7662R279M4322L507
$$ -253356 99368 -115915 207843 -8110 33899 79474 161306 -7710 67662 76941 121263 124770
12468A24770J0540k0121f7484B55998r4696a08800p1217A677b54306b0496B5549
$$ 124770 135310 115189 -67484 255998 161302 -108800 -180017 1677 -254306 -20496 25549
12456c7976a6572B61226a3938B10646a28222C8719i4065B85597G2120d00A38571
$$ -37976 -16572 261226 -13938 210646 -128222 38719 -94065 285597 72120 -400 138571
12444A95802a85977F795K70447e8173A06919A3575K23514A16715o504a09603C55192
$$ 195802 -185977 6795 277242 -58173 106919 13575 237089 116715 110211 -109603 355192
12432B2537h9194o6353A2242a62010C0594a70160d0064n9827F2635a50499A0758
$$ 22537 -89194 -155547 12242 -162010 30594 -170160 -40064 -99891 62635 -150499 10758
12420G7956a53134J0448A24068b03182A52013m843m4890f6389A03330a80907A97747
$$ 77956 -153134 -142686 124068 -203182 152013 147170 102280 -66389 103330 -180907 197747
12408a59044f4188K5323B69369f1807j15743g0342q5022K9135N7965k70213G0830
$$ -159044 -64188 -38865 269369 -61807 -177550 -70342 -155364 -126229 -68264 -338477 70830
12396A58347a16326B90761h813B05252r4568C3528c90301h0498k9949b1987j81330
$$ 158347 -116326 290761 -8813 205252 110684 33528 -390301 -80498 -110447 -21987 -203317
12385b03317A90681g2055m4766C97129a60098d7937B59650F4121A0639g7179r6216
$$ -203317 190681 -72055 -116821 397129 -160098 -47937 259650 64121 10639 -77179 -173395
12374a73395B34450a71933E252J88986i8632A08587L22543b18032d5584P757A44464
$$ -173395 234450 -171933 5252 194238 -98632 108587 431130 -218032 -45584 -37827 144464
12362A90672p3197E5504a3384I8677i3904E3861a16441A09635a00555k33201F9699
$$ 190672 117475 55504 -13384 98677 -93904 53861 -116441 109635 -100555 -333756 69699
12350b05108B591d5977D1148b98267I2137f1076C2265b21192D7607a7951A89011
$$ -205108 2591 -45977 41148 -298267 92137 -61076 32265 -221192 47607 -17951 189011
12338B72904H670c15A38745L2476p2757J15936b4949C00794a23052G8560K518
$$ 272904 8670 -315 138745 171221 98464 214400 -24949 300794 -123052 78560 81078
12327H1078c3664A7220K12816b68033A12616a21518B29128o511R373J08667b31704
$$ 81078 -33664 17220 230036 -268033 112616 -121518 229128 222617 231990 340657 -231704
12315A91606a70372N21B90138b10045b373m8401B86445A8712L011i1520D3022
$$ 191606 -170372 -169851 290138 -210045 -2373 -50774 286445 18712 21723 -91520 43022
12303A99644c4761j85751A35025c05902A22599A223J49068N4682d8599A30072
$$ 199644 -34761 -220512 135025 -305902 122599 1223 150291 204973 -48599 130072
12292E6174K15885a42200L2349I4768a76927K7372G1925P4064b70294D5830c9738
$$ 56174 272059 -142200 -109851 94768 -176927 -149555 71925 145989 -270294 45830 -39738
12280i1797m2471A86626i9030M7225F9126a06810B25119n3175C9537h2081j28186
$$ -91797 -134268 186626 -99030 -51805 69126 -106810 225119 171944 39537 -82081 -210267
12269b10267C4117J7274b24136f1249C68898a92234R1717D4K00235J16632j07569
$$ -210267 34117 51391 -224136 -61249 368898 -192234 -100517 44 200279 316911 209342
12258B09342P7953I851P466J22435J84758A05263a75972I3280K43528E2026a35228
$$ 209342 287295 9851 17317 139752 324510 105263 -175972 93280 336808 52026 -135228
12246d5790A48536q15K42188l036j82233o9493Q3764b38581h7088A80707q8161
$$ -45790 148536 147721 389909 386873 204640 135147 218911 -238581 -87088 180707 92546
12235I2546c00202C02578a36494B93669I6424R6292B5702J92628D1538J16935
$$ 92546 -300202 302578 -136494 293669 96424 192716 25702 218330 41538 158473
12225A58473l9558a19093A72155A7186K29111l6193B6031J83892C0421O1891C1110
$$ 158473 118915 -119093 172155 17186 246297 210104 26031 209923 30421 92312 31110
12213b59350A62587M462a12644B74347J39598h8901A66745j5801b301B78447I8770
$$ -259350 162587 167049 -112644 274347 413945 -88901 166745 150944 -2301 278447 98770
12201f1107C32893j21186I1373j3206P2512K93366C2113L23949i0821N862C25109
$$ -61107 332893 211707 91373 78167 150679 444045 32113 356062 -90821 -84959 325109
12189a6136j67731K8723n9203A1711J43689j7277g332C67684c1264j6534m0830
$$ -16136 -183867 -155144 -214347 11711 155400 138123 -7332 367684 -31264 -47798 -88628
12178h8628L6125A61580F4987j204K3424O2958k7851c3289B98922j46178N1016
$$ -88628 -52503 161580 64987 63783 87207 150165 122314 -33289 298922 152744 203760
12167B03760c0253B26114M61a85282c4916A21614B0848L85144D6164c69594A64800
$$ 203760 -30253 226114 226575 -185282 -34916 121614 20848 405992 46164 -369594 164800
12155b22274B46177a25535C22568a17330E6950K29476d9920B87832A07808O9202
$$ -222274 246177 -125535 322568 -117330 56950 286426 -49920 287832 107808 177010
12145A77010i703j53324j36763B4959G136J14557a63822j01221N335B40541I6852
$$ 177010 -9703 -163027 -299790 24959 7136 121693 -163822 -265043 -259708 240541 96852
12133a95705A63839b3054j32469l7943A95120B8345K15415b44055A9866a50506
$$ -195705 163839 -23054 -155523 -193466 195120 28345 243760 -244055 19866 -150506
12122B43462K2952A8881P5753e9987l48878C11667b11715K0045b4753A07638g5513
$$ 243462 266414 18881 94634 -59987 -408865 311667 -211715 -191670 -24753 107638 -75513
12110c4937B28568F3237P3987f9491j75343i7399I6988K1290k581g0209j90658
$$ -34937 228568 63237 137224 -69491 -244834 -97399 96988 118278 115697 -70209 -260867
12099b60867a17644A7226a29241a0160C23567j52842a22640H5444P7056H0108
$$ -260867 -117644 17226 -129241 -10160 323567 170725 -122640 85444 162500 80108
12088h297H9925b130A59002L6009h7434q4151A99229m3404c4995G200b5767A13497
$$ -8297 89925 -2130 159002 195011 -87434 -171585 199229 155825 -34995 7200 -25767 113497
12075I8176K30998A46584A7879K76005B1094f4584B54268j04285R7052a0544A68504
$$ 98176 329174 146584 17879 293884 21094 -64584 254268 149983 247035 -10544 168504
12063B14991G4396J25438B6080j879a31769k39546J65764e301G2190K26480b04208
$$ 214991 74396 199834 26080 24201 -131769 -371315 -205551 -5301 72190 298670 -204208
12051b9465A76301r536n603C5615R0648a25038l4369l7048E9800j6220b09442
$$ -29465 176301 166765 161162 35615 126263 -125038 -159407 -196455 59800 43580 -209442
12039d7712A93075G1622K3305b2157A25608l4853A686J74570b63569g5396C9122
$$ -47712 193075 71622 94927 -22157 125608 90755 1686 176256 -263569 -75396 39122
12027g7494H7425J58508o7467a07089j00211h8514A57883a75902K6150n1130k53276
$$ -77494 87425 245933 178466 -107089 -207300 -88514 157883 -175902 -149752 -200882 -454158
12016d54158c8471B08959c7689A6186J0910A0127K34830d78068A01201J03712
$$ -454158 -38471 208959 -37689 16186 27096 10127 244957 -478068 101201 204913
12006B04913H4313a27117a1010j8307F6680e4236j96278J19453A80220a77746
$$ 204913 84313 -127117 -11010 -29317 66680 -54236 -250514 -131061 180220 -177746
11995D4411M4685P1412b69460a13699G3429J24584C614h2305d249p5079b3054
$$ 44411 89096 160508 -269460 -113699 73429 198013 3614 -82305 -4249 -79328 -23054
11983a49784M9091k20351a5779A25790e1097J3257I5191K6472J80983H8946J02962
$$ -149784 -100693 -321044 -15779 125790 -51097 -37840 95191 121663 302646 88946 191908
11972A91908I0901a86250A9344a56561r1987A92869a18088H3376O4601A2452d9406
$$ 191908 90901 -186250 19344 -156561 -248548 192869 -118088 83376 147977 12452 -49406
11960b18057N322H7582r542c671l02325j5360L2951A50267b79477a2921k52607
$$ -218057 -212735 87582 78040 -3671 -305996 -321356 -288405 150267 -279477 -12921 -265528
11949b65528c0273A23339k6218a04229I7233J6824B3393O3940b7701F7941A2021
$$ -265528 -30273 123339 97121 -104229 97233 114057 23393 87333 -27701 67941 12021
11937d7158B13198b45727C4024h9925n2377j93800a19112j01890A99532E2358
$$ -47158 213198 -245727 34024 -89925 -142302 -336102 -119112 -221002 199532 52358
11926A06337a79601G9767c0797A69472b51874B01091G4583J10207D6331O5178
$$ 106337 -179601 79767 -30797 169472 -251874 201091 74583 184790 46331 111509
11916A11509d32512J72928H2352a43474B9802Q0881a93620N2305H5564C0073k604
$$ 111509 -432512 -259584 82352 -143474 29802 110683 -193620 -141315 85564 30073 27469
11905B7469K51853h5757j2908A69940D7526R3525q759E823d065k80881C58156
$$ 27469 279322 -85757 -98665 169940 47526 141051 132292 5823 -4065 -284946 358156
11893B50077b47691J01640E6346c06463a23049b8236k44342a32266G4672c9895
$$ 250077 -247691 -146051 56346 -306463 -123049 -28236 -272578 -132266 74672 -39895
11882b7220A0290f5948j71436p949J18175M8087j06399I7743K21649j39416i197
$$ -27220 10290 -65948 -237384 -245333 -127158 -79071 -185470 97743 319392 179976 -9197
11870A53783a87769B19153b42235j78087f2288l21549i4472j45749g5008l50297
$$ 153783 -187769 219153 -242235 -420322 -62288 -383837 -94472 -240221 -75008 -425305
11860d25305a11605a8958l8927C0705h5004I8627l9249g053j05104d6569p2519
$$ -425305 -111605 -18958 -57885 30705 -85004 98627 59378 -7053 -112157 -46569 -119088
11849a19088F4014d6474o245B9a73378k52612i5876C41293h7597r1620E7412b20598
$$ -119088 64014 -46474 -52719 29 -173378 -425990 -95876 341293 -87597 -179217 57412 -220598
11836a56291f1339E0015K35713b66868c4292k218A34298a71149A0611J2627K32973
$$ -156291 -61339 50015 285728 -266868 -34292 -36510 134298 -171149 10611 23238 256211
11825B56211j12582g2388j83372A58635a98557c0056l4521A57215M5133O9750
$$ 256211 143629 -72388 -255760 158635 -198557 -30056 -64577 157215 202348 272098
11815B72098K1461c4050B31965c03015B01515F0084d6032B0263a05871A63048
$$ 272098 293559 -34050 231965 -303015 201515 60084 -46032 20263 -105871 163048
11804A7419L01727b03894i8921E0435a12317r4227C31464j47469a47800c6969
$$ 17419 319146 -203894 -98921 50435 -112317 -206544 331464 183995 -147800 -36969
11793a7873l277B79333E9083q882n160A2803a53337B37995l4481R9511l3318j23417
$$ -17873 -21150 279333 59083 50201 45041 12803 -153337 237995 203514 303025 269707 146290
11781A46290a55382O7809A18389c26413C06307p8322a62302B36869a79411B1604
$$ 146290 -155382 -87573 118389 -326413 306307 227985 -162302 236869 -179411 21604
11770B39877E3124j6558h2432m01406B4026P2916f6644B41156a95257j24312d6143
$$ 239877 53124 36566 -82432 -483838 24026 96942 -66644 241156 -195257 -319569 -46143
11758c3757A10103c24649J09407F8436J84643K4017C9588J64339L6503C0444I413
$$ -33757 110103 -324649 -215242 68436 253079 277096 39588 203927 240430 30444 9413
11746b8759j10020c984B8689J09487a0538j74164P7151G1568h450A32223K91678
$$ -28759 -138779 -3984 28689 138176 -10538 -184702 -107551 71568 -8450 132223 423901
11735D23901D4718A6088K13244m1262A6065J90444K1761o3408G4399f4370b8247
$$ 423901 44718 16088 229332 188070 16065 206509 228270 164862 74399 -64370 -28247
11723F5467J37012n6408M6945a24840c1865A09149D9582b511n9279A90282q8467
$$ 65467 202479 146071 193016 -124840 -31865 109149 49582 -2511 -61790 190282 101815
11712A01815g239I9706A2376J71127a47095A7156b20333A43024a99629P7829F379
$$ 101815 -7239 99706 12376 183503 -147095 17156 -220333 143024 -199629 -121800 6379
11700c31438e6951H0154a32724B0721L12595A3015J8397K31796a42282A01990
$$ -331438 -56951 80154 -132724 20721 333316 13015 31412 263208 -142282 101990
11689G3948R4901K6296H1027b44006I5237c09618i7504C33591a90452A18006f9243
$$ 73948 168849 195145 81027 -244006 95237 -309618 -97504 333591 -190452 118006 -69243
11677B72074a69053B81385H9978e1846E1089f4299H7204b5855j32576A33881a14924
$$ 272074 -169053 281385 89978 -51846 51089 -64299 87204 -25855 -158431 133881 -114924
11665A5933D719g7590A76087a75774B05855i933n0869A52796N6727g0736p9142
$$ 15933 4719 -77590 176087 -175774 205855 -9933 -60802 152796 209523 -70736 -149878
11654a49878j0622A37674E1882Q4619L5662a33413B09303M2583c5880A83877h9701
$$ -149878 -160500 137674 51882 136501 172163 -133413 209303 251886 -35880 183877 -89701
11642a31056D5444b42909A04445k1504M5511a51645J4371A05343a72234e2356
$$ -131056 45444 -242909 104445 82941 128452 -151645 -137274 105343 -172234 -52356
11631B28980j06669J01613a5878j05375M8138j3556B40559O6971r9614B7827K18474
$$ 228980 122311 223924 -15878 -121253 -73115 -86671 240559 307530 207916 27827 246301
11620B46301a28374l5375B38616a90943G7399a74207f2718E9241o199b93343P676
$$ 246301 -128374 -163749 238616 -190943 77399 -174207 -62718 59241 53042 -293343 -285667
11609b85667B12423b39611a04022A39016f1545q5379A84510a69507A21850J28854
$$ -285667 212423 -239611 -104022 139016 -61545 -146924 184510 -169507 121850 250704
11599B50704A08157E3473J13088o919g250B50802C8222P3395c3744C19941d6144
$$ 250704 108157 53473 166561 159642 -7250 250802 38222 111617 -33744 319941 -46144
11587D0594J55845F3025J40740H5895a7675A34332a53722J1079K8085o4711H8698
$$ 40594 196439 63025 203765 85895 -17675 134332 -153722 -142643 -114558 -179269 88698
11575C08388F3903K42511A03586J9554m6210j8437J7613L97126a05318q4669H2491
$$ 308388 63903 306414 103586 123140 76930 58493 76106 473232 -105318 -189987 82491
11563C2503J60394C0137L25065A60380J81080A63200g114D41925I04a60952A81588
$$ 32503 192897 30137 355202 160380 341460 163200 -7114 441925 904 -160952 181588
11551A43870b13096J01347A60549a13539C4579a45688F3545J87192a5704G7199
$$ 143870 -213096 -111749 160549 -113539 34579 -145688 63545 250737 -15704 77199
11540a79972B19364q0336C9368A013J90596h4735J8197H7201B331h5661b1089
$$ -179972 219364 139028 39368 1013 191609 -84735 -66538 87201 2331 -85661 -21089
11528A16110f7406B1821L30544J9451j77787L1294k1135K77120I4733c826A89107
$$ 116110 -67406 21821 352365 371816 194029 225323 204188 481308 94733 -3826 189107
11516a4779A91401r4886a51451g5125E6560c4575B00916J72219A67610d5251I7
$$ -14779 191401 96515 -151451 -75125 56560 -34575 200916 373135 167610 -45251 97
11504D643J63668K09809C0939K03754k8313R768J46966j12750k8005l3564e6694
$$ 4643 168311 378120 30939 234693 206380 216148 363114 250364 222359 188795 -56694
11492d4470D2432K53047O9203A55650P5905e218B33005l1629k9424p455J73558
$$ -44470 42432 295479 364682 155650 231555 -5218 233005 201376 171952 164497 338055
11481C38055q3778A14368j4613a66702B11918H0687c1049A06309J29324o8013
$$ 338055 254277 114368 99755 -166702 211918 80687 -31049 106309 235633 167620
11471A67620c57051A85318K46867a65695e7196C34170i5611I6769A8456a40338
$$ 167620 -357051 185318 432185 -165695 -57196 334170 -95611 96769 18456 -140338
11460b76481C07512A24841K8815Q7883C7706J46366b9677G2492l948a00705G7244
$$ -276481 307512 124841 153656 241539 37706 184072 -29677 72492 68544 -100705 77244
11448i386C53970a56793P5713C01591F327e9651B41582D6919e641n0038F6335
$$ -9386 353970 -156793 -81080 301591 6327 -59651 241582 46919 -5641 -55679 66335
11436A66158J69470a57047A24652e264l24381a11728A4387a87542D45642B0933
$$ 166158 335628 -157047 124652 -5264 -329645 -111728 14387 -187542 445642 20933
11425a93911f546l48082H016J88645e27595G8995b19292b7236F1348C0201A4039
$$ -193911 -6546 -354628 8016 196661 -527595 78995 -219292 -27236 61348 30201 14039
11413A18349P3430C8841O2735b5154G6972a02707G7182K6703J2741b10572D51
$$ 118349 191779 38841 101576 -25154 76972 -102707 77182 103885 116626 -210572 451
11401E0911a33317k2000N9854B60203A4691J30715g221B15742e0491A30854f7685
$$ 50911 -133317 -155317 -95463 260203 14691 145406 -7221 215742 -50491 130854 -67685
11389e9171j41584N3638H106J49386a622j14231K6349j43136a6386r824B2555
$$ -59171 -200755 -147117 8106 157492 -1622 -115853 -89504 -232640 -16386 -26210 22555
11377A5608a85374b1591j41455P6991r6980D57710f9173A45923q567a4261k18032
$$ 15608 -185374 -21591 -163046 -86055 -183035 457710 -69173 145923 137356 -14261 -232293
11366b32293A31678q714B3506f4765A56000b82030b0551L150C16162a10731B49070
$$ -232293 131678 122964 23506 -64765 156000 -282030 -20551 -17401 316162 -110731 249070
11354A443O9030K4428K87935a12365A97903a27035J3287I9672M2884d5852I4024
$$ 1443 70473 94901 382836 -112365 197903 -127035 -113748 99672 142556 -45852 94024
11342b6615I7892b18181H3683g5250L0396B53088h8590A84079b7991A93620b1921
$$ -26615 97892 -218181 83683 -75250 -44854 253088 -88590 184079 -27991 193620 -21921
11330B70761A30650D3042a2449o232j60655b0590j8916k50297d4522B264P5575
$$ 270761 130650 43042 -12449 -18681 -179336 -20590 -39506 -289803 -44522 2264 77839
11319G7839f8116C36043F0642a40866A43626b4883n632D6197K8574g2009J7376
$$ 77839 -68116 336043 60642 -140866 143626 -24883 -30515 46197 74771 -72009 -54633
11308e4633G840e6816E4858k2961c30899F3996b60094B72008i0832D6993A6254
$$ -54633 7840 -56816 54858 31897 -330899 63996 -260094 272008 -90832 46993 16254
11296d8388k5326J1967j8119D4809R5234a6058A08009R565i2766B21380a64612
$$ -48388 -73714 -61747 -79866 44809 140043 -16058 108009 117574 -92766 221380 -164612
11284A19756n4792a13786k039B07916H8044a5539A20110N5095c14169B26827b61859
$$ 119756 64964 -113786 -115825 207916 88044 -15539 120110 175205 -314169 226827 -261859
11272b17059A43259o155o0252g1871j6535H6663i8044A8665a08716p9619b16A35005
$$ -217059 143259 137104 76852 -71871 -88406 86663 -98044 18665 -108716 -188335 -216 135005
11259A30917e4746j69468L0634j08264a28131h629n2953j83083a8835C32734b0647
$$ 130917 -54746 -224214 -193580 -301844 -128131 -8629 -61582 -244665 -18835 332734 -20647
11247F8133K38180c46126B30315b7988N18j12229O3592O781C603K13644e3973
$$ 68133 306313 -346126 230315 -27988 -27470 -139699 -76107 -69326 3603 217247 -53973
11235a44395B88961c6934m8022K6940E767K52142g4659A2526f41602b15393A78856
$$ -144395 288961 -36934 -84956 -58016 5767 257909 -74659 12526 -641602 -215393 178856
11223i6900A9162a64297C04593A7561J28445m8948g5629A2322P3749l8478a25854
$$ -96900 19162 -164297 304593 17561 146006 97058 -75629 12322 86071 47593 -125854
11211A34047L9216a50889E0201m20d4086A72394c86657G8742k4811K94883a3093
$$ 134047 173263 -150889 50201 49781 -44086 172394 -386657 78742 53931 348814 -13093
11199a56961j07525P2296o3368A81118a96242c8489a383B39925b27365A56148
$$ -156961 -264486 -192190 -255558 181118 -196242 -38489 -1383 239925 -227365 156148
11188H9124a36216C8338A8072a5657A83802N0919H6500L0647J1762a77486A15123
$$ 89124 -136216 38338 18072 -15657 183802 234721 86500 117147 128909 -177486 115123
11176E6497a34679K735A53646Q929J98572b5526C4334c6339q7639d7670A35991
$$ 56497 -134679 -131944 153646 162575 361147 -25526 34334 -36339 -123978 -47670 135991
11164a08625C2955c08958e4870q470A97796J02299a38482q5303D37977j74428
$$ -108625 32955 -308958 -54870 -63340 197796 300095 -138482 -223785 437977 263549
11154B63549F340J30142C0192M9936J1635K51115j49001L3374K12147d724r271
$$ 263549 6340 136482 30192 80128 91763 342878 193877 227251 439398 -4724 -13995
11143a3995C7942J04870D7332N4649L51032D3216Q9168F1131B6565O7653M7231
$$ -13995 37942 142812 47332 101981 453013 43216 132384 61131 26565 94218 141449
11132A41449j7419D4008M10430A14444O2048K35731A37022N2859A153M67215j81823
$$ 141449 124030 44008 454438 114444 176492 412223 137022 189881 1153 468368 286545
11121B86545k7792N572r3141J21840l9566j14058J32696K451L7112j12582K11797
$$ 286545 258753 264325 171184 293024 253458 139400 272096 274547 311659 199077 410874
11110D10874j26684j07077K3387J4385l8561P3525J0971O9161P991N167j5837
$$ 410874 284190 177113 200500 214885 176324 249849 260820 329981 337972 343139 327302
11099C27302O9760A89023m3728K88019I4768K02058J36859A47766K68864R7818
$$ 327302 397062 189023 145295 433314 94768 296826 433685 147766 416630 514448
11089E14448A45822M84096j47351A23707j3569J28954J86358P0595B15734L65304
$$ 514448 145822 629918 482567 123707 110138 239092 425450 496045 215734 581038
11079E81038k16156J69671r4565J83229n5424L07728r3739l82062K98597Q6645
$$ 581038 364882 534553 439988 623217 567793 875521 781782 399720 698317 784962
11069G84962j89703j05296L35306k37191R0070j8656Q5413l06579K85396j99925
$$ 784962 595259 489963 825269 588078 678148 659492 744905 438326 723722 523797
11059E23797K20978J7157j88295M7269L53309l03110j2850J08289k09171L89809
$$ 523797 744775 761932 573637 620906 974215 671105 658255 766544 557373 947182
11049I47182k54858j71663K33040j27701r6841R5907M89690k49220o9469j17358
$$ 947182 692324 520661 753701 626000 529159 625066 1114756 865536 796067 678709
11039F78709p3716K35309j34052k09459R5525L03798C92049K28631k48636M54440
$$ 678709 604993 840302 706250 496791 592316 896114 392049 620680 372044 826484
11029H26484l18933J83052p2724J14777P0810n9159K79516l55883J55578J6884
$$ 826484 507551 690603 617879 732656 803466 744307 1023823 667940 823518 840402
11019H40402n0010j20654K11893n5351j4609j3938K49535n3848m53016J07596
$$ 840402 790392 669738 881631 826280 811671 797733 1047268 993420 540404 648000
11009F48000m2213J63208C69405K64416K08520k79342N844K6309M09582l90554
$$ 648000 605787 768995 369405 633821 842341 562999 568843 595152 1004734 614180
10999F14180L91862j61696m0797o8405L9134J55957l09067K63075k44979L45609
$$ 614180 1006042 844346 803549 735144 774278 930235 621168 884243 639264 984873
10989I84873L01768k80760o6771k9563K2144L6061J37413J41894r0473j44482
$$ 984873 1286641 1005881 939110 909547 931691 967752 1105165 1247059 1156586 1012104
10979A012104O863L38853k041j330j97777l6334r1321J56583J69083j20796j10151
$$ 1012104 1018967 1357820 1355779 1354449 1156672 1120338 1029017 1185600 1354683 1233887 1123736
10968A123736j17317K63415l11206J43626k60039j36739L37424l59352L39710
$$ 1123736 1006419 1269834 958628 1102254 842215 705476 1042900 683548 1023258
10959A023258l06942B90945N19753j15104J8816A91878E4306J29796R1104A34972
$$ 1023258 716316 290945 810698 695594 714410 191878 54306 184102 275206 134972
10948E55170k63836l2036j11724A5744M33609k10483F7129a5108B25182e024r3453
$$ 555170 291334 259298 147574 15744 449353 238870 67129 -15108 225182 -5024 -98477
10937i8477F2515e0093A2310J52311a74896e7748C94553A87807J51115A03607
$$ -98477 62515 -50093 12310 164621 -174896 -57748 394553 187807 338922 103607
10926d6759m8056A42012N8252c24781a3766B93763D3907g9808j9377K6696a7738
$$ -46759 -94815 142012 200264 -324781 -13766 293763 43907 -79808 -99185 -72489 -17738
10914a71006a1908j71620C8825f0541G2079a29630H3875J01230B5713N3478Q0463
$$ -171006 -11908 -183528 38825 -60541 72079 -129630 83875 185105 25713 79191 159654
10903A59654d3601D5643R7136b75702i3003I4015c36753B38214I4275J22921d73494
$$ 159654 -43601 45643 142779 -275702 -93003 94015 -336753 238214 94275 217196 -473494
10891B7372b13764a8580G2053e3137r3035f0214A9592h4793j06324b7923E0907
$$ 27372 -213764 -18580 72053 -53137 -146172 -60214 19592 -84793 -191117 -27923 50907
10879D3807g3939k6014B40516A04128b08120C9201K20273g1160G2979a56359A5219
$$ 43807 -73939 -99953 240516 104128 -208120 39201 259474 -71160 72979 -156359 15219
10867D6729N1541L8702c23114A38712R1195G4145a20320A41341a13187C25760
$$ 46729 98270 136972 -323114 138712 229907 74145 -120320 141341 -113187 325760
10856c00328N5993P4382F1128m163d2506k06726P6822k46246a92370A2028h8885
$$ -300328 -244335 -169953 61128 56965 -42506 -249232 -172410 -418656 -192370 12028 -88885
10844c27978i8031L3251D12097b46905A13451a45944D5819b75206Q3792m1730
$$ -327978 -98031 -64780 412097 -246905 113451 -145944 45819 -275206 -191414 -233144
10834b33144Q8158l8031a4472m3672B9314J73648o5864b58860d4763j76316B47945
$$ -233144 -144986 -183017 -14472 -58144 29314 202962 137098 -258860 -44763 -221079 247945
10822c97311F6778K8358a51386B19576o602a29245o8777A43622a33222C4007a68349
$$ -397311 66778 95136 -151386 219576 212974 -129245 -198022 143622 -133222 34007 -168349
10810a56694C4222J02302J33459a70269B96434a92848C56246a54418H0592b31223
$$ -156694 34222 136524 269983 -170269 296434 -192848 356246 -154418 80592 -231223
10799c572A36697f4519j12767A52755E9174K0648j6588J56109N3539h3409B06612
$$ -3572 136697 -64519 -177286 152755 59174 79822 63234 219343 272882 -83409 206612
10787c7402A48434a75453h1284l8509q2113k32847b12256g3161J2538K3392l28074
$$ -37402 148434 -175453 -81284 -119793 -201906 -434753 -212256 -73161 -60623 -37231 -365305
10776c65305a71668A60780k877a42472r4935a1342j89091l7428G2284K03478j16219
$$ -365305 -171668 160780 157903 -142472 -237407 -11342 -200433 -237861 72284 275762 159543
10765A59543c11299g7110j29107h5727b7854B00182b96870J741A83836p4436b75628
$$ 159543 -311299 -77110 -206217 -85727 -27854 200182 -296870 -295129 183836 109400 -275628
10753d56287i7446B8158J47659b218n2460G0620b69683C4358K65913B5117r671
$$ -456287 -97446 28158 175817 -2218 -54678 70620 -269683 34358 300271 25117 15446
10742A5446J61288g0455k28336B24890D8685b6820B3785a9520j8978J6272D54668
$$ 15446 176734 -70455 -298791 224890 48685 -26820 23785 -19520 -38498 -22226 454668
10730d30131E3645a44278B3596a04494A06378d8589B5302k645i8741I6858c6500
$$ -430131 53645 -144278 23596 -104494 106378 -48589 25302 22657 -98741 96858 -36500
10718A40486d2293E7262J68342a83336Q013M9394d8025j7429j52197O5724k7253
$$ 140486 -42293 57262 225604 -183336 -175323 -125929 -48025 -65454 -217651 -151927 -179180
10707a79180Q4228C11233B8768J87479a41414f1257k0049A15682a04827j7392
$$ -179180 -94952 311233 28768 216247 -141414 -61257 -81306 115682 -104827 -122219
10697a22219D7016b0157q2664F2727e5568B63193b51048E6276d15548a48952a223
$$ -122219 47016 -20157 -102821 62727 -55568 263193 -251048 56276 -415548 -148952 -1223
10685b2640C35429e2493A49823g1196k13368E7767J64827b87835p7129R8180O2364
$$ -22640 335429 -52493 149823 -71196 -284564 57767 222594 -287835 -364964 -266784 -204420
10674b04420B68787r941d2152k38447p9249a39156j14077M9916F6032a67469o7408
$$ -204420 268787 258846 -42152 -280599 -359848 -139156 -253233 -203317 66032 -167469 -234877
10663b34877g5637B47704F4685g1799B0875R4996d8631A83270o4021a03732b9790
$$ -234877 -75637 247704 64685 -71799 20875 115871 -48631 183270 119249 -103732 -29790
10651A58476c3619G0838a63124j38998O2255I8211c0294B19777g1993G2887q318
$$ 158476 -33619 70838 -163124 -302122 -239867 98211 -30294 219777 -71993 72887 64569
10640F4569a55389p1612A79958c39552i0246K5322j29277H3432b07167i7585A13876
$$ 64569 -155389 -227001 179958 -339552 -90246 -64924 -194201 83432 -207167 -97585 113876
10628a60079I8166b18844R6923j26144H2336f1305K2158b959l58092A00361D4180
$$ -160079 98166 -218844 -121921 -248065 82336 -61305 -39147 -2959 -361051 100361 44180
10616d8081j9066G3378K6280P1257b37965B51451d1428H0947K3669a67870P5805
$$ -48081 -67147 73378 99658 170915 -237965 251451 -41428 80947 104616 -167870 -92065
10605i2065M5772H7219l7917g265A15627O2359a95346C406a69765r7897a086E0242
$$ -92065 -46293 87219 49302 -7265 115627 177986 -195346 3406 -169765 -267662 -1086 50242
10592g4137n2008B38752G1225a8780j27683A39118b79911I7069A1844b59507N6150
$$ -74137 -126145 238752 71225 -18780 -146463 139118 -279911 97069 11844 -259507 -203357
10581b03357F8147a4856q0138M2936k1149m4991A09161k0652a51550A82065a88129
$$ -203357 68147 -14856 -94994 -52058 -73207 -118198 109161 88509 -151550 182065 -188129
10569b45109A52372N8477E0195i8752K6224l4283e776A39129c09492D1512b34447
$$ -245109 152372 210849 50195 -98752 -72528 -106811 -5776 139129 -309492 41512 -234447
10557a61316k73736J1009A30111o3309L0995a36647H5205a4810D5067d029B73806
$$ -161316 -435052 -424043 130111 66802 97797 -136647 85205 -14810 45067 -4029 273806
10545c26410a2072k61072J09572E8771e3944q2059N9052m0027C84662G5694d9580
$$ -326410 -12072 -273144 -163572 58771 -53944 -136003 -76951 -116978 384662 75694 -49580
10533b5118m296j3540o333A66368g8145B64715a73765C04162g6476G7844a68250
$$ -25118 -29414 -42954 -49287 166368 -78145 264715 -173765 304162 -76476 77844 -168250
10521B26747a80891F621J87540a61074D545f1085A54484h503j44712D81301a1493
$$ 226747 -180891 6621 194161 -161074 4545 -61085 154484 -8503 -153215 481301 -11493
10509b19395O5067g6546F2375J22941J93419A9498K33864c1687G3685J89964H0454
$$ -219395 -154328 -76546 62375 185316 378735 19498 253362 -31687 73685 263649 80454
10497C17379E1971a1485H3967K02366A1650e5598j55050D302J7000J54756a5721
$$ 317379 51971 -11485 83967 286333 11650 -55598 -210648 4302 21302 176058 -15721
10485C33973a9635D944M10756Q573k06909k193E6503a27456A15547m3443e7196
$$ 333973 -19635 4944 415700 424273 217364 215171 56503 -127456 115547 72104 -57196
10473b070G1450J74941J76793e3335J5484B09406B8737i7915j65403A43452g060
$$ -2070 71450 246391 423184 -53335 -37851 209406 28737 -97915 -263318 143452 -7060
10461D8795k2947J0605d2503j78592J9119Q3380A58717D5812M2767h658A93995
$$ 48795 25848 36453 -42503 -221095 -201976 -118596 158717 45812 88579 -8658 193995
10449D3385a1638A17182e5381A11830l271a15485C34499a19233B92694a23079
$$ 43385 -11638 117182 -55381 111830 108559 -115485 334499 -119233 292694 -123079
10438a82090B05802N5048l2156c0214D2674K14639e0517j08699g961n12061A8488
$$ -182090 205802 260850 228694 -30214 42674 257313 -50517 -159216 -7961 -520022 18488
10426i5090c5882k10991c1818J184D2041b15361C1826K65692b2223G1891J88607
$$ -95090 -35882 -246873 -31818 -30634 42041 -215361 31826 297518 -22223 71891 260498
10415B60498A12184L8725J8947M20208D9645i881B2348b16641c5750A33685m5163
$$ 260498 112184 150909 169856 590064 49645 -9881 22348 -216641 -35750 133685 88522
10404H8522J0036O656b66287A75169H0403J83533A28173k6300L11949q7882j25860
$$ 88522 98558 105214 -266287 175169 80403 263936 128173 101873 413822 325940 200080
10393B00080J24325j23641b4268B43654I0641j0596f8990B87477P6273A46774
$$ 200080 324405 200764 -24268 243654 90641 80045 -68990 287477 363750 146774
10382D1197K0287L35400j39393A22336K531N3141P5640p6298n1563Q5266M6711
$$ 41197 61484 396884 257491 122336 124867 178008 253648 177350 125787 211053 257764
10371B57764L9422K8480A10300M6895J75050d3946k45449A16379R6581J98640
$$ 257764 297186 325666 110300 157195 332245 -43946 -289395 116379 212960 411600
10361D11600A60290l6762m2113J85433A28593n2417C5424K16251b3762o681C90148
$$ 411600 160290 123528 81415 266848 128593 76176 35424 251675 -23762 -30443 390148
10349B56321K48116j94445A05992K31253G1760N089Q9264p0935k8878J13536m1308
$$ 256321 504437 309992 105992 337245 71760 76849 166113 95178 66300 179836 138528
10338A38528B722K47541c02983d3327F7187b96562A65190b31379j36861F7681
$$ 138528 2722 250263 -302983 -43327 67187 -296562 165190 -231379 -368240 67681
10327B78436j8092E2077k5972c5901B90769G1335a23961M0350B93170A6070b2727
$$ 278436 260344 52077 26105 -35901 290769 71335 -123961 -83611 293170 16070 -22727
10315D4489b00715I526K52866j878e4792n3926I3156J37920e1350n363j31874
$$ 44489 -200715 9526 262392 260514 -54792 -108718 93156 231076 -51350 -56713 -188587
10304a88587D05270d6051C19793a47897A5838M0073c03140H6547M9993j1713a42017
$$ -188587 405270 -46051 319793 -147897 15838 55911 -303140 86547 136540 124827 -142017
10292G8555a01808H247e3490A64331i3628A68498n9268c49612F0148O801f3553
$$ 78555 -101808 8247 -53490 164331 -93628 168498 109230 -349612 60148 66949 -63553
10280A39133l0421d7000B6556J04821j0130B4230b29260L5353k09680F4958a5926
$$ 139133 108712 -47000 26556 131377 121247 24230 -229260 -193907 -403587 64958 -15926
10268c7133l30590o2298i5247j31204H3998H477a8464A33570f7918p2242E0939
$$ -37133 -367723 -430021 -95247 -226451 83998 8477 -18464 133570 -67918 -140160 50939
10256a64676e2798H6482a48671D5938d8210A73911J23131a5075p425A71817c80472
$$ -164676 -52798 86482 -148671 45938 -48210 173911 297042 -15075 -22500 171817 -380472
10244A00906a87991R3990C8395b46252A95558o8728O5281a19093B5170Q4655C8900
$$ 100906 -187991 -94001 38395 -246252 195558 126830 192111 -119093 25170 109825 38900
10232B68864b89416g2679c2979j35986P2351j133B5203E985b76808D553a25607
$$ 268864 -289416 -72679 -32979 -168965 -96614 -97747 25203 5985 -276808 4553 -125607
10220F5521B1055a85514f5772D6383d7416C50913b9955l5064k3415Q555k583H559
$$ 65521 21055 -185514 -65772 46383 -47416 350913 -29955 -65019 -88434 -79879 -82462 8559
10207h9913m4036l2945k2830O5049K7134J5427I8262i7298H3700b0515q6804H4774
$$ -89913 -133949 -166894 -189724 -124675 -97541 -82114 98262 -97298 83700 -20515 -107319 84774
10194c34518h1648C64659b34547r976B09366r1074g3171B33465d31650I2233A8064
$$ -334518 -81648 364659 -234547 -244523 209366 118292 -73171 233465 -431650 92233 18064
10182a35080M9850c8182j3655J737p4068o4825B06567b26920A45594d3107o1916
$$ -135080 -85230 -38182 -51837 -50100 -124168 -188993 206567 -226920 145594 -43107 -105023
10171a05023j07279f0460j23891j27067I6853a74864A10661D1401K89963c8817
$$ -105023 -212302 -60460 -184351 -311418 96853 -174864 110661 41401 331364 -38817
10160a3218j18537B47402g2909A93583c25683B93902j40728a43135m9670P3658
$$ -13218 -131755 247402 -72909 193583 -325683 293902 153174 -143135 -192805 -119147
10150a19147A22584d0270a1708o61701f2650B15954c6478k94304C4333a19612
$$ -119147 122584 -40270 -11708 -673409 -62650 215954 -36478 -330782 34333 -119612
10139a67473r172J5172B01102g3683H3828e7542k09627A0622Q8626b7743a0094
$$ -167473 -176645 -161473 201102 -73683 83828 -57542 -267169 10622 99248 -27743 -10094
10127E0793b74879a07324d9288P110o7887G2837f1490B5716Q580M738a81352B26000
$$ 50793 -274879 -107324 -49288 -42178 -110065 72837 -61490 25716 34296 39034 -181352 226000
10114a04174f250H0610b713k85375g9446I7093a4210j07026A9080a09531k52543
$$ -104174 -6250 80610 -2713 -288088 -79446 97093 -14210 -121236 19080 -109531 -362074
10103c62074E0079d4663F1142N9591c9000j02973n6135i2483j07760D5535J67479
$$ -362074 50079 -44663 61142 120733 -39000 -141973 -198108 -92483 -200243 45535 213014
10092B13014C7836N7895c41539a6488q109A89244b71045O0946A6978g2163I1281
$$ 213014 37836 95731 -341539 -16488 -24597 189244 -271045 -210099 16978 -72163 91281
10080b1763k34729O7328a4407A79455b1548B80312D8903b03338F8811g2315K7262
$$ -21763 -256492 -189164 -14407 179455 -21548 280312 48903 -203338 68811 -72315 -45053
10069d5053G8049c1159k32383A36147f2151k63404K3124k350F202a86256B5415
$$ -45053 78049 -31159 -263542 136147 -62151 -325555 -302431 -304781 6202 -186256 25415
10057E0266k335f4353r8820A44582b08086O0474K4868A6393a88960K6282A2653
$$ 50266 47931 -64353 -163173 144582 -208086 -147612 -122744 16393 -188960 -162678 12653
10045d1427j38324O3447e1664J067D87999a16253K3829A37439b71236d5679e769
$$ -41427 -179751 -116304 -51664 -50597 487999 -116253 -92424 137439 -271236 -45679 -5769
10033b58808C8002a21990F01946a60565p4007L2856M1887n7604Q6859k40816d4186
$$ -258808 38002 -121990 601946 -160565 -234572 -201716 -159829 -217433 -130574 -371390 -44186
10021a56838C37090e3293f70p2097j40371D7690a835j1815j67771j07437P5061
$$ -156838 337090 -53293 -670 -72767 -213138 47690 -1835 -13650 -181421 -288858 -213797
10010b13797A30198b72375J08567D06250H9125c3359A25753a09455m04399a90418
$$ -213797 130198 -272375 -163808 406250 89125 -33359 125753 -109455 -513854 -190418
9999b06704k78181b02630Q9117c8984B03227a71889B36254b54017A74397h6708
$$ -206704 -484885 -202630 -113513 -38984 203227 -171889 236254 -254017 174397 -86708
9988h672k42359G343O3028P510a33344m1305M7870A26978A7026K05992a92274
$$ -8672 -251031 7343 70371 77881 -133344 -174649 -126779 126978 17026 223018 -192274
9976c22877F5225r491g9665r6162p3434A05022A4923a9108B80722a35113j26233
$$ -322877 65225 55734 -79665 -175827 -249261 105022 14923 -19108 280722 -135113 -261346
9965b61346i8802j27388A66483c85159p9689b01145O1421a0248k12765A8310a04465
$$ -261346 -98802 -226190 166483 -385159 -464848 -201145 -139724 -10248 -223013 18310 -104465
9953D080O5703c76249f4865j24381l63098i8475K1101j10153D7554K66010J21538
$$ 4080 69783 -376249 -64865 -189246 -552344 -98475 -77374 -187527 47554 313564 435102
9942D35102c06894M8629b4582l2320F364a64252r6817d5608j49635A49118m6744
$$ 435102 -306894 -258265 -24582 -56902 6364 -164252 -261069 -45608 -195243 149118 102374
9931A02374o489g2085l15122c7961A73923b28344M7925c7082j9791q8838B0936
$$ 102374 95885 -72085 -387207 -37961 173923 -228344 -180419 -37082 -56873 -145711 20936
9919i2234o8632f3226j90822b5367j00339C5134a00332L1789k64782A54157b04453
$$ -92234 -160866 -63226 -254048 -25367 -125706 35134 -100332 -68543 -333325 154157 -204453
9907A02643A8612a62268n4437B13679a28838A41687a45367c7766k06207L4714
$$ 102643 18612 -162268 -216705 213679 -128838 141687 -145367 -37766 -243973 -209259
9897b09259d9454K1213l5853j6519I1514f8188r3712B57532a91714g5289j75608
$$ -209259 -49454 -28241 -64094 -80613 91514 -68188 -161900 257532 -191714 -75289 -250897
9886b50897C592j526J6856f0533J0241C11348c35590h529j31788E5529b96348
$$ -250897 3592 2066 18922 -60533 -50292 311348 -335590 -8529 -140317 55529 -296348
9874B89717A6082K44574b1362C39679a53247a4310B72859H9635c28011A517e6416
$$ 289717 16082 260656 -21362 339679 -153247 -14310 272859 89635 -328011 1517 -56416
9862E3480B1956a22548A90886k3848b75398J19327l080B01248a47987b6637D2623
$$ 53480 21956 -122548 190886 167038 -275398 -156071 -159151 201248 -147987 -26637 42623
9850C53191d0289G5418K45155b49328A26463b40957A00458K36453a72726o4888
$$ 353191 -40289 75418 320573 -249328 126463 -240957 100458 336911 -172726 -237614
9840b37614o0470g5831q6140d8652j62570g7770j96070A52100K2980a56676B8800
$$ -237614 -298084 -75831 -161971 -48652 -211222 -77770 -273840 152100 175080 -156676 28800
9828I8933i7189n7711b3114r1882l9605a7298o0254a165l62732C4040b87048F4055
$$ 98933 -97189 -154900 -23114 -114996 -154601 -17298 -77552 -1165 -363897 34040 -287048 64055
9815c22906H0545J65822p5673i6241L2218j14724L1400B5550h8299L0074n8715
$$ -322906 80545 246367 170694 -96241 -64023 -178747 -147347 25550 -88299 -58225 -116940
9804a16940E3815b30446a637D2147e7197r1619K8847j988k03980G7001b99410
$$ -116940 53815 -230446 -1637 42147 -57197 -148816 -119969 -121957 -325937 77001 -299410
9792i6146o4960N5736m7080a8500k58646A12675b94550R5732A11145a17223K1150
$$ -96146 -161106 -105370 -152450 -18500 -277146 112675 -294550 -198818 111145 -117223 -96073
9781i6073r9526A62015b81582R8012R1109B14354B1921b65957h191j00501j45791
$$ -96073 -195599 162015 -281582 -183570 -92461 214354 21921 -265957 -8191 -108692 -254483
9770b54483F508a48659K0765A879K03737a47028d6054H6819c30600H6644l7921
$$ -254483 6508 -148659 -127894 1879 205616 -147028 -46054 86819 -330600 86644 48723
9759D8723P8665b03039A36705h7762C1182J8085N4481c8236k04510a10537A07504
$$ 48723 127388 -203039 136705 -87762 31182 49267 103748 -38236 -242746 -110537 107504
9747C1122b09027a71o082m26580K13947A85915a39377k78774J63696M0960H0183
$$ 31122 -209027 -171 -6253 -432833 -218886 185915 -139377 -418151 -254455 -213495 80183
9735G194a21655A94257e1741j45712a3272m19478B05951a13193B4544c20047a02216
$$ 7194 -121655 194257 -51741 -197453 -13272 -432750 205951 -113193 24544 -320047 -102216
9723a45539e3103B78055j01558a6607j20929m09802a43787C20375b06532A68048
$$ -145539 -53103 278055 176497 -16607 -137536 -547338 -143787 320375 -206532 168048
9712A84228h4885j16813A58380a50533d4946C72885a32155M2395j92157g0329
$$ 184228 -84885 -201698 158380 -150533 -44946 372885 -132155 -89760 -281917 -70329
9701c01741a50744F0810M7494b11786o2656A92382r0189j9876K39623a31284k4646
$$ -301741 -150744 60810 108304 -211786 -274442 192382 102193 82317 321940 -131284 -155930
9690a55930B43237d23598B78654c33284A31861D9225d2947I4297j0756J54446
$$ -155930 243237 -423598 278654 -333284 131861 49225 -42947 94297 83541 237987
9680B37987c3576q7426n5012M3858N5499B55752c0514C26568h1488f356A35651
$$ 237987 -33576 -121002 -176014 -132156 -76657 255752 -30514 326568 -81488 -6356 135651
9668a34573j6595H3998a85493F162J22259f9519c1486C40239a77283F396a10054
$$ -134573 -151168 83998 -185493 6162 128421 -69519 -31486 340239 -177283 6396 -110054
9656a30427A79896b81116B24732c12460f2495j42669n0362a17259N3109j24662
$$ -130427 179896 -281116 224732 -312460 -62495 -205164 -255526 -117259 -64150 -188812
9646a88812i0754j37928H2529L561P0818h6529j14247Q3789F2228J60862h5192
$$ -188812 -90754 -228682 82529 86090 156908 -86529 -200776 -116987 62228 223090 -85192
9634a26394q8687k59872b31271h5036J2261A28629a52446d3646F7648a28294N0271
$$ -126394 -215081 -474953 -231271 -85036 -72775 128629 -152446 -43646 67648 -128294 -78023
9623g8023B3463b03038a3795A96471a5071j15000A45963K6252a96006j04976B49765
$$ -78023 23463 -203038 -13795 196471 -15071 -130071 145963 172215 -196006 -300982 249765
9611a58771b5638B73128H578M555L7391h6946a0779D1776d58391A40210a66837
$$ -158771 -25638 273128 8578 13133 50524 -86946 -10779 41776 -458391 140210 -166837
9599c9367k17735B12590D1989J09444b50706H0374b27761O8949e0220l34063C92385
$$ -39367 -257102 212590 41989 151433 -250706 80374 -227761 -158812 -50220 -384283 392385
9587a28242J2115B37526a82729l4474e3828F4527e917p487k04072l8677O4640
$$ -128242 -116127 237526 -182729 -217203 -53828 64527 -5917 -13404 -217476 -256153 -191513
9576a91513j11038a07960A33701A8077a96501d2596A56620b22736C61901P5863
$$ -191513 -302551 -107960 133701 18077 -196501 -42596 156620 -222736 361901 437764
9566D37764b32712J2433r1053j25012f2792K7633j06273F8849b64396A07925K1549
$$ 437764 -232712 -220279 -311332 -436344 -62792 -35159 -141432 68849 -264396 107925 129474
9555A29474f2932j25921n8694n7032a03766A6026J05518l7266j9930K83469j68415
$$ 129474 -62932 -188853 -247547 -304579 -103766 16026 121544 84278 64348 347817 179402
9544A79402b54947n257A88266c57754Q6859m6163i6500A5153J30720c44553e5957
$$ 179402 -254947 -260204 188266 -357754 -270895 -317058 -96500 15153 145873 -344553 -55957
9532b9145k52127A352J50416c44691A65199a36242K9332M7078B7921Q0304l9654
$$ -29145 -281272 1352 151768 -344691 165199 -136242 -106910 -59832 27921 108225 68571
9521F8571i4879K2608C132L9637J10128A5233c43706J10587E1110I405O1357k2399
$$ 68571 -94879 -72271 3132 42769 152897 15233 -343706 -233119 51110 9405 70762 48363
9509D8363b52817i3860B7540c643l2121D1895L2780a18852B76843B2857a77050
$$ 48363 -252817 -93860 27540 -3643 -35764 41895 74675 -118852 276843 22857 -177050
9497a44624q8687H499a98217A80058M0158c71410a79737a8977A6711J19795a58043
$$ -144624 -233311 8499 -198217 180058 220216 -371410 -179737 -18977 16711 136506 -158043
9485a37800E9641c67979B8541J48946a16796j16876n4035n0962J42047M0413l1072
$$ -137800 59641 -367979 28541 177487 -116796 -233672 -287707 -338669 -196622 -156209 -187281
9474a87281m1950O2488L6586N2319i171j91451r9381a27379K7492d70A3836M9068
$$ -187281 -229231 -166743 -130157 -77838 -9171 -200622 -300003 -127379 -99887 -470 13836 62904
9462F2904i6959j42240j09369M1349j3219F8235d0671j31597B1693G307a95229
$$ 62904 -96959 -239199 -348568 -307219 -320438 68235 -40671 -172268 21693 7307 -195229
9450H969g4232C2617P5753b16665A83533b22259I2520a52444D52714c69235J79027
$$ 8969 -74232 32617 108370 -216665 183533 -222259 92520 -152444 452714 -369235 -190208
9439a90208D015b2240H750b24043g5355I6931A6361c6294B1839b93568I7942a07059
$$ -190208 4015 -22240 8750 -224043 -75355 96931 16361 -36294 21839 -293568 97942 -107059
9426F2332g4303B38321G6841a80744C8905j6062h3979j37707g6697B14116O3446
$$ 62332 -74303 238321 76841 -180744 38905 22843 -83979 -221686 -76697 214116 277562
9415B77562b17052A66696a01823c867I750L1634J07821a02461B55459a72510i153
$$ 277562 -217052 166696 -101823 -3867 9750 41384 149205 -102461 255459 -172510 -9153
9403B18273f2059j81651d1525B41564a46718A28997b28031A1723a29910I7174
$$ 218273 -62059 -243710 -41525 241564 -146718 128997 -228031 11723 -129910 97174
9392b81362B3666K6799a36623g068k42252l1687j321B88861E862b94576B09668
$$ -281362 23666 50465 -136623 -7068 -249320 -281007 -282328 288861 5862 -294576 209668
9380b09539F8736d88j72335j4399B1692b42247H0893j7648b94453a31670p2529
$$ -209539 68736 -488 -172823 -187222 21692 -242247 80893 63245 -294453 -131670 -204199
9369b04199m331a4949B5170A2027b83385K1255a30115A25438m5158g4292l5416
$$ -204199 -208530 -14949 25170 12027 -283385 -262130 -130115 125438 80280 -74292 -109708
9358a09708D6273A9368a09322A17870f5254B52853a83907P0100m5942B02885D2831
$$ -109708 46273 19368 -109322 117870 -65254 252853 -183907 -113807 -159749 202885 42831
9346d5939A23962b54339g661A8892c46324J25373C04130m2236c18980I2514a60344
$$ -45939 123962 -254339 -7661 18892 -346324 -220951 304130 261894 -318980 92514 -160344
9334a96535a557p3550j36650g2012I9513h1540L9766A19318b91591d5133j45734
$$ -196535 -1557 -75107 -211757 -72012 99513 -81540 -41774 119318 -291591 -45133 -190867
9323a90867a4348j17098A03463J12360I1742g7979j87353f7075j01758F7667a95506
$$ -190867 -14348 -131446 103463 215823 91742 -77979 -265332 -67075 -168833 67667 -195506
9311A60978g7182A29799c35733L1768a45075O3425j53316b006m75352a13067C22771
$$ 160978 -77182 129799 -335733 -303965 -145075 -81650 -234966 -2006 -477358 -113067 322771
9299A71065o4115f0922k0585A05702d08119E8486e4509b3086k27081I3606e40639
$$ 171065 106950 -60922 -81507 105702 -408119 58486 -54509 -23086 -250167 93606 -540639
9287F6300g9923A80350L0841F7403J08926a82852l0599e5000C06660a71404I4996
$$ 66300 -79923 180350 211191 67403 176329 -182852 -213451 -55000 306660 -171404 94996
9275e9485D398d134q5449B55755A3701c9607k9262C1285J48412a37944K5222a7048
$$ -59485 4398 -4134 -89583 255755 13701 -39607 -68869 31285 179697 -137944 -112722 -17048
9262a41819O3543P703B07934a43817N1458j35405R7907j27202J1057h4883A67045
$$ -141819 -78276 -70573 207934 -143817 -92359 -227764 -129857 -257059 -246002 -84883 167045
9250b45070N0031D2781a87680A9244g7653l47783g60k44474H045b33990k25781
$$ -245070 -195039 42781 -187680 19244 -77653 -425436 -760 -245234 8045 -233990 -459771
9239d59771G0223c47231a59913A02781B275a18439a1450l31552c4992r5587j5546
$$ -459771 70223 -347231 -159913 102781 2275 -118439 -11450 -343002 -34992 -130579 -146125
9228a46125P0467m8447j7824A84800F1263c56436J9194A33851D2415c44775A27780
$$ -146125 -75658 -124105 -141929 184800 61263 -356436 -337242 133851 42415 -344775 127780
9216A63314a95447O9379b0882G7181P9711f0492C15038H0562c0707J2414A68340
$$ 163314 -195447 -126068 -20882 77181 156892 -60492 315038 80562 -30707 -18293 168340
9204a33100n5406f1229k92098f7249j35829R5866A14224D1314b05030f6960j83174
$$ -133100 -188506 -61229 -353327 -67249 -203078 -107212 114224 41314 -205030 -66960 -250134
9193b50134N6632h4066A34975r327b29068I3086c05869a32017E1722a88139d4576
$$ -250134 -193502 -84066 134975 125648 -229068 93086 -305869 -132017 51722 -188139 -44576
9181b83402d4318I5135P6531J2767a6563j09600o6027f4560d975A82912H6891
$$ -283402 -44318 95135 171666 184433 -16563 -126163 -192190 -64560 -4975 182912 86891
9169b35455B32695E0809Q0105b28549Q5999A01945d7802F8325E469d7446q4110
$$ -235455 232695 50809 130914 -228549 -142550 101945 -47802 68325 5469 -47446 -131556
9158a31556H5742b22263j01124E9936a50207o8471G3441h4440E9682a99439A75081
$$ -131556 85742 -222263 -323387 59936 -150207 -218678 73441 -84440 59682 -199439 175081
9146d66704e0144o9931N8491A92769K1974b50343r5232D4175d44410b07546a9724
$$ -466704 -50144 -120075 -61584 192769 214743 -250343 -345575 44175 -444410 -207546 -19724
9134C06099b96804J36654e3773I2524a15013l7623k0538d7567a2011r9865A27438
$$ 306099 -296804 -160150 -53773 92524 -115013 -152636 -173174 -47567 -12011 -111876 127438
9122b60261G2054a75799d4218o2681l22585A26423b68492A20790j2145D781b80988
$$ -260261 72054 -175799 -44218 -106899 -429484 126423 -268492 120790 108645 4781 -280988
9110a015D5273a91252i0466A52375L5866l3440K0852c05712P1362A3242a27005
$$ -1015 45273 -191252 -90466 152375 188241 154801 175653 -305712 -234350 13242 -127005
9098D0074N7208i9788p4177E0021J03657p5505c1481C6185c42703a1411j92206
$$ 40074 97282 -99788 -173965 50021 153678 78173 -31481 36185 -342703 -11411 -203617
9087b03617b6237j5063l9395l06070i6913E5851h9046G241b50629P8903k42014
$$ -203617 -26237 -41300 -80695 -386765 -96913 55851 -89046 7241 -250629 -171726 -413740
9076d13740H0798R070o17a29443A3832a27979l2415A57501a84125D9486f5778
$$ -413740 80798 89868 89251 -129443 13832 -127979 -160394 157501 -184125 49486 -65778
9064A86965a33628j86264a39582A4020c0541E9793a17187E1027A6505J51270n972
$$ 186965 -133628 -319892 -139582 14020 -30541 59793 -117187 51027 16505 167775 161803
9053A61803b67186b7815j21018d3135k21698c9417A35461a98279f7789k33590
$$ 161803 -267186 -27815 -148833 -43135 -264833 -39417 135461 -198279 -67789 -301379
9043c01379A39712c44567B72204E8374d3206j34549j88184a17135d33I6541a43662
$$ -301379 139712 -344567 272204 58374 -43206 -177755 -365939 -117135 -433 96541 -143662
9031A42643a78022j16437a03356d6200C1303b1521k66363A80291b81232d1803
$$ 142643 -178022 -294459 -103356 -46200 31303 -21521 -287884 180291 -281232 -41803
9020b53458k4783B762a8075j57113j94789E0832c5145p0496L9956j99475H9984
$$ -253458 -278241 2762 -18075 -175188 -369977 50832 -35145 -105641 -65685 -265160 89984
9008b05449h071k93820g536B35558L1204a34461A82975a67174B5386a47160a0061
$$ -205449 -8071 -301891 -7536 235558 266762 -134461 182975 -167174 25386 -147160 -10061
8996F6320d5456o1433j83920H8373d85262a05802M0995b4855C6173a03614k90776
$$ 66320 -45456 -106889 -290809 88373 -485262 -105802 -64807 -24855 36173 -103614 -394390
8985c94390B47998b8577J842F1735O31909k61384A43577a02673H9234c16056a44063
$$ -394390 247998 -28577 -26735 61735 693644 432260 143577 -102673 89234 -316056 -144063
8973a82615R0275r3124f9455l12372f3052H3675c2025l03892a45832J7855j179
$$ -182615 -92340 -185464 -69455 -381827 -63052 83675 -32025 -335917 -145832 -127977 -129156
8962a29156B33924j12156c23800f0480k27519r2524B40317b1832r4078d1958j20444
$$ -129156 233924 121768 -323800 -60480 -287999 -380523 240317 -21832 -115910 -41958 -162402
8951a62402A52277a63807m121A32557n8043b4120l0446C66780b62411c5759A38393
$$ -162402 152277 -163807 -167928 132557 74514 -24120 -54566 366780 -262411 -35759 138393
8939b2471i319k88673F2564e3648A55854J50586b83390C3101h7641A21022l0354
$$ -22471 -9319 -297992 62564 -53648 155854 306440 -283390 33101 -87641 121022 90668
8928I0668O3354a51430q2325G170a4180k4436M615B30684F6408Q6123F1482K0444
$$ 90668 154022 -151430 -233755 7170 -14180 -38616 -34001 230684 66408 152531 61482 81926
8916H1926Q0928b98175h8604l33569B3743a02048l10816B38729j15341a37328
$$ 81926 162854 -298175 -88604 -422173 23743 -102048 -412864 238729 123388 -137328
8905A16961N5872k3541E653a23154p5606A74914D7707e7423b8032k22499O1423
$$ 116961 172833 149292 5653 -123154 -198760 174914 47707 -57423 -28032 -250531 -189108
8894a89108H6058f4963A61075e4900j7890B9118O5133c76788D3119J27751c57170
$$ -189108 86058 -64963 161075 -54900 -72790 29118 94251 -376788 43119 170870 -357170
8882B895e8978j78081A66462a27150j6989E371a43520q0139A16092E1222J1510
$$ 2895 -58978 -237059 166462 -127150 -144139 5371 -143520 -223659 116092 51222 62732
8871F2732d999E0717M1472d6401j50855D2793f9092H5155a5848j55360j00774
$$ 62732 -4999 50717 92189 -46401 -197256 42793 -69092 85155 -15848 -171208 -271982
8860b71982E7677J42172K66808B31106a95921B992L7501g7082J0140O741A02872
$$ -271982 57677 199849 466657 231106 -195921 2992 40493 -77082 -66942 -60201 102872
8848A26224b6038j47271C39186e10905a47555O0560G7852i6382p6514B84583A5260
$$ 126224 -26038 -173309 339186 -510905 -147555 -86995 77852 -96382 -172896 284583 15260
8836B5855a33434n6940J859B61333a22307A43461a93159A71956b21563B33745
$$ 25855 -133434 -190374 -188515 261333 -122307 143461 -193159 171956 -221563 233745
$$ [...]