##TITLE=AC1744_SEN00017_9276535_fUiwmSTxca
##JCAMPDX= 6.0         $$ Bruker NMR JCAMP-DX V2.0
##DATA TYPE= NMR SPECTRUM
##DATA CLASS= NTUPLES
##ORIGIN= BRUKER
##OWNER= Administrator
$$ 1.72 TOPSPIN		Version 2.1
$$ 2015-08-07 22:28:19.406 -0700  Administrator@X
$$ Compression mode = diff/dup
##.OBSERVE FREQUENCY= 400.02188249412
##.OBSERVE NUCLEUS= ^1H
##.ACQUISITION MODE= SIMULTANEOUS (DQD)
##.ACQUISITION SCHEME= undefined
##.AVERAGES= 64
##.DIGITISER RES= 22
##SPECTROMETER/DATA SYSTEM= spect
##.PULSE SEQUENCE= noesygpps1d.comp
##.SOLVENT NAME= COFFEE_meoh
##.SHIFT REFERENCE= INTERNAL, COFFEE_meoh, 1, 14.961
##AUDIT TRAIL= $$ (NUMBER, WHEN, WHO, WHERE, PROCESS, VERSION, WHAT)
$$ ##TITLE= Audit trail, TOPSPIN		Version 2.1
$$ ##JCAMPDX= 5.01
$$ ##ORIGIN= Bruker BioSpin GmbH
$$ ##OWNER= Administrator
$$ $$ E:\/data/COFFEE/nmr/AC1744_SEN00017_9276535_fUiwmSTxca/32/pdata/1/auditp.txt
$$ ##AUDIT TRAIL=  $$ (NUMBER, WHEN, WHO, WHERE, PROCESS, VERSION, WHAT)
(   1,<2015-08-07 22:28:14.047 -0700>,<Administrator>,<X>,<go>,<TOPSPIN 2.1>,
      <created by zg
	started at 2015-08-07 22:16:44.031 -0700,
	POWCHK enabled, PULCHK disabled,
       configuration hash MD5:
       21 0F 79 D6 B3 7B B4 F6 88 20 88 DB 03 48 BD 9F
       data hash MD5: 64K
       FB FF A6 1A C1 40 10 1A EB EA 26 E2 4E 39 5C 86>)
(   2,<2015-08-07 22:28:17.297 -0700>,<Administrator>,<X>,<proc1d>,<TOPSPIN 2.1>,
      <Start of raw data processing
       efp LB = 0.3 FT_mod = 6 PKNL = 1 PHC0 = 0 PHC1 = 0 SI = 128K 
       data hash MD5: 128K
       D3 93 86 DD D2 8D 15 BF 99 48 1F 1B A9 D1 61 A0>)
(   3,<2015-08-07 22:28:18.188 -0700>,<Administrator>,<X>,<proc1d>,<TOPSPIN 2.1>,
      <pk PHC0 = -85.76477 PHC1 = 0 
       data hash MD5: 128K
       1D C8 4D 45 10 96 C8 1A AE 0E 34 1B A0 CC 7D 18>)
(   4,<2015-08-07 22:28:18.594 -0700>,<Administrator>,<X>,<proc1d>,<TOPSPIN 2.1>,
      <abs ABSG = 1 
       data hash MD5: 128K
       C6 BA 4C FD ED B4 B4 8B 33 12 3D 2D 84 CB 9E E5>)
(   5,<2015-08-07 22:28:18.703 -0700>,<Administrator>,<X>,<proc1d>,<TOPSPIN 2.1>,
      <abs ABSG = 2 
       data hash MD5: 128K
       A3 BD 74 BB 88 C4 A2 57 11 1F A5 F9 2F F9 9E 4A>)
(   6,<2015-08-07 22:28:18.781 -0700>,<Administrator>,<X>,<proc1d>,<TOPSPIN 2.1>,
      <abs ABSG = 3 
       data hash MD5: 128K
       A8 75 43 FC B7 45 07 ED 38 B3 12 D9 92 BC 43 BA>)
(   7,<2015-08-07 22:28:18.859 -0700>,<Administrator>,<X>,<proc1d>,<TOPSPIN 2.1>,
      <abs ABSG = 4 
       data hash MD5: 128K
       63 B2 91 42 58 61 E3 5A 3D 2F 24 57 2C 6D C8 B6>)
(   8,<2015-08-07 22:28:19.000 -0700>,<Administrator>,<X>,<proc1d>,<TOPSPIN 2.1>,
      <abs ABSG = 5 
       data hash MD5: 128K
       48 37 80 D6 4D 39 78 B4 FE A5 E7 36 99 06 6F 81>)
$$ ##END=
$$ 
$$ $$ hash MD5
$$ $$ D3 F2 37 6D D8 3F 98 9D 8C F6 54 3E CD 2A 23 9B
##$RELAX= 
##$RELAX= 
##$RELAX= 
##$RELAX= 
##$RELAX= 
##$RELAX= 
##$RELAX= 
##$RELAX= 
$$ Bruker specific parameters
$$ --------------------------
##$DU= <E:\>
##$EXPNO= 32
$$ [...]
150 150 150 150 150 150 150 150
##$TP07= 0
##$TPNAME0= <>
##$TPNAME1= <>
##$TPNAME2= <>
##$TPNAME3= <>
##$TPNAME4= <>
##$TPNAME5= <>
##$TPNAME6= <>
##$TPNAME7= <>
##$TPOAL= (0..7)
0.5 0.5 0.5 0.5 0.5 0.5 0.5 0.5
##$TPOFFS= (0..7)
0 0 0 0 0 0 0 0
##$TUNHIN= 0
##$TUNHOUT= 0
##$TUNXOUT= 0
##$USERA1= <user>
##$USERA2= <user>
##$USERA3= <user>
##$USERA4= <user>
##$USERA5= <user>
##$V9= 5
##$VALIST= <valist>
##$VCLIST= <CCCCCCCCCCCCCCC>
##$VD= 0
##$VDLIST= <DDDDDDDDDDDDDDD>
##$VPLIST= <PPPPPPPPPPPPPPP>
##$VTLIST= <TTTTTTTTTTTTTTT>
##$WBST= 2048
##$WBSW= 25
##$XGAIN= (0..3)
0 0 0 0
##$XL= 0
##$YL= 0
##$YMAX_a= 6400787
##$YMIN_a= -12054229
##$ZGOPTNS= <>
##$ZL1= 120
##$ZL2= 120
##$ZL3= 120
##$ZL4= 120
##$ABSF1= 14.961
##$ABSF2= -5.597181
##$ABSG= 5
##$ABSL= 3
##$ALPHA= 0
##$AQORDER= 0
##$ASSFAC= 0
##$ASSFACI= 0
##$ASSFACX= 0
##$ASSWID= 0
##$AUNMP= <proc_prof1d_extract.lims>
##$AXLEFT= 0
##$AXNAME= <>
##$AXNUC= <1H>
##$AXRIGHT= 0
##$AXTYPE= 0
##$AXUNIT= <>
##$AZFE= 0.1
##$AZFW= 0.1
##$BCFW= 0
##$BC_mod= 0
##$BYTORDP= 0
##$COROFFS= 0
##$CY= 15
##$DATMOD= 1
##$DC= 0
##$DFILT= <>
##$DTYPP= 0
##$F1P= 0
##$F2P= 0
##$FCOR= 0.5
##$FTSIZE= 131072
##$FT_mod= 6
##$GAMMA= 0
##$GB= 0
##$INTBC= 1
##$INTSCL= 1
##$ISEN= 128
##$LB= 0.3
##$LEV0= 0
##$LPBIN= 0
##$MAXI= 10000
##$MC2= 0
##$MEAN= 0
##$ME_mod= 0
##$MI= 0
##$NCOEF= 0
##$NC_proc= -2
##$NLEV= 6
##$NOISF1= 0
##$NOISF2= 0
##$NSP= 0
##$NTH_PI= 0
##$NZP= 0
##$OFFSET= 14.961
##$PC= 1
##$PHC0= -85.76477
##$PHC1= 0
##$PH_mod= 1
##$PKNL= yes
##$PPARMOD= 0
##$PPDIAG= 0
##$PPIPTYP= 0
##$PPMPNUM= 2147483647
##$PPRESOL= 1
##$PSCAL= 4
##$PSIGN= 0
##$PYNMP= <proc.py>
##$REVERSE= no
##$SF= 400.020009638204
##$SI= 131072
##$SIGF1= 0
##$SIGF2= 0
##$SINO= 400
##$SIOLD= 131072
##$SPECTYP= <>
##$SREGLST= <1H.CDCl3>
##$SSB= 0
##$STSI= 131072
##$STSR= 0
##$SW_p= 8223.68421052631
##$SYMM= 0
##$S_DEV= 0
##$TDeff= 65536
##$TDoff= 0
##$TI= <>
##$TILT= no
##$TM1= 0
##$TM2= 0
##$TOPLEV= 0
##$USERP1= <user>
##$USERP2= <user>
##$USERP3= <user>
##$USERP4= <user>
##$USERP5= <user>
##$WDW= 1
##$XDIM= 131072
##$YMAX_p= 399129700
##$YMIN_p= -11331
##$CURPLOT= <Network HP LaserJet P1505>
##$CURPRIN= <$Network HP LaserJet P1505>
##$DFORMAT= <normdp>
##$LAYOUT= <+/1D_H.xwp>
##$LFORMAT= <normlp>
##$PFORMAT= <normpl>
##$SURQMSG= 1
$$ End of Bruker specific parameters
$$ ---------------------------------
##NTUPLES= NMR SPECTRUM
##VAR_NAME=  FREQUENCY,     SPECTRUM/REAL,   SPECTRUM/IMAG
##SYMBOL=    X,             R,               I
##VAR_TYPE=  INDEPENDENT,   DEPENDENT,       DEPENDENT
##VAR_FORM=  AFFN,          ASDF,            ASDF
##VAR_DIM=   131072,        131072,          131072
##UNITS=     HZ,            ARBITRARY UNITS, ARBITRARY UNITS
##FACTOR=    0.0627417313425164, 1,          1
##FIRST=     8223.62146879497, 815,          -54220
##LAST=      0,             2773,            -55012
##MIN=       0,             -11331,          0
##MAX=       8223.62146879497, 399129700,    0
$$ Real data points
##PAGE= N=1
##DATA TABLE= (X++(R..R)), XYDATA
$$ [...]
61593C18663l318k909k465k334k562k730k499k022j695j650j694j639j574j664
61579B87908j767j491q11l69p60j623j936j368o87o42r91j106j009j070j132p34
61563B70412j08k1n22o54K01J379J805J303N47J26J61N74J111J284Q32K13J43
61546B78786O71J179J309J358J605J764J511J144J253J840K283K216J962J960
61532C00841K096J935J392P06n4r95j835k005j535j361k127l131l147k149j359
61517B87272j499j840j364j76Q19J150J070Q45M35j29n32m75j9L74J17r47k107
61500B82994k333j476n35l64n95l73L21Q36R73J081J173Q88L80L69R91J479J288
61483B87097Q72Q76J175J281J176J209J417J446R91J1j135j651q76P33J721J287
$$ plain form
61593 318663 315345 312436 309971 307637 305075 302345 299846 297824 296129 294479 292785 291146 289572 287908
61579 287908 286141 284650 283839 283470 282710 281087 279151 277783 277096 276454 275463 274357 273348 272278 271146 270412
61563 270412 270304 270283 269761 269107 269308 270687 272492 273795 274342 274468 274629 275203 276314 277598 278430 278643 278786
61546 278786 279457 280636 281945 283303 284908 286672 288183 289327 290580 292420 294703 296919 298881 300841
61532 300841 302937 304872 306264 306970 306916 305921 304086 302081 300546 299185 297058 293927 290780 288631 287272
61517 287272 285773 283933 282569 282393 283212 284362 285432 286277 286712 286583 286051 285576 285557 285931 286048 285101 282994
61500 282994 280661 279185 278650 278286 277691 277318 277639 278475 279448 280529 281702 282590 282970 283339 284330 285809 287097
61483 287097 287969 288845 290020 291301 292477 293686 295103 296549 297540 297551 296416 294765 293889 294622 296343 297630
61467B97630K78n0K84L48%R5R66J682J286J02o87m03O03J524J797J410Q01M69
61449C08135N14O07M81K87L64P46J077J024P61R36K023L678M894M931L980K837
61433C37275K042J589J245Q61N06M95J099J996K262J406K29K6R31J728J527R48
61417C56165J108J952K315J540L31k01R2L27k12j239j914j945j851k089k306j887
61401C50186j033o61j115j593j276n08k33n76o95j25N14M59j52n97n94m59m65
61384C41077n29n32m39m7Q75K037K701K561K150J981J700P10o52j260o23M95J155
61367C53360J338J553J918K163K278K516K812K823K599K691L352M076M287M194
61353C91960M562N695P023P770P792P605P710Q033Q021P231N787M360L598L534
$$ plain form
61467 297630 297908 297858 298142 298490 298490 298585 299551 301233 302519 302621 301934 301531 302134 303658 305455 306865 307666 308135
61449 308135 308649 309256 309737 310024 310388 311134 312211 313235 313996 314932 316955 320633 325527 330458 334438 337275
61433 337275 339317 340906 342151 343012 343518 344013 345112 347108 349370 350776 351005 351031 351962 353690 355217 356165
61417 356165 357273 359225 361540 363080 363411 363210 363302 363629 363417 362178 360264 358319 356468 354379 352073 350186
61401 350186 349153 348492 347377 345784 344508 344000 343767 343191 342496 342371 342885 343344 343192 342595 342001 341542 341077
61384 341077 340548 340016 339577 339530 340405 342442 345143 347704 349854 351835 353535 354245 353593 352333 351710 352205 353360
61367 353360 354698 356251 358169 360332 362610 365126 367938 370761 373360 376051 379403 383479 387766 391960
61353 391960 396522 402217 409240 417010 424802 432407 440117 448150 456171 463402 469189 473549 477147 480681
61339D80681L533K932J797Q06M06L13O4l24n57p84j423k339k812k523k002j773
61323D75995j615j112m77k09k41j18K37N82J078K160L635M632M712M476M773N809
61307E04317P308Q980J0515J1480J1702J1471J0995R968Q076N630L295J372k01
61294F04908j371k007k394l141m500o088p326p918p875p442p037o933o927o566
61280E27383n751m796l860k703j222J80J055J440J626J655J458J299J586K254
61266E21604K714K593K147J929K316L495N454P690R257R535Q838P898O878N400
61252E97748L459J772Q96L88p08k675m704n757n549m740m221m335m650m446l440
61237E59038k038q91l06j51k01l49m57j50J026L097N378O855P054O477O076O346
$$ plain form
61339 480681 484214 487146 488943 489749 490155 490468 490532 490208 489651 488867 487444 485105 482293 479770 477768 475995
61323 475995 474380 473268 472791 472582 472341 472223 472460 473042 474120 476280 479915 484547 489259 493735 498508 504317
61307 504317 511625 520605 531120 542600 554302 565773 576768 586736 594812 600442 603737 605109 604908
61294 604908 603537 601530 599136 595995 591495 585407 578081 570163 562288 554846 547809 540876 533949 527383
61280 527383 521632 516836 512976 510273 509051 509231 510286 511726 513352 515007 516465 517764 519350 521604
61266 521604 524318 526911 529058 530987 533303 536798 542252 549942 559199 568734 577572 585470 592348 597748
61252 597748 601207 602979 603875 604263 603555 600880 596176 590419 584870 580130 575909 571574 566924 562478 559038
61237 559038 557000 556109 555803 555652 555451 555102 554645 554495 555521 558618 563996 570851 577905 584382 590458 596804
61221E96804P056P754Q207Q315Q006P411O897O647O406N842M997M148L346K476
61207F84312J680J404J919K976M026M733N260O082P434Q943J0058J0877J2225
61194G61929J4584J7174J8508J7855J5819J3509J1481R558P444N250L413K162
61182H98686J107m33k644m963o684p651q205q771r729j1280j3009j3962j3657
61169G98805j2890j2924j4010j5295j6090j6465j6561j6143j5179j4223j3692
61158F35333j3193j2033j0106p920n984m484l361k332j075L77J496J800J375O23
61144E80516k66j331k528l632m397m593m068k947j620l69Q56K189L644N241P076
61129E73771R018J0639J1707J2511J3497J4822J6529J8701K1109K3041K4053K4614
$$ plain form
61221 596804 603860 611614 619821 628136 636142 643553 650450 657097 663503 669345 674342 678490 681836 684312
61207 684312 685992 687396 689315 692291 696317 701050 706310 712392 719826 728769 738827 749704 761929
61194 761929 776513 793687 812195 830050 845869 859378 870859 880417 887861 893111 896524 898686
61182 898686 899793 899360 896716 891753 885069 877418 869213 860442 850713 839433 826424 812462 798805
61169 798805 785915 772991 758981 743686 727596 711131 694570 678427 663248 649025 635333
61158 635333 622140 610107 600001 592081 586097 581613 578252 575920 574845 575222 576718 578518 579893 580516
61144 580516 580250 578919 576391 572759 568362 563769 559701 556754 555134 554765 555621 557810 561454 566695 573771
61129 573771 582789 593428 605135 617646 631143 645965 662494 681195 702304 725345 749398 774012
61117G74012K5435K6321K6414K5574K4708K4486K4349K3310K1267J8943J6819
61106A031638J4683J2287R803P406M805J554k284o171r695j2869j5827j8564k1074
61093I95692k3374k5224k6169k6143k5772k5693k5814k5575k4719k3303k1258
61082G22648j8578j5920j4189j3370j2495j0985r370q301p503o277m548k853j549
61069E96710o29jN13J327K637M018M804M868M639M536M802N648P150Q980J0657
61054F60659J1981J3045J3977J5018J6514J8424K0067K0844K1094K1725K3123
61043H56471K4892K6537K7896K8870K9368K9551K9784L0230L0866L1816L3224
61032A179505L4793L6006L6900L8119M0014M2058M3384M3727M3700M4314M6351
$$ plain form
61117 774012 799447 825768 852182 877756 902464 926950 951299 974609 995876 1014819 1031638
61106 1031638 1046321 1058608 1068411 1075817 1080622 1082176 1079892 1073721 1064026 1051157 1035330 1016766 995692
61093 995692 972318 947094 920925 894782 869010 843317 817503 791928 767209 743906 722648
61082 722648 704070 688150 673961 660591 648096 637111 627741 619440 611937 605660 601112 598259 596710
61069 596710 596081 596080 596593 597920 600557 604575 609379 614247 618886 623422 628224 633872 641022 650002 660659
61054 660659 672640 685685 699662 714680 731194 749618 769685 790529 811623 833348 856471
61043 856471 881363 907900 935796 964666 994034 1023585 1053369 1083599 1114465 1146281 1179505
61032 1179505 1214298 1250304 1287204 1325323 1365337 1407395 1450779 1494506 1538206 1582520 1628871
61021A628871N0028N5236O2026P0643Q0968R2354J04324J17257J32242J50759
61011B544708J74809K06672K47981K99483L62126M37440N25931O26165P36910
61002F162225Q59674R98476J158853J347168J562025J771906J897508J833755
60994A7591590J517543R91632M00808q5498l59268m02661k61384j5610K23589
60985A9600741L22529J74285k32172p88821j324705j699554j861853j840680j700603
60976A0649167j503566j293737j096277r20809p67913o36207n25197m33691l58645
60967C113125k96717k45901k05211j73676j49973j32224j17904j04858r2661q2194
60957A511806p3709o6140n8452n0736m3544l7098l1662k7970k6450k6493k7083
$$ plain form
61021 1628871 1678899 1734135 1796161 1866804 1947772 2040126 2144450 2261707 2393949 2544708
61011 2544708 2719517 2926189 3174170 3473653 3835779 4273219 4799150 5425315 6162225
61002 6162225 7021899 8020375 9179228 10526396 12088421 13860327 15757835 17591590
60994 17591590 19109133 20100765 20501573 20416075 20056807 19654146 19392762 19377152 19600741
60985 19600741 19923270 20097555 19865383 19076562 17751857 16052303 14190450 12349770 10649167
60976 10649167 9145601 7851864 6755587 5834778 5066865 4430658 3905461 3471770 3113125
60967 3113125 2816408 2570507 2365296 2191620 2041647 1909423 1791519 1686661 1594000 1511806
60957 1511806 1438097 1371957 1313505 1262769 1219225 1182127 1150465 1122495 1096045 1069552 1042469
60946A042469k7785k8532k8818k7866k5566k2745k0364j8742j7593j6576j5687
60935G92195j5116j4814j4358j3477j2505j1982j1844j1439j0409r067p850o814
60923F52520n923n389n333n487n469n198m828m427l935l229k125o44O67J143R02
60908F03245R43J991L627M904N418N444N360N461O010O969P813Q100Q079Q284
60894F81648Q738R094R432J0270J1658J2915J3503J3761J4458J5845J7423J8518
60882H37263J8898J8942J9193J9741K0122J9931J9445J9218J9215J8698J7134
60871A047800J4852J2631J0852R255P329M734J504k022n417q460j1126j3394j5204
60858A053334j6651j8057j9663k1333k2653k3327k3418k3171k2668k1794k0658
$$ plain form
60946 1042469 1014684 986152 957334 929468 903902 881157 860793 842051 824458 807882 792195
60935 792195 777079 762265 747907 734430 721925 709943 698099 686660 676251 667184 659334 652520
60923 652520 646597 641208 635875 630388 624919 619721 614893 610466 606531 603302 601177 600533 601200 602343 603245
60908 603245 604188 606179 609806 614710 620128 625572 630932 636393 642403 649372 657185 665285 673364 681648
60894 681648 690386 699480 708912 719182 730840 743755 757258 771019 785477 801322 818745 837263
60882 837263 856161 875103 894296 914037 934159 954090 973535 992753 1011968 1030666 1047800
60871 1047800 1062652 1075283 1086135 1095390 1102719 1107453 1108957 1106935 1101518 1093058 1081932 1068538 1053334
60858 1053334 1036683 1018626 998963 977630 954977 931650 908232 885061 862393 840599 819941
60847H19941j9901k0102k0907k1213k0483j9414j8881j8729j8242j7395j6798
60836F07876j6515j5929j4849j3797j2969j1850j0316r133q710q179o673m809
60824D74147l833l696l230k125j431j830k520k395j570r74r76j050o47K28J193
60809D49291J859J976J537Q56M59Q30K018L350L623K210j2j333j052k32k54j142
60793D63984j835j805j665k128l067l809l971l664l104k467k014k074k652l269
60779D26460l400l080k884l152l533l503l167l121l505l733l294k432j715j283
60765C84658q48k73K65N47M43r7q83j363j038j7J076J683J600Q63j74p35j62J244
60747C86789K336K375J840J650J899J863J205N59O34J137J113K40p21r88r11j469
$$ plain form
60847 819941 800040 779938 759031 737818 717335 697921 679040 660311 642069 624674 607876
60836 607876 591361 575432 560583 546786 533817 521967 511651 502518 493808 485629 478956 474147
60824 474147 470314 466618 463388 461263 459832 458002 455482 453087 451517 450543 449567 448517 447870 448098 449291
60809 449291 451150 453126 454663 455519 455978 456808 458826 462176 465799 468009 467997 466664 465612 465380 465126 463984
60793 463984 462149 460344 458679 456551 453484 449675 445704 442040 438936 436469 434455 432381 429729 426460
60779 426460 423060 419980 417096 413944 410411 406908 403741 400620 397115 393382 390088 387656 385941 384658
60765 384658 383810 383537 383802 384349 384792 384695 383812 382449 381411 381394 382470 384153 385753 386616 386442 385707 385545 386789
60747 386789 389125 391500 393340 394990 396889 398752 399957 400516 401150 402287 403400 403640 402919 401931 401020 399551
60731C99551k848m053m125l266k458k298k664l230l839m391m767m871m577l684
60717C48480k345j332j364k173k749k648k472k844l365l146k095j114r99j561
60703C18273j930j560p53k08j99k91N1P31J156J040P39P06R89J420J983K610K996
60686C27753K936K712K727K871K685K110J644J719K290L152M219N232N601M961
60672C72612L747K891K906L479L929L819L183K344J614J054N23J9j23L58J102
60657D03457J368R17L36K11L27O4n56p69q6J002J490Q14q19k688l998m336m040
60640C92694l926m398m981m973m386l887l844l865l364k288j136m29k93m40m48
60625C50036j23L40N99M89J30k28l63k03J02L10L75M49N66N50L73K49J58k77j017
$$ plain form
60731 399551 396703 392650 388525 385259 382801 380503 377839 374609 370770 366379 361612 356741 352164 348480
60717 348480 346135 344803 343439 341266 338517 335869 333397 330553 327188 324042 321947 320833 319834 318273
60703 318273 316343 314783 314030 313822 313623 313332 313383 314114 315270 316310 317049 317755 318744 320164 322147 324757 327753
60686 327753 330689 333401 336128 338999 341684 343794 345438 347157 349447 352599 356818 362050 367651 372612
60672 372612 376359 379250 382156 385635 389564 393383 396566 398910 400524 401578 402101 402120 401997 402355 403457
60657 403457 404825 405742 406078 406289 406616 406680 406124 405355 405269 406271 407761 408575 407756 405068 401070 396734 392694
60640 392694 388768 384370 379389 374416 370030 366143 362299 358434 355070 352782 351646 351217 350924 350484 350036
60625 350036 349913 350253 350852 351341 351471 351243 350880 350677 350779 351089 351464 351913 352479 353029 353402 353651 353809 353532 352515
60606C52515j223l47P19N91n83j088J05K005L022K873K312J708R54L93O94J722
60590C66372K396K007J021L25J68J77Ml80p80q84m82K21O99O99O12J006J889K710
60572C77780L081L299M054N617P459Q746R255R576J0281J1098J1160R997P897
60559D79300N348K582j57k365l703m465n104n451m874l238j252L53J554K689L718
60544D64935M351M686N208O148P311Q623J0287J2153J3431J3494J2588J1286R464
60531E83965O587K881m64k581l839n064o257o611n674m032k734k287k324k126
60517E49440j412n45N8N17J265K307L052L019K392J762J628K313L983O370Q789
60502E84938J0872J3119J6284K0263K4120K7264L0109L3255L6472L8831L9725
$$ plain form
60606 352515 351292 350945 351664 352255 351672 350584 350689 352694 355716 358589 360901 362609 363563 363956 364650 366372
60590 366372 368768 370775 371796 372121 372289 372466 372470 372090 371310 370426 369944 370165 370864 371563 372175 373181 375070 377780
60572 377780 380861 384160 388214 393831 401290 410036 419291 428867 439148 450246 461406 471403 479300
60559 479300 484648 487230 487073 484708 481005 476540 471436 465985 461111 457873 456621 456974 458528 461217 464935
60544 464935 469286 473972 479180 485328 492639 501262 511549 523702 537133 550627 563215 574501 583965
60531 583965 590552 593433 592969 590388 586549 581485 575228 568617 562943 558911 556177 553890 551566 549440
60517 549440 548028 547483 547541 548058 549323 551630 554682 557701 560093 561855 563483 565796 569779 576149 584938
60502 584938 595810 608929 625213 645476 669596 696860 726969 760224 796696 835527 875252
60491H75252L9271L7659L4511K9180K1549J2229J980q746j9542k9573l7713m3211
60479I12846m6011m6506m5162m2438l8862l4990l1235k7779k4583k1625j9086
60468E34569j7111j5396j3426j1260r611q772p979o523m990m499m965n203m710
60455D20124m165l926l325k082j172j448k261k508k251k255k518k381j756j097
60441C86979n37jR8n42j184r33l31o37j679j989j213o52r25q06O02K030J760J43
60423C80183j016r10k47K49N38O06L21n0pM23Q73J370K117K678K305J111K4n19
60405C90049r54j478j426l16J217K089J988J514J365J702K198K393K176J919J954
60390D06390K000J565Q54O32J102J571J567J573K107K666K384J450J027J716K835
$$ plain form
60491 875252 914523 952182 986693 1015873 1037422 1049651 1051631 1042885 1023343 993770 956057 912846
60479 912846 866835 820329 775167 732729 693867 658877 627642 599863 575280 553655 534569
60468 534569 517458 502062 488636 477376 467765 458993 451014 444491 439501 435002 430037 424834 420124
60455 420124 415959 412033 408708 406626 405454 404006 401745 399237 396986 394731 392213 389832 388076 386979
60441 386979 386442 386441 386539 385997 384813 383880 383549 382912 381233 379244 378031 377379 376454 375648 376250 378280 380040 380183
60423 380183 379167 378257 378010 378259 378797 379403 379724 379674 379667 380090 380963 382333 384450 387128 389433 390544 390568 390049
60405 390049 389095 387617 386191 385875 387092 389181 391169 392683 394048 395750 397948 400341 402517 404436 406390
60390 406390 408390 409955 410809 411441 412543 414114 415681 417254 419361 422027 424411 425861 426888 428604 431439
60375D31439L356L070K535K279K323K373K182J783J370J039P17M95P13J483K254
60360D59411K349J885J669K126K803L128L194L458M004M548M960N339N676N859
60346E10409N889N818N457M499K967J185o30k424l902m608m524m277m451m933
60332E06475n174m877m205l499l028k882k886k749k485k490k988l540l484k695
60318D59493j660p62J06J193K365L229L612L838M428N578P011Q388R764J1442
60304E18025J3452J5545J7648J9834K1554K1442J8452J3036O693N03n442j1181
60292F49561j6120j9341k0419j9676j7935j5999j4215j2449j0565q787p346o005
60280D80704m465l128k807l565m418m533m185m154m505m554l831k619j524q18
$$ plain form
60375 431439 434795 437865 440400 442679 445002 447375 449557 451340 452710 453749 454466 454961 455674 457157 459411
60360 459411 461760 463645 465314 467440 470243 473371 476565 480023 484027 488575 493535 498874 504550 510409
60346 510409 516298 522116 527573 532072 535039 536224 535594 533170 529268 524660 520136 515859 511408 506475
60332 506475 501301 496424 492219 488720 485692 482810 479924 477175 474690 472200 469212 465672 462188 459493
60318 459493 457833 457071 457177 458370 460735 463964 467576 471414 475842 481420 488431 496819 506583 518025
60304 518025 531477 547022 564670 584504 606058 627500 645952 658988 665681 666184 660742 649561
60292 649561 633441 614100 593681 574005 556070 540071 525856 513407 502842 494055 486709 480704
60280 480704 476239 473111 470304 466739 462321 457788 453603 449449 444944 440390 436559 433940 432416 431598
60266D31598l24K57R26J284Q89j98j343j869j627r91m72k71j18M08J247J685J132
60249D32213l9q57q92n50j88L44J069J451J076L03k53m70m19J48J315K372K495
60232D39118J951J753K199K560K375K134K302K537K411K277K612L055K918K468
60218D72670K737L975N130N199M519M204M754N693O344O444O073N478M984M723
60204E42927M435L876L364L426L849L700K540J120L47Q2m52j303j714j414j186
60189E63597j785k873l490l285k839k927l766m893n500m971l408j654o88q82j755
60174E18881k395k164j225l79k17m60m24k5R9m26j105j237p99k91K6K96O77J174
60156E10006J750K208K097J166m7m83L65J906L092L389L069K708K636K856L261
$$ plain form
60266 431598 431274 431531 432457 433741 434630 434432 433089 431220 429593 428602 428130 427859 427741 428149 429396 431081 432213
60249 432213 432174 431317 430425 429875 429687 430031 431100 432551 433627 433930 433677 433207 432788 432936 434251 436623 439118
60232 439118 441069 442822 445021 447581 449956 452090 454392 456929 459340 461617 464229 467284 470202 472670
60218 472670 475407 479382 484512 489711 494230 498434 503188 508881 515225 521669 527742 533220 538204 542927
60204 542927 547362 551238 554602 558028 561877 565577 568117 569237 569584 569666 569214 567911 566197 564783 563597
60189 563597 561812 558939 555449 552164 549325 546398 542632 537739 532239 527268 523860 522206 521518 520636 518881
60174 518881 516486 514322 513097 512718 512501 512041 511617 511592 511691 511265 510160 508923 508124 507833 507859 508155 508832 510006
60156 510006 511756 513964 516061 517227 517180 516697 517062 518968 522060 525449 528518 531226 533862 536718 539979
60141E39979L763M205M327M080L901M368N398O118N730M388K966K119J776J457
60127E94575P93k73j463k302k404j733n87O12J412J460P83n8m30l33m12j150k241
60110E86249k983l166l217l506l832l822l584l499l501l170k537k252k572k773
60096E41835k115r75k98j58L30J605L038L906M264M483M515M111L360K595K038
60081E72534J754J700J531P86m98j739k582l289m102m793n189n590o210o686o655
60066E30972o370o140n693m739l799l587l914m032l828l841m080l813k685j279
60052D73172k55M50J271K308L272L826L854L668L932M965O020N865M220K201J088
60037E19857R67R40L38o28j370j742k144k891l735m274m650n351o309o827o635
$$ plain form
60141 539979 543742 547947 552274 556354 560255 564623 570021 576139 581869 586257 589223 591342 593118 594575
60127 594575 595368 595095 593632 591330 588926 587193 586606 587218 588630 590090 590873 590815 590385 590052 589640 588490 586249
60110 586249 583266 580100 576883 573377 569545 565723 562139 558640 555139 551969 549432 547180 544608 541835
60096 541835 539720 538745 538447 538289 538619 540224 543262 547168 551432 555915 560430 564541 567901 570496 572534
60081 572534 574288 575988 577519 578305 577807 576068 573486 570197 566095 561302 556113 550523 544313 537627 530972
60066 530972 524602 518462 512769 508030 504231 500644 496730 492698 488870 485029 480949 477136 474451 473172
60052 473172 472917 473367 474638 476946 480218 484044 487898 491566 495498 500463 506483 512348 516568 518769 519857
60037 519857 520824 521764 522102 521474 520104 518362 516218 513327 509592 505318 500668 495317 489008 482181 475546
60022D75546o400o700p133p004o377n715n018m136l503l497l440k334n09O30N56
60007D14966J03p4l68j045j425r07M4O55R01J166J409J315R46O99Q96J673K860
59990D23814L792L822L216K927L170L108K253J272Q11M64k89r89j038r77j763
59975D43593l154l992l829l277k775k117j282p69p81q27m69P9L91M64O03J011
59959D22869J623K155K290K030J838K077K457K349J635Q69O16R92J698K227K115
59944D49840J390O88N29O51M38k15r50j670k499l105k823j656m80Lm7j67k46k50
59926D39431J28R96J811J967J633J503J783J965J706J414J718K606L423L676L548
59911D69308L551L885M317M535M378L765K696J450M84l8m55j128j889k100j305
$$ plain form
60022 475546 469146 462446 455313 448309 441932 436217 431199 427063 423560 420063 416623 414289 413780 414410 414966
60007 414966 415069 414995 414627 413582 412157 411250 411294 411949 412850 414016 415425 416740 417686 418385 419281 420954 423814
59990 423814 427606 431428 434644 437571 440741 443849 446102 447374 448185 448649 448360 447371 446333 445356 443593
59975 443593 440439 436447 432618 429341 426566 424449 423167 422398 421617 420790 420321 420400 420791 421255 421858 422869
59959 422869 424492 426647 428937 430967 432805 434882 437339 439688 441323 442192 442808 443800 445498 447725 449840
59944 449840 451230 451918 452447 453098 453536 453321 452371 450701 448202 445097 442274 440618 440138 440141 440094 439927 439681 439431
59926 439431 439559 440555 442366 444333 445966 447469 449252 451217 452923 454337 456055 458661 462084 465760 469308
59911 469308 472859 476744 481061 485596 489974 493739 496435 497885 498369 498331 497876 496748 494859 492759 491454
59896D91454L23K052L074L124K688K458K625K892L158L632M189M244L646L214
59882E32773L735M831N457N267M778M349L748K819J805P54p36k817m861o094o482
59867E49326o614o877p075o867o244n468m698l758k434r12K83R27J457K443L800
59852E07289M890N352N605O398Q029R985J1229J0913R026O334L648J331l61r33
59838E88735j07J436K367J909M06j302k734l920m980n837o252o137n780n638n836
59823E46330o105o249o389o489o150n221m206l549k907j786o29m16j263k207k422
59808D90342j899r09L58J382J408M21o48j062j101j395k013k673l260l650l480
59793D71821k625j559p58j35M78P86M82r8m29o03j055j707j971j590q99l02N2
$$ plain form
59896 491454 491777 493829 496903 500027 502715 505173 507798 510690 513848 517480 521669 525913 529559 532773
59882 532773 536508 541339 546796 552063 556841 561190 564938 567757 569562 570316 569580 566763 561902 555808 549326
59867 549326 542712 535835 528760 521893 515649 510181 505483 501725 499291 498379 498662 499589 501046 503489 507289
59852 507289 512179 517531 523136 529534 537563 547548 558777 569690 578716 585050 588698 590029 589668 588735
59838 588735 588628 590064 592431 594340 594746 593444 590710 586790 581810 575973 569721 563584 557804 552166 546330
59823 546330 540225 533976 527587 521098 514948 509727 505521 501972 499065 497279 496650 496234 494971 492764 490342
59808 490342 488443 487534 487892 489274 490682 491103 490455 489393 488292 486897 484884 482211 478951 475301 471821
59793 471821 469196 467637 466879 466744 467222 468008 468490 468392 467963 467360 466305 464598 462627 461037 460138 459836 459888
59776D59888J11j06l84n45o88q68p33L7J021J399J074Q75J490K596L327L242K641
59759D74377K111J996K193K355K265J967J595J205R75J199J835K352K373K233
59745E01031K382K578K230J467J089J400J834J987K278L149M137M299L284J603
59731E34748Q1o45l14P86J967K760L231L506L330K508J521J085J229J329J085
59716E58207Q73R98J173J014O74N25M90J95l09m27K53J401K293K546K299J837
59700E74042J328R47R80J571K428L006K991K533J913J166J43j122k254k765k444
59685E84463j573p60m96p74j185j422j585j942k526l160l796m525n207n397m802
59670E45313l805l247l648m655n361n127m145l152k640k378j748m78J030K059
$$ plain form
59776 459888 459999 459893 459509 458964 458276 457408 456675 456712 457733 459132 460206 461081 462571 465167 468494 471736 474377
59759 474377 476488 478484 480677 483032 485297 487264 488859 490064 491039 492238 494073 496425 498798 501031
59745 501031 503413 505991 508221 509688 510777 512177 514011 515998 518276 521425 525562 529861 533145 534748
59731 534748 534829 534184 533870 534656 536623 539383 542614 546120 549450 551958 553479 554564 555793 557122 558207
59716 558207 559080 560078 561251 562265 562939 563464 563954 564149 563840 563413 563666 565067 567360 569906 572205 574042
59700 574042 575370 576317 577297 578868 581296 584302 587293 589826 591739 592905 593048 591926 589672 586907 584463
59685 584463 582890 582130 581634 580860 579675 578253 576668 574726 572200 569040 565244 560719 555512 550115 545313
59670 545313 541508 538261 534613 529958 524597 519470 515325 512173 509533 507155 505407 504929 505959 508018
59656E08018K217J752J326J503K312L248L737L519K663J328k43j649k518k866
59642E24347l043l235l297l105k867k819k860k639j953q75K71R72Q05k2o78o07
59626D98395k70n81j639k536k527j895j502j765k440l100l535l725l686l367k649
59611D63178j473qJ354K286K727K873L016L288L452L036J950P59J08r3l95q27
59595D85231p72JP89Q01J12o08r72j035q80n89m90q72j481j744j501j180j183
59578D73627j432j640j668j578j477j477j646j943k224k277j887r77J22P89P03
59563D55015K23j3K11O22Q83Q74O44M13M73Q95J387J672J817J989K168K430L164
59546D74867M484N692O053N973O660Q489J0552J2127J3709J5856J7541J6616J1965
$$ plain form
59656 508018 510235 511987 513313 514816 517128 520376 524113 527632 530295 531623 531380 529731 527213 524347
59642 524347 521304 518069 514772 511667 508800 505981 503121 500482 498529 497654 497925 498897 499702 499680 499002 498395
59626 498395 498125 497544 495905 493369 490842 488947 487445 485680 483240 480140 476605 472880 469194 465827 463178
59611 463178 461705 461697 463051 465337 468064 470937 473953 477241 480693 483729 485679 486438 486546 486453 486058 485231
59595 485231 484459 484460 485249 486050 486162 485554 484582 483547 482667 482078 481588 480716 479235 477491 475990 474810 473627
59578 473627 472195 470555 468887 467309 465832 464355 462709 460766 458542 456265 454378 453401 453523 454312 455015
59563 455015 455238 455225 455436 456058 456941 457815 458459 458872 459345 460240 461627 463299 465116 467105 469273 471703 474867
59546 474867 479351 485043 491096 497069 503729 512218 522770 534897 548606 564462 582003 598619 610584
59533F10584M741k538p697r769q945o229l043n98P78J679K791L928M150K937R33
59518E93702p77j945l215n005o900q292r113r580r662r173q194p047n940m971
59504E03888m322m133m176l983l352k475j595p67rN33P59P85P73O56L16o3m6N31
59486D83320J331J997K572L183L547L322K895L180M444N837O451O348O139N987
59472E40553N569M816M020L287K451J494O81K34K80J001K348L705M429M723N429
59457E85020O848Q332R160R285R007Q471P781P230P000O866O405N240L068j78
59443F79535l989p508j0206j1985j2629j1827j0030q534q162q278p669o051m203
59430E68464k901k223j756r06Q40L442O120Q076R353J0667J2468J4568J6581J8284
$$ plain form
59533 610584 615325 612787 605090 595321 586376 580147 577104 576506 577284 578963 581754 585682 589832 592769 593702
59518 593702 592925 590980 587765 582760 575860 567568 558455 548875 539213 530040 521846 514799 508859 503888
59504 503888 499566 495433 491257 487274 483922 481447 479852 479085 479076 479609 480368 481153 481926 482582 482898 482835 482789 483320
59486 483320 484651 486648 489220 492403 495950 499272 502167 505347 509791 515628 522079 528427 534566 540553
59472 540553 546122 550938 554958 558245 560696 562190 562871 563105 563385 564386 566734 570439 574868 579591 585020
59457 585020 591868 600200 609360 618645 627652 636123 643904 651134 658134 665000 671405 676645 679713 679535
59443 679535 675546 668038 657832 645847 633218 621391 611361 602827 594665 586387 578718 572667 568464
59430 568464 565563 563340 561584 560678 561518 564960 571080 579156 588509 599176 611644 626212 642793 661077
59416F61077J9504K0159K0581K1289K2036K1288J7120Q936j643j1602j8277k0647
59404G59821j9378j5967j1710p062j838L709P826P811K236p334j7172k4010k6714
59391F50218k5984k3234j9828j6566j3489j0363p382n039l373j991q29k33j53
59378E21754PN28J062J442K027K886L451L521L723M433M965M701M285M745N963
59363E69493P016P638Q291R031R409R427R624J0152J0637J1030J1810J3132J4570
59350G01260J5820J7017J8124J8665J8348J7414J6179J4618J2571R959O766L217
59338H69958q2k732n266q544j2377j5444j6825j6985j6979j7259j7616j7732j7308
59325G04809j6084j4206j2276j0733r364p809o283n375n226n203m491k940j254
$$ plain form
59416 661077 680581 700740 721321 742610 764646 785934 803054 811990 810347 798745 780468 759821
59404 759821 740443 724476 712766 705704 703866 707575 715401 723212 725448 718114 700942 676932 650218
59391 650218 624234 601000 581172 564606 551117 540754 533372 528333 524960 522969 522140 521907 521754
59378 521754 521761 522289 523351 524793 526820 529706 533157 536678 540401 544834 549799 554500 558785 563530 569493
59363 569493 576509 584147 592438 601469 610878 620305 629929 640081 650718 661748 673558 686690 701260
59350 701260 717080 734097 752221 770886 789234 806648 822827 837445 850016 859975 866741 869958
59338 869958 869876 867144 861878 853334 840957 825513 808688 791703 774724 757465 739849 722117 704809
59325 704809 688725 674519 662243 651510 642146 634337 628054 622679 617453 612250 607759 604819 603565
59312F03565k91j06J03R93K347L596M712O052P555Q796R841J1285J3215J4620
59298F86283J4068J0705M760k361q555j2304j3761j4159j4155j3424j1851j0077
59286F15169q554o938m967l097j708l87J240K587K947K834L463N132O938Q123
59272F22782Q880R629J0189J0021Q913P244N619M339L116J444o40k475l722m919
59258F80420o664q589r735r765r184q487p790p295p227p190o323m476k567j347
59244E83781l97J069K938M437N370O218P093P357O625N413M407L514K214N35r62
59229F39612k031k982l975m725n160n829p160q611r147q480p271o149n031l626
59215E59435k102q95q6O19J353J883J931J609J330J360J498J295O81K04L94J015
$$ plain form
59312 603565 603274 603168 603271 604264 606611 610207 614919 620971 628526 637322 647163 658448 671663 686283
59298 686283 700351 711056 715816 713455 704900 692596 678835 664676 650521 637097 625246 615169
59286 615169 606615 599677 594710 591613 589905 589518 590758 593345 596292 599126 602589 607721 614659 622782
59272 622782 631662 641291 651480 661501 670414 677658 683277 687616 690732 692176 691536 689061 685339 680420
59258 680420 673756 665167 655432 645667 636483 627996 620206 612911 605684 598494 592171 587695 585128 583781
59244 583781 583384 584453 587391 591828 597198 603416 610509 617866 624491 629904 634311 637825 640039 640574 639612
59229 639612 637581 634599 630624 625899 620739 614910 607750 599139 589992 581512 574241 568092 563061 559435
59215 559435 557333 556438 556352 556971 558324 560207 562138 563747 565077 566437 567935 569230 569911 570115 570509 571524
59199E71524J256P88J69N0K86L18J39L56J216K093K209J588R30P23Q29Q96Q29
59182E86199P24O19N43O48J064J693K328K933L630M472N348O076O521O722P070
59167F36590Q076R657J0854J0703R301P593O159M794L191J405m59k339l809m303
59153F97413m103m337n555o967p567p385o986o499n906n710o279o970o901o344
59139F09904o322o999p519p362o834o215n433m686m406m391l868k681j513p52
59125E40923nR56J726K118K607L482M433N348O670Q420R765J0173J0220J0567
59111F17403J0922J0804J0584J0828J1156J0705R447Q119P037N815M205K511J115
59098G20651J11o14j298k177l109l515l136k556k557l186l794l858l351k597k033
$$ plain form
59199 571524 572780 573568 573737 573787 574073 574391 574530 574886 576102 578195 580404 581992 582922 583645 584474 585370 586199
59182 586199 586923 587542 588085 588733 589797 591490 593818 596751 600381 604853 610201 616277 622798 629520 636590
59167 636590 644666 654323 665177 675880 685181 692774 698933 703727 706918 708323 707864 705525 701716 697413
59153 697413 693310 688973 683418 676451 668884 661499 654513 648014 642108 636398 630119 623149 616248 609904
59139 609904 603582 596583 589064 581702 574868 568653 563220 558534 554128 549737 545869 543188 541675 540923
59125 540923 540918 541874 543600 545718 548325 551807 556240 561588 568258 576678 586443 596616 606836 617403
59111 617403 628325 639129 649713 660541 671697 682402 691849 699968 707005 712820 717025 719536 720651
59098 720651 720762 720148 718850 716673 713564 710049 706913 704357 701800 698614 694820 690962 687611 685014 682981
59083F82981j988k377k899l611m792o134o821o758o857p561p911p008n610n155
59069F07499n688n952n341m557m305m351m103l316k091q19j48l47o90k17Q75J392
59053E67841P28m09j084j184j113j052r51q24p56p69q20p59m44l8M6j71qR25K034
59034E61192K647L136M200N442N800N229M766M917N192N448O349P998R310R429
59020F41055Q851Q411P943O772M884K911J368M49J83K90L05K12M13Q32Q70O54
59004F86403J311L269N305O200O521P438Q583Q609P518O761O838O456M631K316
58990G68159J047Q39M01j109l319n429o904p524p282o428n293m005k475o40J418
58975G21456L500N327O633P392P910Q559R449J0417J1218J1654J1636J1235J0628
$$ plain form
59083 682981 680993 678616 675717 672106 667314 661180 654359 647601 640744 633183 625272 618264 612654 607499
59069 607499 601811 595859 590518 585961 581656 577305 573202 569886 567795 566976 566828 566481 565791 565574 566449 567841
59053 567841 568569 568160 567076 565892 564779 563727 562776 561952 561196 560427 559607 558848 558404 558366 558412 558241 558233 559158 561192
59034 561192 563839 566975 571175 576617 582417 587646 592412 597329 602521 607969 614318 622316 631626 641055
59020 641055 649906 658317 666260 673032 677916 680827 682195 682644 682827 683117 683422 683634 684047 684879 685749 686403
59004 686403 687714 690983 696288 702488 709009 716447 725030 733639 741157 747918 754756 761212 765843 768159
58990 768159 769206 770045 770446 769337 766018 760589 753685 746161 738879 732451 727158 723153 720678 720038 721456
58975 721456 724956 730283 736916 744308 752218 760777 770226 780643 791861 803515 815151 826386 837014
58962H37014R956R265Q510P578O285M535K445J76k353n314q535j1410j3393j4407
58948H30352j4682j4417j3791j3034j2215j1051r293p234n507m439l890l778m264
58935G12757n238o034o013n239m259l436k787k285j846j162j13P71P62m7o86m51
58919F74694M09J342K234L191M066M737N508O661P835Q378Q221P938Q052Q616
58905G51882R437J0286J0913J1197J1212J0957J0214R033Q114Q174Q998R648R575
58892H79640R161R182J0274J2735J6306J9956K2456K3293K2689K0815J7614J3456
58880A077577R251N621K381r58m590q474j2447j6030j8631k0187k1109k1407k0539
58867I50458j8493j6328j5028j4360j3557j2630j2214j2418j2647j2566j2433
$$ plain form
58962 837014 846970 856235 864745 872323 878608 883143 885588 885764 883411 878097 869562 858152 844759 830352
58948 830352 815670 801253 787462 774428 762213 751162 741869 734635 729128 724689 720799 717021 712757
58935 712757 707519 701485 695472 690233 685974 682538 679751 677466 675620 674458 674345 675116 675878 675831 675145 674694
58919 674694 675103 676445 678679 681870 685936 690673 696181 702842 710677 719055 727276 735214 743266 751882
58905 751882 761319 771605 782518 793715 804927 815884 826098 835131 843245 851419 860417 870065 879640
58892 879640 888801 897983 908257 920992 937298 957254 979710 1003003 1025692 1046507 1064121 1077577
58880 1077577 1086828 1092449 1094830 1093872 1089282 1080808 1068361 1052331 1033700 1013513 992404 970997 950458
58867 950458 931965 915637 900609 886249 872692 860062 847848 835430 822783 810217 797784
58856G97784j2491j2609j2715j2947j3200j3001j2123j0952r983r231q406p479
58844F62647o802o683p058p596q072q447q550p858o050l834k660l150m171m022
58830E77694k402n77L17M20M98Q93J529K374L350M114M510M933N778O718P063
58815F17212O685N929M766K844N66p93n97J03k53j861l507m183l919l191k339
58800F17462j788k053l021l832l909l676l786m085l995l519l171k999k490j439
58786E73699k71O77J581K592L437L917M352N048N640N461M437L107J870O45o93
58771F15499j955k935l689m242m308l712k984k962l740m462m481m223m460n002
58757E62344m876l700k173r88LJ155K152K428K075J789J981K492L064L617M111
$$ plain form
58856 797784 785293 772684 759969 747022 733822 720821 708698 697746 687763 678532 670126 662647
58844 662647 655845 649162 642104 634508 626436 617989 609439 601581 595531 591697 589037 585887 581716 577694
58830 577694 575292 574715 575032 575452 575950 576843 578372 580746 584096 588210 592720 597653 603431 610149 617212
58815 617212 623897 629826 634592 637436 638002 637209 636612 636715 636462 634601 631094 626911 622992 619801 617462
58800 617462 615674 613621 610600 606768 602859 599183 595397 591312 587317 583798 580627 577628 575138 573699
58786 573699 573428 574105 575686 578278 581715 585632 589984 595032 600672 606133 610570 613677 615547 616192 615499
58771 615499 613544 610609 606920 602678 598370 594658 591674 588712 584972 580510 576029 571806 567346 562344
58757 562344 557468 553768 551595 550607 550610 551765 553917 556345 558420 560209 562190 564682 567746 571363 575474
58742E75474M547N100N892O659P001O876O559O213N861N668N897O581P471Q264
58728F64063Q610Q166P003N760M964M453L902L596L993M750N028M708M559N007
58714G38562N569N668N341M783L855K463Q67p42k606m956p561r978j1953j3404
58700G15908j4388j5273j6461j7708j8188j7503j6160j4794j3395j1695r841q241
58688E42261p041o186n640n212m516l511k763k769l283l701l762l463k635j197
58674D86582M04J557K304L282M853O643P972Q554Q765R338J0658J2196J2830J1916
58660E87854R795P094L947L02l336o112p682q421q696q446p640o702o153n973
58646E39831n598m621l304k244j603q56M98K175L335L567L309L275L681M181M312
$$ plain form
58742 575474 580021 585121 591013 597672 604673 611549 618108 624321 630182 635850 641747 648328 655799 664063
58728 664063 672673 680839 687842 693602 698566 703019 706921 710517 714510 719260 724288 728996 733555 738562
58714 738562 744131 749799 755140 759923 763778 766241 767108 766366 763760 758804 751243 741265 729312 715908
58700 715908 701520 686247 669786 652078 633890 616387 600227 585433 572038 560343 550502 542261
58688 542261 535220 529034 523394 518182 513666 510155 507392 504623 501340 497639 493877 490414 487779 486582
58674 486582 486986 488543 490847 494129 498982 505625 513597 522151 530916 540254 550912 563108 575938 587854
58660 587854 597649 604743 608690 608992 605656 599544 591862 583441 574745 566299 558659 551957 545804 539831
58646 539831 534233 529612 526308 524064 522461 521605 522103 524278 527613 531180 534489 537764 541445 545626 549938
58631E49938L876L029K079J175K84m58n80J81J403K378K974L631M659N957P354
58616E87880Q664R444R279Q393P427O534N250L366J256p44k651m277n077m894
58602F29850m321l935l769l774m146m743m789l815k383j369q26j24J136K804M587
58587F00383O331P990R549J0815J1363J1024J0417J0312J0437R692P751N697M627
58574G16388M441M513M832N817P539R690J1900J3719J4898J6004J8037K0932K3285
58561H71995K4087K3854K3317K2056J9352J5559J1464P041K090k491n385o571
58549A006368p126p550p493o968o626o840p488q726j0889j3615j5964j7567j8716
58536H70800j9358j8898j7195j4927j2753j0830r189p861o531m777k804j234j37
$$ plain form
58631 549938 553814 556843 558922 560097 560381 559923 559343 559524 560927 563305 566279 569910 574569 580526 587880
58616 587880 596544 605988 615267 623660 631087 637621 642871 646237 647493 646749 644098 639821 634744 629850
58602 629850 625529 621594 617825 614051 609905 605162 600373 596558 594175 592806 591980 591856 592992 595796 600383
58587 600383 606714 614704 624253 635068 646431 657455 667872 678184 688621 698313 706064 711761 716388
58574 716388 720829 725342 730174 735991 743530 753220 765120 778839 793737 809741 827778 848710 871995
58561 871995 896082 919936 943253 965309 984661 1000220 1011684 1018725 1020815 1018324 1012939 1006368
58549 1006368 999242 991692 984199 977231 970605 963765 956277 947551 936662 923047 907083 889516 870800
58536 870800 851442 832544 815349 800422 787669 776839 767650 759789 753258 748481 745677 744443 744306
58523G44306J062K566L857M504M691M718M548M029L157K025Q82R6l03q70j998
58508G77270l227l876m092m499n098n366n283n329n525n406m954m635m427l769
58494G11784k628j677j208o73L98J707K760L470M011M656N922Q152J0802J2766
58480G60242J3668J4261J5320J6669J7456J6880J4579J0845O586K652q20l984
58468H84354o478p688p639o872n616l906k358j747j739j087O77K686M085M982
58454H51654N727O141N871M831K908M0l190n751p391q878j0556j1510j0720q473
58440H10703n979m022k555j292n8J314K984M869O575P673Q155Q592R542J0723
58426H57224J1274J1111J1275J2361J3256J2387R731O591L835J419o51k181l487
$$ plain form
58523 744306 745368 747934 751791 756295 760986 765704 770252 774281 777438 779463 780345 780441 780138 779268 777270
58508 777270 774043 770167 766075 761576 756478 751112 745829 740500 734975 729569 724615 719980 715553 711784
58494 711784 709156 707479 706271 705598 705996 707703 710463 713933 717944 722600 728522 736674 747476 760242
58480 760242 773910 788171 803491 820160 837616 854496 869075 879920 886506 889158 888338 884354
58468 884354 877876 870188 862549 855677 850061 846155 843797 842050 840311 839224 839901 842587 846672 851654
58454 851654 857381 863522 869393 874224 877132 877172 873982 868231 860840 851962 841406 829896 819176 810703
58440 810703 804724 800702 798147 796855 796797 798111 801095 805964 812539 820212 828367 836959 846501 857224
58426 857224 868498 879609 890884 903245 916501 928888 938619 945210 949045 950464 949813 947632 944145
58413I44145n083o657p404p372p332p383o897n916n266n114m522k821m43J890
58399H73825L796M964N259N276N761O479O635O352O411O557N645L656K032J583
58385I44231J566J304J185J429J335O12J94Q56K093L115L927M704N147N182N326
58370I82206N779O090O161O555P373P992Q359R243J0720J1769J1964J2139J2629
58357A098979J2395J0769Q699P254O155M781L400K421J652J197J864L708N439
58344A168713O282P174Q985J0896J1861J2444J3859J6112J8349K0150K1267K1057
58332A337149J9444J7623J6598J5758J3965J1295Q668O563N078M430M528M797
58320A465896N108N952P180P880Q147R347J1813J3994J4969J5984J8075J9986
$$ plain form
58413 944145 939062 932405 925001 917629 910297 902914 896017 890101 884835 879721 875199 872378 871935 873825
58399 873825 877621 882585 887844 893120 898881 905360 911995 918347 924758 931315 936960 940616 942648 944231
58385 944231 945797 947101 948286 949715 951050 951662 951856 952712 954805 957920 961847 966551 971698 976880 982206
58370 982206 987985 994075 1000236 1006791 1014164 1022156 1030515 1039758 1050478 1062247 1074211 1086350 1098979
58357 1098979 1111374 1122143 1130842 1138096 1144251 1149032 1152432 1154853 1156505 1157702 1159566 1163274 1168713
58344 1168713 1174995 1182169 1191154 1202050 1213911 1226355 1240214 1256326 1274675 1294825 1316092 1337149
58332 1337149 1356593 1374216 1390814 1406572 1420537 1431832 1440500 1447063 1452141 1456571 1461099 1465896
58320 1465896 1471004 1476956 1484136 1492016 1500163 1509510 1521323 1535317 1550286 1566270 1584345 1604331
58308A604331K0197J9467J9499K0360K1040K1347K1508K1046J9812J9037J9602
58297A827246K0373K0057J9530K0405K2372K3920K4805K5843K7054K7925K8819
58286B088349L0327L1870L2629L3192L4676L6982L9290M1448M3445M4723M5389
58275B502320M6886M9810N2494N3431N3627N4670N6115N6847N7502N9151O1038
58264C103891O2035O3031O5508O8905P1823P4467P7485P9778Q0158P9950Q1231
58253C908262Q3689Q5838Q8081R1768R6483J01034J05958J12299J19252J25694
58243D918358J32532J40707J48695J55171J62192J72122J83249J92444K00533
58234F406003K10794K23591K36763K50187K65536K82558K99868L18449L40223
$$ plain form
58308 1604331 1624528 1643995 1663494 1683854 1704894 1726241 1747749 1768795 1788607 1807644 1827246
58297 1827246 1847619 1867676 1887206 1907611 1929983 1953903 1978708 2004551 2031605 2059530 2088349
58286 2088349 2118676 2150546 2183175 2216367 2251043 2288025 2327315 2368763 2412208 2456931 2502320
58275 2502320 2549206 2599016 2651510 2704941 2758568 2813238 2869353 2926200 2983702 3042853 3103891
58264 3103891 3165926 3228957 3294465 3363370 3435193 3509660 3587145 3666923 3747081 3827031 3908262
58253 3908262 3991951 4077789 4165870 4257638 4354121 4455155 4561113 4673412 4792664 4918358
58243 4918358 5050890 5191597 5340292 5495463 5657655 5829777 6013026 6205470 6406003
58234 6406003 6616797 6840388 7077151 7327338 7592874 7875432 8175300 8493749 8833972
58225H833972L64299L88893M15547M46989M82368N19326N59271O05533O58050
58216A3274248P15103P78589Q51980R34933J025973J128699J249275J389991J551910
58207B2900701J741392J967018K232998K543930K913753L362269L906940M567888
58199D6136889N377333O373609P589285R053280J0793207J2817543J5102321J7615533
58191A30859000K0352102K3332134K6571167L0023147L3402487L5865972L5869156
58184C36275165L1656284K2348802Q849449o287723k0018264l0119802l5798541
58177C06905370l7474480l6201392l3149921k9293546k5284929k1484524j8064448
58170A05952130j5093438j2574066j0467603q723705p294525o129731n176933
$$ plain form
58225 8833972 9198271 9587164 10002711 10449700 10932068 11451394 12010665 12616198 13274248
58216 13274248 13989351 14767940 15619920 16554853 17580826 18709525 19958800 21348791 22900701
58207 22900701 24642093 26609111 28842109 31386039 34299792 37662061 41569001 46136889
58199 46136889 51514222 57887831 65477116 74530396 85323603 98141146 113243467 130859000
58191 130859000 151211102 174543236 201114403 231137550 264540037 300406009 336275165
58184 336275165 367931449 390280251 399129700 392841977 372823713 342703911 306905370
58177 306905370 269430890 233229498 200079577 170786031 145501102 124016578 105952130
58170 105952130 90858692 78284626 67817023 59093318 51798793 45669062 40492129
58163D0492129m393286l748731l217501k775710k407369k103067j851070j637115
58155A8358280j452929j296839j165264j050709r48515q58438p78705p05134o36881
58146I464866n76876n25509m79333m36679l99078l66517l36696l09883k89219
58137E745076k74909k62704k49339k35289k21211k06076j90072j75520j63507
58128C766449j52755j42699j34386j27626j20545j12833j06273j01380r6519r1015
58118B580418q6118q2200p7865p2665o7963o4419o1234n8334n6648n5733n3843
58107A843396n0903m8681m7545m5841m3141m1164m0655m0020l8122l5859l3939
58096A377526l1572k8570k6382k5826k5753k5106k4355k3855k2799k0896j9315
$$ plain form
58163 40492129 36098843 32350112 29132611 26356901 23949532 21846465 19995395 18358280
58155 18358280 16905351 15608512 14443248 13392539 12444024 11585586 10806881 10101747 9464866
58146 9464866 8887990 8362481 7883148 7446469 7047391 6680874 6344178 6034295 5745076
58137 5745076 5470167 5207463 4958124 4722835 4501624 4295548 4105476 3929956 3766449
58128 3766449 3613694 3470995 3336609 3208983 3088438 2975605 2869332 2767952 2671433 2580418
58118 2580418 2494300 2412100 2334235 2261570 2193607 2129188 2067954 2009620 1952972 1897239 1843396
58107 1843396 1792493 1743812 1696267 1650426 1607285 1566121 1525466 1485446 1447324 1411465 1377526
58096 1377526 1345954 1317384 1291002 1265176 1239423 1214317 1189962 1166107 1143308 1122412 1103097
58085A103097j8770j8405j7602j7206j7885j8837j9275j9679k0549k1294k1377
58074H92218k1279k1323k0847j9396j7643j6205j4743j3065j1888j1651j1550
58063G12628j0660r046p238n494m261m247n317o291o442o321o573o980p205p433
58049F19120p657p300o228n244n004n261n669o398p396q015p937p709p731p572
58035E23999o768n617m649l996l746m192n259o290o791o883o775o371n601m655
58021D46406l810l459m065n357o012n083l448k670k766k475j480p31n34o6Q91
58006D05341J405J057O20N33K90j62j8O63M49j196k677k497j456j300k278l390
57990C95384m237n226o301o752o092m471k441p81q7j23q0K04P8o45j184j035p51
$$ plain form
58085 1103097 1084327 1065922 1048320 1031114 1013229 994392 975117 955438 934889 913595 892218
58074 892218 870939 849616 828769 809373 791730 775525 760782 747717 735829 724178 712628
58063 712628 701968 692922 685684 680190 675929 671682 666365 660074 653632 647311 640738 633758 626553 619120
58049 619120 611463 604163 597935 592691 587687 582426 576757 570359 562963 554948 547011 539302 531571 523999
58035 523999 517231 511614 506965 502969 499223 495031 489772 483482 476691 469808 463033 456662 451061 446406
58021 446406 442596 439137 435072 429715 423703 418620 415172 412502 409736 407261 405781 405050 404516 404450 405341
58006 405341 406746 407803 408423 408956 409246 409084 409066 409729 410178 408982 406305 403808 402352 401052 398774 395384
57990 395384 391147 385921 379620 372868 366776 362305 359864 359083 358996 358873 358793 358997 359075 358430 357246 356211 355460
57973C55460q77j104j089j143j344j023K8Q01M66k71k01O85J482J717J509R90
57957C56086L99K26M81M55j01l24L64J101Q83K33L62J250J872K021K537L839N346
57940C77030O411O985P275P533Q144R290J0537J1276J1396J1002R851P770N308
57927D89808L266J707J02j779l769n799p811r331r838r455q783q177p706p538
57913D14897p714p777p234o182n042l912k780j933j598j438j123j007j564k409
57899C63184k694k286j783j512j255q72m53J76J306K714L771M311M740N287N597
57884C80231N262M355L341K668K381J964Q08r58k469l217l650m286m821m808m596
57869C72205m767n042m719l888l267k966k472j758j394j384r19M18K011L122L762
$$ plain form
57973 355460 354583 353479 352390 351247 349903 348880 348908 349709 350175 349904 349703 350388 351870 353587 355096 356086
57957 356086 356485 356711 357192 357647 357546 357222 357586 358687 359570 359803 360165 361415 363287 365308 367845 371684 377030
57940 377030 383441 390426 397701 405234 413378 422668 433205 444481 455877 466879 476730 484500 489808
57927 489808 493074 494781 494883 493104 489335 483536 475725 466394 456556 447101 438318 430141 422435 414897
57913 414897 407183 399406 392172 385990 380948 377036 374256 372323 370725 369287 368164 367157 365593 363184
57899 363184 360490 358204 356421 354909 353654 352782 352329 352505 353811 356525 360296 364607 369347 374634 380231
57884 380231 385493 389848 393189 395857 398238 400202 401010 400052 397583 394366 390716 386430 381609 376801 372205
57869 372205 367438 362396 357677 353789 350522 347556 345084 343326 341932 340548 339629 340047 342058 345180 348942
57854C48942M280M641M549L890K817J790J494K185L028K749J214k80o32l13n77
57839C79777j776l067l611l421k971k449j712q04j16J00J51N40J179J416J001
57824C64237N92R92K218L642M761N365N278M568L843L745M086L947K736P36j367
57809D09379l059l999m004l236k189j243m28L51J045J544J810J815J468P52j67
57794C99839j000j593k069k628l165l260k725j931j325q17j12O43J112J518K332
57779C84819L240L365K662K129K247K293J746J309J676K268K116J288L78o21j837
57764D09078k572k176j357j245j576j253m59m96j446j764o34P70J112O68M36N46
57748C97632N72O03R97J527J663J431J273J249R88L58k93n84n24m96q73j540j907
$$ plain form
57854 348942 353222 357863 362412 366302 369119 370909 372403 374588 377616 380365 381579 381299 380667 380354 379777
57839 379777 378001 374934 371323 367902 364931 362482 360770 359966 359850 359950 360101 360641 361820 363236 364237
57824 364237 364829 365821 368039 371681 376442 381807 387085 391653 395496 399241 403327 407274 410010 410746 409379
57809 409379 406320 402321 398317 395081 392892 391649 391221 391572 392617 394161 395971 397786 399254 400006 399839
57794 399839 398839 397246 395177 392549 389384 386124 383399 381468 380143 379326 379214 379857 380969 382487 384819
57779 384819 388059 391424 394086 396215 398462 400755 402501 403810 405486 407754 409870 411158 411536 410915 409078
57764 409078 406506 404330 402973 401728 400152 398899 398440 397944 396498 394734 394100 394870 395982 396650 397086 397632
57748 397632 398204 398807 399804 401331 402994 404425 405698 406947 407935 408293 408000 407416 406892 406396 405523 403983 402076
57731D02076j618j130j107j403j273n45R3J35r2k5M47J100J714K014J825J460
57715D03671J484J904K096J682R40K17m03o60r5J125J984J782J013O80J115J934
57699D20469K734L340L658L720L689L485K651R55j117k699l269k961k352k013
57685D30290j938j479j75J474K580L132L974N519P318R101J1342J4417J7991K1679
57671E25225K5598K9840L4101L8390M3237M8272N1009M7932L6868J8461l862k4959
57659H70112m0131m7581m8819m6353m1550l5119k8488k3246j9579j6441j3235
57648E09570j0316p945n841l959k812k639k889k842k241j226q4Q02J181J221J247
57633D71227J303J349J684K538L388L370K437J474J073Q52K73m56o82j56P19J388
$$ plain form
57731 402076 400458 399328 398221 396818 395545 395000 395093 395228 395136 395111 395558 396658 398372 400386 402211 403671
57715 403671 405155 407059 409155 410837 411777 411994 411591 410931 410836 411961 413945 415727 416740 417420 418535 420469
57699 420469 423203 426543 430201 433921 437610 441095 443746 444701 443584 440885 437616 434655 432303 430290
57685 430290 428352 426873 426698 428172 430752 433884 437858 443377 450695 459796 471138 485555 503546 525225
57671 525225 550823 580663 614764 653154 696391 744663 795672 843604 880472 898933 895071 870112
57659 870112 829981 782400 733581 687228 645678 610559 582071 558825 539246 522805 509570
57648 509570 499254 491309 485468 481509 478697 476058 473169 470327 468086 466860 466776 467578 468759 469980 471227
57633 471227 472530 473879 475563 478101 481489 484859 487296 488770 489843 490695 490968 490512 489830 489674 490393 491781
57617D91781J603J579J722K112K326K015J527J461J775J813J349R82J273J967
57603E15285K436K523K493K398J982J224O13O93J422K082J982J169L90K71P19
57588E37682J265J739K278K737K677K012J344J309J870K463K740K772K638K204
57574E67730J564J298J901K972L471K977K246K130K356K006J054O51J620L368
57560E97344M677N058M920M730M577M452M407M457M611M944N457N956O299O581
57546F68470O865O854O145M778L360K675L167M540N790N901M781L322K479K521
57532G31648L216M260N281N881O011O003N954N558M813M397M833N731O371O696
57518H06653P106P617P804P435O638N686N028N234O281P211P140O395N972O182
$$ plain form
57617 491781 493384 494963 496685 498797 501123 503138 504665 506126 507901 509714 511063 512045 513318 515285
57603 515285 517721 520244 522737 525135 527117 528341 528954 529647 531069 533151 535133 536302 536692 536963 537682
57588 537682 538947 540686 542964 545701 548378 550390 551734 553043 554913 557376 560116 562888 565526 567730
57574 567730 569294 570592 572493 575465 578936 581913 584159 586289 588645 590651 591705 592356 593976 597344
57560 597344 602021 607079 611999 616729 621306 625758 630165 634622 639233 644177 649634 655590 661889 668470
57546 668470 675335 682189 688334 693112 696472 699147 702314 706854 712644 718545 723326 726648 729127 731648
57532 731648 734864 739124 744405 750286 756297 762300 768254 773812 778625 783022 787855 793586 799957 806653
57518 806653 813759 821376 829180 836615 843253 848939 853967 859201 865482 872693 879833 886228 892200 898382
57504H98382O454O362O065N753N395N084N046N236N453N742O162O341N853M976
57490I78304M404M319M462M886N833O920P358P129P062P545Q031Q014P781P774
57476A069822P960Q141Q293Q286P808O884O068N827O181P000Q038Q736Q668Q307
57462A176019Q571R510J0229J0297J0255J0498J0632J0374J0118J0099R962R708
57450A296272J0040J1033J1486J0605R428R430J0459J1280J1553J1923J2484J2610
57438A428603J2280J2221J2545J2398J1415J0460J0428J1107J1752J2170J2627
57427A558006J3130J3427J3482J3461J3347J2951J2367J2141J2743J3928J4813
57416A703796J4767J4138J3821J4157J4675J4917J5040J5294J5470J5297J4978
$$ plain form
57504 898382 904836 911198 917263 923016 928411 933495 938541 943777 949230 954972 961134 967475 973328 978304
57490 978304 982708 987027 991489 996375 1002208 1009128 1016486 1023615 1030677 1038222 1046253 1054267 1062048 1069822
57476 1069822 1077782 1085923 1094216 1102502 1110310 1117194 1123262 1129089 1135270 1142270 1150308 1159044 1167712 1176019
57462 1176019 1184590 1194100 1204329 1214626 1224881 1235379 1246011 1256385 1266503 1276602 1286564 1296272
57450 1296272 1306312 1317345 1328831 1339436 1348864 1358294 1368753 1380033 1391586 1403509 1415993 1428603
57438 1428603 1440883 1453104 1465649 1478047 1489462 1499922 1510350 1521457 1533209 1545379 1558006
57427 1558006 1571136 1584563 1598045 1611506 1624853 1637804 1650171 1662312 1675055 1688983 1703796
57416 1703796 1718563 1732701 1746522 1760679 1775354 1790271 1805311 1820605 1836075 1851372 1866350
57405A866350J4852J4868J4851J4989J5448J5890J5930J5829J6139J6824J7381
57394B039351J7663J7883J7962J7656J7317J7752J9090K0464K1049K0941K0801
57383B247929K1110K1861K2541K2371K1100J9603J9102J9734K0507K0742K0704
57372B477304K0615K0060J8958J8286J9002K0730K2306K3243K3881K4365K4467
57361B713217K4329K4492K4983K5220K5049K5184K6143K7342K7875K7740K7653
57350B999227K7818K7716K7172K6844K7300K8078K8312K7992K7949K8592K9262
57339C306262K9152K8442K8048K8457K9244K9728K9751K9669K9720K9672K9102
57328C627247K7989K6930K6614K7135K8006K8806K9575L0412L1056L1188L0981
$$ plain form
57405 1866350 1881202 1896070 1910921 1925910 1941358 1957248 1973178 1989007 2005146 2021970 2039351
57394 2039351 2057014 2074897 2092859 2110515 2127832 2145584 2164674 2185138 2206187 2227128 2247929
57383 2247929 2269039 2290900 2313441 2335812 2356912 2376515 2395617 2415351 2435858 2456600 2477304
57372 2477304 2497919 2517979 2536937 2555223 2574225 2594955 2617261 2640504 2664385 2688750 2713217
57361 2713217 2737546 2762038 2787021 2812241 2837290 2862474 2888617 2915959 2943834 2971574 2999227
57350 2999227 3027045 3054761 3081933 3108777 3136077 3164155 3192467 3220459 3248408 3277000 3306262
57339 3306262 3335414 3363856 3391904 3420361 3449605 3479333 3509084 3538753 3568473 3598145 3627247
57328 3627247 3655236 3682166 3708780 3735915 3763921 3792727 3822302 3852714 3883770 3914958 3945939
57317C945939L0933L1175L1319L1108L0872L1105L1795L2398L2466L2085L1680
57306D292875L1539L1650L1947L2467L3193L3879L4265L4366L4427L4580L4832
57295D660020L5200L5645L5918L5829L5679L6018L6938L7939L8601L8910L8886
57284E065583L8400L7639L7250L7605L8228L8345L7717L6677L5714L5295L5694
57273E474147L6583L7194L7185L6997L6945L6598L5619L4640L4461L4812L4794
57262E869975L4282L3925L3943L3913L3679L3509L3311L2653L1703L1166L1124
57251F233183L0866L0160K9652K9582K9202K8061K6958K6776K7164K7224K6944
57240F545772K6967K7405K7843K8241K8884K9494K9283K8078K6641K5726K5339
$$ plain form
57317 3945939 3976872 4008047 4039366 4070474 4101346 4132451 4164246 4196644 4229110 4261195 4292875
57306 4292875 4324414 4356064 4388011 4420478 4453671 4487550 4521815 4556181 4590608 4625188 4660020
57295 4660020 4695220 4730865 4766783 4802612 4838291 4874309 4911247 4949186 4987787 5026697 5065583
57284 5065583 5103983 5141622 5178872 5216477 5254705 5293050 5330767 5367444 5403158 5438453 5474147
57273 5474147 5510730 5547924 5585109 5622106 5659051 5695649 5731268 5765908 5800369 5835181 5869975
57262 5869975 5904257 5938182 5972125 6006038 6039717 6073226 6106537 6139190 6170893 6202059 6233183
57251 6233183 6264049 6294209 6323861 6353443 6382645 6410706 6437664 6464440 6491604 6518828 6545772
57240 6545772 6572739 6600144 6627987 6656228 6685112 6714606 6743889 6771967 6798608 6824334 6849673
57229F849673K5032K4405K3205K1361J9205J7295J5802J4273J2210R665P106M821
57217G044053K681N63j246k259k459k476k838l309l388l222l402l855l660k311
57203G012872n10P15J144J143Q70L41j16j84j57n49j363k288l430n074o966q587
57187F987861j0139j2350j5155j7481j8676j9469k0965k3296k5798k8098l0343
57176F766091l2666l4924l7024l8959m0567m1666m2440m3325m4348m4849m4203
57165F321120m2691m1310m0607l9951l8328l5734l3315l1919l1011k9516k7381
57154E929357k5652k5047k5202k5543k6176k7514k9385l1142l2455l3518l4613
57143E613110l5934l7679l9739m1066l9916l5181k7528j9061j2077q135p797j0527
$$ plain form
57229 6849673 6874705 6899110 6922315 6943676 6962881 6980176 6995978 7010251 7022461 7032126 7039232 7044053
57217 7044053 7046734 7047297 7046051 7043792 7041333 7038857 7036019 7032710 7029322 7026100 7022698 7018843 7015183 7012872
57203 7012872 7012362 7013077 7014221 7015364 7016234 7016575 7016459 7016275 7016118 7015569 7014206 7011918 7008488 7003414 6996448 6987861
57187 6987861 6977722 6965372 6950217 6932736 6914060 6894591 6873626 6850330 6824532 6796434 6766091
57176 6766091 6733425 6698501 6661477 6622518 6581951 6540285 6497845 6454520 6410172 6365323 6321120
57165 6321120 6278429 6237119 6196512 6156561 6118233 6082499 6049184 6017265 5986254 5956738 5929357
57154 5929357 5903705 5878658 5853456 5827913 5801737 5774223 5744838 5713696 5681241 5647723 5613110
57143 5613110 5577176 5539497 5499758 5458692 5418776 5383595 5356067 5337006 5324929 5316794 5308997 5298470
57131E298470j4722j8484k0938k2760k5192k8631l2437l5859l8668m0879m2385
57120D977515m3075m2870m1438l8293l3592k8373k3443j8255j1525k854O947J7233
57108D717977K8568M2120N8504P7680R9773J25714J57183J96155K44391L03301
57098F051366L74371M59704N61813O82840Q23965R85230J165206J360617J566763
57089A4031875J778302J989394K193659K385204K558993K707194K813092K850622
57081C3308335K793845K628694K355410J981513J516929R78144L94022j97557
57073D5759335p61387j274032j723761k104834k412807k642971k790872k854183
57065B9194488k835385k743288k592013k398327k179203j950034j723239j507677
$$ plain form
57131 5298470 5283748 5265264 5244326 5221566 5196374 5167743 5135306 5099447 5060779 5019900 4977515
57120 4977515 4934440 4891570 4850132 4811839 4778247 4749874 4726431 4708176 4696651 4693797 4700744 4717977
57108 4717977 4746545 4788665 4847169 4924849 5024622 5150336 5307519 5503674 5748065 6051366
57098 6051366 6425737 6885441 7447254 8130094 8954059 9939289 11104495 12465112 14031875
57089 14031875 15810177 17799571 19993230 22378434 24937427 27644621 30457713 33308335
57081 33308335 36102180 38730874 41086284 43067797 44584726 45562870 45956892 45759335
57073 45759335 44997948 43723916 42000155 39895321 37482514 34839543 32048671 29194488
57065 29194488 26359103 23615815 21023802 18625475 16446272 14496238 12772999 11265322
57057A1265322j309180j131414r75948q42104p27665o30179n47488m77378m17383
57048D206583l65400l20161k80950k47006k17528j91948j69917j50925j34240
57039B128508j19234j05517r2703q0321o8237n6860m6488l6572k6087j4598k305
57028A479586J0837K4656L6332L9419K7623P51l3667o5172q6744r6914r7678r2026
57016A147003q2988p3172o4133n6279m9493m3613l8454l3881l0000k6906k4286
57005F23798k1702j9221j7358j6276j5579j4904j4300j3805j3186j2333j1464
56994D53670j0602r230o929m170k013r36l12Q39K851N307P739R979J1667J1720
56980D69580R011L657k712q286j2322j4872j5911j5470j4209j3006j1860r984
$$ plain form
57057 11265322 9956142 8824728 7848780 7006676 6279011 5648832 5101344 4623966 4206583
57048 4206583 3841183 3521022 3240072 2993066 2775538 2583590 2413673 2262748 2128508
57039 2128508 2009274 1903757 1811054 1730733 1662496 1605636 1559148 1522576 1496489 1481891 1479586
57028 1479586 1490423 1515079 1551411 1590830 1618453 1619204 1585537 1520365 1433621 1336707 1239029 1147003
57016 1147003 1064015 990843 926710 870431 820938 777325 738871 704990 674990 648084 623798
57005 623798 602096 582875 565517 549241 533662 518758 504458 490653 477467 465134 453670
56994 453670 443068 433838 426909 422739 420726 419790 419478 420317 423168 428475 436214 446193 457860 469580
56980 469580 478591 482248 479536 471250 458928 444056 428145 412675 398466 385460 373600 363616
56968C63616p078l911j328O33K442M370O501Q943J1661J4396J7043J9655K1722
56955D58665K1800J8429J1368J743q582j7517k3181k4803k3366k0873j8682j6657
56943C58344j3943j0352o661l674j167J841N765R771J2755J4826J7224K0828K5074
56930D30631K8326K8707K4711J5958L871q818j9694k7619l2255l3464l1723k8380
56918C50251k4809k1543j8538j5846j3488j1225q968p181o280n967n639n145m654
56905B00968m095l335k590k145j901j644j325o76Q29K996M585M886M992O408Q881
56890B16834J0934J2233J3889J6394J8738J9891J9709J7935J3749P271M05m859
56878C63123q275j0685j2295j2587j1350q898n554j794J532L903N904Q535J1977
$$ plain form
56968 363616 356538 352627 351299 351932 354374 358744 365245 374188 385849 400245 417288 436943 458665
56955 458665 480465 498894 510262 512005 503423 485906 462725 437922 414556 393683 375001 358344
56943 358344 344401 334049 327388 323714 322547 324388 330153 339924 352679 367505 384729 405557 430631
56930 430631 458957 487664 512375 528333 532204 523386 503692 476073 443818 410354 378631 350251
56918 350251 325442 303899 285361 269515 256027 244802 235834 228653 222373 216406 210767 205622 200968
56905 200968 196873 193538 190948 188803 186902 185258 183933 183257 184086 187082 191667 196553 201545 207953 216834
56890 216834 227768 240001 253890 270284 289022 308913 328622 346557 360306 367577 367982 363123
56878 363123 354848 344163 331868 319281 307931 299033 293479 291685 293217 297120 303024 311559 323536
56865C23536J5684J9442K3542K8049L2686L7291M1482M3701M1462L3160J9436
56854F59471K846j3371k6235l3868l6152l4518l0647k5504j9570j3435p567j816
56842D19634M272J0739J7244K3757L0690L8186M5830N3317O0795O7751P1714O8826
56830I12755N6264L4241O064k3104m7790o3959p0569o9655o4414n7132m8782l9900
56818E24019l1013k2368j4016o132J169Q254J5608K3084L0162L6908M3866N0659
56806F60200N5221N4760M7190L1862J0124j4172l5517m9494n5184n4932n1905
56795E98153m7928m3159l7150l0125k3274j7671j3101q464l386J354N220Q976
56783C89445J3609J8828K3318K6019K6305K3259J5978M879p936j9841k8923l4270
$$ plain form
56865 323536 339220 358662 382204 410253 442939 480230 521712 565413 606875 640035 659471
56854 659471 662317 648946 622711 588843 552691 518173 487526 462022 442452 429017 421450 419634
56842 419634 423906 434645 451889 475646 506336 544522 590352 643669 704464 772215 843929 912755
56830 912755 969019 1003260 1009324 986220 938430 874471 803902 734247 669833 612701 563919 524019
56818 524019 493006 470638 456622 450490 451659 459913 475521 498605 528767 565675 609541 660200
56806 660200 715421 770181 817371 849233 859357 845185 809668 760174 704990 650058 598153
56795 598153 550225 507066 469916 439791 416517 398846 385745 377281 373895 375249 380469 389445
56783 389445 403054 421882 445200 471219 497524 520783 536761 541640 533704 513863 484940 450670
56771D50670l5891l4664l1898k8619k5298k2125j9142j6187j3218j0648q942p906
56759A96132o959o041n599n555n140m092l286l558m423m681l937k853k059j542
56745A36407j141r18q62o77k35N0l29j255j932j664n96L31L21l57n77L01J518
56728A28385J779R20R2J18M10J7p77q24J54J192J540J587J819J750P66n27q08
56711A37593J93J372J773J604J455J364J135R74J118J202O88k49q73q94p98j029
56695A46628j386j363q17l9O28J006J063P97K18n84j303j490r61j27L62L41K75
56678A43248N33Q33O57N1l55j98J68K40Q3J35M34M99O3m12k52N82J420J688J518
56659A50935J482J848K275K301J996J920K365K883K815K145J491J288J400J474
$$ plain form
56771 450670 414779 380115 348217 319598 294300 272175 253033 236846 223628 212980 204038 196132
56759 196132 189173 183132 177533 171978 166838 162746 159460 155902 151479 146798 142861 140008 137949 136407
56745 136407 135266 134348 133486 132809 132574 132624 132295 131040 129108 127444 126848 127179 127500 127143 126566 126867 128385
56728 128385 130164 131084 131176 131294 131704 131721 130944 130120 130274 131466 133006 134593 136412 138162 138928 138401 137593
56711 137593 137786 139158 140931 142535 143990 145354 146489 147463 148581 149783 150471 150222 149349 148455 147657 146628
56695 146628 145242 143879 143062 143023 143651 144657 145720 146517 146735 146151 144848 143358 142397 142270 142632 142973 143248
56678 143248 143781 144614 145271 145322 144967 144769 144937 145177 145260 145395 145829 146328 146391 145979 145727 146309 147729 149417 150935
56659 150935 152417 154265 156540 158841 160837 162757 165122 168005 170820 172965 174456 175744 177144 178618
56645A78618J269N92n00j290q93M82J439J073J67mN74R65R13R42R92K38j424k781
56627A81372k797j952j500j933k691l026k673j938j388j306j307r12l76m01r70
56612A56202j235p73j62l8k88n77q51q24R1J645K381J313n96j625j397q54n27
56595A51885q2O44J205J329J198R05L79l8J78Q14R69L33l60m07LK98L33K57J06
56576A59949q4o1L04P82J126J422J812K194K442K746L392M382N433O293O861P158
56560B06151P302P481P739P837P406O259M585K833J345J36q87j551j585j205j154
56545B52692j867k836l228k881k348k104k130k216k261k205k004j708j433j304
56531B22167j465j954k413k321j695j230j315j404r23l48o31j735k619k650k289
$$ plain form
56645 178618 179887 180479 179979 178689 177796 178278 179717 180790 180957 180953 181527 182492 183405 184347 185339 185577 184153 181372
56627 181372 178575 176623 175123 173190 170499 167473 164800 162862 161474 160168 158861 157949 157573 157172 156202
56612 156202 154967 154194 154032 153994 153706 153129 152278 151454 151545 153190 155571 156884 156288 154663 153266 152412 151885
56595 151885 151803 152447 153652 154981 156179 157084 157463 157425 157603 158417 159386 159719 159359 158952 158955 159253 159586 159843 159949
56576 159949 159865 159804 160108 160890 162016 163438 165250 167444 169886 172632 176024 180406 185839 192132 198993 206151
56560 206151 213453 220934 228673 236510 243916 250175 254760 257593 258938 259074 258187 256636 255051 253846 252692
56545 252692 250825 247989 244761 241880 239532 237428 235298 233082 230821 228616 226612 224904 223471 222167
56531 222167 220702 218748 216335 214014 212319 211089 209774 208370 207447 207099 206468 204733 202114 199464 197175
56516A97175k188k318k285j961j531j240j272j588j805j547r30l57P3M94P49N32
56500A80001ml53m90q25j293j240m63L77O89P00Q26R02N97J16j33j83l31n16m23
56481A77954j7M12O55O99O08N09N83P98Q83P40O75R55J383J604J538J307R30M50
56463A92666J04Mr6l74m72N8R72J481J210N78K09K99O94J179J505J422R19L11
56445B02669o6j24P8N16J020J148N84l31q73q26p18j019j425j383r19m52l4N51
56427A98396J014P54ok39L65P88K44m75j53R61J599J406J228J515J675J245O05
56410B10922J05n74j583k229j772m73P68J459J697J659J428J103P07J62m19o56
56394B12304m11n1N4L8K39O64J009J069Q84O53O90J177J750J700Q20j64l28M67
$$ plain form
56516 197175 194987 192669 190384 188423 186892 185652 184380 182792 180987 179440 178510 178153 178226 178720 179469 180001
56500 180001 179997 179644 179154 178329 177036 175796 175333 175710 176399 177099 177925 178827 179424 179540 179407 179224 178893 178377 177954
56481 177954 177937 178349 179004 179703 180311 180820 181403 182201 183084 183824 184499 185454 186837 188441 189979 191286 192216 192666
56463 192666 192770 192774 192678 192304 191832 191890 192862 194343 195553 196131 196340 196639 197333 198512 200017 201439 202358 202669
56445 202669 202603 202479 202557 203073 204093 205241 205825 205494 204621 203795 203077 202058 200633 199250 198331 197879 197845 198396
56427 198396 199410 200164 200158 199919 200284 201072 201316 200841 200688 201649 203248 204654 205882 207397 209072 210317 210922
56410 210922 211027 210453 208870 206641 204869 204396 205164 206623 208320 209979 211407 212510 213217 213379 212960 212304
56394 212304 211893 211842 211896 211934 212173 212837 213846 214915 215799 216452 217142 218319 220069 221769 222589 222425 222097 222564
56376B22564J549K173K064J449P79L18q9o11q96k97J104K333K610K258K007J826
56360B41141J108j44r39m42R53J966J775Q04J64M00R61J030O25M95R73J462J306
56343B53638Q43J081K375L856M356L632K433J504R29N77O56J332K053K076J652
56328B82993J801K674L101K416J740K405L824M182K954J363L81k97j048j386q99
56313C06204j16L20N60J060J735K245K643L120L459L363L065L209M161N621O726
56298C47375O619N271L759L185L342L142K317J832K356L304L806L829L783L786
56284C97706L929M619N896O966P121O772O897P790Q916R725J0108J0265J0540
56271D97250J1191J2047J2713J3263J4291J6020J7967J9709K1493K3661K6158
$$ plain form
56376 222564 224113 226286 228350 229799 230578 230896 230807 230196 229300 229003 230107 232440 235050 237308 239315 241141
56360 241141 242249 242105 241166 240724 241677 243643 245418 246222 246386 246786 247747 248777 249402 249897 250870 252332 253638
56343 253638 254481 255562 257937 261793 266149 269781 272214 273718 274647 275224 275880 277212 279265 281341 282993
56328 282993 284794 287468 290569 292985 294725 297130 300954 305136 308090 309453 309834 309537 308489 307103 306204
56313 306204 306088 306408 306968 308028 309763 312008 314651 317771 321230 324593 327658 330867 335028 340649 347375
56298 347375 353994 359265 363024 366209 369551 372693 375010 376842 379198 382502 386308 390137 393920 397706
56284 397706 401635 406254 412150 419116 426237 433009 439906 447696 456612 466337 476445 486710 497250
56271 497250 508441 520488 533201 546464 560755 576775 594742 614451 635944 659605 685763
56260F85763K8946L2311L6277M0377M4492M9233N4987O1253O7559P4332Q2104
56249A257634R0413R8344J05618J12355J18163J22337J24635J25050J23148J18431
56239B396128J11004J01099Q8194P1583N1722L0204Q478j2725l2778n0928o6879
56228B695102q0890r2977j02506j08881j12317j13624j13370j11491j07798j02693
56218A648555r7047r1262q5021p8275p1957o6894o2462n7474n2128m7703m4276
56207H94056m0406l5488l0873k7732k5322k2476j9546j7474j5962j4010j1621
56196F33146r599q158p029o407o505o559n556l743k280j646j413j317j425j451
56182E70058r75j98L72O83Q61O00j46m08N98K064K579K276K535L770M945N313
$$ plain form
56260 685763 714709 747020 783297 823674 868166 917399 972386 1033639 1101198 1175530 1257634
56249 1257634 1348047 1446391 1552009 1664364 1782527 1904864 2029499 2154549 2277697 2396128
56239 2396128 2507132 2608231 2696425 2768008 2819730 2849934 2858412 2845687 2812909 2761981 2695102
56228 2695102 2614212 2521235 2418729 2309848 2197531 2083907 1970537 1859046 1751248 1648555
56218 1648555 1551508 1460246 1375225 1296950 1224993 1158099 1095637 1038163 986035 938332 894056
56207 894056 853650 818162 787289 759557 734235 711759 692213 674739 658777 644767 633146
56196 633146 623547 615389 608360 601953 595448 588889 583333 579590 577310 575664 574251 572934 571509 570058
56182 570058 569083 568885 569257 569940 570801 571401 571255 570847 571445 573509 576088 578364 580899 584669 589614 594927
56166E94927N350N643O079O403O685O951P149P569Q587R931J0951J1569J2279
56153G00073J3295J4439J5683J7121J8588K0062K2078K5087K8787L2813L7497
56142I45523M3002M8514N3484N9014O6404P4850Q2061Q6746Q8775Q7360Q1210
56131A716943P1017N9890N0727M4370M0566L8963L8371L6381L0925K1717R922
56120B159792k718j4193k2874k8717l3314l8430m4921n2868o1827p0636p7797
56109A711497q2249q3338q0435p3585o4393n5138m6870l9280l2185k6047k0955
56098A107022j6375j2089q434n542l164j276J20J554L486N289O007N897O019O504
56084A095018O577O201O237O923P598Q055Q848J0066J1113J1833J2733J3952J5067
$$ plain form
56166 594927 600277 605920 611999 618402 625087 632038 639187 646756 655343 665274 676225 687794 700073
56153 700073 713368 727807 743490 760611 779199 799261 821339 846426 875213 908026 945523
56142 945523 988525 1037039 1090523 1149537 1215941 1290791 1372852 1459598 1548373 1635733 1716943
56131 1716943 1787960 1847850 1898577 1942947 1983513 2022476 2060847 2097228 2128153 2149870 2159792
56120 2159792 2157074 2142881 2120007 2091290 2057976 2019546 1974625 1921757 1859930 1789294 1711497
56109 1711497 1629248 1545910 1465475 1391890 1327497 1272359 1225489 1186209 1154024 1127977 1107022
56098 1107022 1090647 1078558 1070124 1064582 1061418 1060142 1060262 1061816 1065302 1070591 1076598 1082495 1088514 1095018
56084 1095018 1101595 1107796 1114033 1120956 1128554 1136609 1145457 1155523 1166636 1178469 1191202 1205154 1220221
56071A220221J5986J6954J7809J8338J9024K0304K1420K1392K0700K0474K0463
56060A433085J9548J7910J6815J6517J6183J5833J6279J7339J8062J8701K0399
56049A626671K2860K4477K4889K5324K6308K7145K7883K9489L1761L3257L3651
56038A933715L4105L5004L5538L5801L7071L9537M1945M3864M6135M8815N0903
56027B382433N2351N4079N5823N6481N6632N8069O0714O2842O4449O7320P1480
56016C042673P4943P7409Q0755Q5179Q8549R0490R3443R8416J03305J06872J10809
56005D052843J16306J21964J26853J32400J39514J46998J54299J62693J72298
55996E326168J81234J89175J98304K09398K20501K30923K42831K57493K73709
$$ plain form
56071 1220221 1236207 1253161 1270970 1289308 1308332 1328636 1350056 1371448 1392148 1412622 1433085
56060 1433085 1452633 1470543 1487358 1503875 1520058 1535891 1552170 1569509 1587571 1606272 1626671
56049 1626671 1649531 1674008 1698897 1724221 1750529 1777674 1805557 1835046 1866807 1900064 1933715
56038 1933715 1967820 2002824 2038362 2074163 2111234 2150771 2192716 2236580 2282715 2331530 2382433
56027 2382433 2434784 2488863 2544686 2601167 2657799 2715868 2776582 2839424 2903873 2971193 3042673
56016 3042673 3117616 3195025 3275780 3360959 3449508 3539998 3633441 3731857 3835162 3942034 4052843
56005 4052843 4169149 4291113 4417966 4550366 4689880 4836878 4991177 5153870 5326168
55996 5326168 5507402 5696577 5894881 6104279 6324780 6555703 6798534 7056027 7329736
55987G329736K91271L11861L35208L58784L82653M10019M41697M75166N10552
55978A0846947N51847O00379O53137P09669P74433Q49916R34014J026984J134316
55969A8081642J260075J404666J572185J772406K012851K297565K637023L050349
55961C4088762L554993M165249M904908N810264O916660Q252836R846834J1715837
55953H9256343J3844253J6194450J8750958K1539882K4602485K7945025L1404342
55946B43537738L4340114L5349876L2528675K4516222J1703226l501533j7751043
55939C60723275k8380133l4360588l6150361l4939842l1981920k8262821k4420920
55932A42226690k0793866j7528678j4681950j2261272j0234501q550547p162458
$$ plain form
55987 7329736 7621007 7932868 8268076 8626860 9009513 9419532 9861229 10336395 10846947
55978 10846947 11398794 11999173 12652310 13361979 14136412 14986328 15920342 16947326 18081642
55969 18081642 19341717 20746383 22318568 24090974 26103825 28401390 31038413 34088762
55961 34088762 37643755 41809004 46713912 52524176 59440836 67693672 77540506 89256343
55953 89256343 103100596 119295046 138046004 159585886 184188371 212133396 243537738
55946 243537738 277877852 313227728 345756403 370272625 381975851 378474318 360723275
55939 360723275 332343142 297982554 261832193 226892351 194910431 166647610 142226690
55932 142226690 121432824 103904146 89222196 76960924 66726423 58175876 51013418
55925E1013418o027641n099460m334235l702082l181777k750921k389251k085370
55917B1442681j831738j617484j432375j272669j136604j018598r13350q21097
55909A1398766p43205o76463o16611n63469n17818m76917m37813m01730l70848
55900F593892l43660l17505k92817k71198k51920k33635k17044k02812j89419
55891D273882j75787j63355j53046j42965j31719j21080j12767j05539r8213r2696
55881B976715r1005r1725r2144r1680r0626q7979q3282p8462p5236p2596o9131
55870B052849o5692o3435o1375n8283n5020n2658n0263m6867m3636m1818m0344
55859A473458l7813l4980l3056l1370k9034k7149k6941k7283k6478k5041k4505
$$ plain form
55925 51013418 44985777 39886317 35552082 31850000 28668223 25917302 23528051 21442681
55917 21442681 19610943 17993459 16561084 15288415 14151811 13133213 12219863 11398766
55909 11398766 10655561 9979098 9362487 8799018 8281200 7804283 7366470 6964740 6593892
55900 6593892 6250232 5932727 5639910 5368712 5116792 4883157 4666113 4463301 4273882
55891 4273882 4098095 3934740 3781694 3638729 3507010 3385930 3273163 3167624 3069411 2976715
55881 2976715 2885710 2793985 2701841 2610161 2519535 2431556 2348274 2269812 2194576 2121980 2052849
55870 2052849 1987157 1923722 1862347 1804064 1749044 1696386 1646123 1599256 1555620 1513802 1473458
55859 1473458 1435645 1400665 1367609 1336239 1307205 1280056 1253115 1225832 1199354 1174313 1149808
55848A149808k4818k5074k5471k6366k6688k5362k3230k1685k0598j9300j8251
55837H92965j7964j7659j6688j5854j5702j5107j3373j1931j1992j2248j1165
55826G33282r706r450r626q730p588p975r289r513q655q345q671q195o831o014
55812F14694o055n716m529l366k689k086j496j126l26J614L744M436L925L888
55798F04912M598M467K561k26k870n288p394q595q829q882r217r379q860p799
55784E39199o791o704q319j1340j4055j4966j4303j3075j1445r223p195o272n803
55771D09708m419k292q69n81n51n72j483l270m526m408l772l694m123m541m968
55756C65639n587o144o455o870p734q749r295r098q398p653p126o583n618m394
$$ plain form
55848 1149808 1124990 1099916 1074445 1048079 1021391 996029 972799 951114 930516 911216 892965
55837 892965 875001 857342 840654 824800 809098 793991 780618 768687 756695 744447 733282
55826 733282 723576 714126 704500 695770 688182 680207 670918 661405 652750 644405 635734 627539 620708 614694
55812 614694 608639 602923 598394 595028 592339 590253 588757 587631 587305 588919 592663 597099 601024 604912
55798 604912 609510 613977 616538 616312 613442 608154 600760 592165 583336 574454 565237 555858 546998 539199
55784 539199 532408 525704 517385 506045 491990 477024 462721 449646 438201 428978 421783 415511 409708
55771 409708 405289 402997 402128 401547 400996 400424 398941 395671 391145 386737 382965 379271 375148 370607 365639
55756 365639 360052 353908 347453 340583 332849 324100 314805 305707 297309 289656 282530 275947 270329 265935
55742B65935l637l567l432k598j525j038j191j547j958k304k115j256m24j30J20
55727B39333P20Q83j16j415j717j386j837l156m000l682k883k170j340l91J80
55712B17023L37N74Q48N82o7j41O44J454J665J563J432R71R6o58r99j337j930
55695B22057k330k148j673j319j014n21J16P68J422J965K133J852J336Q31O44
55680B24119J188K461L581L536K357R93R0m78r82j403j701j847j680j249j165
55665B27820j924k971l146k085n27P29J517K024K443K936L433L502K938K204J781
55650B40674J418O73k10p63j244k225l554m639n417o064o136n193m021l839m443
55635A95017m467l531k666k475k325j803j505j807k023j526o92q5L47O64M20n29
$$ plain form
55742 265935 262298 258731 255299 252701 251176 250138 248947 247400 245442 243138 241023 239767 239343 239213 239333
55727 239333 240053 240936 240820 239405 237688 236302 234465 231309 227309 223627 220744 218574 217234 216843 217023
55712 217023 217360 217934 218782 219364 219297 219156 219800 221254 222919 224482 225914 226885 226981 226323 225324 223987 222057
55695 222057 219727 217579 215906 214587 213573 213052 213168 213936 215358 217323 219456 221308 222644 223475 224119
55680 224119 225307 227768 231349 234885 237242 238235 238325 237847 236865 235462 233761 231914 230234 228985 227820
55665 227820 225896 222925 219779 217694 217167 217896 219413 221437 223880 226816 230249 233751 236689 238893 240674
55650 240674 242092 242765 242555 241792 240548 238323 234769 230130 224713 218649 212513 207320 203299 199460 195017
55635 195017 190550 187019 184353 181878 179553 177750 176245 174438 172415 170889 170197 170112 170459 171123 171543 171014
55619A71014j489j871j943k063j927j303p39p87j019o86RP9q97k222k843k367
55603A48946j313n17k45JN93R93M55p58j585j553j172r09o58m05m30n51j13R12
55585A41691J620J487J184J499K223K686K865L186L768M468N324O395P436Q154
55571A93986Q570Q730Q434P556O334N008L535J860P9j865m166o575q311q924q794
55556B05457q532q260p758o888n623m078k744k161k229k344k271k287k311j759
55542A46212n97L27M54K58L39N21M75M86Q62J127O81j73o42n80m79n95p09p16
55524A47251q58j397k357l439l977l446k250j535j779k092j554n70j88n21p51
55509A20537n03k57m23p88j048j205j251j009m84jK18K99L76L48J27r2m0J76J15
$$ plain form
55619 171014 169525 167654 165711 163648 161721 160418 159679 158892 157873 157187 157196 157275 156378 154156 151313 148946
55603 148946 147633 147116 146871 146872 147465 148458 148913 148155 146570 145017 143845 142936 142278 141873 141443 140892 140779 141691
55585 141691 143311 144798 145982 147481 149704 152390 155255 158441 162209 166677 172001 178396 185832 193986
55571 193986 202556 211286 219720 227276 233610 238618 242153 244013 244092 242227 238061 231486 223175 214251 205457
55556 205457 196925 188665 180907 174019 168396 164318 161574 159413 157184 154840 152569 150282 147971 146212
55542 146212 145615 145942 146396 146654 146993 147514 147989 148475 149337 150464 151145 150972 150330 149750 149271 148676 147967 147251
55524 147251 146393 144996 142639 139200 135223 131777 129527 127992 126213 124121 122567 121997 121809 121288 120537
55509 120537 120034 119777 119354 118566 117518 116313 115062 114053 113569 113568 113786 114085 114461 114809 114936 114844 114804 114980 115095
55490A15095m43j054r76j10P17O86k4o83j137j800k537k490j311J90J094J404
55474A06621J515J347P27J23J02L67J15p17j341j265q92p95r68r95o82k26K2j02
55456A02956l91m17MN33O86M15K19O19J647K698K943K035N12o72j057r52q40q51
55438A10087r00r55r92q94n67k7O64J324J570J130K36o09j187j451j125o2J045
55421A07287J192M27q5L37J044J200R45Q70R89R69Q09O26J64p34j508j406n40
55404A12586J47l4q01j299j007l44k97j194k084j851p75q2n3K67J237J838J328
55387A07582M54J02o8n67p42J24J200J097K5n26KO95P72L75j95q22j121p95m64
55368A07128j001k019k281j637j248j608j752r74k5J85O9N27J394J697J066J07
$$ plain form
55490 115095 114652 113598 112622 112512 113229 113915 113891 113208 112071 110271 107734 105244 103933 104123 105217 106621
55474 106621 108136 109483 110210 110333 110435 110802 110917 110200 108859 107594 106702 105907 104939 103944 103262 103036 103058 102956
55456 102956 102565 102148 102152 102685 103371 103786 104005 104624 106271 108969 111912 113947 114459 113787 112730 111778 110938 110087
55438 110087 109187 108232 107240 106346 105779 105752 106416 107740 109310 110440 110676 110067 108880 107429 106304 106242 107287
55421 107287 108479 108906 108821 109158 110202 111402 112347 113217 114206 115175 115984 116610 116774 116040 114532 113126 112586
55404 112586 112733 112699 111898 110599 109592 109248 108951 107757 105673 103822 103047 102965 102912 103179 104416 106254 107582
55387 107582 108036 108138 108070 107503 106761 106885 108085 109182 109207 108681 108683 109378 110150 110525 110330 109508 108387 107592 107128
55368 107128 106127 104108 101827 100190 98942 97334 95582 94608 94583 94768 94837 95364 96758 98455 99521 99628
55352I9628m75m82j38J95K90K72L90N23K91k26m23j5M97N67L28K45L62L56P7k72
55332A01990m16k80p2r9k95j39O48J406J194P7q49q38k62K03M59O75P13L47k18
55313A04244n56n00k05L9q2o65j264j245o19q1k2M0O49J480J707R95j72j005r76
55294A01762j54P68J029O48M17Q75J631J902J438N70k63p13n52J38Q85J215J003
55277A12599L71m61j131j329j254j402j785j743q92K22P91N94n5q17j277r72j9
55260A01440P03O12K37L07N53J74p56j341j196p96m47J11Q71J234R54O27P53R63
55242A05003P11K40J51L88L59j15n86o87n49m03k35L7L13M30L50J35j89n89r70
55223A03794j217j205q46k09L97O18L84K5p3J54M22M52K43L5QQ7P4r6l22n10o35
$$ plain form
55352 99628 99153 98671 98533 98728 99018 99290 99680 100203 100494 100268 99845 99830 100327 100894 101222 101467 101829 102185 102262 101990
55332 101990 101574 101294 101222 101123 100828 100689 101337 102743 103937 104014 103165 102327 102065 102268 102727 103402 104115 104462 104244
55313 104244 103688 103188 102983 103022 102940 102275 101011 99766 99147 99066 99044 99084 99733 101213 102920 103915 103743 102738 101762
55294 101762 101608 102376 103405 104053 104470 105345 106976 108878 110316 110886 110623 109910 109358 109496 110381 111596 112599
55277 112599 112970 112509 111378 110049 108795 107393 105608 103865 102973 103195 103986 104580 104525 103708 102431 101459 101440
55260 101440 102143 102755 102992 103299 103852 104026 103270 101929 100733 99937 99490 99601 100472 101706 102660 103287 104040 105003
55242 105003 105714 105954 106105 106493 106852 106737 106151 105464 104915 104512 104277 104314 104627 105057 105407 105542 105353 104764 103794
55223 103794 102577 101372 100526 100317 100714 101332 101716 101741 101668 101822 102244 102696 102939 102974 102982 103069 103143 103047 102725 102215 101580
55202A01580n85j76N69J288J604J505J236R07M52q1m68o34p42q92r24o74k29J96
55184A03932N14P10P21M85P2l66n74k16P82J745J615K16j303j689j034l62j42
55167A05106K0L00K49k90p09m49K49Q92J403J764J572N58p47j523j609j426j169
55150A04191o79N0P37J183J338J062K88o26j151j149q29k54O11J471J798J452
55134A09493Q09K29j88l66k26L8M5k55n17n26m04k55kK80K99pk71k09k8q3k65
55113A07591q0O97J574J711Q02m69j097q93n80o32n64J74J094J279P61M62P52
55096A12582J057J005J077J600J931J304l0j106j417j199p38m1P88J336J245O27
55080A20021k7l48m36n97q00o36l3L88J24l84l47J20J89k68m35M4M44K61J69Q75
$$ plain form
55202 101580 100995 100819 101388 102676 104280 105785 107021 107928 108380 108299 107831 107197 106455 105563 104639 103965 103736 103932
55184 103932 104446 105156 105877 106362 106434 106068 105494 105278 106060 107805 109420 109636 108333 106644 105610 105248 105106
55167 105106 105126 105426 105675 105385 104676 104227 104476 105368 106771 108535 110107 110665 109918 108395 106786 105360 104191
55150 104191 103512 103562 104299 105482 106820 107882 108170 107544 106393 105244 104415 104161 104772 106243 108041 109493
55134 109493 110302 110531 110343 109977 109751 109789 109834 109579 109062 108536 108132 107877 107875 108155 108454 108447 108176 107967 107939 107856 107591
55113 107591 107511 108208 109782 111493 112295 111826 110729 109836 109256 108624 108060 108234 109328 110607 111368 111830 112582
55096 112582 113639 114644 115721 117321 119252 120556 120526 119420 118003 116804 116066 116025 116813 118149 119394 120021
55080 120021 119994 119646 119210 118613 117813 117177 117144 117532 117656 117272 116925 117045 117234 116966 116531 116575 117019 117280 117449 118324
55060A18324J709J446J42q73p54j9M15L11rk53l79n08p93j155j211p47j87j19
55042A15340m13l32L91J097J032K81m23n62k73p7l56j006j499j372p76l54n09
55025A10189r22r28k03R57J932K247J844J112N81N03P06Q54P74M95Q1l66o00l63
55007A18893K73P94P30J89k40j45L71R37J300J298Q32M9o27r05q83p45m69r0O7
54988A21629j59l75j57J84N0m29n27q0K58P6k24k78l41o59q63n75p5K20M54R00
54968A19029J191P85n7m56j2Q28J503J811J675J048J61n30q55j049j280j349r66
54951A21477j17Q90J602J663J068J84n71r54p92l5Q98J229P21J45L05Q96R87M70
54933A30066K64R67K045K649K690K669K856L115L315L549L874M111M016L601L162
$$ plain form
55060 118324 120033 121479 121621 120748 119994 119975 120390 120701 120692 120439 120060 119552 118759 117604 116393 115646 115459 115340
55042 115340 114927 114595 114986 116083 117115 117396 116973 116411 116138 116061 115705 114699 113200 111828 111052 110698 110189
55025 110189 109267 108339 108136 109093 111025 113272 115116 116228 116809 117312 118018 118872 119646 120141 120222 119856 119256 118893
55007 118893 119166 119960 120690 120879 120639 120494 120865 121802 123102 124400 125232 125281 124654 123749 122866 122121 121652 121562 121629
54988 121629 121470 121095 120938 121122 121172 120743 120216 120136 120394 120470 120246 119968 119627 118968 118105 117530 117455 117675 118129 119029
54968 119029 120220 121005 120948 120492 120480 121308 122811 124622 126297 127345 127506 126976 126121 125072 123792 122443 121477
54951 121477 121360 122250 123852 125515 126583 126767 126196 125242 124450 124415 125313 126542 127263 127408 127713 128609 129596 130066
54933 130066 130330 131297 133342 135991 138681 141350 144206 147321 150636 154185 158059 162170 166186 169787 172949
54918A72949K941K742K099Q70n41j740k736l616m143m141l966m087m312m007l047
54903A45265j975j252q87q29j077j288r44j85J39l61r27o34L55J058R91O17O15
54886A38681J120J817K452L010L531L863L781L365L124L422L946M021L435K515
54872A82083J408j29k063l713m464m474m302m202m091l905l572k936k123j633
54858A41884j652j605r14P3M82K6q93k001l192l891l300j651l05j90p51r78q25
54841A20317q82j113q30P1P39M38m87j052p66J7O72R41R56Q53O12L16K93O93J059
54822A22847Q23K37J83Q39J159L24r10j166m14O9l19o69r7R31J404J186Q52O09
54804A27888K68o0m8J69J59k8Q7N33P56M72O2o6k4q1j73n2L23P62R91P79K19j34
$$ plain form
54918 172949 175890 178632 180731 181601 181060 179320 176584 172968 168825 164684 160718 156631 152319 148312 145265
54903 145265 143290 142038 141151 140322 139245 137957 137013 136828 136967 136606 135679 135045 135400 136458 137449 138066 138681
54886 138681 139801 141618 144070 147080 150611 154474 158255 161620 164744 168166 172112 176133 179568 182083
54872 182083 183491 183362 181299 177586 173122 168648 164346 160144 156053 152148 148576 145640 143517 141884
54858 141884 140232 138627 137713 137786 138268 138294 137401 135400 132208 128317 125017 123366 123061 122871 122120 121142 120317
54841 120317 119435 118322 117492 117563 118302 118740 118253 117201 116435 116452 117124 118065 119021 119874 120486 120802 121095 121788 122847
54822 122847 123670 123907 124090 124929 126088 126412 125502 124336 123922 123991 123672 123003 122906 123837 125241 126427 127279 127888
54804 127888 128156 128096 128048 128217 128376 128348 128435 128968 129724 130196 130258 130192 130168 130087 129914 129862 130185 130947 131938 132717 132936 132802
54782A32802J86R07J323J207R85R45R65J126J848L117M188M587M763N195N511
54767A69655N117M325L997M296M541M170L196J744j50k188l834m827n300n393
54753A79349n147m743m387l994l448l067l159l173k187m42M86m40k269l174k520
54738A37685j181j35M75R45J460K085K756L097K667J663R95J358K445L424L949
54723A63688M340M852N174M802L622J975K43j379k830m030m802m987m645m166
54709A61857l956m020l983l636l075k278j021M15R98Q7j427j977j250l96k27k46
54693A35865J54M71k7r10j056k86M63M52j34q11j318j411q51P9N91K96k91m19
54675A30857L4N98Q09N08j86q88j059m31O25J284J002Q3n66l59L01N42J64j99
$$ plain form
54782 132802 132988 133895 135218 136425 137410 138355 139320 140446 142294 145411 149599 154186 158949 164144 169655
54767 169655 174772 179097 183094 187390 191931 196101 199297 201041 200891 198703 194869 190042 184742 179349
54753 179349 174202 169459 165072 161078 157630 154563 151404 148231 146044 145602 146088 145648 143379 140205 137685
54738 137685 136504 136369 136844 137789 139249 141334 144090 147187 149854 151517 152512 153870 156315 159739 163688
54723 163688 168028 172880 178054 182856 186478 188453 188696 187317 184487 180457 175655 170668 166023 161857
54709 161857 157901 153881 149898 146262 143187 140909 139888 140303 141301 141388 139961 137984 136734 136338 136111 135865
54693 135865 136019 136490 136463 135553 134497 134211 134674 135126 134992 134181 132863 131452 130601 130680 131271 131567 131276 130857
54675 130857 130891 131489 132298 132806 132620 131732 130673 130242 130867 132151 133153 133236 132670 132311 132612 133154 133318 133119
54657A33119j79l04j034j736j421k66N59N44M09P99J283J164N80J80J09L1j70
54640A33667k91l51o37j134j405j181p66n88n86l03M52J251J527J240Q69P20N83
54623A33067J55l93o06l77m5N6q2k56k92j18J61L60M45O25R35R97M89k66o10l74
54603A33871NJ43Q5J6LL6J3k51o23n03L71J127O44p90j560q20L71N57k73j004
54583A31418j052q20p54p68o37l67m9K54M43M64M53N41O33N94N31O22P26N33R4
54564A32859j45J24O62R83R05P15P77J011R50L49l91o71l83J05N51R77J226R58
54546A41562K11m55o50n61m87l77r2L14Q65J745K684K796J599j18j048q37k77
54529A46874j27l52n20n12n62q68j307j506j244p92n91n74k15N60R95M19p36j423
$$ plain form
54657 133119 132940 132636 131602 129866 128445 128179 128738 129282 129691 130490 131773 132937 133517 133697 133806 133837 133667
54640 133667 133376 133025 132388 131254 129849 128668 127902 127314 126728 126425 126877 128128 129655 130895 131764 132484 133067
54623 133067 133222 132829 132223 131846 131801 131857 131775 131519 131227 131109 131270 131630 132075 132700 133635 134632 135121 134855 134245 133871
54603 133871 133876 134019 134104 134120 134123 134159 134172 133921 133298 132795 133166 134293 134937 134147 132587 131767 132138 132695 132422 131418
54583 131418 130366 129546 128792 128024 127387 127020 126971 127225 127668 128132 128585 129126 129759 130353 130884 131506 132232 132765 132859
54564 132859 132714 132838 133500 134483 135388 136103 136880 137891 138841 139190 138799 138128 137745 137850 138401 139378 140604 141562
54546 141562 141773 141318 140668 140107 139620 139243 139151 139465 140330 142075 144759 147555 149154 149036 147988 147151 146874
54529 146874 146747 146395 145875 145363 144801 143933 142626 141120 139876 139084 138493 137919 137704 138264 139259 139678 138942 137519
54511A37519j200n07J01M22L97K9m10n21k26J55L31L01J95J35J51J31o4k76r6
54492A36567M52O81J60n23m64K88Q43P96O64R32J363J490J266R09N12J25p4M5
54474A46032L73P42J069J262J201R18N79K22k27o64p92m63J55P16Q75L91n79j414
54456A50396j584j215p89m29N0M74L83j50m69k99j74n25q79n18M36J078P98j37
54438A46447r52j085n86QK00K5j38j44k16m33m92j93K36N32P96J179J545J710
54420A48439J799J914J719P90o71j857k087j325j32O61M43n81j356r59M20J710
54404A48927K180K014J720J441J055O42M83P14J174J567J666J416R80N95L97L11
54388A67282J81j5j85l15n45j009j539j711j324p49n49p38p16n6Q44J248R68M23
$$ plain form
54511 137519 136319 135812 135913 136335 136732 136761 136351 135830 135604 135759 136090 136391 136586 136721 136872 137003 136939 136663 136567
54492 136567 137019 137700 137860 137337 136873 137161 138004 138800 139464 140396 141759 143249 144515 145424 145936 146061 145987 146032
54474 146032 146405 147147 148216 149478 150679 151597 152176 152398 152171 151507 150715 150252 150407 151123 151998 152389 151810 150396
54456 150396 148812 147597 146808 146379 146429 146903 147286 147136 146667 146368 146194 145669 144790 144272 144708 145786 146584 146447
54438 146447 145495 144410 143824 143832 144032 144057 143919 143775 143559 143126 142634 142441 142677 143209 144005 145184 146729 148439
54420 148439 150238 152152 153871 154661 153990 152133 150046 148721 148589 149250 149693 149112 147756 146797 147217 148927
54404 148927 151107 153121 154841 156282 157337 157979 158462 159176 160350 161917 163583 164999 165979 166574 166971 167282
54388 167282 167463 167448 167263 166948 166403 165394 163855 162144 160820 160071 159522 158784 158068 158012 158856 160104 161072 161495
54370A61495o4n43r26p34K59J449J925J558J093J097J286J076M65l9j48j6J91
54353A69424N32R41J126R66P76R21J383J891K298K563K559K190J590R81L66l45
54337A90162j023j409j501j585j905k456k994l065k260p84M00M99j48n58m76n46
54321A70351j038j212m74N04N63l51j123r58k60N9l23r94j354j169p03m76p78
54304A60264j372j783j808j506q60J96J333J855J395L62n11r05r17o53j44L65
54288A55311N02K43%J21M44N81M01J01j42l32m88n68n64n09l30J36Q60J465J596
54269A58828J359J198J270J178M85n97j260r52N4J012J500J592J413R07J65l78
54253A67774l82M2N96J181J664J623Q00k77p87o74o13q26p11K2O15K54p12j245
$$ plain form
54370 161495 161431 160888 159962 159228 159487 160936 162861 164419 165512 166609 167895 168971 169436 169397 169249 169233 169424
54353 169424 169956 170897 172023 172989 173765 174686 176069 177960 180258 182821 185380 187570 189160 190141 190507 190162
54337 190162 189139 187730 186229 184644 182739 180283 177289 174224 171964 171180 171580 172079 171931 171373 170897 170351
54321 170351 169313 168101 167627 168131 168694 168343 167220 166262 166002 166061 165738 164744 163390 162221 161518 161042 160264
54304 160264 158892 157109 155301 153795 152935 153131 154464 156319 157714 158076 157565 156660 155743 155090 154946 155311
54288 155311 155813 156056 156056 156177 156621 157202 157603 157704 157562 157230 156742 156174 155610 155101 154771 154907 155767 157232 158828
54269 158828 160187 161385 162655 163833 164318 163721 162461 161509 161563 162575 164075 165667 167080 167987 168152 167774
54253 167774 167392 167434 168030 169211 170875 172498 173298 173021 172234 171560 170947 170121 169410 169432 170047 170301 169589 168344
54235A68344j012n88m55m57l24r5R0K03J65j41o12r45r87q19m73P0O39R45R35
54216A64483P23K57n64j394j583r82j85K03K47L60O50Q55P47M53L53O85J089P51
54198A67148o35k158k480j423j51L71M27O41P94K54p28j136n99M4j01p96j097
54181A58375o95k15k11l22J57J144J756J457O85J16j96m40l90J95O99K08j060
54164A61263j725r80L99J152R45K29o15j311j358n17N77J015P18L77M24O29O88
54147A61910O26N23K93j28o41j117j374j123l06O43J151J158J004P90L31k57m47
54130A63036k9M87N08J27j7M29J111J391J047N01K56K79J28k23j64O31J474J437
54112A72409O74K28N19P52J50q66j218n22O22J439J623J241N11k19n74m08P7N26
$$ plain form
54235 168344 167332 166744 166289 165832 165508 165413 165503 165706 165871 165730 165118 164173 163186 162367 161894 161964 162603 163548 164483
54216 164483 165206 165463 164899 163505 161922 160940 160755 160958 161205 161565 162215 163070 163817 164270 164623 165308 166397 167148
54198 167148 166513 164355 161875 160452 160301 160672 161099 161740 162534 162788 162060 160924 160325 160369 160268 159472 158375
54181 158375 157680 157465 157254 156932 157089 158233 159989 161446 162131 162247 162051 161611 161221 161416 162115 162323 161263
54164 161263 159538 158558 158957 160109 161054 161283 160668 159357 157999 157482 158059 159074 159792 160169 160593 161222 161910
54147 161910 162536 163059 163352 163224 162583 161466 160092 158969 158663 159306 160457 161615 162619 163409 163740 163483 163036
54130 163036 163007 163494 164002 164129 164112 164541 165652 167043 168090 168591 168847 169126 169254 169031 168867 169498 170972 172409
54112 172409 173083 173311 173830 174582 174732 173866 172648 172126 172748 174187 175810 177051 177562 177343 176769 176361 176438 176964
54094A76964O65M39L9k54l25l17l95n42o60p23p02m48J16P64J164J266J280J306
54076A79637J219R69P21O37P55J130J855K711L150K885K297J921J769J612J695
54061B04963K582M169N535O080O298O952P867Q116P104M992K167j043m125o357
54047B55300p258o808n320l373j744q91m46K88J379K242K604K823L090K989K284
54032B47159J571J655K607L776M475M357L449K268J570J567J662J248N31J61K74
54017B78330L67q7j205k689l829l908l036k334k791m041m831m494l475k571k205
54002B37201k413k917l158k765j991j357r33m30R4J70l86j249k066k656k761k184
53986B10199j225m88j80p7p7k11j54M86J284J340O44K15N16P68M02J73R62K259
$$ plain form
54094 176964 177629 178068 178107 177853 177528 177211 176816 176274 175614 174891 174189 173741 173857 174621 175785 177051 178331 179637
54076 179637 180856 181825 182546 183183 183938 185068 186923 189634 192784 195669 197966 199887 201656 203268 204963
54061 204963 207545 211714 217249 223329 229627 236579 244446 252562 259666 264658 266825 265782 261657 255300
54047 255300 248042 241234 235914 232541 230797 229906 229460 229748 231127 233369 235973 238796 241886 244875 247159
54032 247159 248730 250385 252992 256768 261243 265600 269049 271317 272887 274454 276116 277364 277895 278056 278330
54017 278330 278697 278610 277405 274716 270887 266979 263943 261609 258818 254777 249946 245452 241977 239406 237201
54002 237201 234788 231871 228713 225948 223957 222600 221667 221237 221331 221501 221115 219866 217800 215144 212383 210199
53986 210199 208974 208486 208306 208229 208152 207941 207787 208273 209557 210897 211541 211756 212272 213040 213442 213615 214577 216836
53968B16836K932L028L574M851O009O359O045N280L904K056M19o20j460k492l400
53953B53321l736l639l486l138k181p10O50J409J532J227Q25P67J218J722J660
53938B47441J161J063J857L037L784L869L563L040K375J990K412L459M205M019
53924B87275L365L142L512L810L595L359L993N680P565Q557Q439Q132Q751J0400
53910C69575J2102J2992J3250J3602J4135J4048J2575R642N540N13m976r925j3301
53897D49772j4901j5289j4990j4077j2676j1358j0635j0256r458q015o663o193
53885C15261o372o136m940l465k797l136l706l831l654l642l751l543k929k411
53871B60948k455k882l161l077k859k685k426k024j832k250l076l546l116k030
$$ plain form
53968 216836 219768 222796 226370 231221 237230 243589 249634 254914 258818 260874 261293 260673 259213 256721 253321
53953 253321 249585 245946 242460 239322 237141 236431 237081 238490 240022 241249 242074 242841 244059 245781 247441
53938 247441 248602 249665 251522 254559 258343 262212 265775 268815 271190 273180 275592 279051 283256 287275
53924 287275 290640 293782 297294 301104 304699 308058 312051 317731 325296 333853 342292 350424 359175 369575
53910 369575 381677 394669 407919 421521 435656 449704 462279 471921 477461 477974 472998 463073 449772
53897 449772 434871 419582 404592 390515 377839 366481 355846 345590 336132 328117 321454 315261
53885 315261 308889 302753 297813 294348 291551 288415 284709 280878 277224 273582 269831 266288 263359 260948
53871 260948 258493 255611 252450 249373 246514 243829 241403 239379 237547 235297 232221 228675 225559 223529
53857B23529j013n48n40n92m92l66m47p44j025j140j198j298j273r87p12q48j260
53840B09046j337q15j73M7p0n7K77P30J080J237J127P16J07n04r29r63n21J20
53822B09118M84M76M78O68P11M18K78P48J394J452J073J248K377L657M132L775
53806B32487L223K888K722K619K614K772L081L423L641L673L675L795L872L577
53792B78062K889K181J821J807J874J737J262N11l67j311k320l129l302k839k414
53777B76462k509k739k517k127k356l183l733l610l388l494l470k893k302k449
53763B35692l091l261k548j430n08J0N5m52j259j743j539r61o56r01j458j940
53747B14010k095j754q81J61O70L46j84l9P13J053L98n75q64l32N28J402K033
$$ plain form
53857 223529 222516 221968 221428 220836 220344 219978 219531 218787 217762 216622 215424 214126 212853 211866 211154 210306 209046
53840 209046 207709 206894 206721 206768 206698 206641 206918 207648 208728 209965 211092 211808 211915 211411 210482 209519 208998 209118
53822 209118 209602 210078 210556 211224 211935 212353 212631 213379 214773 216225 217298 218546 220923 224580 228712 232487
53806 232487 235710 238598 241320 243939 246553 249325 252406 255829 259470 263143 266818 270613 274485 278062
53792 278062 280951 283132 284953 286760 288634 290371 291633 292144 291777 290466 288146 285017 281715 278876 276462
53777 276462 273953 271214 268697 266570 264214 261031 257298 253688 250300 246806 243336 240443 238141 235692
53763 235692 232601 229340 226792 225362 224854 224864 224919 224467 223208 221465 219926 218965 218309 217408 215950 214010
53747 214010 211915 210161 209280 209441 210111 210457 210273 210234 210947 212000 212398 211823 210959 210627 211155 212557 214590
53730B14590J819N00r84j284l03Q18J301J461J757K114K405K707K754K058Q86
53715B32599K81O51J168J039O28P28J422K232K798K854K266J551J692K818L767
53700B58494L577K712K110J897J847K290L454M540M606L875L107K259R18l65o58
53685B94663l26o05j569j982j421r64j296j537p24N55J028M24m89j079j258j097
53669B82323o81k07J56L89M05N8m37o18m57m45o91n78K24R47N95p12j841j951
53651B76479j173j55N85Q76Q61Q43R22Q06K02o05r23m35M02R20J034J276J975
53634B83890K706K759K021J057L87P7J38P34J728K471K558K417K669L191L342
53619C12145K936K392K150K377L079L938M277L784L055K849L031K998K763K807
$$ plain form
53730 214590 216409 216909 215925 214641 214338 215156 216457 217918 219675 221789 224194 226901 229655 231713 232599
53715 232599 232880 233531 234699 235738 236366 237094 238516 240748 243546 246400 248666 250217 251909 254727 258494
53700 258494 262071 264783 266893 268790 270637 272927 276381 280921 285527 289402 292509 294768 295686 295321 294663
53685 294663 294337 293732 292163 290181 288760 287796 286500 284963 284239 284794 285822 286246 285757 284678 283420 282323
53669 282323 281642 281435 281591 281980 282385 282443 282006 281388 280931 280486 279795 279217 279441 280388 280983 280271 278430 276479
53651 276479 275306 275151 275736 276612 277473 278316 279238 280044 280246 279641 278718 278283 278685 279605 280639 281915 283890
53634 283890 286596 289355 291376 292433 292820 292897 293035 293769 295497 297968 300526 302943 305612 308803 312145
53619 312145 315081 317473 319623 322000 325079 329017 333294 337078 340133 342982 346013 349011 351774 354581
53605C54581L062L074L052L584M333M279L408K961L504M070L838L483L924M743
53591D05896M905M336L721L259K630J806R80m0j508l066m165m910n726o388o263
53576C95467n397m514l956l367k536j837j625j763j907j889j674j235o24mM18
53561C63557L74k30r54j004j72P51R05M04M4L23J237K588L875M207L221J794J143
53544C82063J291J299Q99R50K042L501M207L862L104K808L441M810O135O711O547
53529D33670O195O114O569P798R616J1036J1155J0426J0204J0949J1738J1884
53517E47354J1982J2841J4189J5200J5777J6497J7612J8779J9649K0188K0554
53506G30622K0942K1438K1692K1133J9774J8500J8106J8338J8339J7752J6930
$$ plain form
53605 354581 357643 360717 363769 367353 371686 375965 379373 382334 385838 389908 393746 397229 401153 405896
53591 405896 410801 415137 418858 422117 424747 426553 427533 427493 425985 422919 418754 413844 408118 401730 395467
53576 395467 390070 385556 381600 378233 375697 373860 372235 370472 368565 366676 365002 363767 363143 363139 363557
53561 363557 363931 363701 362747 361743 361571 362322 363227 363631 363675 363998 365235 367823 371698 375905 379126 380920 382063
53544 382063 383354 384653 385552 386502 388544 392045 396252 400114 403218 406026 409467 414277 420412 427123 433670
53529 433670 439865 445979 452548 460346 469962 480998 492153 502579 512783 523732 535470 547354
53517 547354 559336 572177 586366 601566 617343 633840 651452 670231 689880 710068 730622
53506 730622 751564 773002 794694 815827 835601 854101 872207 890545 908884 926636 943566
53495I43566J6348J6254J6723J7480J7864J7435J6587J6092J6199J6569J6957
53484A128074J7385J7730J7669J7187J6619J6168J5781J5468J5239J4679J3201
53473A305200J0947Q851P509O401M644K194j65j861l094m452o316q630j0923j2527
53459A297778j3028j2661j2108j1875j1997j2379j3181j4511j5894j6441j5893
53448A147810j5130j5174j5811j5867j4951j4122j4269j4590j3669j1612r873
53437I92742q966p733n377k952j863j787j335k22O33R46J641L231M893N706N937
53422I85494O359P036P596Q223R487J1320J2974J4034J4889J6095J7701J9373
53410A130581K0749K1609K1963K2139K2649K3799K5505K7495K9543L1592L3664
$$ plain form
53495 943566 959914 976168 992891 1010371 1028235 1045670 1062257 1078349 1094548 1111117 1128074
53484 1128074 1145459 1163189 1180858 1198045 1214664 1230832 1246613 1262081 1277320 1291999 1305200
53473 1305200 1316147 1324998 1332507 1338908 1343552 1345746 1345581 1343720 1340626 1336174 1329858 1321228 1310305 1297778
53459 1297778 1284750 1272089 1259981 1248106 1236109 1223730 1210549 1196038 1180144 1163703 1147810
53448 1147810 1132680 1117506 1101695 1085828 1070877 1056755 1042486 1027896 1014227 1002615 992742
53437 992742 983776 976043 970666 967714 965851 964064 962729 962507 963140 964086 965727 968958 973851 979557 985494
53422 985494 991853 998889 1006485 1014708 1024195 1035515 1048489 1062523 1077412 1093507 1111208 1130581
53410 1130581 1151330 1172939 1194902 1217041 1239690 1263489 1288994 1316489 1346032 1377624 1411288
53399A411288L5716L7556L9048M0372M1843M3416M4673M5433M6021M6715M7289
53388A879370M7450M7323M7124M6675M5710M4384M2991M1384L9284L6865L4415
53377B352975L1740K8608K5569K3319K1317J8164J3547Q772M885J339k883p800
53365B519552j2914j8355k4459l0629l5662l9072m1213m2352m2500m2110m1987
53354B148299m2351m2658m2488m1925m0882l8852l5793l2703l0853l0628l1483
53343A737683l2698l3819l4510l4421l3374l1560k9453k7474k5720k4022k2211
53332A408421k0249j8094j5709j3302j1294r883q932q449q846j0316j2257j3836
53320A257254j4830j5519j5854j5446j4310j2999j1899j0931j0019r256q444p049
$$ plain form
53399 1411288 1447004 1484560 1523608 1563980 1605823 1649239 1693912 1739345 1785366 1832081 1879370
53388 1879370 1926820 1974143 2021267 2067942 2113652 2158036 2201027 2242411 2281695 2318560 2352975
53377 2352975 2384715 2413323 2438892 2462211 2483528 2501692 2515239 2524011 2528896 2530235 2527352 2519552
53365 2519552 2506638 2488283 2463824 2433195 2397533 2358461 2317248 2274896 2232396 2190286 2148299
53354 2148299 2105948 2063290 2020802 1978877 1937995 1899143 1863350 1830647 1799794 1769166 1737683
53343 1737683 1704985 1671166 1636656 1602235 1568861 1537301 1507848 1480374 1454654 1430632 1408421
53332 1408421 1388172 1370078 1354369 1341067 1329773 1319890 1310958 1302509 1293663 1283347 1271090 1257254
53320 1257254 1242424 1226905 1211051 1195605 1181295 1168296 1156397 1145466 1135447 1126191 1117747 1110698
53308A110698m981k949j703j214r46n00L38J855M072O360P913Q730R649J1315
53294A148637J3445J5281J6590J7847J9451K1158K2391K2911K2857K2251K0942
53283A363761J9115J7436J6362J5644J4794J3689J2334J0338P348L800O68j655
53271A493634l647n826q144j0303j2144j3584j4665j5830j7625j9837k1501k2049
53259A328479k2055k2425k3264k3990k4238k4166k4064k4027k3986k3727k2999
53248A069538k1853k0664j9689j8831j8081j7804j8228j8884j9083j8720j8219
53237H59482j7750j7077j6165j5431j5158j4996j4285j2781j0845r017p551o411
53225G02015n690n765o883q653j0284j1304j1823j2102j2313j2759j3818j5319
$$ plain form
53308 1110698 1105717 1102768 1101065 1099851 1098905 1098405 1098743 1100598 1104670 1111030 1118943 1127673 1137322 1148637
53294 1148637 1162082 1177363 1193953 1211800 1231251 1252409 1274800 1297711 1320568 1342819 1363761
53283 1363761 1382876 1400312 1416674 1432318 1447112 1460801 1473135 1483473 1490821 1494621 1495289 1493634
53271 1493634 1489987 1484161 1476017 1465714 1453570 1439986 1425321 1409491 1391866 1372029 1350528 1328479
53259 1328479 1306424 1283999 1260735 1236745 1212507 1188341 1164277 1140250 1116264 1092537 1069538
53248 1069538 1047685 1027021 1007332 988501 970420 952616 934388 915504 896421 877701 859482
53237 859482 841732 824655 808490 793059 777901 762905 748620 735839 724994 715977 708426 702015
53225 702015 696325 690560 683677 675024 664740 653436 641613 629511 617198 604439 590621 575302
53213E75302j6377j6273j5213j3871j2531j1129r854r054q626q062p164o329o021
53200D34798o323p014p792q401q768r044r246r099q455p719p366p147o361m925
53186C27138l663l312l684l982l638k698j711j317j640k034j811j209j135j806
53172B93498k335j933j023n90q34j100r67p87j103j927k696k757j932p47j05m25
53156B72237j234j752j766j614j512j355j128j040j138j154r28o29m00r2L16M06
53140B57217j39q42q40j7P55P13J23k29j24kj04j52O9K87K78L63R17J607J654
53121B61534Q84N7n5M68R37R55P19N46L83l1o89j168j078n62j62j55k20L7L91
53102B62791K30n98j464j693j287p87o15p53r41r17n91j13K34L47M41P62J231
$$ plain form
53213 575302 558925 542652 527439 513568 501037 489908 480054 471000 462374 454312 447148 440819 434798
53200 434798 428475 421461 413669 405268 396500 387456 378210 369111 360656 352937 345571 338424 332063 327138
53186 327138 323475 320163 316479 312497 308859 306161 304450 303133 301493 299459 297648 296439 295304 293498
53172 293498 291163 289230 288207 287617 286783 285683 284716 283929 282826 280899 278203 275446 273514 272767 272662 272237
53156 272237 271003 269251 267485 265871 264359 263004 261876 260836 259698 258544 257616 256987 256587 256495 256811 257217
53140 257217 257078 256236 255396 255379 256134 256847 256970 256741 256617 256615 256511 256359 256428 256715 256993 257356 258273 259880 261534
53121 261534 262418 262475 262420 262888 263825 264780 265499 266045 266428 266397 265708 264540 263462 262900 262738 262583 262363 262400 262791
53102 262791 263021 262423 260959 259266 257979 257192 256577 255824 254883 253966 253375 253262 253496 253843 254284 255046 256277
53085B56277J512J344P41o9p44r61o66j97j3k73p31r68p18p9M27K04p83j778j932
53066B50593j228m52j98k43o4L42M40n6p47r53m96R1J63k82n80k03N78R96P46
53047B48447L12K87O52R15P41K05m37r38j110r22o06m03l14k43l11p10j227j335
53029B43003q45j60L61Q63J578K148J954J000M2k98j13K02N56J071J637J936J826
53012B56761J420P57k28j356k105k069j387n58P1M22M61J99k4L11J256K095K058
52995B58084J242M84L44N50N73L52K53N00J006J592K122K421K323J860J263Q00
52979B75769N92N60M73K22J01N22J342J822J584J216J472K142K382K019J713J796
52963B95727J719J029J45l66o96j414k489l294l379k763j718p27m71j213k289
$$ plain form
53085 256277 257789 259133 259874 259805 259061 258100 257434 257237 257224 256951 256220 255252 254534 254455 254882 255086 254303 252525 250593
53066 250593 249365 248913 248715 248472 248408 248750 249190 249134 248387 247434 246938 247029 247192 246910 246330 246127 246705 247701 248447
53047 248447 248759 249046 249698 250613 251354 251559 251122 250184 249074 248152 247546 247143 246829 246586 246275 245565 244338 243003
53029 243003 242158 241998 242359 243222 244800 246948 248902 249902 249944 249646 249533 249735 250291 251362 252999 254935 256761
53012 256761 258181 258938 258710 257354 255249 253180 251793 251235 251306 251728 252189 252388 252364 252675 253931 256026 258084
52995 258084 259326 259810 260154 260704 261277 261629 261882 262382 263388 264980 267102 269523 271846 273706 274969 275769
52979 275769 276361 276921 277394 277616 277717 278239 279581 281403 282987 284203 285675 287817 290199 292218 293931 295727
52963 295727 297446 298475 298620 298254 297558 296144 293655 290361 286982 284219 282501 281774 281303 280090 277801
52948B77801k743k409j887j545j165o25k64l56p44j192j676k063j942j143p5P16
52932B58688J069J062O88M9m53n35m58p09j296j704j468n89M84J113R06J83j62
52915B56868L50J095J110M35J09P13J508J431M65m38o67n67o96r69r56o70n98
52898B58523q96j046n70K10N85M54M43R13J391J249N84K4j42j64k84m97q01j283
52880B58693j796j937j572j031o05j75L97P63M60l08o92q3J207K271K503K083
52864B60178J704J825K225K300J835J229R06P41L06m88j320j936k331k495k400
52849B62279k266k464k965l253k975k336j730j262r30r10j321j904k275k297j939
52834B31452j080J16R89J010N35L80Q01J384J796J988J770Q98k52q52o70l16k31
$$ plain form
52948 277801 275058 272649 270762 269217 268052 267427 267163 266807 266063 264871 263195 261132 259190 258047 257972 258688
52932 258688 259757 260819 261507 261556 261103 260568 260110 259401 258105 256401 254933 254344 254828 255941 256847 257030 256868
52915 256868 257218 258313 259423 259858 259967 260680 262188 263619 264084 263646 262979 262412 261716 260747 259791 259121 258523
52898 258523 257627 256581 256011 256221 256806 257260 257703 258616 260007 261256 261840 261864 261722 261558 261274 260777 259976 258693
52880 258693 256897 254960 253388 252357 251752 251577 251974 252737 253197 252889 252197 252114 253321 255592 258095 260178
52864 260178 261882 263707 265932 268232 270067 271296 272202 272943 273249 272761 271441 269505 267174 264679 262279
52849 262279 260013 257549 254584 251331 248356 246020 244290 243028 242098 241188 239867 237963 235688 233391 231452
52834 231452 230372 230488 231477 232487 233022 233402 234203 235587 237383 239371 241141 242039 241787 240935 240265 239949 239718
52817B39718j38J74L31J20J21Q59J899K399K154J433K93j081j837j281p1M14j50
52800B45357q12r64j131j803k505k552k000j346p59j77K81N05O52Q45R20Q16Q00
52783B36127R87J024O82L32L85O00M71Pl67m87n00m42k78k52o52j281j550j182
52765B33624m67J42L76J64l48q17r69p89l16M55J247J431P79J7kN57Q09M92K86
52746B36671P11J443J910K016J931J723J491J444J522J308O61J01J76P62J329
52731B55199J661J877J929J554P75L7k62k09k05m93r10j098r19o10n05o66q90
52714B56265j011j004q77o51n02n79p62p74o23o03p62p33k63L64O90O81O90R44
52696B50490J212J015J72p77q62K35J578J894J106L65M04O59L64j63j37L74N71
$$ plain form
52817 239718 239580 239754 240085 240205 240326 241185 243084 245483 247637 249070 249363 248282 246445 245164 245093 245507 245357
52800 245357 244545 243581 242450 240647 238142 235590 233590 232244 231485 231308 231589 232094 232746 233591 234511 235327 236127
52783 236127 237114 238138 238820 239152 239537 240137 240608 240615 240248 239761 239261 238819 238541 238289 237637 236356 234806 233624
52765 233624 233157 233299 233675 233839 233491 232674 231705 230916 230600 231055 232302 233733 234512 234529 234527 235084 235893 236385 236671
52746 236671 237382 238825 240735 242751 244682 246405 247896 249340 250862 252170 252831 252932 253108 253870 255199
52731 255199 256860 258737 260666 262220 262995 263032 262770 262561 262356 261863 260953 259855 258936 258326 257821 257155 256265
52714 256265 255254 254250 253373 252722 252220 251641 250879 250105 249482 248879 248117 247384 247121 247485 248175 248856 249546 250490
52696 250490 251702 252717 252889 252112 251250 251485 253063 254957 256063 256428 256832 257491 257855 257692 257555 257929 258500
52679B58500J88k20k73j93j73P9P51J417J484Q81Q6l95m07k14k52o19q32l68O04
52660B60044J357J472J206R41P78P26Q58J015P72K2p62j168j367j680j948j785
52644B60481j277r00q48q71p63n96l69J65J100J998K198J541O68M50J087J936
52628B66000K258J987J503R20L1j006j640j714j713j912j835j085k15r1p05j268
52612B59515j299r34k50Q25J946K407K014J280O10p3o68o32J80J032J196Q71O57
52595B68677O09L96J41L10Q56J179R56N50L71L78L79M54Q10J361J709J564J075
52578B81775P36Q17R29L76r36k175k411j573l33O66J162J015J85r79j863k138
52562B75253k012j833j690j403p24L86J505J898J241J59l48j8N05O14L55O8j24
$$ plain form
52679 258500 258688 258468 258195 258002 257829 257908 258659 260076 261560 262441 262527 262132 261725 261511 261259 260640 259808 259440 260044
52660 260044 261401 262873 264079 265020 265798 266524 267382 268397 269169 269191 268429 267261 265894 264214 262266 260481
52644 260481 259204 258304 257456 256585 255822 255226 254857 255022 256122 258120 260318 261859 262527 262977 264064 266000
52628 266000 268258 270245 271748 272668 272699 271693 270053 268339 266626 264714 262879 261794 261579 261488 260783 259515
52612 259515 258216 257282 257032 257857 259803 262210 264224 265504 266114 266041 265373 264741 264921 265953 267149 268020 268677
52595 268677 269286 269682 269823 270133 270989 272168 273124 273674 274045 274423 274802 275256 276066 277427 279136 280700 281775
52578 281775 282511 283328 284257 284633 283697 281522 279111 277538 277205 277871 279033 280048 280233 279254 277391 275253
52562 275253 273241 271408 269718 268315 267591 267977 269482 271380 272621 272780 272432 272414 272919 273533 273888 273956 273832
52545B73832k38k41j82k16k81o2N25J056J074N65j83r09j335j165m78J99M75N45
52527B72981P22Q46N76L5l18k87MN99J601K633K943K290J297P02N42L97J69K80
52509B88012J070K271L160L192K390J168j64j520k688l174k670j618r72j326k359
52494B84772l109k808j516j12M62J11l92l09L15R97J531J951K046J464L24p30
52478B84997j195j085o41k0N67Q30P30N58N41O20P23Q99J106J197J330J915K920
52461B95992L616L356K360J211o5j821l742m731m160k802k035k286k669k191r67
52446B79066QJ26k47m63n08p86j263j398j000n67n51o76m47nO2m23j010j258j084
52427B67576m78N85J708K044J206l7m79J12P67O47J64L95J653L150M083M518M987
$$ plain form
52545 273832 273594 273353 273171 272955 272674 272612 273137 274193 275267 275832 275649 274740 273405 272240 271762 271961 272436 272981
52527 272981 273703 274549 275125 275160 274842 274555 274559 275158 276759 279392 282335 284625 285922 286624 287166 287563 287732 288012
52509 288012 289082 291353 294513 297705 300095 301263 301099 299579 296891 293717 291047 289429 288457 287131 284772
52494 284772 281663 278855 277339 277227 277689 277800 277408 277099 277414 278411 279942 281893 283939 285403 285727 284997
52478 284997 283802 282717 282076 282056 282623 283453 284183 284741 285282 285902 286625 287524 288630 289827 291157 293072 295992
52461 295992 299608 302964 305324 306535 306470 304649 300907 296176 292016 289214 287179 284893 282224 280033 279066
52446 279066 279074 279200 278953 278490 277982 277196 275933 274535 273535 272968 272417 271741 271294 271289 271351 270928 269918 268660 267576
52427 267576 267098 267683 269391 271435 272641 272604 272125 272237 273004 273651 273815 274210 275863 279013 283096 287614 292601
52410B92601N693O554P668R088J0319J0641J0015Q990P589N019R88l324o277p487
52396C58077p835q022p835o934n584m313l314k547k076j900j674j017n6O68Q76
52381C06514Q82J174J848K519K766K499J948J424J252J755L064M797O114O301
52367C44857N289L620J971Q01K45J68L39O28R31R49L36p03j332r35J45J079J578
52350C59966J973K447K776K890L075L435L658L614L708M272M998N361N320N157
52336D12650M934M642M730N828P799R696J0833J1535J2505J3776J4785J5299J5787
52323E44799J6687J7763J8436J8553J8431J8288J8059J7855J8120J9086K0305
52312G46382K1116K1358K1340K1293K1223K1194K1309K1422K1324K1097K0870
$$ plain form
52410 292601 298294 304848 312516 321604 331923 342564 352579 361569 369158 374177 375165 371841 365564 358077
52396 358077 350242 342220 334385 327451 321867 317554 314240 311693 309617 307717 306043 305026 304970 305638 306514
52381 306514 307396 308570 310418 312937 315703 318202 320150 321574 322826 324581 327645 332442 338556 344857
52367 344857 350146 353766 355737 356538 356783 356951 357290 357918 358849 359798 360134 359431 358099 357164 357309 358388 359966
52350 359966 361939 364386 367162 370052 373127 376562 380220 383834 387542 391814 396812 402173 407493 412650
52336 412650 417584 422226 426956 432784 440583 450279 461112 472647 485152 498928 513713 529012 544799
52323 544799 561486 579249 597685 616238 634669 652957 671016 688871 706991 726077 746382
52312 746382 767498 788856 810196 831489 852712 873906 895215 916637 937961 959058 979928
52301I79928K0192J8404J5743J3431J2257J1588J0275Q008N285K487k88k683m185
52288A090442m883n522o593p783q477q479q102p699p289o485m966l054j617j075
52274A008418q44j68Q71J789K870M905P748J0122J1211J1649J2361J3238J3657
52261A097827J3745J4233J5319J6483J7338J7952J8314J8184J7573J6743J5668
52250A279379J3895J1190P844M270P43k318m371n417o214p417q772r558r649r683
52236A253922j0334j1676j3241j4390j4697j4346j4006j4062j4007j3054j1375
52225A108734j0117r995j0274r644p861n936m732l978k900j399j32M51O26R37
52211A043780J554K282K978L629M135M294M052L630L318L282L536M007M512M899
$$ plain form
52301 979928 1000120 1018524 1034267 1047698 1059955 1071543 1081818 1089826 1095111 1097598 1097310 1094627 1090442
52288 1090442 1085559 1080037 1073444 1065661 1057184 1048705 1040603 1032904 1025615 1019130 1014164 1011110 1009493 1008418
52274 1008418 1007574 1007406 1008277 1010066 1012936 1017841 1025589 1035711 1046922 1058571 1070932 1084170 1097827
52261 1097827 1111572 1125805 1141124 1157607 1174945 1192897 1211211 1229395 1246968 1263711 1279379
52250 1279379 1293274 1304464 1312308 1316578 1317321 1315003 1310632 1305215 1299001 1291584 1282812 1273254 1263605 1253922
52236 1253922 1243588 1231912 1218671 1204281 1189584 1175238 1161232 1147170 1133163 1120109 1108734
52225 1108734 1098617 1088622 1078348 1068704 1060843 1054907 1050175 1046197 1043297 1041898 1041766 1042217 1042843 1043780
52211 1043780 1045334 1047616 1050594 1054223 1058358 1062652 1066704 1070334 1073652 1076934 1080470 1084477 1088989 1093888
52197A093888N254N822O581P085O925O226N454M741L778K416R74k89j695l677
52183A143483n930p515p951p770p764p991p939p463o971o700o267n288m102l440
52169A050392l446l399k505p64J136K516L131L046K383J397N71M46J199K374L141
52154A061618K891J787O72L48Q47J499J708J559J506J625J525J004M69M38Q05
52139A080301R48N46j7j13M89J611L067M783O632Q379R947J1566J3537J5907J8419
52124A176002K0745K2698K4225K5342K6087K6476K6542K6406K6367K6674K7192
52113A454756K7391K6842K5679K4387K3206K1990K0656J9480J8717J8169J7298
52102A698571J5755J3572J0984Q252N587K997J98l133p011j1095j4857j7720j9223
$$ plain form
52197 1093888 1099142 1104964 1111545 1118630 1125555 1131781 1137235 1141976 1145754 1148170 1149144 1148855 1147160 1143483
52183 1143483 1137553 1130038 1122087 1114317 1106553 1098562 1090623 1083160 1076189 1069489 1063222 1057934 1053832 1050392
52169 1050392 1046946 1043547 1041042 1040278 1041414 1043930 1047061 1050107 1052490 1053887 1054458 1054904 1056103 1058477 1061618
52154 1061618 1064509 1066296 1066968 1067316 1068163 1069662 1071370 1072929 1074435 1076060 1077585 1078589 1079058 1079496 1080301
52139 1080301 1081249 1081795 1081778 1081665 1082154 1083765 1086832 1091615 1098247 1106626 1116573 1128139 1141676 1157583 1176002
52124 1176002 1196747 1219445 1243670 1269012 1295099 1321575 1348117 1374523 1400890 1427564 1454756
52113 1454756 1482147 1508989 1534668 1559055 1582261 1604251 1624907 1644387 1663104 1681273 1698571
52102 1698571 1714326 1727898 1738882 1747134 1752721 1755718 1755916 1752783 1745772 1734677 1719820 1702100 1682877
52089A682877j9436j9143j9116j9277j8842j7412j5482j3724j2197j0598q932
52078A508718p474o202m713k746n31J498L194M812O682Q746J0539J1682J2406
52065A546611J3241J4296J5163J5705J6410J7626J8814J9086J8255J6826J5091
52054A727124J2827R961O964M308J944n05l186n895q252r989j1225j2513j4272
52041A697291j6152j7318j7452j7164j7220j7802j8645j9455j9913j9718j9128
52030A497324j8997j9785k0761k0849j9995j9034j8359j7569j6517j5747j5409
52019A294302j4616j2668j0364r098q963q759p912p335p959r367j0559j1499j2935
52006A162268j4989j6858j7917j8399j8688j8746j8492j8219j8110j7721j6557
$$ plain form
52089 1682877 1663441 1644298 1625182 1605905 1587063 1569651 1554169 1540445 1528248 1517650 1508718
52078 1508718 1501244 1495042 1490329 1487583 1487052 1488550 1491744 1496556 1503238 1511984 1522523 1534205 1546611
52065 1546611 1559852 1574148 1589311 1605016 1621426 1639052 1657866 1676952 1695207 1712033 1727124
52054 1727124 1739951 1749912 1756876 1761184 1763128 1762623 1759437 1753542 1745290 1735301 1724076 1711563 1697291
52041 1697291 1681139 1663821 1646369 1629205 1611985 1594183 1575538 1556083 1536170 1516452 1497324
52030 1497324 1478327 1458542 1437781 1416932 1396937 1377903 1359544 1341975 1325458 1309711 1294302
52019 1294302 1279686 1267018 1256654 1247556 1238593 1229834 1221922 1214587 1206628 1197261 1186702 1175203 1162268
52006 1162268 1147279 1130421 1112504 1094105 1075417 1056671 1038179 1019960 1001850 984129 967572
51995I67572j4932j3789j3699j4455j5521j6487j7071j7120j6798j6533j6586
51984G94581j6759j6637j6037j5221j4714j4821j5209j5077j3880j1801r447p265
51972F27713n363l687k062k44J719L329M122M250M269M433M464L945K601L77k377
51957F47489m891o548p405p834p833p174o067m989l985k712j146M07J971L807
51943E93090N657O903P599Q435R479R944R549R019Q653P541N023J936o52l046
51929F79130o007r010j0834j1531j2231j3142j3245j2170j0921j0314r954r243
51917E50528q354p524o364m597k716j178L97K535M919O840Q214R486J0830J2048
51903E75064J3040J3736J3820J3057J1679R977P581L744j673p831j3520j7874
$$ plain form
51995 967572 952640 938851 925152 910697 895176 878689 861618 844498 827700 811167 794581
51984 794581 777822 761185 745148 729927 715213 700392 685183 670106 656226 644425 634978 627713
51972 627713 622350 618663 616601 616357 618076 621405 625527 629777 634046 638479 642943 646888 649489 649866 647489
51957 647489 642598 636050 628645 620811 612978 605804 599737 594748 590763 588051 586905 587312 589283 593090
51943 593090 598747 605650 613249 621684 631163 641107 650656 659675 668328 675869 680892 682828 682176 679130
51929 679130 673123 664113 653279 641748 629517 616375 603130 590960 580039 569725 559771 550528
51917 550528 542174 534650 528286 523689 520973 519795 520192 522727 527646 534486 542700 552186 563016 575064
51903 575064 588104 601840 615660 628717 640396 650373 657954 661698 660025 652194 638674 620800
51891F20800k0580k1703k1327j9408j6133j2406r408p438n631l146k18K370M364
51878D90136N991P322Q261Q934R345Q897O967L908Q22j670l770n707p271q230
51864E23935q510p883o192m043k507j781r11O93K210K510J704P58k3j158k781
51849D96021m195m871n125n479n928o216o326o257n672m322k632j378q22n50j20
51834D36128N20J296K160K833K793J828M20p21j317j538j575j489j368j277j196
51819D37497j102j081j024n35N49J664K026J562Q28O8j028k448l431l336k510
51804D27699j808j595j590j518j443j480j582j542j079p4J055J443O64o85j541
51789D14924j467p97LO96J012O53l09j354j972k040j617p59M18J639K634L309
$$ plain form
51891 620800 600220 578517 557190 537782 521649 509243 499835 492397 486766 483620 483402 485772 490136
51878 490136 496127 503449 511710 520644 529989 538886 545853 549761 550583 548913 545143 539436 532165 523935
51864 523935 515425 507542 501350 497307 494800 493019 492108 492801 495011 497521 499225 499983 499960 498802 496021
51849 496021 491826 486955 481830 476351 470423 464207 457881 451624 445952 441630 438998 437620 436798 436248 436128
51834 436128 436648 437944 440104 442937 445730 447558 447978 447257 445940 444402 442827 441338 439970 438693 437497
51819 437497 436395 435314 434290 433755 434304 435968 437994 439556 440384 440452 439424 436976 433545 430209 427699
51804 427699 425891 424296 422706 421188 419745 418265 416683 415141 414062 413988 415043 416486 417150 416465 414924
51789 414924 413457 412660 412663 413359 414371 415024 414715 413361 411389 409349 407732 406973 407391 409030 411664 414973
51773D14973L796M446N638P307Q773R345R010Q193O935M811J739j597m379o295
51759D72695p400p747p528p155o822o204n065l877l378l552l571k796j406J38
51745D06332J766L607N390O489O601O070N536N388N600N886N902N413M388K975
51731D77343J410pq90r49k99O23J499K261K671K092J81k443m615n675n722m957
51715D62523l459j720o90q02j414j641j359q79p7J462L549N269N776M854K751
51700D74143J8k428l634l251j717K81K227L736M405L895K061q87m144o515p325
51685D60865p074o793o788o419n084k914n12J410K163J419k69j759k379k320j860
51670D21686q66O99K317L534M653O229Q077R186Q636O315K995o8j853k255j969
$$ plain form
51773 414973 418769 423215 428853 436160 444933 454278 463288 471481 478416 483227 484966 483369 478990 472695
51759 472695 465295 457548 450020 442865 436043 429839 424774 420897 417519 413967 410396 407600 406194 406332
51745 406332 408098 411705 417095 423584 430185 436255 441791 447179 452779 458665 464567 469980 474368 477343
51731 477343 478753 478746 477856 476907 476608 477231 478730 480991 483662 485754 485935 483492 478877 473202 467480 462523
51715 462523 459064 457344 456654 455852 454438 452797 451438 450559 450482 451944 455493 460762 466538 471392 474143
51700 474143 474161 471733 468099 464848 463131 463412 465639 469375 473780 477675 479736 478849 474705 468190 460865
51685 460865 453791 446998 440210 433791 428707 425793 425281 426691 428854 430273 430004 428245 425866 423546 421686
51670 421686 420820 421519 423836 427370 432023 438252 446329 455515 464151 470466 473461 473393 471540 469285 467316
51655D67316j490m74J609M458P048Q623R071Q352O070J973l345q450j1924j3240
51641D75597j2930j1920j0759r370p478n081k612p92j56m97r08p13k43k09n13
51626D11416l50M35R54N30m12j141j698k490l324l645l430l154k980k677k195
51611C85839j727j208l54P81J765K359K735L143L676M358N071N555N820O448P925
51596D32186R809J1039J1020R863P689M487P79k264l831m200m160m030l472k059
51582D62856J92K755N090P317J0175J3904J7378J9007J8487J7045J5996J5694
51570F05896J5930J6414J6441J5042J2231R709R543J2311J7027K2514K8205L3740
51558H15003L8443M1406M1745L8851L2840K4793J6191P938M3p759j5335k2254
$$ plain form
51655 467316 465826 465352 466961 471419 478467 487090 496161 504513 510583 512556 509211 500761 488837 475597
51641 475597 462667 450747 439988 430618 423140 418059 415447 414655 414499 414002 413094 412381 412138 411929 411416
51626 411416 411066 411501 412455 412985 412573 411432 409734 407244 403920 400275 396845 393691 390711 388034 385839
51611 385839 384112 382904 382550 383331 385096 387455 390190 393333 397009 401367 406438 411993 417813 424261 432186
51596 432186 441995 453034 464054 473917 481606 486093 486872 484608 480777 476577 472417 468387 464915 462856
51582 462856 463048 465803 470893 478210 488385 502289 519667 538674 557161 574206 590202 605896
51570 605896 621826 638240 654681 669723 681954 691663 701206 713517 730544 753058 781263 815003
51558 815003 853446 894852 936597 975448 1008288 1033081 1049272 1057210 1057253 1049494 1034159 1011905
51546A011905k8277l3584l8322m2049m3818m3107m0566l7525l4707l1820k8372
51535F09758k4555k1021j8189j6091j4563j3290j1808r866p738n954m791m128
51523D57764l671l247l024l455m607n597n236l452j530n57k57J27M02j95j573
51508D21892k663k708j993j134l85K71R30J832L069M123M217L296K091J132K99
51493D34269n08r68j008j143j680k101j853j320j333k056k981l777m463m814m442
51478C99822l568l033l264l720l657l083k616k676l137l601l761l546l126k761
51464C54273k531k257j720r14l9O47R74J032J200J877L010M132M915N524O321
51449C76444P384Q579J0005J2011J4699J7453J9152J8899J6601J2948Q820M790
$$ plain form
51546 1011905 983628 950044 911722 869673 825855 782748 742182 704657 669950 638130 609758
51535 609758 585203 564182 545993 529902 515339 502049 490241 480375 472637 466683 461892 457764
51523 457764 454093 450846 447822 444367 439760 434163 428927 425475 423945 423388 423131 423258 423660 423465 421892
51508 421892 419229 416521 414528 413394 413009 413280 414210 416042 419111 423234 427451 430747 432838 433970 434269
51493 434269 433761 432793 431785 430642 428962 426861 425008 423688 422355 420299 417318 413541 409078 404264 399822
51478 399822 396254 393221 389957 386237 382580 379497 376881 374205 371068 367467 363706 360160 357034 354273
51464 354273 351742 349485 347765 346851 346812 347459 348433 349465 350665 352542 355552 359684 364599 370123 376444
51449 376444 383828 392407 402412 414423 429122 446575 465727 484626 501227 514175 522995 527785
51437E27785J230j295k179j586q30j554m383q429j2065j4111j4502j4031j3408
51424D40642j2460j0463p409m487k873k355j808q77k89m32o26k74J64J15P5Q63
51408C97506K128K706K386K198K798L649M154M700N845P168P664O993N777M891
51394D60563M888N865P302Q303Q514Q686R831J2049J4650J7327K0517K4645K9548
51381F32688L4805M0114M5243M9942N4059N7254N8575N6822N1607M3712L4170
51370A158991K3464J1842m2j1284k1300k9928l7240m3544m9151n3738n6262n6047
51358H35761n3723n0512m6834m2316l7028l1839k7302k3068j8873j5389j3332
51347D75545j2173j0617q312o257n399n459n480n070m546m173l752l041k190j564
$$ plain form
51437 527785 529015 527720 525541 523955 523125 521571 517188 508759 496694 482583 468081 454050 440642
51424 440642 428182 417719 410310 405823 402950 400595 398787 397910 397621 397189 396563 396289 396453 396568 396643 397506
51408 397506 399634 402340 404726 406924 409722 413371 417525 422225 428070 435238 442902 449895 455672 460563
51394 460563 465451 471316 478618 486921 495435 504121 513952 526001 540651 557978 578495 603140 632688
51381 632688 667493 707607 752850 802792 856851 914105 972680 1029502 1081109 1124821 1158991
51370 1158991 1182455 1194297 1194255 1182971 1161671 1131743 1094503 1050959 1001808 948070 891808 835761
51358 835761 782038 731526 684692 642376 605348 573509 546207 523139 504266 488877 475545
51347 475545 463372 452755 444443 438186 432787 427328 421848 416778 412232 408059 404307 401266 399076 397512
51333C97512j320j304j361j540j933k450k850l007k987k849k552k151j843j668
51319C67697j349p05j3L49M92P92J138R91K39m64n28j21K89O15J018J415J660
51302C73515J891K156J957Q52m86p02N81K110K388J318Jo79q10q93j126j316j259
51285C79498r21l55M16J287J918J948J439R26Q30R66Q52L70j44l50j48L70R62
51268C89864J269J215J224J604J913J447L24o20r70j129j428j622j585j705k184
51253C87617k525k289j781j493j370j191j195j593j924j598q30k99j29R9N48J043
51237C71090J566K137K308J627N08j00L5K96K49L5l02r95j790j880j062j85o7
51220C73470m77o52k98L37R09J117P93K62J95P69J396J585J598J869K273K440
$$ plain form
51333 397512 396192 394888 393527 391987 390054 387604 384754 381747 378760 375911 373359 371208 369365 367697
51319 367697 366348 365643 365630 365979 366471 367263 368401 369392 369631 369167 368639 368518 368807 369422 370440 371855 373515
51302 373515 375406 377562 379519 380371 379885 379183 379764 381874 384262 385580 385581 384902 384092 383199 382073 380757 379498
51285 379498 378577 378222 378638 379925 381843 383791 385230 386156 386986 387952 388804 389174 389030 388680 388532 388902 389864
51268 389864 391133 392348 393572 395176 397089 398536 398860 398240 397270 396141 394713 393091 391506 389801 387617
51253 387617 385092 382803 381022 379529 378159 376968 375773 374180 372256 370658 369828 369529 369400 369499 370047 371090
51237 371090 372656 374793 377101 378728 379236 379136 379171 379467 379716 379751 379449 378454 376664 374784 373722 373537 373470
51220 373470 372993 372341 372043 372380 373289 374406 375199 375461 375656 376425 377821 379406 381004 382873 385146 387586
51204C87586K403K410K450K424K475K679K707K323J873J739J540N54j167k732
51190D09264l461l484l304l184l028k555j521j02J030J287P80Q3m25o79n64L6
51174C90173Q47J341J318R59M28k19p21p09k12L30P19J199J879K359K214J658
51158D03563J353J662K197K113Q66j164k828l249k652j959j578j134m18l5o04
51143C96133j681k068j219J64J087J387J609J989K105J553N63l87j129j712j954
51128C96440j689j276j190j112k21J343K207J579N60P42J992K781K488K141K627
51113D09412L322L169K268J549J435J554J618J778K138K452K566K704L131L677
51099D42773L847L389K649K161J926J338M3j378k008j712j207j005q99o27m16
$$ plain form
51204 387586 389989 392399 394849 397273 399748 402427 405134 407457 409330 411069 412609 413163 411996 409264
51190 409264 405803 402319 399015 395831 392803 390248 388727 388625 389655 390942 391722 391805 391380 390701 390137 390173
51174 390173 391020 392361 393679 394638 395066 394847 394126 393417 393205 393535 394254 395453 397332 399691 401905 403563
51158 403563 404916 406578 408775 410888 411754 410590 407762 404513 401861 399902 398324 397190 396772 396737 396133
51143 396133 394452 392384 391165 391329 392416 393803 395412 397401 399506 401059 401622 401235 400106 398394 396440
51128 396440 394751 393475 392285 391173 390952 392295 394502 396081 396641 397383 399375 402156 404644 406785 409412
51113 409412 412734 415903 418171 419720 421155 422709 424327 426105 428243 430695 433261 435965 439096 442773
51099 442773 446620 450009 452658 454819 456745 458083 458126 456748 454740 453028 451821 450816 449917 449290 448874
51084D48874n27p60q41r15j151j237q03j10K62K71L78P65J164J546K307L511M478
51067D57212M544L942L590M135N489P218R021J0764J2179J2791J2281J0865R210
51054E63241P892P095O932P798R988J2995J5539J6501J5761J4103J2369J0734
51042G00948Q588N190O05l985p186q628r063r264r381r528j0363j2429j5083j6802
51028F03619j6672j5092j2892j0348p439m645k775j971j399j87J629L320M408
51015E39556N072N702O383O993P536Q136Q769R271R687J0348J1456J2714J3615
51002F55238J3955J3873J3455J2711J1981J1876J2575J3464J3876J3858J3850
50991H00712J3840J3424J2590J1825J1293J0536R312Q276Q350R637J1340J2563
$$ plain form
51084 448874 448347 447587 446746 445831 444680 443443 442640 442530 442792 443063 443441 444206 445370 446916 449223 452734 457212
51067 457212 461756 465698 469288 473423 478912 486130 495151 505915 518094 530885 543166 554031 563241
51054 563241 571133 578228 585160 592958 602946 615941 631480 647981 663742 677845 690214 700948
51042 700948 709536 714726 715331 711346 704160 695532 686469 677205 667824 658296 647933 635504 620421 603619
51028 603619 586947 571855 558963 548615 541176 536531 533756 531785 530386 530199 531828 535148 539556
51015 539556 544628 550330 556713 563706 571242 579378 588147 597418 607105 617453 628909 641623 655238
51002 655238 669193 683066 696521 709232 721213 733089 745664 759128 773004 786862 800712
50991 800712 814552 827976 840566 852391 863684 874220 883532 891808 900158 909795 921135 933698
50979I33698J2988J2950J3149J4116J5750J7600J9865K3702K9946L7706M4849
50968A176319N0009N3709N7420O1963O6956P1401P4467P5923P6157P5749P4918
50957A914991P3201O9719O3801N5705M6780L8610L1670K4996J7502R409J967l880
50945B344471q001j0474j1329j1145j1228j2754j5897j9943k3910k6967k8775
50934B164048k9718l0609l1956l3731l5793l8113m0529m2776m4942m7435n0303
50923A738143n3061n5309n7001n7909n7495n5656n2999m9992m6364m1944l7425
50912A172988l3642l0494k7294k3916k0898j8632j7031j5842j4717j3176j1141
50901I46205r223p923o798n197l518k813l168l432k715j320O6J215K127K657K913
$$ plain form
50979 933698 946686 959636 972785 986901 1002651 1020251 1040116 1063818 1093764 1131470 1176319
50968 1176319 1226328 1280037 1337457 1399420 1466376 1537777 1612244 1688167 1764324 1840073 1914991
50957 1914991 1988192 2057911 2121712 2177417 2224197 2262807 2294477 2319473 2336975 2346384 2348351 2344471
50945 2344471 2336470 2325996 2314667 2303522 2292294 2279540 2263643 2243700 2219790 2192823 2164048
50934 2164048 2134330 2103721 2071765 2038034 2002241 1964128 1923599 1880823 1835881 1788446 1738143
50923 1738143 1685082 1629773 1572772 1514863 1457368 1401712 1348713 1298721 1252357 1210413 1172988
50912 1172988 1139346 1108852 1081558 1057642 1036744 1018112 1001081 985239 970522 957346 946205
50901 946205 936982 929059 922261 917064 913546 910733 907565 904133 901418 900098 900164 901379 903506 906163 909076
50886I09076L437M479N554O110O346O819P637Q441Q982R332R689J0255J1204J2479
50872A019840J3739J4698J5416J6214J7471J9514K2387K5691K8991L2413L6435
50861A262809M1073M5837N0680N6339O3367P1356P9638Q8235R7480J07123J16618
50850B080555J26031J35876J45892J54872J61897J67246J71615J74872J76010
50841C494866J73987J68222J58334J43988J25260J03054P8787N3681K8452L830
50831D532461j8874l8099n2980o3776p1157p5214p5386p1276o3442n3430m3139
50820C905688l4111k7288k3340k3029k6970l4962m5881n8351p1426q4567r7277
50809C378486j09017j19361j27837j33799j36694j36533j33798j28942j22193
$$ plain form
50886 909076 912513 916992 922546 928656 935002 941821 949458 957899 966881 976213 985902 996157 1007361 1019840
50872 1019840 1033579 1048277 1063693 1079907 1097378 1116892 1139279 1164970 1193961 1226374 1262809
50861 1262809 1303882 1349719 1400399 1456738 1520105 1591461 1671099 1759334 1856814 1963937 2080555
50850 2080555 2206586 2342462 2488354 2643226 2805123 2972369 3143984 3318856 3494866
50841 3494866 3668853 3837075 3995409 4139397 4264657 4367711 4446498 4500179 4528631 4532461
50831 4532461 4513587 4475488 4422508 4358732 4287575 4212361 4136975 4065699 4002257 3948827 3905688
50820 3905688 3871577 3844289 3820949 3797920 3770950 3735988 3690107 3631756 3560330 3475763 3378486
50809 3378486 3269469 3150108 3022271 2888472 2751778 2615245 2481447 2352505 2230312
50800B230312j13920j04800r5379q5681p5535o5214n5452m6778l9053l1816k4858
50789A491826j8315j2392p344l516j066L32J105J120j4j926l439l925m080m808
50775A433558n908o639p180q425j0564j2788j4600j6417j8546k0428k1380k1501
50763A269182k1265k0748j9774j8426j6923j5259j3317j1150q850o464m157k077
50751A110772Q8K901O243R293J1781J4561J8357K2612K6368K9777L3821L8904
50739A325478M4594N0556N6854O3260O9157P4350P9343Q4534Q9608R3825R6594
50728B128153R7616R6865R4569R1065Q6611Q1315P4959O6798N5950M2304K6702
50717B942907R979p493k4891m0362n2246o0304o4828o5265o1039n3356m4716l6526
$$ plain form
50800 2230312 2116392 2011592 1916213 1830532 1754997 1689783 1634331 1587553 1548500 1516684 1491826
50789 1491826 1473511 1461119 1453775 1450259 1449193 1449525 1450630 1451750 1451736 1449810 1446371 1442446 1438366 1433558
50775 1433558 1427650 1421011 1413831 1405406 1394842 1382054 1367454 1351037 1332491 1312063 1290683 1269182
50763 1269182 1247917 1227169 1207395 1188969 1172046 1156787 1143470 1132320 1123470 1117006 1112849 1110772
50751 1110772 1110860 1113761 1120004 1129297 1141078 1155639 1173996 1196608 1222976 1252753 1286574 1325478
50739 1325478 1370072 1420628 1477482 1540742 1609899 1684249 1763592 1848126 1937734 2031559 2128153
50728 2128153 2225769 2322634 2417203 2508268 2594879 2676194 2751153 2817951 2873901 2916205 2942907
50717 2942907 2952886 2945393 2920502 2880140 2827894 2767590 2702762 2637497 2576458 2523102 2478386 2441860
50705B441860k8523k0635j3927r279o493n456o987j1721j9037k7873l7753m8242
50693B205934n8179o6386p2610p6908p8793p7815p4501o9753o3745n6325m8155
50682A462764m0384l3291k6238j8888j1719n199P41O276J1406J6165K0609K4490
50670A406732K7416K9334L0388L0358K8844K6066K2929K0160J7844J5816J4029
50659A669916J2424J0898R581Q696Q082P226N951M734M214M658N953P771R710
50646A769814J1638J3973J7290K1535K5997L0159L4105L7993M1516M4186M5856
50635B094062M6683M6828M6443M5725M4766M3492M2076M1291M1901M3266M2371
50624B578904L4769J7472q148l6182n9378p3097p6831p2856o4240n3801m3628
$$ plain form
50705 2441860 2413337 2392702 2378775 2369496 2363003 2357547 2350560 2338839 2319802 2291929 2254176 2205934
50693 2205934 2147755 2081369 2008759 1931851 1853058 1775243 1700742 1630989 1567244 1510919 1462764
50682 1462764 1422380 1389089 1362851 1343963 1332244 1327045 1327786 1334062 1345468 1361633 1382242 1406732
50670 1406732 1434148 1463482 1493870 1524228 1553072 1579138 1602067 1622227 1640071 1655887 1669916
50659 1669916 1682340 1693238 1702819 1711515 1719597 1726823 1732774 1737508 1741722 1746380 1752333 1760104 1769814
50646 1769814 1781452 1795425 1812715 1834250 1860247 1890406 1924511 1962504 2004020 2048206 2094062
50635 2094062 2140745 2187573 2234016 2279741 2324507 2367999 2410075 2451366 2493267 2536533 2578904
50624 2578904 2613673 2631145 2622997 2586815 2527437 2454340 2377509 2304653 2240413 2186612 2142984
50613B142984l4625k6538j8855j1670n667j517N26N49j293m983j0495j7365k4647
50600A986404l1659l8582m5821n2770n7918o0367o0646n9735n7878n4887n1038
50589A415103m6947m2777l8277l3594k9346k5856k2836k0043j7726j6157j5043
50578A106501j3756j2013j0095q377o889n303l318r81J368L518N607P795R811
50565A073868J1170J1881J2679J4318J6822J9634K2330K4926K7459K9705L1457
50554A296249L2765L3666L3788L2710L0687K8647K7187K5909K4065K1733J9922
50543A607328J9552K0677K2799K5538K8777L2438L6475M0927M5672N0234N4233
50532A984650N8039O2644O8672P5717Q2803Q9290R5093J00229J04433J07270J08288
$$ plain form
50613 2142984 2108359 2081821 2062966 2051296 2045629 2044112 2044638 2045187 2043894 2038911 2028416 2011051 1986404
50600 1986404 1954745 1916163 1870342 1817572 1759654 1699287 1638641 1578906 1521028 1466141 1415103
50589 1415103 1368156 1325379 1287102 1253508 1224162 1198306 1175470 1155427 1137701 1121544 1106501
50578 1106501 1092745 1080732 1070637 1062260 1055371 1050068 1046750 1045769 1047137 1050655 1056262 1064057 1073868
50565 1073868 1085038 1096919 1109598 1123916 1140738 1160372 1182702 1207628 1235087 1264792 1296249
50554 1296249 1329014 1362680 1396468 1429178 1459865 1488512 1515699 1541608 1565673 1587406 1607328
50543 1607328 1626880 1647557 1670356 1695894 1724671 1757109 1793584 1834511 1880183 1930417 1984650
50532 1984650 2042689 2105333 2174005 2249722 2332525 2421815 2516908 2617137 2721570 2828840 2937128
50521B937128J07064J03354R7323Q9300P9209O6556N1296L4334J6808r54j9206
50510C562212l7634n5017p0157q2590r2192r8696j01920j01959r8742r1876q1443
50499B649986o8498n4240l9031k2994p231O637J8148K8246L7385M4194M6586M3677
50487B682865L6020K4319Q758j0295l1458n2485p1253q6522r7908j05332j08781
50476B187928j08713j06311j02773r8347r2518q5189p7196o9546o2561n6005m9618
50465A279151m3330l7348l2260k8507k5539k1996j7220j2072p823m685k057L59
50453A046673K465M535P077R927J2228J3479J3921J3837J3150J1953J0778R946
50441A169969R187Q184P058N992M804L312J797P31L34O81J867L672N371O423P161
$$ plain form
50521 2937128 3044192 3147546 3244869 3334169 3413378 3479934 3531230 3565564 3582372 3581418 3562212
50510 3562212 3524578 3469561 3399404 3316814 3224622 3125926 3024006 2922047 2823305 2731429 2649986
50499 2649986 2581488 2527248 2488217 2465223 2457992 2464629 2482777 2511023 2548408 2592602 2639188 2682865
50487 2682865 2718885 2743204 2751962 2741667 2710209 2657724 2586471 2499949 2402041 2296709 2187928
50476 2187928 2079215 1972904 1870131 1771784 1679266 1594077 1516881 1447335 1384774 1328769 1279151
50465 1279151 1235821 1198473 1166213 1137706 1112167 1090171 1072951 1060879 1053056 1048371 1046314 1046673
50453 1046673 1049138 1053673 1060750 1070677 1082905 1096384 1110305 1124142 1137292 1149245 1160023 1169969
50441 1169969 1179156 1187340 1194398 1200390 1205194 1208506 1210303 1211034 1211368 1212049 1213916 1217588 1222959 1229382 1236543
50426A236543Q325J0028J1749J3209J4726J6550J8462K0364K2811K6423L0892
50415A430082L5164L8602M1651M4994M8417N0954N2187N2793N3502N3896N2857
50404A955099N0066M6344M2349L7638L1437K3816J5493O778k581j2607k2850l2954
50392B138028m2812n1993n9606o4979o8024o8659o6537o1784n5480m8688m1370
50381A508096l3023k4035j5556p999p03O621J3052J7603K0389K1889K1587J8390
50369A546311J2178M034n086j4907k4826l3333l9140m2416m4331m5577m5933m5124
50357A221850m3499m1757m0311l9022l7437l5240l2577k9846k7156k4202k0833
50346H49970j7450j4489j1818r035o230l914k244q19O37J977L148M497O235Q062
$$ plain form
50426 1236543 1244868 1254896 1266645 1279854 1294580 1311130 1329592 1349956 1372767 1399190 1430082
50415 1430082 1465246 1503848 1545499 1590493 1638910 1689864 1742051 1794844 1848346 1902242 1955099
50404 1955099 2005165 2051509 2093858 2131496 2162933 2186749 2202242 2209020 2206439 2193832 2170982 2138028
50392 2138028 2095216 2043223 1983617 1918638 1850614 1781955 1715418 1653634 1598154 1549466 1508096
50381 1508096 1475073 1451038 1435482 1427483 1426780 1433401 1446453 1464056 1484445 1506334 1527921 1546311
50369 1546311 1558489 1562523 1557437 1542530 1517704 1484371 1445231 1402815 1358484 1312907 1266974 1221850
50357 1221850 1178351 1136594 1096283 1057261 1019824 984584 952007 922161 895005 870803 849970
50346 849970 832520 818031 806213 797178 790948 787034 784790 783971 784608 786585 789733 794230 800465 808527
50332H08527R736J1627J4067J6461J7762J7838J7608J7501J6410J2928P283J386
50320I69134l068n889p616q221p353n535m095l682l489k424n67J060J837K007
50306I22099J942J695J399J430J900K448K833L241L723L771L050K152K014K706
50292I56403L400L570L579M054N134O606Q282J0089J2055J4155J5757J5199J0859
50279A069142L180m905j0327j2326j2104j0666q099m725j658L85J836L218M010
50266A016961L400J741L57r9k53q94j833k268j848j049o00q06j340j643j513j286
50250A007027j313j426j173m19O47K075M235P230J0619J3937J7199K0546K3729
50237A102913K6228K7809K8743K9521L0404L1118L0887K9126K6270K3609K2033
$$ plain form
50332 808527 818263 829890 843957 860418 878180 896018 913626 931127 947537 960465 967748 969134
50320 969134 966066 960177 952561 944340 936987 931452 927357 923675 920186 917762 917195 918255 920092 922099
50306 922099 924041 925736 927135 928565 930465 932913 935746 938987 942710 946481 949531 951683 953697 956403
50292 956403 959803 963373 966952 971006 976140 982746 991028 1001117 1013172 1027327 1043084 1058283 1069142
50279 1069142 1072322 1067417 1057090 1044764 1032660 1021994 1013895 1009170 1007512 1007897 1009733 1012951 1016961
50266 1016961 1020361 1022102 1022459 1022360 1022107 1021213 1019380 1017112 1015264 1014215 1013615 1012809 1011469 1009826 1008313 1007027
50250 1007027 1005714 1004288 1003115 1002696 1003343 1005418 1009653 1016883 1027502 1041439 1058638 1079184 1102913
50237 1102913 1129141 1156950 1185693 1215214 1245618 1276736 1307623 1336749 1363019 1386628 1408661
50226A408661K1079J9577J6989J3690J0117O033P45o213j4581k3337l1132l7051
50214A384577m0921m2860m2806m0810l7489l3642k9439k4581j9312j4830j2424
50203A045463j2596j5011j8819k2777k5627k6835k6760k5796k3778k0617j7147
50192H09700j4612j3371j2622j1542j0180r063q366p792p064o205n376m644l955
50179F94908l266k700k528k892l499l730l191k080r61k61n9k06m32l76J91J073
50163F69991J733J862J755J984K807M068N585P301Q951R982J0064R535Q998Q526
50149G53142P596N800L417J173l76j185j618k059k476k380j350M59K525M624O904
50134G74196R295J1286J2567J3463J4408J5346J6103J7140J9249K2561K6433L0442
$$ plain form
50226 1408661 1429740 1449317 1466306 1479996 1490113 1496146 1496891 1490678 1476097 1452760 1421628 1384577
50214 1384577 1343656 1300796 1257990 1217180 1179691 1146049 1116610 1092029 1072717 1057887 1045463
50203 1045463 1032867 1017856 999037 976260 950633 923798 897038 871242 847464 826847 809700
50192 809700 795088 781717 769095 757553 747373 738310 729944 722152 715088 708883 703507 698863 694908
50179 694908 691642 688942 686414 683522 680023 676293 673102 671022 670061 669800 669741 669535 669103 668727 668918 669991
50163 669991 671724 673586 675341 677325 680132 684200 689785 697086 706037 716019 726083 735618 744616 753142
50149 753142 760738 766538 769955 771128 770752 769567 767949 765890 763414 761034 759684 760143 762668 767292 774196
50134 774196 783491 794777 807344 820807 835215 850561 866664 883804 903053 925614 952047 982489
50122I82489L4843L9842M4943M9463N3272N6469N8619N8988N7602N5476N3661
50111A545667N2415N1550N1061N0999N0799M9238M5139L7941K7698J4793j55j6160
50099A960985l1793m5394n5701o2517o6653o9003o9675o8269o4776n9803n3971
50088A313430m7575m1051l5249l0714k7025k3384j9765j6962j5392j4381j2938
50077A028994j0890q837p181n685m077k689k147k440k764k427j730j572k326l526
50063I70703m686n958p592r187r961r668q760p744o829o160n903n904n726n174
50049H71451m466l687k512p75J134K819M503O557Q617R878J0212J0422J1176J2198
50035I37527J2808J2904J2954J3180J3188J2532J1292R936Q701P348N524L192
$$ plain form
50122 982489 1017332 1057174 1102117 1151580 1204852 1261321 1319940 1378928 1436530 1492006 1545667
50111 1545667 1598082 1649632 1700693 1751692 1802491 1851729 1896868 1934809 1962507 1977300 1977145 1960985
50099 1960985 1929192 1883798 1828097 1765580 1698927 1629924 1560249 1491980 1427204 1367401 1313430
50088 1313430 1265855 1224804 1189555 1158841 1131816 1108432 1088667 1071705 1056313 1041932 1028994
50077 1028994 1018104 1009267 1002086 996401 992324 989635 987488 985048 982284 979857 978127 976555 974229 970703
50063 970703 966017 960059 952467 943280 933319 923651 914891 907147 900318 894158 888255 882351 876625 871451
50049 871451 866985 863298 860786 860011 861145 863964 868467 875024 883641 893519 903731 914153 925329 937527
50035 937527 950335 963239 976193 989373 1002561 1015093 1026385 1036321 1045022 1052370 1057894 1061086
50023A061086O91j585l405m646n276n466n666o306p386q401q720q013o408m341
50009I86158k322o00J046L179O256J0353J5286K0832K6525L1489L4915L6893L8263
49996A208273L9345L9300L7260L3755L0176K6992K3431J9105J4986J2117J0117
49985A494857P678L953j352q713j8404k9410l9748m7991n3737n6731n6706n4285
49973A139411n0910m7260m2734l7039l1380k7141k4152k1243j8019j5035j2552
49962H11946j0129p422m540j625J136L217M286N037O527Q536R518Q523O385M547
49948H45942L383K255O41j373l457n290o669p766r047j0690j2254j3320j4152
49935G68203j5248j6463j7085j6751j5756j4446j2731j0505q162o350n271m515
$$ plain form
50023 1061086 1061777 1060192 1056787 1052141 1046865 1041399 1035733 1029427 1022041 1013640 1004920 996907 990499 986158
50009 986158 983836 983236 984282 987461 993717 1004070 1019356 1040188 1066713 1098202 1133117 1170010 1208273
49996 1208273 1247618 1286918 1324178 1357933 1388109 1415101 1438532 1457637 1472623 1484740 1494857
49985 1494857 1502535 1506488 1505136 1496423 1478019 1448609 1408861 1360870 1307133 1250402 1193696 1139411
49973 1139411 1088501 1041241 998507 961468 930088 902947 878795 857552 839533 824498 811946
49962 811946 801817 794395 789855 788230 789366 792583 796869 801906 808433 816969 826487 835010 841395 845942
49948 845942 849325 851580 852221 850848 847391 842101 835432 827666 818619 807929 795675 782355 768203
49935 768203 752955 736492 719407 702656 686900 672454 659723 649218 641056 634706 629435 624920
49923F24920l577k376j176q6J136K673M157M805M246L108K668L716N803P718Q810
49908F66545R619J1003J2857J4154J4230J3531J2849J2331J1659J0722R545P837
49896H06882N369K568Q6k251n317r323j3288j6094j7540j7946j7431j6077j4394
49883F85244j2993j1927j0915j0020r665r873r953r089p203n157m024m064m379
49870E75982l807k143j96J369K779M510O407P897Q859R856J1451J3560J5448J6261
$$ plain form
49923 624920 621343 618967 617791 617705 618841 621514 625671 630476 634722 637830 640498 644214 650017 657735 666545
49908 666545 676164 687167 700024 714178 728408 741939 754788 767119 778778 789500 799045 806882
49896 806882 812251 814819 814905 812654 807337 798014 784726 768632 751092 733146 715715 699638 685244
49883 685244 672251 660324 649409 639389 629724 619851 609898 600809 593606 588449 584425 580361 575982
49870 575982 572175 570032 569836 571205 573984 578494 584901 592798 601657 611513 622964 636524 651972 668233
$$ [...]
##END NTUPLES=NMR SPECTRUM
##END=
