##TITLE=AC1745_SEN00018_9280926_VILM59K7Pi
##JCAMPDX= 6.0         $$ Bruker NMR JCAMP-DX V2.0
##DATA TYPE= NMR SPECTRUM
##DATA CLASS= NTUPLES
##ORIGIN= BRUKER
##OWNER= Administrator
$$ 1.72 TOPSPIN		Version 2.1
$$ 2015-07-18 01:44:32.697 -0700  Administrator@X
$$ Compression mode = diff/dup
##.OBSERVE FREQUENCY= 400.02188249412
##.OBSERVE NUCLEUS= ^1H
##.ACQUISITION MODE= SIMULTANEOUS (DQD)
##.ACQUISITION SCHEME= undefined
##.AVERAGES= 8
##.DIGITISER RES= 22
##SPECTROMETER/DATA SYSTEM= spect
##.PULSE SEQUENCE= zg30
##.SOLVENT NAME= COFFEE_meoh
##.SHIFT REFERENCE= INTERNAL, COFFEE_meoh, 1, 14.98509
##AUDIT TRAIL= $$ (NUMBER, WHEN, WHO, WHERE, PROCESS, VERSION, WHAT)
$$ ##TITLE= Audit trail, TOPSPIN		Version 2.1
$$ ##JCAMPDX= 5.01
$$ ##ORIGIN= Bruker BioSpin GmbH
$$ ##OWNER= Administrator
$$ $$ E:\/data/COFFEE/nmr/AC1745_SEN00018_9280926_VILM59K7Pi/10/pdata/1/auditp.txt
$$ ##AUDIT TRAIL=  $$ (NUMBER, WHEN, WHO, WHERE, PROCESS, VERSION, WHAT)
(   1,<2015-07-18 01:44:25.307 -0700>,<Administrator>,<X>,<go>,<TOPSPIN 2.1>,
      <created by zg
	started at 2015-07-18 01:43:19.369 -0700,
	POWCHK enabled, PULCHK disabled,
       configuration hash MD5:
       21 0F 79 D6 B3 7B B4 F6 88 20 88 DB 03 48 BD 9F
       data hash MD5: 64K
       E0 6B 36 7D 4C 68 65 45 A5 38 7E 68 B8 56 60 9C>)
(   2,<2015-07-18 01:44:28.541 -0700>,<Administrator>,<X>,<proc1d>,<TOPSPIN 2.1>,
      <Start of raw data processing
       efp LB = 0 FT_mod = 6 PKNL = 1 PHC0 = 0 PHC1 = 0 SI = 32K 
       data hash MD5: 32K
       D6 72 D4 BA DA BC 09 24 97 B8 4F 95 32 1E 97 D5>)
(   3,<2015-07-18 01:44:28.807 -0700>,<Administrator>,<X>,<proc1d>,<TOPSPIN 2.1>,
      <pk PHC0 = 90.9613 PHC1 = 0 
       data hash MD5: 32K
       80 F5 FD F8 27 61 FA 9F A4 F9 16 70 E6 C5 58 97>)
(   4,<2015-07-18 01:44:28.947 -0700>,<Administrator>,<X>,<proc1d>,<TOPSPIN 2.1>,
      <abs ABSG = 1 
       data hash MD5: 32K
       17 CB A5 8D 97 2F E5 B8 B7 59 C3 49 2D 0A 72 6F>)
(   5,<2015-07-18 01:44:29.010 -0700>,<Administrator>,<X>,<proc1d>,<TOPSPIN 2.1>,
      <abs ABSG = 2 
       data hash MD5: 32K
       DE B7 52 D5 CB 9E AF A4 AC 99 54 50 B7 0D 53 AC>)
(   6,<2015-07-18 01:44:29.072 -0700>,<Administrator>,<X>,<proc1d>,<TOPSPIN 2.1>,
      <abs ABSG = 3 
       data hash MD5: 32K
       C7 88 63 91 76 94 FB 7A 3D B2 C5 DA BC DB 53 7D>)
(   7,<2015-07-18 01:44:29.150 -0700>,<Administrator>,<X>,<proc1d>,<TOPSPIN 2.1>,
      <abs ABSG = 4 
       data hash MD5: 32K
       C1 A8 E3 AA 0B 4B BD 08 D4 93 64 23 93 3C D9 0A>)
(   8,<2015-07-18 01:44:29.213 -0700>,<Administrator>,<X>,<proc1d>,<TOPSPIN 2.1>,
      <abs ABSG = 5 
       data hash MD5: 32K
       54 08 30 89 20 67 EC 74 EF 50 73 D2 2E 97 98 16>)
$$ ##END=
$$ 
$$ $$ hash MD5
$$ $$ 77 03 AD 8F 12 19 50 B7 AE 5D FD 3F AE DA BD 28
##$RELAX= 
##$RELAX= 
##$RELAX= 
##$RELAX= 
##$RELAX= 
##$RELAX= 
##$RELAX= 
$$ Bruker specific parameters
$$ --------------------------
##$DU= <E:\>
##$EXPNO= 10
##$NAME= <AC1745_SEN00018_9280926_VILM59K7Pi>
$$ [...]
150 150 150 150 150 150 150 150
##$TP07= 0
##$TPNAME0= <>
##$TPNAME1= <>
##$TPNAME2= <>
##$TPNAME3= <>
##$TPNAME4= <>
##$TPNAME5= <>
##$TPNAME6= <>
##$TPNAME7= <>
##$TPOAL= (0..7)
0.5 0.5 0.5 0.5 0.5 0.5 0.5 0.5
##$TPOFFS= (0..7)
0 0 0 0 0 0 0 0
##$TUNHIN= 0
##$TUNHOUT= 0
##$TUNXOUT= 0
##$USERA1= <user>
##$USERA2= <user>
##$USERA3= <user>
##$USERA4= <user>
##$USERA5= <user>
##$V9= 5
##$VALIST= <valist>
##$VCLIST= <CCCCCCCCCCCCCCC>
##$VD= 0
##$VDLIST= <DDDDDDDDDDDDDDD>
##$VPLIST= <PPPPPPPPPPPPPPP>
##$VTLIST= <TTTTTTTTTTTTTTT>
##$WBST= 2048
##$WBSW= 25
##$XGAIN= (0..3)
0 0 0 0
##$XL= 0
##$YL= 0
##$YMAX_a= 607509
##$YMIN_a= -521605
##$ZGOPTNS= <>
##$ZL1= 120
##$ZL2= 120
##$ZL3= 120
##$ZL4= 120
##$ABSF1= 14.98509
##$ABSF2= -5.573092
##$ABSG= 5
##$ABSL= 3
##$ALPHA= 0
##$AQORDER= 0
##$ASSFAC= 0
##$ASSFACI= 0
##$ASSFACX= 0
##$ASSWID= 0
##$AUNMP= <proc_prof1d_extract_pilot.lims>
##$AXLEFT= 0
##$AXNAME= <>
##$AXNUC= <1H>
##$AXRIGHT= 0
##$AXTYPE= 0
##$AXUNIT= <>
##$AZFE= 0.1
##$AZFW= 0.1
##$BCFW= 0
##$BC_mod= 0
##$BYTORDP= 0
##$COROFFS= 0
##$CY= 15
##$DATMOD= 1
##$DC= 0
##$DFILT= <>
##$DTYPP= 0
##$F1P= 0
##$F2P= 0
##$FCOR= 0.5
##$FTSIZE= 32768
##$FT_mod= 6
##$GAMMA= 0
##$GB= 0
##$INTBC= 1
##$INTSCL= 1
##$ISEN= 128
##$LB= 0
##$LEV0= 0
##$LPBIN= 0
##$MAXI= 10000
##$MC2= 0
##$MEAN= 0
##$ME_mod= 0
##$MI= 0
##$NCOEF= 0
##$NC_proc= -8
##$NLEV= 6
##$NOISF1= 0
##$NOISF2= 0
##$NSP= 0
##$NTH_PI= 0
##$NZP= 0
##$OFFSET= 14.98509
##$PC= 1
##$PHC0= 90.9613
##$PHC1= 0
##$PH_mod= 1
##$PKNL= yes
##$PPARMOD= 0
##$PPDIAG= 0
##$PPIPTYP= 0
##$PPMPNUM= 2147483647
##$PPRESOL= 1
##$PSCAL= 4
##$PSIGN= 0
##$PYNMP= <proc.py>
##$REVERSE= no
##$SF= 400.02
##$SI= 32768
##$SIGF1= 0
##$SIGF2= 0
##$SINO= 400
##$SIOLD= 32768
##$SPECTYP= <>
##$SREGLST= <1H.CDCl3>
##$SSB= 0
##$STSI= 32768
##$STSR= 0
##$SW_p= 8223.68421052631
##$SYMM= 0
##$S_DEV= 0
##$TDeff= 65536
##$TDoff= 0
##$TI= <>
##$TILT= no
##$TM1= 0
##$TM2= 0
##$TOPLEV= 0
##$USERP1= <user>
##$USERP2= <user>
##$USERP3= <user>
##$USERP4= <user>
##$USERP5= <user>
##$WDW= 1
##$XDIM= 32768
##$YMAX_p= 442109953
##$YMIN_p= -705426
##$CURPLOT= <Network HP LaserJet P1505>
##$CURPRIN= <$Network HP LaserJet P1505>
##$DFORMAT= <normdp>
##$LAYOUT= <+/1D_H.xwp>
##$LFORMAT= <normlp>
##$PFORMAT= <normpl>
##$SURQMSG= 1
$$ End of Bruker specific parameters
$$ ---------------------------------
##NTUPLES= NMR SPECTRUM
##VAR_NAME=  FREQUENCY,     SPECTRUM/REAL,   SPECTRUM/IMAG
##SYMBOL=    X,             R,               I
##VAR_TYPE=  INDEPENDENT,   DEPENDENT,       DEPENDENT
##VAR_FORM=  AFFN,          ASDF,            ASDF
##VAR_DIM=   32768,         32768,           32768
##UNITS=     HZ,            ARBITRARY UNITS, ARBITRARY UNITS
##FACTOR=    0.250966925370066, 1,           1
##FIRST=     8223.43324360094, -163420,      115560
##LAST=      0,             28839,           -120982
##MIN=       0,             -705426,         0
##MAX=       8223.43324360094, 442109953,    0
$$ Real data points
##PAGE= N=1
##DATA TABLE= (X++(R..R)), XYDATA
$$ [...]
23847 211739 -133639 109323 246492 117380 18237 -119455 29308 490555 357195 28180
23836 -79584 29821 -121682 -172273 115686 206067 87337 30689 -42764 8135 -168640 24021
23824 -106544 -111691 -117414 -75184 159720 303548 28884 -257004 -162175 258103 -97332 245555
23812 -27531 -39977 262652 -240640 -329054 -121453 13492 185480 -64609 140158 -193447
23801 221881 -209457 -66447 291689 40376 -297319 116261 -149446 -218364 -518425 -538 236816
23789 67569 -212874 -139766 11812 -228623 69128 155979 -228888 122658 130687 158082 41708
23777 57214 -68844 -11531 -124094 226963 111346 -207813 -35789 -43918 -175271 65332 -54750
23765 -396755 -267628 199185 68526 -39330 177742 166584 183409 -66613 -202188 -361288
23755 -361288 201757 -240656 -240538 -223480 -22970 19171 -327686 -153286 -25612 164577 181238
23744 181238 63590 37917 -152111 -232723 31238 48071 319608 -275618 -183389 -196236 332432
23732 -80382 184576 -166962 -15492 -190113 -228872 149922 -73374 99890 60564 95507 -194047
23720 -42696 -115448 177328 -60057 -9476 -136561 17277 13756 -288738 90866 -84667 24660
23708 218212 -192253 327935 -111872 -378537 -60865 -157655 -145962 27192 -54857 -111434 -43898
23696 137652 38148 -66513 -69187 -114063 41883 121649 -227633 10468 109123 -170838 83258
23684 -180214 -213058 -170914 -64299 -40909 32396 -121848 35981 -34138 -9558 -61300 -55403 14141
23671 -44026 26189 -171138 -231648 -72273 132840 96977 -90218 -2939 -149708 -200911 -164555
23660 -164555 13729 53716 -180070 363329 110665 -193618 231588 -290312 -177687 -359209
23650 -359209 104737 183841 371974 133356 196855 -138808 -167328 -79554 1854 -135330 -25684
23638 -87669 -55308 -96389 -8174 249269 -64029 114516 -100126 -6753 -377158 -45913 51596
23626 152645 31392 -68133 -228645 121365 136718 -232063 -251907 -157909 245758 221942 -78723
23614 -340822 -54541 -65010 57168 -305375 -9440 189346 22444 -49975 321026 -108804 -6813
23602 -70217 41915 168905 21428 -51442 14947 21458 277937 173641 24515 251255 40511
23590 346409 146396 -134795 120781 -299319 -149226 -192449 -191361 390512 16542 -48095
23579 64059 -20644 160294 74104 -26141 -326023 -217848 -121132 125922 -203606 -163656 -224693
23568 -224693 410182 -41376 108561 160970 139440 -112769 16540 -28057 50761 142227 -82165
23556 -104521 -105541 -223448 50521 107062 -217109 -35784 -229474 -97388 251122 -228933 98259
23544 -80372 -73950 -235388 -147666 -481631 191869 -46945 -179333 178343 11491 94112 -421765
23532 166111 -56711 -99544 198230 77070 25066 -71405 -298092 -35406 -58615 100788 247084
23521 247084 203461 -361772 4412 32413 -374343 162095 -165525 -304449 150919 137237
23511 137237 60713 25805 -27074 262198 168609 -182035 -189633 -183575 200593 -12032 -132931
23500 -132931 30491 -156725 198829 28200 -184186 138576 -181001 -173230 191331 369495
23490 369495 -10265 217206 -252262 322464 -13289 -11108 146754 87935 41118 -45727 298193
23478 -19346 171299 142337 159425 46189 -235758 -79369 -455758 -29983 -82255 42921 41950
23467 41950 -57582 -56721 -54128 -354395 -137775 -111101 171029 4764 192249 105063 -84947 159138
23454 87578 -106888 -170178 -24041 19086 227638 -72100 -392609 -8650 -260129 -263713 -386792
23443 -386792 -145076 12436 259889 111488 -274584 54011 182627 -158822 -23450 -18324
23433 -18324 167311 -65595 310113 -131910 88645 156039 -21277 64355 -295431 181541 -36189
23421 10336 -81162 411425 121055 -27644 -70670 -164927 -42697 -41775 -106511 111031 241854
23410 241854 52150 155022 -6591 75049 -115444 -98107 -284437 24913 42806 -1765 8051
23398 -108045 46239 -54310 -2895 134452 -97687 205170 174748 -120664 -114458 -130338 -192152
23387 -192152 -36071 16090 1086 157802 -178841 -164025 -81002 121915 -13216 214651 -157053
23375 87083 -143841 -133560 272495 62316 80475 -159960 -219169 -408223 70260 -158921 -266219
23364 -266219 100370 31115 -62704 -52794 164003 118452 177870 53498 -258531 -274346 -37076
23352 81710 217920 -79579 45799 274933 -30223 181376 125142 -29817 31255 -256289 78874
23340 -18577 270218 59163 -58347 -166030 -241038 63207 -14896 26543 154604 -41767 129317
23328 -27979 -234486 -118239 -3902 -129493 138613 181777 -299483 250948 167768 -185447
23317 -130322 -118766 253683 118531 -164368 317969 -259362 125798 -14388 -33595 -174517
23307 -174517 -357114 -220117 113385 112685 72021 150774 -118155 113906 284081 -74069 -83808
23296 -83808 63280 -102816 -56711 -705426 -18030 -182612 -59106 302363 166551 79245 65292
23285 65292 280404 -191468 -48955 -99450 136081 91259 -11959 -135993 -143643 -149730 13515
23273 668 355781 -75259 30488 -249878 -14581 -235313 -220884 185130 -33479 -36335 252853
23261 32574 -175143 246916 -159788 110183 -6055 -88180 -107289 31625 -63897 115845 56948
23249 -344267 -145172 -188596 -67277 -81835 354429 24505 10667 164300 -154145 329088
23238 -381444 -136047 197339 135351 -140846 316310 -96700 -99424 69667 37192 -505740 -17910
23226 -63979 -433452 -178126 -254541 -468520 -152217 -335459 70722 -139753 -171425 160070
23215 -32559 -140372 -258859 27384 -171404 -311120 -196713 37484 -257521 -174666 191057
23204 -195041 -142311 145722 -115297 -144874 -220752 -13547 37505 -406669 -8063 -4299 60325
23192 -127355 283725 -488018 -236953 3452 53715 26774 14434 7588 125806 -322253 -145294
23180 47630 -6401 109795 177135 79386 -84967 -51131 17350 106678 -236444 -264605 430960
23168 -162459 -135253 -107218 189087 -244421 204707 -193603 -124030 -137402 -60119 227437
23157 -56510 5340 -317034 123224 -370284 211594 97920 -56916 -18220 186432 -331389 -87201
23145 16299 171122 219355 107103 -246562 -37599 -22830 4532 200884 -81941 4895 -28830
23133 -98504 -47696 -75843 -5778 45892 -102814 112736 108121 196691 -244217 -155227 -117585
23122 -117585 184431 -140515 -182633 -29723 151712 -411312 129321 14333 42203 110065
23112 110065 23734 -78959 80399 195127 115706 28142 9116 -174029 7570 320996 -175082
23100 31196 -97641 116536 -20115 -165517 139114 4315 -74164 -194330 135370 -362961 -102902
23088 -435827 -29183 374510 -96889 -185956 -36929 278373 145603 154956 -162419 116797 250439
23077 250439 -179127 44128 36202 66473 37647 -134620 181062 -233194 -108241 -10370 -34396
23066 -34396 44010 270823 -329074 -261120 134224 108373 131488 -107346 -325503 178140
23055 -354984 257166 -15706 -143656 161783 15123 -247058 95356 -212237 187614 -271983
23044 36206 -407523 186030 -101375 -236051 207308 -159393 -437288 49263 -41731 -188072
23034 -188072 173052 -83300 -336050 -7842 -180903 -45190 204721 56763 282247 -36976 136755
23022 -298213 -146837 -63846 -71485 240857 -299962 -27058 129117 -29842 166498 41961 -160127
23010 -40287 125991 -231764 190881 -244173 -152119 -108162 -644301 -294365 135178 -115615
22999 -45360 1291 25285 122404 -141330 1946 -86941 197301 288 6583 -154909 -119024 277220
22986 -236734 168896 -158601 -158789 -211284 -228939 -242265 185602 148059 139864 -126632 -33937
22974 115693 55028 -325793 -88280 -165620 -24447 -44266 75936 196528 236951 -37470 59746
22962 37776 133193 350617 -225831 30902 -11058 -85937 141403 -280277 61433 -87613 77609
22950 196590 37631 39639 93232 23195 -231560 50285 252157 -123022 -272214 -90697 26841
22938 340415 -258477 238491 204238 -179899 -140023 -182723 274869 -421430 21088 -304915
22927 -280065 155626 -10671 -180272 -109125 -318722 -114151 50039 -86020 38431 -14101 111
22915 55396 392015 -31254 -251871 -22273 -137145 -170394 80381 150050 -19034 -107452 -24188
22903 -95735 -79287 -164836 -231256 158401 318 223447 82362 48367 27961 -53189 -181946
22892 -181946 183925 51509 31594 -118725 -187472 -287538 -87704 -202409 -69239 44370 -6790
22880 185043 -63976 7428 -87023 -14233 100715 115135 83665 -19078 -244439 -240602 -52811
22868 46936 -149225 -61315 -166984 -134982 53158 -118635 98214 -245419 120750 206251 22393
22856 212133 41269 2876 262134 333317 233436 165809 -135360 206831 49703 -169822 -13019
22844 -45475 -6632 -33785 -36808 170716 -3057 -270152 -105860 -110616 -2006 63471 -187072 212701
22831 37934 193827 284922 -84880 -229159 -39311 -149883 -157225 -190436 58712 -74034 15821
22819 -70448 104343 168165 49829 -34348 -59435 80568 57144 -158388 -94776 288239 -977
22807 -10997 61515 -128465 93112 -97959 -48988 -65167 -76942 103855 -215429 22592 82840
22796 82840 186298 63915 -72986 -141158 -223239 107680 -400383 37210 64636 -10706 -248295
22785 -248295 -293096 -73429 254727 -73812 -110719 69706 110298 177949 187859 -254898 -2579
22773 -36771 -209227 -86243 35758 340858 43447 -296203 -86247 -176034 -55006 -399184 180676
22761 -25841 -22820 240221 -165122 1262 223715 -96739 -105382 -196536 271571 -2718 -193113
22750 -193113 -97853 -51484 -129177 -240514 -91393 -230830 -118115 -16595 188415 117160 -174636
22738 -236438 -177750 165653 -51607 -83915 38840 174818 168387 -186594 -151414 -101677 -4192
22726 -40736 -7397 -159103 -406639 -89222 -112050 -196963 232690 -266305 46636 141436 -147123
22714 -162807 -143891 -116127 62580 133078 -13612 82130 -84060 -59744 -116451 -118427 -206689 377436
22701 -207476 106716 -287708 -11672 126920 -54902 -220268 168133 -101911 63292 -81000
22690 -4537 -306601 58296 77737 68278 157751 167643 -125367 -93532 5665 -205543 132550 -191523
22677 165656 -33298 -163440 -226846 25435 33293 248190 -66287 59827 234438 -130786 -4481
22665 134885 183816 19860 -77015 -175794 8646 -199196 129947 -219582 56751 10161 -190216
22653 146589 20424 192761 31151 -200692 -66850 79883 82491 -91342 120406 102400 -148358
22641 276642 -97571 -346005 -197319 -400267 -129642 97296 146344 18229 -153809 17276
22630 -163713 -324094 -258004 -9154 143711 92427 -93435 -2165 3146 -65636 -440274 158590
22618 122555 -6336 191151 181488 194300 -156066 -37766 -160903 -250918 -208402 137741 78384
22607 78384 -163680 88858 7612 -306709 51638 -71076 -10134 -204487 -137774 -447299 47417
22595 270380 -73216 -489 90686 206381 184042 -217476 -3118 -57445 -62864 112403 198054 80280
22582 -67198 -61610 327405 82836 43592 -93595 -364031 -190218 -158664 -46248 -128422 27852
22570 -165857 -148216 -261980 -25542 113016 29185 -373510 70002 -82890 57595 78195 -101009
22558 -94760 97635 -148027 167322 315464 -109510 -34377 -51552 -96076 -378467 -270972
22548 -270972 -123226 -267474 -81696 -119676 93632 -186860 410952 -41359 -178465 -85620
22537 60420 95547 85981 -42618 49139 -268601 162878 -172045 -115949 205123 -189961 -179960
22526 -179960 87138 53150 133378 -161240 -46197 -171331 69503 291965 61427 134251 96442
22515 96442 -118528 104101 -129856 63536 -410668 125629 -81973 -115347 -112085 -366740 -155266
22503 117439 -13945 149041 -3098 108734 180989 -15902 67381 262105 103164 -304361 -295497
22492 -295497 23007 -153880 -216009 40439 -60099 131385 102609 88913 -153384 -43787 1904
22480 -72987 70051 -127254 -52727 130475 72024 -106923 136237 -25698 -65368 126313 -170744
22468 72591 -369981 3705 24279 -487720 -116086 -71876 -236770 -316387 28827 -159180 160845
22456 245494 -93496 39066 143291 -3243 -61720 -225752 8361 280752 170195 -346751 -224259
22445 -224259 -281347 89623 -173432 -153756 -88457 -56025 -65895 178068 -115367 -1637 303082
22433 127668 -142239 -93534 -233758 -332709 120816 133370 -195353 -77753 410167 40956
22422 -31671 -307875 136166 -66327 115030 61192 95180 -78574 185193 2772 26926 -149427
22410 -360923 -355607 -281911 -219792 58237 -64920 -22988 14609 -156016 10160 -122821 -202880
22399 -202880 -18456 5423 257421 178916 -2973 -129788 -40402 -185122 159660 61711 101010
22388 101010 -33439 -7155 -54445 36583 -59147 255876 -124402 15390 -22861 -330643 78699
22376 -70037 195962 -221865 -336126 226837 25743 -143333 -66728 -129514 2090 155382 -3197
22364 92139 -53236 -25875 -98941 61094 23217 142357 53521 286485 74559 127367 -90939
22352 -260116 119385 -103167 -43843 298607 -152545 -203655 -197697 317384 -201901 -31040
22341 -164424 -325388 -28639 165274 -108286 -318389 -98284 -133663 47792 -3829 131488 187387
22330 187387 -143908 19688 -151547 23443 197340 -116922 -1575 -121565 90522 -3830 45553
22318 -280601 63114 93360 -30403 234132 229963 109443 -31460 16825 135350 85176 53466
22307 53466 325532 367640 -78566 108171 -194768 -97654 -65585 -123288 176160 -236490 -130920
22296 -130920 132096 17858 -595056 3565 21437 102861 -4610 47404 -50454 143167 193081
22285 193081 143445 -182098 78265 -5520 -186170 -205390 57152 -197639 -286475 -66300 -462341
22274 -462341 -83461 164701 -74591 -144039 -61713 92994 101038 -42137 77551 46957 482 -251510
22261 -325270 110235 -374738 46326 -159963 -71557 -154414 -364648 -15547 60319 -165146
22250 81474 45360 -203680 140952 11988 109719 -222691 154803 -277970 65664 -203512
22239 -8730 249841 -14383 -93841 -54792 -8307 -63204 171733 135538 114827 -175071 -45047
22227 118533 145407 113684 -205612 -134045 301611 310668 -109221 -32462 -279344 65908 -165291
22215 90444 -100002 -174967 -31070 197237 28193 127495 -97394 219179 144952 -95347 191864
22203 -224530 -139659 305817 -42812 -69363 150847 -68221 -7619 -14247 -244574 -154561 55127
22191 -80439 -203685 38623 -117214 -147163 -98192 80073 -9737 132769 -62802 -25014 -129583
22180 -129583 -87188 74739 252888 -471215 -41263 -166690 -173052 6767 53420 18449 -229679
22168 210450 -303358 341291 46887 -279221 -243021 -17642 48503 -116429 -83255 90130 -158828
22156 -281847 -368270 -6377 -176762 -14859 -102559 90282 -49906 -13137 -180447 191340 -15031
22144 140914 213369 -109339 -445753 308126 -378686 27607 46033 -114110 228576 -59815
22133 -71175 -177690 -75566 -167094 21139 -107423 -13547 -271007 -506077 5960 27265 -79519
22121 182007 -210240 -219563 -11480 -297683 -119526 123358 69415 -130897 114455 51501
22110 311763 459986 -524612 142615 -139853 46380 111560 -44703 37157 -84176 -116457 92928
22098 404413 -176794 -322917 73339 -209207 -91604 -295254 -37070 -10454 -69214 145098
22087 112124 -168284 167027 -98402 -52725 -91130 13647 -197568 6654 161147 117005 127428
22076 127428 -37845 -57759 -72886 120031 -79624 -164816 60120 142861 -79618 -11142 -130417
22065 -130417 122609 -62217 -163437 -268051 -35769 -172864 7766 -33169 146502 -22251 107204
22053 -110351 -32655 -234957 105302 186658 -45379 -240630 -210270 -134669 -81976 164546 -316257
22041 -141953 -251900 -592 201913 195194 -249334 -228012 42105 202019 4963 -228121 -235418
22030 -235418 -182398 161396 61084 -144927 2294 -75095 -16291 148909 31337 72263 99137
22019 99137 116638 -55299 315771 36061 -176178 -46465 111049 86299 19064 101740 -69550
22007 48796 -183751 73288 -108668 101791 84000 -125790 44684 -96035 -302635 -25515 2901
21995 -24709 -174294 -156655 40201 8403 -209176 185410 -50553 18039 355714 -195985 -31854
21983 -70270 -47845 187309 -53535 -205666 -120446 -54002 -90383 -349617 -39830 108223 336661
21972 336661 -103025 -114681 194464 -168638 69046 -203272 -207385 99830 28681 92201 -61034
21960 211298 -164566 59102 -83032 431656 -45113 -223762 93494 198419 -178002 59732
21949 -289996 47591 -121682 108542 353491 -185141 -213985 223907 59351 -119129 -273118
21939 -273118 -26237 166000 -46834 34453 168188 -78617 -379129 -145070 37983 100182 -166810
21927 -132851 -275232 -202563 -124454 -160381 -260629 -101267 -11845 231921 -523066 439308
21916 -164355 21376 -3517 -67085 -398081 182723 -305995 -267564 -172448 -117804 -190605 -117027
21905 -117027 -3909 275714 -451890 304314 -128011 -63274 -363247 64424 -92621 -151869 51404
21893 -95508 -21177 29579 46561 -95037 -184666 52880 -45186 87249 -55293 -410470 267772
21881 -271619 -96665 -176944 -279878 -202776 -20215 -176687 -213132 264834 -306235 -47261 -281214
21870 -281214 26905 190032 -257085 -41705 -139900 142358 126625 -20888 -85490 -78518 -78216
21859 -78216 177693 -37851 2168 -156475 -135839 165750 -55611 -164086 106417 10668 242649
21848 242649 -438840 135847 276928 245454 -110839 279107 -39700 -109026 94407 290317
21838 290317 -11516 -35956 118468 -116653 -3946 82414 -110243 309313 -240384 196883
21827 -104587 -27585 -155770 41724 322603 161499 -30457 -106886 -287275 -212501 -23335 -187998
21816 -187998 138326 276920 323399 -287735 -132561 -42608 67957 50420 -222263 -103138
21805 54898 -150570 -4900 -186363 -55305 210813 69051 211875 -46654 72178 -311168 256391
21793 -231337 -214128 -91960 4035 -372595 -99407 -102050 154397 -191663 220400 331673 179480
21782 179480 -53046 48193 20142 63057 -71544 247425 -320433 -370621 -790 -341481 -797 -109391
21770 -109391 -8030 -60947 -73226 82974 138180 26241 84129 -85910 6684 108023 -234292
21758 98460 -175751 -161870 51515 -191627 157655 -89355 -6188 -197159 -251379 -110660 -24085
21746 320542 109742 -75129 143700 -199951 166209 74931 -38557 -104570 136005 139097 -31756
21734 26236 -51886 -119273 49210 24331 -201479 -102629 -126011 -260170 144514 -105762 -188503
21723 -188503 -54401 -210411 30149 -302840 221221 27011 58810 -205933 -277717 -40629 -246553
21712 -246553 89884 144698 -241521 102459 -55199 -70765 18433 93360 -19950 179575 -315701
21700 -213575 82469 -165152 -234978 -191517 -305519 -205076 150010 -301338 -110981 118582
21689 13202 -151872 82074 65453 -91122 325884 -197700 -248379 -94641 -145153 111714 10394
21677 -185932 -199317 70775 -195563 195901 150893 45044 -143256 79227 -66192 151169 -134173
21665 -99067 -93174 -74829 54910 -209456 -169404 272485 -40408 -286782 -11095 -356236 76752
21653 -2512 -199683 241153 8268 100976 87675 -88530 69084 6423 323 -321907 175513 -117781
21640 125488 -100903 77042 -446369 -62218 180979 -120807 -8165 -123534 188490 -167037
21629 -138684 -200601 -412923 97206 79658 222482 -148052 154863 160798 -91646 -61871 -98545
21618 -98545 -78685 -122390 127530 117412 -27108 -244481 95604 245980 29746 234646 77602
21606 8288 -107207 129531 -204779 -34110 321924 -146065 71073 -213483 171721 219591
21596 219591 -76581 -279068 167406 3688 -1826 96104 150308 -126111 -208375 -77915 -75233
21585 -75233 -214528 -80224 -165633 -39822 73664 -39476 333717 182276 112172 -9975 -418901
21574 -418901 56565 228304 -46634 -300989 -324754 -311773 -257291 -197032 -193692 -50292 -169841
21563 -169841 131687 71809 84189 198758 -50678 -351213 77502 -55631 -177612 -165180 130891
21551 10170 155256 -365984 73703 94086 239404 -83700 -164757 -32503 46115 17914 -4435
21539 12848 -61775 92214 -93891 -313761 -69459 41371 -71414 -60007 -128823 -7404 130637
21527 -291075 121023 209208 -250922 -153706 -96170 137256 -125812 -402451 -91177 318386
21516 151870 -430749 -120578 23910 -10965 -18450 -202534 -330269 -143154 -84671 -224631
21506 -224631 42985 -65720 148670 -73375 150169 -66959 -143352 -212851 -54500 -56474 111864
21494 75547 -383398 -96988 -13817 -83602 -87713 -308846 -207558 163803 -220979 -226206 -157923
21483 -157923 -112575 -87510 -3261 -105914 131832 -129578 -29906 136948 -125976 -342218
21473 -342218 -23112 -268283 -57151 164173 109667 48342 91057 -212420 -44179 -6241 -221724
21462 -221724 -117167 -331509 -125082 -80664 -64459 -254249 45123 12734 -28958 179087
21451 -89745 -22533 -183722 -145352 123124 177716 99246 -72223 219813 61588 -8320 6575
21439 65104 47501 265770 316834 5355 93034 -23077 38393 -162218 194290 100974 -102731
21427 -188453 -14460 142433 -109386 -11652 779 28698 50601 136041 -221230 87011 -65390
21415 -42459 -114228 86437 -177357 74542 -52847 -45773 -266754 -363976 -134053 188271 -176757
21403 -243340 -50560 -153121 -276672 113256 -117352 32939 -74388 222588 172186 359670
21393 359670 157121 26524 -108665 23399 107619 153702 131572 148018 -150992 -280923 -37022
21381 -7669 164502 28799 226500 3918 -86441 101521 -56501 -73723 -127274 153633 -371526
21369 -384278 254252 176258 -24830 348709 131732 -240793 141238 -38511 199217 -38110
21358 168791 -228244 -19146 13042 -84034 -228117 -213912 3237 45834 -233289 204355 33799
21346 -199876 -205920 -14812 148727 222988 -298629 -224842 -139291 -51363 -142554 -317967 99374
21334 -192092 -196496 109666 -101067 -272815 -17599 -40187 173744 -49583 -63498 251911 -278722
21322 -61208 -54479 8759 -106665 -117557 399621 -202482 120412 -74574 -119776 194007 -137719
21310 278709 -34929 80573 -164505 -39425 100321 -250160 -413077 83170 -274740 -4951 -45978
21299 -45978 -368338 19948 7257 134163 36750 222219 307612 -127724 -161417 211823 184732
21288 184732 -279902 160613 283222 92272 233912 -198532 -110885 -54609 -244035 -265367
21278 -265367 -271315 -22708 181377 -173085 87304 198148 299776 -104246 -126961 -13938 -6420
21266 -271614 242990 -202835 127519 -134981 -159812 -90900 39677 -9578 -151198 -52952 -447413
21255 -447413 1560 -510580 -51826 -139744 15691 -37022 135246 -178936 -246379 -70364 -406198
21244 -406198 -79146 80626 5477 143702 111667 -8730 -40937 -122559 -482533 37211 -193204
21232 -157385 -94948 -221411 204978 334517 -391296 3889 -319545 37870 -397603 -241710
21222 -241710 -52404 -204120 108933 188381 -257315 369070 273777 -243551 -77887 -188971
21212 -188971 -108722 175416 -77000 -101441 149267 -78954 -118737 -28292 80952 -89587 -12660
21200 -175592 -228185 83729 62356 -268732 -82691 63962 -302522 266520 152840 -184658
21189 -235191 -182534 283534 29609 29040 205851 92723 -124936 60907 57654 117230 -213277
21177 -70773 134243 266097 -28300 -4324 -155758 80472 -25391 -340597 302315 -222867 -131892
21166 -131892 244142 -49082 88921 -126040 -96079 140157 73285 143101 208416 135045 -4110
21154 78386 -75230 -173301 -85772 -261722 -39570 -23914 -9152 -267788 127300 11834 124259
21143 124259 22935 -115574 -117279 195616 -23986 -46541 -291350 -229657 -148245 -254815 -122091
21131 129643 -77200 111829 -82841 100603 -15140 -111077 -313013 -341130 133723 122638 -57306
21119 -149772 -90307 -13099 -196640 -104500 127584 75218 -42714 -277836 -200945 241378 218093
21108 218093 -100568 56216 -81777 -141472 14920 -8681 75509 160807 -373354 -129704 178627
21096 158437 212246 -186791 -25058 -239645 199627 -13899 61035 -33670 217184 -56306 -23511
21084 76994 73538 -191172 85705 -330376 -70 -326032 -58081 118870 -175657 137260 88858
21073 88858 -25766 170702 -67227 90615 130846 -41705 186541 -145984 288168 14931 -249937
21061 113371 141550 -394603 -142139 -104079 -33521 -122850 122053 -99343 -38142 -55322 -211028
21050 -211028 -17733 -213872 156311 -50344 222500 -392069 103619 6528 -13311 -140807
21040 -140807 97769 -93699 368875 188615 406184 -21325 235427 -230910 -182426 -140744
21030 -140744 -13401 -70373 -46888 169369 190720 104688 25081 -127967 56520 -58075 158740
21018 11232 127747 101084 274731 7938 69343 8983 137482 -150347 -204371 -17074 -43650
21007 -43650 -40055 108546 87734 -253608 -96793 42253 20030 -322398 -32373 76577 -59831
20995 56488 197224 234271 176489 93136 -8268 49598 -74663 -66631 -19178 -45978 -131944 111036
20982 16006 103428 101249 -62688 -56149 109309 38745 -41521 -347780 -93190 123813 116995 -366061
20969 -177805 16785 -142542 146924 -193696 -88976 -260191 5143 84649 -334491 -119871
20958 46412 -67131 -53724 -319869 80068 -417470 64806 -305217 -219414 163142 113591 7036
20946 -132074 -4988 70560 -14024 20261 -251285 -291595 -147002 27797 131148 64735 -31574
20934 -20005 -231002 134387 -11040 -142746 217008 -251357 -235947 -185979 -238373 29956 -47744
20922 -394352 130819 -263772 -280582 -69985 -137768 -109288 -41888 77462 -289100 -28321 -244421
20911 -244421 -124113 -265167 -176391 290644 -74235 -100380 147416 45262 -30243 7021 75733
20900 75733 273076 -182013 88397 -64472 -62438 -180918 -125321 -100439 -362310 -93873 -312931
20889 -312931 -137846 178987 -296875 49862 -266990 63052 427437 -223464 -86953 73456
20878 -41896 -100834 14339 -39817 -120775 -144343 -106888 -97220 -112248 191396 -194404 -109801
20867 -109801 -286583 219337 446757 15191 -106829 -47622 166331 -67965 -160362 52776
20856 -79989 -200792 -15651 -18860 -218050 223982 -132691 -183910 4085 -148791 -56145 24946
20844 -104025 79023 44584 104763 -245458 176697 179358 -106046 3274 242754 223381 -86102
20832 37908 -46948 -159336 -285357 183697 -86190 -216333 29882 -126516 16721 -64516 -195466
20821 -195466 255345 -27459 75104 94879 -4529 39857 4195 152625 -213057 184028 88475
20809 38075 -136703 44965 -100551 37248 132513 117656 81219 -426508 -182999 -299156 -126005
20797 -131817 -119976 -167213 -32026 -289708 -102532 -194240 61270 -36403 34196 33372 572510
20786 572510 87196 -393322 -25102 -408807 196668 -74413 -33757 250076 -114043 -227507
20776 -227507 125455 -113476 172448 24080 -68981 22902 -84289 97364 162307 -181252 -94744
20765 -94744 57153 83867 -48536 42399 -246660 50624 -51562 -973 -73657 -239244 234522
20753 67110 -92387 -77445 257049 -296889 59155 1816 -12702 -78925 -265468 11445 92999
20742 92999 73981 -249237 -42985 182816 -9180 7060 124166 -221028 -66016 -312124 156487
20730 -559408 -356340 58274 -17699 -73886 -48545 163695 37788 -69226 -160672 -1924 -196029
20719 -196029 -167499 201497 -179766 -209876 30946 -117987 -195854 123164 153092 52445 -214532
20707 -28607 -73131 -40469 -31471 73010 -197456 49122 268363 -229049 -83167 1007 -226606
20695 -419941 82865 -239158 -122306 9361 130125 -45995 110845 84655 -279675 181547
20684 342034 -39664 -1800 25197 -136750 -246561 -60775 -320534 54858 -156121 175887 -105163
20672 93405 -150286 398 -63186 -194680 -3858 25244 -83877 -36147 -52887 -14763 -181648 155290
20659 -50096 10852 46660 -174903 -329625 -241961 -241657 -94842 -187937 -355785 -124492 111526
20647 -51292 -87393 17083 -292986 -15761 -101854 104024 118261 82324 -254529 20685 134833
20636 134833 -16939 72028 -59048 -563927 282712 132214 -108002 179867 24563 -86001
20625 -97155 115121 -62290 47387 32979 -51700 -20618 -300591 -160598 -178566 -258835 -158585
20614 -158585 -174060 -182302 130313 -425962 12435 31272 -203448 173037 -291122 -271400 35525
20602 -75661 -151183 -264365 115 -412332 -26480 -148796 -107825 61606 140030 149458 -298261
20590 145387 62385 136232 233341 175045 -41754 83694 -118806 -110990 -73523 86451 44837
20579 44837 -22696 -30921 137836 244358 -134267 -201944 -256968 -208746 201622 36255 88106
20568 88106 179316 -330551 -202852 -31133 -36544 -122410 -177117 34376 -41591 370627 -30389
20556 -96080 62301 -62604 112570 -187316 -176190 -265603 -212016 -90006 -119582 93856 1903
20544 -10111 32525 -218747 -21561 40246 -24661 190950 -42714 26221 -191752 -177882 -80148
20532 53292 -104427 -44298 -151877 -148271 -47276 -100860 -83941 4064 -289618 -308336 180763
20520 79595 294751 152754 -110909 -87148 114325 112599 140837 3511 -441573 -26836 -35981
20509 -35981 312149 -230521 -140411 -66120 82480 -86649 -111391 -198086 -26231 -550361 -342814
20498 -342814 40417 -180518 -151846 -160628 -351323 -292421 -186287 65836 -114307 -89347 -98600
20487 -98600 49765 57282 -357952 -248677 1479 74888 29849 27555 -326492 -76956 7051 -295878
20474 68847 331436 -276660 -168399 48409 185147 -204266 150430 -221928 32656 86770
20464 86770 -228444 384324 207512 118378 -413685 -91292 135935 10651 -305025 84381
20453 172241 -83376 -77850 170322 -194911 87385 -134038 -51624 -247797 187609 -105025
20442 73494 39310 -220888 -49490 390768 70011 189545 181950 83754 -46254 128924 -118739
20430 -209774 -151310 -8941 41666 109954 71582 -112160 -89006 -82961 -212724 -70127 124382
20418 225045 68052 150509 -230673 -259937 -202527 -191472 -145256 5192 -266382 -172062 -183780
20407 -183780 -226941 -29671 57020 -101269 -46519 52275 13919 -94908 102116 -115245 -293436
20396 -293436 -196568 -88331 -108264 -505442 -6500 -275370 -233207 153760 -269971 -262303 40676
20384 -191466 -426957 -118086 51047 273616 -4469 263861 5095 -124277 104296 74744 100510
20373 100510 257504 -85347 -16532 -131927 -31074 -89564 -4879 -189380 79324 131929 38025
20361 -22999 -14826 -144607 -96603 -21401 -165038 -121941 123236 -222987 -73166 -10670 -103986
20350 -103986 42765 17543 -42426 -41942 -37041 27017 -122800 238994 -309403 -76082 -77367 -82821
20338 -82821 -228415 -190150 326070 183594 1808 -33701 250388 29131 31421 -121278 2373
20326 -4899 -48374 93040 -17254 -273627 -390642 -175294 -71606 -1023 4927 249218 -4945 68431
20313 96239 68132 -11307 -164963 -172710 271034 -49707 -406362 -242961 -178921 -310308 82876
20301 -78187 -19363 -152602 -54045 -149156 70221 6512 -130773 18471 -187995 -50003 139761
20289 -217516 41750 137021 -131385 -67946 -21212 -372701 31295 -99470 27280 58322 -205361
20277 -245548 -266153 231254 48800 -149470 -139995 -127419 -227336 -303882 -187950 -102629 -11031
20265 102255 -352402 206853 -321343 270323 18243 -159633 -139363 67923 76043 331132
20255 331132 5561 -96207 -53098 -184589 -289720 -357032 141113 59048 -104976 267968 -104948
20243 -170943 86259 -81955 -324478 -199013 208348 -93337 189 -9356 -28417 137259 -144101
20231 241214 8652 -89514 -115430 -402786 -284003 -201181 94938 -78811 -89447 152934 -299669
20219 180679 -93327 -101535 8753 136522 -419549 3501 45740 -191590 76569 -208360 187035
20207 261248 -444699 257839 -158909 -208982 -57209 1643 154870 -258966 109108 -73325
20196 197773 -18857 122009 -184764 -132682 73332 177320 -173322 -308704 -52178 -170597
20186 -170597 165772 199195 212272 -137041 122151 310888 -152955 -210152 28707 -81978
20175 -40455 -51972 -109831 -141682 17955 -11014 135727 -321703 217550 95178 -98154 -183342
20164 -183342 -290746 205759 -22069 -112561 -63583 -315117 60420 -123697 -13551 21262 -48228
20152 10728 168902 -32155 -137573 93539 -46618 88461 -380663 4656 -70093 261443 -26226
20140 17353 26718 -201959 65811 -195312 -118314 28219 253754 -44271 -89276 -204659 -3323
20128 -203123 -37025 33529 51687 78334 -120160 85172 -270575 -227243 -42206 -131426 -164665
20117 -164665 128503 26651 -79769 -3972 385946 -197084 86950 35036 -254551 71449 -8530
20105 -163525 -104701 -10192 -3521 -57630 70574 2453 -158021 -111236 290769 -163274 158593
20093 269728 181691 30896 282829 99157 -184842 55612 -26173 352934 151365 -260498
20082 -106741 -16345 134815 -154350 -8191 -39243 -129930 -237278 87283 -85813 214409 -46650
20070 143347 -79527 -216752 -53933 -9062 -67444 94827 -171598 -24118 61134 25182 -347523
20058 -285070 96220 -130498 -105709 136920 91890 -343788 152857 -461796 87634 115011
20048 115011 352246 19835 -121890 87314 -241747 215578 -103598 58372 -238764 -196174
20038 -196174 154817 -89352 -51868 85324 -316155 107384 112758 -320616 -249813 -146980 -102372
20027 -102372 -213940 -126894 226179 155226 -86528 -96079 -93235 -141577 -126498 -354917 -406819
20016 -406819 -164880 229400 66988 55905 36755 75487 -155346 100087 -118177 -309391
20006 -309391 13554 -314509 -94816 214675 -289023 -24431 313326 -109723 -120330 6322 -77843
19994 101428 -64312 -147210 -15417 -11779 -194809 232159 -111488 266143 -256039 -130609
19984 -130609 242112 -193520 -74774 116091 296006 74970 196476 51090 -192981 172340
19973 133851 1543 -88375 130678 115810 -73807 46960 8143 -85179 185098 -177561 232257
19961 -39145 -109717 70251 -241007 280986 111367 -199538 -222282 -251867 56378 -251137 -74677
19949 186654 -472883 -120711 5479 -151290 4840 -80899 139800 -68265 -255867 153291 155834
19938 155834 -181081 147171 -191749 234272 -133049 83488 -66973 -405306 -51378 25316
19927 197448 165102 -185238 -241900 55209 84540 -255508 -285896 -104468 148267 187878 -355079
19915 87798 -146314 2323 13791 -325959 85831 -100606 -53415 38622 -222886 134298 -286527
19903 -275663 -78628 63648 -369787 -132987 157220 -44338 -179998 -214511 -312723 20462 -37871
19891 -72681 -241251 135516 59100 -29075 -13752 200669 -23120 -74724 -60242 224473 -266875
19879 47858 -187840 -196006 101129 -215503 -266301 -24959 17767 58656 20441 59985 -209699
19867 -143658 220146 -267466 173202 -138200 234037 -100712 -97578 104174 -137412 248541
19856 -73770 182477 113279 -148006 -312480 65149 158431 -16448 -104194 53794 -142822 181785
19844 -104031 -51256 115391 -160939 213680 -154090 133012 -2349 -74999 -83740 -12873 -165593
19833 -165593 -20382 -204829 -496660 767 71363 -209441 66267 -46481 -11786 -223897 -28497
19821 -30378 89839 -70372 103512 133246 -107552 -85519 -38295 153949 122445 148715 -147803
19809 -54386 119743 -175203 -143518 -214888 -212474 125645 196966 477836 91263 -100781 33777
19797 6917 69448 -40404 330047 64580 101080 -72776 -285432 63679 50559 -21576 84874
19785 -143495 191902 -931 -333485 130352 -80646 -330225 -259047 -73336 -1460 -346005 -68320
19773 -9711 272922 55185 -204619 -257846 384746 -150499 174293 -279860 199168 -346689
19762 -112581 96975 -254676 26836 -62165 -130500 83235 -30350 30705 229704 -171992 -29861
19750 265382 150897 -92683 72996 -34377 -13835 -185024 -164511 -128076 2495 -219480 -111169
19739 -111169 54382 211032 185420 -373152 -8838 -74170 -451072 293659 -78153 87583 -24882
19727 -16079 49054 10342 -162484 6906 19509 -159283 145268 120071 -351651 -156299 -157470
19716 -157470 227480 -131986 -159334 -12630 -88432 93264 186191 -18133 -280328 14249 267744
19705 267744 -207444 -24638 -122313 150635 228817 -323700 -121952 54512 424915 226827
19695 226827 191269 370125 -3760 255532 -218058 45813 -126296 -215231 118542 -118729
19684 -35619 114636 -309220 144872 209590 -85520 -376238 -244347 156696 47321 -154527
19673 191208 -47838 -119416 46378 -160676 189489 157486 37010 -271939 7007 -289679 -136985
19661 -137378 -44682 41776 148395 -294766 -42425 173954 -16622 -313274 -218601 -176638 200824
19649 158784 -5358 -1012 -149675 123468 -227205 -45309 51375 -60014 -163612 133788 -2530
19637 -197478 -21433 -461043 -221136 -222099 -191479 -171973 3114 -159375 147469 13465 101306
19626 101306 -193547 120909 -28176 -126863 -196701 -19719 -106633 -146200 216751 -162426 -352885
19615 -352885 219086 68830 28834 -400060 211063 141950 -102065 52247 62324 83062 187741
19604 187741 -274510 -81459 30324 -33991 -180436 20786 33689 -108109 -115584 -253304 34813
19592 -160663 213356 -42997 -251364 -97838 -10247 -27398 88877 87362 -95307 -195034 -1851
19580 175994 -156022 -105205 -171953 -258689 9938 -377953 94799 33680 -112212 -56632 -76198
19569 -76198 -105003 -92380 -159877 -135514 32497 76607 -236021 -215591 57755 79063 -82292
19557 13110 -146000 -92140 17443 -474004 -438853 -110482 53867 -118606 -44518 83479 -253053
19545 -283172 -56366 59883 -116283 -46370 -179644 -180004 82559 -49384 -130079 -114987 92427
19533 -118163 282355 -189230 -69296 78048 -6759 207024 -124027 -123170 -436918 -201174 -161938
19522 -161938 -77585 -121956 -153229 -120928 29835 -66619 -56025 -129027 -161505 56852 -194092
19510 -176551 -73598 -10745 -241976 -119551 74434 14884 -39151 -51571 16440 -214442 -4973
19498 -125398 -223075 -70539 106653 14586 20691 -198861 -391212 162131 15672 147142 392870
19487 392870 95974 273236 -8441 -247210 -37754 -53095 73334 12054 10781 24466 -265749
19475 80978 -104587 161813 -205711 275499 -95224 214117 -124701 -63760 223388 -247653
19464 42798 -68393 -195703 59179 1486 -406620 174486 387901 155569 256032 -273088
19453 -113639 -178948 9821 -109611 -266157 130381 -30880 40829 -105430 198164 -146381
19442 111509 181007 -235922 145780 -153361 -99871 -170334 230994 -269541 -179693 21668
19431 -359535 85391 -127064 206081 -200713 -340034 35297 -246877 35353 69385 -127290
19420 -120337 -101854 57500 123326 3561 -71488 -263880 221844 138825 117007 4793 -13693
19408 -134310 -29594 -83657 -209554 -93085 -70434 46586 60399 -188328 100373 225590 549
19396 39761 110399 -92157 37208 -123298 -150579 160733 -169328 257254 -211650 -189858 -77506
19384 -158654 -369382 34963 -87819 130856 -27817 -83038 49817 -134571 -287474 158130
19373 -302204 133876 -86540 344090 -174679 234756 55043 -205212 166868 88158 -134218
19362 -288534 -293916 -231295 -28120 -19066 -64592 -29261 129080 -203618 -122102 -218431 -183489
19351 -183489 -177475 -7080 42985 -49932 117452 159135 60537 85668 -411805 -296318 -214349
19340 -214349 72402 -354684 -632436 -193025 12431 35952 211883 -106410 96968 -203571
19329 162398 7546 -1963 14056 -68337 -11138 -334115 -148822 113724 -204198 152462 -113436
19317 102481 -419506 -351441 48799 -48258 -62396 65622 -305048 -160272 -150095 154728 -140900
19305 89150 -184261 205450 237050 112951 1890 -13015 -82615 89569 124092 -48944 -410123
19294 -410123 122180 -35026 100179 137025 -119349 -162059 -304770 -20610 -279325 119084
19283 42452 109105 -220542 196723 -157741 -114219 -146395 -195232 -36503 -185580 -190541 -255868
19272 -255868 67960 -169633 5550 -92122 -47096 -471362 -148366 -771 -232094 -266200 52654
19260 144835 -210945 157550 -47970 -184796 33309 -97855 18076 -110069 -178244 -262323 -235045
19249 -235045 -243200 46047 -140967 290154 -227967 -216004 -47630 -55722 7974 -6406 -163548
19238 -163548 169780 -1527 -294929 41088 -8923 180999 -3793 -53586 -43363 -59398 98780
19226 92571 50865 -67286 -31011 -249917 204595 -488278 -4858 -133761 41217 -215326 -338486
19215 -338486 -242889 240105 -261173 1270 -78879 -337565 289140 -188335 34427 213064
19205 213064 -187844 -46690 -156459 232727 -323414 -271882 -23981 23015 -57673 -351872
19195 -351872 283765 111680 243688 -97607 -167280 -346260 -111873 -327554 -117575 -212962
19185 -212962 221454 -21169 173222 25459 185040 149264 163085 117822 9751 -154303 -66789
19173 -277747 -93206 91565 -41232 -170413 -176135 -225899 50368 -106558 -166049 -204376 -58198
19161 -217920 -228559 264679 -10295 126398 110224 -204397 -150443 -80240 -226134 71740 -268929
19149 -62940 -246503 -23786 -341192 -99409 131159 159699 -177589 45341 -21899 -124485 303746
19137 -26685 20913 279657 -180403 -76895 123977 97873 -67641 -39733 -269703 72327 10114
19125 129055 -98004 -28664 -260596 -288224 -40179 138474 -190690 400282 -55814 -40157 76135
19113 -50803 141051 17838 -315796 76228 -222778 24784 -462899 -232210 37132 -510135
19102 -240900 -375787 18812 273529 -238947 -113698 169023 -69219 19273 -61956 9333 -146502
19090 92621 28598 127210 25102 -83086 105311 -60179 83082 34977 -207571 255399 201693
19079 201693 -64373 -96910 -51259 -133692 -99845 -267376 -138047 -43486 -71767 207687 -49745
19067 108491 -181359 -56048 245904 -217841 203801 -107457 -6822 -3161 -63993 10469 128558
19056 128558 208220 -199959 244665 61345 -64247 -198610 -72601 197407 -168773 95325
19045 76733 -187766 -119151 50070 77646 160801 -50235 -108503 -86846 125602 -85065 128259
19033 170820 -53145 -10951 35169 -58363 -53889 85327 -1968 143750 -161589 15447 -289588
19021 225159 145019 133500 -10621 -220183 -92155 -199476 77412 67044 -21310 79094 83706
19010 83706 -482882 -43207 27706 180933 -281830 -84021 -193623 -225395 -338407 -93295 -3861
18998 -228642 -115180 107473 327486 -101305 -184096 63297 -100896 137563 -279003 -152319
18988 -152319 148789 71246 -17253 242430 -206842 -20887 -27612 -68063 235664 -75351 -43294
18977 -43294 -16745 -14577 -297316 -230961 -102108 -33084 -174526 125785 -253283 -76639 -87753
18966 -87753 -124987 221436 -163573 -92184 269056 -147861 -46901 -34426 -216784 113268
18955 -183986 -230283 -2606 -305165 275439 121358 -42100 -228575 145777 -78047 -373782
18945 -373782 -116522 -156052 -183894 239695 6633 -184330 7311 -39147 -275738 21 -287077
18933 -481053 105515 124869 20050 135488 21376 -106997 -172129 -121668 -30314 138970 121591
18922 121591 -20539 -65581 66930 258199 86616 -34736 -273834 -222402 -315038 -430101 -195205
18910 -234047 31373 -58497 152033 115593 -95640 21979 56556 -104695 141523 273492 -185077
18898 -242008 -277641 312209 -122925 -57427 -99733 -38206 -144209 67079 -308869 -96061 92836
18886 -105353 158355 12675 -379885 187013 -136019 -65974 53433 92112 -57574 -230779
18876 -230779 258249 -24306 -114008 8109 193710 -166369 211658 22890 228519 -2711 -291871
18865 -291871 -123652 -396916 -221775 164726 -288493 192524 -13816 -201130 -28752 54711
18854 -36969 -10780 116621 -38103 -55905 17511 47476 -46281 224006 -17632 -199063 -96139
18842 -201780 -335159 130753 -266877 76838 -36490 -100400 -37704 -304985 -41940 -168330
18832 -168330 -140523 -153523 140767 -100700 -61888 -188375 -23325 -256083 -109727 209722
18821 100381 -227899 -186448 -123779 301182 -34278 28784 20630 52626 382533 -199586 -4292
18809 -17320 215407 -108037 -135510 25897 -106747 11445 115003 -82344 24363 -378373 276193
18797 -298478 -184347 -83228 -108982 156534 297176 332760 82986 30243 142746 -289485
18786 -286872 125532 -288158 -71519 -49769 46010 -148769 -58934 137797 75538 -122792
18775 -34225 -180323 233218 -174141 -169084 226661 171596 -188499 145169 27494 62263 -265974
18763 -254704 16828 -165919 -121075 -1366 -30391 -296482 -204644 286052 68693 151144 -421370
18751 -250853 100858 67969 -123554 -198448 -92541 156874 73293 -265568 -294915 -44577 145132
18739 94054 -71891 -42508 -42279 -484463 49109 -59272 59496 -119823 17346 86252 -42845 -58136
18727 -58136 -197243 403777 -259536 -319079 154565 137269 -195434 -85185 308709 -123625
18716 -130458 -127349 -24594 14896 -215688 -65925 155773 -195357 -101062 -98529 -32957 150764
18704 -281333 -98455 -8142 113576 -197168 -136136 123100 309473 -138974 -133365 194920 9057
18692 36886 -86936 -137158 -68 -8129 -68905 84651 -148895 -424959 113732 -83641 -498803 -194320
18679 64048 379 -27362 -64052 -27229 19741 165346 -247509 -356514 -60561 -144218 -195428
18668 -195428 -105695 127510 44884 -233423 -216847 -116622 68567 51314 5690 -37112 -98855
18657 -98855 -97805 87411 189946 69429 55211 -151181 -141529 -266758 -390933 210598 250820
18646 250820 320349 33514 303573 -278237 -43482 -190934 -206806 -15902 -131551 -28139 -211666
18635 -211666 -171607 -365164 177200 -40643 -455726 -1244 107970 -157553 -1119 139047 232931
18624 232931 -305498 -36127 37340 193029 -96170 -265593 -95519 -283161 -236424 -31997 -154819
18613 -154819 -176407 93918 -115326 68145 82777 -128982 -120631 163589 -54354 142985 -238277
18601 -1866 217797 117840 175649 -94665 -149166 -128824 253082 -107198 72638 -156049 -379447
18590 -379447 -377559 125124 96602 292133 69434 129331 47454 -123444 -421767 30048 -58949
18578 123090 -36301 35681 -68989 -203861 -67021 -179380 -136508 -177528 -169855 132507 -314865
18566 -213113 -184781 125420 -80308 53612 46564 -101923 -12366 -89523 66708 241155 -154960
18554 95201 -407758 208551 119444 150890 -9554 -254486 133472 -289969 -144286 167156
18543 32609 -219761 -174013 204324 148078 15216 -51711 -144964 59001 -422618 -106731 -82499
18532 -82499 155463 124338 22202 127845 148888 -124393 44254 -329453 -40171 -77671 -291555
18521 -291555 -137625 -117566 81177 -138407 -244422 98381 47654 -117405 -72126 -101291 -58345
18510 -58345 -222695 287812 -234036 -131828 100222 -2406 123196 30035 -38236 -62541 -144297
18499 -144297 -365629 193969 13747 -95501 -15245 -278625 32437 -172784 -47613 -15527 -503367
18488 -503367 124661 79718 -85408 -249313 112731 138079 170097 -113698 -26742 -149113
18478 -149113 -34376 -128358 -358101 -171463 -207168 -84478 508270 -32898 110866 32089 25160
18467 25160 -25484 194189 -282389 34790 94877 -100748 63568 366732 -329387 145677
18456 448346 152807 17860 129265 99119 68202 -467515 100954 916 -68373 -12973 -93243
18445 -93243 -76550 172902 276062 -182807 -109009 -34979 -299782 -39166 102044 11403 -182611
18433 69330 215713 64020 -129961 30236 -238367 -85362 -145423 -298101 -114748 -420380
18423 -420380 47793 -219447 -25555 -33276 78970 49802 -74720 -167180 81455 4704 -257301
18411 -62233 243824 -280150 144884 149731 -46279 -63785 -11259 298865 -257580 332329 166349
18400 166349 104663 39723 -67372 -379558 -356872 64704 -224304 79076 -63251 194224 -166754
18388 -86332 -46545 -247003 -236872 -70186 140729 344784 -56121 -107512 246554 -225229 -147031
18377 -147031 -35624 -95172 -306570 -55483 48842 -44864 129645 123253 -8805 55502 -128346
18365 -167310 -40301 -45953 145649 -231539 11602 -532397 58389 78788 -186198 70155 -267469
18353 -173873 -241248 -45570 33352 107205 -79949 -245918 -188087 -218295 -284108 81851 22498
18341 -8660 -70364 231509 -547 -135231 -115715 201329 -281421 49365 -234210 -241169 101489
18329 -95916 54998 -290814 141673 -123268 -175976 2418 -122835 -139625 31100 -202244 -77057
18317 321777 -38930 -318428 61861 -216928 126004 173997 318935 -243231 -171911 -57866
18306 -131701 -107329 -115850 -26024 -91421 -287720 270610 -28609 60198 -284015 -118028 -256116
18295 -256116 -275172 -125530 -47985 -317014 378962 -179769 48415 -2037 -2451 -131324 13399
18283 76578 -10576 -210314 333223 62266 -115610 188205 213248 220832 164560 53770 -275499
18271 -174243 -289416 -167104 340660 -225451 59044 -28720 -207123 -153811 194525 -47581
18260 118832 -106961 261696 139209 -22404 88375 -74646 -33580 178163 48637 -148486
18249 -42537 -154743 -84651 -200154 -22029 -49913 129914 -153052 -202569 -274171 -98135 85071
18237 283924 -50527 -32129 -352327 -102488 -170710 103266 -16455 33878 14565 -143460 -151027
18226 -151027 -197163 132621 -55972 -229139 24576 -213231 330057 -141412 110915 13424
18215 -45752 102641 -161253 178450 86297 3355 -72181 -159159 -84128 -12728 -252397 40372
18203 -16518 -64246 118012 56303 -29989 203079 135941 34508 -204622 168085 231027 -64116
18191 91763 -265097 -246768 99171 194024 95032 -203785 -58763 59913 -41550 195438 256837
18180 256837 24427 -108299 25997 118536 29501 -196914 112367 -223623 38870 -17252 123512
18168 -216405 90085 -311639 -109242 -195261 -82649 193346 -259298 171801 31243 -52494
18157 -165036 32586 -7092 5700 102417 -176310 67650 163542 -138433 -179546 109869 -301643
18145 230405 60497 91572 167138 -184722 -145814 -312019 49390 240979 -155626 109241
18134 -10922 -118078 -53316 -18424 -118570 85264 35491 -34887 -62425 -20595 27454 270531
18123 270531 -149557 81250 118361 120821 -110134 281501 -156976 131143 -9651 46256 -195782
18111 166416 -261532 -129665 -133715 205641 -5679 -38082 2425 -140034 -157495 -182006 23610
18099 -164895 -13412 -124824 77203 -380068 5341 62621 103514 -90049 -210955 -106388 -154692
18088 -154692 -297109 -151079 -161318 -310541 181035 -138802 -318371 -228013 -186977 20575
18077 82809 197737 38196 171453 -158833 -95993 139175 -148178 -76643 39610 -154556
18066 -174272 -49548 -114838 -196194 -159287 -256954 -60727 166445 -499003 -273132 -416398 4473
18054 -3003 18221 -59354 -256047 -62706 52661 -108032 247968 76421 161482 121367 178418
18043 178418 18568 -72918 278955 -40383 103161 -200995 -362372 275667 95682 -263423
18032 60800 17135 -274659 190159 111588 -22722 -231762 -91690 -186261 -159590 -178796 93587
18020 -346990 131676 19253 216277 -180963 87285 358531 -55946 -23411 596972 -211476
18009 -21511 -294173 -276641 13178 -5093 143078 128275 198220 190818 328251 -64230 -308249
17998 -308249 -475096 -48126 -50559 -37392 9030 -125899 -181693 -129800 -9486 41255 -102742
17986 -133245 74548 -122094 422830 -43077 154560 110031 -104660 125088 15643 -76692
17975 -109226 -149685 22689 -239675 -45213 -244055 278761 -417 54214 -147304 97788 67816
17964 67816 92541 45918 12690 159084 -174511 -20257 172991 119382 -119347 41454 -141788
17952 123380 -220689 -13323 75978 -548846 411612 -119205 -26641 11074 -171236 -145625
17942 -145625 -29423 -304376 77318 -18119 371186 -160757 118358 -36974 64553 108791 -138763
17930 90849 -52474 -509668 -4983 110905 -48242 -92071 294902 18788 -6862 -4747 154443
17918 -206270 85272 -38866 -69410 -150148 163156 209301 -91398 -133125 235907 235529 155250
17907 155250 52 201982 118897 -259628 132018 -231750 113260 -57255 -57364 156596 -448563
17895 -65244 11607 12245 257952 298422 12895 -8458 56337 212417 73167 17278 -351061 116687
17882 -41121 -451090 -195058 61310 -39448 27579 139527 34014 -83301 199685 -57278 -84543
17871 -84543 -158073 -291411 -409631 296954 20027 -447677 -194254 230502 31044 -68918
17860 65154 111789 181974 -201892 -192149 -268979 289969 27535 10792 89504 286982 317658
17849 317658 -74652 -100869 125985 73986 -119399 -224832 -145316 -89281 94328 -233393 -3100
17837 -45554 -203313 -243482 169191 -502288 -193043 -136571 -327318 -222529 -82930 -320556
17827 -320556 -192464 -70882 135249 -5409 98148 -106228 109888 -81133 -161978 200076 -119736
17815 -254043 -128851 51138 3228 169098 -283450 -31032 181994 134689 187818 25720 113332
17804 113332 -13495 -5625 -126310 -45554 -142396 -213699 -23715 5024 -41239 -65856 -22255 53390
17791 68795 -119625 88548 -146924 41008 -265057 -22548 177431 -177623 -241338 -20039 92186
17779 -53226 -124931 240959 57090 291802 134328 229441 -104357 -123992 175828 146551 -4771
17767 -254614 -22757 -57766 -87481 204361 303818 110925 36632 27602 660 70222 95408 87758
17755 87758 -42399 60420 -67055 -175257 74251 289540 251914 9763 44149 133035 232693
17744 232693 -171432 49700 161331 -164564 -91366 -76388 253091 -158060 22711 146151
17734 146151 47278 38841 -86085 144052 -82960 96916 -5680 57768 96469 -149276 -289138
17723 -289138 -94230 -188957 -152937 -91333 -30374 185127 -110296 9662 -106927 -196176 162160
17711 -24546 -48265 110289 -37319 -209459 168844 -247972 72618 126751 272740 -128872
17700 144679 -163855 122707 5591 164815 -22558 -68410 153367 139064 1431 -253596 159691
17688 24793 105357 -131950 31536 -321782 1776 339290 -354113 263955 28861 198478 82834
17676 111037 109330 249353 -55797 8491 19809 279944 21690 340902 174347 -107577 -108189
17665 -108189 123284 492746 1874 -104938 108763 -176389 -91743 358200 64219 -32953
17654 186936 -71430 327760 -72648 -133817 -17398 -156653 -13670 -262549 16973 161033 -125825
17642 -19337 -21478 30490 -21187 2998 108308 -127480 114418 54805 6316 -69137 307705
17630 -36954 255864 -75869 133312 -175142 124458 -100985 123531 272133 -244130 -311368
17620 -311368 73992 -161984 -82208 316903 66331 -87614 174265 303084 -54761 -28129 112644
17608 -21591 203725 73858 -114125 -201821 -67050 -189248 -16117 -198202 11002 -99791 133952
17596 -20482 18856 186705 79298 -137687 -145887 44266 -41978 116886 183434 194034 427150
17585 427150 374854 -56857 107596 -147738 195220 -224443 11082 187277 5760 -210459
17574 147917 357994 -185441 259194 11768 128441 249112 -136426 67549 328540 196207
17564 196207 -62701 236215 131710 -2134 15375 60393 -121011 437987 -15725 366286 31355
17552 -104150 -125561 486808 111466 58963 -8992 123339 225641 -10842 109847 -121468
17541 -33504 -16890 122345 130758 -249345 -36623 56063 78257 55868 91828 -24445 -169392
17530 -169392 -259709 -56623 255849 13081 13532 -42684 68922 -51559 -28523 67678 294684
17519 294684 184540 -207009 260538 37755 -195327 51708 -60595 120423 126368 -91926 -44008
17507 329518 -3771 156765 179953 -8146 88265 -69827 236355 160536 114604 -36036 61031
17495 -211391 71412 190791 -78295 -11955 159576 -21212 -40740 236994 33017 141777 220963
17484 220963 224532 119303 236952 369944 -167853 -154095 155993 556594 61356 65659 32822
17472 256165 25098 198931 358799 122070 -158802 119667 284239 240437 329674 -96027
17461 93141 -183989 52898 130369 5850 278287 220440 196945 -75733 301159 17553 -24339
17449 -2166 114934 664500 -38477 136630 132776 538620 114459 84621 270840 137130 -46927
17437 224858 458125 361089 -6329 298051 76359 303875 63182 581865 277333 149399
17427 149399 115766 26035 42221 161852 154318 289059 221073 738111 58694 229679 131209
17416 131209 129925 340401 462130 171918 263388 -237255 -20006 303143 378997 272241
17406 272241 339061 130560 189892 -8289 146081 22287 284367 15179 -143070 192288 18051
17394 -45183 402375 492500 280130 26556 -150656 147115 538464 86950 -41248 294242
17383 -13759 354387 -190045 273189 103588 253362 257514 310139 103635 195788 -58063 125767
17371 -19874 345639 71412 418501 162307 374794 112549 389181 261458 156304 -49271
17360 352560 135892 39753 115227 65496 -2048 302976 -16439 205545 127740 306450 9219
17348 -125448 -55270 49378 79682 -197988 464303 418148 468495 200577 95163 71998 -232215
17336 235984 -45670 143679 13843 134996 276176 294001 -123507 275987 325166 64468
17325 -106366 -72457 -74057 -35966 106981 16336 59454 157646 389727 221394 -56624 333375
17313 -36833 328900 128225 186317 197392 355148 373014 412120 276606 226693 70038 -128770
17301 -43473 -183268 128800 188965 525806 149914 106900 -112351 374857 197092 305668
17291 305668 457193 508871 -152440 -50212 312200 134445 319658 271274 240022 258773
17281 258773 421930 211227 211662 -27063 -151614 132904 75343 95805 172658 137495 32008
17269 91655 156545 39583 207585 -81284 371998 -238691 448262 207315 354923 86614
17258 85015 118242 10313 411392 -77290 397182 93633 344165 540616 250989 -189247
17247 87044 385022 360739 118837 91828 180979 379382 203329 81722 103911 51517 372001
17236 372001 186686 124656 560147 -218688 352537 507129 142497 197955 207791 402092
17226 402092 -12134 236739 242384 2063 131383 365117 29926 369835 35314 -25592 -23317
17215 -23317 257136 116866 266312 290819 143309 -71850 209534 -18183 106983 403041
17205 403041 -5232 87166 516347 226233 169495 273740 394644 183711 159683 477610
17195 477610 -42818 591050 -181236 256908 260677 262106 455843 382943 379448 61515 -76494
17183 361967 239523 213427 -50649 563075 152172 170696 179805 634617 150254 174046 389675
17172 389675 27419 438262 555822 465105 351970 18018 251454 141711 585044 18926
17161 438007 343007 440632 313841 340621 438300 516499 493328 361188 419106 205290 153222
17150 153222 552794 -16025 213758 281087 158943 355808 276477 464175 359958 373309
17140 373309 297950 609495 92654 65046 370415 483622 92507 247108 147365 283194
17130 283194 395139 73079 464257 225703 582270 -212229 238998 215896 484694 320640
17120 320640 584578 441107 546732 266581 269185 451024 301225 475144 432275 632739
17110 632739 171168 490936 445911 498935 203054 103377 278611 362649 623703 565778
17100 565778 221627 187922 298452 537779 448854 491204 413351 488144 428221 521041 403212
17089 403212 387019 473792 434931 552321 507037 532785 195832 236270 304977 420149 628158
17078 628158 597939 128734 689555 521832 495784 717123 521547 229923 84883 258832
17068 258832 398311 264960 613713 453784 443113 452301 357130 426793 343217 479266 336118
17057 336118 650554 669482 522124 669095 659127 637900 558259 826403 357923 598461
17047 598461 882218 378362 633566 781233 483461 516352 458644 674761 517198 348956
17037 348956 468414 701165 652493 455126 823196 581984 686220 517617 486184 190172
17026 864002 386162 402590 486224 522040 536668 299687 410047 877452 727552 688732
17016 688732 858880 837689 427823 864582 753455 730779 702439 858400 628997 516368
17006 516368 734492 736601 659961 1013865 1093680 565040 745641 633682 507176 578711
16996 578711 844459 674501 732561 833811 961051 859563 1193245 851648 966713 870852
16986 870852 709100 1044992 1083567 1066486 611757 714607 1099447 1016141 682195 836263
16976 836263 333168 1011593 1120218 1024601 972314 862942 1015969 1088788 872695 835202
16966 835202 911614 785448 932809 1114840 1043349 886489 1136321 1019901 984039 1084547
16956 1084547 744902 933505 1094781 1357993 977272 1289507 1256365 1273128 942809 1144022
16946 1144022 1152119 1240919 1060951 1319209 1069076 1349195 1314383 1096958 1165530 1264352
16936 1264352 1075688 1579305 1399127 1178156 1335766 1286126 1719829 1052448 1302593 1286864
16926 1286864 1365923 1477522 1028507 1362508 1558342 905337 1748541 1306483 1451022 1417464
16916 1417464 2024156 1591998 1652734 1476371 1501629 1740143 1819436 1659721 1825974 1729667
16906 1729667 1598444 1695024 2061891 1675991 1646931 1887680 1749546 1739671 1626632 1880812
16896 1880812 1962705 1988694 2112770 2121134 1882357 1913398 2049413 1951114 1918892 1868454 2083375
16885 2083375 2386616 1978690 2448731 2346414 2413854 2182540 2349372 2246245 2276956 2532207
16875 2532207 2291977 2584543 2477693 2562796 2557909 2710849 2720430 2818760 2734619 3042199 2554692
16864 2554692 2908338 2867740 2855859 2731199 2955721 2932197 3097674 2928318 3133471 3108266
16854 3108266 3198074 3310141 3168705 3262739 3422465 3404734 3436913 3186803 3426537 3784191
16844 3784191 3872111 3655719 3913758 3621128 3704562 3793775 4241441 4368157 4420456 4009770
16834 4009770 4627598 4488540 4758023 4631730 4311359 4831592 4798058 5038388 5318006 5353861
16824 5353861 5385327 5318307 5324538 5960480 5468987 5776346 5793262 5986963 5903351 6396024
16814 6396024 6275411 6503782 6765380 6622883 6836067 6931511 7102347 7006447 7451945 7583997
16804 7583997 7625672 7678243 7830409 8111575 8323274 8628479 8828598 9086509 9339852 9485048
16794 9485048 9883442 9951786 10588153 10804163 10873546 11479312 11427649 11970225 12217102 12645740
16784 12645740 12718642 13012334 13372948 13861972 14111490 14996070 15128609 15817184 15991643
16775 15991643 16615415 17243797 17750556 18243586 19188119 19808261 20370507 21151375 22061099
16766 22061099 22481851 23283644 24389284 25135627 26185145 27080205 28536795 29616131 30709766
16757 30709766 32108316 33459406 34846263 36303056 37911524 39590483 41447300 43442492
16749 43442492 45694566 48171377 50310500 52839244 55230197 58379695 61427377 64731914
16741 64731914 68256960 71795819 75735118 79831627 84034992 88626647 93528546 98483114
16733 98483114 104032879 109559169 115052676 120770120 126931093 132765320 138647653 144615120
16725 144615120 149446327 154459654 159260116 163194175 166430767 168607522 170182359 170683130
16717 170683130 170191004 168740512 166548477 163483654 159691634 155350423 150253238 144460633
16709 144460633 138479208 132842659 126912450 120997688 114857341 109105704 103230036 97820871
16701 97820871 92982634 87495394 83542551 78516434 74258272 70444772 66657026 63283537
16693 63283537 60218966 57075036 54379749 51491359 48918021 46513901 44131108 42395571
16685 42395571 40316620 38513923 36517835 34972936 33546459 32201936 30773880 29367747
16677 29367747 28173714 26991796 26152874 24712840 24034851 23411086 22169076 21537801 20708817
16668 20708817 19962726 19285073 18395169 17613183 17553928 16641416 16054149 15775311 15137614
16659 15137614 14602543 14245822 13664205 13376792 12825703 12549169 12362781 11962226 11761790
16650 11761790 11058527 10915360 10465431 10239253 10291767 9839287 9395611 9224117 9142760 8621820
16640 8621820 8724771 8833662 8251193 8291881 7546254 7742020 7674934 7382022 6801031 7027695
16630 7027695 6630466 6598392 6142452 6216808 6252450 5994363 5894044 5801754 5520404 5556747
16620 5556747 5251263 4973086 5359686 5310479 4984589 4700547 4771037 4496749 4832232 4649000
16610 4649000 4707638 4468385 4563951 4220154 3924867 4219675 4032391 4126147 3826716 3732061
16600 3732061 3715164 3598694 3696278 3431957 3407126 3483234 3509322 3424465 3317026 3129869
16590 3129869 2997665 3070465 3083238 2892532 3047155 2659546 2925644 2753112 2764773 2724932
16580 2724932 2733540 2414329 2651479 2728949 2440446 2862254 2268701 2409357 2401779 2056284
16570 2056284 2474376 2414603 2339675 2154682 1791152 2152327 2300535 2023255 2298045 2013444
16560 2013444 2073835 1989356 2211193 2270328 1903940 1830488 1692789 1765608 1796105 1498900
16550 1498900 1780882 1561074 1706630 1730370 1528822 1768497 1551014 1518712 1720361 1739021
16540 1739021 1513160 1682190 1757787 1313591 1346192 1371692 1484090 1294575 1036463 1603481
16530 1603481 1549996 1550553 1467615 1240318 1132219 1406874 1338795 1623700 1403683 974591
16520 974591 1320362 1265431 1027003 1094714 1307650 1207651 1030655 871411 1116791 1014894
16510 1014894 949973 1076200 976427 1120000 1265306 1103473 1175181 1010584 961706 1108879
16500 1108879 973441 809414 1143753 913197 1074056 1266594 1153173 1014706 868418
16491 868418 670667 1227875 754232 851483 924087 758907 857077 950095 777893 955986
16481 955986 829326 694689 812843 938679 914825 872568 730345 667065 778240 955252
16471 955252 670498 535271 770675 841014 668763 620423 735825 681743 639015 692338
16461 692338 699986 889806 794012 577657 783130 837659 682466 632296 539097 619676 843334
16450 843334 392637 433840 505415 391845 534653 786591 574521 1089867 583033 432320
16440 432320 520820 602772 544508 478209 306700 985892 597582 859008 348198 253359
16430 253359 405522 511012 897002 649044 598252 490692 572950 589282 506401 505095 568258
16419 568258 569798 -54188 249246 707363 621398 421476 423539 364429 535760 380139 165540
16407 333630 660046 142035 341026 438364 538653 312299 848174 407269 116890 197760
16397 197760 374646 328857 434783 561973 780100 520907 703933 230760 192955 361602
16387 361602 200855 365828 222192 28239 280698 152583 189909 398495 531538 554199
16377 554199 650725 313809 311544 402496 126492 457959 288858 595832 426645 331015
16367 331015 -22856 410356 41116 24522 -8016 310639 318373 309396 419483 585146 245101
16355 322478 296283 184654 292636 109 172046 355637 143329 192567 377595 192137
16345 192137 136837 409878 346591 165309 150182 358044 489684 543541 217571 564715
16335 564715 167662 160122 302760 187903 305936 140129 460593 -5043 344940 299137
16325 299137 432887 165775 213194 510032 94895 227212 32165 19407 213232 93607
16314 210431 298266 312644 428265 142969 184967 100709 180343 400308 32500 362470 288235
16303 288235 739 158598 356599 -75321 238708 106775 73117 114792 -37697 318407 245973
16292 245973 43502 540848 249863 68926 145799 -5271 271260 293280 23622 263165 -73626
16280 155924 276412 315344 48320 2062 128541 218825 221036 48719 393437 -31059 398842
16268 29911 -95917 -43858 43411 -4033 109349 -166887 178398 347372 387083 251262 -48464
16256 142062 121152 -28587 44068 375426 227802 447580 269925 193267 68526 56392 -143040
16244 185161 210804 337018 215979 413614 81928 99940 238313 22836 209833 163688
16234 163688 254219 187475 -67962 154324 53908 239561 209825 69908 12278 -106531 261615
16222 84378 295870 248881 235217 28725 280043 326873 366809 235587 61644 228508 54155
16210 -224344 94258 214685 176908 -28103 163288 -130003 22553 -213014 -77294 93361 354194
16199 354194 -102191 126875 -66496 152336 217037 -59044 169913 97339 88708 48338 394050
16188 394050 115998 -94213 -215696 -41561 304139 80922 -89069 295322 -249815 51877
16177 -8926 -59648 6507 111335 154483 -59186 158003 101409 -43147 242387 6432 140532
16166 140532 70015 196742 -141459 195253 65003 -331471 12395 -111715 -187594 -160483
16156 -160483 198209 74777 -102866 348312 29976 -83051 -25579 -157536 245883 274423
16146 274423 -141834 63237 264092 5945 217269 36299 -191946 -22531 -190819 -161987 -14576
16134 -339609 -127420 72614 464437 321424 94851 111866 -29181 240263 442040 240024
16124 240024 338829 -108019 -17302 278605 262667 -98818 105181 187073 -53798 -122246 -162668
16113 -162668 -185793 -84895 -86898 -91571 58611 354024 61716 90581 -177541 82393 95457
16102 95457 57284 297631 58749 -132159 138944 -189776 120356 132404 -23622 95591 -57985
16090 -80403 -259899 109296 -167095 -29341 -93771 -114382 56317 68406 34803 133638 -9337
16078 -146201 -157465 -94603 -358640 -152818 -67224 355285 307250 -180024 -108387 -287400
16068 -287400 -100895 118727 -201906 39160 -155359 260593 -286016 -131361 -163431 -2465
16057 -115053 177335 -230477 -97522 -235373 145706 360543 34076 -88518 -179686 110549
16046 -144618 124805 -35124 -2599 209749 74428 -23517 118925 87550 -141815 -134447 133305
16034 38747 -181714 6866 -197977 86007 -4803 -4048 33774 -15966 64383 118006 -126374 377631
16021 -4583 -95880 -9519 -131098 181377 -44921 -260345 -23868 -119968 -58743 331427 -124489
16009 -229676 39709 -210172 81216 177047 -139324 18654 -45279 145998 -16833 -461988 -242727
15998 -242727 -4823 -250147 -118198 147708 233805 101838 129481 -12377 -289085 23898 -124779
15986 99857 -104762 94994 65074 363688 359785 109769 380463 265347 157166 54360 -121302
15974 79184 277503 341073 171932 43865 153902 151393 -156083 -110341 -273522 56519 213019
15963 213019 168846 -204926 310231 -175916 184536 -304901 -28344 -146462 98719 98099 -69144
15951 -41028 69359 -6052 6696 -297768 25285 -144871 55227 251752 6707 -4350 27937 -40984
15938 -128017 -50727 -8320 -266822 380140 192086 -148414 -189307 108831 60993 128615 80647
15927 80647 -254162 -298698 18011 15640 186014 41214 -83471 -116317 137332 -24091 -104369
15916 -104369 -51818 -128213 -70114 12989 -72742 167762 175323 -33064 -17886 50703 4299 -165426
15903 52419 -27385 -81485 220702 122351 137420 139758 -329969 -145683 24940 226097 211020
15892 211020 -45472 -417330 -78008 12742 -50747 -366534 49592 185066 23597 76504 14148
15880 108190 388258 -153488 -123757 330467 -101426 -153893 121739 -267899 58635 198430
15870 198430 127236 -12782 140945 75216 1426 93018 -43434 260501 -72628 13540 -84298
15858 -32415 94661 -56275 -309635 46148 37406 170848 328147 352005 -194482 80466 399290
15847 399290 -397375 34858 -19644 -177528 -212491 -247732 101540 -273861 -245906 68921 248828
15836 248828 -326378 11627 22326 -85855 -354429 366314 18914 -28423 -121674 -88938 53439
15824 12333 57550 114942 -173713 118887 -147933 112987 -12369 16891 -62736 -110845 40568
15812 -86922 139202 -58735 26567 93601 84713 2561 356280 -52772 -118329 -47367 193181
15800 -12498 -88746 -245934 -172320 -129177 204754 43314 -226446 -163995 -90477 132530 -391747
15788 -158111 -62561 129909 -38477 88742 -248627 31364 -128609 109503 -76468 183031
15777 -210351 -109857 192167 -296437 47301 58026 -536059 -202388 -326514 -149465 152613
15766 -14108 -51308 201313 293043 -1489 225225 -8247 199227 24348 201125 6141 374698
15755 374698 -18844 -125998 117992 12942 50222 47539 -13054 76032 -56466 48249 212459
15744 212459 85075 -97499 158185 -238724 -198393 -196118 71916 -326016 -52350 -195767 -114943
15733 -114943 38290 70564 77765 -225551 -106737 18962 545756 -63341 -219516 6812 -238809
15721 -84167 -5150 149500 -247150 67538 213578 263787 91963 -227519 -375376 -121218 78368
15709 -65060 -91306 -151234 -49448 -405597 -233237 -15594 152934 56817 170108 -249943 148198
15697 35125 -72142 31396 17596 -201102 -209110 81762 436358 32982 -116919 -62878 37164
15685 155633 -249481 526826 -332600 139214 -3471 -135908 137281 -164765 41948 324585
15675 324585 23298 77702 29881 14842 232782 111467 -76006 131738 -385706 -53162 -146304
15664 -146304 -188393 -4002 -67241 -12472 89201 52398 221615 -358695 -132491 134071 -94530
15652 74028 403963 -84868 -152666 192802 44755 201458 -131003 -162634 -61427 -114190 49019
15640 -33109 110443 -230289 -60443 -80332 -306254 -116765 -172659 19430 470806 48380 -278215
15628 -172841 -57416 -30469 -408201 173667 -135339 169565 -242316 442900 105271 45235
15617 77497 -152547 -35417 98105 98916 -65593 22459 84527 -21427 80856 -156830 -310953
15606 -310953 -47316 51544 -35875 1251 32721 -93469 -171825 24746 -113322 331063 183144
15595 183144 220725 -147421 109705 -225972 -223550 -218520 161965 73679 271215 -6572 67861
15583 44532 89492 22051 94758 -88259 -2962 -228283 -217103 222701 86458 70341 -37844
15571 -153867 -149767 -243491 -131208 -45199 -74056 259838 118627 4914 -245471 70802 -187779
15559 60363 -122859 -17382 -67224 295367 104504 232965 -203455 81120 -125085 -67264
15549 -67264 -317917 -267732 -30754 -132765 -9731 19522 -164146 -155082 -131902 -171495 212521
15537 67702 -167810 186479 -29693 -12506 29749 119501 13294 331563 241808 62468 -232752
15525 -189876 76368 143086 -110367 -206209 235085 229238 36730 167778 -323040 185698 157409
15514 157409 -128351 7476 -275390 37273 -173741 158300 258967 13402 -13730 -27946 -87348
15503 -87348 -493652 58604 -307006 90952 169588 134225 398420 86736 -176943 209338 -248631
15491 133325 -349069 -329756 -76118 -98202 -163446 101824 98628 87782 -166029 -6461 -215753
15480 -215753 -27597 24495 -95502 23803 -4090 57277 60789 154393 103002 -176626 -68042 38873
15467 -173664 131733 -4059 -205933 -165984 48838 153046 -247820 164359 116722 144983 102576
15456 102576 -287689 248828 37829 -153219 -13197 90981 -120916 256017 152492 -71615
15445 -139777 150714 -28260 -323630 -6004 18170 -65934 183398 153996 -176389 -181837 204079
15433 -232052 185774 -361158 87494 -200943 43943 -29286 88113 236313 -135862 -111163
15423 -111163 244266 99147 119537 15737 28071 138301 -34368 205620 2938 117924 -256966
15411 149174 66739 273365 -161881 80675 -1839 119186 54170 -193570 -154512 155608 -92167
15399 -40024 156141 235107 -180127 139440 -173965 18844 -183475 -33608 317743 85632
15388 274079 -328394 125270 -288840 120553 146963 85639 145406 -65378 -344168 30963
15377 124374 -85860 153587 -137812 211469 24432 93308 5117 -181307 2231 313333 322690
15366 322690 -308072 -63240 200871 187775 -310511 646 268438 -91989 -194531 -60388 152908
15354 -16045 21577 115509 166399 -123453 -1387 220145 130449 -446765 225591 10565 -346874
15342 -188106 -220708 142675 -130715 -56338 -2275 -123634 -107361 132608 -124173 7982 272279
15331 272279 306937 -211493 188135 -12360 79047 89110 -102527 52576 54196 -91658 -18512
15319 -170439 -155470 306012 223133 -63862 -118804 147690 -41314 24518 194608 163221 -140197
15307 -112194 257354 178981 -160049 -216078 264695 -133058 -114138 -21764 234933 42582
15296 -69607 356450 -124272 -340143 206640 65543 141993 -69791 40368 236035 151347 -175580
15284 153191 -98127 261903 212845 -66434 7913 150108 -209122 -119815 622 143139 -1212
15272 -118927 -121530 193050 102946 222537 377 127692 110341 -210788 -38486 36510 -98239
15260 -7136 50703 324353 158627 -8669 -107764 -52658 88390 104626 200870 410953 535919
15249 535919 830212 1345207 953856 1398192 1014336 400873 251668 241621 33032 170291
15239 170291 -150673 -260191 180317 -283926 216829 60434 -167917 -24739 -93188 307476
15228 143294 -231552 51985 163587 106859 -192635 126571 -266092 250911 -132834 100671
15217 115153 111693 -12969 236633 134470 -31908 -202825 -200273 -124559 136905 -369926 -88598
15205 -156323 -9498 -19768 92768 -96664 -59734 64310 44938 217146 -98311 -151321 181235
15193 57458 -70990 36516 209880 12432 105817 -289438 109435 251123 230315 222120 239072
15182 239072 -246141 153462 93780 372261 -75888 -43008 -65449 -217119 -32440 101189
15171 40601 142970 -55538 124369 209324 21886 200648 -217221 293778 97473 142094 103729
15160 103729 610716 -64925 49138 274390 226631 -105725 460086 45433 461066 -92486
15149 95666 52632 -118143 202681 315059 265338 -257293 173340 223785 164908 241466 357058
15138 357058 311981 77598 175259 118259 65520 107437 146224 76151 56075 -70867 143596
15126 292216 23277 350329 -8345 13286 94432 332989 287649 -2765 94530 114046 19038
15114 59563 43101 185913 157391 5895 361010 330997 -33985 -290168 16739 -190714 -156560
15103 -156560 233801 -53527 -130156 567048 72569 43264 414021 157036 279780 -147913
15092 106388 250280 -146919 261178 264853 131336 346173 -238463 -144449 23530 215966
15082 215966 375898 -17551 192594 68726 54581 -7715 512321 231490 202645 31895 158537
15071 158537 428465 125403 252783 134500 -202494 63096 -164714 16238 -272884 -202323
15061 -202323 19600 244316 168191 318060 145375 438405 -5089 255751 359365 112834
15050 362694 164076 288294 -82306 75205 182050 269012 104521 387284 9393 -35088 350245
15038 131113 200951 10431 429700 90390 -110337 330503 79577 125991 10736 158871 335786
15027 335786 394490 323062 190112 -13256 65200 324502 473695 283091 -2104 262825 206214
15016 206214 78034 205003 270060 -13958 -169633 336866 182633 289096 96932 228655
15006 228655 182216 185321 241980 220730 96798 244115 52858 279303 420854 307442 163515
14995 163515 692035 352872 269668 -89456 393454 -37 366528 310977 285779 -16110 134500
14983 -111149 10141 185815 387702 179465 365772 -128520 164392 266709 355834 398748
14973 398748 84105 283086 -7163 502233 227510 184511 184972 243999 155198 16677 27967
14962 27967 -36817 371489 354904 251570 192276 92277 425609 181873 -108984 476374
14951 405497 241488 232609 273851 590372 710560 474345 269320 362385 291397 403853
14941 403853 137546 234570 59451 329560 204735 269797 247808 392733 381912 351455 440882
14930 440882 344269 260939 271279 414139 371271 194690 207475 -8176 470003 64239 420923
14919 420923 362326 376075 152441 263304 388540 236148 450867 403535 -18964 211333
14908 282497 102343 10548 360367 222940 287158 488008 52993 -39485 208244 448979
14898 448979 208585 391601 255295 348711 235649 313763 351487 326468 25856 300957
14888 300957 91919 329683 400850 339281 281502 440360 92589 113807 372365 497873 340914
14877 340914 302443 494946 321974 -167312 597416 204029 128676 624465 355486 522667
14867 522667 314368 156582 504542 272547 263785 201457 587526 395208 682016 716690
14857 716690 338114 102770 444998 706382 427288 529830 542049 429789 394603 300760
14847 300760 556024 290699 539512 287759 471016 547423 306667 167853 458264 327544
14837 327544 598140 261097 577785 850220 404712 544592 429532 455312 427371 397619
14827 397619 543651 427862 712340 761313 296655 292957 902357 359380 567738 385666
14817 385666 269554 292805 502424 428002 124184 432296 272396 329089 581187 345712
14807 345712 265979 645763 626765 469572 587384 560115 646175 744006 343526 712873
14797 712873 399605 367812 460957 546211 398422 387882 80450 539867 471350 859952 501664
14786 501664 645948 422704 871529 744236 834622 734678 449497 488701 503672 305144
14776 305144 756009 400574 763550 477955 679123 527831 393221 542275 564535 448426
14766 448426 459032 418053 704669 664579 452408 180764 164230 528159 893847 734770
14756 734770 448523 784196 813992 728128 486388 660096 651776 560149 605664 471501 406077
14745 406077 663172 689638 775253 632395 586186 607430 806181 619819 724244 417075
14735 417075 344780 623568 591166 411614 351718 794983 354937 758759 1033324 514220
14724 784196 820980 826580 849765 704139 845170 592436 670567 554016 784676 578411
14714 578411 492522 733278 696280 726627 1026902 681421 609122 1102163 1018043 840057
14704 840057 652082 1056868 309366 923475 523287 879219 533962 942328 1022966 809606
14694 809606 599691 760001 1323273 993093 880467 756690 964425 869456 904553 1108499
14684 1108499 597224 908164 1088539 775717 932618 768129 1006433 1016653 582034 1124252
14674 1124252 971473 984379 1087666 834175 1079945 678510 959517 974314 1131636 879795
14664 879795 1192348 1236116 1000105 1176077 1074876 999572 1158649 965448 872712 1095470
14654 1095470 1225307 1096080 997533 574181 1246803 1314893 1359881 998654 1174827 1206484
14644 1206484 1274318 1321720 1098005 1128490 1115040 1020127 1400820 1182301 1050814 1161014
14634 1161014 1394977 1140072 1478704 1262329 1269278 1276705 1213723 1462427 1262750 1587965
14624 1587965 1617558 1125225 1494589 1068678 1255170 1265663 1413168 1696058 1568443 1442773
14614 1442773 1438528 1359257 1370259 1165777 1298320 1498169 1604578 1665348 1521791 1660677
14604 1660677 1528701 1526637 1411099 1742695 1321215 1536650 1480989 1751966 1620392 1731598
14594 1731598 1982318 1830572 1919883 1363210 1682992 1691262 1917983 1812538 1507246 2070852
14584 2070852 1651189 1823985 1835371 2069557 1576062 1759060 1864570 1851164 2270312 1600287
14574 1600287 1751974 2033564 2163599 1960468 2320875 1880066 2031466 2314378 2364925 2385911
14564 2385911 2365556 2447166 2494542 2661809 2559222 2696056 2654776 2687667 3002934 2907235
14554 2907235 3411554 3895546 3843035 4778579 5693222 8264723 12647952 21007058 38519530
14545 38519530 39660750 20026448 8252627 4154865 2572483 2261630 2001909 2057279
14537 2057279 1558077 1489284 2095788 1916001 1939597 1876697 2149091 2114376 2348597 2021100
14527 2021100 2324449 2089731 2081452 2191452 2302363 2072468 2303880 2740547 2506641 2450961
14517 2450961 2471021 2284946 2436801 2311772 2306790 2403819 2610590 2533436 3043464 2998465
14507 2998465 2759407 2840026 2808312 2555040 2713351 3025548 3051615 2956433 3100132 2929913
14497 2929913 2984062 3103184 3223271 3313661 2909167 2976064 3222457 3453198 3350484 3229622
14487 3229622 3478600 3408881 3364261 3641331 3577686 3333465 3950212 3636845 3696717 3828036
14477 3828036 3870624 3992753 3885629 4114363 3948828 4009749 3797578 4081856 3976388 4116321
14467 4116321 4206463 4407519 4307323 4417362 4383511 4285478 4413765 4727918 4487581 4814799
14457 4814799 4870210 4780128 4721929 4966443 5179441 5112799 5065461 5166326 5545844 5466846
14447 5466846 5258565 5162860 5392215 5388520 5546332 5763175 5746586 5819079 5940524 6008246
14437 6008246 5752597 6191273 6324515 6492441 6350476 6459006 6634123 6631398 6657448 6656124
14427 6656124 6676573 6949715 6866208 7149543 7124222 7299532 7368511 7389751 7527478 8154889
14417 8154889 7987215 8137811 8386493 8259802 8268104 8147793 8605160 8886907 8797533 8981046
14407 8981046 9064757 9189215 9575839 9120193 9541046 9527196 10055578 10192218 10597905 10215172
14397 10215172 10502359 10868229 10915596 10948635 11387643 11522601 11826431 11708702 12030718 12276729
14387 12276729 12229824 12683780 13079018 12779006 13479791 13464035 13925427 14070443 14159888 14689893
14377 14689893 14978205 15174188 15407538 15870920 16029973 16306576 16796489 16823770 17374898
14368 17374898 17934316 18345717 18431642 18806697 19266164 19803420 20358257 20344062 21087216 21328660
14358 21328660 21737053 22830349 22818160 23390491 24076622 24427314 25253809 26127448 26718510
14349 26718510 27183851 27684372 28289560 29285519 29864531 30762295 31300881 32041249 33071256
14340 33071256 34007886 35016995 35928169 37214901 38142057 39343670 40191413 41548255 42678619
14331 42678619 44030460 45696172 47177967 48611890 50205224 51897187 53475742 55089324
14323 55089324 56906804 58918201 60859360 63469798 65828001 67938835 70686347 72965231
14315 72965231 75927813 78921145 81895001 85408988 88967384 92308761 96279221 100139196
14307 100139196 104548046 109314268 114333907 119499979 125354059 130892589 136924783 143203643
14299 143203643 150463418 158274870 165425451 174166936 182812260 192335444 202147052 212412319
14291 212412319 223533863 235254687 247029744 259770588 272762800 286397232 300179972
14284 300179972 314256187 329118750 343744578 358221112 372485889 386364809 399718765
14277 399718765 412024523 422981109 432538612 439381365 441361896 441900576 442109953 441724975
14269 441724975 441220143 437427356 434389123 428983061 419808339 408813679 396370110 382983988
14261 382983988 368342371 353141685 337409171 322599304 307207305 292762611 279115157
14254 279115157 265181636 252217562 239450689 227393497 215759865 205007652 195122990
14247 195122990 185291904 176262458 167583189 159923208 152262624 145461291 138450141 132088775
14239 132088775 126047988 120515303 115305573 110463548 105860547 101489960 96712790 93012770
14231 93012770 89336917 85776058 82566819 79146111 76263929 73198766 70337659 67985317
14223 67985317 65380878 63433779 61113024 58783941 56970286 54824887 53520387 51455731
14215 51455731 49809718 48356630 47157834 45650070 44083785 42914622 41474488 40649248
14207 40649248 39656554 38374367 37237408 36086761 35229470 34254824 33411680 32989804 31753227
14198 31753227 30634639 30004906 29479329 28946858 27670836 27023720 26850494 25789430 25019072
14189 25019072 24542069 24107246 23432149 23132122 22209912 22149504 21365641 20935966 20713906
14180 20713906 20115648 19852759 19194533 18792255 18888055 18033521 17751652 17718116 16853381 16738844
14170 16738844 16535267 16237860 15754868 15261560 15399280 14998761 14638199 14551238 14164530
14161 14164530 14187971 13648929 13279405 13232988 13054406 12586449 12451728 12412320 12162694 12039860
14151 12039860 11460648 11649315 11462995 11172857 10825061 11036787 10806291 10483446 10402751
14142 10402751 10265050 9875974 9606533 9517251 9365642 9234990 9354800 8986901 9008651 8901549
14132 8901549 8831797 8546661 8741274 8256226 8377453 8070291 8335087 7807397 8054480 7829169
14122 7829169 7751477 7531210 7157278 7464863 7425923 6825013 7096005 6833719 6749225 6785799
14112 6785799 6644691 6667490 6644553 6451973 6263514 6205479 6197446 5934926 6276799 6092115
14102 6092115 5699082 5889177 5840625 5386270 5707024 5493875 5572126 5568919 5266150 5324961
14092 5324961 5167743 4853256 5088801 5189520 5031830 5194311 4889105 4639473 5016951
14083 5016951 4744097 4764120 4603614 4453879 4220336 4711168 4245471 4467463 4076483 4320406
14073 4320406 4552688 4039942 4397747 4108177 4029894 4008249 3814129 3763301 3891936 3833807
14063 3833807 4167378 3598060 3712362 3311438 3796233 3815694 3673507 3667530 3892238 3556470
14053 3556470 3549343 3520124 3275252 3280596 3167944 3346753 3227517 3355147 3296519 3230522 3104080
14042 3104080 3345347 2874818 2843960 2996226 2894128 2859231 3030659 2813135 2790618 3127215
14032 3127215 2949454 2993564 2893346 2652894 2987542 2602698 2558086 2659894 2474689 2874130
14022 2874130 2567225 2576946 2492204 2396735 2235156 2489152 2560658 2567085 2108166 2121101 2646972
14011 2646972 2182276 2559474 1876851 2035695 2202151 2111809 2137696 2320252 2258042 2004559
14001 2004559 2429510 2289205 1948800 1825599 1741813 2129889 2088605 2244227 2187362 2164022
13991 2164022 2371744 2519865 4158589 7723607 14770476 31696822 40668981 25182901
13983 25182901 12957920 7921972 5637810 4308442 3799857 3451846 3159543 2847167
13975 2847167 2515365 2567583 2671557 2370487 2418160 2403265 2438256 2618766 2348236 2053744
13965 2053744 2120376 2090078 1944894 2276694 2163039 1975246 2156205 1654817 1904397 1888474
13955 1888474 1851493 1860246 1673592 1891920 1990950 1663095 1747986 1948319 2035629 1892671
13945 1892671 1829712 1690285 2001792 1815466 1528682 1607315 1623947 1722004 1602321 1851723
13935 1851723 1476727 1398146 1656357 1410837 1753754 1580618 1642731 1627538 1647645 1425360
13925 1425360 1432774 1526066 1858722 1349746 1355497 1458369 1663809 1399660 1633707 1579332
13915 1579332 1314797 1388402 1467983 1467254 1195990 1196573 1672464 1573173 1434113 1228756 1229838
13904 1229838 1587366 1515161 1437685 1025943 1166753 1435959 1456448 1128299 1391279 1342201
13894 1342201 1446253 963669 1048643 1126753 1347058 1327626 1243718 1043488 1199311 1477678
13884 1477678 1006513 1224245 1079359 1306514 1224060 1082079 1146266 1274929 931909 909998
13874 909998 1224504 1254682 1104774 1183146 1319736 1260698 637327 944374 1231727 781360
13864 781360 614957 1218823 706552 919190 1050249 1323929 756191 1111490 1067988 904934
13854 904934 1063392 806414 1047476 923640 1156428 858283 997376 976631 1404727 909823
13844 909823 818026 615132 950841 921769 801406 1124894 843300 913463 766526 929250
13834 929250 926017 933116 961734 1235108 693642 724814 881952 817685 667996 944714 624381
13823 624381 941868 804994 668607 873729 538847 1037565 762154 852727 907165 738433
13813 738433 697665 865039 949308 922873 964577 519253 593487 916155 1252030 805259
13803 805259 936632 1032147 398668 760899 639637 728362 1102241 849717 788070 598530
13793 598530 745786 1013219 815276 709502 536031 706027 570854 916039 887158 759861
13783 759861 690803 742864 565215 400996 673627 540327 688584 732595 589188 722444
13773 722444 494143 745237 614981 539232 536129 717097 518195 706952 660032 703369
13763 703369 619811 633271 639226 775644 641483 685230 538485 622936 575830 602817 682444
13752 682444 636458 500654 613379 593070 669978 333945 333463 760787 1021773 638574 829862
13741 829862 780526 925114 433049 315269 871729 696119 401273 458509 794896 386662
13730 202644 619537 828709 341389 619647 866008 405769 403499 474482 588220 531189
13720 531189 393209 561678 238096 767785 293317 418024 413518 549918 363045 321545
13710 321545 527490 508569 367612 620433 414609 440332 616090 373785 368267 209369
13700 209369 528111 717341 417447 534689 209815 416788 745515 535351 573777 568527
13690 568527 418756 625499 350749 332711 651139 488952 650884 592249 307744 279639
13680 279639 712578 110777 544883 701152 371897 368697 433553 435250 400627 370589 409771
13669 409771 443581 71267 496756 512101 516279 261233 257608 78687 470760 335084 193015
13658 193015 315198 377423 718710 453292 142075 464512 270947 174342 517789 515031
13648 515031 196956 373017 358867 290504 382836 276169 548084 84187 215284 28006
13637 314612 202698 476130 104719 349243 544734 203987 272134 490726 375521 708150
13627 708150 187454 283225 177755 578611 471020 547500 286846 507726 -32565 364455
13616 369428 279553 481439 557699 531169 441774 266154 471910 439103 507633 245392 622454
13605 622454 210194 386779 66342 476163 416678 281429 450822 436944 51827 297202
13595 297202 254578 581288 311252 188999 219046 211804 414385 196373 276107 363422 470156
13584 470156 169725 675365 335782 574644 522974 318660 362570 485315 279048 239959
13574 239959 390748 81279 100736 147153 308765 130348 417661 608606 487567 340805
13564 340805 279456 30170 405996 232685 426270 426975 623918 409114 302573 167082
13554 167082 573689 -12204 175801 294257 393823 201299 352656 125296 143842 346833
13544 346833 205689 228956 126219 208918 167261 -28322 554765 308097 532806 37595
13533 386393 203165 195501 161432 166887 20432 114044 199813 -50858 535821 97793 325085
13522 325085 252774 511608 268036 327589 138443 207453 120559 495010 324770 208722
13512 208722 261904 74331 141111 175102 568037 313076 380755 803862 82212 315317 155939
13500 350379 234561 267357 369447 240596 280464 320476 143854 219147 168020 585928
13490 585928 132847 390833 554739 124696 344266 473596 -220004 -171067 152459 -267536
13479 204472 115694 259204 177601 285582 81881 428604 312247 249084 259869 473646
13469 473646 -3261 -43242 157784 192064 256884 84913 305985 306273 257234 87327 -116645
13457 79636 171779 145019 31498 252123 146557 469831 264704 208774 173133 21650 43739
13446 43739 357027 2838 120196 115593 400173 -39807 294998 225636 168205 206413 331957
13435 331957 126985 237510 168911 23511 401980 264384 146009 250893 26097 330341
13425 330341 106438 227200 311799 177885 178182 30021 -197315 424281 129725 219262 29976
13413 291513 40687 321185 171871 305436 273077 232117 115969 13429 -3322 248442 169878
13402 169878 -34598 350510 -136972 -5821 346998 479677 257135 279518 -91600 327746
13391 77127 30895 -65320 38533 305418 228747 161348 181737 318913 409390 307517 206147
13380 206147 -171265 157964 25616 146548 503644 83998 402592 381178 -325055 209814
13369 273165 120598 70311 79452 -67783 280317 48030 399082 135127 -110107 399006
13358 522552 -214409 109936 243468 110649 -21526 490276 488957 94799 301305 412825
13348 412825 97643 -123111 -200043 167107 200172 165430 220879 140885 464795 251182 219093
13337 219093 210767 225480 208399 374289 -117633 269353 467469 67971 317558 220313 253964
13326 253964 195528 484612 131322 143216 230589 204506 212521 177758 140791 385780 -13253
13314 302902 179357 564002 21187 33234 -22957 178693 -105469 180794 444095 421307
13304 421307 103283 424592 152682 120714 -210699 -58333 327213 -39293 299126 -24329
13293 251693 84208 38479 231148 -85506 183766 311418 128676 -1828 331567 212137
13283 212137 198114 66855 75035 -73655 234170 119817 241499 170628 -115179 142292 397899
13272 397899 103587 129216 135069 19923 -16451 172550 260289 135157 161785 198449 156436
13261 156436 92680 104706 118096 -306564 37873 25425 340718 122644 352518 -16778 29894
13249 209823 110838 -201140 293731 233807 60280 81900 79415 201458 120622 30642 128170
13238 128170 -190903 170348 549033 162685 178200 186480 84134 13013 -117325 58280 3542
13226 62238 -115864 75377 70055 -134567 15798 122902 262386 71844 188413 130105 166073
13215 166073 233757 178218 77572 59260 291666 -114850 -204689 222876 -50424 249072 92484
13203 226527 161977 102551 121210 197838 579346 237108 203118 265557 14238 265758 43914
13191 98010 100831 -232995 172484 409461 -201685 -148684 -25743 229988 -52034 49346 -93986
13179 69438 286671 302308 49421 291651 159698 13456 342998 30913 418250 38002 41416
13168 41416 -38197 89083 -38929 15415 44034 31493 -97833 35796 171279 372582 38333
13156 30262 -91083 178677 172504 -156049 81369 52316 196159 74041 288255 151325 954
13144 77131 283586 362599 79426 -139686 -262521 19410 104324 -58965 -5596 1424 -226382
13132 -260408 -225429 -104044 -264284 4861 -20932 -112488 -17592 3400 -77496 38768 92237
13121 92237 -66375 -128828 40062 -100398 79364 304602 463175 -173246 86391 60362 195448
13110 195448 442771 187842 39121 132320 -96291 -96567 140446 179725 -55347 82635 472091
13099 472091 82715 -87207 82173 112763 71357 256776 231819 133737 -48882 -159399 -165333
13088 -165333 -174498 65313 -29773 53686 -104231 118313 222191 -70787 114841 -32772 -32028
13077 -32028 301258 -105050 73188 -13273 -68402 334163 254057 -51315 130468 -103311 219327
13065 16122 -8357 -198158 106796 134179 -102166 99149 77000 139573 -145480 279979 56983
13053 211380 -168370 417734 -22670 50190 272498 151337 281934 144888 -14210 -33066
13043 -33066 -146581 30749 -150523 297332 -96493 -35774 64021 231048 109191 285572
13033 285572 -58835 249516 -18632 -164568 71737 207941 327536 138182 229277 101887
13022 155400 315053 1091 314087 402221 152461 -113738 96217 53004 -76406 -40301 89298
13010 -30511 56959 -69374 -21167 -198766 204456 99875 247921 73008 -4522 -85918 -56914
12999 -56914 -145390 132688 266801 -65015 136007 -157545 -141774 -98664 -14001 217211 65965
12987 342360 287697 3715 -37806 76390 43340 25932 4577 -91585 47960 150744 -22098 368141
12974 129489 -70456 -86570 108709 239128 34229 99863 293880 175287 196387 -20262 -407766
12963 -407766 277324 -166752 412847 3944 -109207 290685 -219529 -23205 242989 -133850
12952 306112 339491 231535 215960 -72357 -112895 170962 75835 175979 116001 266530 -201204
12940 40003 -3458 -144026 -6672 69603 216247 222213 325143 -52022 -164304 -66361 -192095
12929 -192095 190766 -183659 173268 -34062 96894 -129484 -122494 42936 -136572 -304201
12919 -304201 120501 265508 359 95511 187457 -234718 -131390 153109 -42777 -258196 151541
12907 -119349 -298131 258818 203510 40646 -39680 143768 -55095 185787 9654 424457 -345979
12895 -177776 13616 -8881 93795 164970 120446 99161 65009 -177989 -271516 150198 166739
12884 166739 99425 80489 43617 -181994 30663 -50713 -86411 199881 138611 -23176 -36474
12873 -36474 151446 187924 34477 52998 344493 155493 -5227 -18374 329248 109902 89151
12862 89151 20189 235995 10474 -161496 -93403 104948 -11415 -38344 55936 -48087 -192393
12851 -192393 18817 -93997 -163385 354746 4285 65044 14406 -6647 -529344 -31665 65291
12839 116787 -137592 26368 150444 -224961 177508 67136 46768 71160 59888 97135 67415
12828 67415 -44459 182147 29117 70429 -51119 -78078 -7350 179723 -253765 104628 68409
12817 68409 -137222 -86493 -96816 -140063 -298212 259114 158144 55867 -197489 56155 59225
12806 59225 -101980 -5997 -93724 -146216 -218021 -46353 192967 -24566 -77014 -207937 -301486
12795 -301486 -411821 12948 201125 -67027 -331150 221280 -137232 -202382 281825 228277
12785 228277 33813 -210504 -38385 -157565 52865 -17783 27285 359977 -3543 216777 119669
12774 119669 1315 184908 92016 -136135 71095 115714 -191804 -233014 236916 -41853 494936
12762 -243294 -155016 -234474 -49407 117898 -72192 94665 101911 -206107 -40628 197635 89272
12750 -52300 228408 163035 -16443 -17677 -103872 -43437 -205048 394290 191818 -109507 285649
12738 524622 -39628 137585 26991 -1615 347021 269721 -196266 33533 60149 98330 106840
12727 106840 10191 19843 24407 257155 -164107 479029 -158492 -324817 223875 138669 -6211
12715 -89093 68846 -244624 -204994 69742 128873 426820 110538 349683 71439 -138697 222681
12703 445474 192532 106738 -183570 -57931 35523 -91348 52198 6311 28013 17111 313796
12692 313796 -91832 -123955 -47002 15540 16082 335350 -232790 13648 130228 88453 -33839
12680 -99313 -14913 245977 133739 115695 -122692 -135426 108686 204420 59155 180112 -18987
12668 247661 -39832 -77644 212000 -181667 279143 6925 160325 132874 22879 -36128 136062
12656 370939 -51054 -16945 336998 -136274 -231805 378853 -65212 -48957 37719 84913 66414
12645 66414 143036 -248935 -37844 245378 134047 -281751 -100346 50078 230824 139188
12635 139188 -128152 222576 176394 232815 59239 114328 268894 -25378 307853 -166467
12624 215351 -23436 -33687 -1996 315598 213518 248994 -156832 -61145 309586 -107751 -122860
12613 -122860 36860 -82671 74079 149322 -286610 96945 300701 16187 289015 75102 75161
12602 75161 28800 254761 -67688 157251 -182282 322236 -381345 35450 80104 -63268 26029
12590 -57813 -11981 217522 -166780 -226722 147211 75595 -157173 95796 -133935 -113944 -45242
12578 -122775 31468 91673 155789 223940 58988 -225909 -64493 37804 -36709 -82481 -139353
12567 -139353 26 141380 -80321 -25036 36626 180203 188245 263054 411927 186479 -386474
12555 262264 91124 187022 -2172 255287 15934 91451 -54074 -217252 87450 -64976 279498
12543 57992 78969 184191 137305 -40336 131415 -247663 -132766 198690 67557 59433 149386
12532 149386 106545 -46857 -107201 -49348 53033 133327 89351 81582 -214593 -32060 87562
12520 191 235098 219858 -601 117790 -6532 -293828 -83591 -164938 305970 53703 60160 26806
12507 -2211 -44871 20716 -125783 -169079 -59775 62850 -42302 185416 -149076 316331 80529
12495 35930 124609 224644 -235359 76486 -188075 65672 -237425 37080 -153622 -269131
12485 -269131 -13858 -292146 -175845 430389 -120771 66275 -112762 262411 172585 307321
12475 307321 167184 3937 -20136 -176931 -54963 -240984 119833 -89957 139099 -122405
12464 269196 -59572 60695 -12527 -166189 53302 49623 327437 208831 -425015 -161801 -23759
12452 -49493 -142307 -72657 6602 -151684 143471 141999 110236 -23717 -65577 -144501 130466
12440 -99686 -20723 7919 -135082 125480 -146544 23435 -112600 -168421 387689 63977 -103537
12428 -152382 259062 -80991 37398 4824 -70394 60623 -24665 220832 186179 11102 120864
12417 120864 293023 -220493 57995 88187 156796 33797 -138752 -66055 294845 74733 -136520
12405 -47684 349896 -7622 -57353 -390462 -84618 -35704 167096 25899 -138843 64141 -70935
12393 -247757 55436 82713 -252925 92989 201283 -54588 -124666 132504 189166 -224763 118243
12381 -262980 -155934 -71313 332441 -312703 30127 -83695 251250 -71913 56943 -104992
12370 167635 -15056 -82429 -181912 192722 -67054 135447 230657 54690 -256680 176233 -46251
12358 171537 -37431 -11346 32287 12849 181629 -107082 138284 -68284 88075 -78125 175807
12346 -11689 37067 226391 -173183 -54932 190564 324182 36929 -119351 -129024 402176 74172
12334 23175 289778 324114 -117219 223050 -290574 -68646 -47532 -24825 -121757 -115400 29837
12322 -95376 -154994 174159 -326510 -95586 28099 218189 -244807 -13156 -60694 67642 -117970
12310 -94946 -217950 14925 83932 -244337 -163517 -111946 -187429 158240 186327 97652 -99563
12298 -253412 55333 61633 193900 -115287 124048 -112171 -556055 -255701 -4359 -108053
12288 -108053 -24877 13890 74645 276842 223092 124043 41181 306544 -46680 182570 152763
12277 152763 -13491 168858 10299 216431 204870 271308 -56967 270999 242134 -128031 305129
12265 -160368 17864 122006 -72896 -199968 23781 -72008 -115004 -27633 383383 42098 -15111
12253 58171 -40324 -92997 -79034 -356077 -290803 -46000 239507 455677 238383 37589 110635
12242 110635 -178281 -115524 161910 11296 12270 373558 61952 46502 -78840 185821 -111331
12230 304853 -144258 -17619 186480 -169483 114496 161526 67606 83915 406268 519485
12220 519485 53152 153788 -98440 141824 -16146 20482 25233 5867 3365 7802 254364 267797
12208 267797 -20 97366 -42683 326003 52636 127271 -181110 96936 -281127 -219886 367339
12196 437061 174841 33031 178820 208954 190265 -27737 142577 81246 316376 215625
12186 215625 260146 161069 -235724 -44158 390180 -17110 107040 -136361 235879 258699
12176 258699 456876 -16611 391766 -32610 118769 339016 96917 70871 72963 -28777 247446
12164 114079 107487 202984 -22434 191735 115086 153295 -126204 256030 -33591 -9551 20669
12152 -88921 -231475 54596 -97751 75736 -15182 69503 163564 134940 89242 -91505 245741
12140 -63024 52647 -171303 -12415 -58632 68416 96463 -266430 32449 313935 120523 291498
12129 291498 -204231 256310 186911 146570 -247648 -11996 78345 25411 26320 103880 -105602
12117 -267398 77811 -586 -153910 -486673 -293261 -56051 8105 5657 -78411 206087 3233 35350
12105 35350 -96666 240256 -306120 -27276 -245759 -173586 -41417 10995 -33536 -194450 73984
12093 364919 -202924 -22732 -110831 34880 33931 -4583 89370 -336974 -158146 -375769 37845
12081 -337900 -183811 -120972 -38908 31929 -23657 405406 725795 1495807 724659 283596
12070 179407 -206521 313199 -101074 95669 244669 380249 265492 -252839 135989 87841
12060 87841 139250 252807 60465 141768 66436 -69237 -206743 142197 -387241 60657 -53802
12048 96668 -178145 97953 104691 64568 -264943 -213258 43890 -227985 -136669 -329412 87441
12036 26053 -173841 -425431 -303658 -176894 -183864 362733 -115532 73135 -106880 7109 31051
12025 31051 10102 37888 -122562 73625 -35491 73435 -68546 173455 163497 203849 -230794
12013 55541 -20478 117722 -138843 -6754 43331 -116382 -222833 -104757 88228 9993 86938
12002 86938 203197 2676 405487 75384 -133528 361827 -158281 -130173 -60124 65826 111960
11991 111960 -150178 60952 -76389 47491 109441 -53568 -74770 -493769 42995 160407 101573
11980 101573 -186981 32767 45401 87755 9789 -125129 48223 -228319 131730 69984 20689
11968 -323265 68783 10624 51436 152905 -162524 -215114 51206 -145030 -3129 -45106 141800
11956 -144921 -80817 -69587 174878 610533 -55901 -82347 -280408 51776 -11748 -12503 -32313
11945 -32313 -163351 -23082 59762 7153 -6548 395057 111163 14173 -11543 -8632 42161 -227358
11932 -90016 123818 -24995 -162112 11872 -136140 133426 279310 13395 -248227 128661
11921 -159996 -393798 106753 26037 -154436 -13835 -231080 -192508 -143769 145332 -66030
11910 -132868 -17753 -129727 -55117 355370 6191 193043 -209316 -141592 -250215 -94107 295105
11898 271591 -32316 -15949 -12828 -157211 -75825 198135 -25894 -48978 -208296 172231 -295453
11886 -390217 -145800 194057 -40489 138416 147155 -44768 61845 103817 163330 63464 103224
11875 103224 113171 -64348 -173084 41784 -66284 77607 14299 -229995 -51199 -63481 64203
11863 28455 273944 -93524 307879 -149037 166672 -370796 -13904 -234799 -190740 212776
11852 -260757 28179 114087 -68042 -75159 170779 -86909 -267612 -216051 -256002 -129369 -111023
11841 -111023 97535 -65435 -301229 258513 -88529 7798 -10889 -141081 -60907 -73790 -371168
11830 -371168 -59393 27520 -410753 -131118 -119908 -3518 131457 -41596 160275 88163 -81223
11818 53102 -19008 -194407 -27542 180003 38860 203738 -22789 57642 250106 -87846 173160
11806 95871 -29778 -68419 73151 -120808 188113 384354 83333 -218799 171063 -108464
11795 205217 166999 11887 152789 88190 -322784 58382 249945 -257696 -353345 -141934
11784 262629 36941 95076 107685 -153065 387518 -201856 147824 107465 -3278 188240 57527
11772 -31605 -3091 55547 -215699 -146544 -117411 115767 100478 83332 167127 143338 -60650
11760 -83964 -288791 6087 190685 46969 23125 -187935 -121775 -116508 -365465 102853 -136836
11748 -474884 -188815 145555 352304 60587 -158989 334481 -188881 118022 -23784 20286
11737 115533 -85931 205688 -89924 99254 -18536 311241 21314 71997 168857 -55164 -158473
11726 -158473 71971 20021 -95699 -39239 313218 -92894 99622 50278 -168930 -73977 -95630
11715 -95630 151005 -185302 -43672 193692 61380 115550 336154 -534 9776 36445 24104
11704 24104 620 106694 -213864 -169295 -86928 -134233 -42430 310762 76693 11103 125156
11693 125156 -199608 143434 253504 11198 -130724 158746 -103495 230317 306001 58670
11682 -231817 126578 -50473 -171112 -103372 210557 -99495 52015 117517 -258436 41239 19387
11670 -67606 -53753 180974 -42084 110760 -227332 -20169 521362 -32390 171556 -162651
11659 200261 -102538 6768 89318 98702 -33787 -155345 309876 -26958 418763 -100024 -303111
11648 -303111 217610 -308725 -272926 275626 195044 109714 157338 -73466 368989 -168882
11637 120227 204070 -226926 56752 2514 6010 -99449 -302559 230996 50863 76740 176957
11626 176957 5252 133390 -92704 211524 125936 -47654 235280 363974 189498 157051 172152
11615 172152 168533 197994 206134 75177 -7768 87942 156219 -1952 8369 -137677 69449 -225200
11602 243765 295614 26684 194971 156018 -29763 -26382 -130134 -176986 -307794 137586 -131447
11590 58134 -18248 187486 -54206 117808 -111826 520683 161669 -127846 123388 523376
11580 523376 -61915 171708 -140935 -32194 48266 -249960 136969 -150198 227368 -10975
11569 76325 157217 -23257 -47331 -70767 -141481 413312 159381 48235 271025 91805 130897
11558 130897 133819 173091 -205909 -189382 -328611 105473 130792 63697 -55757 122080 232069
11547 232069 177821 55532 138466 181738 211368 -178729 27330 25511 -100629 -82846 78036
11535 12567 162755 -194140 273805 -16510 365132 537281 -161844 -18783 -118035 -211983
11525 -211983 61414 186363 -15990 -47363 -85755 -30467 188546 127995 -90505 24908 65301
11514 65301 163279 202599 274181 28944 142041 -53403 151501 -275079 29662 -25896 159710
11502 -19227 94696 -111136 -286238 164070 -28398 -146433 117718 -41317 109363 26465
11491 144533 128629 103637 450642 -67174 90622 316801 486951 192496 445240 11356
11480 206378 -121528 73280 91248 148889 315896 8328 183339 106640 122492 203899 196868
11469 196868 56952 -26856 5561 -142016 467114 238785 -36115 135874 306 48434 178567
11458 178567 -59711 143239 68699 43380 -91050 143056 -13657 -111239 -856 -213880 194837
11446 200290 428388 300707 -210034 -66299 140744 137824 -56864 -174467 180744 -16759
11435 195212 -186236 388833 -86598 119459 -52836 246035 -289931 50413 -211495 96469
11424 171955 -34853 -221360 186951 -119563 -49110 -117464 -94025 22940 -263632 100086
11413 16267 -131847 -208198 -197819 146421 -110917 -52653 347756 229837 23415 23676 -29359
11401 115492 257252 271684 361656 412686 -49362 -53877 139133 -118394 188277 -42133 -188842
11390 -188842 164585 44133 -109101 -74949 -238624 -10380 9894 -214316 318052 -56034 126491
11378 23646 -127056 -188965 -18793 228218 -103456 52478 169518 -348760 36251 -506649
11367 -9927 75234 50669 -116603 -24216 -1391 44607 -252902 -239033 104782 263929 184196
11356 184196 -170185 -144746 -121999 272429 -87603 33833 -96565 216642 -24547 177644 -264555
11344 -6181 177848 -105737 163916 -31864 25700 119822 139321 153190 249477 -82729 -336115
11333 -336115 -381804 564716 -276 -109678 18526 -133411 183319 60335 123485 -111957 -141044
11322 -141044 -218300 58855 -81399 -144469 -217520 28905 35463 -281908 247426 -106993 68207
11310 56311 51526 -66104 -49318 233389 -70197 -131760 -5905 71801 39309 153239 51662 -7246
11297 85878 -139536 102318 -222083 153598 -301228 -190167 -189570 -439385 215122 -2414 -205254
11286 -205254 -225278 -256649 -107326 -309050 82929 -148612 188361 -57356 -121184 -204523 -141526
11275 -141526 -164446 -107792 -26664 -80085 -284652 180836 -352503 -78286 -424383 464302
11264 -231115 54770 81032 -48343 62503 -105802 -214142 -113905 -65155 -44308 -179092 -105853
11253 -105853 601490 -181541 -119102 -122121 62436 -154574 135458 144959 382418 -232360 49788
11241 19179 -68145 178752 96527 -11677 24876 177888 96096 -164908 67093 -281288 179760
11229 162254 -69699 -348678 -244839 -35529 77471 -7894 -3262 39437 -308017 -29774 -20039
11218 -20039 -287929 79189 220405 35527 2056 -312613 172646 -67400 6913 128869 -59262
11206 22162 -16508 -319114 -121264 -142322 -18613 232531 -242379 -10617 -99385 156783 16796
11194 -159159 -192487 -56332 -205355 134106 141515 -179133 135162 43727 89405 54898 -236946
11182 -379854 -121871 67589 -138178 -118157 248342 -101563 -160092 98960 38382 72917 -10002
11170 35971 57046 49122 -24096 -51184 25210 -81263 36532 87652 -9594 -60886 -109809 205305
11157 212924 -284570 -175845 -376173 38317 75422 -242903 24807 -245230 52664 1084 77486
11146 77486 -68209 -151599 295951 326666 136180 162562 -142448 -129959 227234 10705 -15727
11134 134604 -155659 161229 105206 127053 31777 -49856 103431 -143325 -9627 80311 262426
11123 262426 -132890 237475 275222 280808 126382 87394 34514 115972 -269029 -193917 105331
11111 -373856 329765 382896 317969 13111 118075 175206 217013 35997 90858 233999 124820
11100 124820 -39427 71021 95574 152281 296538 -98440 211748 41281 230085 327161 80422
11088 -46810 56287 321189 31125 467325 211608 244381 574470 132268 272100 80031
11077 67535 123955 -31934 134329 -50785 71844 460389 481209 169118 299003 140418 313654
11066 313654 357197 134640 330101 237875 542503 537963 806963 470650 453234 551977 681837
11055 681837 237884 590655 236821 673769 730246 742881 418196 740519 554845 907846
11045 907846 808005 669461 710378 646333 572959 552088 539992 867116 467457 821483 559638
11034 559638 710093 327578 648067 432563 261735 984999 538640 108701 571074 671898
11024 671898 528601 530504 620187 532569 756148 425563 818143 713663 248298 614303
11014 614303 420972 629473 517625 851325 350332 456088 378607 484397 619153 372015
11004 372015 766698 426117 647961 773405 697347 660207 769503 462724 473822 432813
10994 432813 643386 748584 185604 704979 675324 872575 747133 1154946 684630 1054299
10984 1054299 776447 586617 946428 898416 1377112 1024850 810389 1480747 1771780 1550336
10974 1550336 1854665 2116416 2128551 2506843 2704289 2117997 2113991 1702806 1971278 1782496
10964 1782496 1728697 1341542 1562414 1695980 1660051 1610078 1765915 1551650 1759467 1491173
10954 1491173 1441408 1619839 1188177 1056495 867160 565564 677779 170137 543808 185024
10943 113855 382057 -219881 419422 -78685 27004 165091 -18934 -145796 -171853 130119
10932 -98558 89943 188220 192642 -103193 -10486 3054 -69819 257073 168200 155180 192227 151902
10920 151902 -199474 -46737 -29703 -18803 236252 210389 17849 321112 120420 27056 111363
10909 111363 -41320 -200136 -159545 -54975 96264 -28700 -64831 -104315 82395 111613 320951
10898 320951 53054 -15162 28225 -247982 1802 44095 19861 299904 -387775 231739 -280576
10886 -253746 -63230 14024 -131754 168381 -122433 110069 145451 14377 -33742 38313 -204730
10874 102850 -39564 138378 313043 -173566 143061 208403 -72698 -29798 271 322235 -110469
10862 325217 11461 -495370 341213 70987 1947 -28755 -237492 -7565 10776 87567 12032
10850 -213887 -376564 -183158 112109 -83887 521 -116287 498468 -355528 -123432 -98590
10840 -98590 30369 154120 186452 -20355 172183 -30343 39701 135160 -392241 21320 -32363
10828 -25887 -46733 235422 187639 130532 -222141 -180983 5313 -72153 -103498 71067 51218
10817 51218 71169 -307047 90881 327492 -175526 124120 -141308 88605 59948 130151 50296
10805 1640 -277950 -76625 79126 29877 160818 -145179 355277 -173359 20081 -132444 187182
10793 -519492 -164454 -61128 -126495 -43015 83475 -24698 -278026 -298103 -519319 162584 -383367
10781 49929 71608 -213369 98595 -26264 -150539 180270 -33135 -14878 -98565 -156267 -26350
10769 -75230 5369 -156501 -110114 -112618 254930 -1108 180343 -71336 -26045 97846 8580 195847
10757 195847 -48689 19046 -149755 -135357 -141948 59936 -288653 -125884 23197 138874 82705
10746 82705 123598 -20048 440149 -246052 283321 -76802 -235011 296159 231401 -212617
10735 -81681 -230799 158009 46852 5352 -45395 -63807 -291254 -15166 -120510 -197468 64558
10723 -21727 -165232 -128889 -435410 21108 -133654 -21736 -79809 156772 -292005 -71990 7836
10711 -267527 -187133 2990 58453 -67386 -17517 -66157 434538 139212 95613 135596 86131
10700 86131 87890 -198659 -270330 -165027 -194727 -65716 -142186 240912 -277380 -286224 99007
10688 13876 67475 179075 -41635 -59503 -302530 241926 -134314 -293094 -154163 186674
10677 -107665 48278 130753 -183492 -126371 374429 74573 -119512 -115542 1518 -34167 306120
10665 -271555 -79532 -26345 -43554 292765 -13438 -368701 -102384 243377 -144920 -257516
10655 -257516 143363 -171446 -125605 621 -89312 -339680 -242725 94030 -24457 282968 169584
10644 169584 76354 38808 -46647 -333006 92252 -180354 -51924 180597 -204961 -147788 156634
10632 44348 -45547 199553 164425 -18369 -159154 87350 78095 -293563 181773 91422 -125670
10620 -230755 -34806 -12459 -50114 -219209 124587 -130014 79685 -148048 213959 -63477
10609 -97972 42507 203408 -150563 -36721 72690 -201228 129304 -113663 42914 -210845
10598 60209 215376 -313627 -330548 -135145 -272464 -158050 -214680 -184953 -26025 5144 -75466
10586 -32107 147507 7693 -432784 21548 267854 -154067 82796 45211 92662 -70661 -14959
10574 73163 -246232 205161 -207791 -210721 -239599 8019 -82585 -161683 -114736 -106307 -169387 -143700
10562 -143700 -271972 -330177 -69315 -45322 95403 227405 -209254 -52092 -88834 40436 166780
10551 166780 -46956 281052 -105051 84972 336014 -86784 -141512 60783 43463 -146889 -13826
10539 -30059 -144032 -265606 -155253 -265926 -72434 -168204 -153196 238814 -78890 56240 94975
10528 94975 54962 72920 178791 -83701 240927 30243 -79385 168684 129944 -88774 162749
10516 -120948 277378 1503 -280567 -48873 -23115 -65571 -77226 -67076 -47807 22103 -40009
10504 -7710 -76771 -67719 14374 183980 -267474 -156396 -249054 -91703 -33427 129517 -94995
10492 29683 -146884 -89233 -412377 -142887 32568 119876 184458 -10250 296438 131402 140999
10481 140999 894082 602806 223210 520875 286215 180072 286505 -27279 17170 97552
10471 97552 -259612 -114312 15263 111196 -240935 -95983 -192981 -202612 -43570 -281704 75199
10459 -122768 306480 -52796 -121256 -51603 -212074 -125267 318061 191511 -232766 3949 -190651
10447 171364 249708 427004 -52734 191106 -17944 -68295 -14488 -49019 -76036 -69373 -326952
10436 -326952 -442378 270490 -138043 -245714 27614 92985 -256259 -78034 -42837 -506846
10426 -506846 -33367 14385 -245400 -64366 265007 183198 -85614 -312125 -100251 185779
10415 -27903 -438126 29571 -78015 -210583 196931 -73710 73721 -89615 126707 -12601 5053
10403 2536 4765 -138729 -25539 -110711 -143756 -154866 -272691 12871 132283 124438 -86632 -69166
10391 -69166 68963 54417 199091 119319 -180388 -409467 126841 76715 -173683 -144657 -54882
10379 515885 172778 192154 140558 149394 99871 62890 325316 215256 392362 251989 456008
10368 456008 590381 597061 244448 282558 327781 2215 416711 368857 232094 345546 -80579
10356 80868 38472 38874 -7954 -35577 320658 299011 665028 168955 272911 110092 320176
10345 320176 349621 290987 273210 244413 200307 403351 145831 71718 557841 -59769 154757
10333 -19740 135301 -29876 74608 238567 351202 -271 220516 188382 378632 78904 213037
10322 213037 206115 296950 155259 205360 315041 198073 -87098 408899 342783 -14739 -136364
10311 -136364 -87708 79576 -15674 -234930 194365 25153 44872 64134 124966 92093 155949
10300 155949 108381 32962 -93105 -184881 -109280 -137232 -93735 -346945 40691 368984 108082
10288 -15789 15347 -114319 -155291 157005 -101650 191791 20113 24793 -345088 -164256 148919
10276 -143598 71235 39028 11443 -144202 158341 -42618 -76939 -68958 184489 203276 107620
10265 107620 172394 34702 88139 -25695 100368 132338 283051 327420 362293 295113 244958
10254 244958 89863 -24157 -118237 16531 296891 54111 76271 181329 -314404 88302 71419
10243 71419 17542 131306 -70328 -94681 88938 5642 -109420 -170688 103352 -147864 4895
10231 -337200 105144 48971 -38175 43349 25683 81909 -16975 42624 222734 -171156 -65147
10219 -470953 94607 130588 -45748 91706 -60638 -135166 23949 -43656 94178 -24962 -352537
10208 -352537 146083 -57009 -125361 -432157 -37202 -298017 -170231 -262746 -39684 -529705
10198 -529705 -29500 -123834 125158 -375291 72617 -272374 214999 -9184 -97654 226573 59447
10186 -41389 -162305 139104 133237 6554 -146324 -234603 191682 -108607 95950 24271 172617
10175 172617 -80200 77906 -127207 141457 -210771 -176458 -246419 -113296 25738 52498 196451
10164 196451 120979 -199224 -106400 -231600 -202754 89957 268106 59152 275261 135419
10153 -141274 131318 -349611 -357612 -101785 51076 301248 -20915 -328516 -292534 -141848
10142 -105187 -179370 -26372 218343 -281948 -96510 169235 -171147 -33952 -439443 -31534
10131 8010 -202932 66522 249065 -270886 -174955 -109821 -211684 -251442 -57111 47082 -53980
10119 -123785 -44405 -68974 254954 160570 -17348 224064 -56472 13391 -178446 -1411 -73648
10108 -73648 93165 87805 61604 -105574 -16509 -396458 57623 -168460 -27924 25140 -339671
10096 -32657 234823 -250728 -250420 -249742 -89231 -27526 188410 -7983 -217801 -37195 -88018 -114567
10084 -114567 -163438 -175670 86047 -282962 -24753 -31537 24067 -50947 320524 -337728 -205455
10073 -205455 -81612 -228956 -85974 -48499 90365 -202195 -287926 -110181 346584 232198
10063 232198 129369 -180038 -71023 -207973 -167981 -46129 -82402 53724 48734 -125956 -87635
10052 -87635 -101184 -354000 -196515 -143476 -148970 -3803 -314208 57939 309272 119911 -67947
10040 150592 -167616 -171028 -54255 -6241 56677 62619 -118216 -251719 -202759 -10236 22909
10028 -158540 -137187 -77905 -166485 -133567 -57366 53564 27810 -66213 23515 57454 124858
10017 124858 -294291 -148485 -148085 -263218 164822 85081 325252 -26528 171780 -181438
10006 106703 -6455 252961 66591 -310741 18340 5290 -226238 71876 -166871 -180064 -68573
9994 -141659 -35086 -393753 -94477 -218798 -266607 -240388 -398520 42812 -67043 -29112 -80364
9983 -80364 -546219 -194326 26127 -402188 -63708 -90666 -31051 109518 -207169 -62979 -127229
9972 -127229 202302 32575 -271123 140216 -277121 -11653 5371 -107864 33499 -398670 3932
9960 -90803 -113608 -211178 -211218 -463910 -38247 -187646 -196780 -67901 64509 -65262 -79165 -106543
9948 -106543 -57486 2219 43954 -193949 -99558 252326 -95874 203801 -73652 -131271 10792
9936 70960 -304527 -19672 318277 190100 62665 -151238 -123023 -209447 -85720 -21982 126731
9924 -287734 -264259 180198 -66746 -351742 -57737 -92748 -211633 -9079 -230271 -69746 -260580
9913 -260580 78806 183710 -34680 308912 -215220 -145028 60797 -224570 -245548 -4602 -111071
9902 -111071 132132 -152658 -63173 171950 -46441 -7603 644 -110788 -178445 -92279 -129386
9891 -129386 67282 -182162 -107390 164663 -48688 -222185 129570 9320 -232543 256134 103247
9879 -65454 -156883 -27894 -232207 -259232 -122760 -197907 14724 -270489 -107681 -159669 127851
9867 -66003 -126212 252959 -46454 143103 188843 -11923 -43282 -216473 85063 -231233 -254757
9856 -254757 -94625 -308013 -285468 137752 -256790 -266347 -72434 76883 -102335 -195755 39371
9844 -45539 -173171 301834 -92421 4386 -479820 -169895 -32365 -215711 -89265 109274 -54897
9832 -107742 -303546 -55909 -35610 -184387 70570 154391 -275111 29564 -345029 -202638 -95700
9820 -103748 43051 -105583 -21154 -149594 -81502 129960 230163 -151319 32726 -10509 -183527
9809 -183527 105681 208044 39916 -263107 -117493 2128 135916 -182591 -457967 -175573
9798 2616 -23991 -96549 176407 -198294 -114260 132956 -45958 -234586 42253 202955 71313
9786 -197795 -335002 242658 -21644 -188379 -301076 325537 -290103 -164824 -113191 25204
9775 -208887 199986 168550 -77114 -208048 21340 -118314 -18044 -166649 -34918 -257427 -53103
9763 38286 -224166 -68908 -42907 19829 -274341 -34101 -159311 -127724 429 -151421 90533
9751 -88102 152038 95513 -110091 -132515 116687 -97583 -114396 -121134 326468 118224 137766
9740 137766 -266326 29315 -196712 -83652 7701 -100146 -13231 101508 42023 87838 -380487
9728 178507 -366342 23473 27770 -151916 -229236 -132897 163959 39351 34365 -26685 -160289
9717 -160289 -144930 -77155 -206066 -134404 -156534 -26204 -35240 -230076 150538 -232448 126673
9705 -42296 -200472 427120 -323747 22019 37656 -74390 -19544 -44904 219493 222736 -36767
9693 -413936 -141742 -138899 -213430 -50587 79007 65946 -43514 -50495 -257892 64585 98279 65410
9681 65410 -328041 114722 -222634 -102481 -87600 210813 -31953 -5246 -37507 -173840 -168127
9670 -168127 -250922 -166951 178397 -30612 -101369 86536 -61177 -331401 -287506 -430345 -5424
9658 -126558 25771 342995 -271806 -88278 -383657 317297 -299417 -111750 116275 -34575
9647 -261054 -20623 -71339 295484 -162698 -252707 -91400 -97301 -87313 -231595 -127310 130088
9635 247678 -71818 -288419 151732 -48952 -163295 11152 172450 2778 -201232 13461 -81561
9623 -154285 138852 32645 130834 -290418 -246092 -137872 -76421 -69965 -55684 -41134 -76502
9612 -76502 164155 -389477 -489572 8520 -128827 -55450 -135740 168783 -266233 -226352 148782
9600 -146325 -195292 32205 -20158 -186332 -375277 149131 226050 -262313 -105613 113038
9589 303181 -172179 163981 86690 -368045 -254503 -58452 -64052 158371 -13199 183663 -349327
9577 -56968 -10000 -86245 -197409 -181677 -33093 73453 -90014 -191791 -241648 3266 -264125
9565 231850 -37000 -66746 -483011 114180 -261529 119292 79346 -266178 90033 139448 -114256
9553 358035 -9645 174011 201340 -108553 -341090 498781 145425 -26677 107510 -304449
9542 327014 25393 45395 -195379 -13814 -79210 31477 -54472 -23577 6635 616361 -88355
9530 130395 300435 282695 -76615 -49406 312919 -241191 121784 239372 -193692 -420065
9520 -420065 58736 -265322 117241 -146921 -109898 -28009 93818 127758 -32572 176784 189758
9509 189758 371776 -247192 120221 -84395 -263995 -227981 212310 28702 43004 -238245
9498 -198449 -120831 -13769 -46169 66702 34163 75705 -99143 -22545 -923 -244108 -38803 -175411
9486 -175411 144930 75325 -224856 -55262 -36967 -329981 -48832 178103 123654 -196796 -316593
9475 -316593 -238036 -183243 -123071 56205 -215321 335538 -301557 -11504 184109 100504 -212946
9463 -152904 156929 -36748 -16148 -162521 11513 -239424 180808 -288384 29015 -457453
9452 -339752 179707 -299606 135746 -380453 -54811 34056 38484 -5737 -121641 -247614 -219155
9441 -219155 -241973 48334 -130943 -57788 -34261 -258781 -1387 -182395 -91727 -200406 -32624
9429 329796 -231649 -87802 72576 214675 -160118 -159779 -124612 35702 156772 -116086 102416
9417 -520427 -179119 -181669 -10777 7772 -189954 -198570 53525 -123846 -26540 186992 -3170 155462
9404 198653 182796 -68918 -21083 5396 152413 57481 76915 -90031 5061 244900 87718 55287
9392 55287 213041 4906 -210435 91044 45045 -427955 -155548 -151506 169832 -10077 299275
9380 -198257 147403 89314 -237119 50421 -61679 -197962 -101979 9806 -322122 -130371 138104
9368 -77346 -285263 -240847 -221506 -98697 -121099 -262591 -234542 186556 -62000 79450 -149063
9356 -11955 -143716 -386682 -173210 -4506 -172667 -73554 229780 16830 66688 -296840 -3571
9344 -181039 -232181 14147 -144549 -292193 167101 -404678 28873 -109672 -42399 250313
9333 -217964 -73942 -242905 -482932 -176088 49000 -74753 -133605 154818 25233 -109430 -43938
9321 -30601 305535 -223205 53076 -78080 100067 -115443 215486 -193490 -22104 195373
9310 74016 -139575 58601 -67741 -268458 -155374 -60845 250494 -311775 -285657 -332858 -263718
9299 -263718 -24378 -6312 -116468 115929 -42142 172076 -67362 -345501 -85453 -172750 -132876
9288 -132876 81478 -215022 -279342 -84040 25368 -48040 252351 208070 -46113 -165144 -82859
9277 -82859 147273 -56693 -242705 -257452 -71369 -84249 73355 -252083 -35560 -246767 67177
9265 -108609 327775 -22725 -141769 -5656 80040 -308261 68438 -6914 -162341 148566 -122268
9253 -243371 63908 64901 -138645 -195423 24330 -71232 -294306 -128427 9510 114063 11234
9241 -181200 102170 -158858 -216759 -123995 205455 18283 47103 7566 389882 -139213 228478
9229 -194075 215558 -224503 15137 196625 -43508 -16767 -262190 -131324 -64017 313005
9218 328901 54287 -82759 245541 217688 169877 -163750 -336148 -16943 74239 -304379 -245689
9207 -245689 -167038 -224832 -2379 115901 199511 -241846 -149033 -155970 -374212 148651 -123184
9195 -58823 -374986 -62490 -84138 266202 -340879 -52945 -295080 -252565 -111353 -136311 -12631
9183 90588 299411 9709 64968 64180 96193 -118852 -301077 32547 -384194 26976 -197486
9171 250583 -170128 -51786 -370320 142682 -169582 -187134 28274 73976 -110173 -86798 199112
9159 -291271 -169272 51231 -41096 -114044 28130 -129860 63022 -69320 -221271 210695 99284
9147 -8780 67611 -11445 -186311 -295541 -220213 235141 -217241 -659369 -53179 57556 -62383
9135 304974 225705 -85648 110704 220131 -16545 305059 252814 -148801 69495 -117920 -34917
9123 -164726 -140766 -162618 -32256 -151386 -148895 -196419 -511064 -113693 -210706 -224554 110573
9111 -106558 -50055 -28306 -7132 108557 -153923 112115 -117304 -231178 -201629 -19029 -114695
9100 -114695 -129038 -217139 -308276 -408329 -339585 73901 152891 -80326 -28704 12070 58516
9089 58516 -126403 -192813 136610 -308674 120467 -168271 238600 266660 -250917 -210289
9079 -210289 -294038 106869 91320 -95280 -27043 42386 -83149 -85848 249574 245905 -85490 -115314
9067 -115314 -199457 158136 -234521 -57106 123202 77240 277305 -191552 -103530 -40804 33090
9055 -139833 -51046 290 115030 173937 -216886 -70408 -492336 -108412 -186209 39299 -129655
9043 233118 -222696 -160699 137852 -160005 379117 125670 117965 -94734 -2640 -277281 -41470
9031 -30076 125441 -85099 -49753 -88710 -263414 -110156 -82933 7024 242793 104644 -221971
9019 -59789 238759 120126 -84390 -299508 352256 86109 -540681 -263580 -318157 106151
9008 178834 -42255 184080 180584 -308031 76123 63834 27094 158943 -9397 60339 -333155
8996 -158597 -289895 214958 147962 114015 183692 -418840 -109523 404528 -328991 82868
8985 -397497 64737 -29809 50670 69279 -6061 83174 -534008 -196820 50575 6809 -201334
8973 -321697 72319 -165454 -169230 -211548 166022 -126051 -254426 163000 -9674 71437 140554
8962 140554 -190740 242323 268004 -73942 215078 -121633 34870 -45362 -61887 -2188 73106
8950 -134578 106951 -60557 80096 -83597 -55655 -190335 22601 -43336 -155296 -120171 65077
8938 73293 -256880 -153332 -28195 331531 -91544 15194 62048 -168803 -101235 -98593 111318
8926 162314 92820 -148482 272174 -37040 421015 243729 288435 82932 -194215 59129 47704
8915 47704 -125830 -166788 -149570 42520 62223 -49742 -113307 261745 -214274 158018 -18911
8903 -57966 235031 -25751 15569 -20449 32342 230493 -249135 -314217 -271423 -284982 -10663
8891 -32868 100403 -169654 -30077 -264566 59715 57657 -243789 -194376 -32940 -59934 -132386
8880 -132386 143220 -140810 3700 154224 31853 -63660 -66984 209993 -181459 -36364 155606
8868 -158935 -79782 -110568 -212725 -127315 153627 -59193 -305053 -127340 107020 11409 -232620
8856 -38177 76641 48352 -121051 175354 27678 122929 -70285 -271000 128663 -177403 177476
8844 24483 -64476 74444 -257576 -92858 172372 -46584 -152737 -121820 -196678 65486 -75904
8832 -267529 227875 206626 -13401 52243 -7277 -84728 10136 -254647 -240719 -184966 225887
8820 92779 -73782 -118856 -113953 210442 -204588 -96405 -3751 -82338 -271073 14952 -77090 188787
8807 -97610 -360690 60039 163491 161064 59084 24573 -93660 11047 -128778 -36509 189225
8795 -114091 -58722 104480 -324939 -95494 152690 -29883 -17781 -13965 -146089 -304697 -121148
8783 -59329 69597 -46126 -41783 -35111 79969 -21829 -178574 -258319 -26428 -179460 -83284 -205141
8771 -205141 159144 131580 -124552 -81692 -302813 -120506 105914 3361 -388876 -86022 220350
8759 -4638 271859 134669 -217983 210173 -104311 -245826 9916 151608 -92707 -266499 -111503
8747 -139315 284605 106473 163784 7337 -94177 45812 -156169 -314397 65863 57221 28283
8735 -196521 32073 -437112 22958 211215 -132912 312229 -98779 6876 -466664 80711 -185887
8723 271570 -45005 21766 -175810 -93592 -137482 -43889 -172108 -380943 210822 -108698 -262016
8712 -262016 -21166 -28353 -112282 -176097 -312252 116551 -248397 -2314 -4160 101422 -24151
8700 -173460 -47805 -366625 -117616 -227700 15290 -200544 -80242 -55647 -149831 136495 -82671
8688 27886 -101835 86554 -163116 41237 21874 -604 -2554 -28321 114864 -280440 -72802 -232850
8676 -232850 9983 -104812 -18424 -104873 -9174 141350 -331880 -107891 96258 -131730 165794
8664 130759 80761 130547 -268576 -29997 85658 -106576 69917 -222719 -130259 -65821 120066
8652 -204664 -143392 -148413 -104915 195826 -206276 -346920 258506 87502 270947 -39216 -6054
8640 176392 75147 22113 -23334 63074 -106270 -612174 -122055 119859 -167973 -279915
8630 -279915 160958 -178995 -206675 -106715 -27907 -29648 -40074 15571 189385 -898 -32612 -97598
8618 -97598 -316658 -225644 52034 -199489 -97513 -89351 26346 -254923 33047 112638 87128
8607 87128 55190 -144766 69390 -110114 135482 -98997 173388 70579 -133567 -77832 101958
8595 84426 -177404 -146258 100976 17895 -100353 -119726 -53154 -272399 56342 -122178 -66858
8584 -66858 229913 -119227 55189 546675 149186 72969 282218 84546 -509419 -331084
8574 -331084 86562 -204344 36331 -36709 225576 -95665 -55552 -7890 64663 -298429 -251419
8563 -251419 -294209 -106663 91891 -57972 -23302 81076 119823 -196710 6411 8845 -68391 54765
8550 101365 -120616 -56629 86295 192365 38267 -15241 266852 -148142 -248821 59371 167729
8539 167729 47124 -74695 -39793 -10604 -142190 10018 -253192 -171813 186387 -22396 73356
8527 -232124 -135724 282995 -188832 178119 -158477 -344633 123757 309831 -64120 -236364
8517 -236364 -274194 202668 -227667 91741 -345213 5516 -245515 -78784 -370586 73249 -137995
8505 -229350 112693 -19337 -250488 197517 350005 114493 -165348 -39582 -179978 -190351
8495 -190351 263660 -153579 82391 -41645 -123700 -182645 145419 -10648 -6927 -137379 113459
8483 -24023 93030 114156 -241536 -150783 -98193 115521 -145036 504624 198811 18420 -124606
8471 -104604 71723 -168068 -279412 35206 -58498 -94911 -485934 37909 4994 16340 102785
8460 102785 -266163 -102615 -14042 19469 -65202 -176277 -249930 250656 362424 43626 -63688
8448 201535 -22337 -47397 -45849 -13965 -26135 -234798 -51410 -243544 45994 7611 123443
8437 123443 -151699 30628 -257078 -183423 -252473 121472 -115043 137548 218417 73343 145786
8426 145786 -19859 110825 -121691 159551 -62074 88581 -6495 -216580 116664 -81234 -188562
8415 -188562 -2159 -208316 107486 4524 -325227 157862 104197 124192 126496 -6074 -161223
8404 -161223 -165349 -101045 47113 110591 6754 -266319 48002 -103516 20958 -53360 -101838 11387
8391 -100004 1260 -142411 -18366 -174392 -7954 -12267 -42847 -262618 47508 345079 -93236
8379 -29697 -191589 -433119 -107400 -231267 75706 -96334 -158533 162547 -217819 -355216
8369 -355216 -116057 -35358 93867 -47684 314431 -288736 21272 -7591 -66499 -204773 4065
8357 108431 47446 -6490 71826 68465 -218005 -418939 117026 -110949 -209463 -174325 345814
8345 -8145 -310196 12285 -187058 -241096 -75646 108018 140335 -123757 -107501 96158 -44689
8333 -174643 -120437 -19754 -274249 -107799 126838 -290564 185385 52571 -35332 122768
8322 7408 -10718 -48285 77055 -126769 -138765 157239 -40511 152290 -72818 35002 -49597
8310 -165075 -314467 94642 -243666 136698 163193 -358765 193159 -128416 8649 112596
8300 112596 72959 124977 -170787 206983 134215 -205165 9 61034 94187 -62320 -266403 94764
8287 -48744 -43873 190891 26997 -210088 49461 -382842 202265 33598 121804 -234442 -196396
8276 -196396 197488 -29035 -38768 -35940 -27022 190126 251088 192941 -65546 -160720 88292 95828
8264 95828 54334 164447 -420781 97687 -69302 -103531 -242992 67247 -128891 87287 -11896
8252 -65622 -318481 103633 234688 -44637 50264 19098 -136143 3079 -254163 -82180 -171261
8241 -171261 -147925 -107265 -137040 -264766 -63949 99715 -283031 -61300 10192 -92296 112145
8229 23468 -364470 -16561 -408555 -140998 96767 -85942 139268 215055 75248 -211115 -57762
8217 -414922 -23637 -3234 -22996 -160624 -273832 -263493 -57985 -120754 60764 -90876 92547
8205 -241971 -155522 213986 -38944 176890 329742 -70385 -120010 -178997 -77700 101337 50500
8193 -7210 177741 -198674 -81336 -174157 101994 -167326 -334108 242575 -127043 -85201 93665
8181 -100744 66377 -186729 -281777 -155169 -76918 -66583 83011 -158219 -367563 -81750 277058
8169 -168547 110761 177863 -90368 87449 -124232 -1447 -126413 266903 -425675 345471 -108348
8157 -245688 -353025 -120533 -140103 259378 -93634 -146588 -5549 220643 -104161 178946 282841
8146 282841 -67690 -101600 -114594 193485 95478 -370358 -44033 -3295 -192706 122174 84635
8135 84635 -82755 -78484 29825 173712 82136 -93494 165936 -94306 -279760 34500 89831
8124 89831 -50853 -194860 -66020 327344 -178537 -59166 111353 -46484 -286025 15050 -229120
8112 -214278 257063 -73630 32741 -14188 -207274 -261168 -230289 -369085 383405 -67432 51392
8100 -172825 105212 -218903 -1485 -305704 206691 -230446 -246639 -60084 -22645 -101238 161153
8088 -9764 315101 73037 -55956 75448 212740 -327861 -269152 -295764 -115538 43480 -327524
8076 58623 -146724 -85291 -36729 45222 -52177 -192829 -400404 151644 138390 82057 -67546
8064 -21014 379147 -268040 -398223 -8276 -22856 -221108 -208141 -153899 -89088 -77282 -40540
8053 -40540 -23613 -4016 -98811 240605 57751 -156902 -123963 -260904 84605 -13442 71917
8041 -66188 -94555 15922 -13197 -288539 180227 16026 -184871 -360930 -52432 1080 83213
8030 83213 -108847 238024 41127 214655 129704 -59460 46721 -30579 -29312 -253341 -177288
8019 -177288 34794 13150 -218719 109952 105236 15088 -21156 -11066 25667 -137764 -88522
8008 -88522 19734 -208857 -306455 177578 -367227 87809 -184137 46482 66183 151161 -263949
7996 -39535 -39324 234639 -320563 474899 -364000 -115522 -28744 -141265 -111893 172787 -186609
7984 -66178 106792 80688 115139 -11953 184667 231117 -115533 -94850 11338 -201970 -6350
7972 191356 96120 63229 -53062 -280844 -167690 -132390 -364654 -100906 51714 -158139 143642
7960 -43246 170956 -245405 -225557 -473150 167571 79625 -270251 -259139 -301878 146242 6007
7948 81542 69979 317645 190863 -552025 155848 82561 -4128 338557 -220335 255240 177866
7937 177866 81136 -135592 -181985 -309354 -163929 28288 67244 60474 -34201 9677 142195
7926 142195 151467 -90919 160352 129273 -51103 251154 25176 43476 -89718 -26221 -338484
7915 -338484 89836 -180330 282527 -152456 13714 83228 -109956 -125813 -45796 -6805 56839
7903 2445 61706 310643 -58635 114419 86652 96548 299932 -4253 -97354 41862 -98496 71934
7890 -370757 92754 -209492 -279728 4586 330932 -198688 -248328 -223081 68201 171446 -290035
7878 -145981 141961 -160390 139452 15235 -67403 -30845 42570 -295173 58567 -262938 -80803
7866 -320765 47802 82043 -86647 -245288 -252364 -180111 171093 -299442 -205243 -207263 314483
7854 -314926 483203 -4427 -274236 -55357 31327 18315 113195 230640 -174947 172416 -209903
7842 -148293 -163861 -25768 -181536 155319 -150011 30677 -28047 -109847 -301433 222681 -97221
7830 -194128 276755 161088 -198721 -209253 30288 -223543 -24536 74525 -360613 51863 199709
7819 199709 -292814 -202553 -312379 18401 41601 -40616 18705 87649 -136576 -81763 -41204
7808 -41204 -258288 98341 -389018 127218 68753 92329 -118773 18360 105313 -141554 -232662
7797 -232662 -104218 -142159 -214186 50491 -64878 -232549 107632 -63079 138700 117173 -245503
7785 -269741 53549 58435 93039 -367122 -301320 -50780 -491853 -145317 53529 96210 -185054
7773 -89631 -69336 -172226 134430 -273487 -343419 47569 -189346 -348457 -38513 -96598 -119303
7762 -119303 -93900 -463414 -78817 142643 -10644 39063 -112827 -57283 44541 -75923 278051
7750 182976 -298781 -241231 -74223 -301739 -69328 120434 -21180 -179572 -68216 -98448 -12018
7738 12384 -164449 105301 244513 -16896 -143676 114860 -296491 -250904 133296 74039
7728 74039 69377 -94690 183920 -36755 -99353 -32458 -227208 -125358 148002 200477 -21417
7716 -96675 -8370 20515 -288 -167783 3416 26057 -17957 221777 52981 -100357 88160 138396
7704 138396 -102474 19551 101341 9434 -92793 -131019 -195750 329460 7722 76601 -230089
7692 -14964 -213550 -195998 180295 299560 -139988 -154296 -331198 -82212 27917 -126170 504209
7680 -2536 -157102 -183193 136517 32718 285405 95097 187527 -196504 -126317 -52838 114776
7668 87719 189468 -69060 219414 357505 195218 74580 -77082 -79163 -231883 -181446 259663
7656 -123147 69273 -207806 47998 -74533 89224 -261895 27135 -19529 -125777 -264016 -187235
7645 -187235 -50593 -70512 -125731 -123667 -91150 191815 -257011 -53701 166240 -267002 111950
7633 247158 -249960 -46590 4370 -178188 -86352 46203 745 -334707 -144402 238568 -109513
7621 190788 164155 286236 191712 -93862 136071 307098 -552910 -231258 148449 54217
7610 -169736 253017 -348560 -252783 -25157 72199 -2217 -22473 11777 68261 136061 -111249
7598 -82277 -132560 188226 -40316 254732 -2451 -172893 -88539 349366 42200 -25122 59879
7586 -58544 -68129 -168662 78166 34992 -28843 -186547 -207601 -100748 12613 -183880 414751
7574 -49649 23563 46939 135337 19307 41773 -69818 -27259 -153717 68217 11169 -113299
7562 -3070 -338496 -169680 -240348 245335 14444 -24287 33903 -42458 75208 -130693 -280775
7551 -280775 -172360 -198398 -244940 78488 -144755 -204216 -384575 221142 43130 112404 147439
7540 147439 -130798 -215741 -157286 166073 -54084 -63227 -216340 -113796 -521385 -193707 -220645
7529 -220645 -62707 17824 -136186 -167609 97586 -151551 -114576 -114180 -1729 92606 209042 209655
7517 209655 -356342 -141824 26281 -122417 112883 -27903 7998 -210615 251669 205815 -190673
7505 -136389 343985 -113398 -66283 -130041 138979 -230835 -391974 -370119 237694 -21483
7494 -270268 -194831 -6739 -197568 64002 -37567 -69265 -53734 -36910 -138666 27033 5677 22072
7482 22072 -139938 -166389 335529 -66939 -112757 355797 31074 -144173 -280562 -32771 -50723
7471 -50723 -243950 152954 176415 359655 -217611 -124518 65628 173045 -184218 -134083 -251245
7460 -251245 19058 -16913 93542 -90924 62046 -91525 -14016 129593 -81402 -209936 300121
7448 -204871 132771 -16311 79745 15746 -29274 123889 -96321 37176 -228596 126971 -193608
7436 265203 191422 -83345 204460 -299819 -42878 46664 188066 -140253 -47616 154004 16811
7424 142349 -39749 140709 -171371 -135193 -19404 213436 -7144 -363566 66249 -264904 55557
7412 36742 -468743 -111291 -57940 367182 -380021 -258482 -289735 -321250 54553 -48762 103325
7400 30422 20626 -54739 31665 -60113 312320 288764 -163265 277108 31326 -272654 -430549
7389 -430549 1335 363374 -38702 97750 207366 -9401 55837 139307 169883 119132 32848 265974
7377 265974 -193548 118896 17141 -381444 343678 114079 -190931 -202006 -185694 139892
7366 22133 212080 25596 -115301 85646 -86022 294720 256243 -132732 212155 111162 -69009
7354 -34545 -71730 -83481 -189607 -254018 -1039 -3468 -11548 114333 161104 -124807 -3488 37662
7341 -110520 -47773 -301660 -83314 -246717 -170314 -56334 8398 189814 148699 210050 -31085
7329 159393 -190529 -86100 709 277088 -16919 -123547 -59576 -130329 244100 5739 166145
7318 166145 170699 102652 -193317 57406 -262007 -152337 197047 -33057 -223243 -98000 -171631
7307 -171631 222994 -382645 -35830 -103966 -207676 -253977 -62739 3293 -176296 242391 72756
7295 164948 13424 13579 -185200 -37271 27106 -36005 273362 -223600 -113229 94830 69936
7284 69936 -198831 -213807 -59089 -117822 -290897 141852 194584 7586 65886 -307590 188960
7272 -507507 -29287 -98113 216091 -125879 230024 -135568 -102721 -225457 -89670 13213 -301397
7260 95333 30534 -111650 295748 33511 52760 49808 192985 90852 -119224 -164286 -291555
7249 -291555 -261473 -172477 -2317 55042 -139100 -219354 -4598 -116071 -273789 -186806 -49281
7237 153745 110262 -147488 40052 149546 87588 41871 -29723 395791 27900 -203232 193811
7225 -51409 381520 10195 -62782 44147 324907 -219714 146334 -57827 42679 -120418 76153
7213 -344150 -52412 102780 -284152 -144170 134061 119170 3008 -135794 -158651 185633 -80789
7201 -62810 133542 120262 165451 -134286 361471 -27613 131217 14516 -109723 6595 135881
7190 135881 -83603 16535 159098 18251 170333 -7337 110553 -199293 -4616 -19459 -85150
7179 -85150 -132007 190505 -199471 -36976 -115899 -60005 74775 -164002 -47547 -50091 162275
7167 -181743 21128 -15858 -9518 -295797 -12875 14665 205126 -213126 118478 1009 -550094
7155 -59074 -154552 -123510 -54898 159055 -26194 -74135 -218372 349125 80453 -310192 -32803
7143 -143825 139877 62468 172847 -88132 -288776 -17485 64501 -40697 -47444 -37250 85098
7131 43790 235152 -74916 -204980 -172861 34268 128848 69085 143674 141564 -123415 -166413
7120 -166413 134790 -208542 -2664 112562 -74667 74910 -141311 -256861 -13692 167095 -223323
7108 -57519 -425627 41228 -83741 -273210 330700 107654 -222658 5733 75750 149790 -293771
7096 -107052 374413 -5920 -431985 251947 134974 169211 -19281 355244 156914 -23382 -100601
7085 -100601 -158129 -112975 -180484 173088 -88805 158179 287955 2655 -275107 84833 -239756
7073 196261 -38260 -92422 -139945 177008 -54056 215485 -135109 170894 110385 3343 150109
7062 150109 120968 -295552 -430074 -13606 84667 -151267 97428 7101 107067 46321 -144780
7050 -253300 -254305 -147392 62316 92639 30398 11433 145944 -38519 32608 -193474 -153813
7039 -153813 -198732 226323 -115095 60256 505001 125667 132593 129158 -47799 -185184 -447134
7028 -447134 -146807 -48946 -60832 -150063 4481 -83098 52741 -159614 -208956 20016 10735 -169772
7015 67547 -284941 184515 -149432 107159 72026 -126652 204119 -217209 -62640 381598
7004 -163218 -206841 179261 -221763 -174067 -320462 189464 -37017 -209282 250866 96317
6993 125744 158356 176669 -30630 -268479 -166266 -131152 191076 -245756 -328680 250557 -137636
6981 -52251 -196990 -55608 -105088 103549 -178330 56590 9087 -146818 187311 -31280 30045
6969 202193 33144 -15495 -237134 50843 -203802 -144886 -283605 48885 -21875 -155684 111407
6957 88857 -135537 21243 -61312 61885 90231 -53013 -465739 -243075 38418 -162421 69294
6945 83635 -30186 -137469 -238645 180074 -45953 218018 79194 145744 -182171 296724 137525
6933 50585 -146132 -253772 68683 -141913 -69608 -185866 105030 -174179 -144086 -46483 -56103
6922 -56103 -28551 -31493 252755 63115 41455 -43618 -110634 -116236 251353 -37780 -63382 -60042
6910 -60042 182042 -146599 286445 -136093 -79318 -84879 96608 -138821 241095 -38672 -39764
6899 -39764 24208 -167918 -21797 -269876 11419 171700 -169768 -157767 3669 130043 -190040
6887 2034 60126 95907 -122523 -109798 -215649 -177268 171333 -45948 -186274 -10728 96061
6875 -67750 188937 -293463 -94268 115796 -82431 102935 -88645 118872 118130 89753 -318935
6863 292007 8711 8863 -80659 -159413 89406 171478 -85133 -162944 38857 107526 7955 -220170
6850 -190049 -79502 -196938 116169 -39513 307017 -174692 -48349 -234788 -422341 -4583 -94659
6839 -94659 15575 123404 -27508 43586 -174189 1639 -149788 333042 -259515 -94633 -41792
6827 -121146 -260222 -42574 158806 174388 139090 152164 190184 -77863 82854 -220897 -134969
6816 -134969 -255250 -193881 -153763 -35033 -16579 80839 -72429 -161898 174680 -134774 114403
6804 53214 -113949 -290208 120652 48346 17485 -180398 -60126 324288 -102484 -82003 20157
6792 95026 -166274 -247623 17033 54708 201122 -99854 -24914 167164 -224663 13989 -207114
6780 9049 -16979 463676 -22344 -60290 -107432 195467 78399 -58831 -475138 -83631 163643
6768 -217591 72621 -91713 317757 -176509 -197562 -222323 -204066 -327922 51522 16362 49682
6757 49682 38749 154395 75079 -148398 -81250 -25623 -167782 138738 191581 39137 99238
6746 99238 -110279 -354726 -391084 230099 142994 -116228 -428121 108072 -72801 257358
6735 -118905 47573 -14916 371187 267694 -473510 397599 144555 -218842 -179401 245211
6724 -16334 -349773 47345 -139636 -149726 65131 -203296 237073 -21234 -246198 -27238 -255612
6713 -255612 146418 55323 -4917 18523 -245307 -65303 97138 152523 -65845 25923 47806
6702 47806 -163299 -262173 -353580 -216032 183650 171707 487 -9321 441927 -152197 255023
6690 -87916 220940 -98896 6227 149235 111801 224603 2573 -51992 -88528 122076 -1524 -187982
6678 -187982 -25118 60275 140974 37673 -143272 99562 -84303 -123724 -113384 126376 -36304
6666 60661 23566 -96963 -32327 -72965 11601 -236513 227683 137305 20209 142651 84609
6655 84609 133241 -38163 -30121 -134500 223528 -147830 -44059 -308841 260697 -47961 -80230
6644 -80230 22362 -163294 -308606 83082 206699 205779 -105821 13595 59564 154500 -46097
6632 69743 -58555 -59024 -135352 -134647 -123665 -218950 25664 35706 -121142 -14209 -42018 138381
6619 -116182 195162 17694 127031 -95913 127434 180944 -66286 -255597 90701 -412201 -105292
6607 -93077 -16455 124864 20424 482174 147841 -94063 35024 -356940 112166 -45660 -146986
6596 -146986 -47125 162759 135686 295987 84862 -130819 142307 -131006 -110542 -116970 10975
6584 19245 265753 -286210 -307605 -84677 -153647 -260559 -240807 240040 -85772 -178689 -556919
6573 -556919 96317 30327 -231081 -115243 -83251 180167 -180019 154020 -254392 306108
6562 -79754 -289737 104688 -287832 -33590 -56074 -246185 30439 -60744 -180117 90004 163922
6551 163922 54649 242044 19117 -374 213739 -64188 -61872 -154099 115102 159758 -28316 -213067
6539 -213067 74182 280494 112085 87505 27504 -235928 -169102 204423 125402 -105063 -486073
6528 -486073 -13934 -189822 -54451 101981 197220 26459 -230007 -27009 37690 11894 -235024
6516 -145778 -62370 -11722 260036 -194588 -61577 989 80547 -205800 66746 -213156 224278
6504 -43698 -339910 -320401 -227209 -194834 103579 117566 -75521 122645 187466 156576 121527
6493 121527 -60734 -126624 -204303 -69131 -70935 249016 248567 -17532 -39887 -22042 49671 -30446
6480 -221622 -84603 -315208 34091 52309 29116 100275 -65409 -215672 -274268 84885 -33933
6468 384548 51625 -31173 39768 286174 61108 71133 16213 -36937 44296 -159555 -382474
6457 -382474 -40741 27307 -68083 48372 -61656 -128426 -150415 125041 -16524 73857 58789
6446 58789 135822 -23397 78769 -125071 -19937 81079 100350 55695 141721 -107176 124488
6434 -260955 -189518 -372531 193957 330461 -46115 15919 -28473 -84227 259898 -93052 -33688
6422 497886 219877 -109986 16523 198124 25717 44416 -193498 83243 -6997 -127279 29724
6410 -310897 94278 64591 360036 -79688 -59972 -110383 -130595 297812 214784 340091 94560
6398 87782 -137958 -49054 -259118 123275 -2062 -13309 -98128 319568 -133167 -100692 -3692
6386 -105365 -111139 -65181 -82141 156749 38001 -78519 -246943 -32969 -262215 75410 42935
6375 42935 51725 -279058 -244338 -100327 260400 44795 -170682 25114 -151969 -155158 99645
6363 -67108 47211 130368 5894 -152806 -27030 77309 96144 -120925 36874 -48505 -109071 -156417
6351 -156417 79055 -104530 26970 6792 -239785 -112072 95870 123437 -5673 -216848 134926
6339 5890 3563 46665 196154 -125689 -34907 -262255 -316437 205447 286780 88460 170312
6328 170312 -135482 -243051 -275094 89443 -28523 -123608 -163568 -107894 -245428 -30148 -212561
6317 -212561 145779 -153971 185331 -12845 -52879 47420 -407920 -42525 42141 -19949 158130
6305 -197336 83402 363357 -76994 171877 -61925 213539 -33649 583994 -207213 -17056 10927
6293 71633 248365 -24597 139027 83696 153407 112254 -29477 304630 106742 68145 -353910
6281 72499 -46810 -69275 -64446 -204311 -55341 -11925 -43225 -193661 -205451 -119675 -50237 -175136
6269 -175136 -20707 -151551 114103 -124463 45251 9905 316480 6843 -11162 303258 268538
6258 268538 232684 5781 70055 31167 30762 -167811 195166 -74964 11921 -72449 201487 144937
6246 144937 -61874 -168026 -321613 4094 18294 -83546 47735 187378 36244 -23388 -39682
6235 -39682 -68922 -317406 38684 -53079 84928 54854 63426 -321448 98416 -45802 -154424
6224 -154424 -204445 216768 -120611 -196352 -251263 -80775 39926 -60530 -114440 371144 253357
6213 253357 166383 -113165 -375132 -123038 217663 -3185 -135907 -154979 124229 -40709 97066
6201 -139320 285255 -205584 -98826 104806 -238045 76310 -117607 -148995 -183035 -194167 42049
6189 211060 145404 287189 250001 -259153 -39037 -32271 220285 -47890 -211367 66181 -44976
6177 -191621 -233573 -3228 -279497 1660 178024 -200025 -143027 127354 193838 -258106 -261728
6166 -261728 -185285 54990 37778 -49664 -34192 -224180 -276398 -106160 -98945 202215 -80440
6154 167335 -249205 -102649 204388 92580 133692 -99995 114548 -244520 275615 199030
6144 199030 168925 -84379 -61701 -240025 -171949 122332 109090 -27483 -417920 35506 33332
6133 33332 301426 237992 -20565 288748 15567 -141067 68660 64311 263580 275770 39555
6121 -180702 -116206 -22821 48632 -261671 3051 -3312 -91765 47364 -277763 312845 49652
6109 96941 -139740 131119 -610791 243067 -232658 297777 -81358 -193657 271900 -319331
6098 1405 133118 50598 -57353 -278020 -299418 -126216 -113730 12884 -176964 213486 -7493
6086 105858 -62512 -144457 209784 322373 417900 -18623 99833 -250656 63046 211215 27101
6074 128452 51886 419469 119794 -18848 -111320 -203188 266104 -90208 -307150 -228973 -12218
6062 -66451 71486 -13897 52283 77408 83598 -20206 33101 13722 183722 -155939 -78649 171732
6049 47861 -5355 191315 117601 198152 -213661 110058 -42022 191608 -407837 -232551 47018
6037 -21580 -251878 257177 121454 -46100 -298655 -138530 189002 -49328 152096 -107009
6026 -6048 -50161 103700 20305 -21619 -80364 125119 163566 396436 -24367 -97217 120788
6014 363542 -1918 -36678 45287 -32369 187106 -163409 -73329 -25709 10714 -81864 166555
6002 -34571 -108391 -3311 -432105 120509 -78200 94872 23790 107694 306726 -113020 -73041
5991 -73041 -103968 -144071 -29432 -205341 -77435 162511 77680 -86607 -260881 12677 -3386
5979 170636 -38901 -90385 142666 -232586 89504 55792 33292 110267 -52156 233564 -59825
5967 -20697 163027 -171886 238945 180513 87987 -90985 214477 -167740 1911 -299885 123843
5955 58 325656 -1121 259969 -31196 -93365 -3252 -81880 32940 243485 -96209 -132806 -393989
5943 -393989 114262 241345 99729 50710 207739 -61297 100146 -262006 -111714 11577
5932 -123855 13839 -138676 124954 125573 88314 155832 -213228 -263724 163205 -82955 46743
5920 18935 -54045 96578 22446 -124139 -85915 115169 -145952 208167 284849 -60903 -287079
5909 -287079 -19922 23380 -298692 -354365 -226745 -153865 -111210 -156920 -180122 -249598 198721
5897 -303167 310881 31319 -298665 -57603 -175899 -138423 -123591 279749 -151170 291855
5886 -147781 143218 -102901 -247731 -12686 158390 130299 61489 -141318 71154 96167 -2755
5874 97619 -80425 4570 273486 -24516 -266770 93953 557 -49572 131353 -52015 44695 37223
5862 37223 -496160 35375 201124 -40770 36950 -43123 -223524 -98818 -211147 -1760 176749
5850 -44459 42118 9059 -132055 58785 103392 -14026 -240487 -220921 55305 -159800 140881
5838 92820 124143 -179233 37931 -251112 -250699 -300859 -279176 4041 -173655 -33804 -206147 -64027
5825 -296979 -308622 -56017 180186 -121050 196380 -269126 190155 175600 -21394 -2175 52930
5813 -147943 19785 -129211 129811 197926 123643 -8587 -190920 141727 211657 91743 302815
5802 302815 180597 -3761 145232 316097 -177049 61763 -136068 141598 -37223 -418179
5792 -418179 159005 34616 120377 122282 -169152 125334 36987 -2451 -20524 171573 68584
5780 -62613 187770 199344 196130 -121846 -70138 -290699 41019 40706 26923 -2162 -394502 -166439
5767 -190314 -38656 60444 -143923 -324878 129897 65739 -18902 -252533 -335141 37730 -13629
5755 96735 40897 -266014 163710 157987 325263 145960 -16214 -12784 -20476 -189328 183148
5743 -105419 -208356 -89128 28277 131073 62525 279670 -27208 -185258 2482 282919 -68459
5731 266353 9781 -122399 -35925 -53131 213253 -400017 -117359 -7293 251212 -108593 -35076
5719 -110219 281783 51620 304237 -160389 -107895 -301973 -119963 -47837 -125476 -34883 67597
5707 -317960 -130881 -75456 -1849 39370 186908 107412 110055 172786 -129218 -24996 -144991
5696 -144991 338784 -262454 -317619 63056 -232869 25446 9923 14701 45512 -139763 -224974
5685 -224974 60694 -330021 -10858 -99221 -102914 -82479 -223957 196841 127244 -78815 -262845
5674 -262845 114468 2268 -10640 -92343 14464 -185740 340426 -48046 -159785 140338 3865
5662 -92947 -81656 -136558 179197 -237214 -67303 -123224 -43602 -96538 294144 91455 -213372
5650 140850 -299122 -151191 -86644 65494 -127761 110251 124793 -65630 -144364 -55995 -252529
5639 -252529 -151665 -93425 -94272 -152966 -247057 -89240 -149464 169651 3697 -225792 420648
5627 52443 139345 80685 -52951 -41995 -13867 -205104 -220494 209717 155886 -131367 -127721
5616 -127721 -19922 -222941 -55921 131701 40507 193788 -14352 -35748 -154415 79716 -97180
5604 -96640 45005 11370 116699 -100579 257951 125291 142402 -33019 -73625 -202334 99554
5592 92393 -192132 175004 -375745 -304209 125549 197777 -298505 -93635 95248 141275 62374
5580 147394 105524 25775 -138109 -23339 -243425 198446 -142585 11471 -144781 220719
5569 201487 133692 37076 118254 126295 107931 -159738 129834 -297801 190189 216930 -359995
5557 -375776 125139 -25143 -265721 -186205 -99058 56834 91506 65093 -7227 42563 301590
5546 301590 -225644 28547 -123515 -97548 -95548 133644 174546 -136682 -64914 34120 -161590
5534 108068 -6422 7342 -34232 -200986 -4611 -146637 -139661 -99703 -198 21439 25424 -41314 257735
5520 132308 -136862 348127 -19104 -330457 -183140 -103521 65550 -44747 -321381 225157
5509 -65665 -52462 -85527 -85977 -35598 272778 -58513 -129826 252535 165296 -155918 24579 -95150
5496 232007 124110 139089 13016 -196038 -228948 76870 -69082 -99764 101954 45989 -131183
5484 -48450 -18927 67168 -198668 -96500 -97714 -148854 32883 -79538 82066 -191880 -41909 155467
5471 -76331 -308889 124418 -67358 31509 307812 24533 131095 -104027 -269151 -57537 -89566
5460 -89566 67495 -96234 -52952 219616 246998 -211681 -275916 25294 -22097 14395 62541
5449 62541 -150 -224230 -84802 105412 -113624 177558 -37755 -148868 -2932 -57901 -15992
5437 200878 108552 127545 -211494 -116076 -126302 -65365 -52631 230445 -25490 186064 -212250
5425 65675 254256 15326 -64306 192034 86319 -60986 -70519 194458 98822 -176609 253919
5413 327998 427049 185566 114456 -176018 -151509 -20746 55872 -36538 5612 370349 140289
5401 -51135 -157703 51987 109926 -316824 -11598 271042 137873 69384 -155537 -287077 -64902
5389 -110633 155754 283187 -176658 72834 -71211 110116 101389 121008 -8623 258839 -130958
5377 273189 -510655 -110743 34450 -180537 -11541 176055 -39343 -305799 -472649 -64387
5366 106147 11981 45294 167957 139421 226145 -101762 -386713 -228259 273276 -9496 -85782
5355 -85782 10504 -270216 -32299 125649 29248 -389475 -429925 -5151 126978 -58662 -101257
5344 -101257 169012 204177 -134141 -3514 -160600 -155552 15039 -28538 -75817 -29684 -253125
5333 -253125 -141130 101685 77171 168305 162758 163989 135866 175817 283784 -47904 302960
5321 170637 59246 -161639 44412 37590 203678 -243590 -193232 -103106 -186671 114072 -129840
5309 -151080 -239841 141016 82848 175868 -11686 -90887 -392 -225669 -188151 260549 -183136
5297 168425 162528 -36304 57684 -177475 -193997 88442 -172536 -117278 -122882 126920 96158
5286 96158 444527 118795 -206987 123744 -118485 -212088 173383 -212329 178129 -50994
5275 -280264 -215500 151517 -104840 -78926 165671 -227470 131383 -247801 -6448 -505031
5265 -505031 -58349 -22135 26585 -308957 -124865 -186655 -212790 -10829 -20238 233897 -240166
5253 27260 -46759 -132504 223991 -254712 -206162 -262263 221306 -331559 -118012 43460 -194089
5241 -168795 -217099 -47028 -4699 -1630 -72032 183247 227408 -278802 -114095 26198 -359708
5229 280640 -58271 -44213 -144882 145348 195077 272962 -43520 35208 -35848 -125404 215418
5217 -146364 30776 -5398 109688 216291 121758 61431 -93676 -115038 288883 30097 -205101
5205 -80501 278584 -48498 -53418 70288 98168 92546 6713 104886 -108895 -15563 -153133 416469
5192 69303 278607 -236245 -195349 107278 99276 129295 598160 -82293 -228747 59556 24208
5180 93057 268791 -221739 -120117 -18002 -25162 495558 101230 98139 342333 104948 -82678
5168 -163944 120446 203441 -98345 23549 -1987 362009 259197 150987 1209 43168 156048
5157 156048 117487 218356 -69700 137275 -37673 209134 278354 -192923 -325346 -300804 -120814
5145 -37844 -47248 270673 -375128 33965 94769 310926 129336 -266483 110477 97340 14023
5133 -163710 -240666 -96993 418654 -40048 -464654 -66685 121316 -51822 -93626 -53339 -262013
5122 -262013 -207840 -399135 48240 -119070 132643 -15225 245788 -41096 -288599 9008 44200
5111 44200 -43544 114039 -115355 -108822 171343 -5478 84054 72982 48706 126485 -38522 206203
5098 119520 -189831 -9327 6706 56360 101275 -148001 -20674 -622907 -49616 198926 -203569
5086 227887 -86900 70840 -331867 28993 -114643 -182176 -50863 205786 106416 -180757 220042
5074 310090 144172 78398 40505 2565 -164551 70987 -204025 -38447 34450 -40121 122215
5062 201550 -232469 14219 -72695 172872 -147855 -163545 -188191 263642 -238454 -217743 86696
5050 271368 24537 314959 154002 66443 332032 -59541 16981 274778 102516 81444 82350
5039 82350 -32735 281509 72007 -117739 60485 -112503 82886 -371510 -8530 -229846 184924
5027 -153922 112784 85989 -169080 5645 -5299 229266 -103711 116985 -81050 59770 -11885
5015 190018 -26820 -296294 149558 242319 -276029 -4401 142129 -134637 233842 106983
5004 -96575 -189233 57625 -468 -38144 3809 233856 13877 -237335 -121967 201218 22391 26768
4992 26768 138711 -133451 137365 -43510 112688 -88065 -63552 123893 161269 50080 1231
4980 -220367 -157454 -57968 -57191 215306 115712 16744 194896 -166822 48478 128055 -65277
4968 81790 88352 133624 -96342 -42883 -112642 97371 308798 74712 -6872 6618 59099 -607602
4955 80613 -1881 -81099 12607 114204 122071 -30327 -193242 205942 37034 169174 191229
4944 191229 -120962 137732 7007 210662 -93156 -66812 -101717 47053 120768 113761 292258
4933 292258 -178677 -69004 -33327 -211554 40482 -76999 12958 12421 -16011 101685 -45812
4921 -67040 -312462 34033 -49781 -97398 108312 -157780 222368 -215721 165394 -140248
4910 -134768 -126728 -115805 97835 -132621 100826 -278822 248039 -48235 -104088 337334 93256
4898 5146 -199510 -225 313762 292614 75746 -124877 -45944 15861 22979 -138842 101952 -71051
4885 209510 69970 -16773 109270 27715 -92388 -312730 344 139473 -53562 -99523 172418
4873 -38442 -60825 -125097 -128480 -29862 88714 -108868 -14230 228591 177959 -136417 -254727
4862 -254727 386717 155911 85861 334273 216353 204040 -63247 -262665 -113568 -160331
4852 -160331 -254662 36496 -157944 -298392 -111466 -38633 -52905 54661 -289560 -195134 484584
4840 -116435 124747 -239444 36617 301295 -205130 -25543 -133374 181743 -199649 51897
4829 141320 -154185 -143221 -127842 -58266 184925 20731 28361 271950 -81732 -78178 -647 62106
4816 -273652 52008 -37354 112409 47586 -26027 179271 133845 202775 141302 -266509 -272175
4805 -272175 -13221 221395 62103 -2444 158847 212596 -70531 69710 273042 143009 158184
4794 158184 31559 216511 153352 -107631 -130322 67811 67855 -134552 -157808 -18047 -48023 141146
4781 -188610 463241 -92737 -144458 196872 95174 466928 -47848 61350 -59595 -122738 -106511
4770 -106511 153061 15925 228143 -335829 97063 188824 129393 -40627 238805 222573 -48236
4758 10237 -88246 158184 51884 -154638 37166 58314 77783 -127349 -58975 -17097 -164398
4747 -164398 -99988 34200 62529 -86699 -121549 -105121 -32080 -133370 -396784 -74510 284842
4735 127840 -391176 -114646 -162139 -79311 12174 -244309 29465 176545 -411910 2499 -7691
4723 118704 -40685 219604 271836 -22297 88823 -80145 -140906 211900 -152344 146464 184621
4712 184621 -85933 -85748 -502675 -17572 -61767 118231 -123194 -296330 115635 -322770 57637
4700 389125 296355 36200 238284 232005 42893 -126350 -216236 -157495 466660 91397 198570
4689 198570 -19069 118709 123655 -5290 -103612 -180526 262481 178450 -155976 -57929 110231
4677 -66109 93606 259334 -60936 -114160 94830 189688 177899 119263 -296612 -331356 -12400
4665 117890 70096 258810 -241640 -40783 -14955 -73009 -52404 -332602 -106617 -173648 -2840
4653 23325 -302752 -242745 64290 -437710 377721 231758 32876 -141681 -10671 -433261 89914
4641 431789 -43981 76956 34595 -143512 317252 24039 312199 -94394 74430 20399 -151631
4629 -45678 -341684 220003 -169795 -73261 -69469 -180752 96030 -1230 14703 29372 248343
4618 248343 -142209 178714 -160140 231331 189318 -602 -3666 230518 -284219 252846 119160
4606 246601 165141 -63629 290274 234317 109303 -131217 -167956 -78804 91535 -276374 224286
4594 22843 -285188 -123942 -121554 -37761 18307 -44461 -259166 -30671 -86158 47679 131430
4583 131430 -84782 -126447 -336333 -138680 115095 168369 186812 160940 -111615 93529 110351
4572 110351 -71183 49780 182371 -213220 -186830 -69451 -155286 256028 -5624 351145 31596
4560 -140250 192114 -146964 -85343 -152506 115034 103153 81042 -279449 74076 92849 10285
4548 242620 163 9623 239755 283930 25533 99044 -42147 -53414 371356 145434 473608
4537 473608 45001 -51902 96363 16168 62743 -29892 97823 -84032 -48072 -254777 28855
4525 -125443 8909 -115446 105333 -64380 44569 112879 50475 102829 183165 -217652 145605
4513 32378 24346 238475 277390 -87043 87797 442530 -207219 -406344 54930 -174367 282905
4501 152410 -64967 159115 114869 331647 -74750 40554 235989 251545 -143094 200412 60167
4489 -388520 40188 -106771 -17892 79519 10243 -132078 -112649 227808 150835 -207557 168295
4477 -60378 -258019 -186045 -154139 -82803 215124 -182950 39414 164840 14165 -62133 -206725
$$ [...]
##END NTUPLES=NMR SPECTRUM
##END=
