##TITLE=AC1745_SEN00018_9280926_VILM59K7Pi
##JCAMPDX= 6.0         $$ Bruker NMR JCAMP-DX V2.0
##DATA TYPE= NMR SPECTRUM
##DATA CLASS= NTUPLES
##ORIGIN= BRUKER
##OWNER= Administrator
$$ 1.72 TOPSPIN		Version 2.1
$$ 2015-07-18 01:57:37.166 -0700  Administrator@X
$$ Compression mode = diff/dup
##.OBSERVE FREQUENCY= 400.02188249412
##.OBSERVE NUCLEUS= ^1H
##.ACQUISITION MODE= SIMULTANEOUS (DQD)
##.ACQUISITION SCHEME= undefined
##.AVERAGES= 64
##.DIGITISER RES= 22
##SPECTROMETER/DATA SYSTEM= spect
##.PULSE SEQUENCE= noesygpps1d.comp
##.SOLVENT NAME= COFFEE_meoh
##.SHIFT REFERENCE= INTERNAL, COFFEE_meoh, 1, 14.96097
##AUDIT TRAIL= $$ (NUMBER, WHEN, WHO, WHERE, PROCESS, VERSION, WHAT)
$$ ##TITLE= Audit trail, TOPSPIN		Version 2.1
$$ ##JCAMPDX= 5.01
$$ ##ORIGIN= Bruker BioSpin GmbH
$$ ##OWNER= Administrator
$$ $$ E:\/data/COFFEE/nmr/AC1745_SEN00018_9280926_VILM59K7Pi/12/pdata/1/auditp.txt
$$ ##AUDIT TRAIL=  $$ (NUMBER, WHEN, WHO, WHERE, PROCESS, VERSION, WHAT)
(   1,<2015-07-18 01:57:31.635 -0700>,<Administrator>,<X>,<go>,<TOPSPIN 2.1>,
      <created by zg
	started at 2015-07-18 01:46:01.541 -0700,
	POWCHK enabled, PULCHK disabled,
       configuration hash MD5:
       21 0F 79 D6 B3 7B B4 F6 88 20 88 DB 03 48 BD 9F
       data hash MD5: 64K
       A5 00 A0 FB EC AD 6D 3C 2D AD 6F ED 73 D4 A3 02>)
(   2,<2015-07-18 01:57:35.057 -0700>,<Administrator>,<X>,<proc1d>,<TOPSPIN 2.1>,
      <Start of raw data processing
       efp LB = 0.3 FT_mod = 6 PKNL = 1 PHC0 = 0 PHC1 = 0 SI = 128K 
       data hash MD5: 128K
       C1 C7 E0 44 19 E6 07 88 F0 8A CD 36 11 03 80 EA>)
(   3,<2015-07-18 01:57:35.947 -0700>,<Administrator>,<X>,<proc1d>,<TOPSPIN 2.1>,
      <pk PHC0 = -86.50635 PHC1 = 0 
       data hash MD5: 128K
       98 9B 75 C5 34 D8 B8 74 50 60 4A 38 B6 EF 2B 41>)
(   4,<2015-07-18 01:57:36.338 -0700>,<Administrator>,<X>,<proc1d>,<TOPSPIN 2.1>,
      <abs ABSG = 1 
       data hash MD5: 128K
       D0 BE BA C1 31 98 39 E4 3A 54 DB 7A 05 6D 28 02>)
(   5,<2015-07-18 01:57:36.447 -0700>,<Administrator>,<X>,<proc1d>,<TOPSPIN 2.1>,
      <abs ABSG = 2 
       data hash MD5: 128K
       26 42 B2 6D 27 86 6D 7C 5B 8F DD 0A F3 71 C8 1E>)
(   6,<2015-07-18 01:57:36.525 -0700>,<Administrator>,<X>,<proc1d>,<TOPSPIN 2.1>,
      <abs ABSG = 3 
       data hash MD5: 128K
       B8 E5 79 BF 92 50 B3 E2 04 9A C7 A2 E8 4A 1D 3E>)
(   7,<2015-07-18 01:57:36.619 -0700>,<Administrator>,<X>,<proc1d>,<TOPSPIN 2.1>,
      <abs ABSG = 4 
       data hash MD5: 128K
       FE 47 08 31 7B FC 53 3C 6E 13 76 52 2F 44 01 96>)
(   8,<2015-07-18 01:57:36.713 -0700>,<Administrator>,<X>,<proc1d>,<TOPSPIN 2.1>,
      <abs ABSG = 5 
       data hash MD5: 128K
       7C A2 B1 49 6D 1A EA 86 90 AD 9F E3 4E 23 74 0A>)
$$ ##END=
$$ 
$$ $$ hash MD5
$$ $$ 8D A0 89 FE BD 34 E6 6D 51 B6 81 E6 EA B9 C2 E4
##$RELAX= 
##$RELAX= 
##$RELAX= 
##$RELAX= 
##$RELAX= 
##$RELAX= 
##$RELAX= 
##$RELAX= 
$$ Bruker specific parameters
$$ --------------------------
##$DU= <E:\>
##$EXPNO= 12
$$ [...]
##$TP07= 0
##$TPNAME0= <>
##$TPNAME1= <>
##$TPNAME2= <>
##$TPNAME3= <>
##$TPNAME4= <>
##$TPNAME5= <>
##$TPNAME6= <>
##$TPNAME7= <>
##$TPOAL= (0..7)
0.5 0.5 0.5 0.5 0.5 0.5 0.5 0.5
##$TPOFFS= (0..7)
0 0 0 0 0 0 0 0
##$TUNHIN= 0
##$TUNHOUT= 0
##$TUNXOUT= 0
##$USERA1= <user>
##$USERA2= <user>
##$USERA3= <user>
##$USERA4= <user>
##$USERA5= <user>
##$V9= 5
##$VALIST= <valist>
##$VCLIST= <CCCCCCCCCCCCCCC>
##$VD= 0
##$VDLIST= <DDDDDDDDDDDDDDD>
##$VPLIST= <PPPPPPPPPPPPPPP>
##$VTLIST= <TTTTTTTTTTTTTTT>
##$WBST= 2048
##$WBSW= 25
##$XGAIN= (0..3)
0 0 0 0
##$XL= 0
##$YL= 0
##$YMAX_a= 5904207
##$YMIN_a= -11240331
##$ZGOPTNS= <>
##$ZL1= 120
##$ZL2= 120
##$ZL3= 120
##$ZL4= 120
##$ABSF1= 14.96097
##$ABSF2= -5.597212
##$ABSG= 5
##$ABSL= 3
##$ALPHA= 0
##$AQORDER= 0
##$ASSFAC= 0
##$ASSFACI= 0
##$ASSFACX= 0
##$ASSWID= 0
##$AUNMP= <proc_prof1d_extract.lims>
##$AXLEFT= 0
##$AXNAME= <>
##$AXNUC= <1H>
##$AXRIGHT= 0
##$AXTYPE= 0
##$AXUNIT= <>
##$AZFE= 0.1
##$AZFW= 0.1
##$BCFW= 0
##$BC_mod= 0
##$BYTORDP= 0
##$COROFFS= 0
##$CY= 15
##$DATMOD= 1
##$DC= 0
##$DFILT= <>
##$DTYPP= 0
##$F1P= 0
##$F2P= 0
##$FCOR= 0.5
##$FTSIZE= 131072
##$FT_mod= 6
##$GAMMA= 0
##$GB= 0
##$INTBC= 1
##$INTSCL= 1
##$ISEN= 128
##$LB= 0.3
##$LEV0= 0
##$LPBIN= 0
##$MAXI= 10000
##$MC2= 0
##$MEAN= 0
##$ME_mod= 0
##$MI= 0
##$NCOEF= 0
##$NC_proc= -2
##$NLEV= 6
##$NOISF1= 0
##$NOISF2= 0
##$NSP= 0
##$NTH_PI= 0
##$NZP= 0
##$OFFSET= 14.96097
##$PC= 1
##$PHC0= -86.50635
##$PHC1= 0
##$PH_mod= 1
##$PKNL= yes
##$PPARMOD= 0
##$PPDIAG= 0
##$PPIPTYP= 0
##$PPMPNUM= 2147483647
##$PPRESOL= 1
##$PSCAL= 4
##$PSIGN= 0
##$PYNMP= <proc.py>
##$REVERSE= no
##$SF= 400.020009648498
##$SI= 131072
##$SIGF1= 0
##$SIGF2= 0
##$SINO= 400
##$SIOLD= 131072
##$SPECTYP= <>
##$SREGLST= <1H.CDCl3>
##$SSB= 0
##$STSI= 131072
##$STSR= 0
##$SW_p= 8223.68421052631
##$SYMM= 0
##$S_DEV= 0
##$TDeff= 65536
##$TDoff= 0
##$TI= <>
##$TILT= no
##$TM1= 0
##$TM2= 0
##$TOPLEV= 0
##$USERP1= <user>
##$USERP2= <user>
##$USERP3= <user>
##$USERP4= <user>
##$USERP5= <user>
##$WDW= 1
##$XDIM= 131072
##$YMAX_p= 389030549
##$YMIN_p= -11373
##$CURPLOT= <Network HP LaserJet P1505>
##$CURPRIN= <$Network HP LaserJet P1505>
##$DFORMAT= <normdp>
##$LAYOUT= <+/1D_H.xwp>
##$LFORMAT= <normlp>
##$PFORMAT= <normpl>
##$SURQMSG= 1
$$ End of Bruker specific parameters
$$ ---------------------------------
##NTUPLES= NMR SPECTRUM
##VAR_NAME=  FREQUENCY,     SPECTRUM/REAL,   SPECTRUM/IMAG
##SYMBOL=    X,             R,               I
##VAR_TYPE=  INDEPENDENT,   DEPENDENT,       DEPENDENT
##VAR_FORM=  AFFN,          ASDF,            ASDF
##VAR_DIM=   131072,        131072,          131072
##UNITS=     HZ,            ARBITRARY UNITS, ARBITRARY UNITS
##FACTOR=    0.0627417313425164, 1,          1
##FIRST=     8223.62146879497, 2243,         -51921
##LAST=      0,             4411,            -51841
##MIN=       0,             -11373,          0
##MAX=       8223.62146879497, 389030549,    0
$$ Real data points
##PAGE= N=1
##DATA TABLE= (X++(R..R)), XYDATA
$$ [...]
63958F56526L0897L5074L9377M3964M9256N5599O3013P1440Q1299R3347J07739
63947A327531J23519J39413J54919J70314J85800K01062K15457K28188K38353
63938B984556K45215K48505K48096K43441K33670K18203J97088J70753J39903
63929D929430J05638O9328L2161n094m1963p8056j12860j45433j74419j98587
63919D380145k17381k30775k38936k42283k41617k37626k30410k19859k06515
63910B314743j91567j76153j60969j46389j32394j18533j04544r1043p9037o8838
63900A045276n9969n2059m5120l9047l3639k9165k6114k4223k2651k1226k0512
63889F71551k0345j9519j7613j5941j5643j5723j4305j1285q313o417m994l300
$$ plain form
63958 656526 687423 722497 761874 805838 855094 910693 973706 1045146 1126445 1219792 1327531
63947 1327531 1451050 1590463 1745382 1915696 2101496 2302558 2518015 2746203 2984556
63938 2984556 3229771 3478276 3726372 3969813 4203483 4421686 4618774 4789527 4929430
63929 4929430 5035068 5104396 5136557 5131463 5089500 5011444 4898584 4753151 4578732 4380145
63919 4380145 4162764 3931989 3693053 3450770 3209153 2971527 2741117 2521258 2314743
63910 2314743 2123176 1947023 1786054 1639665 1507271 1388738 1284194 1193151 1114114 1045276
63900 1045276 985307 933248 888128 849081 815442 786277 760163 735940 713289 692063 671551
63889 671551 651206 631687 614074 598133 582490 566767 552462 541177 532864 526447 521453 518153
63877E18153j564j43J354L430N808P852R452J0955J2503J3874J4868J5600J6399
63864F28541J7570J8978J9907J9709J8666J7746J7270J6362J4137J1010Q212O208
63852H14316M252J573j621m647p311r967j2772j5408j7535j9152k0384k1229k1749
63839F68366k2317k3264k4335k4852k4522k3821k3344k3044k2334k0879j8988
63828D16666j7224j5819j4579j3240j1852j0735j0066r607r006q242p554o920
63816B81822n991m647l296k364j845j600j742k315k807k599j845j414j863k854
63802B44640l621l696l082k142j436j311j519j579j560k033l057l714l168j812
63788B10910q22p00q69p04l72l53o04o44k82J20J68j34n52r60j284j303q85l71
$$ plain form
63877 518153 516589 516446 517800 521230 527038 534890 544342 555297 567800 581674 596542 612142 628541
63864 628541 646111 665089 684996 704705 723371 741117 758387 774749 788886 799896 808108 814316
63852 814316 818568 820141 818520 813873 806562 796595 783823 768415 750880 731728 711344 690115 668366
63839 668366 646049 622785 598450 573598 549076 525255 501911 478867 456533 435654 416666
63828 416666 399442 383623 369044 355804 343952 333217 323151 313544 304538 296296 288742 281822
63816 281822 275831 271184 267888 265524 263679 262079 260337 258022 255215 252616 250771 249357 247494 244640
63802 244640 241019 237323 234241 232099 230663 229352 227833 226254 224694 222661 219604 215890 212722 210910
63788 210910 210088 209388 208519 207815 207443 207090 206486 205842 205560 205680 205848 205714 205162 204202 202918 201615 200730 200359
63770B00359l24p50r56m93J68K78n1j6O21J130R09L46J96M59N46K39p4r9j2rq
63749B02459P0J06J38N40J505K517K791K169J301Q46R22J376K181L212L821L291
63733B29245J822O49P88J869K675K672K517K962L799M259M098L780L741L894L898
63718B72668L571K924K114J406R81O76R9q69j891k560k832k941l062l142k949
63703B64193k272j186j59L34L38L14N17P70R82J409K138K707K726K536K723L164
63687B81234L187K574J836J366R70L70k71o83q48p73l74J61L57J90L36J176J980
63670B92788J830J063R10J685K275J701M32m06n39n90r76j484j960k692l852m945
63654B85240n262m748m073l833l906l745l105k212j347n39J81N84N47L86N75J160
$$ plain form
63770 200359 200035 199285 198329 197836 198004 198282 198231 198215 198836 199966 200875 201221 201417 201876 202422 202661 202587 202488 202476 202467 202459
63749 202459 202529 202635 202773 203313 204818 207335 210126 212295 213596 214442 215364 216740 218921 222133 225954 229245
63733 229245 231067 231716 232504 234373 237048 239720 242237 245199 248998 253257 257355 261135 264876 268770 272668
63718 272668 276239 279163 281277 282683 283664 284340 284439 283570 281679 279119 276287 273346 270284 267142 264193
63703 264193 261921 260735 260576 260910 261248 261562 262079 262849 263831 265240 267378 270085 272811 275347 278070 281234
63687 281234 284421 286995 288831 290197 291167 291537 291266 290583 289735 288962 288588 288749 289106 289296 289632 290808 292788
63670 292788 294618 295681 296591 298276 300551 302252 302684 302278 301739 301149 300173 298689 296729 294037 290185 285240
63654 285240 279978 275230 271157 267324 263418 259673 256568 254356 253009 252470 252651 253235 253782 254168 254743 255903
63638B55903J748K065K246K557L075L715M360M875N209N577O291P310Q102Q177
63624C21210P678P310P740R069J0830J2419J3643J4776J6070J7309J8191J8987
63612D75232K0373K2481K4550K5756K6102K6119K5958K5124K3029J9488J4730
63601G28942R228L632j294m789o395o384n918o290p838r721j0992j1579j2086
63588F58516j3036j4543j6407j8137j9130j9283j9120j8988j8435j6893j4615
63577D69929j2339j0305q285o405n024l837k111M6J538J845J867K693M244N750
63563D39606O946Q043Q988R524R787J0141J0636J1233J2326J4349J7014J9616
63551E78209K2074K4887K8054L0767L2310L2609L1654K9021K4373J8005J0672
$$ plain form
63638 255903 257651 259716 261962 264519 267594 271309 275669 280544 285753 291330 297621 304931 313033 321210
63624 321210 328888 336198 343938 353007 363837 376256 389899 404675 420745 438054 456245 475232
63612 475232 495605 518086 542636 568392 594494 620613 646571 671695 694724 714212 728942
63601 728942 738170 741802 740508 735719 729324 722940 717022 710732 702894 693173 682181 670602 658516
63588 658516 645480 630937 614530 596393 577263 557980 538860 519872 501437 484544 469929
63577 469929 457590 447285 439000 432595 427571 423734 421623 421669 423207 425052 426919 429612 433856 439606
63563 439606 446552 454595 463583 473107 482894 493035 503671 514904 527230 541579 558593 578209
63551 578209 600283 625170 653224 683991 716301 748910 780564 809585 833958 851963 862635
63540H62635L279l041p200r042r607j0048j0536j0542r847q839q123q345j0100
63527G60644j3384j7225k0440k2728k4609k6341k7563k7974k7674k6677k4774
63516E01255k2237k0015j8647j7539j5811j3551j1571j0212r136q140p406o865
63504C40125o061m951m101l826l620k983k238j998k230k399k261j872j117L4R67
63489C01469R69L69K58R12J385J071P28J299K436L141L305L661M439N081N227
63474C35750M991M209K450Q2j641k081k027k464l175l322k868k525k551k509k116
63459C20203j646j334j053o86l01J85J067K346L583M434N043N728O571P466Q315
63444C59921R081R806J0656J1758J3020J4400J6220J8739K1485K3498K4289K3949
$$ plain form
63540 862635 865914 862873 855673 846631 837024 826976 816440 805898 796051 787212 779089 770744 760644
63527 760644 747260 730035 709595 686867 662258 635917 608354 580380 552706 526029 501255
63516 501255 479018 459003 440356 422817 407006 393455 381884 371672 362536 354396 346990 340125
63504 340125 334064 329113 325012 321186 317566 314583 312345 310347 308117 305718 303457 301585 300468 300502 301469
63489 301469 302438 302807 303065 303977 305362 306433 307161 308460 310896 314037 317342 321003 325442 330523 335750
63474 335750 340741 344950 347400 347482 345841 343760 341733 339269 336094 332772 329904 327379 324828 322319 320203
63459 320203 318557 317223 316170 315484 315183 315368 316435 318781 322364 326798 331841 337569 344140 351606 359921
63444 359921 369002 378808 389464 401222 414242 428642 444862 463601 485086 508584 532873 556822
63432E56822K2377J9230J4990J1192Q920P730O724O162P024R368J2191J4856J7653
63419G15239K0812K3899K6456K8452K9621K9077K6166K1357J5752J0064M519n90
63407I50824m813p911r919j0892j1012j0812j1038j2143j4123j6729j9634k2483
63395G99315k5001k7058k8532k9232k9056k8169k6824k5150k3204k1128j9028
63384E16933j6909j4810j2824j0842q555n969l629j976o65J009L145N181O703
63371D56792P900R079J0238J1273J2327J3635J5286J7202J9201K1026K2527K3909
63359F40395K5553K7498K9369L0818L1654L1435K9457K5491K0245J4757R495M382
63347I20549n33m843q113j0076j0649j0177r532r556j0343j1519j3189j5953j9823
$$ plain form
63432 556822 579199 598429 613419 624611 633531 641261 647985 654147 661171 670539 682730 697586 715239
63419 715239 736051 759950 786406 814858 844479 873556 899722 921079 936831 946895 951414 950824
63407 950824 946011 938100 928181 917289 906277 895465 884427 872284 858161 841432 821798 799315
63395 799315 774314 747256 718724 689492 660436 632267 605443 580293 557089 535961 516933
63384 516933 500024 485214 472390 461548 452993 447024 443395 441419 440754 441763 444908 450089 456792
63371 456792 464692 473771 484009 495282 507609 521244 536530 553732 572933 593959 616486 640395
63359 640395 665948 693446 722815 753633 785287 816722 846179 871670 891915 906672 916167 920549
63347 920549 920016 915173 907060 896984 886335 876158 866626 857070 846727 835208 822019 806066 786243
63334G86243k3685k6312k7491k7680k6965k5021k2061j9032j6624j4547j2087
63323E44738r047n861l136j502j626l827p545j1517j4664j6601j7392j7121j5926
63310D18973j4184j2400j0919r820q951q017o761n294m076l381k924k279j573
63297C28394j427k065k927l369l392l397l392l003k246j793k170l012l463l137
63283B89601k406j808j539j474j402j150p13l28k40l34k54Q6L92M89O15R72J339
63266B81846J451J473J729K142K387K502K813L315L576L369K962K697K696L064
63252C18022L957N185O118O362O227O276O662P186P730Q334R028R937J1343J3239
63238D25606J5053J6204J6843J7613J8744J9891K0846K1896K3252K4542K5137
$$ plain form
63334 786243 762558 736246 708755 681075 654110 629089 607028 587996 571372 556825 544738
63323 544738 535691 529830 526694 525192 523566 519739 512194 500677 486013 469412 452020 434899 418973
63310 418973 404789 392389 381470 371650 362699 354682 347921 342627 338551 335170 332246 329967 328394
63297 328394 326967 324902 321975 318606 315214 311817 308425 305422 303176 301383 299213 296201 292738 289601
63283 289601 287195 285387 283848 282374 280972 279822 279109 278781 278541 278207 277953 278039 278431 278920 279535 280507 281846
63266 281846 283297 284770 286499 288641 291028 293530 296343 299658 303234 306603 309565 312262 314958 318022
63252 318022 321979 327164 333282 339644 345871 352147 358809 365995 373725 382059 391087 401024 412367 425606
63238 425606 440659 456863 473706 491319 510063 529954 550800 572696 595948 620490 645627
63227F45627K4815K3901K2958K2441K2472K2744K2821K2647K2640K3109K3776
63216H99951K4093K3775K2840K1191J8563J4906J0504N630K98n473j1308j6662
63204A008308k1213k4917k7740k9551l0324l0190k9246k7537k5277k2819k0242
63193G19252j7248j3773j0411p780n635l109J35L541O529R242J2113J5086J7581
63180G25523J9044J9311J8703J7959J7811J8302J8739J8479J7536J6258J4821
63169I22486J3387J2260J1386R988P315L557m79m462q665j3161j7485k1221k4357
63156H90549k6950k8905l0209l0919l0852k9798k8106k6546k5317k3716k1115
63145E88116j7914j5181j3553j2766j2041j0774q985p210n903m915l879k880k323
$$ plain form
63227 645627 670442 694343 717301 739742 762214 784958 807779 830426 853066 876175 899951
63216 899951 924044 947819 970659 991850 1010413 1025319 1035823 1041453 1041751 1036278 1024970 1008308
63204 1008308 987095 962178 934438 904887 874563 844373 815127 787590 762313 739494 719252
63193 719252 702004 688231 677820 670040 664405 661296 661431 664972 671501 680743 692856 707942 725523
63180 725523 744567 763878 782581 800540 818351 836653 855392 873871 891407 907665 922486
63169 922486 935873 948133 959519 969507 976822 980379 979900 975438 966773 953612 936127 914906 890549
63156 890549 863599 834694 804485 773566 742714 712916 684810 658264 632947 609231 588116
63145 588116 570202 555021 541468 528702 516661 505887 496902 489692 483789 478874 474995 472115 469792
63132D69792k105j567m16Q46J679K173K570K696K354J941K073K808L627M109M210
63117D96790M055L734L289K671J903J262J066J155J088R55J312K031K046Q95k66
63102E23986j66O89P92o0n24J27R91J044N45K67J98j12n25m06M54J604K439K582
63084E33925K052J430J508K369L144L165K960L517M846O018O492O677P066P579
63070E92748Q032Q663R788J1229J2450J3179J3674J4506J6144J8559K1204K3591
63058G63767K5904K8719L2074L5287L7916M0392M3318M6513M9314N1556N3646
63047A208406N5732N7419N8436N8960N9103N8606N7437N6260N5763N5759N5404
63036A837285N4263N2733N1427N0438M9259M7046M2999L6751K8605J9199Q900
$$ plain form
63132 469792 467687 466120 465704 466550 468229 470402 472972 475668 478022 479963 482036 484844 488471 492580 496790
63117 496790 500845 504579 507868 510539 512442 513704 514770 515925 517013 517968 519280 521311 523357 524252 523986
63102 523986 523820 524509 525301 525241 524717 524844 525835 526879 527424 527691 527889 527777 527252 526846 527300 528904 531343 533925
63084 533925 535977 537407 538915 541284 544428 547593 550553 554070 558916 564934 571426 578103 585169 592748
63070 592748 600780 609443 619231 630460 642910 656089 669763 684269 700413 718972 740176 763767
63058 763767 789671 818390 850464 885751 923667 964059 1007377 1053890 1103204 1154760 1208406
63047 1208406 1264138 1321557 1379993 1438953 1498056 1556662 1614099 1670359 1726122 1781881 1837285
63036 1837285 1891548 1944281 1995708 2046146 2095405 2142451 2185450 2222201 2250806 2270005 2278905
63025B278905k229j3910k5388l6015m5780n5013o3538p0365p4363p5158p3376
63014A743770o9995o5590o0230n4022m7363m0557l3481k5970j8364j1263m862
63003A312073J114O778J1898J6374K0395K3920K6545K8221K9643L1409L3119L3880
62991A575369L3514L2718L2078L1462L0458K8824K6357K2754J7973J2407O402
62980A850316j93p725j6154k5024l3849m2209m9534n5206n9016o1296o2470o2608
62968A375032o1533n9238n6036n2348m8569m5055m2006l9306l6659l3959l1404
62957H68919k9152k7089k5104k3363k2053k0976j9740j8295j6989j6074j5484
62946F34600j5110j4952j4847j4371j3296j1956j0898j0267r749r026q102p144
$$ plain form
63025 2278905 2276676 2262766 2237378 2201363 2155583 2100570 2037032 1966667 1892304 1817146 1743770
63014 1743770 1673775 1608185 1547955 1493933 1446570 1406013 1372532 1346562 1328198 1316935 1312073
63003 1312073 1313187 1319965 1331863 1348237 1368632 1392552 1419097 1447318 1476961 1508370 1541489 1575369
62991 1575369 1608883 1641601 1673679 1705141 1735599 1764423 1790780 1813534 1831507 1843914 1850316
62980 1850316 1850123 1842398 1826244 1801220 1767371 1725162 1675628 1620422 1561406 1500110 1437640 1375032
62968 1375032 1313499 1254261 1198225 1145877 1097308 1052253 1010247 970941 934282 900323 868919
62957 868919 839767 812678 787574 764211 742158 721182 701442 683147 666158 650084 634600
62946 634600 619490 604538 589691 575320 562024 550068 539170 528903 519154 510128 502026 494882
62934D94882o251n433m818m630m838m880m084k551j256r55j224j101m83k12p78
62919D51388j665k236k527k725k556j814j090j186k003k612k453j920j699j942
62905D22960k266k312k164k242k683k982k552j675j287j645j874j310o08o93j199
62890C95468r54J65J011P76j11q45j129r93n03jQ1r2J13O96Q83M06O6M49R34O79
62870C97099qj87K66O00L37l07r83j466j418o36M93J331J735J894J664Q35MJ83
62852D01436J369K345K273J696J455J385Q21j56q38r78r04o99q9P23R38J76r13
62835D10040j449j287q40l25K77Q14J066J140J312J428J071L47Q4R07K459L770
62819D20814M233L950L375K927K785K804K696K471K555L267M348N278N894O383
$$ plain form
62934 494882 488631 483198 478380 473750 468912 464032 459948 457397 456141 455186 453962 452861 452378 452166 451388
62919 451388 449723 447487 444960 442235 439679 437865 436775 435589 433586 430974 428521 426601 424902 422960
62905 422960 420694 418382 416218 413976 411293 408311 405759 404084 402797 401152 399278 397968 397360 396667 395468
62890 395468 394514 394679 395690 396466 396355 395510 394381 393388 392885 392884 392965 392873 392986 393682 394565 394971 395037 395486 396420 397099
62870 397099 397091 396904 397170 397770 398107 397800 396817 395351 393933 393297 393790 395121 396856 398750 400414 401249 401253 401436
62852 401436 402805 405150 407423 409119 410574 411959 412780 412624 411786 410808 409904 409205 409116 409839 410777 410953 410040
62835 410040 408591 407304 406464 406139 406416 407230 408296 409436 410748 412176 413247 413594 413678 414585 417044 420814
62819 420814 425047 428997 432372 435299 438084 440888 443584 446055 448610 451877 456225 461503 467397 473780
62805D73780O761O851O830P309Q653J0431J1864J2636J3110J3766J4664J5506
62793F02161J6197J7184J9130K2215K5936K9664L3229L6799M0497M4438M8995
62782I36445N4510O0722O6806P2118P6659Q0739Q4419Q7372Q9109Q9187Q7375
62771A785461Q3648P7952P0057N9807M7452L3479J8291K338j3526k8292m1490
62760B095177n3212o3496p2038p8630q3326q6065q6664q5395q3121q0474p7304
62749A245452p3282o8648o3891n9084n4058m9062m4636m0877l7293l3473k9557
62738F91591k5963k2907k0301j7921j5645j3613j2060j0902r693q128o475n200
62726E22783m344l571k735k036j589j136k51J314L469N865Q114J0051J1684J2940
$$ plain form
62805 473780 480541 487392 494222 501531 510184 520615 532479 545115 558225 571991 586655 602161
62793 602161 618358 635542 654672 676887 702823 732487 765716 802515 843012 887450 936445
62782 936445 990955 1051677 1118483 1190601 1267260 1347999 1432418 1519790 1608899 1698086 1785461
62771 1785461 1869109 1947061 2017118 2076925 2124377 2157856 2176147 2178485 2164959 2136667 2095177
62760 2095177 2041965 1978469 1906431 1827801 1744475 1658410 1571746 1486351 1403230 1322756 1245452
62749 1245452 1172170 1103522 1039631 980547 926489 877427 832791 791914 754621 721148 691591
62738 691591 665628 642721 622420 604499 588854 575241 563181 552279 542586 534458 527983 522783
62726 522783 518439 514868 512133 510097 508508 507372 507121 508435 511904 517769 525883 535934 547618 560558
62712E60558J3736J4463J5982J8757K2157K5180K7694L0465L3958L7737M1248
62701H41935M4615M8311N2402N6537O0456O4098O7236O9444P0423P0146O8594
62690A514197O5560O0834N4372M6159L6106K4237J1014k729j6167k8757m0165
62679A724661n0161n8632o5488p0470p3216p3739p2657p0748o8301o5138o1187
62668I94924n6775n2358m8196m4321m0634l7011l3467l0170k7132k4145k1243
62657E79472j8932j7432j5964j3625j0909r462r917j0896j0702r320p951p177
62645D37185o580n871n301m864m040k628j205l38J05N21Q17N30m12j491k096k074
62629D02258j766j553j491j318q33j38N24J023J344J521J728K201K934L671M308
$$ plain form
62712 560558 574294 588757 604739 623496 645653 670833 698527 728992 762950 800687 841935
62701 841935 886550 934861 987263 1043800 1104256 1168354 1235590 1305034 1375457 1445603 1514197
62690 1514197 1579757 1640591 1694963 1741122 1777228 1801465 1812479 1809750 1793583 1764826 1724661
62679 1724661 1674500 1615868 1550380 1479910 1406694 1332955 1260298 1189550 1121249 1056111 994924
62668 994924 938149 885791 837595 793274 752640 715629 682162 651992 624860 600715 579472
62657 579472 560540 543108 527144 513519 502610 493148 483231 472335 461633 452313 444362 437185
62645 437185 430605 424734 419433 414569 410529 407901 406696 406358 406463 406984 407801 408331 407919 406428 404332 402258
62629 402258 400492 398939 397448 396130 395297 395159 395683 396706 398050 399571 401299 403500 406434 410105 414413
62614D14413N051N937O556O593O351O334O606P041P923R628J1864J3905J5553
62601E23755J7316J9543K2037K4579K7252L0013L2569L4930L7562M0591M3266
62590H53413M4559M4118M2329L9752L6615L2602K6988J9389J0549J965n487j2155
62578A134637j8694k5040l0629l5124l8453m0532m1448m1585m1144l9816l7439
62567G44733l4630l2191l0130k7888k5378k3046k1008j8865j6482j4314j2662
62556D88139j1270r916q850q264p779o906n627m103k264k90Q45K20j591k736k068
62541D17540l40R26J206J020P37J86n42q04j86R13J891K728L749M979O143P232
62525D47378Q509J0023J1509J2837J4273J6174J8639K1540K4691K7956L1311L4703
$$ plain form
62614 414413 419464 425401 431957 438550 444901 451235 457841 464882 472805 482433 494297 508202 523755
62601 523755 541071 560614 582651 607230 634482 664495 697064 731994 769556 810147 853413
62590 853413 897972 942090 984419 1024171 1060786 1093388 1120376 1139765 1150314 1152279 1146792 1134637
62578 1134637 1115943 1090903 1060274 1025150 986697 946165 904717 863132 821988 782172 744733
62567 744733 710103 677912 647782 619894 594516 571470 550462 531597 515115 500801 488139
62556 488139 476869 466953 458103 449839 442060 435154 429527 425424 423160 422870 423715 423935 422344 419608 417540
62541 417540 417200 418126 419332 420352 421089 421275 420733 419929 419743 420656 422547 425275 429024 434003 440146 447378
62525 447378 455887 465910 477419 490256 504529 520703 539342 560882 585573 613529 644840 679543
62513F79543L7737L9716M0371M0467M1100M2302M2763M1247L7870L3740K9600
62502A106456K5277K0193J4059P104O8n986j0240j2642j3749j3965j3051j0573
62490A092951o650k064K425O733J1287J6245K1130K5318K8699L1573L3891L4817
62478A296355L3248K8736K1930J4151O514o46p700j5161k3297l2007m0719m8346
62466A233058n3778n6733n7894n7957n6873n4372n0861m7215m3846m0529l7063
62455F75937l3427k9443k5028k0839j7807j5798j3523j0213o645l967k263r64
62443D96020k4K91M18J236K789M148M677M686M562M001K529L93j588k874l629
62428E17635m394n525o888q017q561q586q368q056p711p490p540p629p288o374
$$ plain form
62513 679543 717280 756996 797367 837834 878934 921236 963999 1005246 1043116 1076856 1106456
62502 1106456 1131733 1151926 1165985 1173089 1173157 1167171 1156931 1144289 1130540 1116575 1103524 1092951
62490 1092951 1086301 1084237 1086662 1093395 1104682 1120927 1142057 1167375 1196074 1227647 1261538 1296355
62478 1296355 1329603 1358339 1380269 1394420 1400934 1400288 1392588 1377427 1354130 1322123 1281404 1233058
62466 1233058 1179280 1122547 1064653 1006696 949823 895451 844590 797375 753529 713000 675937
62455 675937 642510 613067 588039 567200 549393 533595 520072 509859 503214 499247 496984 496020
62443 496020 495996 496287 496705 497941 500730 504878 509555 514241 518803 522804 525333 525726 524138 521264 517635
62428 517635 513241 507716 500828 492811 484250 475664 467296 459240 451529 444039 436499 428870 421582 415208
62414D15208n275m524m364m659n018m989m363l408k625k271k161j955j439o42
62400C67515J42N62O24P27J087J344J129Q03J069J952K790L235L590L991M027
62385C94587L523L088L318L900M132M005M147M890N942O902P574P804P534P094
62371D68440P045P671Q874J0570J2778J5295J7694J9745K1614K3635K6140K9376
62359F68877L3179L6824L9702M2136M4866M7690M9269M8577M5865M1840L6575
62348A135400K9949K2533J5275Q475J822m726j0768j6099k0862k5067k8532l1345
62336A076055l3756l5585l6332l5879l4573l2538k9628k6200k3169k1036j9451
62325G47908j8034j6917j6225j5715j5357j5531j6155j6391j5860j5363j5617
$$ plain form
62414 415208 409933 405409 401045 396386 391368 386379 382016 378608 375983 373712 371551 369596 368157 367515
62400 367515 367657 368219 368843 369570 370657 372001 373130 373933 375002 376954 379744 382979 386569 390560 394587
62385 394587 398110 401198 404516 408416 412548 416553 420700 425590 431532 438434 446008 453812 461346 468440
62371 468440 475485 483156 492030 502600 515378 530673 548367 568112 589726 613361 639501 668877
62359 668877 702056 738880 778582 820718 865584 913274 962543 1011120 1056985 1098825 1135400
62348 1135400 1165349 1187882 1203157 1211632 1213454 1208728 1197960 1181861 1160999 1135932 1107400 1076055
62336 1076055 1042299 1006714 970382 934503 899930 867392 837764 811564 788395 767359 747908
62325 747908 729874 712957 696732 681017 665660 650129 633974 617583 601723 586360 570743
62314E70743j5907j5061j3227j1600j0653r789q655p647p008o437n761n150m499
62301D49349l520k539k310k736k790k047j292j101q30K45J587K184K044K018K426
62286D40688K734K512J990J650J777K355L081L590L886M353N137N824O066O085
62272D91728O314O898P926R577J1632J3401J4741J6568J9650K3412K6792K9854
62260F78493L3481L7704M1497M4358M7031N0266N3643N6038N6701N5437N2165
62249A206814M6793L9486L0845K1793J3155N112k777j0810j8626k5802l2539l9097
62237A234347m4884m8934n1247n2754n3814n3654n1575m8013m3901l9666l5320
62226G10585l1120k7521k4705k2440k0399j8387j6510j5085j4124j2987j1013
$$ plain form
62314 570743 554836 539775 526548 514948 504295 494506 485851 478204 471196 464759 458998 453848 449349
62301 449349 445829 443290 440980 438244 435454 433407 432115 431014 430184 430429 432016 434200 436244 438262 440688
62286 440688 443422 445934 447924 449574 451351 453706 456787 460377 464263 468616 473753 479577 485643 491728
62272 491728 498042 504940 512866 522443 534075 547476 562217 578785 598435 621847 648639 678493
62260 678493 711974 749678 791175 835533 882564 932830 986473 1042511 1099212 1154649 1206814
62249 1206814 1253607 1293093 1323938 1345731 1358886 1363998 1361221 1350411 1331785 1305983 1273444 1234347
62237 1234347 1189463 1140529 1089282 1036528 982714 929060 877485 829472 785571 745905 710585
62226 710585 679465 651944 627239 604799 584400 566013 549503 534418 520294 507307 496294
62215D96294q544o719o140o224o036n189l769k080p84n62j154j376n46O68J404
62200D49243J944L125M820N992O123N767N689O073O670P167P269O942O678P131
62186E30633Q309R453R863R562R084Q872Q984R128Q844P857O412N272N222O509
62172F44004Q621J0709J2403J4254J7137K1123K5272K8622L1062L2987L4478L5190
62160I15862L4773L2976K9610K4781J9120J3362P781K357k722p175j1068j4740
62148A044917j8291k1575k4558k7198k9016k9371k8285k6555k4825k2968k0483
62137G71792j7209j3450r757o777m920l957l176k119r65p6N10R22J181J398J983
62122G15380L215M747N944O686P464Q539R358R029P239M535J754n28k065k789
$$ plain form
62215 496294 487750 481031 474891 468667 462631 457442 453673 451593 450809 450247 449093 447717 447171 447839 449243
62200 449243 451187 454312 459132 465124 471247 477014 482703 488776 495446 502613 509882 516824 523502 530633
62186 530633 538942 548395 558258 567820 576904 585776 594760 603888 612732 620589 627001 632273 637495 644004
62172 644004 652625 663334 675737 689991 707128 728251 753523 782145 813207 846194 880672 915862
62160 915862 950635 983611 1013221 1038002 1057122 1070484 1078265 1080622 1077900 1070725 1059657 1044917
62148 1044917 1026626 1005051 980493 953295 924279 894908 866623 840068 815243 792275 771792
62137 771792 754583 741133 731376 724599 719679 715722 712546 710427 709462 709386 709896 710818 711999 713397 715380
62122 715380 718595 723342 729286 735972 743436 751975 761333 770362 777601 782136 783890 783362 781297 778508
62108G78508k852k695k822l444m504n917p534q850r221q559p504o630n743m258
62094F97975k076K84K266L610M311M578M825N309N825O141O494P234Q067Q325
62080G63168Q065Q287R751J2074J4247J5675J6458J7018J7782J8900J9938K0165
62068I41528J9469J8764J9082K0429K1893K2716K2876K2662K2035K0550J7801
62057A169805J3890R480N298J488k320o259r863j2712j5162j8081k1849k5905
62045A087810k9252l1242l1971l2051l2044l2020l1696l0829k9339k7179k4566
62034G55621k2304k1186k0822j9749j7163j4024j1839j0825j0102r279q881r194
62022E80253r612r471q869q353q219q361q491q286p629o759n945n065l948k943
$$ plain form
62108 778508 775656 772961 770139 766695 762191 756274 748740 739890 730669 722110 714606 707976 702233 697975
62094 697975 695899 696183 698449 702059 706370 710948 715773 721082 726907 733048 739542 746776 754843 763168
62080 763168 771233 779520 789271 801345 815592 831267 847725 864743 882525 901425 921363 941528
62068 941528 960997 979761 998843 1019272 1041165 1063881 1086757 1109419 1131454 1152004 1169805
62057 1169805 1183695 1193175 1198473 1199961 1197641 1191382 1181519 1168807 1153645 1135564 1113715 1087810
62045 1087810 1058558 1027316 995345 963294 931250 899230 867534 836705 807366 780187 755621
62034 755621 733317 712131 691309 671560 654397 640373 628534 617709 607607 598328 589447 580253
62022 580253 570641 561170 552301 543948 535729 527368 518877 510591 502962 496203 490258 485193 481245 478302
62008D78302k573k615k216j057K77J233J946K630L080L147L103L070K701J930
61994D92958J417J645K021J605L59j003k109l190m488o032p777r333r816q753
61980D47504p000n981o071o420o339n930n368m471l385k816l121l661l602k918
61966C80421k192j814j817k142k618k828k435j616q78n24m45l46m6M44R97J624
61950C63785K493L613M656N356N954O804P710Q190Q412R186J0859J2774J4128
61937D63920J4825J5191J5301J5067J4555J3883J3060J2181J1434J0626R135O795
61925F15973M421K957K363J810P78n47j795k840l638m004l651k370l16J931L825
61910F14897N427P157Q949J0206J0762J1155J1601J1377R873P568N252K846p5
$$ plain form
62008 478302 475729 473114 470898 469841 470118 471351 473297 475927 479007 482154 485257 488327 491028 492958
61994 492958 494375 496020 498041 499646 500005 499002 496893 493703 489215 483183 475406 466073 456257 447504
61980 447504 440504 434523 428452 422032 415693 409763 404395 399924 396539 393723 390602 386941 383339 380421
61966 380421 378229 376415 374598 372456 369838 367010 364575 362959 362081 361557 361112 360766 360720 361164 362161 363785
61950 363785 366278 369891 374547 379903 385857 392661 400371 408561 416973 426159 437018 449792 463920
61937 463920 478745 493936 509237 524304 538859 552742 565802 577983 589417 600043 609178 615973
61925 615973 620394 623351 625714 627524 628302 627755 625960 623120 619482 615478 611827 609457 609141 611072 614897
61910 614897 620324 627481 636430 646636 657398 668553 680154 691531 701404 708972 714224 717070 716995
61897G16995l111n400o966q530j0118j0886j0569j0028j0019j0257j0111r533
61885F11467q883q407q289q749r694j0623j1164j1377j1380j1113j0634j0119
61873D91035r395q075o343n041m555m251l381k125j095l30O61K090L727N305O680
61858D64907P705Q464R476J1199J3415J5491J7184J8788K0462K1889K2710K3009
61846F54699K3131K3126K2549K0912J8243J5084J1810Q228M078k11l756o095p414
61833G84384p912p583o687n750m749k902K20L889P036R335J0881J1317J0160P773
61819H09412N055K238j150n080q695j1539j4211j7214j9836k1024k0981k0977
61807F75998k1567k1924k1150j9576j8150j7092j5806j4008j2155j0726r683q894
$$ plain form
61897 716995 713884 708484 701518 692988 682870 671984 661415 651387 641368 631111 621000 611467
61885 611467 602584 594177 585888 577139 567445 556822 545658 534281 522901 511788 501154 491035
61873 491035 481640 473565 467222 462181 457626 453375 449994 447869 446774 446444 447105 449195 452922 458227 464907
61858 464907 472612 481076 490552 501751 515166 530657 547841 566629 587091 608980 631690 654699
61846 654699 677830 700956 723505 744417 762660 777744 789554 797782 801860 801649 797893 791798 784384
61833 784384 776472 768889 762202 756452 751703 748801 749021 752910 759946 769281 780162 791479 801639 809412
61819 809412 814467 816705 815555 810475 801780 790241 776030 758816 738980 717956 696975 675998
61807 675998 654431 632507 611357 591781 573631 556539 540733 526725 514570 503844 494161 485267
61795D85267q460q244p651o369m958m089l621l081k665k829l121k538j126r4q1
61780D26340l68l38n45j450k098j258O39J957K035J713J712J658J061K98O7M49
61764D31872J035J579K096K573K989L473M125M736M883M318L171J851P52mn82
61749D68867j174j783k276k599k826l093l455l759l621k854j922j619k108k637
61735D33141k370j228K91J647K396K298J697J426J887K587K925K933K729K002
61721D54361Q02K11J065K426K575J429P10J460K732L104K403J287Q5j142k022
61706D71486k175j710r97l18j11r49k688m247m762m502m107l512k395j129m50
61691D37434m26o22j005j861k895l311k842j990j233o76n30j096k046k440j804
$$ plain form
61795 485267 476807 468563 460912 454543 449585 445496 441875 438794 436129 433300 430179 427641 426515 426421 426340
61780 426340 425972 425634 425089 423639 421541 420283 420922 422879 424914 426627 428339 429997 431058 431356 431423 431872
61764 431872 432907 434486 436582 439155 442144 445617 449742 454478 459361 463679 466850 468701 469453 469449 468867
61749 468867 467693 465910 463634 461035 458209 455116 451661 447902 444281 441427 439505 437886 435778 433141
61735 433141 430771 429543 429834 431481 433877 436175 437872 439298 441185 443772 446697 449630 452359 454361
61721 454361 455163 455374 456439 458865 461440 462869 463579 465039 467771 470875 473278 474565 474650 473508 471486
61706 471486 469311 467601 466604 466286 466175 465226 462538 458291 453529 449027 444920 441408 439013 437884 437434
61691 437434 437008 436386 435381 433520 430625 427314 424472 422482 421249 420573 420043 418947 416901 414461 412657
61676D12657p46j32j68n12q66j073j059r99j221j671j819j416r25q09p76k69N69
61659C98765J033Q84O09O35P16L94l24r49j071p20k68MK55Q89J917K745K874K641
61641D11029K798L421L726L112J853O25k32o69o54l88m15j063j951k555k942l455
61625D12240l871l608k758k162k281k620k499j897j162m78k6k27j200k292k655
61610C82504k274j964k356l269m051m317m262m412m999n604n568m827m054l808
61596C26739l954m146m379m612m337l239k027j769k434k857k317j420j129j508
61582B86611j877j763j271p91o95j104j672j796j295o91n05n49k46M89J103J135
61566B75083O97J82j86k89N5Q77J701J828J160M39L94Q09Q96N12L74Q73J328J004
$$ plain form
61676 412657 411911 411779 411611 411099 410233 409160 408101 407102 405881 404210 402391 400975 400050 399241 398465 398196 398765
61659 398765 399798 400682 401291 401926 402642 403036 402712 401763 400692 399972 399704 399708 399963 400852 402769 405514 408388 411029
61641 411029 413827 417248 420974 424086 425939 426564 426332 425663 425009 424621 424206 423143 421192 418637 415695 412240
61625 412240 408369 404761 402003 399841 397560 394940 392441 390544 389382 388904 388878 388651 387451 385159 382504
61610 382504 380230 378266 375910 372641 368590 364273 360011 355599 350600 344996 339428 334601 330547 326739
61596 326739 322785 318639 314260 309648 305311 302072 300045 298276 295842 292985 290668 289248 288119 286611
61582 286611 284734 282971 281700 280909 280214 279110 277438 275642 274347 273656 273151 272602 272356 272845 273948 275083
61566 275083 275780 275962 275776 275487 275542 276419 278120 279948 281108 281547 281941 282750 283646 284158 284532 285405 286733 287737
61548B87737L80N74J660K422J969Q91L85P69J434J880K168K378K227J491N55J47
61532C09067N07R91P87j10q75r14o02o90j254j698j631j304j128j203j427j673
61516B96843j702j280n90k12m73j014j220q87l12J41L06K53J86K82N19O98O92
61499B92230O17O81R28J149J040N58J20K53R23J516J644J545J477J179N38K32
61483C06630Q66J781J767R05N43J265K010J712P61J29n4j99k82r6N4j62l00J91
61465C17521Q52P38j17p62p99p46q49n86K75J031J043P18Q52J467J925J938J875
61448C26376K072K345K280J736R82M65M81R65J567J905J849J527J183R52P93O52
61432C48130O97J108J638J709J191P54J046J739J960J597J502K146K710K018J25
$$ plain form
61548 287737 288117 288691 290351 292773 294742 295633 296018 296787 298221 300101 302269 304647 306874 308365 308920 309067
61532 309067 309574 310565 311352 311242 310367 309453 308851 308161 306907 305209 303578 302274 301146 299943 298516 296843
61516 296843 295141 293861 293271 293059 292586 291572 290352 289465 289153 289294 289600 289853 290039 290321 290840 291538 292230
61499 292230 292847 293528 294456 295605 296645 297203 297323 297576 298499 300015 301659 303204 304681 305860 306398 306630
61483 306630 307496 309277 311044 311949 312492 313757 315767 317479 318240 318369 318315 318116 317834 317738 317792 317630 317330 317521
61465 317521 318373 319111 318994 318232 317433 316687 315838 315252 315527 316558 317601 318319 319171 320638 322563 324501 326376
61448 326376 328448 330793 333073 334809 335791 336256 336737 337702 339269 341174 343023 344550 345733 346685 347478 348130
61432 348130 348827 349935 351573 353282 354473 355227 356273 358012 359972 361569 363071 365217 367927 369945 370070
61417C70070j604k019j379q42j069j640j807j500j297j554j919j896j576j508
61403C48460j887k240j973j112k98j10m56p16n17k05l11o77n62K78J062R51J22
61386C39809n30n58k43J40O80J404K056K482K803L048L035K776K577K518K290
61371C64287J807J483J530J454Q64L58R00K329L367L188K368J950K209K724L209
61356C94027L676M016M087M170M801O000P049P295O878O466O426O492O175N335
61342D72893M293L440K786K066J295R60J327J807J474K41j055j828k438l414m510
61327D79337n070m920m436l903l357k838k362j742q84r8L47P60J607K692L384
61312D58517L583L843M557N588O775Q102R317R994J0120J0014R640Q669P330O324
$$ plain form
61417 370070 368466 366447 365068 364226 363157 361517 359710 358210 356913 355359 353440 351544 349968 348460
61403 348460 346573 344333 342360 341248 340950 340840 340384 339668 339151 338946 338635 337958 337396 337674 338736 339687 339809
61386 339809 339279 338721 338478 338618 339298 340702 342758 345240 348043 351091 354126 356902 359479 361997 364287
61371 364287 366094 367577 369107 370561 371425 371783 372683 375012 378379 381567 383935 385885 388094 390818 394027
61356 394027 397703 401719 405806 409976 414777 420777 427826 435121 441999 448465 454891 461383 467558 472893
61342 472893 477186 480626 483412 485478 486773 487733 489060 490867 492341 492582 491527 489699 487261 483847 479337
61327 479337 474267 469347 464911 461008 457651 454813 452451 450709 449825 449727 450074 450834 452441 455133 458517
61312 458517 462100 465943 470500 476088 482863 490965 500282 510276 520396 530410 540050 548719 556049 562373
61298E62373N650M413K195j80j827k890l860m532m520m230m425n105n690n969
61284E31403o105n965n309m447l931l648l018j991j051k31R86K642L954M285L877
61269E11451L348K951K626K387K329K531L046L750M269M407M565N266O263O738
61255E65927O382N635M737L292J173p80j561j212o83p45j453k468l411l877l608
61240E67348k859k326k506l176l654l596l294l136k946k276j251o40q40j197p64
61225E32887N77K195L554M432M579L877K897K649L467M642N281N218M857M570
61211E85682M433M223L570K352J123O72J120J806K294K971M322O107P665Q786
61197F37126R753J0682J1356J1763J2284J3103J3725J3412J2036J0189Q385O490
$$ plain form
61298 562373 568023 572436 574631 574451 572624 569734 565874 561342 556822 552592 548167 543062 537372 531403
61284 531403 525298 519333 514024 509577 505646 501998 498980 496989 495938 495707 496693 499335 503289 507574 511451
61269 511451 514799 517750 520376 522763 525092 527623 530669 534419 538688 543095 547660 552926 559189 565927
61255 565927 572309 577944 582681 585973 587146 586366 584805 583593 582910 582165 580712 578244 574833 570956 567348
61240 567348 564489 562163 559657 556481 552827 549231 545937 542801 539855 537579 536328 535688 534848 533651 532887
61225 532887 533464 535659 539213 543645 548224 552101 554998 557647 561114 565756 571037 576255 581112 585682
61211 585682 590115 594338 597908 600260 601383 602055 603175 604981 607275 610246 614568 620675 628340 637126
61197 637126 646879 657561 668917 680680 692964 706067 719792 733204 745240 755429 763814 770304
61185G70304M221J924K99n62j303k288l121l565m263n794p468q039p471p085p814
61170G17975r162j0096j0264r986r713r900j0865j2263j3142j2926j1995j0935
61158E86728r670p948o259n541n923o363n730l942j849k80N88J000J004K75j394
61143E34696l537n253o014o033n808n522n042m287l360k434j535m87R52K768M569
61128D93673N939O917P873R008J0181J1271J2393J3694J5108J6446J7533J8248
61116F38284J8602J8796J9035J9365J9754K0168K0351J9779J8225J6244J4593
61105H43196J3257J1549R154O522M115J822o88l453o324r173j1780j3832j5304
61092H29061j6503j7628j8516j9027j9274j9336j9057j8323j7249j5959j4505
$$ plain form
61185 770304 774525 776449 776748 776186 774883 772595 769474 765909 761646 755852 748384 740345 732874 725789 717975
61170 717975 708813 698717 688453 678467 668754 658854 647989 635726 622584 609658 597663 586728
61158 586728 577058 569110 562851 557310 551387 545024 539294 535352 533503 533223 533811 534811 535815 536090 534696
61143 534696 531159 525906 519892 513859 508051 502529 497487 493200 489840 487406 485871 485384 486336 489104 493673
61128 493673 499612 506529 514402 523410 533591 544862 557255 570949 586057 602503 620036 638284
61116 638284 656886 675682 694717 714082 733836 754004 774355 794134 812359 828603 843196
61105 843196 856453 868002 877156 883678 887793 889615 888927 885474 879150 869977 858197 844365 829061
61092 829061 812558 794930 776414 757387 738113 718777 699720 681397 664148 648189 633684
61081F33684j3125j2173j1632j1025j0051q924p853o629n051l453k376j922j718
61068E37752j442j018m19M88J786L330M744N667O115O515P207Q062Q787R433J0248
61053F07255J1224J2169J3129J4304J5675J7092J8608K0229K1567K2346K3044
61042G96642K4264K5673K6403K6473K6816K7828K8911K9684L0543L1713L2799
61031A107749L3752L5239L7396L9198L9852L9942M0410M1287M2364M4422M8631
61020A550242N5094O2927P1512Q0988R1865J04823J20603J39656J62370J89988
61010B630068K24301K65802L13316L66527M27857N00861N88448O94475Q24937
61001F836592R83319J163664J349352J515957J629059J640260J500239J195462
$$ plain form
61081 633684 620559 608386 596754 585729 575678 566754 558901 552272 547221 543768 541392 539470 537752
61068 537752 536310 535292 534873 535361 537147 540477 545221 550888 557003 563518 570725 578787 587574 597007 607255
61053 607255 618479 630648 643777 658081 673756 690848 709456 729685 751252 773598 796642
61042 796642 820906 846579 872982 899455 926271 954099 983010 1012694 1043237 1074950 1107749
61031 1107749 1141501 1176740 1214136 1253334 1293186 1333128 1373538 1414825 1457189 1501611 1550242
61020 1550242 1605336 1668263 1739775 1820763 1912628 2017451 2138054 2277710 2440080 2630068
61010 2630068 2854369 3120171 3433487 3800014 4227871 4728732 5317180 6011655 6836592
61001 6836592 7819911 8983575 10332927 11848884 13477943 15118203 16618442 17813904
60993A7813904P80071L63852N5273r3896r8089q389J13255J95729J61736m0543
60983A9242903l95545q15634j188774j438716j548767j543210j458160j326803
60975I527294j176537j026778q87041p59811o45892n46361m61187l88791l27550
60966C307346k76670k35477k02722j76681j55554j37875j22927j10528j00274
60957A788638r1262q2760p4601o6732n9074n2119m6939m3983m2355m0866l9293
60946A148654l8030l6984l5619l3851l2194l1039l0291k9645k8774k7404k5622
60935G99201k3939k2718k1661k0279j8719j7572j6928j6161j4740j2888j1278
60924F02318j0307r836r427q714p645o460n416m522l617k659j868j538j677j891
$$ plain form
60993 17813904 18593975 18957827 19013100 18919204 18821115 18812726 18925981 19121710 19283446 19242903
60983 19242903 18847358 18031724 16842950 15404234 13855467 12312257 10854097 9527294
60975 9527294 8350757 7323979 6436938 5677127 5031235 4484874 4023687 3634896 3307346
60966 3307346 3030676 2795199 2592477 2415796 2260242 2122367 1999440 1888912 1788638
60957 1788638 1697376 1614616 1540015 1473283 1414209 1362090 1315151 1271168 1228813 1187947 1148654
60946 1148654 1110624 1073640 1038021 1004170 971976 940937 910646 881001 852227 824823 799201
60935 799201 775262 752544 730883 710604 691885 674313 657385 641224 626484 613596 602318
60924 602318 592011 582175 572748 564034 556389 549929 544513 539991 536374 533715 531847 530309 528632 526741
60910E26741j651q13K32R95J444J930K586L030K774J826P86L11M48N45l3j092
60894E40059j799j732j465j764k609l348l634l689l796l988m197m306m181m027
60880D95524m547o130p956q670q014p069o703o564n972n059m437m205l991l705
60866D12502l555l418k838j712n61J13L88O70J093J335J057L95o7J57R41J710
60850D08210K026J949J803J752J713J572J352J177J075R37O69L05j09o38j227
60835D22566j484j123n67o18j353j891j538o50M3M51Q71J166R08J68m92o97m90
60818D15270m6K93k3j155k391k933k933l089l474l574l317l162l140k843k412
60803C81071k584l428l974l572k804k588l006l507l688l451k865k273k123k372
$$ plain form
60910 526741 525090 524277 524509 525504 526948 528878 531464 534494 537268 539094 539880 540191 540639 541184 541151 540059
60894 540059 538260 536528 535063 533299 530690 527342 523708 520019 516223 512235 508038 503732 499551 495524
60880 495524 490977 484847 476891 468221 460207 453138 446435 439871 433899 428840 424403 420198 416207 412502
60866 412502 408947 405529 402691 400979 400418 400531 400919 401589 402682 404017 405074 405469 405402 405559 406500 408210
60850 408210 410236 412185 413988 415740 417453 419025 420377 421554 422629 423566 424235 424540 424431 423793 422566
60835 422566 421082 419959 419392 418774 417421 415530 413992 413342 413385 413836 414707 415873 416781 416949 416457 415760 415270
60818 415270 415224 415517 415494 414339 411948 409015 406082 402993 399519 395945 392628 389466 386326 383483 381071
60803 381071 378487 375059 371085 367513 364709 362121 359115 355608 351920 348469 345604 343331 341208 338836
60789C38836k499k272j958j646j097n52q03j936k719k000j87J298J716J504J409
60774C27094J717K260K654K616K298K172K460K975L567M256M800M739M141L657
60760C71406L504L104K155J312J152J126L15j159k316k598k311j932j641j445
60746C70672j279j033q17r69j519k038k340k847l779m513m452m040m157m791n094
60731C27004m661l953l453l070k471j587p11m09j106k418l146k436p79N74R88
60716B98366P54L24r7l04p0N59J304J846J812R37l24p91J41J594K303K259K402
60699C13015K959L123K459J583J232J416J781K115K251K101K001K455L276L688
60685C45455L449L226L506L814L504K722K057J623J123M93o2n22r81j226r72n08
$$ plain form
60789 338836 336337 334065 332107 330461 329364 328812 328009 326073 323354 321354 321167 322465 324181 325685 327094
60774 327094 328811 331071 333725 336341 338639 340811 343271 346246 349813 354069 358869 363608 367749 371406
60760 371406 374910 378014 380169 381481 382633 383759 384074 382915 380599 378001 375690 373758 372117 370672
60746 370672 369393 368360 367543 366574 365055 363017 360677 357830 354051 349538 345086 341046 336889 332098 327004
60731 327004 322343 318390 314937 311867 309396 307809 307098 306689 305583 303165 300019 297583 296804 297378 298366
60716 298366 299120 299444 299347 299043 298973 299532 300836 302682 304494 305431 305107 304316 304457 306051 308354 310613 313015
60699 313015 315974 319097 321556 323139 324371 325787 327568 329683 331934 334035 336036 338491 341767 345455
60685 345455 348904 352130 355636 359450 362954 365676 367733 369356 370479 370972 370910 370388 369407 368181 367209 366701
60669C66701o17j618k857l417l159k730k690k941l098l059k920k605j957j124
60655C31909m88j93j07k34o66j071p36N31J977K692K466J639N10p04j717k413
60639C33395k962l398l421k977k544k381k029j112j72O8j28K6M97N05j27n87k56
60622C12397N36J141J317J142Q11O87J017J387J062N5o72l88N11J061Q58K89m9
60605C23162R2M65O26M82M91J042J801J993J379M79q1m4O26J749K743K935K327
60588C42267J562J073O16j49j074j676j554n55J071K550L100K665J882J274R53
60573C54005J118K162M005N842O942P371P652Q118Q826R685J0254R799Q008N524
60559D49311L337J805N44q06k060k868l230l432l406k563n46J943L596L958M012
$$ plain form
60669 366701 366084 364466 361609 358192 355033 352303 349613 346672 343574 340515 337595 334990 333033 331909
60655 331909 331421 331228 331121 330887 330221 329150 328414 328945 330922 333614 336080 337719 338229 337525 335808 333395
60639 333395 330433 327035 323614 320637 318093 315712 313683 312571 312399 312467 312339 312365 312862 313367 313240 312653 312397
60622 312397 312933 314074 315391 316533 317344 318031 319048 320435 321497 321552 320880 320492 321003 322064 322922 323211 323162
60605 323162 323254 323719 324345 324827 325318 326360 328161 330154 331533 332012 331931 331887 332513 334262 337005 339940 342267
60588 342267 343829 344902 345518 345369 344295 342619 341065 340510 341581 344131 347231 349896 351778 353052 354005
60573 354005 355123 357285 361290 367132 374074 381445 389097 397215 406041 415726 425980 435779 443787 449311
60559 449311 452648 454453 454997 454191 452131 449263 446033 442601 439195 436632 436086 438029 441625 445583 449595
60544D49595M918O659Q364R583J0531J1414J2282J3417J4983J6270J6093J4175
60532E88284J1408Q573N528K050j329l843n412o502p375p850p658o796n655m876
60518E58547m787m927m516l382k022q06L37J384K089K542L249M449N903P531R618
60503E75209J2173J4844J7682K1214K5307K8861L1223L3131L5541L8078L9566
60492H72829L9555L8443L6360L2821K7470K0423J1922K234q033j8027k7087l4806
60480I94104m0784m4763m6835m7225m6038m3586m0548l7354l3699k9302k4874
60469E59096k1578j9606j8038j6175j4238j2658j1263r677q013o749o092n805
60457D09204n583n350n145m881m351l513k648k131k027k126k318k575k592j923
$$ plain form
60544 449595 454513 461172 469536 479119 489650 501064 513346 526763 541746 558016 574109 588284
60532 588284 599692 608265 613793 615843 614514 610671 605259 598757 591382 583532 575874 569078 563423 558547
60518 558547 553760 548833 544317 540935 538913 538107 538444 539828 541917 544459 547708 552157 558060 565591 575209
60503 575209 587382 602226 619908 641122 666429 695290 726513 759644 795185 833263 872829
60492 872829 912384 950827 987187 1020008 1047478 1067901 1079823 1082057 1074024 1055997 1028910 994104
60480 994104 953320 908557 861722 814497 768459 724873 684325 646971 613272 583970 559096
60469 559096 537518 517912 499874 483699 469461 456803 445540 435863 427850 421101 415009 409204
60457 409204 403621 398271 393126 388245 383894 380381 377733 375602 373575 371449 369131 366556 363964 362041
60443C62041o85K72L24j55l79k25k28p09j403j870j847j254k96N16P62O00M88
60426C55952N10L47j25o47r68j107j142j019o91j83M54J084J482J607J755K118
60410C59427K317J830Q12k2l55n91j054j409j148l02O98J533K087K273K187K212
60394C70495K601L054L138L004L169L596L587K795J861J597J886J986J680J466
60380D05915J662J957K032K042K138K090J750J505J704K028J946J559J303J094
60366D30725N02k87n35m8N40P63R35J408J955K296K651L286L887L976L634L344
60350D59032L300L327L307L293L274L136K739J870M04j308k456k575k139j996
60336D73208k334k538k027j017l83r02k446l955m387l740k853k304j968j694j692
$$ plain form
60443 362041 361356 361628 361952 361797 361418 361193 360965 360256 358853 356983 355136 353882 353586 354102 354864 355464 355952
60426 355952 356462 356809 356684 356037 355069 353962 352820 351801 351110 350927 351381 352465 353947 355554 357309 359427
60410 359427 361744 363574 364386 364364 364009 363418 362364 360955 359807 359505 360203 361736 363823 366096 368283 370495
60394 370495 373096 376150 379288 382292 385461 389057 392644 395439 397300 398897 400783 402769 404449 405915
60380 405915 407577 409534 411566 413608 415746 417836 419586 421091 422795 424823 426769 428328 429631 430725
60366 430725 431227 430940 430405 430357 430897 431660 432595 434003 435958 438254 440905 444191 448078 452054 455688 459032
60350 459032 462332 465659 468966 472259 475533 478669 481408 483278 483682 482374 479918 477343 475204 473208
60336 473208 470874 468336 466309 465292 464909 464007 461561 457606 453219 449479 446626 444322 442354 440660 438968
60321D38968j910j728p77L98J065J322J726K301K661K938L826N545P450Q801R588
60306D82174J0322J1354J2561J3472J3720J3306J2428J0963Q438M732M97l430
60294E90537o750r534j1599j2625j2772j2588j2272j1454r835p750n925m847m418
60281D68168m166l787l462l523l873m069m023m109m341m125l209k340k272k577
60267D18292k263j314o48o50p08m17l31r77j839j984j294m81o3J15L12M02K16
60250D06368j7Q0M13M47rm17k23K61K09n39j179r84j44O81J215J573J720J486
60232D10941J014Q25J311K270L006K953K336K055K614L401L487K962K794L377
60218D45346M156M775N593O657P181O706N972N836O104O190O196O407O423N811
$$ plain form
60321 438968 437058 435330 434553 434951 436016 437338 439064 441365 444026 446964 450790 456335 463785 472586 482174
60306 482174 492496 503850 516411 529883 543603 556909 569337 580300 588738 593470 593967 590537
60294 590537 583787 574253 562654 550029 537257 524669 512397 500943 491108 483358 477433 472586 468168
60281 468168 464002 460215 456753 453230 449357 445288 441265 437156 432815 428690 425481 423141 420869 418292
60267 418292 416029 414715 414067 413417 412709 412292 411961 410984 409145 407161 405867 405386 405323 405438 405750 406152 406368
60250 406368 406351 406431 406844 407291 407282 406865 406642 406903 407112 406573 405394 404410 404266 404947 406162 407735 409455 410941
60232 410941 411955 412780 414091 416361 419367 422320 424656 426711 429325 432726 436213 439175 441969 445346
60218 445346 449502 454277 459870 466527 473708 480414 486386 492222 498326 504516 510712 517119 523542 529353
60204E29353N070M843M738M040L150K956L173K721J611R82J129J015L5j094j679
60189E62043k086k777l454l773m020m353m257l501k884l294m430n204n003m062
60175E08945k926k070j702j571j206n82j71j99l26k74j87j97k33m38j094j772
60159D93997j502j98R23J002P52J191J911J744O30l19m79l07k31P6R07J826K233
60142E04156K205K269K548K623K245J898K341L653M985N446N069M562M266L888
60128E52154L198K471K040J883J913K187K567K627K244J936K213K866L240K977
60114E86516K203J197K01n91j095j375j540j770k330l268m129m447m485m874n473
60099E54740n337m053k356j079k42L35L34l60q97l76Q16J463J180P98J073J686
$$ plain form
60204 529353 534423 539266 544004 548044 551194 554150 557323 560044 561655 562637 563766 564781 564816 563722 562043
60189 562043 559957 557180 553726 549953 545933 541580 537323 533822 530938 527644 523214 518010 513007 508945
60175 508945 506019 503949 502247 500676 499470 498888 498717 498518 498192 497918 497731 497534 497301 496863 495769 493997
60159 493997 492495 492297 493220 494222 494974 496165 498076 499820 500450 500131 499652 499345 499114 499190 500097 501923 504156
60142 504156 506361 508630 511178 513801 516046 517944 520285 523938 528923 534369 539438 544000 548266 552154
60128 552154 555352 557823 559863 561746 563659 565846 568413 571040 573284 575220 577433 580299 583539 586516
60114 586516 588719 589916 590117 589526 588431 587056 585516 583746 581416 578148 574019 569572 565087 560213 554740
60099 554740 549403 545350 542994 541915 541673 542008 542342 541982 541085 540709 541525 542988 544168 544966 546039 547725
60083E47725J737Q24n64j510j580j315j606k531l283l460l708m609n655o045n933
60068E08487n912n760m778l274k509l045m058m555m453m153l817l489l248k910
60054D52526k119j025k71K9O18J969L451M250M517M845N088M632L719L463M327
60039D90019N382N484M603L436K258R60j10k48M12O33n68k740m680n849o438o520
60023D86034n982n253n088n375n101l936l003l408m629n285n038m743m882m851
60009D19460m092k982k245k008j897j705j573j646j858j929j457k50J285K273
59995C99376K169J310N44M24Q58J424J837K127K491K972L289L082K320J371N90
59980D26184m2p80j640k248k186j495o89k68l22o53j173j904k609k762k100j023
$$ plain form
60083 547725 549462 550286 549722 548212 546632 545317 543711 541180 537897 534437 530729 526120 520465 514420 508487
60068 508487 502575 496815 492037 488763 486254 483209 479151 474596 470143 465990 462173 458684 455436 452526
60054 452526 450407 449382 449111 449140 449758 451727 455178 459428 463945 468790 473878 478510 482229 485692 490019
60039 490019 495401 500885 505488 508924 511182 512142 512032 511784 512196 512829 512261 509521 504841 498992 492554 486034
60023 486034 480052 474799 469711 464336 459235 455299 452296 448888 444259 438974 433936 429193 424311 419460
60009 419460 415368 412386 410141 408133 406236 404531 402958 401312 399454 397525 396068 395818 397103 399376
59995 399376 401545 402855 403399 403823 404681 406105 407942 410069 412560 415532 418821 421903 424223 425594 426184
59980 426184 426142 425362 423722 421474 419288 417793 417104 416836 416514 415861 414688 412784 410175 407413 405313 404290
59964D04290k77k47o44q57m49M77J345J584J144M77O1O6M54J041J418J190N33
59947D11606J50L91P97Q16O09N98N87N1q21j170p53m41r68j806j826q09L68R82
59929D08361J286J880K768L477L802M060M555N159N578N741N723N435M683L578
59915D66086K576J990J613J038K38l75m94l21k32j53L74J421K275K221J511J092
59899D80860J367J763J686J349J289J591K019K556L243L864M293M866N767O412
59885E22925O218N674N752O357O403N509M534M249M346M186L593K512Q09j110
59871E81957k321k640k992l950m789m821m666n128n600m896l238k045j915k072
59857E30884j766j046r9J109K278K918L338M547O728Q706R303Q542P101N433L893
$$ plain form
59964 404290 404013 403766 403122 402265 401816 402293 403638 405222 406366 406843 406904 406970 407424 408465 409883 411073 411606
59947 411606 411756 412147 412944 413760 414369 414967 415554 415605 414784 413614 412861 412420 411452 409646 407820 407011 407379 408361
59929 408361 409647 411527 414295 417772 421574 425634 430189 435348 440926 446667 452390 457825 462508 466086
59915 466086 468662 470652 472265 473303 473541 473166 472672 472351 472119 471966 472340 473761 476036 478257 479768 480860
59899 480860 482227 483990 485676 487025 488314 489905 491924 494480 497723 501587 505880 510746 516513 522925
59885 522925 529143 534817 540569 546926 553329 558838 563372 567621 571967 576153 579746 582258 583067 581957
59871 581957 579636 576996 574004 570054 565265 560444 555778 550650 545050 540154 536916 534871 532956 530884
59857 530884 529118 528072 527973 529082 531360 534278 537616 542163 548891 557597 566900 575442 582543 587976 591869
59842E91869K918K406J558L9j155q71N45J564J248p4j761l541n069n700n310m810
59826E73856n165o095o389n463m101l398l528l869l961l842l602l151k570k249
59812E16473k519l334m374n184n246m338k935j837j271p52j0M79K21n14j084j319
59796D82456j456j547j415j074o96l01J38M44M41K80K37L31M84Q09J273J411R02
59779D82717K37J59N79P17L00j47k95n36j174j674j293j50Q53J099Q81Q89J341
59762D84503J859K129K379K999L850M370M382M331M612N071N419N659N807N634
59748E43004N084M540M292M125L882L940M517N052M879M191L599L109K388J696
59734E98298J549J676J327N92L37P55R95N46o1k61k71m14m53j83k4l97j034j492
$$ plain form
59842 591869 594787 597193 598751 598790 597635 596764 597309 598873 600121 600047 598286 594745 589676 583976 578666 573856
59826 573856 568691 562596 556207 550744 546643 543245 539717 535848 531887 528045 524443 521292 518722 516473
59812 516473 513954 510620 506246 501062 495816 491478 488543 486706 485435 484683 484673 485152 485373 484859 483775 482456
59796 482456 481000 479453 478038 476964 476268 475967 476105 476549 476990 477270 477507 477838 478322 479131 480404 481815 482717
59779 482717 482954 483113 483692 484409 484709 484562 484267 483731 482557 480883 479590 479440 480293 481392 482273 483162 484503
59762 484503 486362 488491 490870 493869 497719 502089 506471 510802 515414 520485 525904 531563 537370 543004
59748 543004 548088 552628 556920 561045 564927 568867 573384 578436 583315 587506 591105 594214 596602 598298
59734 598298 599847 601523 602850 603442 603779 604534 605529 606075 606014 605753 605482 605068 604615 604432 604408 604011 602977 601485
59716F01485j839k359k880l017k725k181j412m82K75O37R22J554K401K888K728
59701E95995K210J888K144K973L971M604M657M332L915L544L234K872K140Q83
59687F39362m14j008r02r62j704k481k390j633j385k307l760m696m938n188n855
59672E99739o360n898m628l579l333l444l358l248l359l144j936j63R95J176J130
59657E60590J449J892K196K650L404L897L576K732K124K032K059J613M26j240
59643E89400k762l794m632n676o588o641n799m857m428m398m476m489m093k981
59629E23786j674j266j983k813k909k640k757l311l934m507m912m812m292m101
59615D77875m595m966m278k742j302m22M0K39L61P73J443J650R68J27O0N66Q08
$$ plain form
59716 601485 599646 597287 594407 591390 588665 586484 585072 584590 584865 585502 586424 587978 590379 593267 595995
59701 595995 598205 600093 602237 605210 609181 613785 618442 622774 626689 630233 633467 636339 638479 639362
59687 639362 638948 637940 637038 636076 634372 631891 629501 627868 626483 624176 620416 615720 610782 605594 599739
59672 599739 593379 587481 582853 579274 575941 572497 569139 565891 562532 559388 557452 557289 558284 559460 560590
59657 560590 562039 563931 566127 568777 572181 576078 579654 582386 584510 586542 588601 590214 590640 589400
59643 589400 586638 582844 578212 572536 565948 559307 553508 548651 544223 539825 535349 530860 526767 523786
59629 523786 522112 520846 518863 516050 513141 510501 507744 504433 500499 495992 491080 486268 481976 477875
59615 477875 473280 468314 464036 461294 459992 459570 459610 459849 460210 460983 462426 464076 465044 465171 465231 465797 466605
59598D66605O96P26P84K82n75q12q6Q67J388J549J445P87l93j375j606j346j128
59581D67808j064j043j175j576k081k483k852l290l637l671l355k777k059j400
59567D35345j004q05n88l81m47q06j110j142j047r11m68M42J447K004K046J969
59551D34544K094K395K738L068L339L503L638M033M979O571Q651J0968J3272J5319
59537E19112J6829J7428J6540J3513Q265J986l243o000o642o542o378n713m152
59524E55003k201o53K53O76O62K23l94j002j781k894m060m898n504o191o819o884
59508E13536o209n195m395m168m560n172n200m121k341q19j03n0m18j166k003
59493D67616k181j151P02K285K766K266J612J511J999K570K773K615K492K845
$$ plain form
59598 466605 467301 468027 468811 469093 468518 467706 467620 468487 469875 471424 472869 473656 473263 471888 470282 468936 467808
59581 467808 466744 465701 464526 462950 460869 458386 455534 452244 448607 444936 441581 438804 436745 435345
59567 435345 434341 433536 432948 432567 432120 431314 430204 429062 428015 427104 426636 427078 428525 430529 432575 434544
59551 434544 436638 439033 441771 444839 448178 451681 455319 459352 464331 470902 479553 490521 503793 519112
59537 519112 535941 553369 569909 583422 591687 593673 590430 584430 577788 571246 564868 559155 555003
59524 555003 552802 552149 552402 553078 553740 553963 553569 552567 550786 547892 543832 538934 533430 527239 520420 513536
59508 513536 507327 502132 497737 493569 489009 483837 478637 474516 472175 471356 471253 471203 470785 469619 467616
59493 467616 465435 464284 464986 467271 470037 472303 473915 475426 477425 479995 482768 485383 487875 490720
59479D90720L795M927N577N473N040M720M298L311K025J235J073P46k05j148j307
59464E30280q61n06m10k18K82J119K366L820M798M955M992N777O936P222O200
59449E76752M767L837L313K670J803Q97j45j605l463n328o736p388p227o468n517
59434E50162m800m564m691m627l811k366j097m54J41J505L516N306O507P642R205
59419E57574J0987J2544J3806J4926J5906J6731J7617J8684J9346J8340J4592
59408G31053Q170M84o491j1221j3136j2511j0147o943l375N86M654P323O590J909
59394F96945m943j1320j5659j7755j7940j6701j4754j2674j0458p968n628m106
59382E57039l435k911j924m44J144K366K981L318M018N132N877N746N332N392
$$ plain form
59479 490720 494515 499442 505019 510492 515532 520252 524550 527861 529886 531121 532194 532940 532735 531587 530280
59464 530280 529419 528913 528503 528285 528567 529686 532052 535872 540670 545625 550617 556394 563330 570552 576752
59449 576752 581519 585356 588669 591339 593142 594039 593894 592289 588826 583498 576762 569374 562147 555679 550162
59434 550162 545362 540798 536107 531480 527669 525303 524206 523752 523893 525398 528914 534220 540727 548369 557574
59419 557574 568561 581105 594911 609837 625743 642474 660091 678775 698121 716461 731053
59408 731053 739223 739707 733216 721995 708859 696348 686201 679258 675883 676469 681123 688446 695036 696945
59394 696945 692002 680682 665023 647268 629328 612627 597873 585199 574741 566773 561145 557039
59382 557039 553604 550693 548769 548325 549469 551835 554816 558134 562152 567284 573161 578907 584239 589631
59368E89631N661N454N065N424O520P294P193O768O540O260N723N397N655O096
59354F74681O183O073O324P119Q199R215R897J0166J0306J0646J1005J0839J0077
59341G90730R199Q343P006M942K657N71j653m348o925q526r222r797j0427j0425
59327G62125r456q281p872q148q097p118n769m975m810m520l703k942k892l280
59313F80262l281k655j897j361q70l17J10M43J167K519M010N016N512N739N409
59298F99806L757M25l998q434j2084j4649j6009j6080j5037j3495j2078j0832
59286E81292r391p714o216n060l847k325r09jP77K097L997N964P613Q661Q715
59271E83653P857P163P562Q411Q222O864N743N573N214L458Q61j129k164l030
$$ plain form
59368 589631 595292 600746 605811 611235 617755 625049 632242 639010 645550 651810 657533 662930 668585 674681
59354 674681 680864 686937 693261 700380 708579 717794 727691 737857 748163 758809 769814 780653 790730
59341 790730 799929 808272 815278 820220 822877 823448 821795 817447 810522 801996 792774 782977 772550 762125
59327 762125 752669 744388 736516 728368 720271 713153 707384 702409 697599 693079 689376 686434 683542 680262
59313 680262 676981 674326 672429 671068 670198 669881 669991 670434 671601 674120 678130 683146 688658 694397 699806
59298 699806 703563 703988 699990 691556 679472 664823 648814 632734 617697 604202 592124 581292
59286 581292 571901 564187 557971 552911 549064 546739 545830 545829 546606 548703 552700 558664 566277 574938 583653
59271 583653 591510 598673 606235 614646 622868 629732 635475 641048 646262 649720 650581 649452 647288 644258
59257F44258m163n142n618n826n970n819n206m506m234m351m294l717k940k512
59243E79960k397j943o69J185L100M836O186O621N872M644M030M136L990K954
59229F22505J553O22K07k67j162k294l264l805l950l935l786l144j823m01K83
59214E97339J86O7L18M36p0q97j400j447j378j479j806k266k598k469j933j475
59198E79128j456j652j623j297j017j081j400j538j069j9J079J754K072K395K845
59183E77121L276L552L550L122K473K257K800L503L634L417L650M501N457O281
59169F28594P053P446O954N942N417N623N832N631N335M910L687J639k42j508
59155F92313l010n335p498q243p912p871q587r321r485r231q812q190p437o928
$$ plain form
59257 644258 640095 634953 629335 623509 617539 611720 606514 602008 597774 593423 589129 585412 582472 579960
59243 579960 577563 575620 574951 576136 579236 584072 590258 596879 602751 607395 611425 615561 619551 622505
59229 622505 624058 624680 624887 624620 623458 621164 617900 614095 610145 606210 602424 599280 597457 597056 597339
59214 597339 597525 597592 597910 598346 598276 597379 595979 594532 593154 591675 589869 587603 585005 582536 580603 579128
59198 579128 577672 576020 574397 573100 572083 571002 569602 568064 566995 566976 568055 569809 571881 574276 577121
59183 577121 580397 583949 587499 590621 593094 595351 598151 601654 605288 608705 612355 616856 622313 628594
59169 628594 635647 643093 650047 655989 661406 667029 672861 678492 683827 688737 692424 694063 693821 692313
59155 692313 689303 683968 676470 668227 660315 652444 643857 634536 625051 615820 607008 598818 591381 584453
59141E84453o963p477q141q562q525q192p821p304o302m909l627k593j462k92
59127E02283K63nk78K98J612L076M514N980P221P948Q243Q283Q081P903Q383R628
59111E83433J0769J1008J0632J0354J0117R351Q066O951O405O083N342L837J781
59098F84129j52j383k060k736l379l359k654k208k596l102k820j978j432j427
59084F52843j682k221l299m732o040p026p631p636p104o642o628o555n853m859
59070E74935m234l883l420l201l835m879n095m152l093k901l322l454k941k287
59056E24238k187k695l099k770k090k000k596k879k235j361j113j214r16l13j4
59041D96756PK73P75J007Q44O05M20K84N55J650L314M905O142P051P507P538P747
$$ plain form
59141 584453 577490 570013 561872 553310 544785 536593 528772 521468 515166 510257 506630 504037 502575 502283
59127 502283 502546 502541 502263 502561 504173 507249 511763 517743 524964 532912 541155 549438 557519 565422 573805 583433
59111 583433 594202 605210 615842 626196 636313 645664 653730 660681 667086 673169 678511 682348 684129
59098 684129 683977 682594 680534 677798 674419 671060 668406 666198 663602 660500 657680 655702 654270 652843
59084 652843 651161 648940 645641 640909 634869 627843 620212 612576 605472 598830 592202 585647 579794 574935
59070 574935 570701 566818 563398 560197 556362 551483 546388 542236 539143 536242 532920 529466 526525 524238
59056 524238 522051 519356 516257 513487 511397 509397 506801 503922 501687 500326 499213 497999 497083 496770 496756
59041 496756 496763 497036 497811 498818 499662 500267 500687 500971 501526 503176 506490 511395 517537 524588 532095 539633 547380
59024E47380Q648R836J0530J0674J0707J0643J0201R511Q806P751N894L629J729
59011F55939K64j108k117k253j936k058k392j709L38K559L765L978L836L733L830
58996F64669M125M186L476K183J051K69o80j958k956l236l170l289l588l742l594
58981F53746l137k509j975j566q19O17K248L323L985N070O773Q376R360R947J0382
58966G03821J0479J0213J0003J0008R717Q597O784M849L146J563k46k416m514
58953G72004n896o599p444q904j0457j1493j2231j2966j3147j2230j0833r941
58941F49863r383q339o952o072n692n052m172l785l754l141k047j765k689l519
58927E83501l151k015r43mQ43J133P66M73O85Q27M61K18P60J684K246K434K557
$$ plain form
59024 547380 556028 565864 576394 587068 597775 608418 618619 628130 636936 644687 650581 654210 655939
59011 655939 656203 655095 652978 650725 648789 646731 644339 642630 642968 645527 649292 653270 657106 660839 664669
58996 664669 668794 672980 676456 678639 679690 679959 679279 677321 674365 671129 667959 664670 661082 657340 653746
58981 653746 650609 648100 646125 644559 643740 644357 646605 649928 653913 658983 665756 674132 683492 693439 703821
58966 703821 714300 724513 734516 744524 754241 762838 769622 774471 777617 779180 778934 776518 772004
58953 772004 766108 759509 752065 743161 732704 721211 708980 696014 682867 670637 659804 649863
58941 649863 640480 632141 625189 619117 613425 608373 604201 600416 596662 593521 591474 589709 587020 583501
58927 583501 580350 578335 577392 577388 578231 579364 580130 580603 581288 582115 582576 582794 583554 585238 587484 589918 592475
58910E92475K549K437K882M331O134P296P712Q014Q549R219R970J0795J1412J1472
58896F95247J1021J0477J0254J0502J0952J1070J0788J0928J2293J4394J5828
58885H23754J5934J5207J4121J2532J0447Q326O267L845J151j035k532m165o322
58872H97530q140q874r040r396r680r269q426p850p606p371p337p943q970r705
58858G77923r804r436q817q260q331r336j0731j1548j1352j0500r634r170r054
58845F51950q857q306p774p760q010p756o888o146n952n857n418m861m490m176
58831E59699l787l466l137k462j547r58o98j2J365K681L318L642M147M617M698
58816E68100M613M654M715M701M721M432L198J358K83M96P99N1j227j922k033
$$ plain form
58910 592475 595024 597461 600343 604674 610808 618104 625816 633830 642379 651598 661568 672363 683775 695247
58896 695247 706268 716745 726999 737501 748453 759523 770311 781239 793532 807926 823754
58885 823754 839688 854895 869016 881548 891995 900321 906588 910433 911584 910549 908017 903852 897530
58872 897530 889390 880516 871476 862080 852400 843131 834705 826855 819249 811878 804541 796598 787628 777923
58858 777923 768119 758683 749866 741606 733275 723939 713208 701660 690308 679808 670174 661004 651950
58845 651950 643093 634787 627013 619253 611243 603487 596599 590453 584501 578644 573226 568365 563875 559699
58831 559699 555912 552446 549309 546847 545300 544342 543644 543632 544997 547678 550996 554638 558785 563402 568100
58816 568100 572713 577367 582082 586783 591504 595936 599134 600492 600775 601271 602070 602121 600894 598972 596939
58801E96939k203k431k392k416k974l679l878l816m170m824n061m686m028l110
58787E47271j736j96R69J816K895M417O022P167P359O415M915L950L930M150L842
58772F03186K993J672n10l555o455q267r153r682r770r135q100p087n990m801
58758E25346m090m005l616k274q42m79r19j094p47k70M15J495K373K472K439L210
58742E19414M335M673M318M359M974N336N277N520O144O322N821N424N536N615
58728E93068N313N124N400N715N609N190M683M090L588L574M061M602M958N302
58714F60277N683N906N897N702N100L848K180N06j222l247n352p197q984j1027
58700F58070j2888j3884j4223j4677j5240j5119j4088j2857j1913j0869r268p361
$$ plain form
58801 596939 594736 592305 589913 587497 584523 580844 576966 573150 568980 564156 559095 554409 550381 547271
58787 547271 545535 545339 546308 548124 551019 555436 561458 568625 575984 582399 587314 591264 595194 599344 603186
58772 603186 606179 607851 607341 603786 597331 589064 579911 570229 560459 551324 543224 536137 530147 525346
58758 525346 521256 517251 513635 511361 510519 510040 509121 508027 507280 507010 507425 508920 511293 513765 516204 519414
58742 519414 523749 528422 532740 537099 542073 547409 552686 558206 564350 570672 576493 581917 587453 593068
58728 593068 598381 603505 608905 614620 620229 625419 630102 634192 637780 641354 645415 650017 654975 660277
58714 660277 665960 671866 677763 683465 688565 692413 694593 695099 693877 690630 685278 678081 669097 658070
58700 658070 645182 631298 617075 602398 587158 572039 557951 545094 533181 522312 513044 505683
58688E05683n860n280n620o237o187n147l814l029k833k849k945k846j834J55
58674D51357J763J810J108J399K786L798L869M118N437P281Q808R904J0539J0191
58660E24168Q652O487M177J473j780m846o680p014o492o056o260o839o910n968
58646D86112m561l550k990k406j789j533j500j088k14N77R54R93O73L5l25J66
58630D69554J042J323R62P66R14P68K41J32P09J157R41P52J421K668L604L903
58614D90857L887L838L787L780L925M200M337L931K810J416M91K18Q9j41m2M80
58598E27863N61m48j862k604k642k510k023p54P40J492J636K082K965L738M543
58583E32777O010P754Q613Q453Q376Q931R457R424R125Q765Q195P794Q389R954
$$ plain form
58688 505683 499823 494543 488923 482686 476499 471352 467538 464509 461676 458827 455882 453036 451202 451357
58674 451357 453120 454930 456038 457437 460223 464021 467890 472008 477445 484726 493534 503438 513977 524168
58660 524168 532820 539307 543484 544957 543177 538331 531651 524637 518145 512089 505829 498990 492080 486112
58646 486112 481551 478001 475011 472605 470816 469283 467783 466695 466481 467058 468012 469005 469678 469713 469388 469554
58630 469554 470596 471919 472881 473647 474561 475329 475570 475702 476411 477568 478509 479261 480682 483350 486954 490857
58614 490857 494744 498582 502369 506149 510074 514274 518611 522542 525352 526768 527259 527477 527566 527425 527383 527863
58598 527863 528424 527976 526114 523510 520868 518358 516335 515581 516321 517813 519449 521531 524496 528234 532777
58583 532777 538787 546541 555154 563607 571983 580914 590371 599795 608920 617685 625880 633674 642063 652017
58569F52017J1495J2556J3738J5410J7164J8747K0499K2371K3677K4094K3937
58558H55705K3182K1289J8229J4565J0332N152k55m108n674o105o597o916o434
58545I12365n509n056n567p147r695j2523j4652j5967j7303j8966k0142k0086
58533G59752j9041j7532j5665j3603j1768j0128q134n808l995l078k431j559r00
58520F46110r72j523k039k367k460k196j791j681j783j582j041o49n68o37j099
58505F23722k239l353l352k427j790j703j278l99j33q10j257o64K94Q71J433K439
58489F09354L521M320N114N929O268O367P412R791J2242J3586J4160J4752J5274
58476G28090J5246J4521J2808R607N337J444j337l726o291q274q941q761q403
$$ plain form
58569 652017 663512 676068 689806 705216 722380 741127 761626 783997 807674 831768 855705
58558 855705 878887 900176 918405 932970 943302 948454 948199 944091 938417 932312 925715 918799 912365
58545 912365 906856 901800 896233 889086 879391 866868 852216 836249 818946 799980 779838 759752
58533 759752 740711 723179 707514 693911 682143 672015 663881 658073 654078 651000 648569 647010 646110
58520 646110 645138 643615 641576 639209 636749 634553 632762 631081 629298 627716 626675 626026 625458 624821 623722
58505 623722 621483 618130 614778 612351 610561 608858 607580 607181 607048 606238 604981 604317 604611 605482 606915 609354
58489 609354 612875 617195 622309 628238 634506 640873 648285 658076 670318 683904 698064 712816 728090
58476 728090 743336 757857 770665 780272 785609 787053 785716 781990 775699 767425 758484 749723 741320
58463G41320p606o008m064k180J52L407O979R773J1289J1576J1038J0533J0638
58450G96847J0471Q447M569O13k362n024p734r411r423q894q843q428o460l516
58436G50852j126J54O87P04N55J144K964N213O767P424P590P509P416P610P840
58421H13303P400O107M271J668j961n437o903o488o304p317q180p873p271p212
58407G67803p069o438o201o597o304m715l174k523j566M92K151K061J348J555
58393G30823K118J942J747K590L569L320K506K582L347L864M703O930R798J1589
58379G91428J2034J1965J1324R510P034N056L856L158L189L958M549M527M946
58366H76534O555Q273R011R540J0841J2056J2028J1499J1687J1950J0961R096
$$ plain form
58463 741320 733714 727706 723642 721462 721614 725021 732000 741773 753062 764638 775676 786209 796847
58450 796847 807318 815765 820334 820947 818585 813561 805827 796416 786993 778099 769256 760828 754368 750852
58436 750852 749726 749880 750567 751271 751826 752970 755934 761147 767914 775338 782928 790437 797853 805463 813303
58421 813303 820703 826810 831081 832749 830788 825351 818448 811960 805656 798339 790159 782286 775015 767803
58407 767803 760734 754296 748095 741498 735194 730479 727305 724782 723216 723708 725859 727920 729268 730823
58393 730823 732941 734883 736630 739220 742789 746109 748615 751197 754544 758408 763111 770041 779839 791428
58379 791428 803462 815427 826751 836261 843295 848351 852207 855365 858554 862512 867061 871588 876534
58366 876534 883089 891362 900373 909913 920754 932810 944838 956337 968024 979974 990935 1000031
58354A000031P557O179M182K131J158J142J393K097L312L905L339L164M736O863
58340A051189P842Q280R670J1514J2368J2514J3144J3994J4197J4290J5023J5332
58328A199357J3913J1680J0219R015O727M023K566K254J992K061L123M093L748
58315A274771L340M827P547R382J0172J1204J2396J2797J2940J3914J5038J5130
58303A403458J4974J5886J7073J7133J6828J7489J8146J7342J6292J6951J8409
58292A589981J8635J8349J9618K1868K3041K3545K5240K7552K8403K8098K8639
58281A852969L0084L1172L2460L5080L7606L7899L6984L7258L8238L8048L7629
58270B245427L9168M1723M2975M3838M6746N0705N2958N4180N6993O0597O2215
$$ plain form
58354 1000031 1007588 1013767 1017949 1020080 1021238 1022380 1023773 1025870 1029182 1033087 1036426 1039590 1044326 1051189
58340 1051189 1059031 1067311 1076981 1088495 1100863 1113377 1126521 1140515 1154712 1169002 1184025 1199357
58328 1199357 1213270 1224950 1235169 1244184 1250911 1254934 1257500 1259754 1261746 1263807 1266930 1271023 1274771
58315 1274771 1278111 1282938 1290485 1299867 1310039 1321243 1333639 1346436 1359376 1373290 1388328 1403458
58303 1403458 1418432 1434318 1451391 1468524 1485352 1502841 1520987 1538329 1554621 1571572 1589981
58292 1589981 1608616 1626965 1646583 1668451 1691492 1715037 1740277 1767829 1796232 1824330 1852969
58281 1852969 1883053 1914225 1946685 1981765 2019371 2057270 2094254 2131512 2169750 2207798 2245427
58270 2245427 2284595 2326318 2369293 2413131 2459877 2510582 2563540 2617720 2674713 2735310 2797525
58259B797525O2586O4557O7301O7664O6364O6976O9492P0902P1567P4840Q0682
58248C560456Q5731Q9448R4274J00066J04503J08569J15391J24048J30846J36193
58238D649525J43692J53127J61276J68958J79965J93594K05803K17199K32066
58229F305205K50039K66936K83363L03901L28220L51925L75828M05119M39722
58220I310258M75217N12861N58464O11774O67921P28874Q01974Q87808R81941
58211A5537092J088121J216443J369083J542561J743769J988264K283839K633830
58203B9403002L056704L582544M228268M994781N886788O913179Q072939R373774
58195G5511979J0867665J2636835J4745854J7243960K0195738K3616203K7318530
$$ plain form
58259 2797525 2860111 2924668 2991969 3059633 3125997 3192973 3262465 3333367 3404934 3479774 3560456
58248 3560456 3646187 3735635 3829909 3929975 4034478 4143047 4258438 4382486 4513332 4649525
58238 4649525 4793217 4946344 5107620 5276578 5456543 5650137 5855940 6073139 6305205
58229 6305205 6555244 6822180 7105543 7409444 7737664 8089589 8465417 8870536 9310258
58220 9310258 9785475 10298336 10856800 11468574 12136495 12865369 13667343 14555151 15537092
58211 15537092 16625213 17841656 19210739 20753300 22497069 24485333 26769172 29403002
58203 29403002 32459706 36042250 40270518 45265299 51152087 58065266 66138205 75511979
58195 75511979 86379644 99016479 113762333 131006293 151202031 174818234 202136764
58188B02136764L0851457L3576329L4702974L3242241K8195361J9191548P133875
58181C89030549n886095j7512433k6146806l1315782l3374603l3048807l1139438
58174B10606585k8361532k5239657k2091263j9094589j6351708j3904939j1752669
58167G3810228r884760q296016o967815n862647m945260m192174l577422l068384
58159B7015750k641660k287880j996715j751443j541403j365445j219211j091562
58151A3120431r76628q77050p92220p14914o42493n79932n28400m81393m35520
58142G091881l95013l62272l33418l06588k85382k70480k56278k39499k23430
58133D419521k10359j97369j82847j70054j60738j51745j41157j31585j24461
$$ plain form
58188 202136764 232988221 266564550 301267524 334509765 362705126 381896674 389030549
58181 389030549 383144454 365632021 339485215 308169433 274794830 241746023 210606585
58174 210606585 182245053 157005396 134914133 115819544 99467836 85562897 73810228
58167 73810228 63925468 55629452 48661637 42798990 37853730 33661556 30084134 27015750
58159 27015750 24374090 22086210 20089495 18338052 16796649 15431204 14211993 13120431
58151 13120431 12143803 11266753 10474533 9759619 9117126 8537194 8008794 7527401 7091881
58142 7091881 6696868 6334596 6001178 5694590 5409208 5138728 4882450 4642951 4419521
58133 4419521 4209162 4011793 3828946 3658892 3498154 3346409 3205252 3073667 2949206
58124B949206j17032j07916r9980r4885r0084q3877p8327p4679p0912o6180o2776
58113B002558o1467n9574n5853n2733n1671n0714m8630m6965m6245m4521m1511
58102A442674l9729l9787l8963l6177l3918l3413l2423k9857k8043k8230k8081
58091A074053k5927k3521k2259k0673j7888j5799j5514j5242j3941j3429j4674
58080H75186j5599j4843j4213j5106j5954j5502j5225j6167j6627j5482j4489
58069G05979j4914j5031j3488j1994j1994j1789r773p628p322p592o449m790m510
58056E78705n146n343n676p121q548q546q112q718r315q099n866m897n446n975
58042D81897n944o009o128n713n113n091n323n009m391m288m753n450o401p434
$$ plain form
58124 2949206 2832174 2724258 2624278 2529393 2439309 2355432 2277105 2202426 2131514 2065334 2002558
58113 2002558 1941091 1881517 1825664 1772931 1721260 1670546 1621916 1574951 1528706 1484185 1442674
58102 1442674 1402945 1363158 1324195 1288018 1254100 1220687 1188264 1158407 1130364 1102134 1074053
58091 1074053 1048126 1024605 1002346 981673 963785 947986 932472 917230 903289 889860 875186
58080 875186 859587 844744 830531 815425 799471 783969 768744 752577 735950 720468 705979
58069 705979 691065 676034 662546 650552 638558 626769 616996 609368 602046 594454 588005 583215 578705
58056 578705 573559 568216 562540 555419 546871 538325 530213 521495 512180 504081 498215 493318 487872 481897
58042 481897 475953 469944 463816 458103 452990 447899 442576 437567 433176 428888 424135 418685 412284 404850
58028D04850p837p626p885q834r043p729o253o019o346n971n196m872m614l687
58014C12938k590k155k084j763j506j655j529o86r0n96j383j252n19j90k25K8
57998B94743N68J149J970K875K907J793P99R19J467J577J812K798L631L172J929
57983C24109J018K98r02k130k471k150j959j877j609j663k429k982k362j253q53
57968C00785q47k42N14O9j428k342j964j296j239j398j110n67m49j049k086k987
57952B82364l318l113k738k333j794j257r93q20l77J7k02m92L45K208L549L725
57936B74771L914N028O261O641O512O374N660L947K186J367J014K86n21q34j179
57921C21427k261l532m072m148m596n274n391m777l769k465j118n10q82j310j061
$$ plain form
58028 404850 397013 389387 381502 372668 363625 355896 349643 343624 337278 331307 326111 321239 316625 312938
58014 312938 310348 308193 306109 304346 302840 301185 299656 298970 298880 298284 296901 295649 295130 294940 294715 294743
57998 294743 295311 296460 298430 301305 304212 306005 306804 307723 309190 310767 312579 315377 319008 322180 324109
57983 324109 325127 325425 324523 322393 319922 317772 315813 313936 312327 310664 308235 305253 302891 301638 300785
57968 300785 299938 299696 300210 300279 298851 296509 294545 293249 292010 290612 289502 288935 288486 287437 285351 282364
57952 282364 279046 275933 273195 270862 269068 267811 266818 265998 265621 265638 265436 264944 265289 267497 271046 274771
57936 274771 278685 283713 289974 296615 303127 309501 315161 319108 321294 322661 323675 323961 323440 322606 321427
57921 321427 319166 315634 311562 307414 302818 297544 292153 287376 283607 281142 280024 279514 278632 277322 276261
57906B76261o96p99p35J27J010R79N68P38J096Q40N56J310K537K673J592P17Q95
57889B89669J612K155K231J565J74j101j458j323j645k380k810k908l223l721
57875B76837l944l991m224m317l741k818k236j872j257o71n93n52K06J318J913
57860B50058K231L205M745N771N891N737N783N983O386O966P081O228N039M373
57846C25477L849K539P66k49l10m01j093k092l281m723n774n602m560l794l536
57831B97216l132k604k674l217l208k419j697j452j189p90q13j219j249q72j001
57816B69680j837k327j893j440k002l335m595n483o103o365o162n645n003m339
57802B13151l768l181k072l33J054J139M93N13J416K240K712L477M361M127K558
$$ plain form
57906 276261 275565 274766 274031 274158 275168 276147 276715 277453 278549 279389 279945 281255 283792 286465 288057 288774 289669
57889 289669 291281 293436 295667 297232 297406 296305 294847 293524 291879 289499 286689 283781 280558 276837
57875 276837 272893 268902 264678 260361 256620 253802 251566 249694 248437 247766 247173 246621 246827 248145 250058
57860 250058 252289 255494 260239 266010 271901 277638 283421 289404 295790 302756 309837 316065 321104 325477
57846 325477 329326 331865 332631 332382 332072 331671 330578 328486 325205 320482 314708 309106 304546 300752 297216
57831 297216 294084 291480 288806 285589 282381 279962 278265 276813 275624 274834 274021 272802 271553 270681 269680
57816 269680 267843 265516 263623 262183 260181 256846 252251 246768 240665 234300 228138 222493 217490 213151
57802 213151 209383 206202 204130 203797 204851 205990 206483 206996 208412 210652 213364 216841 221202 225329 227887
57787B27887J214J254J851J749J257J531K646L614L864L767L861M276M819N150
57773B68740M977M399L865L651L574L208K184L89j714l186l569l540l999m773
57759B74206n029m665m349m287m086l768l789l898l151j377L82J258J429J321
57745B40197R12K77q2O8L37M02L55J90k38n64j61P35J152R34J057J983K798K648
57727B53000K051J973K449K898L091L094K767K111J619J654J828J498N34o95j713
57712B78159k055j631j176j673l006l999m071m025m612n253m976l870k786k068
57698B32958j450q17l39k3K44L09m2o89j369k003k616l109l375l391l064k314
57682B08910j361m46P55K799N468P843R561J1188J3112J4990J6799J9471K3796
$$ plain form
57787 227887 229101 230355 232206 233955 235212 236743 239389 243003 246867 250634 254495 258771 263590 268740
57773 268740 273717 278116 281981 285632 289206 292414 294598 294987 293273 290087 286518 282978 278979 274206
57759 274206 269177 264512 260163 255876 251790 248022 244233 240335 237184 235807 236189 237447 238876 240197
57745 240197 241109 241386 241304 241372 241709 242111 242466 242656 242418 241854 241693 242428 243580 244514 245571 247554 250352 253000
57727 253000 255051 257024 259473 262371 265462 268556 271323 273434 275053 276707 278535 280033 280567 279872 278159
57712 278159 276104 274473 273297 271624 268618 264619 260548 256523 251911 246658 241682 237812 235026 232958
57698 232958 231508 230691 230352 230329 230573 230882 230840 230151 228782 226779 224163 221054 217679 214288 211224 208910
57682 208910 207549 207103 207858 210657 216125 223968 233529 244717 257829 272819 289618 309089 332885
57669C32885K9294L4917M0117M4391M6223M3475L4934K1164M297j2635k6657l6015
57657E56390m0665m1597l9996l7001l3498k9683k5300k0620j6606j3798j1734
57646B45892r916q560p808o969n356l406k105j714j716j698j530j034j98M61M48
57631A94791N0n7K27M06J78l32r69j639k098k106j775j410j114q02m82k70l06
57614A82292q24j951l258l878l410k329j300m61K85Q11J000R27N40m05j648k342
57598A64049k149j853k221k829k812k275k042k294k392j983j470j220j058o95
57584A36756j94J56J26l12r41j383j448j282j115j088j420k202k945k859j950
57569A17899j196j210j401j096o96q85j280r85k10j10j009j859j646n26P28J632
$$ plain form
57669 332885 362179 397096 437213 481604 527827 571302 606236 627400 631697 619062 592405 556390
57657 556390 515725 474128 434132 397131 363633 333950 308650 288030 271424 257626 245892
57646 245892 235976 227416 219608 212639 207283 203877 201772 200058 198342 196644 195114 194080 193882 194343 194791
57631 194791 194841 194784 195011 195417 195595 195263 194294 192655 190557 188451 186676 185266 184152 183350 182868 182598 182292
57614 182292 181468 179517 176259 172381 168971 166642 165342 164881 165166 165977 166977 167904 168444 168039 166391 164049
57598 164049 161900 160047 157826 154997 152185 149910 147868 145574 143182 141199 139729 138509 137451 136756
57584 136756 136562 136718 136844 136532 135591 134208 132760 131478 130363 129275 127855 125653 122708 119849 117899
57569 117899 116703 115493 114092 112996 112300 111415 110135 109150 108940 108830 107821 105962 104316 103790 104518 106150
57553A06150J994J738J140Q42J241K050K670K727K164J141L0p67j166j341j305
57538A19308p93J97J096J213M84m63r21p25k89j47n29j207j620j213M0J333J633
57521A17397Q49N1J46P65J048J116J737K753K956J865N77L12R53J568J648J190
57505A36931K52q45j341q27J24O54N70J08p26j871k733k787k378k258k533k684
57489A17656k422j895j279p07m30n20o54n86n51o83n47J43P72N97j02m99n55j004
57471A06734j984k653k306j219k22Q7l64j125j510j222o41k37M0L79N39K68k5
57454I4539K25P55P65Q3n93o30o6O80J078O68m33j291j055k2P80Q42M72M0k80
57435I6557k07L65Q93Q00M69P28J443J619R57K90K32L91L14K93O95J228J365R92
$$ plain form
57553 106150 108144 109882 111022 111864 113105 115155 117825 120552 122716 123857 123887 123120 121954 120613 119308
57538 119308 118515 118712 119808 121021 121505 121042 120121 119396 119107 118960 118431 117224 115604 114391 114431 115764 117397
57521 117397 118246 118297 118443 119208 120256 121372 123109 125862 128818 130683 131260 131572 132525 134093 135741 136931
57505 136931 137183 136338 134997 134170 134294 134948 135518 135626 134900 133029 130296 127509 125131 122873 120340 117656
57489 117656 115234 113339 112060 111353 110923 110403 109749 109163 108612 107929 107382 107525 108297 108894 108792 108293 107738 106734
57471 106734 104750 102097 99791 98572 98350 98437 98073 96948 95438 94216 93575 93338 93378 93757 94296 94564 94539
57454 94539 94764 95519 96284 96367 95774 95144 95078 95758 96836 97504 97071 95780 94725 94703 95483 96325 96797 96837 96557
57435 96557 96350 96715 97608 98408 98877 99605 101048 102667 103624 103914 104146 104537 104851 105144 105839 107067 108432 109424
57417A09424K11q44j666j503l05R39J361J210J214J413J279O73L0l48n95q74j029
57400A10590q10k73K06L00R0n3M9J49K9r7J43P47J470K204K875L108K643K002
57382A25372K066K902L554L228K190J226O80L09j84q16j380j674j746j899k299
57367A31529k654k570k127j776j708j742j791j963k109j767p76L85J110J309J319
57352A14669J356J329J153J064J404K123K667K591K122J721J259K71r42j259k19
57337A31309J176J723J517J530K132K835L170L070K569J815J240J139J238J157
57323A57620J003R87R38Q10J148K194L056K765J846J667K391K810K181J152O35
57308A83203P82J316J963K333K086J460J026R24R42J187J889K740L261L679M399
$$ plain form
57417 109424 109635 108791 107125 105622 105317 106256 107617 108827 110041 111454 112733 113406 113436 113088 112493 111619 110590
57400 110590 109780 109507 109713 110013 110103 110050 110099 110248 110277 110180 110323 111070 112540 114744 117619 120727 123370 125372
57382 125372 127438 130340 133894 137122 139312 140538 141218 141527 141343 140527 139147 137473 135727 133828 131529
57367 131529 128875 126305 124178 122402 120694 118952 117161 115198 113089 111322 110546 110931 112041 113350 114669
57352 114669 116025 117354 118507 119571 120975 123098 125765 128356 130478 132199 133458 133729 132787 131528 131309
57337 131309 132485 134208 135725 137255 139387 142222 145392 148462 151031 152846 154086 155225 156463 157620
57323 157620 158623 159610 160548 161358 162506 164700 167756 170521 172367 174034 176425 179235 181416 182568 183203
57308 183203 183985 185301 187264 189597 191683 193143 194169 195093 196035 197222 199111 201851 205112 208791 213190
57293B13190M926M528L744L793M516M538L639L280M235N371N612N560O126O882
57279B79940O973O691O806P129O939O263N662N198M613M121M108M276M029L389
57265C56137K902K801K899L060L220L244L228L650M759O091O982P222O946O373
57251D19514N991O369P377Q152Q237Q112Q244Q298P949P679Q136R217J0430J1597
57237E35302J2556J2824J2257J1521J1239J1154J0852J0705J1310J2494J3600
57226F65814J4376J4884J5039J4946J5234J6219J7287J7735J7843J8263J8888
57215H46528J9240J9492K0150K1039K1535K1501K1176K0420J9077J7793J7479
57204A065430J8086J8863J9639K0832K2280K3212K3498K3946K5132K6756K8352
$$ plain form
57293 213190 218116 222644 226388 230181 234697 239235 242874 246154 250389 255760 261372 266932 273058 279940
57279 279940 286913 293604 300410 307539 314478 320741 326403 331601 336214 340335 344443 348719 352748 356137
57265 356137 359039 361840 364739 367799 371019 374263 377491 381141 385900 391991 398973 406195 413141 419514
57251 419514 425505 431874 439251 447403 455640 463752 471996 480294 488243 495922 504058 513275 523705 535302
57237 535302 547858 560682 572939 584460 595699 606853 617705 628410 639720 652214 665814
57226 665814 680190 695074 710113 725059 740293 756512 773799 791534 809377 827640 846528
57215 846528 865768 885260 905410 926449 947984 969485 990661 1011081 1030158 1047951 1065430
57204 1065430 1083516 1102379 1122018 1142850 1165130 1188342 1211840 1235786 1260918 1287674 1316026
57193A316026K9824L1039L1680L1851L2151L2853L3506L3666L3523L3469L3512
57182A673100L3406L3050L2401L1263K9467K7269K5396K4666K5422K7189K8989
57171A991618L0143L0689L0979L1223L1573L2306L3587L5197L6774L8146L9232
57160B361467L9883M0144M0357M0817M1558M2635M4186M5903M6972M6993M6595
57149B837510M6678M7261M7487M6502M3986M0130L5480L0614K5729K0763J6026
57138C238166J2247R771Q286P655Q364J0767J4442J8744K3500K8648L3680L7979
57126C452249M1331M3673M4830M4839M4116M3028M2010M2355M5988N3763O4404
57115C962586P5617Q5641R3600R9494J04637J11416J21766J36290J55101J78702
$$ plain form
57193 1316026 1345850 1376889 1408569 1440420 1472571 1505424 1538930 1572596 1606119 1639588 1673100
57182 1673100 1706506 1739556 1771957 1803220 1832687 1859956 1885352 1910018 1935440 1962629 1991618
57171 1991618 2021761 2052450 2083429 2114652 2146225 2178531 2212118 2247315 2284089 2322235 2361467
57160 2361467 2401350 2441494 2481851 2522668 2564226 2606861 2651047 2696950 2743922 2790915 2837510
57149 2837510 2884188 2931449 2978936 3025438 3069424 3109554 3145034 3175648 3201377 3222140 3238166
57138 3238166 3250413 3260184 3268470 3276125 3284489 3295256 3309698 3328442 3351942 3380590 3414270 3452249
57126 3452249 3493580 3537253 3582083 3626922 3671038 3714066 3756076 3798431 3844419 3898182 3962586
57115 3962586 4038203 4123844 4217444 4316938 4421575 4532991 4654757 4791047 4946148 5124850
57105E124850K07826K43457K87755L43957M14882N02599O10023P41544R01194
57096I378087J091009J311355J561516J839860K145193K477869K836867L214148
57088B5855904L590846L932474M178949M244012M049071L582939K931497K233104
57080E4598796J591666J028499N09982O834m78104r24716j319964j666351j976367
57071E1370275k262473k527343k759957k942427l061939l115755l106785l038635
57063B8554961k915869k745664k536942k299675k046880j795756j563669j361237
57055A1289269j189093j041225r11397p96850o97295o12102n39420m77256m24017
57046D600614l77901l36977l00251k67753k39255k13787j90657j69893j51270
$$ plain form
57105 5124850 5332676 5576133 5863888 6207845 6622727 7125326 7735349 8476893 9378087
57096 9378087 10469096 11780451 13341967 15181827 17327020 19804889 22641756 25855904
57088 25855904 29446750 33379224 37558173 41802185 45851256 49434195 52365692 54598796
57080 54598796 56190462 57218961 57728943 57735777 57257673 56332957 55012993 53346642 51370275
57071 51370275 49107802 46580459 43820502 40878075 37816136 34700381 31593596 28554961
57063 28554961 25639092 22893428 20356486 18056811 16009931 14214175 12650506 11289269
57055 11289269 10100176 9058951 8147554 7350704 6653409 6041307 5501887 5024631 4600614
57046 4600614 4222713 3885736 3585485 3317732 3078477 2864690 2674033 2504140 2352870
57037B352870j33961j17596j02536q8598p4632n9919m4801k9497j3773J062J1088
57026A699707J2098K625j5628l8850o1754p8862q7372q8560q5526q0214p3427
57015A104237o6276n9801n3770m7450m1236l6160l2267k8735k5294k2264j9617
57004F71367j7253j5769j5597j5673j4433j2003j0006r242q880q096p166o559
56992E30690o034n034l305r26J690L769M905N693O964Q408Q683O846L043k097
56978E63295p855j3224j7160j9237j9676j8811j7063j5176j3758j2640j1197r154
56966C88344o584l477l6L058N453P859J1127J4848J7740J9127J9153J7684J4110
56953E08406Q251P21p502j5100k0386k2343k1733k0207j8398j5838j2580r613
$$ plain form
57037 2352870 2218909 2101313 1998777 1910179 1835547 1775628 1730827 1701330 1687557 1688619 1699707
57026 1699707 1711805 1714430 1698802 1659952 1598198 1519336 1431964 1343404 1257878 1177664 1104237
57015 1104237 1037961 978160 924390 876940 835704 799544 767277 738542 713248 690984 671367
57004 671367 654114 638345 622748 607075 592642 580639 570633 561391 552511 544415 537249 530690
56992 530690 524656 519622 516317 515391 517081 520850 525755 531448 538412 546820 555503 562349 565392 563295
56978 563295 555440 542216 525056 505819 486143 467332 450269 435093 421335 408695 397498 388344
56966 388344 381760 378283 378247 381305 386758 394617 405744 420592 438332 457459 476612 494296 508406
56953 508406 516657 517378 509876 494776 474390 452047 430314 410107 391709 375871 363291 353678
56941C53678p403n181k125J567N252Q717J2204J6070K0506K4978K8009K8225K5647
56928E10144K1090J4548N392n600j5843k3200k7666l0203l0994k9777k7084k4052
56916C36755k1273j8721j6509j4841j3364j1412r042p153o281n836m915l592k772
56903B01044k784k733j651J03J224J228J031J618K888M215N482O908Q401R841
56889B36815J1612J4078J6752J8704J9474J8979J6794J2544O872J174l638p421
56877C62739r987j0953j0439r075p169m588j533J372L951O641R601J2448J5144
56864C58152J8401K2738K7778L2763L7148M0163M0387L6411K7913J5873K115j1137
56852F48705k1716k8223l0558k9722k7080k3534j9205j3839p677j566L938R226
$$ plain form
56941 353678 346275 341094 338969 340536 345788 354505 366709 382779 403285 428263 456272 484497 510144
56928 510144 531234 545782 551174 545574 529731 506531 478865 448662 417668 387891 360807 336755
56916 336755 315482 296761 280252 265411 252047 240635 231593 224440 218159 212323 207408 203816 201044
56903 201044 198260 195527 193876 193979 195203 196431 197462 199080 201968 206183 211665 218573 226974 236815
56889 236815 248427 262505 279257 297961 317435 336414 353208 365752 372624 373798 370160 362739
56877 362739 352752 341799 331360 322285 315116 310528 308995 310367 314318 320959 330560 343008 358152
56864 358152 376553 399291 427069 459832 496980 537143 577530 613941 641854 657727 659842 648705
56852 648705 626989 598766 568208 538486 511406 487872 468667 454828 447151 445585 449523 458749
56840D58749J5030K1545K8651L6458M4905N3089N9751O4117O5289O1228M9693
56829I58505L0631O977j7003l7469n1586n8164n8405n5105n0301m4246l6850k8986
56817E57998k1670j4877q106j510M508J0444J7423K5670L3928M0468M4251M4912
56805G33439M1909L4063K0444K013j7737l4431m5408n0662n1601m9607m5757m0958
56793D95707l5734l0191k4482j8939j3577q083k548K367O399J0246J4670J9359
56781D15194K3153K5007K4237K0269J2959L221p130j6417k3750k8765l1223l1202
56769C85553k9520k7419k5555k3425k0271j6458j3359j1710j0720r327p701o715
56757A83373o449o159n544m988m544l734k577j802j741j792j489j222j381j534
$$ plain form
56840 458749 473779 495324 523975 560433 605338 658427 718178 782295 847584 908812 958505
56829 958505 989136 996113 979110 941641 890055 831891 773486 718381 668080 623834 586984 557998
56817 557998 536328 521451 513345 511835 516343 526787 544210 569880 603808 644276 688527 733439
56805 733439 775348 809411 829855 831868 814131 779700 734292 683630 632029 582422 536665 495707
56793 495707 459973 429782 405300 386361 372784 364701 362153 364520 370919 381165 395835 415194
56781 415194 438347 463354 487591 507860 520819 524040 516910 500493 476743 447978 416755 385553
56769 385553 356033 328614 303059 279634 259363 242905 229546 217836 207116 197789 190088 183373
56757 183373 176924 170765 165221 160233 155689 151955 149378 147576 145835 144043 142554 141332 139951 138417
56743A38417j161n89m88p96q55m42nP4o7j00L9J83J67P8J95O58J126J053L96j67
56723A37716J06J272K637L379L184K373J478P72K83J28M41Q95Q26J39l99j87L82
56706A55425N99M14J68j95p84j073m70O28J226J070P41N87M52L98P35J271J414
56689A62606J130J006J315J751K101K364K241J467N72M07Q94J206J168J317J562
56674A83107J094q5q45o27k97o93j365j430q17k5N92P33J72o40q00k04K19k7k65
56655A77797J26O95Q04O55P29R45R83Q10L69n15j423j487p29l18q57j463j264
56638A75857q03r67j458j389p08K8O45J176J241O27p5k83l63q51j335j181q01
56621A69360j086j916k349k103j780j638j181q8J169J845J611P47j5l0N82J021
$$ plain form
56743 138417 137256 136667 136179 135383 134528 134086 134081 134155 134088 133988 134027 134210 134377 134455 134650 135308 136434 137487 137883 137716
56723 137716 137822 139094 141731 145110 148294 150667 152145 152917 153200 153328 153769 154664 155490 155629 155230 155043 155425
56706 155425 156024 156438 156606 156411 155627 154554 154084 154712 155938 157008 157749 158336 158788 159186 159921 161192 162606
56689 162606 163736 164742 166057 167808 169909 172273 174514 175981 176553 176960 177854 179060 180228 181545 183107
56674 183107 184201 184116 183271 182644 182347 181654 180289 178859 178042 178017 178609 179342 179514 178874 178074 177870 178089 178062 177797
56655 177797 177923 178618 179422 180077 180806 181751 182734 183544 183913 183398 181975 180488 179759 179441 178584 177121 175857
56638 175857 175054 174087 172629 171240 170532 170560 171205 172381 173622 174249 174174 173891 173528 172677 171342 170161 169360
56621 169360 168274 166358 164009 161906 160126 158488 157307 157219 158388 160233 161844 162591 162576 162546 163128 164149
56605A64149Q16L32l7n16j294j841j540n96K74O98P17M34Q0K7K57L23J04M8K52
56586A62687J54m36p83l63L09O38R18J542K075J986J625J565J615J407J249J524
56570A77712J812J610J329J649K521L534M692N896O505O366O497P693R173R739
56556B46728R398Q600O829L574k4k200k840l096l212k525j361r57j466j791j587
56541B54070j687k235k214j397j037j861k768k545j744j737k664l431l283k559
56527B22908k033k124k693l265l449l136k390j320l04P0l24q78j026r27r02p94
56511A97413m34k57o31j065r36m75l13m64p13j328k349k774j739q6N93J50k63
56494A84329j52l0M9O15J399J365M44k25r1R6j74k69L85J360K090K676L238L295
$$ plain form
56605 164149 164965 165297 165260 164744 163450 161609 160069 159473 159747 160445 161162 161596 161676 161703 161960 162283 162387 162435 162687
56586 162687 162841 162405 161622 161259 161568 162206 163124 164666 166741 168727 170352 171917 173532 174939 176188 177712
56570 177712 179524 181134 182463 184112 186633 190167 194859 200755 207260 213626 220123 227816 236989 246728
56556 246728 256126 264726 271555 275129 275105 272905 270065 266969 263757 261232 259871 258914 257448 255657 254070
56541 254070 252383 250148 247934 246537 245500 243639 240871 238326 236582 234845 232181 228750 225467 222908
56527 222908 220875 218751 216058 212793 209344 206208 203818 202498 202194 202264 201940 201062 200036 199109 198207 197413
56511 197413 196979 196722 196091 195026 194090 193615 193302 192838 192125 190797 188448 185674 183935 183849 184442 184592 184329
56494 184329 184177 184147 184196 184811 186210 187575 188019 187794 187703 187799 187625 187356 187741 189101 191191 193867 197105 200400
56476B00400K471J159M5n47n70j33L88O71R08J382J671J184K75j12N6j36r79j593
56458B06540j226j97P36J115P92K6l52J94R28P46l9n3R14J484Q75O3J19O28O42
56439B13935J90n1J22M48P82J004P81N8o12o85k71Q1%n40j200j424r79l51j56
56420B11132k71j44K29L63K21K68N76P17N53L97L80L60M05O01N73mo09m73J54
56401B15428L19k13q24j126j122n23Q89K281K456J546Q02O95N90K82M32J202J759
56384B24873J601J231J116J070R16Q13O99L30mJ86O11N73K09J76L07p1n98k06
56366B33832J029J909K004J947J801R22l66p22J98J239J590J483J003p0j007p23
56350B46069J75j04j558k183j220k54l00k44P47J552J293J030J740K570K626K687
$$ plain form
56476 200400 202871 204030 204075 203528 202958 202825 203213 203884 204792 206174 207845 209029 209304 209192 209248 209112 208133 206540
56458 206540 205314 205117 205853 206968 207760 207786 207434 207628 208556 209302 209263 209210 210124 211608 212483 212546 212665 213293 213935
56439 213935 214125 214074 214196 214644 215426 216430 217211 217269 216657 215972 215701 215782 215782 215242 214042 212618 211639 211288 211132
56420 211132 210861 210717 210946 211309 211530 211798 212374 213091 213644 214041 214421 214781 215186 215787 216360 216356 215747 215274 215428
56401 215428 215747 215534 214710 213584 212462 211939 212828 215109 217565 219111 219913 220608 221198 221480 221912 223114 224873
56384 224873 226474 227705 228821 229891 230807 231620 232319 232649 232645 232831 233442 234015 234224 234400 234707 234636 234038 233832
56366 233832 234861 236770 238774 240721 242522 243444 243078 242356 242554 243793 245383 246866 247869 247799 246792 246069
56350 246069 246244 246140 244582 242399 241179 240925 240625 240381 241128 242680 243973 245003 246743 249313 251939 254626
56334B54626L538M303M130L865M348M629L727K688K994M097M493M145L937L718
56320C09238K769J531J027J100P80l7o65q92r43p16q5N85J091J787K598K708K039
56303C23915J811K641L507L655L984N125N784M725L002K298K313J818J214J813
56289C67605L293M096L912L875M533N347N949O342O243N632N522O674Q112Q422
56275D45557Q014Q435R865J0986J1069J0663J0377J0444J1294J3231J5584J7416
56263E82935J8849K0657K2949K5376K8206L1940L6221M0371M4650M9821N5800
56252I57775O1876O7986P4628Q1877Q9346R6795J03953J10175J15110J19054J21944
56241B000519J22787J20858J16482J09805R9929Q6366P0179N2514L3272J2503
$$ plain form
56334 254626 258164 262467 266597 270462 274810 279439 283166 285854 288848 292945 297438 301583 305520 309238
56320 309238 312007 313538 314565 315665 316445 316408 315743 314851 313908 313192 313107 313692 314783 316570 319168 321876 323915
56303 323915 325726 328367 331874 335529 339513 344638 350422 355147 358149 360447 362760 364578 365792 367605
56289 367605 370898 374994 378906 382781 387314 392661 398610 404952 411195 416827 422349 429023 437135 445557
56275 445557 453571 462006 471871 482857 493926 504589 514966 525410 536704 549935 565519 582935
56263 582935 601784 622441 645390 670766 698972 730912 767133 807504 852154 901975 957775
56252 957775 1019651 1087637 1162265 1244142 1333488 1430283 1534236 1644411 1759521 1878575 2000519
56241 2000519 2123306 2244164 2360646 2470451 2570380 2656746 2726925 2779439 2812711 2825214
56231B825214q177k7111m4456o0888p5648q7472r6423j03073j06981j07841j07055
56220B000089j06194j04756j01436r6704r2019q7271q1294p4374o8080o2891n8011
56209A067059n3193m8829m4611l9984l5591l2426k9908k6659k2855j9901j8126
56198F94976j6644j5208j4340j3772j2648j1069r836q878p582o288n793n771n382
56185E61765m898n027n101l961k143j198j218r60j50L52M36Q53J596J957K015
56170E44318K338K592K149J668K251L465M091M256M889N681N648N246N720O839
56156F01151P500Q040R620J1764J3008J3699J5588J8747K1486K3427K6209L0872
56144H01111L6847M3691N1668O0277O8256P5291Q1833Q7251R0061Q9865Q7238
$$ plain form
56231 2825214 2817037 2789926 2745470 2684582 2608934 2521462 2425039 2321966 2214985 2107144 2000089
56220 2000089 1893895 1789139 1687703 1590999 1498980 1411709 1330415 1256041 1187961 1125070 1067059
56209 1067059 1013866 965037 920426 880442 844851 812425 782517 755858 733003 713102 694976
56198 694976 678332 663124 648784 635012 622364 611295 601459 592581 584999 578711 572918 567147 561765
56185 561765 556867 551840 546739 542778 540635 539437 538219 537259 537109 537461 537897 538750 540346 542303 544318
56170 544318 546656 549248 551397 553065 555316 558781 562872 567128 572017 577698 583346 588592 594312 601151
56156 601151 608651 616691 626311 638075 651083 664782 680370 699117 720603 744030 770239 801111
56144 801111 837958 881649 933317 993594 1061850 1137141 1218974 1306225 1396286 1486151 1573389
56133A573389Q1943P3513O3420N4437M7804M2926L9450L7266L4734K9484K1264
56122B099630J1951K831o051j4164k0564k5791l1520l8330m5764n4111o3865p3637
56110A740615q0889q4522q4884q1925p5735o8068o0800n3475m4894l6172k9454
56099A039797k4532j9788j5481j2862j0902p658m073k633k765j658Q18K151K020
56086I42434K754M784N984N968O819Q845R736Q850Q353R180R665R114R043R959
56072A051488J0488J0542J1757J3977J4917J4097J3568J4094J4325J4233J5456
56061A198942J7558J7957J6378J5417J6004J6285J5657J5753J6715J6732J5977
56050A379375J6698J8776J9685J9408K0589K3182K4089K2949K3050K5317K6902
$$ plain form
56133 1573389 1655332 1728845 1792265 1846702 1894506 1937432 1976882 2014148 2048882 2078366 2099630
56122 2099630 2111581 2114412 2108361 2094197 2073633 2047842 2016322 1977992 1932228 1878117 1814252 1740615
56110 1740615 1659726 1575204 1490320 1408395 1332660 1264592 1203792 1150317 1105423 1069251 1039797
56099 1039797 1015265 995477 979996 967134 956232 948574 944501 941868 939103 937445 938263 940414 942434
56086 942434 945188 949972 955956 961924 968743 977588 987324 996174 1004527 1013707 1023372 1032486 1041529 1051488
56072 1051488 1061976 1072518 1084275 1098252 1113169 1127266 1140834 1154928 1169253 1183486 1198942
56061 1198942 1216500 1234457 1250835 1266252 1282256 1298541 1314198 1329951 1346666 1363398 1379375
56050 1379375 1396073 1414849 1434534 1453942 1474531 1497713 1521802 1544751 1567801 1593118 1620020
56039A620020K6970K8281L1371L2866L1632L1023L2831L4415L4189L4579L7072
56028A975249L9413M0221M1417M3836M5403M5667M7050M9777N0985N0616N2384
56017B482018N7036O0784O2397O5304P0467P4066P4904P7113Q2523Q7346Q9619
56006C283577R2839R8860J04280J07506J12162J19892J26963J31692J37864J47110
55996D462745J55558J61822J70270J82518J94093K03475K15641K32418K48684
55987F227224K62590K79800L02764L26078L47697L73903M07519M42460M76116
55978I446151N15373N63959O16211O70378P34872Q13921R01060R95079J107624
55969A6364628J246235J405957J587672J807939K080439K406721K797347L281728
$$ plain form
56039 1620020 1646990 1675271 1706642 1739508 1771140 1802163 1834994 1869409 1903598 1938177 1975249
56028 1975249 2014662 2054883 2096300 2140136 2185539 2231206 2278256 2328033 2379018 2429634 2482018
56017 2482018 2539054 2599838 2662235 2727539 2798006 2872072 2946976 3024089 3106612 3193958 3283577
56006 3283577 3376416 3475276 3579556 3687062 3799224 3919116 4046079 4177771 4315635 4462745
55996 4462745 4618303 4780125 4950395 5132913 5327006 5530481 5746122 5978540 6227224
55987 6227224 6489814 6769614 7072378 7398456 7746153 8120056 8527575 8970035 9446151
55978 9446151 9961524 10525483 11141694 11812072 12546944 13360865 14261925 15257004 16364628
55969 16364628 17610863 19016820 20604492 22412431 24492870 26899591 29696938 32978666
55961C2978666L882409M599234N431229O390313P481818Q705745J0098672J1740998
55953I1309084J3701154J6013567J8728664K1899661K5428414K8939689L1837048
55946B47857281L3387804L2667490K8620064K0614112R233572l555697j5265019
55939C53559607k4088417k9455923l1730778l1643657k9966614k7397599k4470089
55932A54806530k1503146j8659419j6033974j3678775j1598620r780414q222148
55925E5330034o917085n832813m929490m183205l574555l072403k647687k289835
55917B1882961j994141j745904j530594j346813j195452j066980r51398q50144
55909A1201535p66707o95272o29056n70327n22228m79609m37396l99266l69049
$$ plain form
55961 32978666 36861075 41460309 46891538 53281851 60763669 69469414 79568086 91309084
55953 91309084 105010238 121023805 139752469 161652130 187080544 216020233 247857281
55946 247857281 281245085 313912575 342532639 363146751 372380323 368824626 353559607
55939 353559607 329471190 300015267 268284489 236640832 206674218 179276619 154806530
55932 154806530 133303384 114643965 98609991 84931216 73332596 63552182 55330034
55925 55330034 48412949 42580136 37650646 33467441 29892886 26820483 24172796 21882961
55917 21882961 19888820 18142916 16612322 15265509 14070057 13003077 12051679 11201535
55909 11201535 10434828 9739556 9110500 8540173 8017945 7538336 7100940 6701674 6332625
55900F332625l41931l12951k86071k66055k49096k30009k11558j98188j87141
55891D049625j73870j60186j49427j39366j27214j16011j09148j03864r6918r1250
55881B782371r0382r1334q9642q6511q4795q2663p7575p2008o9140o7126o3397
55870A907798o0226o0178o0402n7252n2657n0122m8376m4687m0749l9457l9260
55859A354432l7235l4622l3938l3775l1678k9135k8540k8180k5445k2089k1237
55848A028558k1870k1287k0299k0977k1824k0348j8092j8091j9379j8959j7265
55837H10167j6764j6929j5469j3080j2365j3138j3096j2039j1448j1002r320p098
55825F58419o004n700n152n338p406r745j0287j0008j0732j1330r792p355o701
$$ plain form
55900 6332625 5990694 5677743 5391672 5125617 4876521 4646512 4434954 4236766 4049625
55891 4049625 3875755 3715569 3566142 3426776 3299562 3183551 3074403 2970539 2873621 2782371
55881 2782371 2691989 2600655 2511013 2424502 2339707 2257044 2179469 2107461 2038321 1971195 1907798
55870 1907798 1847572 1787394 1726992 1669740 1617083 1566961 1518585 1473898 1433149 1393692 1354432
55859 1354432 1317197 1282575 1248637 1214862 1183184 1154049 1125509 1097329 1071884 1049795 1028558
55848 1028558 1006688 985401 965102 944125 922301 901953 883861 865770 846391 827432 810167
55837 810167 793403 776474 761005 747925 735560 722422 709326 697287 685839 674837 665517 658419
55825 658419 652415 646715 641563 636225 628819 619074 608787 598779 588047 576717 566925 559570 552869
55812E52869p437p163n794n085m883l515j160M86J153J749K110J824K061L743
55798E30958N209M554K834J973J158j384m557n927n901o750q434q955q131p662
55784D88985p942p978q015r209j1133j2356j2916j3622j3705j1900r090p130n929
55771C58060m352k950k909l348k663j627k055l298l329k426k462l241l021k178
55757C18201k729m465n090m166l475l348k150J00J073j13j553j893k159l187l873
55742B81173l253k180j746j813k012k567l412l841l729l697l764l234k177j556
55728B42192j701j979k162k693l473l769l415k947k516j864j284j375j994k500
55714B08520k706k581j657M3J201P81l26o34k98m08q48o69%K17j14m86j071k147
$$ plain form
55812 552869 545432 538269 532475 527390 522507 518992 517832 518318 519471 521220 523330 525154 527215 530958
55798 530958 536167 540721 543555 545528 546686 545302 540745 534818 528917 522167 513733 504778 496647 488985
55784 488985 481043 473065 465050 455841 444708 432352 419436 405814 392109 380209 371119 363989 358060
55771 358060 353708 350758 347849 344501 341838 340211 338156 334858 331529 329103 326641 323400 320379 318201
55757 318201 315472 311007 305917 301751 298276 294928 292778 292878 293951 293838 292285 290392 288233 285046 281173
55742 281173 277920 275740 273994 272181 270169 267602 264190 260349 256620 252923 249159 245925 243748 242192
55728 242192 240491 238512 236350 233657 230184 226415 223000 220053 217537 215673 214389 213014 211020 208520
55714 208520 205814 203233 201576 201619 202820 203601 203275 202641 202343 201935 201087 200418 200418 200635 200521 200035 198964 196817
55696A96817k939k720k289k650l098k519j517j196q29Q03K696K920J931J843K799
55681A90052K974K038J678K485L056K622K125K151K106J918K361L200L115J941
55667B23822J012Q65N76k12o50m90n98j150j212o26m65j052j335p18J18P20J425
55650B20030K017J554R7j094j532k043k923l364l203l534m845o071o193n410m274
55635A79212l011k147k353l189l385k711k194k220k014j290q18q58o06K09O90
55620A53315K41n96j233j687j830j331o41o93j341j569j301j487k157k229j522
55605A33939j142j437j389o48l22r89j627j381q27o95p55q13j351k302k582j693
55589A13986n80j11Q3N31R44J072J276J569J314O00O52K002L461L757L180K808
$$ plain form
55696 196817 193878 191158 188869 186219 183121 180602 179085 177889 177060 177863 180559 183479 185410 187253 190052
55681 190052 193026 195064 196742 199227 202283 204905 207030 209181 211287 213205 215566 218766 221881 223822
55667 223822 224834 225699 226275 226063 225413 224923 224325 223175 221963 221337 220872 219820 218485 217767 217885 218605 220030
55650 220030 222047 223601 223698 222604 221072 219029 216106 212742 209539 206005 201160 195089 188896 183486 179212
55635 179212 176201 174054 171701 168512 165127 162416 160222 158002 155988 154698 153880 153022 152416 152625 153315
55620 153315 153556 152960 151727 150040 148210 146879 146238 145545 144204 142635 141334 139847 137690 135461 133939
55605 133939 132797 131360 129971 129323 129001 128012 126385 125004 124177 123482 122727 121914 120563 118261 115679 113986
55589 113986 113406 113295 113378 113909 114853 115925 117201 118770 120084 120684 121336 123338 126799 130556 133736 136544
55573A36544L055L759M826N981O616O412N606M433L081K111J858J480m3k102l087
55558A80530k880k940l718l972l105k250k162j977j089n75j455k898l508l238
55544A44763k862k540j988j324q55o38p39j207j444p66K03j7j479k443j856p15
55528A24093k98m92o73q53j101j086r45j374k273k651k415k584l139k613p64M08
55512A01240l71j584j383m02l17j059j440j378j545j653r34K34Q32Q57J040J434
55496I3571J569J492J511J415J021P84Q93N37p65k008k038j231o07k22K82L96
55480I6600l99j227q56L19Q52L95j46k80l51m88m39l42n37q15p94p07q78q55j37
55461H8915O47M84m88j217j286j039n79K44J058J338J307J527J744J282L46j00
$$ plain form
55573 136544 139599 143358 148184 154165 160781 167193 172799 177232 180313 182424 184282 185762 185719 183617 180530
55558 180530 177650 174710 170992 167020 163915 161665 159503 157526 156437 155862 154407 151509 148001 144763
55544 144763 141901 139361 137373 136049 135194 134556 133817 132610 131166 130400 130603 130586 129107 126664 124808 124093
55528 124093 123795 123303 122630 121777 120676 119590 118645 117271 114998 112347 109932 107348 104209 101596 100832 101240
55512 101240 100869 99285 97902 97500 97183 96124 94684 93306 91761 90108 89174 89408 90240 91097 92137 93571
55496 93571 95140 96632 98143 99558 100579 101363 102256 102793 102028 100020 97982 96751 96144 95922 96204 96600
55480 96600 96201 94974 94118 94437 95289 95684 95538 95258 94907 94419 93980 93638 93101 92286 91492 90785 89907 89052 88915
55461 88915 89562 90046 89558 88341 87055 86016 85437 85681 86739 88077 89384 90911 92655 93937 94283 94183
55445I4183K26O17M98M5l17l50pM29M55J8k40JO5o66j577j581o27M23J000J112
55425I3707Q31L36J26L70M19k54j031r64j36N91Q79J012J042P52K12l25q41j281
55407I5445j317r48q02j113j111k52P00P35R2l04l12l53m02k34j76m52l91N41
55389H9346J535J594J274J684K363J836J34j109j157j042j546j941j438n60k57
55374I0716m95n35o2N23O28N2p75j080o88l71q34j642j865j419q99m23L76J330
55356H2537J721J390R27P43P17Q11J164J506J274M95j78m33o51j142j615j616
55340H7650j084l65N1j23n88o70j65M04O58R07J366J516R86L53L07N55M37R5M2
55321I2332R1k38o78o23k14m4j43k45n92j314j519l19J561K488K076J286P23J89
$$ plain form
55445 94183 94409 95026 95524 95569 95252 94902 94895 95324 95779 95797 95557 95558 95623 94957 93380 91799 91172 91595 92595 93707
55425 93707 94538 94874 95000 95370 95789 95535 94504 93540 93404 93995 94874 95886 96928 97680 97892 97567 96726 95445
55407 95445 94128 93180 92378 91265 90154 89902 90602 91337 91429 91125 90813 90460 90058 89824 89648 89196 88805 89346
55389 89346 90881 92475 93749 95433 97796 99632 99766 98657 97500 96458 94912 92971 91533 90973 90716
55374 90716 90221 89686 89624 90147 90775 90827 90052 88972 88284 87913 87079 85437 83572 82153 81254 80831 81207 82537
55356 82537 84258 85648 86575 87318 88035 88846 90010 91516 92790 93285 93107 92674 92023 90881 89266 87650
55340 87650 86566 86201 86252 86129 85541 84871 84706 85110 85768 86675 88041 89557 90543 90896 91203 91758 92195 92290 92332
55321 92332 92423 92185 91507 90884 90670 90626 90483 90238 89646 88332 86813 86494 88055 90543 92619 93905 94628 94817
55303I4817k54k11m9n59j493j742j104n15l42N8Q73J298R24M01K75K90K81N92
55285I3540J120J071J82p39j015r16q86q76q44r90j066m34P65J427J001K85J95
55268I1820N44O40L67P6r4k38m41p53j016o82N23J820K093J348N87K35k02q05
55250I5822q91l87k42q61j266o03N02R04M78o7k68j07L11O27L37m72r93p67k54
55231I1803K2J96M36L61k38p72o25r1J01k44p73j181j287q84K9J040J660J609
55213I1162P14r18k491k901j858j92J109J652J469Q68N79J139J920J646J71j176
55197I2893j419j092j053j155q54l43j71l11l65k63j10K12O84R38Q42Q53J188
55180I0474J250N43l92o09pP01J002J019J080J234J128L45q87j439n02J065J521
$$ plain form
55303 94817 94563 94352 94303 93744 92251 90509 89405 88890 88548 88606 89479 90777 91701 92102 92377 92667 92948 93540
55285 93540 94660 95731 95913 95174 94159 93243 92357 91481 90637 89647 88581 88147 88912 90339 91340 91625 91820
55268 91820 92364 93004 93371 93447 93353 93115 92674 91921 90905 90223 90746 92566 94659 96007 96594 96829 96627 95822
55250 95822 94931 94544 94302 93441 92175 91572 92074 92978 93456 93389 93121 93014 93325 93952 94289 93817 92824 92057 91803
55231 91803 91825 92021 92457 92818 92580 91808 91183 91092 91193 90949 90176 88995 87708 86824 86853 87893 89553 91162
55213 91162 91876 90958 88467 85566 83708 83516 84625 86277 87746 88614 89193 90332 92252 93898 94069 92893
55197 92893 91474 90382 89329 88174 87320 86977 86806 86495 86130 85867 85757 85969 86653 87591 88433 89286 90474
55180 90474 91724 92267 91875 91266 91259 91960 92962 93981 95061 96295 97423 97768 96881 95442 94940 96005 97526
55163I7526N45m31m28j45l73n33P9P71M62m50p09j62J75j97p60j049j140j022
55145I2159m70L11O76L69k06o17p61o48l29o8j07k29J2O45J184J161N92j2J8Q29
55125I4509J634J420K40p34p86n31p56j106p26L17J089J046M35k94q61r91n53
55108I3352K00R11J454J720J424O20j1R7O00P47L80q9l23k44J66O69P44K98ML84
55088A03103R35Q03o6j031j623j665j002R3P09L58j26L07J294J608J035N86Q50
55071A06168J278J268R29N30O9k89j96J63R6n52j144j285j354j658j771j223k90
55054A00739L67M51O8n34q95n11N07J278J125L64k08l48m31p19j012j017o95k21
55036I8308J78L42K31k7k29k21JK91M36L36P6j70k25R5Q26J601J805J183J70n95
$$ plain form
55163 97526 98071 97640 97212 97067 96694 96161 96240 97011 97473 97023 96314 96152 96327 96130 95370 94321 93181 92159
55145 92159 91689 92000 92676 93045 92839 92222 91461 90813 90484 90416 90309 90080 90092 90737 91921 93082 93674 93662 93680 94509
55125 94509 96143 97563 97803 97069 96283 95752 94996 93890 93164 93481 94570 95616 96051 95757 94896 93905 93352
55108 93352 93552 94463 95917 97637 99061 99681 99670 99767 100367 101114 101494 101405 101082 100838 101004 101673 102417 102715 102719 103103
55088 103103 104038 104841 104775 103744 102121 100456 99454 99547 100256 100614 100488 100795 102089 103697 104732 105318 106168
55071 106168 107446 108714 109643 110173 110242 109953 109757 109920 110016 109464 108320 107035 105681 104023 102252 101029 100739
55054 100739 101106 101557 101625 101091 100196 99685 100192 101470 102595 102959 102751 102403 101972 101253 100241 99224 98529 98308
55036 98308 98486 98828 99059 99032 98803 98582 98583 98874 99310 99646 99722 99552 99327 99422 100248 101849 103654 104837 105007 104412
55016A04412q40n87P8Q72J229Q42Q2m90p74r43q80m20J05K98M69J213K250K570
54998A09486J924J263J259J216K61j076j387m03N65L97l64l72O29J456J053k02
54982A15705j049q55j63J03l74j189j689j469o82M1K30J87O25J624K369K184J386
54965A16984P22L29j87q61j198q73j96K52J69l28q48r77o42j79M9P3J10J29o5
54946A12463m04n73m60k95l16m89o27n55k02L03O41O21N02P60J495K199K274J691
54928A19028J074J142K015L147L875M000L787L580L659M216N029N326M438K707
54914A67023J168K78n54j890l421m470m941n169n241m954m225l160j970j026p30
54899A26718r60j063p19m42p53j341j557j326q89q8J291K654K980K131J091P48
$$ plain form
55016 104412 103572 102985 103063 103935 105164 106006 106088 105598 104824 103881 103001 102581 102686 102984 103453 104666 106916 109486
54998 109486 111410 112673 113932 115148 115409 114333 112946 112543 113108 113505 113141 112769 113398 114854 115907 115705
54982 115705 114656 113801 113638 113741 113367 112178 110489 109020 108338 108379 108609 108796 109421 111045 113414 115598 116984
54965 116984 117706 118035 117848 116987 115789 114916 114720 114972 115141 114813 113965 112988 112346 112167 112216 112289 112399 112528 112463
54946 112463 112059 111486 111026 110731 110415 109926 109299 108744 108542 108845 109486 110107 110609 111369 112864 115063 117337 119028
54928 119028 120102 121244 123259 126406 130281 134281 138068 141648 145307 149523 154552 159878 164316 167023
54914 167023 168191 168469 167915 166025 162604 158134 153193 148024 142783 137829 133604 130444 128474 127448 126718
54899 126718 125758 124695 123976 123534 122781 121440 119883 118557 117668 117580 118871 121525 124505 126636 127727 128475
54883A28475J111J777K574L397L988M206M207M095L673K835J926J423J294R95
54869A65976Q7j274k590l613m397m814m481l509k801k995l329k529p91K43k57
54854A28926j157j144o16q28j869k700k762k472k178j770j295j090j136r79m73
54839A06457n1p7m69q97r80l77P62J608J471O96K01K38K67l6l93m74k09M52J366
54820A09555J888J398K32o01o82m42j84K64P96Q01J03n85o16k21RoQ3M25Q55J167
54800A14239J337J494J741J856J461O96L89R70J645J398N11J11L54K18p26j539
54784A26155j376o42j03K78Q73J419J412R78O52N73N19N36R23J758K779L675M236
54767A44645M394M370M541M991N402N440M961L815J989m9j688k893m062n087n365
$$ plain form
54883 128475 129586 131363 133937 137334 141322 145528 149735 153830 157503 160338 162264 163687 164981 165976
54869 165976 166063 164789 162199 158586 154189 149375 144894 141385 138584 135589 132260 129731 128940 129183 128926
54854 128926 127769 126625 126009 125181 123312 120612 117850 115378 113200 111430 110135 109045 107909 106930 106457
54839 106457 106406 106329 105860 104963 103983 103606 104368 105976 107447 108143 108344 108582 108849 108813 108420 107946 107737 108189 109555
54820 109555 111443 112841 113073 112472 111790 111348 111164 111428 112224 113025 113128 112543 111927 111706 111715 111709 111792 112217 113072 114239
54800 114239 115576 117070 118811 120667 122128 122824 123213 124183 125828 127226 127737 127848 128202 128420 127694 126155
54784 126155 124779 124137 124034 124312 125185 126604 128016 128994 129646 130219 130738 131274 132197 133955 136734 140409 144645
54767 144645 149039 153409 157950 162941 168343 173783 178744 182559 184548 184499 182811 179918 175856 170769 165404
54752A65404m853m299m066l717l131l014l603l816k703j025k91p48j393j541j299
54737A25905o87M17J522J750J057M08M74J022J663K431L301L885M027M122M447
54722A55744M678M419L788L116K430J619P43j51j217k465l481l910l965m077m216
54707A53055l963l269k611k363k297j962j323q33q85j388j893k006j682j113n22
54692A24945p5R5q5n29r83j187j043o42j90J34K75L03K69J29j03k03N2N06O59
54673A22327K35m75r82j173j235j214r82o55n24m78o9O95J052M97m06p26m02n6
54655A15429J27N02J000R70K23n13n83j93J43L28M33K86j21k86J91J044J813K432
54637A23225K772K296Q31o84j118n48n3j89n09m90j62K08M19K37m16j129j353
$$ plain form
54752 165404 160551 156252 152186 148469 145338 142324 138721 134905 132202 131177 130886 130138 128745 127204 125905
54737 125905 125218 125635 127157 128907 129964 130372 130846 131868 133531 135962 139263 143148 147175 151297 155744
54722 155744 160422 164841 168629 171745 174175 175794 176537 176386 175169 172704 169223 165313 161348 157271 153055
54707 153055 149092 145823 143212 140849 138552 136590 135267 134434 133549 132161 130268 128262 126580 125467 124945
54692 124945 124870 124965 124880 124351 123368 122181 121138 120496 120306 120440 120715 121018 121287 121416 121313 121110 121162 121668 122327
54673 122327 122562 122087 121105 119932 118697 117483 116501 115846 115322 114844 114775 115470 116522 117019 116613 115887 115485 115429
54655 115429 115556 116058 117058 118028 118251 117738 117155 116962 117105 117433 117866 118152 118031 117745 117936 118980 120793 123225
54637 123225 125997 128293 129124 128440 127322 126774 126721 126532 126023 125533 125371 125579 125998 126235 125819 124690 123337
54620A23337j101q66q88r92j016q96m45L91J150J302R59N54N7p85j551j401l06
54603A17503P82J163J042Q25M84p8o76j087j271j193r09p46q68p86mR75J189O63
54585A17008L86P54J172J339J715K245J871J10j865k554j871p68J20O71P43L67
54569A21443R9L44O69M31k00n53m45j48K82R06J268P04o77j880k021j071L21J429
54551A20901J842J652J279J009Q01O24O70J075J616J919J768J158L66q2J09M97
54535A37204L56k75o16l11J13J72O9N0j32n93q36n07o5r1m12n23m79o95j135j340
54515A29954j081n69j15Q9M6k6k6l27j257k209k060p53M25N20K1k26k33k66J2
54496A21919Q51J594J532R39L90l10j411k117j495o6P75P82R22J538J829J303
$$ plain form
54620 123337 122236 121370 120482 119490 118474 117578 117133 117524 118674 119976 120935 121489 121546 120761 119210 117809 117503
54603 117503 118285 119448 120490 121315 121799 121721 121045 119958 118687 117494 116585 115839 114971 114185 114181 115156 116345 117008
54585 117008 117394 118148 119320 120659 122374 124619 126490 126600 124735 122181 120310 119542 119662 120333 121076 121443
54569 121443 121542 121886 122555 122986 122786 122233 121788 121640 121922 122828 124096 124800 124123 122243 120222 119151 119472 120901
54551 120901 122743 124395 125674 126683 127484 128108 128778 129853 131469 133388 135156 136314 136680 136598 136707 137204
54535 137204 137560 137285 136669 136358 136471 136643 136712 136762 136630 136037 135201 134694 134629 134538 134126 133603 133124 132429 131294 129954
54515 129954 128873 128304 128189 128278 128324 128298 128272 127945 126688 124479 122419 121666 122091 122611 122632 122406 122173 121907 121919
54496 121919 122770 124364 125896 126835 127225 126915 125504 123387 121892 121826 122601 123383 124305 125843 127672 128975
54480A28975N86L19K57n4m13k89L91J151J502J375J172J314J607J471R17P19J151
54463A42151J338N70m30n75j43k54r41j111l88K92J62m37q22q09n07j10o2o42
54445A37282j274j057n3P83J003R99Q84K52o54p55K78J254J001j05q93r69p72
54428A37204o04l74k4M04R28J439J606J341R72O93K68l94p91m89J73M80K26j94
54410A42864l61j27M17R55J081P48L49J88J16j03l35l25j34K7J68M55Q45J124
54392A47952J228J271J289J130O70Nn62p53n61k70k06m75q98j097o76L53J280
54375A49680J232K03p97r22l66K13O86J211J520J224O40N47J147J903K409K774
54359A63304L090L169K921K516K067J582J128O58j54j439k658l178l104k920k636
$$ plain form
54480 128975 129561 129880 130137 130083 129670 129381 129772 130923 132425 133800 134972 136286 137893 139364 140281 141000 142151
54463 142151 143489 144059 143629 143054 142911 142657 141716 140605 140217 140509 140671 140234 139412 138603 138096 137986 137924 137282
54445 137282 136008 134951 134898 135681 136684 137683 138567 138819 138165 137410 137688 138942 139943 139838 138945 137976 137204
54428 137204 136600 136226 136202 136606 137534 138973 140579 141920 142892 143585 143853 143459 142668 142179 142352 142832 143058 142864
54410 142864 142503 142376 142793 143748 144829 145577 145926 146114 146230 146127 145792 145467 145333 145360 145528 145983 146828 147952
54392 147952 149180 150451 151740 152870 153540 153545 152983 152230 151669 151399 151193 150718 149820 148723 148047 148400 149680
54375 149680 150912 151115 150318 149396 149030 149243 149929 151140 152660 153884 154524 155071 156218 158121 160530 163304
54359 163304 166394 169563 172484 175000 177067 178649 179777 180435 180281 178842 176184 173006 169902 166982 164346
54344A64346k003j336j144j166p42q9q9p45j012m12K33Q3o57j328j619j393o41
54327A50286P7jo22n62O09J770J778Q87k6p18j330j642j450j096r75r91j017j257
54309A43720j583j281j66Q31R20N70N15M43k68j190j391r05n32m43j52L32M71
54292A39891K76L06N90N50J03q9K99P92R47Q71O92K58l32n85l53q5n1P8N18Q28
54272A45504O04K46M27J092J493J215P02O46J161J732J812J331O16J5k99k95n2
54255A57950J83J80N7K22Q13J416J505R98J99o19j345j877k093j991j689j338
54239A52571j055q34m67K01Q75R71K82o60j103p88o8N01O05M07M23R41J605J810
54221A56217J449Q77K45n98j473j776j278m44K16O10O31l2j236k135k108j462
$$ plain form
54344 164346 162343 161007 159863 158697 157955 157866 157777 157032 156020 155608 155841 155924 155267 153939 152320 150927 150286
54327 150286 150363 150362 149740 149178 149787 151557 153335 154222 154196 153478 152148 150506 149056 147960 146985 145994 144977 143720
54309 143720 142137 140856 140690 141521 142441 143011 143526 143969 143701 142511 141120 140215 139683 139240 139088 139420 139891
54292 139891 140167 140473 141063 141613 141716 141627 141926 142718 143665 144536 145228 145486 145154 144569 144216 144131 144080 144158 144676 145504
54272 145504 146108 146354 146781 147873 149366 150581 151283 151929 153090 154822 156634 157965 158581 158596 158297 158002 157950
54255 157950 158133 158313 158370 158592 159405 160821 162326 163324 163523 162904 161559 159682 157589 155598 153909 152571
54239 152571 151516 150682 150215 150416 151291 152262 152544 151884 150781 149993 149925 150426 151031 151438 151861 152802 154407 156217
54221 156217 157666 158543 158788 158190 156717 154941 153663 153219 153435 154045 154676 154644 153408 151273 149165 147703
54205A47703p96j36O81J264J011m0j186j707j209K33J833K416J608L92q0J93M82
54188A52662N79Q06J058P90l8p57q48m57%K55K11m9k09l3L22N42M78L6q37j700
54168A52811j669n44O01P03J08j00J96J68m28q71o85k12J77N32P49M22l93j015
54150A50550j070r02p94m82J58N99L70k44n91l69L53J322K023J884R58mm31m47
54132A52883l30n3L29M52K69L48R79J541J360P84O45R92J152R34Q66J219J534
54115A65904J372R17M93P2l87n39j53L00J07o67j170q62j70K28L39O55J276J761
54097A69476J854J808J871J898J782J838K354K969L009K394J750J593J690J425
54083A97711O04l29q16q30r05j461k223k510k094j467j166j175j167j015p55l64
$$ plain form
54205 147703 146907 146771 147452 148716 149727 149687 148501 146794 145585 145818 147651 150067 151675 152067 151987 152180 152662
54188 152662 153241 154047 155105 155895 155857 155100 154252 153795 153795 154050 154261 154212 154003 153970 154292 154834 155312 155348 154511 152811
54168 152811 151142 150598 151199 151902 152010 151910 152106 152274 151846 150975 150290 150078 150255 150787 151536 151958 151565 150550
54150 150550 149480 148578 147784 147302 147460 148059 148429 148185 147594 147225 147578 148900 150923 152807 153765 153761 153330 152883
54132 152883 152553 152500 152829 153281 153550 153898 154877 156418 157778 158562 159207 160199 161351 162285 163151 164370 165904
54115 165904 167276 168193 168686 168758 168371 167832 167679 167979 168086 167419 166249 165387 165217 165445 165784 166439 167715 169476
54097 169476 171330 173138 175009 176907 178689 180527 182881 185850 188859 191253 193003 194596 196286 197711
54083 197711 198315 197986 197170 196340 195435 193974 191751 189241 187147 185680 184514 183339 182172 181157 180402 180038
54067A80038J21M52N25O18R99J411J391R33N63P41J485K426L055L079K764K676
54051B03277K959L156K990K790K794K584J878J316J657K531K931K673K451K564
54037B38551K706K981L981N480O162N302L838L094L092K930K264J663J621J996
54023B85661K322K286J823J144O22M35L46k9q09j810k745l364l636l822m175m577
54007B69672m805n085n799o606o492n096l352k374k130j874j487j582k369l137
53993B17484l133k449j787j591j664j559j149p99r35j466j733j180o6P14N76q7
53977A99176l22K78J065J129M29j57RN62P16K87k15k68K60J232K305L028L239
53960B12753L245L296L181K852L009M302O140P345P944R241J1773J4307J5433
$$ plain form
54067 180038 180159 180611 181136 181754 182753 184164 185555 186488 187051 187792 189277 191703 194758 197837 200601 203277
54051 203277 206236 209392 212382 215172 217966 220550 222428 223744 225401 227932 230863 233536 235987 238551
54037 238551 241257 244238 248219 253699 259861 265163 269001 272095 275187 278117 280381 282044 283665 285661
54023 285661 287983 290269 292092 293236 293858 294293 294639 294610 293801 291991 289246 285882 282246 278424 274249 269672
54007 269672 264867 259782 253983 247377 240885 235789 232437 230063 227933 226059 224572 222990 220621 217484
53993 217484 214351 211902 210115 208524 206860 205301 204152 203353 202418 200952 199219 198039 197973 198687 199263 199176
53977 199176 198854 199132 200197 201326 201755 201598 201607 202169 202885 203172 202957 202689 202949 204181 206486 209514 212753
53960 212753 215998 219294 222475 225327 228336 232638 238778 246123 254067 263308 275081 289388 304821
53947C04821J5186J4248J2341Q569L129k311o082p768q083p952p849p575o607
53934C04067m832k820j233j73N88J097J344J585K104K736L138L362L712M109M187
53919C22971L993M075M771N822O782P479P867P843P342O442N275M020K995K439
53905D00116K098J366N2j242j780j591j448j975l048m094m774n174n472n674n802
53890C61558o057o581p131p288o955o473o175o091o066n960n597m887m041l455
53876B78801l185k910k516k373k744l247l349l129l120l485l827l838l701l728
53862B33649l855l692k943j772q00o15j131j564j303o65m39q08j212j245j167
53847B10438j282j353j004m07j17l53q18j174j335j301j053o79l82k28r6J20M24
$$ plain form
53947 304821 320007 334255 346596 355165 358294 355983 349901 342133 334050 326098 318249 310674 304067
53934 304067 299235 296415 295182 295009 295597 296694 298038 299623 301727 304463 307601 310963 314675 318784 322971
53919 322971 326964 331039 335810 341632 348414 355893 363760 371603 378945 385387 390662 394682 397677 400116
53905 400116 402214 403580 403632 402390 400610 399019 397571 395596 392548 388454 383680 378506 373034 367360 361558
53890 361558 355501 348920 341789 334501 327546 321073 314898 308807 302741 296781 291184 286297 282256 278801
53876 278801 275616 272706 270190 267817 265073 261826 258477 255348 252228 248743 244916 241078 237377 233649
53862 233649 229794 226102 223159 221387 220587 219972 218841 217277 215974 215309 214870 214062 212850 211605 210438
53847 210438 209156 207803 206799 206392 206275 205922 205104 203930 202595 201294 200241 199562 199180 198952 198856 198976 199400
53830A99400Q54J395J749J504P45J43J87N88P80P58Q88J141J071O52N35J214K339
53813B15943L125L154K602J960J729K119K756L025K907L119M119N314N725N197
53799B62794M519M395M736M948M619L890L313L235L339L007K225J616J415J013
53785C09064j5j097j511j557k043k957l595l786m041m530m851m899m979m991m381
53770B59831l235k435k410k600k558k702l361l920l666k859k226j895j593j461
53756B22910j805k330k379j871j365j232j310j375j367j186o91l9M05N00M46M06
53740B07717L12O2k52l80r5N76J249J481J246R43Q82J002J149J314J446J379J146
53723B21177J017J091J149J094J153J348J215M82l23m66M3N53P38R69J685K721
$$ plain form
53830 199400 200254 201649 203398 204902 205647 205790 205977 206565 207345 208103 208991 210132 211203 211855 212390 213604 215943
53813 215943 219068 222222 224824 226784 228513 230632 233388 236413 239320 242439 246558 251872 257597 262794
53799 262794 267313 271708 276444 281392 286011 289901 293214 296449 299788 302795 305020 306636 308051 309064
53785 309064 309049 307952 306441 304884 302841 299884 296289 292503 288462 283932 279081 274182 269203 264212 259831
53770 259831 256596 254161 251751 249151 246593 243891 240530 236610 232944 230085 227859 225964 224371 222910
53756 222910 221105 218775 216396 214525 213160 211928 210618 209243 207876 206690 205999 205960 206365 206865 207311 207717
53740 207717 208029 208091 207839 207459 207364 207940 209189 210670 211916 212859 213741 214743 215892 217206 218652 220031 221177
53723 221177 222194 223285 224434 225528 226681 228029 229244 229726 229403 228937 228980 229533 230271 231240 232925 235646
53707B35646L379L086K100J490K103L480M223L667K656K358K797L092K803K383
53693B75263K339K596K764K685K461K175J671O48q75k266k738k261j618j413j415
53678B80016j124n86k22j64j73l9K35N08M75j23j043j601j449j010q37r11r17
53661B71035q64r20r53o96j89K68N19N87N84P61J322J927J878J083L92M74Q72
53644B78080P39N6m90m99o5P24J786K723L070K793K153J356O91O20J249K070K652
53627B99708L153L636L589K880K491L278M531M863M235L871M336M936N037M846
53613C55390M648M296L728L189K760K326K109K479L175L531L406L112K607J726
53599C98482J101J552K538K549J301J90P8Q8o71j484j228k55J06n91j647k344
$$ plain form
53707 235646 239025 242111 244211 245701 247804 251284 255507 259174 261830 264188 266985 270077 272880 275263
53693 275263 277602 280198 282962 285647 288108 290283 291954 292602 291727 289461 286723 284462 282844 281431 280016
53678 280016 278892 278306 278084 277920 277747 277708 277943 278451 278926 278803 277760 276159 274710 273700 272863 271952 271035
53661 271035 270171 269251 268298 267602 267413 267681 268200 268787 269371 270132 271454 273381 275259 276342 276734 277208 278080
53644 278080 278819 278875 278385 277886 277821 278545 280331 283054 286124 288917 291070 292426 293117 293737 294986 297056 299708
53627 299708 302861 306497 310086 312966 315457 318735 323266 328129 332364 336235 340571 345507 350544 355390
53613 355390 360038 364334 368062 371251 374011 376337 378446 380925 384100 387631 391037 394149 396756 398482
53599 398482 399583 401135 403673 406222 407523 407713 407791 407879 407208 405724 404496 404241 404347 403756 402109 399765
53583C99765k511k205j617j199j282j730k202k510k506k071j542j513j957k148
53569C72772j822j641k050k456k177j472r15m66P8L18j12o91p26m86o33r19n23
53552C56079N04J202J123Q52R62J270J347J138Q90Q96J396K312L104L375L415
53537C79865L730M170M232L988M025M486M891M962N018N458O446Q075J0214J2098
53523D61658J2810J2355J1668J1452J1592J1818J2222J2883J3627J4491J5812
53512F02388J7499J8830J9407J9740K0412K1165K1408K1211K1176K1514K1855
53501H26605K1832K1363K0463J9205J7908J6942J6411J6180J6108J6014J5670
53490A024701J5213J5276J6163J7091J6944J5761J4797J4929J5636J5882J5458
$$ plain form
53583 399765 397254 395049 393432 392233 390951 389221 387019 384509 382003 379932 378390 376877 374920 372772
53569 372772 370950 369309 367259 364803 362626 361154 360239 359773 359851 360169 360057 359366 358640 358154 357521 356602 356079
53552 356079 356583 357785 358908 359760 360722 361992 363339 364477 365367 366263 367659 369971 373075 376450 379865
53537 379865 383595 387765 391997 395985 400010 404496 409387 414349 419367 424825 431271 439346 449560 461658
53523 461658 474468 486823 498491 509943 521535 533353 545575 558458 572085 586576 602388
53512 602388 619887 638717 658124 677864 698276 719441 740849 762060 783236 804750 826605
53501 826605 848437 869800 890263 909468 927376 944318 960729 976909 993017 1009031 1024701
53490 1024701 1039914 1055190 1071353 1088444 1105388 1121149 1135946 1150875 1166511 1182393 1197851
53479A197851J4947J4721J4548J4042J3033J1521R643P673N793L912J945P7j525
53466A308181l158n257p753j0078j1828j2954j3415j3175j2685j2718j3486j4351
53454A177323j4742j4868j5196j5713j6135j6418j6621j6567j6203j5938j6090
53443A002832j6250j5790j4785j3779j2767j1193q873o316m080k403j454j266
53431H93876j292o77P69K418L676M495M980N214N620O758Q531J0203J1506J2967
53417I69044J4846J6553J7568J8201J8864J9411J9827K0801K2690K4540K5212
53406A187557K5088K5545K7044K8850L0570L2675L5302L7695L9367M0811M2506
53395A553010M3992M4716M5154M6236M7911M9133M9195M8456M7619M6931M6263
$$ plain form
53479 1197851 1212798 1227519 1242067 1256109 1269142 1280663 1290306 1297979 1303772 1307684 1309629 1309706 1308181
53466 1308181 1305023 1299766 1292013 1281935 1270107 1257153 1243738 1230563 1217878 1205160 1191674 1177323
53454 1177323 1162581 1147713 1132517 1116804 1100669 1084251 1067630 1051063 1034860 1018922 1002832
53443 1002832 986582 970792 956007 942228 929461 918268 909395 903079 898999 896596 895142 893876
53431 893876 892584 891907 892676 895094 898770 903265 908245 913459 919079 925837 934368 944571 956077 969044
53417 969044 983890 1000443 1018011 1036212 1055076 1074487 1094314 1115115 1137805 1162345 1187557
53406 1187557 1212645 1238190 1265234 1294084 1324654 1357329 1392631 1430326 1469693 1510504 1553010
53395 1553010 1597002 1641718 1686872 1733108 1781019 1830152 1879347 1927803 1975422 2022353 2068616
53384B068616M5557M4866M4067M2850M0917L8126L4534L0446K6370K2774J9810
53373B458933J7204J4408J0897O489J552l314p898j2686j8183k4015k9123l3019
53361B381245l6358l9839m3012m4820m5170m5152m5532m5787m5020m3257m1280
53350A906018l9520l7779l5903l4189l3022l2500l2501l2851l3264l3329l2711
53339A528449l1390k9667k7950k6511k5343k4204k2839k1141j9196j7166j5171
53328A267871j3170j1158r535r040r994j1700j2970j3275j3050j2836j2581j1919
53316A126643j0833r718q955q540q049p006n375l703k522j728q73J28J034J917
53302A062420L144M730O264P629R092J0633J1907J3089J4932J7534J9798K0727
$$ plain form
53384 2068616 2114173 2159039 2203106 2245956 2286873 2324999 2359533 2389979 2416349 2439123 2458933
53373 2458933 2476137 2490545 2501442 2507931 2509483 2506169 2498271 2485585 2467402 2443387 2414264 2381245
53361 2381245 2344887 2305048 2262036 2217216 2172046 2126894 2081362 2035575 1990555 1947298 1906018
53350 1906018 1866498 1828719 1792816 1758627 1725605 1693105 1660604 1627753 1594489 1561160 1528449
53339 1528449 1497059 1467392 1439442 1412931 1387588 1363384 1340545 1319404 1300208 1283042 1267871
53328 1267871 1254701 1243543 1234008 1224968 1214974 1203274 1190304 1177029 1163979 1151143 1138562 1126643
53316 1126643 1115810 1106092 1097137 1088597 1080548 1073542 1068167 1064464 1061942 1060214 1059341 1059469 1060503 1062420
53302 1062420 1065564 1070294 1076558 1084187 1093279 1103912 1115819 1128908 1143840 1161374 1181172 1201899
53290A201899K0690K0706K1078K1408K1512K1455K1008J9846J8128J6284J4301
53279A418315J2008R731P999O575M596J722j460m284o674q824j0738j2362j3802
53266A402802j5246j6858j8738k0736k2360k3193k3384k3432k3553k3673k3861
53255A167768k4354k5086k5591k5463k4668k3508k2465k1910k1678k1105j9938
53244I12002j8868j8732j9394j9978k0121k0199k0337j9987j8728j6920j5280
53233G03458j4118j3212j2167j0726r044p689p073o916o594o082o036o908q397
53220E88496r904j1095j1828j1999j1755j1614j2037j2935j3665j3510j2274j0546
53208D45334r305r001r122q873q096p225o621o379o611p293q002q280q205q083
$$ plain form
53290 1201899 1222589 1243295 1264373 1285781 1307293 1328748 1349756 1369602 1387730 1404014 1418315
53279 1418315 1430323 1440054 1448053 1454628 1459224 1460946 1459486 1455202 1448528 1439704 1428966 1416604 1402802
53266 1402802 1387556 1370698 1351960 1331224 1308864 1285671 1262287 1238855 1215302 1191629 1167768
53255 1167768 1143414 1118328 1092737 1067274 1042606 1019098 996633 974723 953045 931940 912002
53244 912002 893134 874402 855008 835030 814909 794710 774373 754386 735658 718738 703458
53233 703458 689340 676128 663961 653235 644191 636502 629429 622513 615919 609837 603801 596893 588496
53220 588496 578592 567497 555669 543670 531915 520301 508264 495329 481664 468154 455880 445334
53208 445334 436029 427028 417906 409033 400937 393712 387091 380712 374101 366808 358806 350526 342321 334238
53194C34238p738o792n578m986n255n660n597n242m937m615m190l866l616k967
53180B63199j863j114j405k205k391j710r96r49j284j231n11L61O12Rq48j114
53164B46560o24l8j5m61q07p97p37j012j495j634j121l72j11m48p33n66m62r93
53146B34134j673j509n11J89j27r09j314j237r64m75L48J226J760J946J968J791
53130B34643J344Q66O45O28O06N98O72O40L40M5K19Q88J550J746J472J108R76
53113B48986J022Q57K10o67j269j452j533j717j795j500q95k93m5l74j091j465
53097B36979q79K85Q98M18n13r99r28p17n06j16M29P83O44K5p01j011p13k68k73
53078B32837o20o37p9N32P42O89O04L63j00n12p12r02j136j186j153j471j946
$$ plain form
53194 334238 326500 319708 314130 309144 303889 298229 292632 287390 282453 277838 273648 269782 266166 263199
53180 263199 261336 260222 258817 256612 254221 252511 251515 250566 249282 248051 247540 247901 248513 248522 247674 246560
53164 246560 245936 245898 245883 245422 244615 243818 243081 242069 240574 238940 237819 237447 237336 236888 236155 235589 235127 234134
53146 234134 232461 230952 230441 230630 230503 229594 228280 227043 226079 225604 225952 227178 228938 230884 232852 234643
53130 234643 235987 236853 237498 238126 238732 239330 240002 240642 240982 241027 241246 242134 243684 245430 246902 248010 248986
53113 248986 250008 250865 251075 250408 249139 247687 246154 244437 242642 241142 240247 239954 239909 239535 238444 236979
53097 236979 236100 236385 237283 237701 237188 236189 235261 234544 234038 233922 234351 235134 235778 235803 235102 234091 233378 233110 232837
53078 232837 232217 231580 231501 232033 232775 233464 234068 234431 234331 233819 233107 232205 231069 229883 228730 227259 225313
53061B25313j598j53J189J263N32K37N27N61P6k68q0L31P43J347K064K325J771
53044B36180O50n87j582j947j473n23J78L26J35j92o22r82j023p96n25k06K19
53027B27230M37J33l66m77k69k79m74k79L82Q47P99P52J103J471J310O91O3k65
53009B32809j59L57R22J099J017J173J480J241L65k28O7N05N6j054j697j429q80
52992B35644o15m11J68J021J646J790J666J644J766J680J154N76O14J378K225
52977B51946K545K343J842J031j8p46n79L31J275J782J877J673J174M78j69o51
52961B66134j065j512j951k251k180j480k61P28O45n13j810k316j959j329q69
52946B48011o25n93r22j578k111k062j544j086q39l64N99J486J493O85k4k2L22
$$ plain form
53061 225313 223715 223562 224751 226014 226546 226783 227310 227871 227947 227679 227599 227930 228673 230020 232084 234409 236180
53044 236180 236830 236243 234661 232714 231241 230718 230896 231222 231357 231165 230543 229561 228538 227742 227217 227011 227230
53027 227230 227667 227800 227434 226957 226688 226409 225935 225656 226038 226885 227684 228436 229539 231010 232320 233011 233074 232809
53009 232809 232650 233007 233929 235028 236045 237218 238698 239939 240304 240076 240143 240648 240704 239650 237953 236524 235644
52992 235644 235029 234618 234786 235807 237453 239243 240909 242553 244319 245999 247153 247729 248343 249721 251946
52977 251946 254491 256834 258676 259707 259689 258943 258364 258695 259970 261752 263629 265302 266476 266954 266785 266134
52961 266134 265069 263557 261606 259355 257175 255695 255434 256162 256807 256294 254484 252168 250209 248880 248011
52946 248011 247386 246793 245871 244293 242182 240120 238576 237490 236651 236287 236886 238372 239865 240550 240526 240504 240826
52929B40826L37rk20m0K38J93k53p27o46K90J617K314J766M87m05l97l0kk27j14
52909B44998L93N64o0q43q06k3M18j2n23k94J62k32j373k001j464m49K30O28J046
52890B40359J242R57N86O62J065J377J564J664J236l9j467j922j312o03l95k99
52874B44675J46P48J184J530J920K206K326K481K640K399J729J268J367J368N17
52859B68504p97j505j389j268j679k188k281k270k773l647l994l266k029j469
52845B37949k146l338l729k754j131L2L14Ln28j007j033l75N51J032J004J020
52829B25864J237J069J32j054j740j805j538j089o27n76j021j239n05Q33J756
52814B19697J902J762J721J602J199O06j27j021j763j887j462j046q80p68p42
$$ plain form
52929 240826 241163 241154 240934 240894 241132 241325 241072 240345 239699 239989 241606 243920 245686 246173 245768 245371 245341 245339 245112 244998
52909 244998 245391 245955 245895 245052 244246 244223 244641 244629 244106 243812 243974 243742 242369 240368 238904 238455 238685 239313 240359
52890 240359 241601 242558 243144 243806 244871 246248 247812 249476 250712 250673 249206 247284 245972 245369 244974 244675
52874 244675 244821 245569 246753 248283 250203 252409 254735 257216 259856 262255 263984 265252 266619 267987 268504
52859 268504 267707 266202 264813 263545 261866 259678 257397 255127 252354 248707 244713 241447 239418 237949
52845 237949 235803 232465 228736 225982 224851 224883 225197 225200 224672 223665 222632 222257 222808 223840 224844 225864
52829 225864 227101 228170 228302 227248 225508 223703 222165 221076 220449 219873 218852 217613 217108 217941 219697
52814 219697 221599 223361 225082 226684 227883 228489 228362 227341 225578 223691 222229 221183 220303 219535 218793
52799B18793j075j535j487r95q17j019o40N92J366N84q45j272o30j51j51K82J417
52782B12417K222J927J071L96j60q03j123p49j44P5M0K21M91L59j67o04p59q50
52764B13860j017j170j281j338j170o60r0J85K87N82R54Q98L95J40O62J591K126
52747B14954K002J708J860K579L406L678L126K184J629J758K085J974J418R51
52733B45312Q73R03O71K11k31o27j135j673j876j545r52n57n48p68r51r66q65
52716B35276q02q69j007j102j181j314j373j079l73M24R17R79P22L25Oo5J03L38
52698B29925O09J037J568J924J983J877J538O58o21j460j283n88k08j47J57O39
52682B37608O35L8m41l87k23l69n32l21J2m2n05r99j251j139n70K47P39O02K60
$$ plain form
52799 218793 217718 216183 214696 213701 212884 211865 211225 211817 213183 213767 212922 211650 211020 210869 210718 211000 212417
52782 212417 214639 216566 217637 218033 217873 217070 215947 215198 215054 215129 215169 215390 215881 216240 216073 215469 214710 213860
52764 213860 212843 211673 210392 209054 207884 207224 207134 207319 207606 208188 209142 210040 210435 210575 211237 212828 214954
52747 214954 216956 218664 220524 223103 226509 230187 233313 235497 237126 238884 240969 242943 244361 245312
52733 245312 246185 247088 247759 247970 247739 247112 245977 244304 242428 240883 239931 239374 238826 238058 237107 236141 235276
52716 235276 234474 233605 232598 231496 230315 229001 227628 226549 226176 226600 227517 228496 229218 229543 229549 229484 229587 229925
52698 229925 230534 231571 233139 235063 237046 238923 240461 241119 240498 239038 237755 237167 236959 236812 236969 237608
52682 237608 238243 238281 237840 237453 237230 236861 236329 236008 236020 235978 235473 234474 233223 232084 231514 231761 232500 233102 233362
52663B33362L26P91J173J216J067R11Q65J158J931K871L383L135K267J093q4r94
52647B54471j511j781j975j986j602r22k88J43N00Q06Q19L18n54j288j330m99
52631B43321Q05J908K482K746K887K672J867P70j36q34j585k188k102j345p04
52616B50564p67j175j228p73k33Jj72o57j103r88k09N38M18m93j180q57K36J243
52598B43165J587J256N72k3j26L63J137J808K176K174J746J077O59P69R96P80
52582B60116K44K4K24K60j01k09M12J073P02n99j553j301l60J49k08r37j322j127
52564B55487p11n98q92j161j007n42j35J43L58K65m35j349j586q68RJ53m16j013
52546B45702j113o48J82R84J292R72M28J53K27M41O31P19O77O94J072J637J642
$$ plain form
52663 233362 233688 234479 235652 236868 237935 238846 239711 240869 242800 245671 249054 252189 254456 255549 255465 254471
52647 254471 252960 251179 249204 247218 245616 244694 244406 244549 245049 245855 246674 246992 246438 245150 243820 243321
52631 243321 244126 246034 248516 251262 254149 256821 258688 259458 259322 258488 256903 254715 252613 251268 250564
52616 250564 249797 248622 247394 246621 246388 246389 246217 245560 244457 243469 243260 243798 244216 243723 242543 241686 241922 243165
52598 243165 244752 246008 246580 246557 246431 246794 247931 249739 251915 254089 255835 256912 257571 258340 259336 260116
52582 260116 260360 260384 260608 260868 260767 260558 260970 262043 262745 262146 260593 259292 258932 259081 258873 257936 256614 255487
52564 255487 254776 254178 253286 252125 251118 250576 250441 250584 250942 251207 250772 249423 247837 246969 246978 247131 246715 245702
52546 245702 244589 243941 244123 245107 246399 247371 247799 247952 248179 248620 249251 249970 250647 251341 252413 254050 255692
52529B55692O45p29j408j050k00N57J048J164Q00K89L16J065J820J808J155O40
52513B63612O61R08J106J512K419L458L839L220J982O19o87j789k364k402k436
52498B73658k811l059k601j812j550j779j607q03k09l40n25j90O6n11j364j308
52482B53255k90O23Q37P50P43O34L65L10O64J129J478J746J724J006j29o27J33
52465B64351J574K726L239L167K441J240L62L83P25K95r73k042k234k055k268
52450B70931k778k890k364j690j444j637j774j383n07K86M51M0l14j44L06M52
52434B55541J97L0K93O74O85L58J11L3k25p69j131q64k13J66J04J51Q92K170L176
52415B61379L263K705K529L463N037N997N691M771M440N207O624P809P903O348
$$ plain form
52529 255692 256337 255608 254200 253150 252950 253507 254555 255719 256519 256808 257124 258189 260009 261817 262972 263612
52513 263612 264273 265181 266287 267799 270218 273676 277515 280735 282717 283336 282649 280860 278496 276094 273658
52498 273658 270847 267788 265187 263375 261825 260046 258439 257636 257427 257087 256562 256372 256438 255927 254563 253255
52482 253255 252965 253588 254425 255175 255918 256552 256917 257227 257891 259020 260498 262244 263968 264974 264845 264218 264351
52465 264351 265925 268651 271890 275057 277498 278738 279100 279483 280208 280503 279530 277488 275254 273199 270931
52450 270931 268153 265263 262899 261209 259765 258128 256354 254971 254464 254750 255201 255241 254927 254783 255089 255541
52434 255541 255738 255768 256061 256735 257420 257778 257889 257922 257697 256928 255797 254933 254720 254886 254990 255141 256033 258203 261379
52415 261379 264642 267347 269876 273339 278376 284373 290064 294835 299275 304482 311106 318915 326818 333166
52401C33166L338j6k432l546l934m210m445m502m430m324m114l752l335k892k319
52386B88253j623r87l97M49J559K300K079J245Q70J519K635L303L313L181L301
52371C11000L523L630L774M138M390L969K893J865J458J533J621J529J286Q76
52357C47485L39p3k06k43l25j69M74J189J298Q23N05Q19J513K177K749L235L444
52340C65034L332L272L672M497N393O117O717P400Q328R403J0249J0620J0849
52327D54883J1567J2989J4736J6357J7647J8484J8810J8902J9193J9633J9668
52316F42869J9029J8135J7456J6955J6567J6647J7481J8615J9225J8955J8028
52305H39962J6717J5232J3971J3329J3206J3074J2529J1552J0295Q884P400N735
$$ plain form
52401 333166 336504 336488 334056 330510 326576 322366 317921 313419 308989 304665 300551 296799 293464 290572 288253
52386 288253 286630 285643 285246 285695 287254 289554 291633 292878 293748 295267 297902 301205 304518 307699 311000
52371 311000 314523 318153 321927 326065 330455 334424 337317 339182 340640 342173 343794 345323 346609 347485
52357 347485 347824 347751 347545 347302 346977 346808 347282 348471 349769 350592 351097 351916 353429 355606 358355 361590 365034
52340 365034 368366 371638 375310 379807 385200 391317 398034 405434 413762 423165 433414 444034 454883
52327 454883 466450 479439 494175 510532 528179 546663 565473 584375 603568 623201 642869
52316 642869 661898 680033 697489 714444 731011 747658 765139 783754 802979 821934 839962
52305 839962 856679 871911 885882 899211 912417 925491 938020 949572 959867 968751 976151 981886
52293I81886L609R29j884m257n944p003p506p676q000q659r008q236o587n181
52279I06483m535l914k525o53R62K362M184O440Q290R226R788J0695J1771J2275
52265I70849J2103J2040J2681J3655J4255J4439J4684J5025J4900J4064J3114
52254A121809J2731J2761J2451J1353R631P612N402K983L41k441n058p067q365
52241A174143r401j0613j1732j2175j2039j2125j2840j3546j3374j2300j1089
52230A042909j0420j0276j0138r480q287p124o560o460o131n266m263l380k188
52217I52936m05J184J510Q21N78J629L221M181M384M469M659M577M022L285K653
52202I93704K174J977K334L245M282N091N755O458O970O804N843M657L989L948
$$ plain form
52293 981886 985495 986424 984540 980283 974339 967336 959830 952154 944154 935495 926487 918251 911664 906483
52279 906483 901948 898034 895509 894856 895818 898180 902364 908804 917094 926320 936108 946803 958574 970849
52265 970849 982952 994992 1007673 1021328 1035583 1050022 1064706 1079731 1094631 1108695 1121809
52254 1121809 1134540 1147301 1159752 1171105 1180736 1188348 1193750 1196733 1197074 1194633 1189575 1182508 1174143
52241 1174143 1164742 1154129 1142397 1130222 1118183 1106058 1093218 1079672 1066298 1053998 1042909
52230 1042909 1032489 1022213 1012075 1002595 994308 987184 980624 974164 968033 962767 958504 955124 952936
52217 952936 952531 953715 955225 956046 956624 958253 961474 965655 970039 974508 979167 983744 987766 991051 993704
52202 993704 995878 997855 1000189 1003434 1007716 1012807 1018562 1025020 1031990 1038794 1044637 1049294 1053283 1057231
52188A057231L785K684P35j151k415l530n161o992q077q188q106q372q515p923
52174I96005o878o132n795n297m316l129k142j458r93o17k00K82P09J084J683
52159I62806K590L344L442L046K678K367J753Q96L33K45K81L60R17K009K839K681
52143I92587J826J113Q82Q29O58M12L46Q55K223M100N561O151O598P993J0424
52128A042558J2955J4861J6265J7595J9031K0632K2540K4792K7063K8750K9298
52117A276340K8530K6916K5295K4100K3023K1771K0712K0220J9705J8077J5286
52106A519975J2498J0605R273P800O185M723L268J564j10j402k801n282r007j2907
52092A544382j5745j7206j7880j8506j9308j9804j9323j7913j6475j5640j4743
$$ plain form
52188 1057231 1061016 1063700 1064435 1063284 1060869 1057339 1052178 1045186 1037109 1028921 1020815 1012443 1003928 996005
52174 996005 989127 982995 977200 971903 967587 964458 962316 960858 959865 959248 959048 959330 960039 961123 962806
52159 962806 965396 968740 972182 975228 977906 980273 982026 982922 983255 983500 983781 984141 985058 987067 989906 992587
52143 992587 994413 995526 996408 997237 997895 998307 998653 999508 1001731 1005831 1011392 1017543 1024141 1032134 1042558
52128 1042558 1055513 1070374 1086639 1104234 1123265 1143897 1166437 1191229 1218292 1247042 1276340
52117 1276340 1304870 1331786 1357081 1381181 1404204 1425975 1446687 1466907 1486612 1504689 1519975
52106 1519975 1532473 1543078 1552351 1560151 1566336 1571059 1574327 1575891 1575781 1574379 1571578 1566296 1557289 1544382
52092 1544382 1528637 1511431 1493551 1475045 1455737 1435933 1416610 1398697 1382222 1366582 1351839
52081A351839j2616r307o209m316l139j720N1J757L417N304P178Q589R814J1589
52067A362231J3815J5416J5741J5408J5321J5452J5191J4468J3853J3718J3730
52056A524344J3250J1905R851P655N792M091J848j301m906q337j1494j4431j6676
$$ plain form
52081 1351839 1339223 1329916 1323707 1319391 1316252 1314532 1314583 1316340 1319757 1325061 1332239 1340828 1350642 1362231
52067 1362231 1376046 1391462 1407203 1422611 1437932 1453384 1468575 1483043 1496896 1510614 1524344
52056 1524344 1537594 1549499 1559350 1567005 1572797 1576888 1578736 1577435 1572529 1564192 1552698 1538267 1521591
$$ [...]
##END NTUPLES=NMR SPECTRUM
##END=
