##TITLE=AC1745_SEN00018_9280926_VILM59K7Pi
##JCAMPDX= 6.0         $$ Bruker NMR JCAMP-DX V2.0
##DATA TYPE= NMR SPECTRUM
##DATA CLASS= NTUPLES
##ORIGIN= BRUKER
##OWNER= Administrator
$$ 1.72 TOPSPIN		Version 2.1
$$ 2015-07-18 20:11:51.150 -0700  Administrator@X
$$ Compression mode = diff/dup
##.OBSERVE FREQUENCY= 400.02188249412
##.OBSERVE NUCLEUS= ^1H
##.ACQUISITION MODE= SIMULTANEOUS (DQD)
##.ACQUISITION SCHEME= undefined
##.AVERAGES= 8
##.DIGITISER RES= 22
##SPECTROMETER/DATA SYSTEM= spect
##.PULSE SEQUENCE= zg30
##.SOLVENT NAME= COFFEE_meoh
##.SHIFT REFERENCE= INTERNAL, COFFEE_meoh, 1, 14.98509
##AUDIT TRAIL= $$ (NUMBER, WHEN, WHO, WHERE, PROCESS, VERSION, WHAT)
$$ ##TITLE= Audit trail, TOPSPIN		Version 2.1
$$ ##JCAMPDX= 5.01
$$ ##ORIGIN= Bruker BioSpin GmbH
$$ ##OWNER= Administrator
$$ $$ E:\/data/COFFEE/nmr/AC1745_SEN00018_9280926_VILM59K7Pi/20/pdata/1/auditp.txt
$$ ##AUDIT TRAIL=  $$ (NUMBER, WHEN, WHO, WHERE, PROCESS, VERSION, WHAT)
(   1,<2015-07-18 20:11:43.744 -0700>,<Administrator>,<X>,<go>,<TOPSPIN 2.1>,
      <created by zg
	started at 2015-07-18 20:10:37.697 -0700,
	POWCHK enabled, PULCHK disabled,
       configuration hash MD5:
       21 0F 79 D6 B3 7B B4 F6 88 20 88 DB 03 48 BD 9F
       data hash MD5: 64K
       DE 0A A9 CD 8A 26 24 C8 21 C7 E6 BF BF 06 A7 D6>)
(   2,<2015-07-18 20:11:47.025 -0700>,<Administrator>,<X>,<proc1d>,<TOPSPIN 2.1>,
      <Start of raw data processing
       efp LB = 0 FT_mod = 6 PKNL = 1 PHC0 = 0 PHC1 = 0 SI = 32K 
       data hash MD5: 32K
       F1 5A 2C 69 6F 2F 0C F6 CB A3 54 E3 C7 A3 B1 98>)
(   3,<2015-07-18 20:11:47.307 -0700>,<Administrator>,<X>,<proc1d>,<TOPSPIN 2.1>,
      <pk PHC0 = 87.03918 PHC1 = 0 
       data hash MD5: 32K
       81 8D 38 D8 12 34 4F EA FD C9 60 B4 87 F2 E8 47>)
(   4,<2015-07-18 20:11:47.432 -0700>,<Administrator>,<X>,<proc1d>,<TOPSPIN 2.1>,
      <abs ABSG = 1 
       data hash MD5: 32K
       A4 AA 85 05 07 28 1A 37 6C C7 01 0A 48 14 44 D5>)
(   5,<2015-07-18 20:11:47.494 -0700>,<Administrator>,<X>,<proc1d>,<TOPSPIN 2.1>,
      <abs ABSG = 2 
       data hash MD5: 32K
       CC 73 24 45 6C E0 4F 67 57 20 72 41 D6 FF 39 DE>)
(   6,<2015-07-18 20:11:47.557 -0700>,<Administrator>,<X>,<proc1d>,<TOPSPIN 2.1>,
      <abs ABSG = 3 
       data hash MD5: 32K
       DA 3C 81 BD 6E FC 64 80 9C D3 53 F9 5F 14 24 AD>)
(   7,<2015-07-18 20:11:47.619 -0700>,<Administrator>,<X>,<proc1d>,<TOPSPIN 2.1>,
      <abs ABSG = 4 
       data hash MD5: 32K
       17 C6 6B 00 56 2B E3 68 55 45 97 D5 49 00 7B 47>)
(   8,<2015-07-18 20:11:47.682 -0700>,<Administrator>,<X>,<proc1d>,<TOPSPIN 2.1>,
      <abs ABSG = 5 
       data hash MD5: 32K
       53 F2 DF E4 63 3C EF 3A 16 41 2D C6 E2 1B C7 62>)
$$ ##END=
$$ 
$$ $$ hash MD5
$$ $$ C8 0F 83 4D 87 2B 38 8A 61 7D 3B 7B D3 FA B0 C3
##$RELAX= 
##$RELAX= 
##$RELAX= 
##$RELAX= 
##$RELAX= 
##$RELAX= 
##$RELAX= 
$$ Bruker specific parameters
$$ --------------------------
##$DU= <E:\>
##$EXPNO= 20
##$NAME= <AC1745_SEN00018_9280926_VILM59K7Pi>
$$ [...]
150 150 150 150 150 150 150 150
##$TP07= 0
##$TPNAME0= <>
##$TPNAME1= <>
##$TPNAME2= <>
##$TPNAME3= <>
##$TPNAME4= <>
##$TPNAME5= <>
##$TPNAME6= <>
##$TPNAME7= <>
##$TPOAL= (0..7)
0.5 0.5 0.5 0.5 0.5 0.5 0.5 0.5
##$TPOFFS= (0..7)
0 0 0 0 0 0 0 0
##$TUNHIN= 0
##$TUNHOUT= 0
##$TUNXOUT= 0
##$USERA1= <user>
##$USERA2= <user>
##$USERA3= <user>
##$USERA4= <user>
##$USERA5= <user>
##$V9= 5
##$VALIST= <valist>
##$VCLIST= <CCCCCCCCCCCCCCC>
##$VD= 0
##$VDLIST= <DDDDDDDDDDDDDDD>
##$VPLIST= <PPPPPPPPPPPPPPP>
##$VTLIST= <TTTTTTTTTTTTTTT>
##$WBST= 2048
##$WBSW= 25
##$XGAIN= (0..3)
0 0 0 0
##$XL= 0
##$YL= 0
##$YMAX_a= 572908
##$YMIN_a= -505501
##$ZGOPTNS= <>
##$ZL1= 120
##$ZL2= 120
##$ZL3= 120
##$ZL4= 120
##$ABSF1= 14.98509
##$ABSF2= -5.573092
##$ABSG= 5
##$ABSL= 3
##$ALPHA= 0
##$AQORDER= 0
##$ASSFAC= 0
##$ASSFACI= 0
##$ASSFACX= 0
##$ASSWID= 0
##$AUNMP= <proc_prof1d_extract_pilot.lims>
##$AXLEFT= 0
##$AXNAME= <>
##$AXNUC= <1H>
##$AXRIGHT= 0
##$AXTYPE= 0
##$AXUNIT= <>
##$AZFE= 0.1
##$AZFW= 0.1
##$BCFW= 0
##$BC_mod= 0
##$BYTORDP= 0
##$COROFFS= 0
##$CY= 15
##$DATMOD= 1
##$DC= 0
##$DFILT= <>
##$DTYPP= 0
##$F1P= 0
##$F2P= 0
##$FCOR= 0.5
##$FTSIZE= 32768
##$FT_mod= 6
##$GAMMA= 0
##$GB= 0
##$INTBC= 1
##$INTSCL= 1
##$ISEN= 128
##$LB= 0
##$LEV0= 0
##$LPBIN= 0
##$MAXI= 10000
##$MC2= 0
##$MEAN= 0
##$ME_mod= 0
##$MI= 0
##$NCOEF= 0
##$NC_proc= -8
##$NLEV= 6
##$NOISF1= 0
##$NOISF2= 0
##$NSP= 0
##$NTH_PI= 0
##$NZP= 0
##$OFFSET= 14.98509
##$PC= 1
##$PHC0= 87.03918
##$PHC1= 0
##$PH_mod= 1
##$PKNL= yes
##$PPARMOD= 0
##$PPDIAG= 0
##$PPIPTYP= 0
##$PPMPNUM= 2147483647
##$PPRESOL= 1
##$PSCAL= 4
##$PSIGN= 0
##$PYNMP= <proc.py>
##$REVERSE= no
##$SF= 400.02
##$SI= 32768
##$SIGF1= 0
##$SIGF2= 0
##$SINO= 400
##$SIOLD= 32768
##$SPECTYP= <>
##$SREGLST= <1H.CDCl3>
##$SSB= 0
##$STSI= 32768
##$STSR= 0
##$SW_p= 8223.68421052631
##$SYMM= 0
##$S_DEV= 0
##$TDeff= 65536
##$TDoff= 0
##$TI= <>
##$TILT= no
##$TM1= 0
##$TM2= 0
##$TOPLEV= 0
##$USERP1= <user>
##$USERP2= <user>
##$USERP3= <user>
##$USERP4= <user>
##$USERP5= <user>
##$WDW= 1
##$XDIM= 32768
##$YMAX_p= 433579585
##$YMIN_p= -697317
##$CURPLOT= <Network HP LaserJet P1505>
##$CURPRIN= <$Network HP LaserJet P1505>
##$DFORMAT= <normdp>
##$LAYOUT= <+/1D_H.xwp>
##$LFORMAT= <normlp>
##$PFORMAT= <normpl>
##$SURQMSG= 1
$$ End of Bruker specific parameters
$$ ---------------------------------
##NTUPLES= NMR SPECTRUM
##VAR_NAME=  FREQUENCY,     SPECTRUM/REAL,   SPECTRUM/IMAG
##SYMBOL=    X,             R,               I
##VAR_TYPE=  INDEPENDENT,   DEPENDENT,       DEPENDENT
##VAR_FORM=  AFFN,          ASDF,            ASDF
##VAR_DIM=   32768,         32768,           32768
##UNITS=     HZ,            ARBITRARY UNITS, ARBITRARY UNITS
##FACTOR=    0.250966925370066, 1,           1
##FIRST=     8223.43324360094, 40241,        -173735
##LAST=      0,             12474,           34677
##MIN=       0,             -697317,         0
##MAX=       8223.43324360094, 433579585,    0
$$ Real data points
##PAGE= N=1
##DATA TABLE= (X++(R..R)), XYDATA
$$ [...]
23886 -44299 270924 -307809 -211371 -159176 166456 -135100 -247670 -126826 66623 88678
23876 88678 -44001 -51159 162893 282182 60695 -41270 254214 -52992 -208918 20893 18535
23865 18535 32896 301799 -2547 267198 47270 -307890 221031 -44669 83435 144828 -96911
23853 30611 -19918 51778 4906 119979 -24639 174990 129427 249890 -9608 120514 110064
23842 110064 130354 -367318 -65196 -7091 287408 -84863 32129 -395593 20530 -70364 165860
23830 7663 110238 -13654 -183136 68298 153776 -243257 175648 -119907 43957 43623 1485
23818 90050 403135 -40930 -138011 -41007 -321228 131831 4377 -211033 189673 94038 -149079
23806 -2694 -142680 90760 72598 -37753 113181 282069 -201914 -158437 119054 -14302 184289
23794 -77510 -83947 174664 162847 111398 -1545 194040 127223 -326807 142660 75249 -254340
23782 -109425 48644 -41132 -271973 -187323 -366262 210231 302768 203934 6613 -123519 -47780
23770 -69095 107026 -72902 36803 -230834 -25167 138772 23637 -131264 100896 -17068 164200
23758 -206366 48088 209848 4184 92296 -62509 -29871 173021 241721 148791 43028 69810
23747 69810 -27089 -67967 28735 74879 -179629 -71397 -26911 -210945 118879 -86115 337922
23735 -24274 -104550 -65417 146198 -130133 -40242 12925 22268 244715 -697317 2623 -5538
23723 -290914 -26597 -186706 -208194 -255344 -52192 177662 220277 15060 80222 142043 -258700
23711 35481 -148297 -1560 -116742 -30405 107017 143726 -181524 237999 -338499 -113888
23700 252268 -231794 265258 10232 70472 255158 -150037 199810 172508 259238 -487872
23689 142088 160198 -181464 22446 81286 275067 154304 47395 -28287 115013 -59208 -77207
23678 -77207 -79988 -176454 -89293 147795 137890 287341 186728 278330 -181536 -171806 224185
23666 110469 -14485 137041 -86901 -65051 -200357 -23076 -166397 -3545 -141517 -104819 215444
23654 -58142 -146465 215366 297665 -168032 -5227 5676 -63911 95616 29016 -116995 153263
23642 -151513 69216 238106 -309531 -120548 57629 10131 -205801 -289483 -51438 -218059
23632 -218059 -215506 161715 -21140 -22341 -387925 -279060 8487 -32019 -94442 -80237 34814
23620 -83130 357272 -94840 197135 -41544 -5503 -4285 -227295 -191089 -28301 -82656 -350664
23609 -350664 150282 90112 -235215 238294 17013 -56482 251004 -126322 127576 65939
23599 65939 -65722 -134890 20701 -187518 -199365 -36551 -52330 -138702 -182657 -155017 -103480
23588 -103480 -70673 382506 -254407 300734 -122082 -39304 97922 -159416 60668 212052
23578 212052 -38188 48825 -140987 256473 62907 43328 95186 243408 -41156 -130524 308683
23566 -25539 -32941 99774 232871 288637 -142201 128715 78718 141150 -9902 345374 20786
23554 -219843 57927 -259706 -101947 103693 -102225 -12937 36020 211575 -102134 42856
23543 -3847 -57463 18634 -163195 -167961 -96815 187238 409169 -13381 -51929 -108493 -73288
23532 -73288 -51306 116576 143095 40022 21918 -28536 -424326 254068 62150 -6914 89784
23520 263144 176402 39483 156605 -74434 -20480 -145192 -13776 163319 -10017 111647 -64222
23508 90691 23136 -411919 73653 -25361 88672 -155904 -282531 123948 246414 147490 -138584
23496 76586 309868 -311049 -55156 -65254 227457 229420 -190820 -133782 -36595 -7623 -124579
23485 -124579 -105885 -86185 -13484 -93371 -196204 241702 119600 -139765 22921 246573
23475 246573 -140540 141077 -292688 142837 -74276 -297713 49762 -406106 -333318 -124359
23464 -6168 -188966 -58440 -80309 119822 -177808 -148240 -14020 95885 -150040 -162622 47211
23452 133633 -40793 -8222 -404210 -57706 -218284 226810 206126 335812 318401 86697 -100979
23440 -13030 -117861 3747 68213 -18882 -14455 -243168 -23682 -164724 -251780 331674 -48564
23428 116791 125477 38292 68779 -292248 46879 -87136 106163 -109246 -80885 -3592 -65385
23417 -65385 -63106 -110592 -194600 -68943 -13052 -222850 14617 -190593 4975 -45631 -312 133058
23404 48904 -203053 73943 6368 -201672 -78462 -15678 153764 -128770 -298654 4536 -102839
23392 -274558 5125 77085 -37079 -129072 -48447 -15088 144544 -127398 -60374 -65155 -82434
23381 -82434 146840 -186078 -84551 33877 81603 -61526 -107124 -2131 31368 -425324 -55776
23369 45154 -152542 -97625 -81096 -55697 110013 15047 179714 -222922 10036 -16329 -56854
23358 -56854 -72781 -22593 -10132 -66557 173365 -168846 -171857 -164625 57171 299239 46900
23346 429112 -123790 12758 47223 -111126 -94011 62760 -143203 -164014 -21660 210274 171204
23335 171204 2897 220972 -251706 -59178 -257419 -156750 -227988 -133035 -78682 -4909 13542
23323 -44469 -24966 111975 -38834 -46206 94162 -5949 279005 63890 -37154 -96210 267292
23311 126510 52370 -143705 -14987 -351741 -324433 99185 -280774 -15550 480619 -257107
23300 -278884 106506 -166522 -233145 213224 -358147 178726 118681 -103002 8584 17667 -168452
23288 -16934 -113036 87033 158413 16874 127690 64558 36067 -165223 28376 -114800 -70871
23277 -70871 -100847 139054 30351 375849 89835 -270243 159221 -547 -77156 77374 -68423
23265 -25729 14076 129180 -254103 26872 -76615 -82909 -34966 283530 -114797 56563 127408
23254 127408 248657 -51408 290141 50653 110702 -1020 -75450 156738 62050 131030 173261
23243 173261 71660 253211 -206412 -214092 -138056 -286997 -227724 18504 -143819 32855 -206344
23231 31645 189173 140677 -34273 -244943 -304082 40768 126737 -88453 -170429 25511 -96931
23219 -406143 43361 97519 6323 20851 -76777 -11498 31059 -426893 150700 -248865 -5684
23207 -28686 136589 -239437 -224379 -136048 83713 497472 173714 162393 6691 108449 -11789
23195 -285026 112994 113214 256045 103156 166524 104910 -247443 -27804 -77812 -202049 58201
23183 73105 -224254 -21417 67094 -211997 44720 -138102 146372 240594 -157740 -161896 324110
23171 -226909 -101184 104421 56334 14500 123792 -290366 177371 55784 -189688 -20949
23160 -127757 -5708 -104750 208245 134598 -91823 -140835 20856 31459 -67317 14108 93510
23149 93510 -151095 -126623 -49866 132789 49251 -238069 -30168 52647 -71641 -158923 -8885
23137 -213882 -195136 -30002 147343 -326213 -33349 183059 86535 -160867 206719 191209
23127 191209 11961 -211867 -38079 98447 54911 451260 -92422 233397 7917 127353 -169562
23115 -261928 -203032 123086 -257028 -402901 -30235 -35789 -125482 -49069 79599 -186159 -303009
23104 -303009 -254326 228123 -199637 -182401 -25252 249427 -271966 129520 -152749 299919
23093 -49143 -290962 2837 -150200 273215 -311004 85505 585 -150058 197707 66460 -400682
23081 291594 -105467 810 -219449 -368534 -63421 50236 -32227 45190 -8080 64830 -26932
23069 230793 -232814 80888 -137964 136787 227677 221204 -107824 -63328 60236 251883 146660
23058 146660 144898 124496 -42669 164073 3317 396025 -57679 -165229 -150013 73879 -77199
23046 28564 -72533 63085 -98510 -219804 -29106 -52383 -113197 -273491 73001 -37811 -105712
23035 -105712 241729 -370615 323395 345007 114945 40264 -143129 74138 -108710 -180792
23025 -180792 -34239 295799 136 -210341 -125899 -71412 19637 250759 -309718 -72676 -52273
23014 -52273 -59744 -384570 -910 -185914 54655 14398 41647 207898 84639 -34012 -73151 25552
23001 -45160 -440886 195812 -166562 65191 87111 -264645 -17196 246187 -79588 46208 18383
22989 10665 5039 36579 229920 -195361 141197 -46140 26789 164870 -449846 138548 51366
22977 30635 -91596 -4352 122821 -90838 -20584 -132587 -88564 -212218 -62797 12000 -294319
22965 284304 -325686 80190 -87791 236163 -236170 -57665 76017 -52218 -93372 201964 -32139
22953 2651 -264776 -44444 347478 -332429 -87950 104690 224608 -65793 185446 -43985 -20105
22941 -330309 -231952 -89167 -111655 284613 -83725 15950 306773 -24558 -24750 -98008 45558
22929 17865 -28866 -89336 -367553 -211384 -44022 -65958 48493 -14365 226846 264149 -128048
22917 -183810 442325 18694 4159 -95051 -202725 86097 291273 -165166 161315 -103133
22906 72709 -197757 81934 -2264 -84435 -126341 69483 8317 135679 -167760 -2256 100937
22894 -75947 3639 -192425 -19992 139324 133167 -217222 -30464 -96357 -24378 -260533 165525
22882 -318337 98096 -253599 -81272 -229327 -22941 22211 -11294 1726 -12540 104835 -125672
22870 -55595 -128998 -12623 123225 85278 -148351 74309 119787 -230900 123660 -214360 108493
22858 -16778 92579 50879 -28481 -19598 -117288 -179344 363260 -138465 173811 124153 22198
22846 -98332 -40645 137156 -36708 -56707 51494 152073 -155893 -119279 -19602 -61216 299973
22834 -156393 104546 231142 81683 -49607 26797 -159058 -85555 -49288 -158647 65921 8196
22822 115584 -199582 -231512 94740 86849 -409151 -19527 -166984 -165814 -130937 -24700 -93435
22811 -93435 89125 63150 118348 102786 -93848 -179601 -90036 -36769 -159156 -18472 -175141
22800 -175141 -15599 -58375 496271 193307 140489 -61093 -95801 -130044 -135723 -238930 324726
22788 176203 152867 130039 -181597 -51604 -222615 -60810 184725 112565 239441 18324 214913
22777 214913 243014 74075 -124202 47460 -43399 292425 225997 -46718 -262851 266562 201631
22766 201631 4913 90616 -31219 71243 21714 87480 -169999 -143397 51519 -259751 74535
22754 114628 -36593 12323 62911 267121 -154483 40784 -69336 34363 -139242 65760 -33907
22742 18324 -194470 -447971 -287869 23926 38397 -328097 94862 -119916 -235608 254016
22731 3511 78701 -48421 -82412 -136271 -40032 -104031 -274680 103426 13098 303834 -55388
22719 344534 -110528 15527 12397 23778 -175416 -86694 -138282 -156178 -236758 60945 127743
22708 127743 -29771 118594 -20997 19690 200635 65271 -309391 56999 97363 -180362 -117803
22697 -117803 -88624 218104 -176378 4929 -11726 -634041 -179557 -129021 -240153 -141967 -26081
22685 -367023 72645 5442 220576 -302333 -169602 -10580 -279377 -268102 -320261 406423 -248448
22673 -68317 -172749 120162 17113 166284 -65306 156250 -184539 -54341 -70698 69390 117682
22662 117682 -185079 526810 -290745 -129301 -117466 27865 -97576 -291679 323472 -215287
22651 -27976 -38612 -32951 224937 29967 -96974 -361800 142346 -31511 59456 146003 -163250
22639 27068 97799 -12989 74820 -167742 -268378 -41652 387435 -129973 -74356 156598 39649
22627 76871 95058 285982 329471 211151 -264830 257118 29500 85242 -47002 -313331 81545
22615 99536 50868 -109814 -203478 14859 151653 -68469 -97259 -393914 -147728 39884 -17418
22603 223852 10497 468 75137 76572 -125340 -17841 -151372 -190943 -414128 102534 343 -83412
22590 -68231 220066 478585 -189765 325214 344557 -98476 -225648 26510 -290389 -6492 -295074
22579 -295074 321750 -29361 -167178 -57383 120410 -64272 145464 -306734 -85280 -391314
22569 -391314 -54152 38761 -25438 -143808 282614 -129698 -23557 86522 -110069 234014
22558 354415 -206529 36295 -163033 -75497 -25741 -28938 -112943 81013 -176166 -92872 -113500
22547 -113500 110509 75764 6610 -239432 -113878 80577 -13134 -41262 38837 6948 -359375
22535 170513 139440 -18687 53622 -130990 107244 -36848 335503 -135228 -14084 97612 -181167
22523 130842 119213 25724 -15837 15817 61260 55670 -37168 308441 158853 -191037 -253182
22512 -253182 -133055 -176086 -180585 200569 -28 341350 -112471 102557 -207020 -23217 57915
22500 -105067 -148196 -73903 256659 -233290 -84342 110938 -303360 -105123 227760 165787
22490 165787 -172082 17668 45661 -61526 9103 -73523 121987 52645 48757 -147303 -197546
22479 -197546 26808 -94814 -22094 -31165 -35248 -245622 -131355 -197591 -78934 -167974 297637
22467 -128294 -289756 -376851 137075 -149015 123899 157748 -23080 99355 173926 16818 4572
22455 -180475 14726 -245329 -426311 127218 191961 85730 -182457 277746 12531 110100
22445 110100 69673 41037 -94034 221202 -20823 21570 165887 258580 49180 -192417 -139355
22434 -139355 -225698 -19103 698 -314142 279292 -155481 -10725 -94759 -234270 -174829 21944
22422 -108843 -104133 13630 99602 -74022 -43371 -115222 112225 -134288 16127 127780 -214465
22410 -151493 125282 -132571 -343174 234707 173455 2894 249339 13400 -256352 66790
22399 -64577 -245445 93409 -276887 -118139 368019 433749 -51543 81494 -59870 210795 -155248
22387 241976 -99306 -29431 85523 28666 110463 132557 102573 7091 -70476 -153521 -65912 -60166
22375 -60166 123540 -116909 -171977 -34412 80658 130504 104382 -167772 174014 -48260 -69913
22364 -69913 -114514 109885 -209319 129547 115491 -6345 25248 -163262 -60624 63393 5940
22352 -183962 155381 50097 52147 9803 19028 -263248 8738 -7039 -22477 -255935 153342 -304291
22339 166653 404243 272119 -200553 -43416 36647 -89610 52686 262844 101169 -54140
22328 3074 2185 12563 -139155 142452 136898 148284 -321736 -257717 -135203 -81971 5778 127293
22316 127293 56671 -63292 -1412 -136582 -250050 165648 303203 -291076 90526 46936 -20906
22304 -80511 195832 163117 -19238 -157943 -136229 30463 -79440 -88277 -206627 75988 45142
22293 45142 65683 104740 71906 -84319 -30498 -330791 -38026 51577 306559 -82180 195177
22281 86319 -53188 -443810 -284228 -366589 227254 -329320 -30492 -172034 -73778 -383783
22271 -383783 -155445 14219 -290173 106397 159973 105928 116028 -187867 72307 -48839 -353813
22260 -353813 -70593 164665 -63651 -40377 -392855 68233 -218005 -53333 -17846 295035 122197
22248 189341 -297390 -29629 -183475 -375807 163295 -200045 240760 -394949 -236554 -9137
22237 77961 12140 -98900 170090 124028 115388 -58887 101544 -291169 -244014 155328 -55681
22225 -216763 -247073 37107 105501 -269204 -176422 137162 -75048 -256265 261046 141021
22215 141021 -59559 -177722 -121016 116638 11726 264879 -71261 -8211 -127714 130164 -19343
22203 228348 -115837 -421251 -337883 171033 -182779 -366579 50216 343156 108132 -99501
22192 -143268 -116265 -142156 89880 -73180 60782 -190800 59159 189025 35420 -283721 -172128
22181 -172128 86597 185391 14114 -134186 2866 -73650 70222 -24971 196209 58401 -40250
22169 348343 244960 -320606 -292066 303287 57486 -246525 -108275 181602 66224 235471
22159 235471 221506 11432 -95523 -49341 221686 -22969 -107099 -44243 227171 -105613 -197303
22148 -197303 182496 -249392 90015 179009 -28406 91290 -285222 181343 -133842 87434
22137 -319879 6658 -145852 -272455 61628 -230023 97882 -60120 -38353 -285986 -43248 -204268
22126 -204268 -373033 169188 -50881 -178269 -210061 -180817 61429 -116561 124433 160662
22116 160662 -367090 34770 145442 -19064 -16894 214199 260833 346097 25372 -215884 5040
22104 -302067 236219 -217701 -178444 23767 -5736 106455 172019 -198495 -16741 -1061 87935
22092 -37246 -47545 115500 -270736 176665 103159 36758 -43132 -7205 -225158 -62807 21507
22080 -68534 46826 -435123 -243912 -148828 -91299 -79196 -149572 90923 155867 224874 -3106
22068 136742 -152217 -180185 -324297 180462 -88163 42133 -247051 -167605 305986 -47274
22057 -594 76461 -85628 100140 61204 -36788 635284 206435 35974 -219344 110001 -229392
22045 -106278 196315 -92857 92731 -7502 219754 155285 1753 14591 130926 108189 -86967
22033 -128672 -127733 -12780 -158897 -8232 -165352 -369756 17877 -185073 36598 223307 150442
22022 150442 232138 -374261 326318 -33568 -19895 295311 -117978 -49822 -133181 61466 -486386
22010 -6169 -67796 111945 127625 37590 -190267 -78620 -127092 19218 -49245 203710 -347288
21998 -18928 -68129 95630 -45023 -121204 -120758 125257 -173067 -69627 -138353 -196348 138114
21986 249436 130718 96619 13568 1117 139936 -141243 62804 52781 -235525 -473443 36991
21974 -92475 -222512 -138596 66871 -41510 194369 -360110 -310226 -20425 25600 -495300 -266312
21963 -266312 50365 -229438 -279623 -72046 -131881 -196463 68140 -5430 -33741 124224 -169682
21951 106511 33553 160692 -150582 -12663 88850 6597 -285448 193927 -25092 -97085 -96720
21940 -96720 -92010 97427 61868 175418 -46189 -222095 11297 116853 -321932 180019 -182407
21928 155250 -107050 223623 -130517 74404 -34156 -367046 -49686 -50617 -3045 323071 53365
21916 -51999 -36309 -187880 231732 37696 -17219 -261292 36966 -70120 -102025 110979 -209799
21904 25276 74188 102166 38043 338277 -43517 113008 98472 297496 -36032 -76473 178211
21892 -222329 -112708 254620 -192536 -72628 -218287 -199178 -120764 -248487 12212 11153 -343156
21880 -12909 182690 -173101 -14699 -102224 60347 -203734 -191376 42936 -179482 -21472 41354
21868 -222336 -76686 -114438 166601 10874 168630 -246738 125841 97483 -309116 89867
21857 159458 -3652 368020 -43033 67309 170078 169512 17115 -158678 -62964 -158126 -170424
21846 -170424 -153372 -367347 -41440 -7139 -4112 118108 81524 16533 17883 55666 -322333
21834 -40429 -307131 -143581 -84383 166558 -19333 -85488 8396 424574 284126 43834 -159357
21822 -137676 -73671 68651 33625 -140151 -252061 205087 -104644 -174712 -168569 -18821 -91935
21811 -91935 107376 -148889 430666 -19120 168138 65573 235297 58393 -58654 -435721
21801 -435721 -141463 -70948 -276490 12534 -169447 -112696 -160012 -179626 -143374 500074 -202573
21789 226010 -122319 -55155 -169515 -45650 41136 29028 -118795 -188636 -270059 60254 142835
21778 142835 943 -62459 -20279 -192553 15266 9898 -168243 291383 -151554 9561 -80115
21766 123337 -197075 -112529 61862 5082 19030 -65505 90381 181298 -187998 68663 58440
21755 58440 192507 260159 106016 177793 -241089 20401 250297 -66372 29085 -43430 -142838
21744 -142838 119477 -184518 -105843 -116231 33886 -230374 21315 2259 -5824 -7887 295719
21732 59719 77784 2209 -198520 -126102 -202285 72979 -260394 -22030 -111577 179666 -13652
21720 16015 -112655 13090 -508181 260329 -68351 -244466 -225448 3672 46905 -77492 -273176
21709 -273176 -52097 -387134 56828 -146235 -194803 -54631 -302010 -56131 -125045 149790 -221776
21697 -16588 -198504 -227919 -2718 -32894 204058 -152602 -84455 19761 -88114 62995 -181096
21685 406557 75939 -103559 116932 -216645 -93166 -363667 -59193 -221384 17032 45204
21675 45204 232321 262988 88220 -339998 59186 88892 348760 -345640 -97017 161388 -315248
21663 -33414 243330 127266 -370152 -293429 6800 -104292 18773 -98470 98557 -211358 32523
21651 -70281 48202 -62390 -196980 -226386 -385194 133454 187315 78179 215895 -98780 40082
21639 -421381 173007 -251997 -90929 28135 -320873 94554 -49975 -103923 -289620 16145 -54133
21627 228560 180466 -119158 -68532 -64408 -400175 -176586 169577 -68498 -4982 -329503 -240861
21616 -240861 -27077 -56931 -229500 -83201 -50608 5107 -82508 37948 392670 -360353 -193555
21605 -193555 24750 125559 -242548 293499 -9793 -3212 254956 303190 -265474 45264 -117246
21593 -72490 -108492 412821 -351521 276281 -124659 -85959 -420316 -48959 -28511 -194895
21583 -194895 -24095 33970 9466 -77530 212014 -215431 -125794 92468 -147668 -244055 9028
21571 68279 -247245 18048 -182361 84999 -108916 -217416 -245442 88027 -137088 13082 6096
21559 66275 242957 -23463 -278528 168696 82859 -32000 155100 -254670 -161228 227277
21548 -128180 -78391 67536 -97325 -58352 193566 -100575 90357 -200997 210397 -39209 -1001
21536 62643 -108455 -142334 -77893 80463 113508 66900 -122228 -188773 -131369 -366232 -265838
21525 -265838 174709 -73633 111639 399267 -152705 -171937 -217198 -130876 -169135 -14413 49425
21513 23976 117723 57591 -89300 -19599 25491 143432 -65140 212547 -380669 -26714 61360
21501 2260 -73864 130898 9244 -90783 95210 124055 119724 -72504 -70532 -295906 -59833 -277135
21489 -277135 93955 -186015 -140237 -36804 -27271 -63426 75962 224471 -98540 -405265 187274
21477 -26074 220982 -43936 -22583 48934 81167 -50362 -439472 -54498 -401741 -48339 -5623
21465 68939 -181182 12738 -41930 -132061 -169660 -292544 -140756 -167058 -12505 -57339 -197779
21454 -197779 164858 101176 -34132 -107770 -36180 190090 81483 -191419 -230365 73561 -237796
21442 179239 104261 83552 96189 54005 319611 231582 571760 321376 -18599 223179 120629
21431 120629 11083 322880 34430 82735 -130056 8210 354777 210713 -256549 243196
21420 67482 -209463 -50243 6352 -243010 220571 35531 -475611 55895 195874 -122315 -8380
21408 -15247 -129989 -261403 -73078 -473482 -62113 100029 127919 -296244 -160408 46392
21397 -65831 -189893 151140 -24675 -280052 -258533 35208 -45906 184371 -18686 -274291 -19559
21385 -104398 29440 -34170 -90748 277792 -5234 4472 -73899 -108701 -126824 -280245 -142872
21374 -142872 286194 -93900 -75093 -39601 217022 22549 -296502 -45975 82238 217963 8212
21362 150961 -282145 57197 -271149 230592 -264420 111586 33941 222178 47457 -184758
21351 12259 -282929 -227212 69442 189243 15277 -25441 -102403 -135858 -145105 44709 42354 -9721
21338 -71151 29084 -198314 154338 -180629 6198 -45502 -344484 253123 -88298 -14876 -42095
21327 -42095 -17367 -95917 -292984 -46453 117525 -226445 -184687 -87661 -66865 41348 -193782
21315 18484 -64466 40037 47851 -119481 -26953 -16708 -64880 28400 203946 -415490 -409074
21304 -409074 -130209 55025 -179316 -200057 -187628 -470559 -54859 159294 -34102 -272312
21294 -272312 19484 4795 -6925 -459606 -53390 26139 -79958 -300364 -260373 -58741 196066
21282 -209614 111335 -175167 -69086 180326 -91730 -308897 117636 -51776 -102361 86307
21271 88811 108926 63911 -200957 111051 177999 30310 141202 -322181 86196 -207762 192971
21259 5307 -337572 321728 -8061 -17072 -78118 -137354 -177623 70938 -96557 6745 -44702 -198969
21247 -198969 -30265 -3715 -356459 -52720 23225 209030 -24787 223074 -282792 256826 145069
21236 145069 -407379 -228578 -86916 -127656 -7658 -69595 -205338 -122171 -431362 108802 -43610
21224 -82188 -615097 20536 224321 136728 -282695 -123916 -330436 -201953 -325213 132406
21213 -256955 -157724 103998 13955 9270 -91865 104685 -375487 273077 -97880 -165102 -9209
21201 -4093 148255 270650 25600 96123 89850 -235792 -53177 -146442 237827 4699 -88517
21189 -175231 -297711 28169 154260 206854 -194731 -282026 -73817 -253660 -22024 -241298
21179 -241298 -221468 -103513 14864 16669 269028 369160 -200405 -101074 -66944 3375 -189735
21167 314806 -102464 -46811 -79740 128097 239239 -306902 -3244 -39697 37597 53162 -70890
21155 153714 -4282 -239494 -266975 -118989 -288291 193938 47858 120432 -55762 -45311 119406
21143 114842 180165 -227118 -286799 -31690 260856 -105027 71337 312588 -35999 -18412 -55598
21132 -55598 131368 50265 33184 10344 -238890 -154689 428801 -489318 -381804 224602
21121 -354696 -148827 -247280 -112245 -180195 21377 210117 -125453 21090 -128553 -182258
21111 -182258 -26995 -27300 128417 56788 -139850 -2149 231992 105789 394376 -12281 -167357
21100 -167357 -264014 -368818 8816 70101 -11001 -74489 -356161 126469 202706 154272 -289030
21088 14052 -172113 71166 -19369 -16608 -64443 134853 -193485 -369856 114720 -222870 -230205
21077 -230205 -11112 -262162 -136692 -253315 129046 -83808 49069 -76272 -116450 80889 168372
21066 168372 -516328 28123 213429 -125223 -184052 -270469 -198349 -32845 -24805 -162321 -203858
21055 -203858 129434 -81593 -148444 -87538 22427 -212981 -117287 24879 -148869 155026 115216
21044 115216 -289905 -72063 -93568 -156076 -194849 -266978 -170594 -197704 -319519 -218709 56374
21032 -278176 168682 -209586 -3154 -322120 10093 -92736 -218895 -250702 79897 168825 149427
21021 149427 -187321 -115692 -231599 51207 -231021 -95411 -333209 14207 -131599 -289288
21011 -289288 -134869 -37720 -411717 -408086 82917 256456 -81856 -151381 -187885 -215238 304855
20999 -24977 -297793 344386 -301007 -69861 -334410 -125302 -257762 -82712 -126053 -315226
20989 -315226 -22381 22981 -87783 -395564 -112939 -145286 57335 -103340 -203532 83805 -6113
20977 65097 71079 97751 252931 227312 -226654 60068 -265508 59965 263151 296990 -72339
20965 174424 -14546 83058 -237491 -2536 26287 -37510 -151400 -164555 139110 -12707 -42678
20954 -42678 -119506 -197029 55530 -81695 71876 -350811 -17185 62140 -313632 -131844 -117444
20943 -117444 53777 -197297 -164352 -165621 -58248 -47856 277049 57811 -128646 7006 -113087
20931 -9835 -49613 -105304 418239 10696 -432997 -193805 -320943 107507 -290988 -137649
20920 -48553 105882 -67776 -23958 103682 13787 -71735 73568 36271 333472 33771 -97757
20908 -101256 120440 -210106 118992 236550 -152025 186923 26669 104225 -131441 -120114
20898 -120114 -118993 109053 92700 -173591 -62723 113649 142520 -187957 336031 -519220
20887 112009 -116884 -59186 24904 -336328 -27494 -17246 128677 -138782 -259204 -241947
20877 -241947 -23466 236499 -170671 -11288 -11694 -78891 -11349 -147629 -183092 -42708 -36291
20866 -36291 -377473 -305897 20973 -273211 -22708 112252 -245423 368419 384419 25891 -203417
20854 -84088 -18428 -12891 59706 25334 -25583 375274 -120311 -203053 -308904 5951 82414
20843 82414 -210984 11158 107117 -204710 -152311 -243049 -227897 -176322 -177668 -67811 131322
20831 -236820 -143469 -303018 -260291 -202160 -360353 -53095 -44409 51629 -30677 -103059 107488
20819 -157191 -78215 -39507 11761 -196398 162384 -259804 40302 85564 -40834 -62724 -19976
20807 -49130 -63492 -8835 -138524 -242405 -191406 -175644 61049 -84029 40958 -207783 15895
20795 -102010 111206 -134867 -254113 227238 71143 -153225 -218864 -423995 -198871 -28226
20784 -114689 -128815 86585 -141127 286131 253566 -130647 -31988 -256139 23051 251299
20774 251299 -87647 102249 292466 2040 -351317 331348 -91338 52904 -186128 109141
20763 -48421 -12668 -212327 193234 -68252 -5301 -45918 -42664 -300117 113942 304861 49982
20751 -228842 30459 256424 -224901 -16060 -90078 -277058 -325303 259402 -26390 -197800
20741 -197800 -154212 -128490 -22068 -66765 273264 -18660 -30435 -48557 -65714 -34364 -438234
20730 -438234 -242960 65584 297973 -238371 -302700 95590 -155121 114617 75344 -123919
20719 -1548 321803 -182655 147330 38521 -271283 -105801 -189480 -113724 73336 34046 -206851
20707 195494 14103 -90692 -42329 -95176 -356639 82057 -333180 -328686 71003 -85868 -40358
20695 37643 165549 -155877 -25169 -406479 -236310 -258310 -96416 26264 -251057 -86731 -186820
20684 -186820 -212763 -124566 33335 192136 54472 -202129 -85978 -201652 915 -217399 3286
20672 41824 170428 -16504 -119616 -116682 94190 -299004 4847 21074 -46801 -237087 48783
20660 -63940 -49027 -231143 162761 -19994 -12926 54199 -190494 10561 -98888 32870 6957
20648 -178986 -281559 -191399 -84696 -97778 -164443 -152002 -153769 -29387 -497526 -18065 -239899
20637 -239899 33319 85714 -191064 111178 -131878 61126 -20041 -216163 -33989 144401
20626 115380 -310921 -201774 84552 45342 -12202 255756 378707 -218473 -575070 -79681
20615 3990 -105279 225495 36202 255771 -207592 -34646 -363454 199092 158792 -134601
20604 19810 -264858 -123989 186572 -212475 -324746 -339541 58629 -350366 93316 -43302
20593 51241 -187458 -284111 -184012 -148370 300363 241618 215431 -173348 31968 8431 189922
20582 189922 176532 45070 -78919 51790 -98845 37767 237958 41528 -350990 -19816 249269
20570 10346 -241408 -250248 115837 186459 -157449 -234739 31644 39929 -87358 -128640 -49722
20558 56399 -119915 -93306 134208 -381417 -202752 228373 -262143 138544 -67570 -497320
20548 -497320 3780 -2997 -116058 224474 -263537 -276804 169191 164934 96067 -353774 41029
20536 296367 -180423 -336442 -219381 -68087 -40159 -47219 -195197 71013 83862 -105379 39084
20524 549438 -190631 -224878 -59669 -73782 281439 -71179 -4289 -452218 32033 102602 -160586
20512 -237302 -21879 -505912 14030 149039 -11130 82265 -95282 -172736 3768 93326 69850
20501 69850 -205494 -254607 -28792 4234 189360 74834 -24178 200138 -110792 148776 -103818
20489 -117444 21348 -145085 -3504 -52186 66514 90177 229756 -223074 -64603 23310 -10676
20477 70129 43703 12181 -152424 62870 -328903 349525 -237972 -116685 -206883 274842
20466 42553 -28483 113974 -236368 147762 -161895 78486 -20778 -34193 -46780 -175058 11194
20454 -6055 -395504 -73112 108562 -19807 82084 105730 -140534 51173 369825 176611 -153763
20442 39093 -187369 -323355 -172072 -320274 90167 38747 -104361 119322 45892 -16188
20431 88774 -9829 -27866 -206210 -23653 -37798 -142373 -239251 -65806 19211 -141493 -226955
20420 -226955 95794 -121294 118327 -60078 -127045 174841 305816 -77554 208408 -155835
20409 -76246 -91504 298112 -34818 234193 -479851 110309 -163354 -27000 -32860 267527 32289
20397 -377269 196002 190339 -222430 -165650 66369 2790 -115039 -378047 -24803 168152 -32102
20385 240568 -235282 -4389 -359810 -167106 -216115 29409 -139715 82768 -42801 -371123 -230780
20374 -230780 -257124 -68558 -155856 231277 -159828 94243 197661 17400 173425 -46656 -29667
20363 -29667 151175 95067 -179686 -245507 -72624 -50545 -252127 40545 -174975 -248260 -136178
20352 -136178 94337 -83929 -8399 -216572 8800 -12521 -107905 -52320 65599 -218366 -21485
20340 -76736 -163253 -288489 -65151 -68559 348112 261280 -223634 -201551 -111914 -122024 -142321
20329 -142321 223226 7541 -269201 -59360 225988 -116798 -294020 -195181 -107722 -114179 -79612
20318 -79612 -57149 52601 -64684 -160135 -263079 -3460 226324 -256143 -215944 104730 -202576
20306 -36756 -161423 93608 -43771 -9963 142646 -57786 28943 -117569 -6300 156396 -33877
20294 219115 53323 89996 -119218 -94802 18264 184979 -292305 236410 -28191 33343 113494
20283 113494 -110145 -180067 -52640 -170961 -49785 -117798 117354 -395441 -20726 -134973
20273 -134973 -98088 244051 -130308 -198781 -122661 102525 -112259 -94133 -160131 47691 -122189
20261 139514 -240096 -93183 -243003 227920 -239900 38418 -148039 -299422 -30838 -30327 -138126
20250 -138126 -210083 276699 -211897 -177831 -37718 -364010 -100075 -312968 -318562 23923 -267638
20238 -129542 -168039 42850 -49439 123779 111188 160026 -48074 171450 -186621 43263 -145781
20226 -339222 -265533 -244054 -35483 181381 65659 139350 122352 -31035 -92751 -55053 -152387
20215 -152387 32353 75203 176222 61672 -262240 -402079 -303843 128679 180048 -74526 -97301
20204 -97301 -430373 -72543 -483966 368787 113460 8410 -214589 -164958 -378524 208116
20193 362571 -4652 3407 141117 -79441 55740 -167791 49648 33914 -319340 6184 -72576
20181 10267 -47481 -48330 14734 -13305 39724 -246936 -161350 -91182 -364060 -239025 235278
20169 -166351 -214231 -25010 -235166 -190690 168873 -31459 -141963 135200 -226034 -109798
20158 -36062 -24197 37679 -279038 118803 326524 260068 -82649 -44839 32824 -23918 -267221
20147 -267221 -337414 5001 -141084 142395 -150745 121083 185517 109593 -75045 -21340 120806
20135 -213424 -101775 86779 264536 -291335 -222814 23357 -445739 36112 -215703 -134053
20125 -134053 87897 -170095 39489 -85099 88191 -113549 283897 -392782 191201 -46199
20114 78276 69463 -223267 -139965 -99707 -257619 -229352 -194005 29337 97598 -485942 -55415
20102 96855 -26745 -33925 -21997 28779 -62244 -174648 -56890 -58536 -204204 -177471 -94595 -180694
20090 -180694 86185 -200336 266345 103191 -103882 -310421 -48282 -59492 -204535 86096
20079 -287074 51369 65648 45062 -47322 298872 407532 -148343 206703 105334 -231323
20068 25653 -113846 -59449 -43080 -63883 -106918 230876 -115855 -169864 50674 -18693 -307877
20057 -307877 77483 -32957 -321314 21098 -272795 -28734 57839 -318748 -219901 163615 346290
20046 346290 -64652 -53633 -50346 375406 -426665 -162628 -34399 -286999 -121968 -128312 -130289
20035 -130289 -193599 153984 -36479 185703 83209 -324261 -356340 -190570 -6370 -318637 -158164
20023 -208659 -165782 211106 73663 60684 -263930 164560 -242843 160035 -154477 114829
20012 216016 -310549 -6360 56222 -91211 15731 231912 -87822 -249997 141690 -122104 69381
20000 147224 5531 -269 165139 24544 103625 25988 -335386 -256791 -116768 201631 147989
19989 147989 158148 141852 174089 -262518 -12721 54530 -335007 -23677 -160709 19631 37705
19978 37705 -338395 205680 -88315 88575 -188369 -148042 42395 20132 63821 -305458 -131798
19966 57908 -32109 26291 16736 -2079 -128349 13745 -117645 -95837 84952 183819 -71660 228206
19953 -49291 -199016 -29900 208178 -177053 -177320 -64110 121784 -110816 -178243 -145164 -266645
19942 -266645 -176897 -136735 -284603 -76774 -87515 -8137 29771 -159503 -233310 -297274 17541
19930 198163 -152343 -404945 -156893 -435424 -217366 -121709 -234704 -255670 -57182 -138225
19920 -138225 -101712 -108938 245338 -189229 -475071 84304 -146650 -39434 -139238 -57224 228167
19908 124891 64551 -133537 -160447 -259152 -133861 80416 90452 -217832 11285 -112102 57727
19896 23127 -23275 -31254 190211 -88825 -331671 -373353 145848 -22849 778 -81517 99286 -250421
19883 -117468 -66979 132670 93998 -138251 -78192 -70202 -148413 84053 35850 -203982 109193
19871 -571 -137678 104248 64279 -151855 -366430 -292435 101616 269723 -117167 -149221 236137
19859 -36360 -20583 -185069 -21917 -37771 -29237 -73829 53952 -284706 203006 -135126 -314274
19848 -314274 285697 -302647 -432829 278201 -61083 62327 -132654 -214585 158551 -45232
19837 -8920 -345 -15419 -23072 -91436 211161 213013 385419 -199846 -170895 -149012 -25297 -102149
19825 -102149 125396 94539 78234 43238 -19875 117514 164996 -120991 -272475 -98095 -113380
19814 -113380 -111795 -34645 -195269 -427334 -321968 -318822 180003 65967 265567 16091 -31374
19802 10166 -208453 64107 -69153 -230037 -154823 140649 -71866 -377148 -161827 -29772 173903
19790 -96029 260595 176919 -165463 -471298 189778 -264545 139569 19696 -36079 310943
19779 -179577 -429723 -253282 -282727 212764 18850 -96377 -335148 84873 -79455 -124730 114281
19767 5858 262298 -76290 -119320 -476918 -59986 -310731 82552 -314322 -307355 -16833 -195880
19756 -195880 -23113 34222 216444 -47425 -142157 -110673 -53265 104905 -273686 -11066 -87233
19745 -87233 164792 343923 -6805 -17951 -320156 -282847 127398 37573 182070 166693 -222232
19733 -85435 -128486 93424 4050 90572 164472 39436 85879 -270115 116916 -47051 -85095
19722 -85095 176867 -303608 -135653 108511 293045 17184 -120678 -38760 122758 -184943
19711 -68781 -196018 -299917 -60706 -159891 -178032 103894 203600 -374769 6842 155878 -245703
19699 -99019 -417616 -373108 -186471 331526 8629 -263735 -199996 154955 -24080 186770 89795
19687 -16292 483492 172216 10965 133345 30250 -113345 -207016 102694 71335 -153147
19676 138983 -22802 -315691 250966 -203567 -536583 -319104 -170850 -164464 -21995 -185428
19666 -185428 -123822 -138730 -233275 -169022 611 -72125 1651 -301314 -25502 224600 52213 -219305
19653 228351 -313675 -124796 -325499 54269 -295648 -156336 26227 -53722 127140 145247
19643 145247 -122021 -90246 87517 -59871 -136384 205468 -289843 15427 -190147 64404 -247748
19631 -213761 283297 86522 -148425 62854 -251967 28112 274477 -55716 31577 -24949 -123548
19620 -123548 8557 -163487 79848 46567 -15550 -187261 -65252 73693 -97464 -243898 2277
19608 4999 387241 61556 -73744 -222347 26437 -199062 -47020 -269019 -71103 -165749 14960
19596 -40981 -4610 -13084 179218 62344 -24945 72558 -361421 289765 32391 12316 78956
19585 78956 -22544 -244986 -19320 -125262 -12812 48220 -247618 192558 -222313 244876
19574 -59888 137761 -50443 -101514 -183291 -3534 -519666 162425 -160131 -143469 -48782 -82287
19563 -82287 -18035 56899 80881 239856 -125780 108875 75804 -97967 42991 1695 -229991
19551 119507 -350485 124149 28097 -260960 -77987 -68447 140132 -221719 79822 -186070
19540 -161894 -371502 13597 -105434 84283 -124237 205084 55522 -169049 -114853 -139951
19530 -139951 -96394 -266259 -221138 15171 38213 -181913 -157446 26525 164489 165878 -262105
19518 -23523 -256929 113279 47916 61270 -11657 150012 -380002 79975 96682 845 -277222
19506 -71663 -60275 -304404 187691 -129809 -9403 -57212 -188861 -382733 157027 -238367
19495 -63866 43011 -61033 -146545 -213540 18630 -156974 -416455 185123 -176319 -12590 -49730
19484 -49730 -138202 -414224 272811 -241668 -229397 12332 66027 -82004 -52394 153115 -193513
19472 1123 -147778 -214588 -64827 -199468 110376 160274 -100019 -54466 -77895 -110569 -100287
19461 -100287 -196496 -412803 -49347 -200888 -274064 -203090 77139 -39722 -133665 -171893 -270761
19450 -270761 -201282 -242205 213071 117754 254519 -236943 285770 -55377 98110 101336 -469838
19438 123096 133140 -192231 -155239 -304378 -94567 -128774 -9925 -35246 21015 97640 80763
19427 80763 141996 116636 -12455 109817 -202214 185179 45347 -238773 24778 -181646 -390281
19416 -390281 -99578 -407029 205308 -246934 -125310 -201670 333675 -298455 -19773 -112963
19406 -112963 -42219 -17581 -107297 -100629 -36637 -6011 28836 -122340 -262710 12899 -6391 188630
19393 -116113 151054 -9895 79570 -136430 -139788 -199250 70218 -206631 -421264 73259 42228
19382 42228 54762 -240449 -88777 -175961 -102446 188599 -168349 159336 -139342 -270564
19372 -270564 65701 69308 -98269 -71788 -69923 153934 -92913 -119170 -34314 -409271 -36464
19360 15031 -125132 31309 57384 -172319 45485 202017 -185407 -150575 31172 -55358 -31497
19349 -31497 -306451 -356507 -277941 58777 -131626 92464 118003 -89699 -157285 148937 -253271
19337 75852 -101107 -86656 -171293 -69942 -362444 -294518 -167498 223984 184957 101817 -36737
19325 -236572 -85489 -28970 -163021 116486 187989 -116274 339045 -130245 -19002 84397
19314 204059 -6354 53006 261084 123156 -323663 55894 227000 148783 55519 129283 -74743
19302 246293 -4392 -36364 -125853 -249648 -126575 -177601 6074 -104603 -184657 -46936 61842
19290 -195461 321565 -155592 -42440 -411380 307276 222703 -133501 81934 -76749 5872 -217970
19278 204135 -23270 -77189 95275 -238123 -246032 -1007 29517 -116722 -97464 229388 1909
19266 -48076 23990 -148681 84501 -205272 61499 94355 110904 -26265 46550 -224303 154883
19254 -203712 -275313 102602 -103395 -83306 -95933 -77562 -30726 38645 -205704 -93524 -19385
19242 56972 -295550 -72694 -189707 -179337 90092 129819 43937 -48576 217802 -325535 25066
19230 68840 -35155 -60841 165408 130038 51898 -172623 39065 -57220 95063 125249 -255976
19218 -143496 90272 160008 -282863 132164 39933 119751 -152184 -156620 262052 -226533 -362142
19207 -362142 -286125 -122906 -11141 -177273 -98736 -90110 25913 -181244 1032 -26016 90129
19195 122654 -13759 -101672 -85714 -261995 132758 -131398 -371031 221635 -289115 -115866
19184 -44283 -231563 192891 -140112 -118126 66111 39943 -73319 12168 24347 46050 -2538
19172 -61344 -165954 69781 219714 -37213 -159864 -132189 -115833 -14581 67538 -9373 41953
19160 -132439 51703 -193320 -172400 50428 -372676 98925 66546 -12019 -90039 -295742 -36495
19148 -138959 221327 -214904 110874 21235 101220 -319642 -190117 11020 -17066 40982
19137 205334 -164832 96316 -16775 -87279 47592 613 -37062 270999 5742 -108630 364331
19125 -44092 -162900 -57264 -61789 -221968 232011 -244152 -230345 -80121 260267 165314 39919
19113 15406 148073 -10694 -266156 109316 -90464 234546 -41320 87037 -49333 -205614 -126218
19102 -126218 122928 -90861 -270719 -388882 -116781 99379 -51058 32212 163333 -101974
19091 -30265 -224585 -106498 67539 144987 52418 -176770 -271183 152541 146464 -93042 -235184
19080 -235184 -285537 -45628 -296169 64284 -166919 -32245 26767 -116264 -200392 -33843 167105
19068 84246 240356 187611 136483 -336509 33748 -12298 -276944 -92188 -44937 172974 189769
19057 189769 -170344 -20942 -94414 -355876 139582 -525876 -91442 -147730 -8169 -9117 -239550
19046 -239550 101345 110877 -125206 -231970 79165 123134 -215422 -121742 -59361 106833 131758
19035 131758 -48658 -115789 267618 150397 -18373 -150837 -68968 116825 11968 -250059
19024 -232820 88575 -39503 -78572 -28592 107658 -37689 27346 51117 29436 -454152 -189296
19012 -232467 -469287 -59060 -9944 105026 -86143 -109590 -105353 -70966 25975 -68646 36546
19000 -365947 43509 65356 143377 142075 4471 182667 -195893 16987 -276263 180622 42344
18988 -144738 -193753 53982 -239564 44539 104369 -175880 -326818 -229405 -17816 -411611 88796
18976 50625 115636 -292301 -244268 -114686 -146214 -158338 -320512 8845 -290266 64292 25116
18964 -72423 -334687 -150064 -60660 -115077 -63169 133552 248401 -264393 43797 -76592 -12225
18952 16914 191805 -43040 117028 -28093 -17775 -414458 159857 529676 -185797 -171355
18942 -171355 144627 116133 -35003 176457 -30373 -139815 59559 68134 -250749 -178299 -37601
18930 -190321 18871 -17689 -401049 154191 98226 -133111 -22113 120202 44115 -63248 -12887
18918 -5161 -104443 -17264 -54313 -28804 -181423 37120 -182501 -57881 130158 268284 -185457
18906 33016 -55314 -158639 204446 14471 -105826 -124088 133498 54982 347710 -81567 -20240
18894 -92939 -3307 354153 104392 -120031 100369 -33116 -189841 87693 -327302 116242
18883 -63119 93099 157503 230391 21627 9768 -195503 -113931 -82071 -10391 4428 94444 -590739
18870 -4778 -243897 75811 148121 -262596 -68640 -218800 -48088 -191256 -96457 336320 327374
18859 327374 89886 113022 108398 49206 -56335 -119233 -195322 40291 -10522 -125724 -131511 -177074
18847 -177074 -129070 -270490 -20339 241398 -164888 -35691 -59015 -21540 -272310 157037
18836 -329833 131458 -143152 -3573 -97589 -258385 -133538 164337 168366 -256961 137752
18825 63701 -217891 19162 -82500 -104794 108961 182527 6164 443750 345435 70311 -184228
18813 -64865 206935 395175 167273 206616 -240256 -18263 256705 11560 45627 7375 61089
18802 61089 24687 267816 -88642 -110349 -292603 -223881 -24577 118760 126205 -56195 211858
18790 -95666 -199581 -11987 -134405 -212705 9619 108942 160913 -187259 -17169 -204374 124067
18778 34888 -245114 90941 -35620 -35394 -96225 -121694 -251019 -5795 -8320 351574 -344049 -97454
18765 -13707 -65825 115132 134768 -176740 -96281 -28665 259628 -51814 79848 -146748 147590
18753 29293 164144 -111802 78434 52447 -169606 -107785 -364418 -253752 72485 -125124
18742 11599 8020 50987 -13743 76381 -110886 -141848 142565 -18909 79346 32271 346392
18731 346392 154878 2475 -19151 -35060 -138009 -214988 -12498 -57387 72784 147095 -17468
18719 -217352 -364674 -64300 -4077 -187188 33895 -29875 -34790 -52992 -152471 24662 -62657
18707 16552 -72052 54549 143443 97817 24290 221076 37107 -54956 -158840 -180809 24797
18695 -289536 137647 70197 -472826 -350392 92667 456 -308212 -100181 -344098 -275481 48065
18683 -30396 -126712 -144335 -69982 -44469 21835 -179582 92594 -303889 285038 -67314 94376
18671 -393051 43204 287333 -89582 -208975 -6900 355195 105921 -56365 187228 -75137 42566
18659 -113209 80136 -312556 66356 144968 -17745 -132611 180571 63568 -257780 115670
18648 -582 -9548 -5689 -189478 155703 -106515 -7651 -100504 48562 -315016 -262234 -254254 -18774
18635 -292567 147135 102912 225531 -141907 -88200 -258696 -129985 -18493 -256010 144772
18624 135860 -148081 -5753 -213549 170196 110863 -37109 221352 -87462 -243120 -314805 -72747
18612 -109307 -110427 -361819 -28570 -192952 185520 140803 -5315 23838 -158060 -89447 76733
18600 -30237 143124 -37406 14331 137354 -267905 -66700 -49101 5332 -100970 186296 81645
18588 -81917 -181964 30271 134110 -120217 -78392 76113 73420 296341 -10805 -537254 59721
18576 2481 184663 164802 94849 -7027 -167200 161620 87576 153268 -214825 -54189 -169363
18565 -169363 -163233 -38200 -6704 -125743 -4561 -72136 80431 79246 170262 -228171 -206160 -212981
18553 -212981 -135438 -108413 -255774 -27048 -61738 103649 74475 -66959 -467840 -135256 -68898
18542 -68898 -187670 -90460 -61764 79514 237124 -26422 -14198 -208389 -283501 -179448 -40648
18530 -47971 -92684 123390 -77459 -55812 -32250 -144051 102693 -110033 41517 -301285 -268892
18519 -268892 116558 -79758 -110543 -213530 97871 -47833 -304592 -77328 -34433 99895 84041
18508 84041 -298621 -235338 -98787 -187024 -225375 -351211 -34244 -14394 196569 -67329 41109
18496 212333 73939 -236026 -252129 -164766 -267236 52202 182175 -9923 7054 76135 -196106
18484 -2917 -117187 -297933 -188882 -272478 2143 123468 17979 -223237 76296 -164739 60981
18472 246422 -169051 -386299 -65192 145416 -19764 -3755 74889 136685 -39919 -210309 483388
18460 176970 -192724 -139769 -2453 229870 -118888 -76859 153626 25778 -174677 -20707 -165935
18449 -165935 -165469 -199579 96883 -55037 -396152 141268 1255 6206 303661 -87359 22548 -223785
18436 120894 61976 25562 67125 6670 -229903 -133878 37501 -59222 54141 2055 -168884
18424 -31514 -418348 -291606 -40456 -144699 -172340 -192038 -77798 -130674 -5724 342600 161182
18412 -75487 -12565 -32277 -37845 -7572 114071 -263367 -46867 45656 -60696 -90720 -107553 172300
18399 -177111 -148757 448002 -17469 -195052 -267928 -170577 -113768 -166119 -30260 -20803 -305074
18388 -305074 36015 145878 -125297 254704 173992 -19666 -73004 -301534 -464265 118618
18377 -167532 288232 -66918 -51467 -186701 -31850 50092 -282678 36485 87454 -149774 43100
18365 52823 94137 217079 141341 -152863 -57190 -69374 -31400 -43288 241487 -1700 -142424
18354 -142424 -147192 -25385 -302795 -289180 -168557 -218678 359985 -107892 13248 -421 -38409
18343 -38409 -12110 -154023 -85189 -168972 -163079 -369167 -93686 200093 396325 -35966 156679
18331 22616 -71518 108989 60918 1106 -230655 16958 -42278 -345495 -137917 168525 102678
18320 102678 -56196 -112745 63524 171537 67893 7117 -148549 242038 -87070 -351781 212598
18308 -5704 -102676 -107246 -80424 85772 164782 -178656 -136838 31784 -217356 -13602 -13711 58657
18295 -259852 -84135 234554 -204862 15502 -297343 5382 170073 156276 -363646 -163917
18284 76776 -19361 -115656 -15829 158244 -69207 -256419 -126110 -241225 -143003 -314833 -108361
18272 -149617 33472 -120397 -193444 52105 -23450 107447 330419 121293 -179938 80575
18261 -416096 52951 -1761 -101466 227692 83298 31316 -144981 119843 -215707 140416 -287239
18249 188108 44521 1241 -326074 -184143 -318941 -161174 -89687 368807 -47691 107200
18238 124554 116589 -343855 109653 -174030 -150967 101646 180595 -313809 -143011 -283725
18228 -283725 -6525 192391 -155603 -48736 -32606 189162 -177945 -71579 166708 -19908 -85136
18217 -85136 -120870 -191243 -111510 -182014 -565660 17583 -295106 58155 -229021 -34288 -223885
18206 -223885 -24317 -50642 -175141 -300971 32733 -54682 -345913 66666 133280 244598 -338865
18194 5922 -93007 140923 -243084 246129 -13910 236745 419551 28376 -75673 -101791 -166240
18183 -166240 -264240 -198575 -59224 -257524 19628 -48517 -106918 -107328 269218 -92165 -281615
18172 -281615 -56663 110576 51325 -432824 110494 -231592 205 -32376 -145314 -234865 86367
18160 44120 34121 -35802 -65873 262040 21305 93694 149983 -150189 -127789 105188 21432
18148 -43733 129951 345270 292485 -174115 79169 194518 121153 48519 -181909 -84183 -162112
18137 -162112 -29599 97587 -164239 -13661 22746 -169180 -68282 15546 52336 318447 63608
18125 57655 -168531 61561 78365 -322601 -608437 134952 -302395 -255133 -186005 -277244 -79533
18113 74348 -52006 10711 7854 -278869 221760 60325 723 -84587 80037 178707 172244 266992
18101 266992 -174005 59971 119815 126252 -293834 -334411 -34198 -232567 55381 -10967 19391
18089 37937 -140162 -107971 42313 40368 -273161 -221135 -172578 -105076 148689 -375154 393807
18077 2474 386471 133711 18638 172320 -190951 -102594 -31476 -89056 -81609 129394 82416
18066 82416 5392 137103 4525 -77780 116249 -82701 -155371 132686 154399 70574 217800
18055 217800 -178681 -67395 84146 32480 83027 -16249 -187576 -10329 74277 23178 -132689
18043 65732 -69882 -157957 309148 -5149 68509 -315517 -7959 -365819 -99 -8053 161525 -133141
18030 -113696 69567 -90983 161171 -204545 294632 -39955 -56774 7864 -241888 22555 -52500
18018 -111044 62700 -175363 -65474 -194646 -326351 16863 -46298 -175599 -56417 90771 49866
18007 49866 54374 49661 -28452 56300 -31044 -23261 62034 -60343 5569 6933 96607 76513 -148400
17993 -2165 -85622 -534072 -79670 52211 -452 -133588 -67784 77873 202324 159860 12578 -89928
17980 -289083 67169 81424 -48407 84802 -129888 68008 -7506 -287450 -159502 -46548 -24270
17969 -24270 212233 252884 71498 40733 -549620 -124069 130286 -79474 208315 -87944 -41594
17957 -30936 -18632 190357 391211 -48312 -67784 -166509 8926 -230651 -93558 -304195 60357
17945 168400 -134562 78280 31120 202995 42648 105014 -2931 73018 142555 -242863 -125935
17934 -125935 -312681 -199626 54139 -146790 17092 145345 -260083 -13255 31671 383502
17924 383502 235057 -37928 -51627 -155879 -185947 81726 -19538 -149274 -35590 -149335 -2904
17912 119637 47320 36492 -264718 29952 263182 3003 21391 57431 -151863 265834 229880
17901 229880 -255831 163743 377610 -94812 -107680 109201 -1374 -116210 85781 192248
17891 192248 129424 216698 -132370 393176 318693 -244 -124168 -189108 -14326 -97227 202768
17879 131492 -17455 -35383 -101739 -97593 49888 136471 -340374 -129379 -305200 121056 -49160
17867 -16297 46142 -15669 -114345 156838 -65272 -57350 -189286 -108644 53290 -80870 -1975 -10436
17855 -10436 -69432 -193046 106676 -43734 -207587 -77227 60707 -83075 -248661 -9601 -302956
17844 -302956 57290 100496 -56417 84940 58560 -313 63917 51356 -157707 -54540 120689
17832 195890 -287342 81659 -158397 124941 -196094 -194265 -366728 -25672 183028 328943
17822 328943 198687 -270132 100722 -136022 -170523 -190950 -108054 -207302 21525 342314
17812 342314 -193738 -413602 149268 -129296 380502 203935 128703 4160 22499 -49241
17801 -115814 101831 300889 -21490 38155 -42696 -96540 -124693 128956 14109 279142 -355701
17789 -238213 218141 163858 -71191 -196980 6662 -85717 83416 -188823 44469 -179890 -163866
17778 -163866 336724 -224996 -218432 -335874 124277 259598 -4446 209927 14308 -139945
17767 -115877 -341459 -42018 -273687 321478 236896 -1731 -79078 -104130 263250 158027 53423
17755 -292915 123116 114934 -113111 -97060 -40890 31030 97377 -92495 34607 44758 -212548
17743 1000 52245 -13354 -7070 80196 55115 278768 -142374 189794 104407 -16575 85495
17731 -92692 -69465 152957 59005 324349 343924 120047 71451 288479 9639 -42402 24586
17719 -87467 180138 -243204 -144386 -54065 147297 -117539 -111218 317378 216807 -50776 105846
17707 -267709 -55863 -54899 105917 -21712 130921 135256 -106911 92118 -199503 97132 1087
17695 -203356 292875 -89654 27362 128470 -170408 255608 120060 -149573 53771 278768
17685 278768 289242 -129582 80789 276248 -231948 281656 -112925 321337 112042 -263027
17674 -108849 -236008 85028 -110115 -70517 -188377 147296 -94631 293946 66855 -128265
17663 164634 5097 -196470 86290 -209983 154886 151397 -561139 185148 257625 171507 157858
17652 157858 -99310 281568 -14815 88036 -95444 87829 -144671 160197 115285 -182634 265166
17640 91291 -211119 171462 -17985 114757 219494 175300 -231864 127061 45078 -176728
17629 317402 116936 111569 94610 -22647 59028 186959 -124261 8682 192178 -57241 365912
17617 -20035 -76388 123863 33121 29729 -99696 75373 -77751 219892 52378 61331 -5779 12091
17604 6246 29420 -113990 -298429 -41334 24889 -3585 -15140 58471 -317740 -180485 -72984
17592 20311 -13742 -326220 -49706 166368 45303 162831 -243408 -137218 -251770 22360
17581 100867 -111142 120248 -175186 -307456 70994 271220 74307 -54071 -178829 -79098
17570 203414 -178602 16035 276298 5370 149504 79512 163932 -67329 -7386 -80131 -247855
17559 -247855 77923 112966 309286 -82370 137918 123275 43900 85865 -20423 111316 258387
17548 258387 121870 446859 155598 336031 49869 -40934 -127565 -161913 -100568 -160653 77980
17536 115550 -48194 9838 -121216 185599 -67707 199858 96831 190040 148386 146914 208843
17525 208843 172788 111223 397098 444678 -136736 -34221 31261 -35834 258678 182040 -72019
17513 225215 166728 206945 -152519 -89127 -135206 157719 -81044 -47825 290758 109332 202010
17502 202010 -131077 255482 318187 97855 181647 197871 169984 -115373 -344512 220764
17491 -265079 -67737 222379 49579 -66795 271051 308690 341457 -25362 410674 -82074 145844
17479 521634 313491 -134798 173568 -57189 235974 -79734 270292 68439 74837 324502
17469 324502 108740 462793 264554 110068 -238053 6557 -62119 219109 131085 11673
17458 297260 168039 -261211 -223832 23751 369741 160904 -23377 -127848 320509 163719
17448 163719 497050 135229 282330 352262 344960 287967 252347 206468 301251 409 412422
17437 412422 129259 78036 221471 1469 511292 547681 256349 76421 223863 344206
17427 344206 96798 101714 138466 208988 94587 173992 366564 -14590 125962 -18505 384593
17415 309140 352306 -106179 228887 274850 308055 443805 263422 102148 332004 44555
17404 107190 146709 112333 185214 78431 203787 118410 25552 190880 34460 -213060 145605
17392 -165492 -111403 254428 -208229 -155585 213067 88167 241996 159995 -102833 350439
17381 263387 117219 247475 484110 144638 -33900 81458 39649 202839 120607 243168
17371 243168 266530 87612 128020 90927 176467 218922 -10949 6280 -35956 145204 132783
17360 132783 -208603 -25737 95275 150275 -143473 94150 101252 132069 236074 -51461 -20857
17348 287945 122237 -28742 424362 128873 47794 411861 174887 56415 155041 18013
17337 334202 -146753 114027 512292 5986 5572 47643 299012 118095 -507 9619 -91547 227430
17324 185375 -40154 382709 72295 217386 323031 119313 382572 422275 314160 106557
17313 -232689 -9057 -20329 113509 16663 -168038 80375 -46940 -43521 16780 150820 397791
17302 397791 -10554 -26029 143542 36897 22486 75374 53024 5762 -240762 46507 55227
17291 55227 432304 -198758 -142865 236852 252669 -21942 497176 184727 240867 197655 221070
17280 221070 206297 38157 205082 210501 259260 15230 583489 147353 81238 29485 198263
17269 198263 105638 225693 -121433 155132 49760 87327 -38904 135661 205829 -143278
17258 159128 380849 276264 149673 3311 321121 121928 255020 191968 216485 187127
17248 187127 161813 -71699 208490 229335 204613 109112 324181 357173 25628 390690 137296
17236 9957 206460 -23183 136897 322877 357590 210703 292517 -48495 382326 451391 228337
17225 228337 217575 77903 166183 137827 255006 332854 245479 262996 218979 -28450 268809
17213 182107 231570 65103 286833 -85759 228328 232771 169951 335713 112204 225397 68442
17201 -170801 267654 175457 375326 220781 297171 382870 139447 -61313 136061 110191
17191 110191 313367 22150 331299 129231 27518 -53598 128583 291470 225552 211557
17181 211557 189779 245548 380371 -36008 170394 354792 262450 341539 53241 501168 135260
17169 678396 224751 72946 335996 202193 331715 413416 273303 280813 188225 -63806 467844
17157 390375 136231 158349 198405 259571 379320 445269 319834 150868 121193 64371 302841
17146 302841 128473 363944 150744 209220 351657 340266 450971 386269 551545 491554
17136 491554 440993 504835 378601 229585 247456 317724 193517 177599 577073 215900
17125 579535 175219 219032 205775 496634 589338 376071 165638 460451 310307 730595
17115 730595 344442 375385 350818 675578 511229 212012 368737 321958 -82134 329039
17104 247746 615713 278621 228820 364699 339682 703408 141691 417711 403370 344267
17094 344267 392093 307883 247000 264680 469920 331639 239357 572827 382041 239265
17084 239265 732735 119472 326471 356663 211391 494040 400070 541880 395753 282603
17074 282603 200555 486214 497345 520324 337709 447564 275749 348176 633187 638070 364353
17063 364353 278167 483044 534747 816626 653238 277815 485565 480532 567973 448090
17053 448090 426190 841642 291587 450968 729760 704714 423676 495545 539596 359975
17043 359975 384518 597732 536546 713851 526457 296012 485006 631519 453128 243852
17033 243852 691308 556159 567119 433629 493353 470638 546756 574856 329099 583754
17023 583754 696274 807806 774759 655746 839637 388745 636675 525010 802834 373104
17012 495333 531412 773315 441904 570643 318177 609995 814806 481638 649735 559229
17002 559229 785511 807373 826708 846048 434490 640463 617512 499176 803071 608901
16992 608901 650629 646626 1022625 915093 932008 846203 767976 828930 903833 883429 578257
16981 578257 772207 1121326 800678 987027 768547 899465 867005 1122348 831840 814682
16971 814682 781137 690085 958160 538148 1110387 940634 1182668 1010881 843242 1024416
16961 1024416 983464 980849 753802 796732 516440 1274002 1204363 1207762 1114904 1372028 1060267
16950 1060267 1080390 1290999 1372535 933174 888230 781828 746597 1205460 997868 1193122
16940 1193122 1120722 848384 835604 1010838 1054668 1276848 1063346 985933 1369304 1158740
16930 1158740 987147 1255828 1252455 961371 1235116 1201218 1266732 996377 1133379 1433101
16920 1433101 869562 960941 1257377 1112926 1514265 1321589 1241773 1318430 1264755 1713192
16910 1713192 1587336 1227497 1564591 1611417 1353137 1662002 1271726 1721881 1622667 1964823
16900 1964823 1470282 1433748 1545551 1524675 1596425 1699969 1484542 1866716 1880962 1794642
16890 1794642 1897862 1518259 1773556 1761021 1671073 2025959 1795611 2080061 2022993 1822362
16880 1822362 2088232 2062335 1994510 1905483 2218028 2068570 2089122 2202130 2195025 2163222 2388056
16869 2388056 2159567 2273762 2329677 2476496 2302385 2359633 2610541 2744321 2474325 2739700
16859 2739700 3025872 2265193 2367615 2354723 2903699 2914017 2923561 2830900 3025680 3098911
16849 3098911 2905467 3297423 3266324 3215046 3176955 3469168 3215453 3349623 3264230 3644085
16839 3644085 3684417 3403356 3546845 3545947 3999504 4048189 3914814 4103743 3907008 4233307
16829 4233307 4124891 4387947 4444330 4457309 4259008 4695424 4766979 4896704 4673287 5131407
16819 5131407 5148466 5165790 5224709 5407156 5053792 5703742 5697264 5830124 6057967 6425940
16809 6425940 6148815 6481322 6364281 6644901 7038884 6959950 6951500 7238808 7451345 7611253
16799 7611253 7589704 7735649 8129200 8369816 8429403 8736531 9200217 9348821 9633888 9718953
16789 9718953 9682596 10065783 10523549 10897338 11267345 11419520 11805922 11964904 12406927 12796149
16779 12796149 13057403 13719703 14073668 14741196 14797343 15594344 15900635 16482177 17441697
16770 17441697 17624645 18133029 19238408 19819118 20207754 20997996 21727639 22854231 23761379
16761 23761379 25012617 25726941 26703271 27967882 29161489 30351007 31809361 33200479
16753 33200479 34635182 36236163 37853334 39801356 41580311 44027500 46379269 48641438
16745 48641438 51591965 53913868 56859108 60087876 63084912 67154314 70790917 74879890
16737 74879890 79541067 84077005 89001289 94314550 99763894 105734160 111866666 118197722
16729 118197722 124609696 131392268 137921870 144785519 151037056 156834466 162132745 166958376
16721 166958376 171288828 174108587 175672603 176709715 176442379 174961715 172363611 169010683
16713 169010683 164220756 159016678 153186780 146855537 140675892 133769080 126892736 120260016
16705 120260016 113538021 107354193 101114988 95337188 89881236 84751210 79864893 75604152
16697 75604152 70692648 66770955 62868127 59450565 56208911 53239796 50424933 47831790
16689 47831790 45229644 42972661 40701057 38650977 36968784 35195556 33549341 32130770
16681 32130770 30482440 28999253 27756169 26670369 25381376 24269584 23326410 22611826
16673 22611826 21676716 20907434 20175532 19385081 18687398 17925554 16970199 16496917 15998477
16664 15998477 15668570 15072923 14329392 13927003 13238421 13256393 12730183 12127354 11565406
16655 11565406 11597788 11189398 10679649 10715681 10210101 9983133 9552564 9428668 9573839 8916757
16645 8916757 8651251 8246226 8025487 7961657 7632073 7768560 7392608 7360544 6885649 6939185
16635 6939185 6855820 6396690 6536765 6209122 6146328 5622166 5664219 5534552 5690543 5299354
16625 5299354 5357008 5505803 5303975 4997085 4786890 4651440 4591918 4368548 4650609 4541024
16615 4541024 4442500 3970733 4216142 4215051 3998852 4012759 4079334 3898055 3583648 3244127
16605 3244127 3369851 3420031 3392025 3181450 3118749 3172227 2979646 3104648 3181900 3258318
16595 3258318 3075727 3127967 3024094 2729805 2679105 2579127 2635334 2508946 2557913 2481883
16585 2481883 2194788 2682481 2392762 2213641 2399879 2402144 2467124 2168280 2130089 2164655
16575 2164655 2228939 2167792 2084093 2125013 2174500 1850720 1964200 2081972 1936992 1775940
16565 1775940 2105221 1858416 1803824 1926118 1781314 1918133 1721328 1817655 1759742 1899712
16555 1899712 1715503 1703839 1668890 1760986 1518667 1494016 1652480 1209579 1074940 1521393
16545 1521393 1280387 1451764 1096580 1450379 1549071 1356679 1337329 1493899 1325151 1548511
16535 1548511 1395645 1073618 1152756 1405444 1133221 1241152 1145413 1087424 880606 1240148
16525 1240148 1294542 867519 1189255 1246476 853947 1163757 1048454 1121190 1072327 1082763
16515 1082763 1125319 1230842 908244 1127207 960143 1090291 794257 775667 1149770 1145158
16505 1145158 864881 795587 1076304 827892 846786 1079435 725403 591596 587717 752531
16495 752531 1141852 688941 805404 999785 610950 954008 590630 797490 613838 1050946
16485 1050946 617776 773414 508965 698014 459918 557218 497054 654999 687808 831380
16475 831380 595494 722368 661438 693026 663245 577981 726376 523915 829906 723736
16465 723736 962618 523250 792200 812644 555329 411998 246118 528661 577505 506489
16455 506489 509520 646969 429344 350652 736672 606095 730401 462531 422207 602639
16445 602639 371912 503387 453995 525647 462554 447185 375727 471250 495515 316236 577387
16434 577387 452001 704223 530716 519571 308880 543191 701898 82699 496383 461396
16424 461396 433709 513743 394819 489618 226333 535981 601036 350065 698214 209395
16413 387889 611960 350853 417555 144790 123298 32434 264135 388875 293287 550094
16403 550094 539156 410733 262297 99955 661895 332301 439001 127862 305401 157192
16393 157192 155507 412002 360786 257518 337631 211821 112876 266842 88373 212193 255510
16382 255510 472934 269346 350431 75087 356739 478945 486873 98906 83123 262296 90093
16370 271802 167599 35180 161525 542088 322055 93178 315320 199796 384660 339824
16360 339824 91921 204088 123626 -183612 187731 252468 257561 215796 18839 349416 274451
16349 274451 495948 222945 398295 331303 152000 338546 -69499 -35390 -7617 289498
16338 103079 321126 106071 205736 253277 308081 107018 451055 315703 189610 -58442
16327 200463 39132 199074 117103 113721 -41526 180433 428875 250532 110334 346967
16317 346967 401713 322760 184964 441 155490 255820 209522 224550 161392 201200 261917
16306 261917 310483 103991 109698 310631 250989 265924 280013 404090 53444 131328 -52387
16294 347695 418122 109458 18505 15651 154883 186086 -76089 232347 344855 98533 143808
16283 143808 59941 -75630 332130 -94063 141073 112169 -41953 122368 120266 80563 248032
16272 248032 -18971 74839 86448 26862 102447 131553 111708 -36827 218200 -298169 424943
16260 394724 203865 195385 103405 262907 32710 163293 161128 82126 -183023 138925 326772
16249 326772 136213 132858 -63920 -171490 -174861 116391 85187 87254 107362 -283918 178776
16237 177955 -111995 -72517 90760 455636 90357 257553 168994 -197789 187286 102073
16227 102073 274579 111864 63210 78977 253489 -131965 324698 -165694 -81982 -103863
16217 -103863 194525 -27327 227310 -188488 269355 105730 24754 24790 163890 236382 198073
16206 198073 279748 264512 -55738 32455 104996 276305 76770 -27350 -29353 310181 475349
16195 475349 -117347 233559 138853 152066 278292 42185 -311170 151007 96933 156962
16185 156962 311146 128524 135348 119596 36474 191424 290749 89214 99913 -58302 209582
16173 -6442 164137 88590 305965 108085 147401 -93282 58486 35444 -122799 94613 -9911
16161 -127816 -21647 -55475 -437664 -181490 -69603 129454 -120806 -274787 -147875 -178955
16151 -178955 -140257 90313 147500 40834 161170 -295 -90443 -56608 -23865 18826 -112561
16139 -69423 162582 65998 -44993 325985 -53290 73619 19703 47942 -15274 193434 -116107
16127 -277445 -170037 80645 194584 -207142 192663 191018 -85493 -82099 -215070 -61240 121991
16115 -11344 5041 139627 -19910 36205 32580 -71357 -21383 283059 -2580 133919 -321178
16103 218090 203704 29996 148012 232307 -14836 -37985 145830 -141225 312391 17607 -134493
16091 -122554 51332 -139404 311096 201848 -350906 -78357 40219 -97946 -263458 338472
16080 179761 -46623 40614 -10578 -37738 -196296 233788 -205207 -134711 68665 77697 90831
16069 90831 101359 67882 -157539 130201 -25176 -93728 -167241 27981 3402 -667 -79092 88434
16056 -15023 29474 -95167 -220927 183581 372135 -174990 -115808 -163298 322633 -129879
16045 -337636 283045 -111217 272969 -227598 -160119 6737 233100 -39632 -357967 15113
16034 -53010 -114693 -257761 168087 97590 -230531 -51467 -17021 -261144 -351874 -264562 128748
16022 -116521 -5426 -83190 -51440 204482 -43642 -131863 -287053 196396 202832 79157 171685
16011 171685 328499 65805 -136144 -121574 -170937 -101916 151619 7502 -47303 56966 -33415
15999 7329 95761 -123250 -140040 237566 -48027 46624 -426615 -253791 -68071 -79787 319553
15987 -39928 75046 -55647 -89245 144194 163881 45260 301969 77639 297212 -159138 250293
15975 -26937 52919 24926 68215 -216769 247642 7674 -254017 89753 82882 -40471 -30617 -77803
15963 -77803 185423 -119235 -16250 -60633 167093 -153440 -150099 -12425 26932 -141264 -152472
15952 -152472 -64678 -143454 -64892 118927 -193496 203191 -217326 25257 180616 -83825
15941 -169196 -14738 -115463 26687 -536446 -6062 -113467 24839 -239510 68472 -50719 -77181
15930 -77181 35155 50429 -41811 -35890 360890 -7737 -47842 -206052 11162 -105802 162980
15918 99626 -137843 -72569 266090 -138313 -173575 -192037 -158986 -25993 -56510 120597 143575
15907 143575 -52823 201840 72232 -152966 38657 12335 30491 -225420 -40610 -186779 19769
15895 199947 2340 -52030 167883 -135782 -25490 268861 89914 -234183 27040 -205455 -225461
15884 -225461 321308 -47830 28918 37513 7327 -149939 -181860 54419 -449792 -29658 -174265
15873 -174265 -150203 -20283 209418 -11821 222351 -172635 -41223 123638 206071 89381 -251216
15861 -55147 -41906 309001 137062 41168 65380 -209561 231296 -28052 -147611 -85793 223936
15849 68568 179728 171457 -17711 -442901 47529 -178854 -134120 5951 -194135 123549 4723
15837 -53184 59898 -90772 -144377 -165988 -66788 56569 -254525 43811 79580 117860 -167152
15825 14884 -70592 112598 -3257 -244843 43815 186788 5964 -180738 144649 -183234 -206684
15814 -206684 185212 177387 -71676 -53151 -388124 114668 -110571 232460 10279 9088 107704
15803 107704 -80474 -133699 -106903 -324185 118021 -92166 -394884 209121 -135460 -56968
15792 -286957 -149032 -30391 401123 192849 190974 96316 -126047 -200192 -27687 28636 -150174
15780 173333 -42906 -252468 90953 135474 -228895 -49253 -116227 152434 170607 -130661 178054
15768 -263958 121953 307763 -8613 -246720 -72226 -276493 -157258 202469 -43894 223120
15757 -243468 218479 118343 -308328 -95969 101211 -4748 67220 91786 -37701 -202704 21418
15745 -334925 -84178 42494 -25292 23408 204319 195670 -457415 112230 285011 151251 -127751
15733 1387 130110 -446380 -209763 169380 -212391 -124674 -50041 130011 -80557 53620 -117717
15721 201011 84153 -168781 76592 16575 -403017 -230677 -250404 -99187 59503 273248 37118
15709 -154879 -174499 -252519 -59997 -82861 -104185 66901 97031 -185211 -97181 -251870 -93789
15697 -93762 152861 -174019 49236 168620 6165 90804 19801 -83109 -48352 -48581 -257815
15686 -257815 -332840 -74082 -106071 -5326 -100679 172270 149146 -190752 -151591 -59719 -56123
15675 -56123 -188407 -327965 -44585 -63884 -142033 -71072 -20217 -72937 -110893 -11541 -55404
15664 -55404 -62758 -154080 119510 126352 111292 -43887 -9526 5884 -193177 214227 164696 -185965
15651 -69215 -126522 298386 246832 -153867 -6107 18509 30611 -109009 -35894 58312 -46551
15639 10643 -140128 -186389 -51968 50564 117024 -109392 35285 47625 6781 -78143 234740
15627 -185191 -67163 120571 -104471 17164 -160443 -229342 -92626 -314071 -83519 31319 177101
15616 177101 -37585 146787 -228971 99560 55486 -153977 -274233 93660 -60990 -168543
15606 -168543 -107139 -46580 -297298 -22889 292801 116674 -95178 -206251 352301 102450
15595 -104151 6709 -259945 152636 237408 -294202 -40117 -203589 -117919 83169 66162 150911
15584 150911 -33906 -141582 -62568 -121273 -113481 -251484 199097 -276354 2731 52681 28488
15573 28488 47566 57357 -130946 245870 102792 148260 39195 50491 -374449 -232973 -58168
15561 155046 -75011 17439 -35557 19284 99023 -79265 194780 -107401 -17414 212336 -229982
15549 232608 171604 59854 -172237 -47656 -151964 -147828 -60396 -62454 -32526 -32696 28619 -209978
15536 107757 35200 269603 1163 -84018 -21205 -1923 267197 52822 -86022 -37134 -61660
15525 -61660 -199549 -98029 39312 69060 98163 -156294 -249923 -24274 -86264 136931 196886
15514 196886 -68186 275067 189839 186001 110860 53825 -36237 -135031 206365 31935 -373436
15502 -27039 -156487 163824 -2839 -42856 11749 102938 -162086 -117759 210974 186832 -63041
15490 -181797 -110093 135845 -97408 107225 -98965 -242644 -50002 200467 -137015 92929
15479 132154 -222241 -56880 -86860 206639 126107 -260916 21644 -306976 297141 -7817 -135717
15468 -135717 11433 24626 -100917 182000 327251 -131309 273577 218393 12317 -140113
15457 -113329 103364 105853 -2104 -391890 -209815 -9529 -239264 -137959 238856 -79621 48123
15445 -149041 159069 -195344 195240 -210017 -325007 -126768 91729 -91357 60752 -84809
15434 66117 -171013 15975 34271 226464 -79019 57999 -12607 63334 173750 128708 -210926
15422 -95775 -279825 264481 269800 61605 -73679 -9439 305417 63835 -206778 1915 -346073
15410 20032 55735 61122 -61438 54008 103058 -335339 -304159 -171257 -37545 -157639 10808
15398 -199026 -13421 177045 58002 -142761 167721 244317 6598 107439 29594 132343 79041
15387 79041 82474 232370 -48092 -238754 31938 104437 -73556 119316 184008 -426967 29350
15375 -217944 -342489 -44639 2103 58044 -375137 96041 52288 220857 42053 -44713 -7862
15363 24774 -146353 117566 -3679 -168220 242399 223831 -110863 263596 -158176 -99316
15353 -99316 117653 -120827 -61392 -40482 -92590 302148 -228668 231231 -113747 142357
15342 -255837 -94693 -161179 -186354 19286 45367 264165 -227949 -89177 -131292 28442 56281
15331 56281 -41840 -140833 -110744 -194390 15942 -222555 -23571 320056 138055 69824 -297455
15319 147651 159894 -108813 341602 224897 -194398 55310 75621 -195513 26215 -108877
15308 -174216 -10129 -101584 -51160 -295593 34034 -97261 299627 39543 -18674 -6452 -125229
15297 -125229 -76650 -66081 73334 155668 -145636 192408 49268 -176302 -86268 52781 -1065
15285 -56293 -124844 253890 -404367 213702 79979 -167252 123314 -85227 -151645 163834
15274 231939 -116621 408784 39361 -68048 443806 25893 383458 138314 34609 108177
15264 108177 53495 -162190 121236 24140 -156163 -132551 289179 -113599 367172 112105
15253 369427 233852 -180710 136267 318329 777923 1160076 669025 1161436 550276 547440
15243 547440 314472 -64601 246143 -93289 -206084 -71785 -52491 -186650 20323 162550
15233 162550 65208 189939 -34334 53195 142066 -38572 6 70470 208182 -110224 8927 43440
15221 43440 25400 7462 -282446 231641 -339296 -77091 238008 77242 65332 51807 -24641
15209 37449 -10659 313579 134068 -204068 -49423 142494 -118750 222452 65759 46485
15199 46485 -62225 31470 -174446 -296524 28011 1415 132331 223985 67334 14092 -73618
15187 162728 -28962 181824 -147716 394168 201203 -45332 47220 366168 136938 -56073
15176 194009 186015 142554 310023 -84557 60816 231685 170671 179123 -38772 338300 -220031
15164 -77518 -103178 -14142 161414 232984 -73289 310775 366568 -215701 280457 -145019 62313
15152 73283 99137 300544 -34336 145131 185876 -29626 -145282 -129109 17633 189228 -195224
15140 118200 366205 95543 -41764 -225548 90284 66752 289666 -153532 182117 -125913
15129 338613 32471 6164 56573 293232 12939 229941 163049 179636 136922 248023 188239
15118 188239 235917 -3211 6995 3573 110364 78253 179230 99306 173187 47832 287520
15107 287520 122625 -195232 -6184 109967 268015 -176760 -32975 390480 299069 -7766 205711
15095 111720 -133667 358396 -137724 257873 190383 -96142 198457 355285 6266 -99231
15084 68865 98712 236527 110212 38317 181146 168443 -58956 67400 543028 -297936 366392
15072 209621 -66355 38250 -196078 376002 269634 265083 42051 98675 94967 454179 -34732
15060 -130292 -10095 162105 414063 68141 125757 1565 321124 267352 31919 144783 383499
15049 383499 296769 -150106 155527 -48115 224006 39814 25318 81442 128482 42968 319550
15038 319550 196943 302126 22768 -80000 62155 289676 2786 306152 15650 243155 251016
15027 251016 -5573 244448 330952 -7498 83321 58326 196313 107953 32819 121169 89108
15016 89108 161074 -6757 227542 226239 294110 268822 -24021 224022 93969 76510 230709
15005 230709 75105 141577 175918 -45460 221821 95234 503330 -21369 482875 199270 175502
14994 175502 151454 173720 190188 -50810 22754 330696 99802 129024 310629 323891 -67235
14982 -239977 196219 165588 121530 320368 197107 282638 310651 196235 159782 234412 180546
14971 180546 384764 218591 473165 415561 187142 77310 97377 211792 234100 166089
14961 166089 164193 299892 208094 377644 -37408 306854 121781 106468 22836 277162 375554
14950 375554 365900 76365 170347 401601 260477 195947 288602 168398 78998 595781 204360
14938 668761 -42281 459861 164722 266263 245730 493557 303303 104163 296257 369855
14928 369855 132153 127144 518707 176411 347401 14100 285972 174455 100089 524243
14918 524243 402179 230963 542626 248443 281554 393732 160825 398114 222936 327242
14908 327242 310794 108938 242841 394143 81567 499759 208013 539556 660662 534046
14898 534046 754251 250947 303508 330246 222982 669451 301692 375906 29888 242681
14888 242681 132906 166758 33750 297774 280352 392754 61025 125237 330324 38971 566160
14877 566160 226451 451902 12651 153220 46238 406818 295986 118437 316766 298347
14867 298347 323398 293939 634436 573360 337669 42895 204648 416824 477580 299434
14857 299434 360144 351514 793150 324501 475844 394690 82591 370266 196214 470582
14847 470582 302812 421487 499292 478232 473390 518069 408341 231754 419294 318889
14837 318889 87018 650427 533305 226095 291279 467305 649547 647811 397960 319960
14827 319960 471426 301032 602869 322797 259988 402951 355938 381776 394293 602199
14817 602199 186976 487581 574003 279839 209255 514002 655182 462411 364339 689777
14807 689777 270135 437692 515914 269572 314788 187312 255716 290885 454664 428752
14797 428752 482964 330816 -37664 592948 560464 531185 269794 70468 409520 326388 756773
14786 756773 553803 746216 541340 425102 498974 444867 506458 180956 465353 559186
14776 559186 870506 449007 390240 388056 796171 332968 615961 224015 558412 615296
14766 615296 618507 431672 469978 362380 450697 542928 625322 565055 510254 621977 869064
14755 869064 823738 659638 529218 747728 687999 124988 470319 637948 589914 715860
14745 715860 696542 755827 819682 619026 499711 529993 733909 775033 883137 551868
14735 551868 365141 885396 702145 468405 719354 594520 600221 831325 929240 663690
14725 663690 679259 348880 761503 864243 550612 875424 778518 1059648 676071 596001
14715 596001 735169 786346 1024197 514203 735131 1027209 785524 803317 593780 735356
14705 735356 653992 805687 657242 1001227 787951 657873 766704 551139 1123925 817081
14695 817081 795367 525072 763484 628424 823173 875320 887475 728064 1018726 937428
14685 937428 891095 617862 980563 1190710 1106535 985597 1069969 799213 1091912 989463
14675 989463 819040 779721 1084416 765401 698226 962232 913474 936938 1069030 939445
14665 939445 805370 852767 1060572 1216735 720817 458435 974077 1005261 1102997 1017215
14655 1017215 1028354 979550 934084 1119576 1087248 1246717 919028 1153124 1158519 1325757
14645 1325757 1162325 1210774 890166 1161295 1088235 1049239 1296613 987798 1115713 1181077
14635 1181077 1426859 1350572 946093 1434687 1030142 1365399 1202507 1516087 1121862 1252240
14625 1252240 968272 1173490 1327699 1140166 1195235 1380072 1463251 1244327 1065340 1187858
14615 1187858 1466118 1344818 1288119 994518 1103259 1650378 1359447 1369021 1444271 1373294
14605 1373294 1619354 1084698 1244354 1350763 1349077 1426905 1758863 1524257 1290505 1278696
14595 1278696 1397310 1450492 1791956 1555619 1786080 1799090 1612175 1480072 1879098 1650099
14585 1650099 1531264 1935920 1723675 1764254 1629897 1749168 1856266 2004704 1675666 2069629
14575 2069629 1795788 2134200 1903780 2201389 1868355 2109386 2017616 2154708 2199158 2203458
14565 2203458 2276215 2631526 2462159 2589690 2508762 2514132 2720833 2852749 2855224 2926068 2917023
14554 2917023 3323896 3522241 3661772 4328881 5360756 7267600 11074447 19672438 41524868
14545 41524868 39428741 17607404 8380281 4658570 2863800 2576456 2077189 2368445
14537 2368445 1854294 1968415 1880200 1999353 1810346 1977335 1844573 1734097 1876283 2120687
14527 2120687 2112100 2319188 2382648 1841343 2181393 2044767 2173131 2336328 2384148 2373892
14517 2373892 2202585 2656215 2297998 2441603 2513460 2659005 2467367 2428497 2829436 2887507
14507 2887507 2528119 2679565 2418896 2540150 2791751 2408022 2793317 2953490 2985981 2933283
14497 2933283 2617558 2573633 3104218 3171052 3065343 3054353 3192331 3481156 2905631 3071214
14487 3071214 3052278 3053468 3236385 3551451 3554570 3438106 3315260 3576526 3513621 3602688 3541052
14476 3541052 3446802 3831789 3645543 3734689 3762705 3623782 3795650 4025711 4114532 4295206
14466 4295206 4227845 4020825 4176645 4416419 4380805 4324891 4258900 4183879 4314485 4460792
14456 4460792 4828539 4227725 4479833 4766557 5087860 4887074 4899752 4939397 5252523 5274153
14446 5274153 5409521 5176150 5331967 5182204 5713739 5506379 5761660 5437432 5611486
14437 5611486 5749281 6350658 5573440 6137391 6336954 6019537 6188701 6526489 6399780
14428 6399780 6856463 6959048 6465523 6687815 6920816 6635246 7292062 7227279 7344090 7626322
14418 7626322 7395594 7804753 7643128 8023320 7822343 8035313 7953748 8178909 8559147 8556159
14408 8556159 9018787 8725032 8670204 9007504 9529797 9574830 9951710 9726995 9837199 9931844
14398 9931844 10092266 10434743 10645614 10758848 11079900 10860963 11444929 11476588 11694350 11943929
14388 11943929 12325318 12070491 12489668 12695071 12884212 13069460 13523818 13559068 14001458
14379 14001458 14063151 14612210 14782410 14983892 14955602 15552006 15913761 15817661 16568703 16766277
14369 16766277 17065627 17594733 18006451 18200343 18472094 18976865 19355765 19614546 20267227
14360 20267227 20735246 21202427 21665082 21836787 22514435 23254192 23903623 24360245 24886327
14351 24886327 25680753 25911758 26454164 27714106 28196489 28832761 29568402 30084075 30962405
14342 30962405 31907487 32732776 33975047 34164291 35496231 36326456 37670811 39132887 40006130
14333 40006130 41137286 42463498 44143953 45400654 46583938 48163079 49595250 51299163
14325 51299163 53148175 54843917 56811567 58664872 60668889 63146863 65394410 67436428
14317 67436428 70260674 73074619 76205418 78951027 81795317 85579327 89084607 92901309
14309 92901309 97009258 101049560 105237222 110428447 115092900 120398714 125887111 132095598
14301 132095598 138176343 144722050 152211448 159726555 167636412 176092015 185095818 194660862
14293 194660862 204570101 215567782 226582958 238016342 250046056 262790245 276051569
14286 276051569 289482871 303622991 317605589 331601173 345549376 359612818 373004628
14279 373004628 385735233 398040249 408682552 418274341 426034609 431727026 433579585
14272 433579585 432015759 430444704 428384633 422580924 415599794 408327686 400832261 391462043
14264 391462043 380788895 367921553 354758520 340580202 326091822 310793753 296253276
14257 296253276 281766666 268143038 255521161 242457562 230526284 218618235 207622765
14250 207622765 197261474 187665199 178014849 169346369 161048435 153202952 146423826 139476932
14242 139476932 132801746 126534322 120991882 115320496 110862772 105993808 101277212 97000151
14234 97000151 92673791 88952429 85605849 83049621 79136896 75950724 73001479 70416043
14226 70416043 67496828 65612317 62745577 60779625 58808273 56580918 54807091 52761403
14218 52761403 50904814 49662941 47968439 46682649 45286474 43887137 42351154 41263832
14210 41263832 39964920 38720098 37678042 37268566 35917948 34932850 33847511 32825188
14202 32825188 32018256 31172814 30447623 29932964 28950860 28074382 27701507 26896893 26160394
14193 26160394 25448275 24902949 24090569 23688098 23073977 22445366 21973562 21725212 21047597
14184 21047597 20489788 20129574 19765351 19205741 18923832 18480270 17810652 17526683 17435070
14175 17435070 16887590 16615224 16219179 16068843 15923816 15521365 15256403 14618729 14778599
14166 14778599 14499739 14176144 13782811 13633630 13487189 13205911 12856511 12617695 12393720
14157 12393720 12014947 11941529 11737733 11568724 11260645 11372189 11243617 10882037 10492737
14148 10492737 10480210 10274129 10048072 10151277 9716657 9590317 9954744 9298406 9257724 9149475
14138 9149475 8640761 8809902 8642581 8483287 8592385 8453336 8457363 8154725 7988022 7998297
14128 7998297 7897079 7749993 7528086 7605594 7308696 7118424 6984107 7255531 7241922 6842451
14118 6842451 6915727 6821304 6412965 6564216 6358238 6527471 6326254 6257370 6107439 6291636
14108 6291636 6053464 5749133 6002628 5614239 5930692 5514545 5931667 5738038 5435090
14099 5435090 5311873 5451597 5342070 4986569 5314333 5219406 4952382 5435431 5318500 4808107
14089 4808107 5244330 4981435 4861149 5034312 4984148 4653131 4626165 4323418 4240949 4221630
14079 4221630 4330405 4304244 4019535 4268993 4239567 4161320 4534306 3912856 4247584 4186057
14069 4186057 3954182 3893377 3873553 3859282 3954318 3826568 3774302 3828140 3525653 3781304
14059 3781304 3679694 3807949 3715188 3563916 3550088 3662855 3367922 3229963 3406218 3112877
14049 3112877 3489497 3174805 3147703 3169710 3473572 2901591 3168866 3150483 2893202 2769184
14039 2769184 2726468 2949206 2774787 2962500 2922512 2606494 2796604 2713335 2582033 2718285
14029 2718285 2775226 2895825 2596523 2618436 2690887 2675576 2634807 2211571 2302610 2160363
14019 2160363 2364926 2429755 1980090 2305999 2628733 2270965 2241209 2328101 2281566 2096582
14009 2096582 1881698 2195246 1978029 2030513 2235714 1777146 1824306 1992370 1621594 1859076
13999 1859076 1895492 1787724 1953840 2016267 1837979 2071073 1625438 1815013 2316750 2429492
13989 2429492 3123289 6055823 12170481 32819687 40311752 21819235 12268659 7753009
13981 7753009 5372365 4249537 3744876 3556006 2945631 2728984 2677150 2136165 2381250
13972 2381250 2462091 2087454 2186031 2355856 2044429 2172346 1966742 2250465 2432500 1874480
13962 1874480 2083348 1939521 2084374 2108295 1821606 1995731 1682203 1904334 1934187 1593826
13952 1593826 1609060 1525700 1524014 1797662 1546977 1776270 1885628 1665723 1554759 1856308
13942 1856308 1711102 1871008 1590391 1693454 1363637 1132975 1378790 1514436 1571751 1311827
13932 1311827 1564359 1777213 1442201 1599176 1391196 1531167 1603826 1496400 1343959 1620137
13922 1620137 1120220 1373848 1642560 1430825 1372684 1583917 1402712 1453469 1053341 1200691
13912 1200691 1122342 1241286 1260499 1285292 1528772 1700604 1074309 1316266 1328990 1309526
13902 1309526 1287204 1348358 1095974 962629 1518166 1129351 853682 1501348 963091 1320864
13892 1320864 1299096 1122036 1165670 1265131 1189591 1113386 1037918 1220449 1314293 890722 1001136
13881 1001136 996065 1055006 748983 1381014 961524 895988 1051780 1129502 1004302 1010179 531475
13870 531475 1060359 913143 1077943 1104638 1137425 765378 1023992 1081276 858273 883357
13860 883357 1128634 1134563 1296504 1058382 1050389 1150688 595256 766703 667590 1172642
13850 1172642 863430 989780 816074 821880 968799 698397 1060712 959365 952242 896994
13840 896994 571476 1075931 1114446 845763 538429 943756 624541 448148 841137 731908
13830 731908 721764 783635 886849 1266802 969772 606850 904189 441609 683285 828366
13820 828366 616700 862662 784036 835355 837231 589308 965440 1087871 999070 634228
13810 634228 358734 850943 645275 758739 918791 704139 462756 714059 970485 802255
13800 802255 245997 615006 628725 670665 663516 406542 841305 948443 428416 717435
13790 717435 832655 790282 881186 671540 648096 645929 675808 517219 664282 654345 781956
13779 781956 824793 406217 833787 433159 770332 331905 842453 504331 376738 344318
13769 344318 500216 597939 636418 632419 676392 852554 652722 633340 879367 570531 696115
13758 696115 684748 632617 421853 418760 491979 745596 583780 622564 746526 566661 196593
13746 659892 491308 661743 477378 721788 433528 568972 522426 330805 540052 564146
13736 564146 604980 448003 211593 555953 395333 666830 745598 707143 480283 466587
13726 466587 714435 517003 402780 954535 496245 567259 447455 426682 604327 704761
13716 704761 622528 332261 666386 505677 477217 597181 277988 371330 388052 507945
13706 507945 396956 411714 392931 225668 410828 415857 634575 314894 412525 380091 538807
13695 538807 334242 337983 536582 285255 451815 450820 294068 693307 690292 400170 571581
13684 571581 386909 335419 553209 116802 681917 299689 427295 414818 449728 407193
13674 407193 402809 223649 333784 308673 376036 204005 472080 593554 621240 435639
13664 435639 277393 445033 624117 332361 520036 616562 367973 215387 365495 385355
13654 385355 472962 107147 532706 244037 249337 459753 396473 191238 -127552 321330
13643 222191 388136 386142 495889 395367 476865 250292 592554 -4540 482966 102086
13632 426756 437711 422671 245287 379202 215234 411760 319686 403748 332651 375934 294908
13621 294908 239312 224387 564653 93376 474211 390269 307261 384134 265389 343798 283753
13610 283753 544130 159081 462829 301569 415503 600557 388341 6324 521926 219831
13599 467583 544083 399410 497013 343637 405613 246965 293790 426573 123403 412880
13589 412880 349059 112444 417470 487939 140167 313613 106682 405173 429062 103481
13578 673802 277039 560813 372438 340999 198511 135518 518649 319472 417184 685717
13568 685717 -2625 405406 230153 193081 109247 -142437 338859 145955 279639 383796
13558 383796 275455 159745 251358 154818 264822 276253 413126 17968 446390 407564
13548 407564 204186 218661 320839 414764 233396 237842 351791 204263 273353 -33832 495527
13536 66333 -20769 -34166 219547 168354 244462 550190 78899 7430 121823 -46805 131906
13524 428543 149012 218758 85945 349549 390729 157777 472341 253129 74735 229285
13514 229285 -27350 176811 271199 119288 359010 313748 343094 86787 371156 217868
13504 217868 315373 227684 307339 326397 235842 305588 53655 45984 -286978 18016 324843
13493 324843 246255 307555 6573 503556 497381 382206 253772 117914 209450 69346 57533
13482 57533 93942 -26235 119158 433274 -1248 390959 227509 476758 178564 27233 -46878
13470 -21082 137051 283371 -59005 358874 396684 67059 73586 190721 337409 -92549 99503
13458 34754 378485 129469 98558 177183 -91086 143232 -31809 402877 305938 729122 172506
13446 -85530 28022 94310 295457 -62778 201810 317151 412599 336729 168083 153061 98049
13435 98049 209044 316830 168344 -96273 183600 291816 203263 267786 251202 256913 376606
13424 376606 312300 242237 34816 158492 -26845 405469 272287 23294 37977 57324 354804
13413 354804 285588 283018 187323 -51562 -361557 199515 359244 230789 222470 275945 16100
13401 344735 408522 262425 6123 98149 195930 95207 166434 353894 176365 -257487 185667
13389 598068 247035 105725 195318 34882 77116 160145 312087 24384 97283 315480 384893
13378 384893 149553 177043 45071 328700 35294 306542 393107 194930 198251 71100 -67357
13366 142198 377341 316120 272166 169591 152267 -120531 117382 12970 222334 201085
13356 201085 360160 379265 -144455 -69347 349024 -21624 159240 210347 355679 179655
13346 179655 7848 132260 316256 470767 118915 240158 257147 493300 198035 -6341
13335 -58186 286295 -29804 87104 285874 134454 132880 244087 91671 234138 391874 -35549
13323 399744 96917 327118 1827 279245 239747 243836 285533 377809 64368 234419 -15579
13311 795067 284050 -219042 -139376 -13203 381727 157415 217962 105093 525452 241426
13300 76262 -39297 -34775 290569 24168 198412 -92837 45323 216737 204891 379551 153992
13288 -49486 167968 440563 160122 369394 -24043 124870 37346 -21072 -47876 679272
13277 273400 157716 59733 178009 328 -157732 201276 313128 47241 -3983 62095 150323
13266 150323 -197194 18056 -90177 -238129 272668 -85929 26593 169111 -150510 238594
13255 233372 -204479 70085 179507 -158588 -40862 182546 78260 -154069 78460 150999
13245 150999 91193 -80928 101318 544506 -9891 -32655 298320 70373 519810 -238296 2160
13233 112304 107221 -8089 19354 124232 354314 158275 101090 74277 67747 200467 -70910
13221 38275 -83652 -71712 -115683 208284 -131418 158861 12915 165137 78159 -127164 -212439
13210 -212439 -351532 -342704 -37864 -10453 216782 -90000 205747 321167 133802 25932 175243
13199 175243 276478 352807 431031 128465 48064 -43347 61409 55685 205530 -155382 -46826
13187 234362 50144 206027 30460 -139477 18135 140702 178789 94684 17709 52070 14972
13175 291275 -35702 -187915 146636 123725 -49103 -12615 -43707 157664 412346 209333
13165 209333 202951 -271978 290412 250665 -186070 250876 391456 58258 40858 -8075 -59375
13154 -59375 22824 20948 -75448 -4473 -210853 366671 -126520 -8379 202576 132219 -42320
13142 234109 118108 -266252 79270 -181214 53972 -104428 -188607 281875 334891 91740
13131 -93314 178387 19417 146786 124852 -273567 96443 139109 95430 35009 311126 178054
13120 178054 219391 47176 286661 134611 13762 -29045 -224603 137662 -139145 38380
13109 18260 195025 201149 22451 24316 154730 -162205 -123253 -140804 -94114 -18435 -22569 515969
13096 160578 -87250 -59705 -11487 194415 139041 -32871 -367509 -39373 103210 366110 59966
13084 -187575 452323 91838 -21406 224086 74284 -54035 77765 228077 128191 117792 145288
13073 145288 -178947 216864 15362 -33052 252138 69344 276857 82881 -237668 272674
13062 157756 -24556 294181 69214 -72640 -86127 320755 -57262 235562 150242 1525 224664
13051 224664 -476930 -178625 -82000 323250 -77523 101429 -21572 -197801 -116857 -165424
13041 -165424 -64038 268640 -102503 -109491 -182509 300497 269284 227576 215885 -140109 -19075
13029 241253 389150 -118924 208846 242064 438490 179380 242521 13764 110607 230212
13019 230212 87358 12839 122950 203407 -17699 120770 7568 131828 135765 -180974 224476
13007 -76233 386430 103228 73882 129191 -35293 -175823 254512 89361 -136075 145022
12996 321169 -104835 94493 -25700 -91899 320606 66500 364481 -94957 67991 302005 54490
12984 -194686 217049 52368 -84126 27254 -86563 45505 214928 -37270 59823 143284 254787
12973 254787 20154 -64163 267110 172617 171733 137284 -87162 170228 -127777 248724 -105755
12961 -100042 -10106 -119441 -84555 19908 59033 114201 59915 135735 143680 -55856 39522
12949 -7877 118637 -99842 -69945 30980 91278 97176 1108 101060 7574 19072 193288 141277
12937 141277 259059 -205827 73864 193611 250951 -26967 -77740 178990 57324 -96800 -18852
12925 -10698 5044 38175 221518 -21891 -517660 176045 195183 64347 19858 -74960 -178836
12914 -178836 13110 133198 -83679 -63088 -266866 -98866 -4610 206184 424782 -55299 -116848
12903 -116848 -215006 -59670 -208668 -132123 -286265 41451 -243150 40179 -182885 -160380 160966
12891 152745 155665 248427 229461 122426 320772 27022 68858 57308 -24433 -208569 69025
12879 -42031 -126777 54113 -82565 58724 224218 174428 113184 97607 -68197 328483 -181504
12867 309284 -19089 79908 -54020 127042 -45444 -69164 209047 -505 207904 -170707 -154368
12856 -154368 -255720 -58213 -40223 -151616 -209399 18421 92883 -69508 137530 116472 85878
12845 85878 -218801 83927 -172778 -29852 78539 66284 -19309 -220400 363352 163595 -295208
12833 -123804 108629 -206952 -7957 -41335 201533 302339 57755 -115911 13961 43310 526133
12822 526133 93647 -152897 -88515 52162 73006 262674 237422 87592 225081 -50039 212071
12810 14068 243781 -268899 -295975 17384 160425 -187653 -233088 -30388 257431 -154855
12799 54109 125392 -241440 92635 5795 -160907 -27760 -31843 43720 -210514 -326492 66136
12787 79941 258368 344872 297315 127885 -237812 -29484 227482 -33463 -91159 -100347 350661
12775 -17218 112483 -208088 -36267 143439 30786 -170808 112413 97108 -352830 186850
12764 -167592 143883 13765 321295 -9406 -228728 43714 -33417 228532 278080 -41789 -137328
12753 -137328 -213106 199259 319413 -109196 103625 32604 47141 217531 66387 20559
12742 -161105 7158 324685 73683 138571 93067 -165006 365580 -165502 -23703 -75414 112294
12730 -226932 393364 241514 193597 -15035 406004 -200362 80831 -38873 23734 -319158
12719 2770 24112 85969 -39263 294732 78879 -24346 -103462 4980 -280884 328763 -45204
12707 311584 142057 -25782 289256 -148485 306785 179358 212204 93549 140183 46483
12696 325648 6123 -24235 348635 -55548 -79569 15376 197788 28070 229995 -76587 171686
12684 -366264 8748 -193673 278121 128470 292064 151427 301089 140343 -34206 -22798
12674 -22798 77020 67401 -90903 119008 -216012 -46584 75306 103001 5876 150461 115765
12663 115765 -12579 88794 198111 290758 -113758 165984 329595 23154 -57378 214483
12652 7800 -133510 -8312 -195407 -272644 -390651 -82359 -285086 220291 10670 168618 -161965
12640 109190 27975 -103263 -122741 -70044 302718 541936 148008 21621 245604 -26855
12629 435567 239415 446713 98332 427819 179203 -35026 262923 -135526 -121697 317509
12618 -35041 236165 -235257 -201006 92125 224662 63588 -8515 466 146591 70547 -159676
12606 192796 312148 102888 -80966 -306409 148160 242099 38379 320673 28455 -185657
12595 70843 -49729 -105658 36971 -189535 -16628 130189 57467 224650 -237836 66091 -65966
12583 142533 5882 -23370 374050 14764 -281204 -309664 461958 152960 -112484 -162228 -171330
12572 -171330 16782 -12655 42041 -138637 -25725 121048 1371 -33634 -149898 47588 175096
12561 175096 -43358 -57797 -278447 -124893 468324 371695 -86419 121797 24284 209862
12551 209862 68224 -121415 246063 99064 -167272 96505 -197544 -151196 -360736 -179521
12540 -234325 115345 -423464 20929 246339 -89065 74829 -361141 1842 -132949 78663 -132981
12528 -72981 -132929 -26979 -96128 407154 -102439 348652 -82286 -165271 34511 -49914 -149137
12517 -149137 -216822 -12042 219292 -81712 53586 -190487 -244650 -150698 99101 -10170 171749
12505 -106275 98667 61946 -41371 295723 27525 68564 -79349 -209648 203079 138248 -255112
12493 36515 366078 -64322 -321988 28706 -25750 -167532 -14113 378949 -264935 133075
12482 -124753 134389 -145289 252438 -98352 -69387 98903 -97794 111905 17512 382342
12472 382342 181430 -67094 -23313 -300769 184763 -297223 -30066 30868 -131730 13747
12461 165152 -348054 -50953 142317 -31939 -70479 -106169 64534 60231 953 179850 -216792
12449 143761 20897 53487 -164608 -7803 -23758 -152573 229565 -11679 118607 -284453 -23282
12437 120526 -416932 -17182 -169562 186550 -80268 1137 -221566 -36619 101287 90211 -178118
12425 126144 -194462 347261 110281 -170263 -118341 6392 -58310 -148971 -1425 -81018 230145
12413 27217 291663 19285 -163440 -370903 -127826 13895 -133495 152846 -102017 256794
12402 178227 38810 -120242 -379601 -46174 -225155 90696 45341 265660 -43053 -43042 -81242
12391 -81242 -272608 161609 109118 -3511 30838 -216236 204947 -22734 189834 8384 -7899
12379 156029 132448 -39970 306549 137454 40706 -161071 192770 -44283 8969 -403624 -96156
12367 -227473 -386707 239419 29292 150921 -25178 -331001 -148949 62588 -324503 223660
12356 71064 -53066 93255 184127 -172653 344340 156774 -46143 -110951 -186448 -9728 328768
12344 16234 -143669 206884 -214774 -59179 -164797 331203 132465 -37504 52916 61033 -202830
12332 -278535 338578 50595 -107430 369730 143155 64314 -113497 -47779 168693 -14274
12321 -88181 197504 -156723 -150060 -465161 149817 54572 298140 -349161 -30743 81834 26935
12309 -39419 15984 92684 -20788 -82727 -20390 -13786 -68994 -43659 -210537 213393 -40598
12297 -164948 65680 -399494 -64126 243492 300641 -74906 -65230 72735 137908 -139819 2548
12285 139092 -166694 154700 174550 133966 121549 -91452 -231337 15227 -73520 6628 113094
12274 113094 305801 308731 40907 -169245 210585 204141 57096 87791 514047 -60518 320138
12262 -255188 -188059 206742 371086 -177570 294784 18044 -221997 -225129 139416 -81237
12251 10599 264044 28286 -402532 130583 -167684 -149246 -95169 1423 31525 -71133 -31294
12239 143519 220513 374451 -127899 -210938 176677 -6595 -13578 -130678 379489 351813 162712
12227 209535 -127487 -140827 221281 241761 395875 29429 18130 125696 -22850 132234
12216 112024 -94909 291977 70797 102584 113375 75000 267383 -63008 -152565 289466 -17448
12204 129786 311420 -166619 189989 -67627 -7361 45333 166053 362071 310369 314759 130328
12192 177327 63615 69400 190374 56657 119914 137112 27154 -45723 152548 61161 18075
12180 -18150 145390 196346 168260 90491 164936 19109 7496 75158 -93168 162823 192450
12169 192450 31672 232946 77191 -88685 347676 1909 -22370 203984 -62505 -53175 -5792
12157 -170125 123044 112106 173368 41709 -142309 456382 -320827 -55218 128591 -334910
12146 3616 32160 98861 133126 81450 204677 -48686 -246102 -303850 -315577 7140 -108575
12134 382777 -288748 -272270 222303 18103 301523 -158714 115896 5478 19272 259495
12124 259495 -44968 -90571 302813 -81956 -75977 2745 209382 98756 16898 119953 80147
12113 80147 222829 -312936 30352 -166777 44606 184157 -326380 -81758 -187848 36419
12102 1236 139370 -343738 143434 -129102 119537 -6327 71646 -11234 191465 112523 -47301
12090 37573 -222547 -42949 -263710 -64680 20249 -359354 62255 -266937 253806 356094
12080 356094 196536 -60666 498664 264667 80412 261792 1710617 1137937 314214 142507
12069 373163 200332 198923 -123867 261841 -113818 255995 -62102 130862 30343 -36011
12058 33068 257541 9027 163428 47421 -128514 -145785 -178587 -217498 15633 -84464 -292073
12047 -292073 103649 154297 70986 231225 44763 91837 258853 -55265 -125253 -49058 -232168
12036 -232168 -120983 39302 39339 -125568 133427 -56247 -202876 -106279 -156466 78672 263433
12025 263433 -70686 40920 100739 -224798 112645 -98333 113646 -90636 -171087 208722 256303
12014 256303 -174326 -91086 -71006 112208 64469 -39992 117906 138702 -73496 -201211 -101997
12003 -101997 -168948 -386865 52478 -31116 45668 239358 128423 -91 -48681 -226236 -12085
11991 -164862 -288810 289454 -180399 -48693 -66162 -135335 210842 -42430 120274 -69045
11980 -96829 194034 57309 264767 -6089 147396 -177957 -129214 34554 -141758 158399 271391
11969 271391 -201812 -20364 -172548 8517 29996 113088 -13868 186539 128802 -84771 -129600
11958 -129600 209681 -135881 -118726 -84240 -296282 239060 14827 8561 58093 -17310 -2545
11946 -149903 -310723 -92525 -57134 -215771 -281500 43311 161925 -87743 -65517 275890 220320
11935 220320 -18239 -155103 -157527 -11964 -2558 113969 -47097 -139496 -244754 72723 137181
11924 137181 -116535 -47797 131296 128154 287680 106986 136012 -262679 93179 -394002
11913 94951 145437 269042 -175260 -214812 14262 -17924 57450 46623 -266191 138186 -232456
11901 85223 60921 -204261 -227606 -223404 4418 -141061 -308849 -274004 -284765 44196 -119122
11889 -152188 131213 -6749 -232610 -266105 -237788 -276768 49338 -29434 -415360 -304746 57341
11877 84155 -192545 -203336 -5461 133476 -397269 -146689 -64922 -59514 264366 -37262 -128117
11866 -128117 -65986 -25433 -235485 138807 -19571 221172 -241937 240598 -101732 -185870
11856 -185870 147150 -167034 180575 -47225 1452 -187416 -70202 142723 121367 -61774 -152772
11845 -152772 -137365 -309840 -219832 47423 -283588 -209184 -209156 172160 98548 -219011 -29622
11833 308438 -132382 66126 -13859 96072 108213 69941 171205 -105512 17874 218524 -157625
11821 -467626 -203767 -384786 -196712 -100523 46317 -240171 -10157 -36179 -18414 -107760 -172474
11810 -172474 255517 31626 131704 212708 -1482 -47599 -12947 60272 336433 -189386 238146
11798 106052 -247854 -32934 -73015 93971 30965 -64324 35960 97895 -80839 -89664 -375855
11787 -375855 169516 -74980 127645 -125789 -40119 -528968 -265937 -140992 84575 281444
11777 281444 68534 -170881 144463 -278520 -138992 173087 -217381 -81250 -288323 228557
11766 -19674 -78333 128347 -31330 -124135 -248500 -181063 -224373 -80047 111065 4959 65937
11755 65937 3680 -160712 85455 15626 141963 207646 -145027 252404 -32475 -278414 -347678
11744 -347678 56421 73874 57827 2255 -444617 22552 32727 -442541 204877 85217 414484
11733 414484 124207 -20811 89257 -99786 264015 -42619 139582 175640 -7684 -22343 74772
11721 128264 241137 201036 545497 -46536 -95165 23689 -23813 86869 146229 120353 28591
11709 158184 17716 -212693 156003 167704 -244349 -28653 170034 286144 324397 -152214
11698 -240834 -277241 -349780 27299 129942 -100200 -45880 182970 302614 276118 -127172
11687 -174077 105244 -233921 345063 117418 71378 23787 -172957 -20753 104899 144725
11677 144725 16520 -102630 3474 144970 -8783 122109 -108296 227757 -224821 -165678 112048
11665 104695 73297 84979 -28272 -145951 75803 -201790 81824 32826 21397 -262083 -73214
11653 -46129 -363885 166661 -79528 5080 274776 186164 -16906 298500 -1965 -63921 144705
11641 70542 -39253 45723 -271357 79294 -95971 -201978 300595 287716 -471546 4582 104701
11630 104701 -95790 -202024 -312148 -179702 142543 32026 -47869 360700 288879 -5340 -69367
11619 -69367 -184504 66307 153572 -172864 322000 292834 186449 -86384 -318267 87344 154622
11608 154622 202912 -37183 -79895 104360 -65047 -40816 168603 104764 272491 226706 45109
11596 -69324 -225825 44772 -57182 -182001 -29341 226277 173930 274292 79623 -61919 149355
11584 27785 115574 33881 237240 166233 -115036 401171 -157782 379372 91426 50496 64072
11573 64072 39538 71346 75709 -17969 94256 17039 171089 169243 241953 -108131 353272
11561 -48827 382414 51838 -119206 -306078 140606 209929 106311 -169584 14069 -11837
11550 226540 68139 -140748 9791 -8846 231733 245829 -54195 178302 -141154 -235862 -18717
11538 161311 336815 357191 -48917 235815 187531 68356 -290492 -87212 -217724 85242 -360679
11526 99597 404201 -176796 253146 -7198 233306 -353767 -130704 81917 -155958 -122100
11516 -122100 33799 97397 -96481 186768 117098 59267 274748 119313 -181993 29067 118786
11505 118786 150156 229046 2547 335849 30886 143815 294861 304279 250084 132077 -54543
11493 251574 165653 302856 308461 90900 -59914 15084 24014 93881 106043 72067 128351 -114780
11480 -169385 -90527 352747 30490 141127 -28517 -152891 179084 -35633 133983 174693
11470 174693 -262986 117654 -47542 312590 -23433 -321997 -113498 36448 175665 141738
11460 141738 -149517 104289 60863 -169023 49443 87142 -37807 -146550 217785 -131329
11449 -123389 109360 -146779 256798 -405348 120590 -144746 11466 21282 57768 88979
11439 88979 -48719 -35066 199235 373561 -151553 -301162 45158 -85006 138083 146976 -12562
11427 -58799 64212 -29738 -56500 214316 -113153 -193242 101537 -48553 139203 -411568 144745
11415 -67850 -33363 -22247 -122336 129026 207757 178934 124393 30059 284432 -369874 232464
11403 133101 34056 -139160 -36911 78813 47017 289643 187706 -106835 -145111 -93547 112493
11391 112580 -33425 31547 -471419 -199350 122002 -48140 80614 4999 -5593 -269634 -78499
11379 75729 -419108 -16807 -135033 18152 248129 -118191 -194474 -30679 57372 20436 -24013
11367 -178144 -209744 114026 -103241 -449547 -141531 -17276 -117566 168757 222621 -191933
11356 117599 378221 -127401 115942 17307 120628 -216591 -104541 -151232 310080 85415
11345 59643 206958 -74539 -208499 132017 -48735 -136638 201705 -78673 75682 95404 73973
11334 73973 -201247 -77609 -269302 74445 -119917 -381944 -252037 328319 -141044 321116
11323 27424 172367 100480 -88638 150050 -271491 37875 -130116 -205203 -299293 306897 -246816
11311 -76558 130196 -34122 -14900 13404 74821 165705 64258 -149280 95577 -177155 31079
11299 -272153 50823 68510 60763 102799 -44264 43273 -134888 -229202 53726 -319595 -220939
11288 -220939 -140022 -115605 9702 7967 -51605 -123473 157810 -69044 63230 -66045 243885
11276 293523 -124121 213820 249728 28493 72090 12652 -268486 -335788 -162652 35291 46801
11265 46801 -163710 -201502 -113266 196325 -241611 -7256 128777 -128546 13316 -299561 172211
11253 68189 -72920 -119368 -85583 -55529 147447 -22483 11927 -104194 313629 -56696 16118
11241 -104844 -132891 -34884 -200630 -5429 34726 -98829 76968 -188386 -89434 10983 -1731
11229 -175682 -24080 -277825 92339 214812 -349486 -59731 -116699 -74547 7288 -10416 267073
11217 218766 25401 235115 62949 -189084 -187170 136754 227287 -105023 -55258 -216637 24878
11205 -144421 -223025 -42088 88917 -225541 31251 -187011 -275746 -120952 -96067 161629 71396
11193 124674 -42794 -103352 -245291 -115967 52177 -65054 29341 -284 -137162 -40223 90611
11181 -115826 -34934 -144939 84494 99537 -255205 -94089 162000 -179382 -65702 389678
11170 -86397 -222147 -72730 -196261 220810 -52460 -20074 9176 137134 33947 90312 28174
11158 193822 45841 25402 -30846 -180948 82529 53877 -6187 47644 -249086 -257279 -93965
11146 105975 -121954 -399017 -185608 59461 282547 -42227 -150211 -81135 -55624 -95699
11136 -95699 13634 -51503 341443 -61057 134837 -364441 85320 246861 267717 92209 124394
11125 124394 64049 -164987 222864 -197829 248806 -39995 -14408 292678 50944 54134 -283168
11113 -84259 217583 94412 -51533 -172616 24012 126533 97061 200932 94192 213543 176973
11102 176973 -242915 357342 416095 180019 -136546 325454 263735 101341 -111743 12194
11091 112157 42017 -193085 295281 208890 -93448 420741 590237 45937 -238354 258527
11080 115987 -113018 215863 180970 254181 35399 289088 509487 144581 -78277 318473
11069 121143 350649 261599 220890 68872 486954 49741 188455 323511 275295 157855
11059 157855 119410 440361 291914 308058 904740 508883 351734 825721 432462 510265
11049 510265 233456 387148 925540 630544 482104 153657 503681 686633 589555 691476
11039 691476 557938 410110 702703 666054 406413 623894 781317 398410 553051 618402
11029 618402 683840 528028 739840 639889 806876 648466 376521 725189 418747 711772
11019 711772 449365 705118 150492 487064 588083 601891 689743 537488 574915 558997
11009 558997 591971 367475 684300 625281 518071 545934 650617 369168 819634 710634
10999 710634 374130 350051 505210 599755 646434 243354 870171 513940 646489 904119
10989 904119 610155 551390 571225 887226 804373 1038072 843959 764752 822285 1239908
10979 1239908 1016498 1241155 1325602 1725385 1639172 2074353 2328565 2342026 2121464 2511241
10969 2511241 2404966 2119079 1868920 1741021 1778489 1592818 1325583 1322123 1388761 1588009
10959 1588009 1866675 1525102 1692263 1526600 1395956 1426758 1695562 966547 1058066 839974
10949 839974 854248 538753 594219 125167 202384 48927 325476 10126 45898 423598 -170286
10937 421036 -118516 272256 54977 165708 48865 313505 253259 186397 143211 75485 114737
10926 114737 -206189 141899 9538 45487 70392 20874 202901 -95353 -40161 104176 -98225
10914 -82617 79161 -678 -152506 -348128 2485 -198089 113388 -66275 -101200 -198426 -155411
10903 -155411 268456 237669 -6000 63486 201064 53904 244460 165084 66322 -70448 300065
10891 -133731 -58575 114336 -94354 65349 -122319 95969 61214 11071 124457 38274 -173446
10879 70985 -379752 20034 155851 -325488 -80187 -70578 -225272 3141 95916 -138121 -176929
10868 -176929 18599 -211493 -94490 -226845 -177203 -21768 -214865 -225649 -52572 -134941 327786
10856 69721 167196 -67163 -205116 229427 -92919 132953 -70424 162269 212174 -18068 158209
10844 137582 13601 -18080 158885 -130138 3086 -25155 -292311 -146522 -97095 189317 79259
10832 -378881 86718 -98622 -34689 142347 -198673 1815 -65680 -21026 -81212 254243 367515
10821 367515 -15762 -350990 -2217 234807 -23756 -181891 4490 96143 -112188 164438 -20264
10809 -116662 -146002 -10387 -53188 54570 -166617 -58261 169005 -35487 -41477 -276285 -86718
10797 -30451 -174127 11810 72472 466175 -212848 333652 53482 -166348 -118375 229676
10786 -132821 18546 -191909 -212838 111600 -314626 -219116 169447 212519 -110903 136714
10775 -110881 176645 -3485 -164474 155476 -55821 16402 -281168 -204210 -105129 31574 -28309
10763 -190269 -67879 313225 -74672 234712 110141 -156258 -217071 -9930 -6240 21975 -24249
10751 176112 -9646 69231 5393 162257 -74234 -106906 47025 -212044 177130 -3301 -229149
10740 -229149 65131 -43342 1363 268711 106365 -6951 -119469 -8664 -186956 559 -205986
10728 94092 283667 -25441 -167782 -70609 -288893 12419 -22071 -140826 -89909 -367273 19953
10716 -206759 61450 23874 -268154 56683 187442 -68967 -118447 -219795 361905 24976 -177190
10704 -201239 204217 -297745 -349714 -69049 -278430 106963 5392 -45211 -145453 47836 135984
10693 135984 -130258 -88323 -13534 53217 -47784 122903 -121862 4587 71321 -399471 -103873
10681 -10434 -92561 113526 222017 138538 -200685 -192417 -9587 -241820 -68745 -133547 -404028
10670 -404028 -290631 -431304 48153 -368033 15807 32750 -140302 -56789 35512 -142510
10659 -239768 -150885 38710 -321195 115959 -206994 314655 -74016 -270190 45147 -259226
10648 -19896 -192777 -61491 -293251 -341324 235786 185588 -125325 -139852 74798 -373052 -178685
10636 -92990 138122 28825 -46800 -112975 -234035 -41258 88739 -67222 -148127 54043 -328533
10624 188980 -421778 -124335 26706 -214287 -75375 83851 -26024 37680 -129761 -96755 95418
10612 -231433 32910 -13083 -286261 121368 -58674 183021 135059 -158896 -71525 -210367
10602 -210367 -134055 -26268 -374273 -55776 65921 -377645 128509 134950 25365 -28459 81993
10590 -170668 -36581 -274018 -98172 86103 112634 -326314 -63879 -22357 -39048 -202576 -105445
10579 -105445 -96363 151841 90083 -143649 57264 -123768 -152139 143416 1302 47580 174430
10568 174430 402465 -311814 -56851 -301534 -291328 -33535 -65145 101455 -174101 75887
10557 45680 20123 -49786 84807 -38985 122923 -80099 -57927 277244 -152823 -211397 -352325
10546 -352325 -79875 289443 201208 55429 -104282 -12813 -28639 -53333 -213948 -78790 113329
10534 -207086 207607 -365834 1335 205985 -405169 117004 1893 38223 -27354 1314 -82427
10522 117628 -300754 174073 30684 80361 112083 71085 29595 66156 -31895 13122 -7344
10510 -165572 -61607 44793 -223071 -202097 -238842 -50947 -7593 -32392 2638 22511 108607 172422
10498 172422 131228 499571 -237842 107758 44499 -86612 -107499 222918 236441 -235443
10487 258599 120456 -33587 140713 169329 157758 240547 492595 451098 452564 96170 286293
10476 286293 113633 60468 117382 -470709 57471 -85850 -17689 -12650 316743 269539 -72846
10464 -60061 -84511 120532 13392 13142 -141566 32493 166421 -251955 20341 -143367 56601
10452 81869 -47449 -95391 -213180 -408438 -103940 103673 412265 21571 111259 -372559
10441 233205 27117 -7476 -357576 79811 -99189 73185 199691 110547 -329893 -46251 -207080
10430 -207080 110466 -233361 -136575 73008 -100491 -55048 -201993 47236 -5771 126662 206292
10419 206292 -178502 -134817 113644 90409 53083 -364035 44608 -112531 -292612 205151
10408 -350974 118722 -358830 -79120 -117244 -88313 -111396 13207 -86837 143648 53950 19447
10396 -321621 -144530 392075 69717 -197208 -175558 198074 5355 309223 29426 107873 98688
10385 98688 -161720 -92051 -172019 -148108 51073 82406 284260 55776 233014 63584 79371
10374 79371 297309 305771 -214726 -33220 303005 83622 139429 328882 703512 357355 81379
10362 383258 300837 34245 -147363 201795 34765 269167 188071 179437 -143817 409870 322849
10351 322849 441932 539838 413295 229527 200851 212206 463439 291183 391057 339260
10341 339260 102435 9302 829 -66633 452840 -237121 217137 250717 97854 -85487 257529
10329 -2902 -34798 -61185 -84786 230537 -184530 -55360 1078 -3366 419031 138830 98196
10318 98196 239947 -87329 -85787 301982 34934 -326084 188993 117167 -199213 -220892 -17013
10306 -63990 155977 194786 212617 -138523 -143258 32771 234093 -245526 134588 -92028 215839
10294 35696 -4830 35622 143128 267142 96179 -16496 448473 -51106 -156870 130400 -34845
10282 -241099 106841 -272489 -174056 -96736 42183 -72261 -114804 -45797 -409714 117842 75331
10271 75331 145333 -122348 374503 43564 132957 243356 90147 -177168 50638 -21938 -75006
10260 -75006 520292 131393 342901 416392 93333 152079 7301 264961 220597 -93028 65430
10248 -33163 -68954 -60181 -38294 177877 533451 -77815 120709 215636 -121698 16612 -140894
10236 126470 -112579 144587 -102315 -78077 -80422 46826 80086 -110068 -169844 -275761 55399
10224 22235 113256 -179186 -265554 -260649 -42145 71556 -86736 281697 -217659 241649 -215199
10212 231972 -226759 172854 -276252 -194931 -216853 -25611 147507 -433967 -303613 -157295
10202 -157295 27980 55925 -101562 -25786 59445 -68871 -101127 37149 137296 -108114 -19014
10190 -70629 -176571 118031 23911 117220 209514 47188 -120490 -136690 -154413 109953 -138518
10178 -237307 -147491 58023 145313 -440313 -15309 20672 -123038 -41613 -194831 -154401 -456925
10167 -456925 -116644 -104213 -42182 -254261 -198681 9236 -333713 -229948 -114339 -226756
10157 -226756 -36468 252013 -221720 29400 -303513 -264452 20260 -66234 17457 17419 133433
10146 133433 -208389 -518394 -316944 36285 -233751 272998 131681 -150220 15490 49332
10136 49332 173758 -4944 162653 -82719 122699 -86161 -254479 -43084 -83704 112887 -14706
10124 -50116 33087 159196 246786 -68360 87340 209518 117603 -228556 174785 -27287 124784
10112 -203062 83403 -89206 20945 -195436 -89969 -401507 -26335 42485 89084 252922 -277859
10100 149012 -302732 19870 73635 63143 -449745 -202267 -211163 -347591 -210841 -286941 170740
10088 324 -25332 -149376 -160623 -69911 85433 -276493 37295 -388947 -30073 33377 -303369
10076 305644 -20129 -327431 -96126 37475 -526066 -103095 83969 -58840 -191894 -113928 -24736
10064 -24594 -89266 215132 215670 38203 -219430 -436716 -273704 216406 173122 -316072 -194624
10053 -194624 -347620 -196399 -14586 288417 -24842 -130495 216442 -74829 -134532 -53837
10042 -30361 -56870 -15086 -208247 -129822 -32107 -26759 -258045 -68833 -201967 -186977 -87222
10030 -399094 -33258 -73600 -190452 372528 -61853 -130912 -160547 76177 65699 -157134 134693
10018 63712 -207027 259331 -192542 -9929 -176586 184642 138270 -131634 -25404 -52513 -32857
10007 -32857 144088 7827 -256048 -10424 243499 -151697 38752 149639 -194316 194712
9996 -161610 -113196 -214616 -100838 -196326 -446825 -278947 -205092 204775 98632 -247378
9985 -170391 -52098 216096 -317664 -187254 64823 105510 -329399 14568 -167509 158224
9974 -102092 -153722 -229468 -83781 36170 -161588 -18973 -63355 -196253 -80726 -21886 -305303
9963 -305303 82176 -34357 -169834 108159 132403 -299253 119294 263399 45661 -149373
9952 78270 -98883 -43763 -9653 -355592 24458 17407 170149 -123086 -126775 -16945 134381 66356
9939 -129988 351 228573 -234170 -252824 -344022 -123405 -14134 -98993 -331845 -371464 -6851
9927 18421 153990 -57890 -1900 -130537 -227090 575742 -160456 -173840 -60198 -376999 -35479
9915 -258191 -117501 -250740 112491 -118404 223964 60527 -85267 174211 -203775 -37262
9904 45153 -11392 87479 -142722 221266 -208799 251240 -70406 -74739 -93549 143062 -214555
9892 -235317 29290 92415 347152 82936 -157668 196048 94267 58266 -242817 -197292 217852
9880 -270238 -185077 -324330 -298125 -208884 -228949 -165446 -91310 -44580 -184603 -502384 145104
9868 -59633 69314 -52987 301110 -126174 71632 -70892 -148191 -103430 -379585 -129664 11477
9856 -101959 102809 -110771 177444 192142 66304 36900 -63145 -83445 -81541 -55800 -214079
9845 -214079 -361325 -135299 -404629 48843 -124277 -218171 -102087 -159226 -187103 144968
9834 4879 -304864 198831 24900 -133358 -201790 34167 164277 -192138 -91064 48865 -180062
9822 -207955 -41593 -530547 62275 -277915 -58680 -152335 -297845 -123413 -240864 -13514 -65557
9811 -65557 -71188 -192167 -60050 157706 -57469 165220 197537 109286 -308832 46067 -33462
9799 82650 -61761 -382531 -2749 -100433 -365675 -121438 -199256 -50868 209032 66548 -107175
9787 122700 -143260 -365572 126591 -192067 56178 -39032 -416071 -92326 -163218 64901 48863
9776 48863 40491 -223421 -242050 -165323 51624 -164560 178697 65021 -175684 35772 -112639
9764 -127017 46385 -301560 86810 6084 -150598 6706 -135343 -419608 -122356 -15245 -53596
9753 -53596 -215538 -373799 37043 198237 -179332 206896 -73404 176788 83025 -115080
9742 -138492 72524 307907 -76157 -131386 -84233 -145694 -51608 -119971 -182270 103603 -104176
9730 -175242 -38753 -206120 -173530 -122605 -89839 -228390 38375 73531 241306 -43511 -209768
9719 -209768 -270392 -207486 -109379 -70825 292613 -417966 136325 -104641 -218672 -208032 8578
9707 13160 -86135 -208302 216092 -290831 -105261 247501 -67364 65922 -122854 140935
9696 -62072 -127795 119486 135526 -455774 -108760 -212192 -263395 -113131 -166879 148177 -148313
9684 -131800 176427 -235153 92191 88358 -46656 -222282 -129836 -279745 -111123 4717 -227266
9672 -302317 -22912 -26605 176052 -121832 1725 242611 128862 53471 -158309 -28329 113335
9660 -333340 -272026 -149455 -137036 -334770 1421 218615 -59340 177180 -390413 77807 82488
9649 82488 77873 -149645 -10964 160745 23545 -88202 -123329 238756 -153040 12384 199274
9638 199274 3238 147866 -169802 142212 89188 117952 221829 230355 137781 -300703 145679
9626 45389 -282127 -212467 182883 -32767 -200479 -95899 -66643 271904 -136805 92369 -35374
9614 -231911 -204674 -192087 -281569 -233154 -357388 -177731 -111920 284692 15330 -198868 -35221
9602 159723 -10805 -416599 -72061 -80268 -178855 -17963 -50350 -87730 -81107 53428 -56138 -9585
9589 -97590 -124059 -110626 -33159 193961 -48313 151386 -35074 -147416 -55672 80114 -167871
9577 -189437 -283455 156748 -490266 33694 87930 54997 -56883 -225295 -74489 35155 -116622
9565 53271 -413546 161608 -180535 -351784 -3003 -257723 -326283 145635 49702 -79092 -103917
9554 -103917 -122564 256344 26885 -143906 -300152 -187468 -141623 -69823 -309214 -147666
9543 39151 -243710 -218557 -406818 -96662 -138123 250570 -86701 -252155 -87495 159866 -53333
9531 -95089 -130476 70698 148803 -60386 19843 124801 -234466 56337 275556 -36876 234167
9519 -136711 -79904 180151 975 15429 -226272 -68371 -73415 18663 -336127 -48350 172698
9507 -240422 -42262 55931 65417 75848 409358 46758 -14270 -9806 -263276 -94757 -197979
9496 -197979 31133 23738 168055 -158804 79465 -168830 -124345 -184452 -255865 45470 -166594
9484 168530 68477 180060 -147986 -140184 -274736 36840 -155491 234881 -140968 -162113 -248957
9473 -248957 85058 -10960 -137997 59585 139744 -75539 48985 45097 29367 -444847 94710
9461 180511 -276171 -227963 -370076 109962 142049 -203613 -84912 30868 260402 43390 233719
9450 233719 -83988 49583 -165431 64342 196127 8337 -150225 177800 162015 -176007 256031
9438 -512782 20124 -214222 -77604 870 -102769 104610 -340084 -189854 61507 151728 -101100
9426 179730 -344266 13725 233915 197303 -289996 46752 133625 38672 -74051 -40053 -258475
9415 -258475 -275090 -331001 -113059 -128884 -301585 -120398 202787 -110204 -115064 106034 -155841
9403 32154 142299 156574 -123543 172281 -109035 33373 -197118 123543 55454 99014 -262957
9391 3985 114627 -59386 25686 -224953 -108486 -40022 418239 74727 -131941 -27946 -291589
9380 -291589 -126089 -156711 -452868 -48695 43926 -151466 -1583 -42480 -76487 -48690 -194052
9369 -194052 -168758 -35087 64701 -11777 -39710 -88495 -165180 -178060 -183899 -251027 -170855 -344947
9357 -344947 -426115 -175439 -204394 -24291 250885 -148652 131658 -377640 -378274 229233 -107392
9345 -12139 -132889 -52078 -179887 141037 122001 46162 -117890 13391 87100 -14952 -116776
9334 -116776 -337702 80984 -11375 -42534 296108 -131551 81085 -65120 -35328 116703 248692
9323 248692 53445 -244074 -49021 -153110 315877 98359 -83900 19512 -176138 -217988 -436373
9312 -436373 -188782 -4792 116806 166547 -136191 154474 -260028 -46799 -290157 4485 123534
9301 123534 -11145 -157169 -232951 -95254 -45014 -224496 -361231 -374777 -261465 115386 71372
9290 71372 -1681 206367 -260207 127509 -102804 206913 -123895 -139271 71711 11346 -2478
9278 -171590 -263627 141229 -151470 -176956 4312 -80249 -130898 106131 120317 373763 68568
9266 -229043 -108556 38451 -210778 129922 -172368 65327 22206 -264175 110746 -40118
9255 -86676 -239310 38224 -70446 133940 -102826 234749 -262518 -103295 365101 -30425
9244 106676 131764 81879 -105702 -337217 -208453 7295 397613 13848 -80699 58920 42518
9233 42518 -162157 -188657 -30207 -79415 65239 188688 -98645 35381 -261266 138358 113315
9222 113315 7191 -173425 74588 24158 -239068 -469601 -256441 -128827 57434 -354685 -16324
9210 45123 -239032 -345739 45757 -108838 -71832 124387 110834 116535 -28251 -249260 257346
9198 -33212 -161366 -172424 73674 147962 -134435 54983 219611 45836 -206171 -155938 -225831
9187 -225831 -153864 -242423 -37319 -148323 -106059 -137629 -256248 -26247 -269082 -405951 148554
9175 -390552 318451 494458 -13405 156959 -33443 -15668 99525 -126838 -78412 -87953 -25858
9163 -30149 -105677 -68300 -5919 102505 119598 -160931 98092 11978 -162316 -30473 93383
9151 -378459 -17720 162834 170601 136589 30337 -77611 53232 -107320 -85348 102852 -6567
9139 -84754 175715 163610 287685 -74651 -148051 -4368 133643 75199 -402740 -196020 -13770
9127 -111931 -53036 -181211 161766 207527 -272559 264024 -7499 336892 -124852 -87825 -55548
9116 -55548 145189 -143289 -96700 -50121 -27755 -250992 137896 -247518 182334 -138001
9105 -177932 -119894 -282935 74952 84306 11952 201068 78763 53608 295138 -314270 -74062
9093 4540 -103913 -58074 94001 -143272 -122234 -273398 43768 -129751 22927 3163 115410
9082 115410 131639 -100430 -33020 25950 73771 -128524 -32127 106845 -266740 -161846 -24840
9070 -104714 -270586 -8404 -347338 105437 -37038 121868 -125839 135710 -13250 -102014 -383252
9059 -383252 -802 113518 212901 -231482 -4497 -343183 108946 -23928 -94063 -23050 -88978
9048 -88978 -49577 -115060 -221464 145803 39005 -97563 152976 183166 -65592 6665 288686
9037 288686 -198893 -233832 -599708 68673 -130339 -209502 129679 21488 -88953 -219953 -312954
9026 -312954 81708 -187874 -74623 -354412 137119 -13656 -88570 -49633 261923 -7073 -59326
9015 -59326 -129689 -148437 -132409 -273059 -76214 329196 -65979 26609 -2110 86238 -140559
9003 -206243 -120651 -174965 32315 -263289 -259787 -330875 -23515 -130737 73949 -241131 -390628
8992 -390628 222833 -138121 -63153 -100703 -163094 -239651 -151344 -125448 6651 28603 -260239
8980 -309129 -120331 -56722 -226795 -94203 -286711 21808 -105971 366806 -123481 -378267
8970 -378267 22951 -216676 47279 16664 -128014 -135502 -106739 -352077 -105699 -10938 67978
8958 -127840 133663 -80262 -183880 -409476 226234 -364643 -117473 -96033 -119919 83592
8947 -185452 -101401 158330 -96484 22678 65550 -191722 120852 26425 120076 152533 212889
8936 212889 167313 -127923 -162408 -226780 -16806 -115178 -35987 -126791 -388087 237326 -180153
8924 168484 -89833 167142 463644 265217 115803 53265 221358 -300826 147771 -67444
8913 -182040 70503 -181022 107695 -91844 -84336 100607 -171872 -259220 -216842 85023 69567
8902 69567 -107032 138037 104143 38522 -81410 6345 -152642 453565 57706 8091 206218
8891 206218 74758 -60040 120305 17157 169184 -34371 197037 -227187 -211867 -96680 69181
8879 -114409 120275 -14970 82603 -290196 -190247 -280614 47619 -236923 30500 -49795 -224514
8868 -224514 -45683 15178 -73585 -203853 -26338 -143203 233338 -362441 159320 66454 -137523
8856 44978 -112435 120141 -41839 -93173 -577154 157945 -124379 71473 151587 64838 -235811
8844 -379438 -103288 52837 116938 -52938 -18966 -199289 -81510 -197136 -105347 214428 -96240
8832 205842 227810 19634 -163335 222429 -155314 7147 -106508 142916 -163304 -53358 -35250
8821 -35250 -120287 -96217 -20397 -9648 -37699 -187268 365427 68367 270471 286260 -210535
8809 -91667 -212257 -104492 9541 65136 157101 205172 -370506 26865 -203217 176348 252150
8798 252150 2204 32887 -86499 -219622 -104499 -3660 -101386 -291700 96888 -128176 170210
8786 -132047 29167 67263 -60850 67076 -308643 -75719 -124942 257787 -25436 -14535 -181295
8775 -181295 95927 101316 233521 -136914 -330941 36606 -223760 176715 269860 48328 -239880
8763 -242432 -325691 -117465 -151946 42404 -17547 102028 183193 -116307 -148144 26784 -94186
8751 377769 -221876 -182868 -202270 108789 -58368 232220 -7750 -241306 -158858 -213491 -262022
8740 -262022 -375530 130574 -71263 -7762 -24501 55845 -229574 223415 -460070 -215901 -75305
8728 -34735 76483 20169 -12550 -13220 97851 92381 -325125 -496307 -132215 184203 86477 -33334
8715 -77523 27416 -110877 -217141 -185118 137985 -561438 10142 -406759 74387 -179399 -86236
8703 -30409 -148239 -75763 -128319 -46350 -19492 -215606 241459 123362 -370787 -155142 -48626
8691 -88126 -314836 -135292 -289727 63710 125802 -79022 2281 -303736 -44222 347293 -226582
8679 84573 89604 -108679 -187306 22377 -8556 -62119 -219526 -164229 -229888 -238176 -16450 -115106
8667 -115106 -264730 -19907 -343400 -88885 60442 -77192 -156998 -272221 174306 227261 8003
8655 92201 40263 90502 53593 -272095 -219157 -180431 81487 -56431 11878 -315559 5507 20335
8643 20335 -181050 -25981 96213 151285 -186499 17540 306653 115060 38491 -72469 -102422
8632 -102422 41961 -279933 -241856 -401760 -20638 110140 -24100 -91819 -149116 -279727 -275497
8621 -275497 -186466 -146569 212874 -277 -58304 -314950 -159594 236817 142390 -87344 -101251
8610 -101251 -132020 -100666 158287 160237 -268195 587 -145468 -186175 -53321 148135 9601 -85058
8597 -172771 -208350 -8446 -195472 -336985 -264099 7576 205821 7114 -231 -108970 23941 -240467
8584 215914 -159263 191830 213759 -79490 -40347 125707 42820 111389 -90428 115493 -249811
8572 -38749 -302508 120450 -50062 51245 -217589 -24179 -202579 440649 -219532 -124335 -195959
8561 -195959 -155118 154733 6396 16483 -177465 259488 -86250 -198124 -287382 -3422 88078
8549 135319 -191063 -11637 -78012 -368623 -34306 -87282 172151 170033 142253 86943 119920
8538 119920 234406 70444 -3792 42138 318537 158220 -363182 98754 133499 283841 -107266
8526 -319071 -43297 -159904 -251707 -24863 172083 -32875 -117290 -75634 -524 -140285 -155581
8515 -155581 133084 -118792 -243002 -195794 -1369 229220 73277 53851 168357 -12160 59473
8503 38706 -179796 -311825 133777 -97232 -8241 68244 -21538 -107388 -15677 -156011 -8772
8491 -216643 -79710 65018 14514 96879 53180 -174325 -67096 -113821 -145588 -151979 -168624 -325530
8479 -325530 113162 42151 -259 -47138 -11798 -10070 -167319 27400 197883 85377 -61801 -231610
8467 -231610 -63953 244033 137321 278167 8591 -107087 -333855 -47210 57196 -286280 -348
8455 82382 -378004 -281177 -129806 -117716 -179635 -198631 277940 -6423 42414 57504 -220105
8443 -156989 -154288 271624 -385983 23428 -195990 -36354 -99088 -304515 -211819 53913 405396
8432 405396 -286518 133098 -60149 97674 111738 85035 -36402 -101032 -233661 -74645 232507
8420 -505993 -71828 -168276 -35602 -231716 114178 119708 -103765 -43990 55630 73933 -481446
8408 -57528 19960 -354262 279618 118668 144372 22407 -58580 15574 -182445 -112204 35882
8396 -96987 -135120 20192 125111 -162079 -6589 225138 50336 -15457 -110368 64472 -321636
8384 4209 -206765 -1618 -307895 -1483 -39202 -240244 16250 -160764 -138683 -10812 119800
8372 -345633 23840 38280 3745 -147425 46343 -42088 -178537 -350652 47569 -38179 -200736
8361 -200736 -97469 122685 -122225 -82256 18869 -118631 102866 -173102 -22435 57043 -191469
8349 -530259 58177 -249047 -40775 38830 83494 255994 -7963 34357 -180695 -135677 -170813
8338 -170813 -54401 153597 -118413 14632 21981 -66246 -149781 85553 -287948 -187640 -202223
8327 -202223 83071 -408804 -340527 -77008 99875 -121216 5082 15394 -8872 167040 -216008
8315 -91726 -59737 -34552 -23845 -135894 -94582 -177115 146836 2844 147647 70969 -134398
8303 -117989 -153549 -156187 -330897 18015 24649 468 245451 2008 -32641 325861 -137386 -44455
8290 -187377 212210 89321 34771 51986 -135179 -125173 8372 60968 145411 -446517 2877
8278 19038 -3519 -126121 156214 7408 199160 -112052 57466 172596 -47520 127605 -213111
8266 -125705 44222 117437 134027 -94289 -84413 47079 -240325 -349539 56920 -98503 -555265
8255 -555265 -39561 40539 143855 103205 -41719 -248136 -242277 78903 -248325 64829 -155071
8243 -81637 120905 61716 330693 -239569 -61803 -248726 -143969 50396 142749 110921 120712
8232 120712 39871 377184 -101369 87907 -128051 -54173 27042 -2820 -27576 -229675 -164016
8221 -164016 -453688 194121 97550 36326 187581 -221670 -197635 88916 -237631 -206203 259969
8209 -285357 67229 -245657 -407294 105288 37786 68211 -367 -47023 -59150 148856 -29878
8197 12130 172818 -79157 -222876 -315812 -73810 9190 -222297 30948 215835 -271508 18388
8185 -233986 -116919 -158636 242323 140381 100963 -177337 149789 120240 -165358 -116979
8175 -116979 21343 115307 41487 65954 5045 102072 -185908 38957 -97031 127279 41378
8163 -173805 -110723 240885 -88679 -93512 18161 80996 -78767 136323 -161417 -28540 60056
8151 -168463 -6574 -125953 -3798 -236861 -103336 -125105 245748 -34617 -31885 -93377 158351
8139 -99179 -32157 351115 145000 -166540 69738 -30093 -98460 -240415 -61096 7793 218379
8128 218379 271119 -115771 -61767 -19649 -55644 -30185 -357814 95760 -124736 -194588 108932
8116 231722 182624 -40637 -313950 -453279 29642 -111890 25456 57910 15026 -105433 -35807
8104 218006 -9542 -18532 -134363 -242527 167572 -359363 -366847 -23231 -268410 142352 177922
8093 177922 -194294 145833 123103 -57335 -48991 -151208 134189 165509 -8419 -98929 -156641
8082 -156641 -221806 133247 -227063 226813 -167611 -47642 256952 19048 26824 166444 -11105
8070 -298885 -445351 -164222 -135853 -66041 -197235 38073 292596 291818 -47730 -66595 159231
8058 66130 -290161 -154422 -406006 180011 -291970 -511980 -138243 -142757 148817 -95355
8047 23242 -220272 -329740 -194180 -220230 -68313 -45183 -20717 -92991 208585 -52788 -172164
8036 -172164 273652 -59410 -255258 -93866 51319 -38512 139609 92960 35092 77186 -104737
8024 -76082 122968 -215474 -259403 257975 115655 318919 58224 335455 -9277 -169820 110485
8012 49787 58678 71011 -14789 110314 -198714 -158154 11838 180442 -67401 -235641 13163
8000 48038 210980 25014 -40208 -99541 -111038 -41167 255007 -82813 -105434 297592 -139992
7988 107802 178634 -251523 -47052 -37120 -164464 48785 136046 89798 -70137 -249662 257801
7976 20979 -56727 146153 -53159 78329 -51813 -248013 -142413 -124362 41227 -475609 -3817
7964 -320870 -182367 195942 -282961 -169963 -513 157516 -38478 15997 -143647 -242348 -368474
7953 -368474 233455 -10033 -159948 -254287 153681 125967 161802 -217123 -122477 99762 -119676
7941 16574 -212684 144756 -30328 259214 136727 -273211 98287 189441 124263 16359 13017
7930 13017 -48702 -47775 29929 -259356 109473 -83054 5175 188011 -53871 -402886 25779 -104257
7917 -197778 -230348 -268127 -280339 262434 268186 -289459 -197052 121328 24461 78318 -41866
7905 -25412 -144345 -109572 -25798 -133960 67885 113781 13300 193238 200223 -195037 -29001
7893 -181633 45761 131800 208143 -135113 208737 -240501 29498 63184 -300438 -5274 123630
7881 -254414 79958 37577 -5701 -169663 131643 -138487 -153945 31810 -122168 -179859 134217
7869 -399907 -214737 -89328 54231 236165 -93384 -45821 -108742 160121 75852 -296480 -242236
7858 -242236 107142 -125913 -6564 5850 464439 -151832 214778 278473 -397435 -73496 -97360
7847 -97360 -114386 -106812 -92206 -100705 -84318 -24350 194290 -182202 -48588 67410 -114012 9140
7834 46476 145421 -311478 -92234 13639 53009 50916 78470 233145 -557417 -202018 1965
7822 -265775 -129579 -138695 125699 -199820 281465 -271125 -28276 230881 -30076 -52009 -128654
7811 -128654 94222 -380675 177122 -101624 65336 -320895 28570 -60619 54424 -120317 148111
7799 160732 -493846 -122110 -265601 -396657 255302 47298 136331 3848 -61698 -259620 43675
7787 -363355 -302755 -104842 -137237 167586 109572 -333243 -411597 -65210 -204987 -54834 2261
7775 127731 -211013 195704 -71753 -165183 -111900 102230 -79992 245290 -58869 -166246 139242
7763 -4872 29510 62567 -63429 -3668 130504 -274607 -179515 71068 -98155 -200134 -121496 -2269
7750 -192494 19346 270648 219191 -275518 -144466 -71538 -82260 77580 -2523 91455 -7883
7738 152563 104730 10920 126825 -139780 285385 139640 110293 -190915 213600 -53912
7727 -33629 -51653 92131 -257395 599 -33216 14499 113246 -124024 78810 44827 149197 -150207
7714 -276366 -86552 -161659 -218659 73127 -52144 12080 -260386 1538 -210090 -71102 80351
7702 -35294 96637 123812 78545 -241678 -273789 -268008 -133876 -188960 -38048 -194708 123605
7690 -56764 184322 -291694 -126966 -86932 46609 45040 -12370 -216118 -354416 190251 -74096
7678 -130379 -92026 242844 -256260 -197842 170489 -2408 -150178 -18766 -306860 49936 98435
7667 98435 27221 249857 253939 -156962 44880 157622 -79995 -301060 68725 104153 -228313
7655 113903 -103599 59736 266880 241795 -109927 -62852 15597 2114 -36656 110134 116018
7644 116018 -156697 4639 -358064 -137927 -65520 251878 -16864 -160213 -103075 -111518 -16581
7632 49910 -328803 -167546 -70486 96439 35278 65233 233108 213031 100294 201101 -111791
7620 -80054 -95854 -113170 101141 6150 -189198 43559 137244 -92806 -71652 -114782 -94882 -129525
7608 -129525 160987 165694 171397 12856 111283 -93557 269336 -322478 -221263 -21794 -127827
7597 -127827 -38668 -261978 99053 -274690 1195 -61990 204059 -200152 -65527 -27073 141411
7585 217602 -21394 -110971 38151 -165373 38120 144486 43839 -144861 -99972 -24698 -344319
7574 -344319 -77400 -122301 -115246 64269 -73875 103887 108092 -41738 -4070 196543 -56772 -413791
7562 -413791 12920 289831 -222374 -144712 71759 3208 -151731 -23152 -122557 141658 105674
7551 105674 83423 -159333 -219851 -129825 152533 -107376 -132752 -55509 368441 -357793 -12692
7539 -50786 -173548 32403 112884 -137593 318557 -83475 -111656 113722 -48399 165583 60700
7527 48403 142638 73303 -210190 -116503 282687 -77168 -394628 293857 11745 89428 -123916
7515 -173808 -34954 -9269 291837 -93366 -390390 220230 -272916 289470 -10720 -223487 -80302
7503 113031 -254992 -186634 198243 -181432 -108572 -83962 58253 -55198 -171921 92409 64154
7492 64154 36299 190455 -17517 -349181 126119 40226 -232046 127283 -169265 17917 -331907
7480 -41234 429836 45021 -41715 -23712 -96441 -243471 102646 133405 -171870 -17240 -44805
7469 -44805 -4721 -194743 -340694 -117394 -23850 -195911 -252769 36181 -25090 -198893 -279801
7458 -279801 132062 106497 57411 103152 39963 -345762 348944 -134522 -145639 132700 -27870
7446 -138439 57749 -190296 -121503 -26319 281296 59994 -140248 -78602 -139181 -132811 134677
7434 230874 149722 78927 -151169 41600 -140752 -8009 -77212 84540 37329 -51673 -199532
7423 -199532 -54533 287794 -132132 75884 -99620 271651 443147 50922 -78923 22865 -226665
7411 -207282 -69099 -94342 56566 2553 -67175 -63339 -47475 117579 31445 -61289 31403 2089
7398 -242668 174353 48047 54024 141963 -11116 -123040 19907 -21752 -75906 -47316 235189
7386 -128940 -112524 -25342 -276549 23764 193246 -281636 -27342 -20923 -261188 -143433 -308403
7375 -308403 -275793 74656 -8221 94575 10485 281023 -212480 114640 -213317 -54637 -116582
7364 -116582 -192656 169819 -43375 47381 -35656 -71468 -126744 -96819 59738 13668 -191251
7352 71821 251112 10797 224743 99278 -45356 -165274 -156804 123926 -28501 -19775 224132
7340 -91782 478816 -213656 -455235 -70787 11472 -27487 -106812 63464 -97690 101076 -270146
7328 -143501 99752 148016 43218 -153320 153003 -241803 -423164 -123420 -280188 -120262
7317 -15537 -60365 -367849 -45117 149835 -55586 3202 -381105 157059 214824 -37145 -264386
7306 -264386 77279 -217308 257457 -1967 -35513 164413 -215899 -67557 91987 167091 -87333
7294 -100372 145996 25539 136236 -112462 116005 7789 39732 -204797 -184605 -178795 -23480
7282 229061 77771 168132 84434 -47456 -104724 -247602 58905 -50434 71841 -134902 -44869
7270 -372988 111737 91595 -9817 -234849 -131409 204057 106339 8563 -7784 -69684 93574
7258 107326 -111674 -222821 147879 -244857 -381180 4492 186256 272763 -304426 -32930
7247 -60784 232617 -145388 5201 -184694 -244036 -53029 82839 -3288 -11062 49614 -132112 -286013
7235 -286013 169190 243893 41820 -251575 266541 17917 -156610 104137 -92045 -64782 95627
7223 -275909 61551 -219693 -257827 5303 -70326 -124698 -14757 -222384 -107881 -285879 178911
7211 262866 -341917 12092 -146550 29990 2076 -94025 176139 -42856 -71258 -176965 -24139
7199 30113 5364 -279866 143169 -49464 68799 -70036 -40677 -37096 -130359 -174650 35530 65845
7187 65845 31029 -58627 27701 174583 -85571 91786 50975 188376 26151 174320 -294887
7175 -57697 70070 -82161 219216 207646 15984 313275 -107241 166298 -87570 -155859 24617
7163 -28178 27106 -139981 -321306 -151539 -240425 -69139 387778 -21274 -108593 91712 -83402
7151 98351 11720 478117 74432 127714 132040 -81512 273246 -127862 19885 -7117 86770 -152937
7138 -217643 -7673 -41593 223990 -57714 -17416 -483127 -124179 -146174 -44280 100698 -190446
7126 255287 -250196 -73691 -26780 -79601 -92593 -13613 -135649 123537 37110 114213 -122380
7114 283548 -188975 -87747 -196165 105700 212620 156379 -250508 109490 -5106 63430 -382951
7102 -221097 -233984 120676 -46919 38876 145001 82051 -85041 39309 -57032 -70362 -85029
7091 -85029 72913 195466 -165585 -112607 -41831 -287871 -60661 -113690 -145723 103645 -42833
7079 453718 162132 -77313 28562 -160549 132642 -100652 -19209 2223 -219111 41901 41570
7068 41570 -34462 193905 -111040 -30616 -285039 -110189 -368357 97492 124109 21301 -40684
7056 139553 -227677 118996 -103982 -237275 5556 -150788 -220663 -69461 181183 -352373
7045 -79059 391258 -21393 156428 49672 98415 191266 -47196 370698 -116972 -70852 58936
7033 -36004 -33686 215481 -201847 -193577 -136006 -99981 -213082 -177683 -177366 -142041 -56039 71326
7020 4217 -30740 33354 33356 -74902 96027 -159240 40053 144964 -89246 22645 -245036 21577
7007 179575 -83162 -46459 -149920 68246 -147294 -96173 -125056 -76750 -164641 49134 -36803
6995 -93768 -85708 -136111 -464981 166579 -338412 -14160 -953 -116723 -154675 -126214 -100700 -150542
6983 -150542 -51678 -203585 -129364 109614 -150117 -379478 -5291 57549 32734 68786 33043
6971 -139680 82375 -197735 -183812 -133827 -34247 -223303 50949 104101 -110448 -150908 -280614
6960 -280614 -20612 251763 107540 -156200 -106519 -241008 112463 -20595 227232 152678
6950 152678 21364 92790 -5404 111202 70859 158674 -3298 20825 68541 131388 60711 50053
6938 50053 91140 61548 143012 272660 -99907 267840 164488 -257245 96876 93331 167148
6927 167148 197476 -172428 -56252 -208557 73838 -192980 -21827 348441 164932 338070
6917 338070 -19502 -30804 58805 -151827 -31799 77536 20365 -279062 322116 -423412 -2028
6905 -306355 153481 -20408 -155630 -25213 120842 -18754 -1387 -245604 -142465 181630 24763
6893 -212126 226913 296804 399332 122702 -215151 -64409 195311 28726 -159327 -350484
6883 -350484 -230754 -150262 -10069 285960 23950 239043 -166474 187998 -137473 98004
6872 -66820 -64739 116973 -95400 -167438 76612 86824 -284316 -254211 -113835 248529 -113707
6860 322723 104177 -308341 -47911 -33889 208328 -9639 -204949 -19711 82085 -173157 -96391
6849 -96391 96293 -167328 81705 66383 -67672 130209 86540 -195296 -97762 46316 96462
6838 96462 125629 39668 -176686 -265878 -118602 157441 -233437 -149022 104886 79089 193030
6827 193030 55944 -133209 154759 130102 80803 14315 157718 -2388 55909 -38571 -100374
6816 -100374 -333630 -226100 60661 -244001 -127338 103963 63026 183304 103028 -76657
6805 -281203 -255514 -394123 -258589 70042 -111799 -10444 -51626 124395 178365 27730 -264982
6793 -114492 -211038 248172 117465 148008 212143 223974 200931 -30934 -6214 -41519 -181674
6782 -181674 -249998 92202 -100625 -215341 32036 -99589 49089 -87798 -32823 5812 273382
6771 273382 -157398 -330124 88122 254059 -198415 159090 -315352 -128464 174437 47121
6760 57251 -101007 -26269 -88919 135435 200658 39594 51989 124238 36759 -147563 -17205
6748 285098 -67118 -455604 392102 -19373 272596 15031 -8020 -118284 -41472 -255179 -167208
6737 -167208 80475 -211713 113231 -104457 -158513 -223398 -78510 -100217 388 -117376 -335733
6726 -335733 -170761 157875 -64440 -81457 -167983 96823 75628 -65423 -116569 -363303 42614
6714 -176964 -189254 -184988 125865 220299 -207864 181998 87278 115168 -76999 44927 241309
6703 241309 100198 55681 65695 -197516 -101952 -325548 -43362 345701 -24456 136769 55334
6691 -46124 99217 6713 40884 -208461 145674 386482 -132105 197746 122441 157656 -86933
6679 -78998 52598 97779 -118439 66345 -20366 -92581 -35318 313599 317299 -83284 12717 -288429
6666 -53253 122608 123752 -123011 191618 -42662 -2650 -28771 -5650 113412 161832 -292081
6654 -68442 48994 19346 -88186 -69050 -88623 -82434 225090 -208977 -94464 -118154 -359367
6643 -359367 -133938 -212295 216952 65166 -10076 25366 -68285 82874 220123 316819 -304111
6631 -171653 -53425 81571 75997 89635 101940 191326 -344244 -154922 89677 28397 -302930
6619 -14042 -137218 -178594 95234 128441 24920 -69268 64443 -462371 -15048 169464 -9349
6607 -32057 165358 -125119 66170 122802 343960 55092 -6009 -255726 -218189 25303 -107498
6595 293548 -58268 117089 -104703 -83777 48 162550 250931 244823 -177436 -13281 -50495 71354
6582 -13317 -199720 -131223 -222633 -112213 -5825 -293238 -208768 170952 294030 -204640 8410
6570 -49063 -35842 -165835 38934 -289996 -35578 31415 -211879 7667 -120231 138714 -37170
6558 34233 294890 -44987 147883 185931 24981 -17471 -44988 295534 -114093 -7084 49393
6546 -86520 40021 129291 250822 -236718 -74756 110961 -158403 89334 -94617 -51087 -38975
6535 -38975 65451 -26703 -14214 83890 -86251 -121515 103044 -214619 37255 -98276 -89297 138644
6522 -150741 7754 -38192 117947 179133 339029 99159 -13623 -62605 -269067 -31954 324464
6510 333909 -86912 161876 201458 77700 -68345 -55038 153295 -180431 14319 -81469 127988
6498 -387215 45386 6078 104743 -332093 -28421 -124068 49772 -46573 -233826 -20336 22898
6486 -167144 143932 -38112 128572 120678 -159016 257498 -109731 48623 332508 -395672
6475 158020 -143749 -326905 -119016 -216542 154939 93815 189507 -179329 -22116 -45496 138131
6463 -189133 -76379 -134185 -183268 -141285 -58313 -241015 85298 -83140 -174686 24883 147327
6452 147327 -38920 -86718 359682 -70343 117147 186522 -239741 -151683 44590 19225 286909
6441 286909 -164647 -142986 -142468 227682 171361 -43344 168660 -372293 28449 272077 -122852
6429 111611 143127 -129857 -228172 70093 -152502 -166470 5722 -377736 -34571 59194 149070
6418 149070 -214269 -14242 309845 18190 25025 71504 21760 204429 172169 279922 183369
6407 183369 18260 44370 -26732 222183 100735 -2242 -300036 -106976 -192209 -86416 -164322
6396 -164322 -147565 -201352 215699 120968 222964 -30919 -112234 -120661 -198055 -233316 391662
6384 -58192 -195523 42994 -173436 -50910 187470 -63113 -47578 48087 -234458 -60503 -135009
6373 -135009 -169010 -220366 -179255 -45143 91862 -71913 175760 102711 -130214 3194 97488
6362 97488 292450 -28030 -54699 309506 -2174 240765 204593 -60495 -36491 -59026 -165827
6351 -165827 107214 -86989 -257648 187077 -26702 -230581 -299027 197603 -188965 -50574
6340 22127 -16192 -113099 -92502 -303945 157193 -116430 -262874 -96545 -49755 -79153 321875
6328 33922 -49114 36 -54650 193173 187106 -183962 67311 178623 3077 395 -314565 119881
6315 131902 11426 -67124 10092 -289739 -295126 240150 -19806 -235884 20087 -90308 -58910
6304 -58910 305707 317660 -66500 -217746 59389 156766 242850 79735 -216099 247829 -70702
6292 237514 -59512 188179 -89883 -389083 249814 124491 51079 -82728 -80570 22631 54111
6281 54111 37672 103180 -169376 -106578 -222370 257383 -235828 -41176 -84546 -203901 -254380
6270 -254380 -141403 -109282 283789 -61287 -172843 94231 287380 -98766 115036 390629
6260 390629 294862 -136369 168956 171950 -49506 119594 19009 -507997 -398944 -272340 22416
6248 -90323 -224125 -96637 193427 -25275 47188 355662 -72791 -41701 150328 -366881 -100429
6236 -43336 53590 -134666 136386 7463 -36222 98077 -61063 67706 59439 123642 181092 162650
6224 162650 211154 202187 -96222 -148023 -46619 126889 -19152 -58789 194556 -8689 201238
6212 -124955 -245519 29428 -218203 136533 198433 -107215 -66315 -335627 -90348 -280503
6202 -280503 314211 -383321 -45642 -352257 -29286 -7828 -125508 222354 -100146 -222072
6192 -222072 181643 116285 128978 580993 83262 -63277 -24993 146328 -39617 -369294 -261515
6181 -261515 -256187 289527 -62908 -90875 -74627 -50084 328321 -48626 -89719 -5218 50571 184484
6169 184484 -155564 249194 -360172 233478 240584 -91854 -376652 -21648 248221 -217600
6158 61464 -65056 169729 14868 -65821 -65680 -34801 -164882 192553 -12434 71842 39873 -144226
6145 278527 -246987 112072 112535 -165558 -15354 -222955 181579 -84012 191703 -100983 -72033
6134 -72033 -197744 368868 -304521 -4465 1261 -51734 159882 20490 -146806 -42606 14716
6122 44503 137552 -369232 -56398 154659 -237993 -224723 206935 -114836 -106960 -62468 1193
6110 -245691 -72800 308097 -123263 145895 26404 -200988 -134949 -4991 -349374 -106968 82807
6098 110311 283802 141925 -67175 67889 188944 -58812 -90035 160104 165578 -109552 176094
6086 58266 -115428 -201491 89716 53429 -93312 132067 35593 -93813 -181087 60818 -322308
6074 248113 -64323 -128597 -155779 92054 94599 -61664 -154950 28892 -5423 223153 -66431 -111166
6062 -111166 -19321 -34510 99238 -155602 -134191 24734 -49684 150566 37289 -203091 281373
6050 -92452 -97758 -86068 -154636 -79943 22056 326234 -101591 119135 131988 134066 -168501
6038 128700 29428 -84751 23842 195047 249351 24173 14050 -157627 -359074 -193561 -356585
6027 -356585 -31084 228005 85585 -236210 -10030 -47690 178882 -112132 -185947 -7585 -47915
6016 -47915 412378 80189 94260 218108 -67533 152896 125980 -135449 -437102 52357 -231918
6004 -34585 168463 75189 -170156 -379952 -129757 106767 154558 8334 166540 -72773 -154380
5993 -154380 -1442 -5504 -181142 -378848 158896 -40353 121224 247310 73037 32229 -32785
5981 -365720 -229196 -97382 -24351 49164 -130064 205691 -225416 -113611 -83617 -283695
5971 -283695 -124721 -401003 -27715 -232130 65578 236860 -208300 -283521 48480 -68412 89078
5959 206139 -222944 -98628 -208931 52414 -88496 90511 265170 192412 -103984 -278434 -126286
5947 -283361 73167 -157924 -105228 22649 56066 108087 187328 -190580 188122 49096 -159669
5935 30914 108051 62954 211814 -256847 -201087 -106027 143275 102468 190043 226537 -80644
5923 -97114 147403 -90770 162104 341051 -215587 44663 61660 227448 207142 -7211 -223017
5912 -223017 -152830 126557 -123512 57357 147556 15675 -164670 -185358 86832 37000 65256
5901 65256 172959 106479 488 205327 -223145 -229809 -238622 102664 -4289 179109 54216 -33360
5888 130619 -10447 137163 6199 -152399 75448 -92419 61352 65480 -143068 532649 73648
5876 77589 100240 22799 -179021 424342 34603 76389 209436 71261 56441 164230 -258415
5864 -91265 80740 -394728 -334550 35433 51571 -49495 -178766 287257 -283745 269663 -132023
5852 -49033 -192211 85249 -62982 -145219 -157959 7476 -238905 -348148 136832 -294346 -127351
5840 324290 -169557 -113316 -10497 -95691 15920 -62588 -469383 -171391 -48265 19443 -48884
5828 -33229 -84484 -494701 -17913 -35076 -164287 6470 61097 -88836 301077 147173 86440
5817 86440 136088 223890 359285 -50975 -96649 581830 -117115 -212925 -97786 -176251 4620
5805 151228 109746 229605 88790 49283 -91791 -73778 202979 31128 112874 -38312 443923
5793 -67467 -93646 199353 93552 -31160 -4563 -117319 186132 29807 111541 -63238 -262824
5782 -262824 -25682 94773 266790 210416 -54262 123751 -52530 174296 -128545 -49683 -191325
5771 -191325 -17703 2375 -56443 83927 40225 -75595 -195831 119163 84994 -27663 132748
5759 -151263 -220021 263509 -188685 198351 -302528 -142315 -67531 -89151 220686 -194095
5748 -32505 68864 186715 5749 -174543 5843 -94336 21240 -111956 -72299 -84021 207698
5736 35546 -145294 -58230 50895 157996 177724 89731 8829 166799 359 -60202 -82082 -60804
5724 -60804 -94293 115970 -87804 -96998 -33716 -122146 298953 131347 -185699 66956 35064
5713 35064 -102691 -5194 147160 365589 -85144 -151619 137210 53562 -66348 -32392 -198006
5702 -198006 -249606 95383 -3083 -406060 289419 -159646 -49260 87873 -140873 -341789 -163645
5690 31576 152611 30661 -208100 -239144 114283 -281315 96124 103506 -77397 -196245 -58031
5678 -120384 356791 -41259 9419 223817 146658 233401 -241961 -80078 -335902 45141 189574
5667 189574 -63716 -38246 -46602 33047 -31103 50936 124082 88266 339991 119586 -9539 172619
5654 412909 -105747 36832 -94583 7888 -115199 -203668 -10004 47864 55301 140697 74935 372967
5642 372967 81296 103686 167611 40007 -40642 -316956 -22965 14733 -17188 525047 179910
5630 54767 -201163 -197362 210307 21983 83979 -15100 173043 -123922 -68744 -9689 -31826
5619 -31826 232515 -296111 -6989 36416 -106127 -9421 -420785 -152221 -70957 -149703 -115435
5608 -115435 -194095 44660 99774 -215248 -96769 -73404 227087 317016 -124813 43680 138098
5597 138098 8864 66677 -24578 -119019 -91366 -62671 188650 113499 -83118 -18261 -64619 122307
5584 157171 -53323 -155699 246469 269666 -108320 -126406 90433 -34948 -5921 39522 49044
5573 49044 -124548 -319971 -150373 -287396 -204283 62520 137705 -50745 187803 -98553 -103786
5562 -103786 82577 59687 -91981 294537 134224 -255393 -276597 39843 13965 16826 342210
5551 342210 81359 129610 160275 -71083 88693 4737 1936 -434525 95502 35358 -172854 -14982
5538 163444 638 293502 48738 -113058 217387 101236 -21234 281282 -142042 93539 -83402
5526 -239212 193308 216855 19648 -69499 130725 -236618 -60 -135501 -147508 -84380 -117939
5515 -117939 -19412 -127045 8944 34803 28398 2000 -267211 -82693 -104740 -125308 -112377 131528
5502 -7350 15777 -45718 -30718 126296 1553 56555 -73233 102177 100620 -159383 4498 -46886
5489 -80452 155101 105125 -62106 85783 -77284 10769 33606 7584 78943 20113 105106 -78457
5476 -85469 41229 178294 -198310 110694 -73808 -229731 -204007 155696 -8683 -137730 -199730
5465 -199730 130749 -55676 -65010 67369 -47135 135753 52276 151270 -180270 -215614 173602
5453 -95898 66740 52662 140264 83463 298242 736 156651 -81785 -79887 90533 242263 -143296
5440 156853 84562 -376497 -120158 196940 -424287 384366 -94378 59314 514 212308 30595
5428 -201153 -47184 -82826 -11456 -4939 -32340 -273964 260858 -37164 -84670 -8000 215254
5416 -81229 55365 -22987 111823 212312 15936 -115016 -24488 226866 -57476 -95106 -187219
5405 -187219 -83858 -143602 -36155 168020 -203578 -207194 42069 -207365 -244342 -11773 224911
5393 2680 237194 -261282 92172 150999 -133860 228669 -12898 -85296 -110470 -139401 -200987
5382 -200987 340671 -329876 -61701 -49448 39329 -100751 441716 115562 -262881 56582
5371 -13233 150969 -26036 299540 39604 94699 354090 -333678 97634 -103620 -33934 426758
5359 123223 -47787 60357 -19340 95568 -162189 35567 356484 -371452 1937 -49553 139518
5347 -188448 -155586 165849 232632 115785 79316 200246 -9001 57033 87360 161163 11437
5335 33319 -72953 148446 -115231 1415 -272779 53580 210222 -281981 -34645 -62906 91971
5323 107852 242668 -82147 -367589 110787 66927 -399548 38962 -6041 37655 61707 57386
5312 57386 247091 -16949 5048 47780 3110 180399 -8823 -494028 332375 -37099 -384798
5301 -384798 173506 302250 -59437 202120 18043 -90819 101538 -108142 33987 119064 184631
5290 184631 241150 -85372 -100098 88065 121002 80528 -194988 -26211 467 -244445 244122
5278 79189 515763 -7098 -83355 45668 -146222 97861 -145396 230100 5903 214156 -103562
5266 180046 256481 61677 -157062 -288537 -52714 56780 286116 -2700 -161633 131829 -154641
5254 190320 -12743 65691 -97885 -119579 -973 112864 -229631 108643 -97401 116564 -86511
5242 107270 70085 -180774 125051 132541 3616 -19324 -122331 -205749 9182 -251652 -58732
5230 61296 -104473 69228 188354 -84090 -128815 -80616 37129 -250619 36996 -147534 410419
5218 -13216 -85307 238518 -35210 -258904 -56885 184470 -6207 -23897 5026 44910 111327 -344996
5205 -124772 -157079 80420 69062 204848 5991 -119512 -196465 144161 -252627 110217 54620
5193 219710 44775 15758 209209 67316 -149664 17872 -140806 38257 -146295 334515 207077
5182 207077 -269364 -29504 -398078 -35941 121303 250041 -3356 99088 17746 -33900 -4910
5170 103307 249872 41386 127866 -192446 -76930 -1079 148721 168250 78605 -102127 -97655
5159 -97655 275703 269990 -46956 -82329 -176602 33391 295331 -252824 -117811 -18650 98670
5147 44835 -159385 373599 -98242 88585 158381 -158821 -160190 191650 195967 55436 105876
5136 105876 -28867 252771 124681 -309634 -157631 108242 -40626 -61613 -133375 -224573 115830
5124 -89971 -12864 -226702 -81006 -92508 224140 -84681 -35096 155094 73284 -137283 -136120
5113 -136120 126891 219202 -239148 -165556 -169083 314859 313137 203630 -152691 -364869 -330472
5102 -330472 -60811 -58027 -16999 69406 116402 -40694 40371 119991 290898 391002 -273132
5090 43826 273778 -152928 -8211 -185585 156429 178922 184765 102303 64491 -314289 -90680
5078 61388 46701 205187 328117 -187478 115482 38808 51098 -73920 -75006 370618 53727
5066 104619 244537 235506 133861 248380 159938 -106114 233923 -157159 15834 -216060
5055 -11092 -248457 136183 -77916 306374 150368 37241 25047 66287 -45618 95626 194279
5044 194279 -27794 231521 -130643 -91655 39812 119974 -341843 46014 -248615 -106363 348963
5032 275117 160590 212218 -142101 -266577 297747 -176939 55608 82940 -212003 318155
5021 53752 98776 -189078 -14580 -18048 196210 -74088 44707 71389 316308 -18875 -110606
5010 -110606 315595 -27141 104925 148961 -27037 209704 -73496 -108451 79274 -197713 99289
4998 -156024 245563 3340 46822 204758 359593 316278 205590 -82852 -141403 89504 -248422
4986 -28412 62488 -235656 -5236 -118784 70860 122680 -145628 144332 74023 41223 11830
4974 -206513 -83415 52865 -29753 6509 12538 51278 57225 -107104 -179808 56449 24824 -17986
4961 175609 -121503 101542 -80552 -142682 -177533 21751 131991 35327 -1987 -28706 -112236
4950 -112236 115920 -52919 -114230 -196251 309626 338852 -164739 39174 6923 54251 149899
4939 149899 -6789 211732 -61226 314213 -39265 38143 96948 41022 113413 -209263 -32784
4927 17731 -157528 -342456 -295343 -156397 221426 29137 268673 90578 29838 75416 -70767
4915 130469 115732 232336 131921 -129380 -365327 149186 236131 -15288 162430 -416725
4904 363268 156241 109406 143835 112190 -114034 156376 116379 -16058 -448656 -90824 84950
4892 -33550 -147466 -296296 -295886 -149484 -4830 -61950 -29580 215889 -104496 80527 335512
4881 335512 176403 -240849 212958 -289372 -220194 -57901 158309 204645 43175 89780 61513
4870 61513 -35587 -252292 17476 -9506 51522 -408939 195384 113785 -133730 223868 31764
4858 71486 -55067 41456 161195 -74739 224192 119848 -4415 153846 -163909 9521 -74911
4846 61401 176542 49241 -71166 -267489 -170111 -36342 201201 -245 -15150 -108488 -49833 -186337
4834 -186337 6635 129701 -202705 -29731 125942 -47980 142723 206026 -13191 -70509 180529
4822 38336 -56823 -171398 -24682 -43050 8215 -153108 -87477 -160343 127140 -44848 16761
4810 -3150 -76243 49560 122509 -313247 -47779 -255359 135472 -287965 384802 -8042 17680
4798 16406 -16325 540178 -59074 5422 182529 -136235 9799 -41271 18161 -31257 -61620 216840
4785 50704 24210 33408 -259852 62307 -85539 -243337 -59379 303209 185705 -46457 -30526
4774 -30526 154884 5938 -9064 -98891 -291502 -74458 -1472 -226296 17524 186203 38207 -42886
4761 34796 220125 264624 117740 23182 -230486 196422 -122325 513215 44559 -233128
4750 -17289 -152188 -119143 -209279 35367 -19161 158676 70062 36799 -274590 -50686 -125431
4739 -125431 107585 211789 328302 330074 146198 -166499 -41349 257260 26050 -328189
4728 -68963 -74137 219962 -75375 9881 -139843 126295 -20640 283735 -65570 -61573 139907
4716 166817 97040 70110 -166231 -344496 89774 -281635 4439 193285 3293 -22402 -68238
4705 -68238 41682 170945 -65945 163257 156817 273407 -63681 147863 75265 316387 116094
4693 361911 -79304 -97182 158481 -45716 -162651 -30776 69668 -133103 85590 128237 -48753
4681 100839 4211 3748 -133285 -31802 227497 175255 96083 195862 4552 -89366 -24623 -120267
4669 -120267 -126309 276083 35666 137366 146071 -46879 -62326 -371972 44597 160190 163629
4658 163629 -26453 77028 239362 -114516 26948 -85383 -378314 -153639 -63496 -125573 261723
4646 -206649 377948 157079 6404 128965 -49078 -137019 120741 302143 -126912 -239801
4636 -239801 -5155 119933 149036 -180149 -153117 224215 77509 -14394 -116087 -49117 280709
4624 159829 47777 -93400 -58979 -194946 -42456 15153 92695 12140 271798 5365 -25834
4612 50529 -10526 379018 152383 -164596 -28091 209298 31847 71630 -100084 167803 341049
4601 341049 41358 -38863 -22621 -296015 7710 256711 -136865 116952 -164400 -85996 154187
4589 17920 -120476 -189738 41461 206947 23593 198393 203442 157270 -14282 199620 283514
4578 283514 109714 47160 -17946 -114810 -19211 -9686 155093 36715 40288 32879 137394 -212254
4565 228812 -18746 136127 10582 84379 -113656 302928 35017 173826 32147 35702 271416
4554 271416 -248714 11652 -91006 135896 191135 -41633 -99734 92506 289491 -210 -70806
4543 -70806 141306 233189 -6489 -155436 -50878 -11336 83718 -100960 -81677 -43916 28047
4531 -58727 -14419 18872 -63973 182169 101247 99788 128726 83105 -93113 -61704 30711 42152
4519 42152 4190 -92371 29014 -193919 -41185 115191 -58758 39607 203713 52521 -93602
4507 -1691 -256306 22434 270781 -99967 -65871 73756 -137922 -80795 -47582 185611 223244
4496 223244 -131012 -161082 -26279 -241809 87014 242158 -83470 407598 272987 -149153
4485 29647 -44690 -100533 136098 145789 -155547 54062 -5692 442946 -30139 -189222 -103803
4474 -103803 -51261 4363 -74671 24220 -63340 -69959 -103662 286125 108038 -16530 11164 208119
4462 208119 344021 -327002 -124375 119846 190197 -217866 69480 -172660 63744 106685
$$ [...]
##END NTUPLES=NMR SPECTRUM
##END=
