##TITLE=AC1745_SEN00018_9280926_VILM59K7Pi
##JCAMPDX= 6.0         $$ Bruker NMR JCAMP-DX V2.0
##DATA TYPE= NMR SPECTRUM
##DATA CLASS= NTUPLES
##ORIGIN= BRUKER
##OWNER= Administrator
$$ 1.72 TOPSPIN		Version 2.1
$$ 2015-07-18 20:24:55.119 -0700  Administrator@X
$$ Compression mode = diff/dup
##.OBSERVE FREQUENCY= 400.02188249412
##.OBSERVE NUCLEUS= ^1H
##.ACQUISITION MODE= SIMULTANEOUS (DQD)
##.ACQUISITION SCHEME= undefined
##.AVERAGES= 64
##.DIGITISER RES= 22
##SPECTROMETER/DATA SYSTEM= spect
##.PULSE SEQUENCE= noesygpps1d.comp
##.SOLVENT NAME= COFFEE_meoh
##.SHIFT REFERENCE= INTERNAL, COFFEE_meoh, 1, 14.96081
##AUDIT TRAIL= $$ (NUMBER, WHEN, WHO, WHERE, PROCESS, VERSION, WHAT)
$$ ##TITLE= Audit trail, TOPSPIN		Version 2.1
$$ ##JCAMPDX= 5.01
$$ ##ORIGIN= Bruker BioSpin GmbH
$$ ##OWNER= Administrator
$$ $$ E:\/data/COFFEE/nmr/AC1745_SEN00018_9280926_VILM59K7Pi/22/pdata/1/auditp.txt
$$ ##AUDIT TRAIL=  $$ (NUMBER, WHEN, WHO, WHERE, PROCESS, VERSION, WHAT)
(   1,<2015-07-18 20:24:49.291 -0700>,<Administrator>,<X>,<go>,<TOPSPIN 2.1>,
      <created by zg
	started at 2015-07-18 20:13:19.760 -0700,
	POWCHK enabled, PULCHK disabled,
       configuration hash MD5:
       21 0F 79 D6 B3 7B B4 F6 88 20 88 DB 03 48 BD 9F
       data hash MD5: 64K
       14 A1 CE 03 4B EF D0 FB 5B 1F 54 3E A4 15 15 D0>)
(   2,<2015-07-18 20:24:52.994 -0700>,<Administrator>,<X>,<proc1d>,<TOPSPIN 2.1>,
      <Start of raw data processing
       efp LB = 0.3 FT_mod = 6 PKNL = 1 PHC0 = 0 PHC1 = 0 SI = 128K 
       data hash MD5: 128K
       BA EB 7B 92 C7 8C 81 50 0A 2A 8E 10 50 0A D8 08>)
(   3,<2015-07-18 20:24:53.900 -0700>,<Administrator>,<X>,<proc1d>,<TOPSPIN 2.1>,
      <pk PHC0 = 267.7094 PHC1 = 0 
       data hash MD5: 128K
       94 04 3A D5 08 35 15 55 59 2A E1 37 3D B5 F1 64>)
(   4,<2015-07-18 20:24:54.291 -0700>,<Administrator>,<X>,<proc1d>,<TOPSPIN 2.1>,
      <abs ABSG = 1 
       data hash MD5: 128K
       2C EF E1 F8 F2 7F 61 6A CB 37 94 44 F7 0A 2D C1>)
(   5,<2015-07-18 20:24:54.385 -0700>,<Administrator>,<X>,<proc1d>,<TOPSPIN 2.1>,
      <abs ABSG = 2 
       data hash MD5: 128K
       EB E7 75 15 79 08 35 86 BA C0 E0 1A CE 89 9E AB>)
(   6,<2015-07-18 20:24:54.463 -0700>,<Administrator>,<X>,<proc1d>,<TOPSPIN 2.1>,
      <abs ABSG = 3 
       data hash MD5: 128K
       DC 3E 7E 20 87 FA E5 CE 78 24 62 B9 13 6B A3 66>)
(   7,<2015-07-18 20:24:54.557 -0700>,<Administrator>,<X>,<proc1d>,<TOPSPIN 2.1>,
      <abs ABSG = 4 
       data hash MD5: 128K
       A9 D6 84 1B 49 A3 86 EF 79 9F 65 3D B2 CD 2F 5A>)
(   8,<2015-07-18 20:24:54.635 -0700>,<Administrator>,<X>,<proc1d>,<TOPSPIN 2.1>,
      <abs ABSG = 5 
       data hash MD5: 128K
       F1 2A 11 4D 11 6B 98 05 45 4C 72 23 5C 37 2A A6>)
$$ ##END=
$$ 
$$ $$ hash MD5
$$ $$ 0C E3 20 5E 45 D0 79 60 2B F4 D5 58 2D 48 79 69
##$RELAX= 
##$RELAX= 
##$RELAX= 
##$RELAX= 
##$RELAX= 
##$RELAX= 
##$RELAX= 
##$RELAX= 
$$ Bruker specific parameters
$$ --------------------------
##$DU= <E:\>
##$EXPNO= 22
$$ [...]
150 150 150 150 150 150 150 150
##$TP07= 0
##$TPNAME0= <>
##$TPNAME1= <>
##$TPNAME2= <>
##$TPNAME3= <>
##$TPNAME4= <>
##$TPNAME5= <>
##$TPNAME6= <>
##$TPNAME7= <>
##$TPOAL= (0..7)
0.5 0.5 0.5 0.5 0.5 0.5 0.5 0.5
##$TPOFFS= (0..7)
0 0 0 0 0 0 0 0
##$TUNHIN= 0
##$TUNHOUT= 0
##$TUNXOUT= 0
##$USERA1= <user>
##$USERA2= <user>
##$USERA3= <user>
##$USERA4= <user>
##$USERA5= <user>
##$V9= 5
##$VALIST= <valist>
##$VCLIST= <CCCCCCCCCCCCCCC>
##$VD= 0
##$VDLIST= <DDDDDDDDDDDDDDD>
##$VPLIST= <PPPPPPPPPPPPPPP>
##$VTLIST= <TTTTTTTTTTTTTTT>
##$WBST= 2048
##$WBSW= 25
##$XGAIN= (0..3)
0 0 0 0
##$XL= 0
##$YL= 0
##$YMAX_a= 5890819
##$YMIN_a= -10508778
##$ZGOPTNS= <>
##$ZL1= 120
##$ZL2= 120
##$ZL3= 120
##$ZL4= 120
##$ABSF1= 14.96081
##$ABSF2= -5.597372
##$ABSG= 5
##$ABSL= 3
##$ALPHA= 0
##$AQORDER= 0
##$ASSFAC= 0
##$ASSFACI= 0
##$ASSFACX= 0
##$ASSWID= 0
##$AUNMP= <proc_prof1d_extract.lims>
##$AXLEFT= 0
##$AXNAME= <>
##$AXNUC= <1H>
##$AXRIGHT= 0
##$AXTYPE= 0
##$AXUNIT= <>
##$AZFE= 0.1
##$AZFW= 0.1
##$BCFW= 0
##$BC_mod= 0
##$BYTORDP= 0
##$COROFFS= 0
##$CY= 15
##$DATMOD= 1
##$DC= 0
##$DFILT= <>
##$DTYPP= 0
##$F1P= 0
##$F2P= 0
##$FCOR= 0.5
##$FTSIZE= 131072
##$FT_mod= 6
##$GAMMA= 0
##$GB= 0
##$INTBC= 1
##$INTSCL= 1
##$ISEN= 128
##$LB= 0.3
##$LEV0= 0
##$LPBIN= 0
##$MAXI= 10000
##$MC2= 0
##$MEAN= 0
##$ME_mod= 0
##$MI= 0
##$NCOEF= 0
##$NC_proc= -2
##$NLEV= 6
##$NOISF1= 0
##$NOISF2= 0
##$NSP= 0
##$NTH_PI= 0
##$NZP= 0
##$OFFSET= 14.96081
##$PC= 1
##$PHC0= 267.7094
##$PHC1= 0
##$PH_mod= 1
##$PKNL= yes
##$PPARMOD= 0
##$PPDIAG= 0
##$PPIPTYP= 0
##$PPMPNUM= 2147483647
##$PPRESOL= 1
##$PSCAL= 4
##$PSIGN= 0
##$PYNMP= <proc.py>
##$REVERSE= no
##$SF= 400.02000971222
##$SI= 131072
##$SIGF1= 0
##$SIGF2= 0
##$SINO= 400
##$SIOLD= 131072
##$SPECTYP= <>
##$SREGLST= <1H.CDCl3>
##$SSB= 0
##$STSI= 131072
##$STSR= 0
##$SW_p= 8223.68421052631
##$SYMM= 0
##$S_DEV= 0
##$TDeff= 65536
##$TDoff= 0
##$TI= <>
##$TILT= no
##$TM1= 0
##$TM2= 0
##$TOPLEV= 0
##$USERP1= <user>
##$USERP2= <user>
##$USERP3= <user>
##$USERP4= <user>
##$USERP5= <user>
##$WDW= 1
##$XDIM= 131072
##$YMAX_p= 421117010
##$YMIN_p= -13255
##$CURPLOT= <Network HP LaserJet P1505>
##$CURPRIN= <$Network HP LaserJet P1505>
##$DFORMAT= <normdp>
##$LAYOUT= <+/1D_H.xwp>
##$LFORMAT= <normlp>
##$PFORMAT= <normpl>
##$SURQMSG= 1
$$ End of Bruker specific parameters
$$ ---------------------------------
##NTUPLES= NMR SPECTRUM
##VAR_NAME=  FREQUENCY,     SPECTRUM/REAL,   SPECTRUM/IMAG
##SYMBOL=    X,             R,               I
##VAR_TYPE=  INDEPENDENT,   DEPENDENT,       DEPENDENT
##VAR_FORM=  AFFN,          ASDF,            ASDF
##VAR_DIM=   131072,        131072,          131072
##UNITS=     HZ,            ARBITRARY UNITS, ARBITRARY UNITS
##FACTOR=    0.0627417313425164, 1,          1
##FIRST=     8223.62146879497, -3145,        -48648
##LAST=      0,             -1117,           -49877
##MIN=       0,             -13255,          0
##MAX=       8223.62146879497, 421117010,    0
$$ Real data points
##PAGE= N=1
##DATA TABLE= (X++(R..R)), XYDATA
$$ [...]
$$ plain form
63956 628518 657812 690858 728179 770440 818832 874789 939456 1013847 1099418 1198080 1311474
63945 1311474 1440531 1585798 1747877 1927165 2123225 2334609 2559288 2795038 3039385
63936 3039385 3289320 3541164 3790434 4031545 4257780 4462149 4638842 4784047 4895458
63927 4895458 4971333 5010264 5011491 4974872 4900570 4789415 4643880 4468399 4268471 4049674
63917 4049674 3817609 3578109 3336638 3097366 2863206 2636819 2421219 2219283 2033018
63908 2033018 1863415 1710635 1574009 1452137 1343469 1246961 1162039 1087995 1023627 967539
63898 967539 918558 875814 838585 806185 777814 752369 728585 705622 683439 662381 642456
63887 642456 623291 604758 587300 571478 557481 545196 534498 525315 517640 511725 507951 506248
$$ packed form
63956F28518K9294L3046L7321M2261M8392N5957O4667P4391Q5571R8662J13394
63945A311474J29057J45267J62079J79288J96060K11384K24679K35750K44347
63936C039385K49935K51844K49270K41111K26235K04369J76693J45205J11411
63927D895458P5875L8931J227l6619p4302j11155j45535j75481j99928k18797
63917D049674k32065k39500k41471k39272k34160k26387k15600k01936j86265
63908B033018j69603j52780j36626j21872j08668r6508q4922p4044o4368n6088
63898I67539m8981m2744l7229l2400k8371k5445k3784k2963k2183k1058j9925
63887F42456j9165j8533j7458j5822j3997j2285j0698r183p675n915l774j703
$$ plain form
63875 506248 505906 506391 508179 512318 519276 528679 540153 553770 569490 586657 604452 622546 640976
63862 640976 659636 678174 696240 713514 729626 744321 757553 769167 778632 785383 789315 790653
63850 790653 789477 785750 779741 771936 762390 750584 736141 719406 701063 681384 660130 637147
63838 637147 612865 588245 564301 541490 519434 497400 475266 453900 434347 416814 400682
63827 400682 385430 371104 357894 345726 334509 324428 315578 307513 299538 291463 283768 276949 270940
63814 270940 265290 259807 254849 250946 248159 245899 243521 241024 238941 237486 236144 234376 232385 230790
63800 230790 229687 228581 227261 226168 225682 225426 224660 223127 221205 219339 217597 215770 213677 211309 208769
63785 208769 206162 203629 201519 200290 200015 200086 199763 198981 198265 197920 197779 197841 198510 199827 201020 201324 200965
$$ packed form
63875E06248l42M85J788M139O958R403J1474J3617J5720J7167J7795J8094J8430
63862F40976J8660J8538J8066J7274J6112J4695J3232J1614R465O751L932J338
63850G90653j176l727o009p805r546j1806j4443j6735j8343j9679k1254k2983
63838F37147k4282k4620k3944k2811k2056k2034k2134k1366j9553j7533j6132
63827D00682j5252j4326j3210j2168j1217j0081q850q065p975q075p695o819o009
63814B70940n650n483m958l903k787k260k378k497k083j455j342j768j991j595
63800B30790j103j106j320j093m86k56p66j533j922j866j742j827k093k368k540
63785B08769k607k533k110j229k75P1l23p82p16l45j41O2O69J317J193L04l59
$$ plain form
63768 200965 200778 201083 201468 201580 201538 201462 201111 200234 199053 198170 198045 198589 199204 199298 198842 198347 198254 198587 199299 200541
63748 200541 202248 203764 204379 204119 203617 203342 203400 203920 205108 206875 208898 210990 213006 214527 215287 215954
63732 215954 217737 220917 224372 226912 228544 230036 231782 233714 235964 238931 242715 246959 251301 255611
63718 255611 259814 263804 267530 270901 273592 275249 275869 275719 274833 272924 269939 266474 263409 261181 259569
63703 259569 258071 256376 254494 252631 251044 249925 249296 249008 248993 249504 250950 253415 256480 259670 262944
63688 262944 266550 270453 274125 276939 278691 279706 280494 281285 281843 281847 281494 281469 282134 282976 283196 282759 282523 283359
63670 283359 285440 288311 291255 293624 295234 296605 298515 301120 303704 305289 305217 303212 299400 294472 289441
63655 289441 284922 280858 277015 273407 270082 266921 263944 261440 259451 257487 255177 252928 251470 250924
$$ packed form
63768B00965j87L05L85J12m2p6l51q77j181q83j25N44O15R4m56m95r3L33P12J242
63748B00541J707J516O15k60n02k75N8N20J188J767K023K092K016J521P60O67
63732B15954J783L180L455K540J632J492J746J932K250K967L784M244M342M310
63718B55611M203L990L726L371K691J657O20j50q86j909k985l465l065k228j612
63703B59569j498j695j882j863j587j119o29k88j5N11J446K465L065L190L274
63688B62944L606L903L672K814J752J015P88P91N58Ml53k5O65Q42K20m37k36Q36
63670B83359K081K871K944K369J610J371J910K605K584J585p2k005l812m928n031
63655B89441m519m064l843l608l325l161k977k504j989j964k310k249j458n46
$$ plain form
63641 250924 250823 250958 251680 253344 255827 258701 261554 264108 266361 268743 271848 275878 280546 285590 291086
63626 291086 297063 303064 308471 313345 318747 326053 335943 348071 361663 376262 391845 408419 425847
63613 425847 444128 463556 484404 506612 529985 554620 580945 609342 639742 671341 702462
63602 702462 730796 754187 771390 782128 786694 785790 780682 773065 764478 755833 747448 739248 730844
63589 730844 721634 711068 698743 684156 666660 646025 623056 599324 576108 553716 531944 510980
63577 510980 491613 474573 459963 447415 436610 427518 420275 414997 411676 410155 410202 411691 414653
63564 414653 419100 424917 432000 440358 449898 460151 470465 480495 490433 500772 512032 524700 539293
63551 539293 556334 576288 599485 626121 656366 690440 728274 768829 809717 847635 879261
$$ packed form
63641B50924j01J35P22J664K483K874K853K554K253K382L105M030M668N044N496
63626B91086N977O001N407M874N402P306R890J2128J3592J4599J5583J6574J7428
63613D25847J8281J9428K0848K2208K3373K4635K6325K8397L0400L1599L1121
63602G02462K8334K3391J7203J0738M566r04n108p617q587q645q385q200q404
63589G30844r210j0566j2325j4587j7496k0635k2969k3732k3216k2392k1772k0964
63577E10980j9367j7040j4610j2548j0805r092p243n278l321j521M7J489K962
63564D14653M447N817P083Q358R540J0253J0314J0030R938J0339J1260J2668J4593
63551E39293J7041J9954K3197K6636L0245L4074L7834M0555M0888L7918L1626
$$ plain form
63540 879261 902003 914575 917415 912512 902460 889570 875825 863109 852711 844570 837559 830626
63528 830626 823260 814850 804171 789838 771021 747572 719887 688944 656225 623269 591336 561385
63516 561385 533931 508776 485309 463337 443317 425555 409597 394739 380804 368053 356633
63505 356633 346558 337984 330993 325250 320295 316059 312607 309497 305994 302082 298725 296763 295856 294919
63491 294919 293464 292073 291493 291636 291851 292009 292844 295006 298188 301578 304882 308333 311796 314633 316718
63476 316718 318973 322355 326628 330613 333401 334917 335474 335286 334455 333039 331021 328393 325267 321745 317800
63461 317800 313545 309547 306543 304763 303742 302864 301967 301373 301510 302546 304338 306692 309701 313768 319220
63446 319220 325917 333281 340751 348292 356492 366027 376954 388714 401045 414619 430483 449112 470522
$$ packed form
63540H79261K2742J2572K840m903j0052j2890j3745j2716j0398q141p011o933
63528H30626p366q410j0679j4333j8817k3449k7685l0943l2719l2956l1933k9951
63516E61385k7454k5155k3467k1972k0020j7762j5958j4858j3935j2751j1420
63505C56633j0075q574o991n743m955m236l452l110l503l912l357j962r07r37
63491B94919j455j391n80J43K15J58Q35K162L182L390L304L451L463K837K085
63476C16718K255L382M273L985K788J516N57j88q31j416k018k628l126l522l945
63461C17800m255l998l004j780j021q78q97n94J37J036J792K354L009M067N452
63446C19220O697P364P470P541Q200R535J0927J1760J2331J3574J5864J8629K1410
$$ plain form
63433 470522 494928 522273 550891 577533 599350 615495 626657 633916 638673 642896 648362 655829
63421 655829 665591 678484 695546 716910 741967 770547 803025 839019 876641 913247 946339 973722
63409 973722 993651 1005487 1009952 1008430 1002244 992711 981341 969504 957904 946529 934859 922016
63397 922016 906966 888920 867543 842818 814947 784458 752226 719259 686507 654777 624637
63386 624637 596398 570334 546801 525950 507507 491197 477230 465992 457296 450427 444952 441055
63374 441055 439059 439064 441176 445599 452256 460719 470729 482438 495862 510429 525445 540880 557493
63361 557493 576282 597984 622915 651063 682218 715994 751694 788300 824847 860708 895163
63350 895163 926682 953047 972361 983777 987371 983915 975075 963346 951133 939694 928982 918338
$$ packed form
63433D70522K4406K7345K8618K6642K1817J6145J1162P259M757M223N466P467
63421F55829R762J2893J7062K1364K5057K8580L2478L5994L7622L6606L3092K7383
63409I73722J9929J1836M465j522o186r533j1370j1837j1600j1375j1670j2843
63397I22016j5050j8046k1377k4725k7871l0489l2232l2967l2752l1730l0140
63386F24637k8239k6064k3533k0851j8443j6310j3967j1238q696o869n475l897
63374D41055j996NK112M423O657Q463J0010J1709J3424J4567J5016J5435J6613
63361E57493J8789K1702K4931K8148L1155L3776L5700L6606L6547L5861L4455
63350H95163L1519K6365J9314J1416L594l456q840j1729j2213j1439j0712j0644
$$ plain form
63338 918338 907135 894874 880934 864442 844593 821202 794891 766581 736977 706720 676783
63327 676783 648247 621736 597481 575903 557681 543254 532743 526338 523957 524206 524262 521381 514293
63314 514293 503059 488199 470576 451678 433194 416192 401038 387929 377016 367973 359965 352275
63302 352275 344821 338035 332415 328212 325314 323301 321602 319624 316846 313062 308655 304416 300907 298047
63288 298047 295403 292620 289468 285787 281766 278144 275728 274576 273892 272820 271250 269827 269231 269502 270093
63273 270093 270551 270966 271617 272349 272676 272509 272346 272629 273307 274295 275981 278844 282726 286815 290305 292867 294600
63256 294600 295862 297125 298808 301217 304633 309218 314700 320466 326295 332773 340530 349216 357736 365579
63242 365579 373482 382574 393195 404836 417065 430198 445037 462126 481359 502212 524182 546949
$$ packed form
63338I18338j1203j2261j3940j6492j9849k3391k6311k8310k9604l0257k9937
63327F76783k8536k6511k4255k1578j8222j4427j0511o405k381K49N6k881p088
63314E14293j1234j4860j7623j8898j8484j7002j5154j3109j0913r043q008p690
63302C52275p454o786n620m203k898k013j699j978k778l784m407m239l509k860
63288B98047k644k783l152l681m021l622k416j152o84j072j570j423n96K71N91
63273B70093M58M15O51P32L27j67j63K83O78R88J686K863L882M089L490K562J733
63256B94600J262J263J683K409L416M585N482N766N829O478P757Q686Q520P843
63242C65579P903R092J0621J1641J2229J3133J4839J7089J9233K0853K1970K2767
$$ plain form
63230 546949 570300 594172 618738 644093 669677 694276 716873 737514 757198 777067 797829
63219 797829 819708 842517 865728 888706 911018 932432 952626 971032 986898 999393 1007636 1010799
63207 1010799 1008228 999498 984537 963890 938819 910882 881312 850870 820213 790146 761493 734892
63195 734892 710848 689875 672417 658619 648268 641008 636646 635256 636944 641513 648467 657418 668393
63182 668393 681614 696981 713931 731798 750175 768886 787770 806644 825387 843888 861878
63171 861878 879002 895169 910651 925564 939273 950521 958239 962060 961956 957645 948656 934877 916819
63158 916819 895234 870550 842722 811682 778134 743886 711056 680747 652689 626339 601922
63147 601922 579976 560350 542419 526238 512611 501766 492654 484052 475896 468949 463456 458785 454404
$$ packed form
63230E46949K3351K3872K4566K5355K5584K4599K2597K0641J9684J9869K0762
63219G97829K1879K2809K3211K2978K2312K1414K0194J8406J5866J2495Q243L163
63207A010799k571q730j4961k0647k5071k7937k9570l0442l0657l0067k8653k6601
63195G34892k4044k0973j7458j3798j0351p260m362j390J688M569O954Q951J0975
63182F68393J3221J5367J6950J7867J8377J8711J8884J8874J8743J8501J7990
63171H61878J7124J6167J5482J4913J3709J1248P718L821j04m311q989j3779j8058
63158I16819k1585k4684k7828l1040l3548l4248l2830l0309k8058k6350k4417
63147F01922k1946j9626j7931j6181j3627j0845r112q602q156o947n493m671m381
$$ plain form
63134 454404 450560 447711 445639 443608 441407 439867 440038 442016 444882 447806 450783 454142 457825 461601
63120 461601 465613 470148 474946 479335 483020 486188 488816 490517 491324 492042 493422 495347 497153 498535 499780
63105 499780 501286 503057 504622 505422 505455 505485 506323 507949 509699 511213 512614 513812 514374 514287 514125 514170 514032
63088 514032 513578 513500 514352 515615 516401 516695 517247 518579 520768 523867 527778 531931 535867 540059 545469 552268
63072 552268 559615 566775 573851 581356 589603 598740 609008 620717 634108 649245 665890 683621 702350
63059 702350 722577 744893 769510 796635 826941 861128 899135 940396 984709 1032292 1083021
63048 1083021 1136266 1191497 1248446 1306524 1364629 1421805 1477767 1532713 1586970 1640889 1694739
63037 1694739 1748670 1803010 1858410 1915129 1972200 2027787 2080335 2128799 2171805 2207269 2233089
$$ packed form
63134D54404l844k849k072k031k201j540J71J978K866K924K977L359L683L776
63120D61601M012M535M798M389L685L168K628J701Q07P18J380J925J806J382J245
63105D99780J506J771J565Q00L3L0Q38J626J750J514J401J198N62q7j62M5j38
63088E14032m54p8Q52J263P86K94N52J332K189L099L911M153L936M192N410O799
63072E52268P347P160P076P505Q247R137J0268J1709J3391J5137J6645J7731J8729
63059G02350K0227K2316K4617K7125L0306L4187L8007M1261M4313M7583N0729
63048A083021N3245N5231N6949N8078N8105N7176N5962N4946N4257N3919N3850
63037A694739N3931N4340N5400N6719N7071N5587N2548M8464M3006L5464K5820
$$ plain form
63026 2233089 2247726 2250066 2239423 2215945 2180508 2133964 2077050 2011206 1938878 1862687 1784892
63015 1784892 1707899 1634471 1566665 1504997 1449260 1399814 1357488 1322633 1295091 1274980 1262713
63004 1262713 1258106 1260053 1267332 1279388 1296204 1317707 1343400 1372327 1403252 1435071 1467184 1499454
62992 1499454 1531870 1564310 1596506 1628028 1658383 1687326 1714936 1741090 1764844 1784600 1798888
62981 1798888 1806758 1807394 1799759 1782923 1756678 1721645 1678830 1629254 1574034 1514610 1452669 1389809
62969 1389809 1327277 1265990 1206692 1150081 1096884 1047814 1003287 963108 926617 893249 862804
62958 862804 835090 809576 785703 763369 742704 723434 704900 686791 669465 653277 637851
62947 637851 622300 606120 589708 574055 560050 548032 537758 528596 519705 510270 499996 489533
$$ packed form
63026B233089J4637K340j0643k3478l5437m6544n6914o5844p2328p6191p7795
63015A784892p6993p3428o7806o1668n5737m9446m2326l4855k7542k0111j2267
63004A262713m607J947P279J2056J6816K1503K5693K8927L0925L1819L2113L2270
62992A499454L2416L2440L2196L1522L0355K8943K7610K6154K3754J9756J4288
62981A798888P870O36p635j6836k6245l5033m2815m9576n5220n9424o1941o2860
62969A389809o2532o1287n9298n6611n3197m9070m4527m0179l6491l3368l0445
62958H62804k7714k5514k3873k2334k0665j9270j8534j8109j7326j6188j5426
62947F37851j5551j6180j6412j5653j4005j2018j0274r162q891r435j0274j0463
$$ plain form
62935 489533 480114 472439 466047 460044 454252 449273 445535 442719 440206 437685 435230 433098 431560 430677
62921 430677 430104 429339 428238 427071 426066 425199 424412 423678 422787 421430 419647 417846 416254 414630 412689 410451
62905 410451 408028 405445 402900 400834 399401 398149 396585 394821 393342 392293 391365 390327 389367 388870 389069
62890 389069 389822 390624 390871 390305 389176 387871 386561 385271 384145 383432 383248 383503 383986 384483 384919 385504 386555
62873 386555 388082 389688 390979 391908 392584 392893 392531 391359 389606 387738 386179 385129 384598 384616 385263 386392
62857 386392 387512 388247 388848 389913 391637 393683 395720 397648 399270 400316 400924 401652 402808 404209 405710
62842 405710 407418 409174 410461 411179 411871 412616 412380 410219 406794 403875 402501 402317 402562 402962 403603 404615
62826 404615 406126 408053 409900 411206 412245 413728 415814 417959 419831 421805 424400 427773 431909 436724
$$ packed form
62935D89533r419p675o392o003n792m979l738k816k513k521k455k132j538q83
62921D30677n73p65j101j167j005q67p87p34q91j357j783j801j592j624j941k238
62905D10451k423k583k545k066j433j252j564j764j479j049r28j038r60m97J99
62890C89069P53Q02K47n66j129j305j310j290j126p13j84K55M83M97M36N85J051
62873C86555J527J606J291R29O76L09l62j172j753j868j559j050n31J8O47J129
62857C86392J120P35O01J065J724K046K037J928J622J046O08P28J156J401J501
62842D05710J708J756J287P18O92P45k36k161l425k919j374j84K45M00O41J012
62826D04615J511J927J847J306J039J483K086K145J872J974K595L373M136M815
$$ plain form
62812 436724 441687 445907 449077 451939 455429 459702 464423 469604 475574 482298 489349 496528 504073 512199
62798 512199 520904 530334 540863 552571 564998 577839 591680 607668 626487 648032 672167 699396
62786 699396 730535 765984 805703 849830 898902 953453 1013742 1080008 1152626 1231653 1316369
62775 1316369 1405443 1497358 1590423 1682630 1771897 1856377 1934157 2002742 2059344 2101843 2129169
62764 2129169 2140709 2135842 2114434 2077537 2027212 1965723 1895081 1817145 1733791 1646997 1559010
62753 1559010 1472260 1388638 1308708 1231992 1158285 1088454 1023679 964241 909527 859117 813299
62742 813299 772397 736037 703413 673918 647239 623127 601557 582839 566988 553066 539813
62731 539813 527116 516235 508206 502447 497420 492382 487977 485223 484386 484863 485762 486537 487371 489098 492548
$$ packed form
62812D36724M963M220L170K862L490M273M721N181N970O724P051P179P545Q126
62798E12199Q705R430J0529J1708J2427J2841J3841J5988J8819K1545K4135K7229
62786F99396L1139L5449L9719M4127M9072N4551O0289O6266P2618P9027Q4716
62775A316369Q9074R1915R3065R2207Q9267Q4480P7780O8585N6602M2499K7326
62764B129169J1540m867k1408l6897n0325o1489p0642p7936q3354q6794q7987
62753A559010q6750q3622p9930p6716p3707o9831o4775n9438n4714n0410m5818
62742H13299m0902l6360l2624k9495k6679k4112k1570j8718j5851j3922j3253
62731E39813j2697j0881q029n759n027n038m405k754q37M77Q99P75Q34J727L450
$$ plain form
62716 492548 497782 504085 510790 518060 526817 538004 551916 568206 586480 606933 630351 657435
62704 657435 688197 722096 758788 798662 842640 891497 945283 1003354 1064967 1129900 1198401
62693 1198401 1270429 1344899 1419644 1492036 1559671 1620685 1673643 1717250 1750173 1771071 1778686
62682 1778686 1772030 1750907 1716583 1671625 1618513 1558393 1491651 1419647 1345199 1271099 1198766
62671 1198766 1128694 1061538 998100 938705 883427 832762 787340 746950 710540 677330 647384
62660 647384 620899 597489 576447 557350 540057 524408 510128 496888 484305 472141 460595
62649 460595 450119 440776 432087 423750 416221 410256 406005 402855 400047 397185 394250 391473 389258 387978
62635 387978 387698 388126 388857 389578 390059 390107 389595 388487 386814 384703 382517 380910 380592 381829 384140 386589
$$ packed form
62716D92548N234O303O705P270Q757J1187J3912J6290J8274K0453K3418K7084
62704F57435L0762L3899L6692L9874M3978M8857N3786N8071O1613O4933O8501
62693A198401P2028P4470P4745P2392O7635O1014N2958M3607L2923K0898P615
62682A778686o656k1123l4324m4958n3112o0120o6742p2004p4448p4100p2333
62671A198766p0072o7156o3438n9395n5278n0665m5422m0390l6410l3210k9946
62660F47384k6485k3410k1042j9097j7293j5649j4280j3240j2583j2164j1546
62649D60595j0476r343q689q337p529n965m251l150k808k862k935k777k215j280
62635C87978k80M28P31P21M81M8n12j108j673k111k186j607l18J237K311K449
$$ plain form
62619 386589 388567 390343 392816 396693 401963 408117 414710 421569 428541 435330 441715 447843 454136 460994
62605 460994 468778 478018 489291 502767 518163 535403 555070 577869 603779 632208 662908 696303
62593 696303 732847 772496 814869 859404 905038 950187 993451 1034108 1071529 1104286 1130228
62582 1130228 1147413 1154876 1152788 1142202 1124452 1100398 1070325 1034795 995359 954058 912323 870697
62570 870697 829470 789142 750314 713571 679524 648597 620660 595155 571655 550124 530653
62559 530653 513221 497748 484146 472274 461978 453153 445557 438680 432052 425645 419749 414592 410306
62546 410306 407146 405324 404604 404375 404148 403763 403270 402899 403084 404071 405518 406793 407664 408417 409362 410606 412248
62529 412248 414398 417014 420099 423997 429107 435442 442995 452406 464625 479873 497590 517478 539871
$$ packed form
62619C86589J978J776K473L877N270O154O593O859O972O789O385O128O293O858
62605D60994P784R240J1273J3476J5396J7240J9667K2799K5910K8429L0700L3395
62593F96303L6544L9649M2373M4535M5634M5149M3264M0657L7421L2757K5942
62582A130228J7185P463k088j0586j7750k4054l0073l5530l9436m1301m1735m1626
62570H70697m1227m0328l8828l6743l4047l0927k7937k5505k3500k1531j9471
62559E30653j7432j5473j3602j1872j0296q825p596o877o628o407n896n157m286
62546D10306l160j822p20k29k27l85m93l71J85R87J447J275Q71P53R45J244J642
62529D12248K150K616L085L898N110O335P553R411J2219J5248J7717J9888K2393
$$ plain form
62516 539871 564938 592298 621800 654003 689422 727858 768851 812167 857209 902403 945829
62505 945829 986190 1022722 1054566 1080843 1101038 1114761 1121392 1120669 1113434 1101191 1085082 1065966
62493 1065966 1045371 1025493 1007995 993365 981660 973405 969498 970705 977575 990509 1009489 1033819
62481 1033819 1062406 1094392 1129424 1167255 1206913 1246115 1281634 1310608 1331702 1345064 1351319
62470 1351319 1350660 1342576 1325982 1299750 1263670 1219101 1168471 1114005 1057140 999084 941437 885924
62458 885924 833664 784911 739487 697431 659299 625880 597556 573977 554425 538354 525395
62447 525395 515023 506601 499768 494463 490571 487931 486746 487475 490096 493821 497857 502107 506758 511437
62433 511437 515277 517791 519201 519781 519198 516759 512164 505823 498481 490638 482418 473881 465323 457136 449435
$$ packed form
62516E39871K5067K7360K9502L2203L5419L8436M0993M3316M5042M5194M3426
62505I45829M0361L6532L1844K6277K0195J3723O631p23p235j2243j6109j9116
62493A065966k0595j9878j7498j4630j1705q255l907J207O870J2934J8980K4330
62481A033819K8587L1986L5032L7831L9658L9202L5519K8974K1094J3362O255
62470A351319o59q084j6594k6232l6080m4569n0630n4466n6865n8056n7647n5513
62458H85924n2260m8753m5424m2056l8132l3419k8324k3579j9552j6071j2959
62447E25395j0372q422o833n305l892k640j185P29K621L725M036M250M651M679
62433E11437L840K514J410N80n83k439m595o341p342p843q220q537q558q187p701
$$ plain form
62418 449435 442051 434944 428428 422770 417726 412744 407592 402578 398164 394513 391400 388338 384826 380775
62404 380775 376761 373542 371168 368907 366317 364039 363078 363496 364417 365306 366528 368406 370356 371560 372118
62389 372118 372860 374160 375599 376890 378440 380718 383553 386530 389718 393537 398098 403213 408976 415778
62375 415778 423558 431506 438861 445758 453009 461233 470579 481165 493273 506919 521642 537151 554086
62362 554086 573767 597184 624479 655459 690218 729026 771851 818377 868370 921588 977168
62351 977168 1033312 1087784 1138598 1184120 1222702 1252668 1272954 1283773 1286496 1282753 1273564 1259219
62339 1259219 1239663 1214773 1184415 1148741 1108690 1065996 1022500 979576 938321 899854 864924
62328 864924 833368 804471 778006 754497 734323 716905 701044 685788 670732 655701 640536
$$ packed form
62418D49435p384p107o516n658n044m982n152n014m414l651l113l062l512m051
62404C80775m014l219k374k261k590k278r61M18R21Q89J222J878J950J204N58
62389C72118P42J300J439J291J550K278K835K977L188L819M561N115N763O802
62375D15778P780P948P355O897P251Q224R346J0586J2108J3646J4723J5509J6935
62362E54086J9681K3417K7295L0980L4759L8808M2825M6526M9993N3218N5580
62351I77168N6144N4472N0814M5522L8582K9966K0286J0819K723l743r189j4345
62339A259219j9556k4890l0358l5674m0051m2694m3496m2924m1255l8467l4930
62328H64924l1556k8897k6465k3509k0174j7418j5861j5256j5056j5031j5165
$$ plain form
62317 640536 625166 609605 593819 577734 561466 545457 530307 516474 504116 493229 483892 476243
62305 476243 470112 464786 459398 453653 448072 443449 440136 437786 435660 433105 429924 426422 423145 420565
62291 420565 418967 418489 419082 420514 422572 425205 428353 431770 435249 438914 442955 447109 450737 453446 455391
62276 455391 456972 458623 460899 464319 468979 474687 481537 489914 499771 510495 521887 534815 550403
62263 550403 568947 590180 614270 641881 673412 708878 748581 793179 842883 897168 955547
62252 955547 1017984 1083903 1151031 1215774 1274772 1325822 1367516 1398772 1419188 1429475 1430952 1424425
62240 1424425 1409861 1387155 1356836 1319719 1276170 1226254 1170702 1111423 1050901 991215 933626
62229 933626 878866 827630 780860 739442 703471 671909 643346 617149 593573 572825 554525
$$ packed form
62317F40536j5370j5561j5786j6085j6268j6009j5150j3833j2358j0887r337p649
62305D76243o131n326n388n745n581m623l313k350k126k555l181l502l277k580
62291D20565j598m78N93J432K058K633L148L417L479L665M041M154L628K709J945
62276D55391J581J651K276L420M660N708O850Q377R857J0724J1392J2928J5588
62263E50403J8544K1233K4090K7611L1531L5466L9703M4598M9704N4285N8379
62252I55547O2437O5919O7128O4743N8998N1050M1694L1256K0416J0287J477o527
62240A424425j4564k2706l0319l7117m3549m9916n5552n9279o0522n9686n7589
62229I33626n4760n1236m6770m1418l5971l1562k8563k6197k3576k0748j8300
$$ plain form
62218 554525 538301 524319 512808 503400 495342 488098 481409 474998 468709 462742 457375 452579 448273
62205 448273 444745 442311 440682 439178 437612 436499 436359 437295 439333 442673 447296 452662 458077 463305 468654
62190 468654 474631 481572 489458 498046 507200 517012 527435 538029 548381 558655 569257 579999 590046
62177 590046 598747 606119 612469 618055 623371 629273 636523 645473 656513 670494 688351 710506 736921
62164 736921 767496 802075 840176 880981 923371 965727 1005891 1041776 1071985 1095709 1112333
62153 1112333 1121685 1124533 1122229 1115628 1104617 1088723 1067819 1042206 1012496 979734 945285 910336
62141 910336 875738 842588 812523 786859 765511 747287 731313 717770 707126 699205 693367 689291
62129 689291 687091 686757 687828 689663 691789 694061 696739 700439 705684 712449 720307 728891 737828 746244
$$ packed form
62218E54525j6224j3982j1511r408q058p244o689o411o289n967n367m796m306
62205D48273l528k434j629j504j566j113j40R36K038L340M623N366N415N228N349
62190D68654N977O941P886Q588R154R812J0423J0594J0352J0274J0602J0742J0047
62177E90046Q701P372O350N586N316N902P250Q950J1040J3981J7857K2155K6415
62164G36921L0575L4579L8101M0805M2390M2356M0164L5885L0209K3724J6624
62153A112333R352K848k304o601j1011j5894k0904k5613k9710l2762l4449l4949
62141I10336l4598l3150l0065k5664k1348j8224j5974j3543j0644p921n838m076
62129F89291k200l34J071J835K126K272K678L700N245O765P858Q584Q937Q416
$$ plain form
62115 746244 752870 756913 758510 758177 756332 753683 751459 750396 749627 747319 742500 735660 727552 718286 708062
62100 708062 698023 689549 682962 677658 673414 670811 670176 670795 671602 672329 673540 675779 679111 683383 688462
62085 688462 694069 699757 705307 711026 717490 725061 733774 743611 754749 767521 782196 798702 816541
62072 816541 835086 854033 873458 893365 913433 933401 953539 974431 996485 1019948 1045242
62061 1045242 1072714 1101941 1131631 1160367 1187010 1210226 1228216 1239569 1244294 1243612 1238733 1230133
62049 1230133 1217843 1201869 1182098 1158162 1129769 1097232 1061562 1024087 986010 948224 911349
62038 911349 875748 841520 808641 777316 748127 721652 697967 676669 657369 639959 624451
62027 624451 610866 599246 589343 580264 570985 561489 552828 545634 538992 531426 522672 513800 505727 498357
$$ packed form
62115G46244O626M043J597l33j845k649k224j063p69k308m819o840q108r266j0224
62100G08062j0039q474o587n304m244k603o35O19Q07P27J211K239L332M272N079
62085F88462N607N688N550N719O464P571Q713R837J1138J2772J4675J6506J7839
62072H16541J8545J8947J9425J9907K0068J9968K0138K0892K2054K3463K5294
62061A045242K7472K9227K9690K8736K6643K3216J7990J1353M725o82m879q600
62049A230133j2290j5974j9771k3936k8393l2537l5670l7475l8077l7786l6875
62038I11349l5601l4228l2879l1325k9189k6475k3685k1298j9300j7410j5508
62027F24451j3585j1620r903r079r279r496q661p194o642p566q754q872q073p370
$$ plain form
62013 498357 491304 484710 478963 474061 469685 465675 462172 459350 457241 455799 455067 455303 456893 459939 463938
61998 463938 468032 471585 474413 476619 478469 480355 482454 484360 485419 485506 485104 484394 482631 478744 472473
61983 472473 464717 456803 449581 443076 436813 430397 423813 417233 410721 404299 398171 392583 387437 382326
61969 382326 377038 371880 367435 364137 362012 360584 359054 356932 354554 352700 351584 350590 349174 347673
61955 347673 346856 346925 347326 347523 347685 348539 350695 354105 358134 362197 366391 371389 377737 385414 394177 404120
61939 404120 415654 428982 443795 459447 475339 491071 506317 520735 534105 546609 558756
61928 558756 570873 582713 593654 603134 610696 615897 618583 619185 618294 615908 611531 605138 597663 590418
61914 590418 584393 580172 578061 578016 579882 584007 591164 601495 613939 627192 640894 655222 669617
$$ packed form
62013D98357p053o594n747m902m376m010l503k822k109j442p32K36J590L046L999
61998D63938M094L553K828K206J850J886K099J906J059Q7m02p10j763l887o271
61983D72473p756p914p222o505o263o416o584o580o512o422o128n588n146n111
61969C82326n288n158m445l298k125j428j530k122k378j854j116r94j416j501
61955C47673q17O9M01J97J62Q54K156L410M029M063M194M998O348P677Q763R943
61939D04120J1534J3328J4813J5652J5892J5732J5246J4418J3370J2504J2147
61928E58756J2117J1840J0941R480P562N201K686O02q91k386m377o393p475p245
61914E90418o025m221k111m5J866M125P157J0331J2444J3253J3702J4328J4395
$$ plain form
61901 669617 682681 693370 701560 707225 709703 708294 703246 695681 686622 676424 665135 653103 641059
61888 641059 629697 619242 609487 600168 591211 582582 574042 565262 556121 546711 537000 526696 515547
61875 515547 503712 491736 480265 469805 460573 452441 445135 438675 433535 430102 428015 426398 424947
61862 424947 424487 426070 429700 434362 439311 444846 451722 460387 471139 484515 500832 519525 539557
61849 539557 560518 582710 606105 629857 653151 675990 698683 720853 741383 759106 773160
61838 773160 782853 787713 787769 783477 775429 764464 752053 740068 729852 721729 715651 712078 711850 715195
61824 715195 721329 729275 738847 750379 763479 776450 787168 794303 797467 796420 790648 779802 764246
61811 764246 745059 723684 701614 680056 659575 640065 621157 602663 584654 567315 550832
$$ packed form
61901F69617J3064J0689Q190N665K478j409n048p565r059j0198j1289j2032j2044
61888F41059j1362j0455r755r319q957q629q540q780r141r410r711j0304j1149
61875E15547j1835j1976j1471j0460r232q132p306o460n140l433k087j617j451
61862D24947m60J583L630M662M949N535O876Q665J0752J3376J6317J8693K0032
61849E39557K0961K2192K3395K3752K3294K2839K2693K2170K0530J7723J4054
61838G73160R693M860N6m292q048j0965j2411j1985j0216q123o078l573k28L345
61824G15195O134P946R572J1532J3100J2971J0718P135L164j047n772j0846j5556
61811G64246j9187k1375k2070k1558k0481j9510j8908j8494j8009j7339j6483
$$ plain form
61800 550832 535341 520899 507520 495247 484129 474181 465426 457861 451245 445074 439065 433603 429348
61787 429348 426324 423700 420597 416938 413472 411095 410165 410202 410216 409495 408119 406578 405121 403798 402908 402781
61771 402781 403185 403622 404270 405853 408313 410483 411611 412504 414473 417688 421370 425073 428868 432513 435578
61756 435578 438458 442225 447135 452048 455762 458283 460302 461937 462611 461932 460087 457472 454378 451108 448026
61741 448026 445306 442752 439989 436791 433259 429733 426627 424323 423114 422995 423451 423719 423533 423491 424387 426277
61725 426277 428563 430889 433453 436320 439059 441426 443935 447175 450777 453701 455523 456909 458706 461074
61711 461074 463674 466157 468045 468567 467231 464532 461590 459043 456675 454094 451268 448231 444797 440936
61697 440936 437155 434057 431646 429380 426791 423807 420568 417261 414113 411291 408842 406882 405657 405154
$$ packed form
61800E50832j5491j4442j3379j2273j1118r948q755p565o616o171o009n462m255
61787D29348l024k624l103l659l466k377r30L7J4p21j376j541j457j323q90j27
61771D02781M04M37O48J583K460K170J128Q93J969L215L682L703L795L645L065
61756D35578K880L767M910M913L714K521K019J635O74o79j845k615l094l270l082
61741D48026k720k554k763l198l532l526l106k304j209j19M56K68j86m2Q96J890
61725D26277K286K326K564K867K739K367K509L240L602K924J822J386J797K368
61711D61074K600K483J888N22j336k699k942k547k368k581k826l037l434l861
61697D40936l781l098k411k266k589k984l239l307l148k822k449j960j225n03
$$ plain form
61683 405154 404814 403996 402642 401151 399732 398288 396858 395701 394908 394279 393615 392792 391626 390115 388749 388029
61667 388029 387665 386827 385313 383872 383203 383215 383396 383290 382400 380389 377876 376317 376498 377611 378410 378801 379668
61650 379668 381515 384007 386534 388533 389461 389226 388627 388744 389893 391615 393598 395988 398872 402027 405232
61635 405232 408313 410834 412249 412487 412031 411365 410624 409726 408465 406528 403809 400689 397662 394814 392007
61620 392007 389348 387022 384912 383001 381872 382045 382901 383121 382203 380667 378658 375477 370945 366207 362380
61605 362380 359066 355064 350095 344954 340199 335597 330851 326107 321545 317069 312635 308514 304915 301656
61591 301656 298450 295368 292701 290456 288275 285966 283870 282429 281447 280137 278050 275647 273681 272298
61577 272298 271134 270080 269423 269223 269087 268655 267944 267088 266127 265219 264627 264320 263967 263602 263915 265513 268119
$$ packed form
61683D05154l40q18j354j491j419j444j430j157p93o29o64q23j166j511j366p20
61667C88029l64q38j514j441o69J2J81j06q90k011k513j559J81J113P99L91Q67
61650C79668J847K492K527J999R28k35n99J17J149J722J983K390K884L155L205
61635D05232L081K521J415K38m56o66p41q98j261j937k719l120l027k848k807
61620C92007k659k326k110j911j129J73Q56K20r18j536k009l181m532m738l827
61605C62380l314m002m969n141m755m602m746m744m562m476m434m121l599l259
61591C01656l206l082k667k245k181k309k096j441r82j310k087k403j966j383
61577B72298j164j054o57k00j36m32p11q56r61r08n92l07l53l65L13J598K606
$$ plain form
61560 268119 270754 272522 273045 272513 271724 271796 273351 275928 278517 280621 282535 284648 286840 288662 289858
61545 289858 290583 291179 291822 292394 292685 292739 292894 293479 294522 295742 296663 296807 296064 294989 294436 294698 295227 295363
61527 295363 295084 294734 294271 293206 291316 289044 287054 285579 284370 283139 281918 280939 280305 279888 279610 279694
61511 279694 280388 281473 282314 282593 282762 283483 284760 285949 286630 287138 288024 289173 289746 289042 287251 285274 283936
61494 283936 283484 283766 284577 285699 286813 287652 288225 288721 289182 289444 289462 289568 290293 291899 294098 296295 298184
61477 298184 300083 302497 305351 307896 309453 309983 309817 309178 308329 307839 308209 309248 310276 310890 311168 311211 310961
61460 310961 310541 310256 310107 309685 308758 307698 307176 307650 309182 311397 313534 314879 315364 315512 315810 316461 317666
61443 317666 319591 321859 323696 324963 326538 329214 332576 335508 337531 339159 341065 343406 345884 348013
$$ packed form
61560B68119K635J768N23n32p89P2J555K577K589K104J914K113K192J822J196
61545B89858P25N96O43N72K91N4J55N85J043J220R21J44p43j075n53K62N29J36
61527B95363k79l50m63j065j890k272j990j475j209j231j221r79o34m17k78Q4
61511B79694O94J085Q41K79J69P21J277J189O81N08Q86J149N73p04j791j977j338
61494B83936m52K82Q11J122J114Q39N73M96M61K62J8J06P25J606K199K197J889
61477B98184J899K414K854K545J557N30j66o39q49m90L70J039J028O14K78M3k50
61460C10961m20k85j49m22r27j060n22M74J532K215K137J345M85J48K98O51J205
61443C17666J925K268J837J267J575K676L362K932K023J628J906K341K478K129
$$ plain form
61429 348013 349267 349351 348459 347153 345961 345202 345006 345251 345636 346053 346776 348044 349614 351036 352222 353379
61413 353379 354413 354823 354212 352665 350597 348525 346914 345905 345120 344035 342612 341233 339982 338413 336281
61398 336281 334134 332798 332376 332127 331312 329882 328327 327077 326255 325837 325806 326071 326368 326411 326185 326042 326415 327446
61380 327446 328879 330364 331777 333226 334798 336457 338263 340531 343513 346954 350241 353095 355829 358703
61366 358703 361317 363063 364053 365103 366670 368246 369070 369144 369248 370082 371741 374012 376808 380135 383817 387649
61350 387649 391934 397595 405353 414754 424315 432770 439941 446287 452032 457100 461507 465283 468203 470145
61336 470145 471639 473420 475429 476864 477265 476871 475709 473135 468753 463297 458020 453555 449787 446507 443588
61321 443588 440735 437640 434418 431508 429248 427828 427569 428817 431591 435593 440504 446045 451932 458079
$$ packed form
61429C48013J254Q4q92j306j192p59j96K45L85M17P23J268J570J422J186J157
61413C53379J034M10o11j547k068k072j611j009p85j085j423j379j251j569k132
61398C36281k147j336m22k49q15j430j555j250q22m18l1K65K97M3k26j43L73J031
61380C27446J433J485J413J449J572J659J806K268K982L441L287K854K734K874
61366C58703K614J746R90J050J567J576Q24P4J04Q34J659K271K796L327L682L832
61350C87649M285N661P758R401R561Q455P171O346N745N068M407L776K920J942
61336D70145J494J781K009J435M01l94j162k574m382n456n277m465l768l280k919
61321D43588k853l095l222k910k260j420k59J248K774M002M911N541N887O147
$$ plain form
61307 458079 464713 471985 479673 487608 496195 505956 516588 526978 536155 543729 549378 552478 552615 550084
61293 550084 545670 540150 534226 528550 523382 518391 513132 507651 502298 497021 491285 484898 478652 473794
61279 473794 470877 469378 468513 468133 468647 470269 472706 475539 478569 481671 484642 487400 490071 492642 494808
61264 494808 496456 498137 500633 504149 508372 513304 519530 527330 535889 543715 549807 554197 557494 560159
61250 560159 562249 563622 564244 564346 564264 564053 563287 561412 558413 554967 551797 548969 546004 542594 538878 535026
61234 535026 530915 526500 522255 518939 516919 515946 515551 515486 515835 516871 518767 521322 524045 526673 529444
61219 529444 532704 536404 540278 544300 548556 552836 556778 560403 563995 567432 570171 572037 573551 575246
61205 575246 577056 578636 579925 581127 582452 584125 586472 589817 594554 601346 610778 622605 635802 649614
$$ packed form
61307D58079O634P272P688P935Q587R761J0632J0390R177P574N649L100J37k531
61293E50084m414n520n924n676n168m991n259n481n353n277n736o387o246m858
61279D73794k917j499q65l80N14J622K437K833L030L102K971K758K671K571K166
61264D94808J648J681K496L516M223M932O226P800Q559P826O092M390L297K665
61250E60159K090J373O22J02q2k11p66j875k999l446l170k828k965l410l716l852
61234E35026m111m415m245l316k020r73l95o5L49J036J896K555K723K628K771
61219E29444L260L700L874M022M256M280L942L625L592L437K739J866J514J695
61205E75246J810J580J289J202J325J673K347L345M737O792R432J1827J3197J3812
$$ plain form
61191 649614 664036 678865 692784 704129 712377 718337 722935 726366 728447 729261 729216 728692 727792 726339
61177 726339 724108 721148 717739 713933 709285 703313 696117 688337 680559 672982 665543 658110 650564 642782
61163 642782 634546 625450 615175 604022 592924 582674 573288 564334 555650 547435 539822 532813 526638
61150 526638 521830 518812 517565 517644 518363 518904 518495 516649 513312 508827 503682 498125 492025 485325 478591
61135 478591 472804 468519 465553 463574 462628 462852 464100 466196 469284 473557 478890 485073 492237 500683 510487
61120 510487 521623 534312 548820 564918 581963 599502 617495 635959 654723 673637 692722
61109 692722 711935 730922 749206 766606 783337 799567 814940 828738 840573 850574 858658 863961
61097 863961 865457 862968 857072 848228 836663 823042 808339 792790 775744 756961 737415 718383
$$ packed form
61191F49614J4422J4829J3919J1345Q248N960M598L431K081Q14m5n24r00j453
61177G26339k231k960l409l806m648n972p196p780p778p577p439p433p546p782
61163F42782q236r096j0275j1153j1098j0250r386q954q684q215p613p009o175
61150E26638m808l018j247P9P19N41m09j846l337m485n145n557o100o700o734
61135D78591n787m285k966j979r46K24J248K096L088M273N333O183P164Q446R804
61120E10487J1136J2689J4508J6098J7045J7539J7993J8464J8764J8914J9085
61109F92722J9213J8987J8284J7400J6731J6230J5373J3798J1835J0001Q084N303
61097H63961J496k489n896q844j1565j3621j4703j5549j7046j8783j9546j9032
$$ plain form
61085 718383 700304 682988 666383 650559 635392 620828 607178 594708 583267 572659 562987 554207
61073 554207 545929 538194 531915 527831 525408 523488 521752 520810 520993 521811 522631 523375 524479 526544 529974
61058 529974 534720 540425 546924 554354 562687 571705 581557 592741 605179 617996 630696 643895 658376
61045 658376 674144 691009 709377 729638 751435 774382 798968 825821 854584 884382 914908
61034 914908 946172 977798 1009699 1043056 1079441 1119014 1160340 1201645 1241616 1279688 1316663
61023 1316663 1354627 1395406 1439757 1488886 1545543 1612003 1687833 1771412 1863033 1964939 2079614
61012 2079614 2210721 2365295 2552334 2779303 3052317 3379170 3769269 4231800 4779223
61003 4779223 5434066 6228725 7199063 8383806 9824589 11537879 13452230 15364840 16987980
$$ packed form
61085G18383j8079j7316j6605j5824j5167j4564j3650j2470j1441j0608r672q780
61073E54207q278p735o279m084k423j920j736r42J83Q18Q20P44J104K065L430
61058E29974M746N705O499P430Q333R018R852J1184J2438J2817J2700J3199J4481
61045F58376J5768J6865J8368K0261K1797K2947K4586K6853K8763K9798L0526
61034I14908L1264L1626L1901L3357L6385L9573M1326M1305L9971L8072L6975
61023A316663L7964M0779M4351M9129N6657O6460P5830Q3579R1621J01906J14675
61012B079614J31107J54574J87039K26969K73014L26853L90099M62531N47423
61003D779223O54843P94659R70338J184743J440783J713290J914351J912610J623140
$$ plain form
60994 16987980 18081127 18571857 18571488 18293272 17961191 17766528 17843923 18220735 18764216 19202891
60984 19202891 19246322 18726470 17657718 16190402 14519424 12816950 11206343 9758977
60976 9758977 8500783 7426990 6519421 5756842 5117540 4580814 4129541 3750369 3431312
60967 3431312 3160625 2927905 2724746 2544392 2382121 2235617 2103466 1983297 1872565
60958 1872565 1770526 1677811 1594245 1518732 1451068 1391984 1340952 1295414 1252645 1211266 1170736
60947 1170736 1130761 1091725 1054633 1019979 987372 956524 927755 901177 876171 852050 828593
60936 828593 805720 783316 761577 740808 720741 700757 681024 662611 646213 631377 617284
60925 617284 603618 590368 577451 564993 553542 543582 535100 527800 521428 515773 510748 506573 503572
$$ packed form
60994A6987980J093147M90730l69k78216l32081j94663P7395L76812N43481M38675
60984A9202891M3431n19852j068752j467316j670978j702474j610607j447366
60976I758977j258194j073793r07569p62579o39302n36726m51273l79172l19057
60967C431312k70687k32720k03159j80354j62271j46504j32151j20169j10732
60958A872565j02039r2715q3566p5513o7664n9084n1032m5538m2769m1379m0530
60947A170736l9975l9036l7092l4654l2607l0848k8769k6578k5006k4121k3457
60936H28593k2873k2404k1739k0769k0067j9984j9733j8413j6398j4836j4093
60925F17284j3666j3250j2917j2458j1451r960q482p300o372n655n025m175l001
$$ plain form
60912 503572 501667 500394 499443 498866 498808 499369 500622 502419 504266 505900 507789 510579 514090 517374 519678
60897 519678 520892 521188 520902 520671 521013 521614 521581 520494 518792 517127 515788 514670 513226 510484 505691 499047
60881 499047 491407 483380 475204 467308 460226 453949 447976 442029 436123 430029 423455 416843 411188 406842
60867 406842 403127 399323 395387 391578 388106 385481 384467 385228 386875 388234 388731 388378 387408 386254 385498
60852 385498 385527 386426 388270 391064 394312 397081 398803 399703 400316 400929 401671 402759 404349 406267 407990 408856
60836 408856 408447 407076 405664 404775 403983 402650 401015 399867 399319 398753 397958 397499 397784 398546 399501 400800 402459
60819 402459 403895 404434 403932 402706 401267 400153 399498 398699 397067 394841 392822 390936 388063 383641 378608
60804 378608 374223 370653 367310 363961 360774 357669 354354 350878 347584 344563 341500 338012 334024 329934
$$ packed form
60912E03572j905j273r51n77n8N61J253J797J847J634J889K790L511L284K304
60897E19678J214K96k86k31L42O01l3j087j702j665j339j118j444k742m793o644
60881D99047p640q027q176p896p082o277n973n947n906o094o574o612n655m346
60867D06842l715l804l936l809l472k625j014P61J647J359M97l53r70j154p56
60852C85498K9Q99J844K794L248K769J722R00O13O13P42J088J590J918J723Q66
60836D08856m09j371j412q89p92j333j635j148n48n66p95m59K85P62R55J299J659
60819D02459J436N39n02j226j439j114o55p99j632k226k019j886k873m422n033
60804C78608m385l570l343l349l187l105l315l476l294l021l063l488l988m090
$$ plain form
60790 329934 326482 324128 322502 320833 318964 317442 316523 315754 314757 313769 313022 312212 311080 310025 309572 309668
60774 309668 309987 310615 311871 313757 316064 318813 322182 326215 330884 336122 341412 345783 348756 351053 353852
60759 353852 357508 361416 364881 367612 369544 370703 371236 371203 370421 368812 366781 364902 363381 362191 361476
60744 361476 361330 361322 360789 359569 357891 355529 351683 346064 339619 333750 328955 324615 320036 315336 311210
60729 311210 308134 306048 304639 303569 302408 300736 298521 296159 293973 291886 289763 287785 286207 285060
60715 285060 284411 284556 285451 286335 286541 286417 286669 287028 286566 285357 284790 285814 287770 289495 290828 292380 294368
60698 294368 296453 298406 300340 302404 304691 307319 310286 313393 316523 319725 322853 325488 327515 329406
60684 329406 331668 334321 337155 340126 343215 346258 349158 351905 354199 355507 355792 355714 355827 356060 356284 356649
$$ packed form
60790C29934l452k354j626j669j869j522r19p69r97r88p47q10j132j055m53R6
60774C09668L19O28J256J886K307K749L369M033M669N238N290M371K973K297K799
60759C53852L656L908L465K731J932J159N33l3p82j609k031j879j521j190p15
60744C61476j46qn33j220j678k362l846n619o445n869m795m340m579m700m126
60729C11210l076k086j409j070j161j672k215k362k186k087k123j978j578j147
60715B85060o49J45Q95Q84K06j24K52L59m62j209n67J024J956J725J333J552J988
60698B94368K085J953J934K064K287K628K967L107L130L202L128K635K027J891
60684C29406K262K653K834K971L089L043K900K747K294J308K85p8J13K33K24L65
$$ plain form
60668 356649 356886 355951 353070 348673 343668 338325 332600 327084 322652 319401 316767 314595 313284 312974 313338
60653 313338 314141 315289 316373 316950 317335 318393 320416 322841 325167 327421 329476 330624 330275 328647 326397
60638 326397 323877 321078 318010 314895 312153 310310 309641 309761 309848 309409 308622 307865 307251 306768 306533 306637 306911
60621 306911 307043 306830 306250 305431 304566 303729 302789 301730 300997 301171 302200 303284 303677 303400 303029 302977 303171 303286
60603 303286 303156 303044 303514 304899 306898 308839 310397 311765 313150 314463 315680 317163 319214 321505 323339
60588 323339 324487 325335 326116 326359 325412 323379 321202 319807 319424 319771 320607 321874 323522 325471 327758 330543
60572 330543 333976 338215 343526 350159 358087 367012 376642 386904 397859 409433 421008 431171 438187
60559 438187 441189 440875 438736 435706 431884 427409 422931 419070 415957 413594 412281 412401 414070 417211 421691
$$ packed form
60668C56649K37r35k881m397n005n343n725n516m432l251k634k172j311l10L64
60653C13338Q03J148J084N77L85J058K023K425K326K254K055J148l49j628k250
60638C26397k520k799l068l115k742j843o69J20Q7m39p87p57o14m83k35J04K74
60621C06911J32k13n80q19q65q37r40j059p33J74J029J084L93k77l71n2J94J15
60603C03286j30j12M70J385J999J941J558J368J385J313J217J483K051K291J834
60588C23339J148Q48P81K43r47k033k177j395l83L47Q36J267J648J949K287K785
60572C30543L433M239N311O633P928Q925R630J0262J0955J1574J1575J0163P016
60559D38187L002l14k139l030l822m475m478l861l113k363j313J20J669L141M480
$$ plain form
60544 421691 427240 433605 441032 450246 461672 475006 489805 506035 523489 540972 556678 569439
60532 569439 579177 586124 590015 590271 586788 580394 572508 564356 556492 549040 542193 536207 531000 526172
60518 526172 521552 517444 514179 511711 509823 508471 507730 507670 508434 510198 512891 516272 520456 526130 534065
60503 534065 544693 558291 575268 596002 620611 649040 681110 716378 754251 794400 836654
60492 836654 880329 923991 965960 1004488 1037281 1061565 1075173 1077232 1067507 1045765 1012526 970047
60480 970047 921805 871071 820250 771112 724895 682247 643546 609148 578984 552320 528501
60469 528501 507696 490313 475979 463760 453140 444000 435772 427549 419177 411487 405121 399734 394617
60456 394617 389606 385017 381084 377830 375210 373029 370816 368055 364557 360561 356527 352909 350074 348335
$$ packed form
60544D21691N549O365P427R214J1426J3334J4799J6230J7454J7483J5706J2761
60532E69439R738O947L891K56l483o394p886q152p864p452o847n986n207m828
60518E26172m620m108l265k468j888j352p41o0P64J764K693L381M184N674P935
60503E34065J0628J3598J6977K0734K4609K8429L2070L5268L7873M0149M2254
60492H36654M3675M3662M1969L8528L2793K4284J3608K059r725k1742l3239m2479
60480I70047m8242n0734n0821m9138m6217m2648l8701l4398l0164k6664k3819
60469E28501k0805j7383j4334j2219j0620r140q228q223q372p690o366n387n117
60456C94617n011m589l933l254k620k181k213k761l498l996m034l618k835j739
$$ plain form
60442 348335 347937 348810 350352 351733 352473 352539 351897 350398 348239 346085 344438 343220 342231 341615 341509 341652 341762
60425 341762 341918 342180 342230 341884 341531 341490 341317 340525 339644 339756 341069 342724 343996 344911 345543 345548 344746 343673 343097
60406 343097 343266 343885 344662 345687 347332 349799 352733 355390 357321 358746 360124 361637 363250 364954 366653
60391 366653 368127 369448 371102 373366 375886 378209 380300 382192 383657 384819 386559 389550 393219 396385
60377 396385 398623 400327 401783 403021 404316 405953 407632 408892 409963 411393 413021 414192 414820 415339 415750
60362 415750 415763 415780 416596 418013 418900 418892 419031 420362 422880 426225 430442 435512 440915 446196 451378 456424 460927
60345 460927 464663 467723 469779 470025 468341 465770 463303 460783 457595 453856 450336 447613 445836 444909 444455
60330 444455 443875 442850 441488 439869 437882 435640 433446 431177 428353 425110 422355 420678 419858 419744 420683
$$ packed form
60442C48335l98Q73J542J381P40O6o42j499k159k154j647j218r89o16j06J43J10
60425C41762J56K62N0l46l53m1j73p92q81J12J313J655J272R15O32Nq02j073n76
60406C43097J69O19P77J025J645K467K934K657J931J425J378J513J613J704J699
60391C66653J474J321J654K264K520K323K091J892J465J162J740K991L669L166
60377C96385K238J704J456J238J295J637J679J260J071J430J628J171O28N19M11
60362D15750J3J7Q16J417Q87qJ39J331K518L345M217N070N403N281N182N046M503
60345D60927L736L060K056K46j684k571k467k520l188l739l520k723j777r27m54
60330D44455n80j025j362j619j987k242k194k269k824l243k755j677q20j14R39
$$ plain form
60315 420683 422566 424426 425813 427721 431298 436343 442056 448591 456740 466486 477123 488601 501546
60302 501546 515863 530352 543894 556086 566380 573447 575957 573498 566388 555102 540473 524187
60290 524187 508374 494472 482626 472284 463206 455680 449857 445331 441685 439113 437954 437714 437176 435588
60276 435588 433122 430080 426415 422410 419085 417179 416113 414621 412166 409235 406504 404312 402815 402008
60262 402008 401537 400869 399689 397937 395622 392932 390331 388209 386531 385140 384197 384007 384549 385503 386569 387439
60246 387439 387751 387546 387541 388423 389907 391017 391269 391043 390746 390200 389137 387923 387403 388169 390211 393129 396412
60229 396412 399554 402192 404302 406174 408054 409861 411464 413131 415361 418175 420992 423478 426126 429579
60215 429579 433779 438378 443631 450055 457288 464236 470471 476610 482999 488987 494030 498706 503879 509403
$$ packed form
60315D20683J883J860J387J908L577N045N713O535Q149R746J0637J1478J2945
60302E01546J4317J4489J3542J2192J0294P067K510k459p110j1286j4629j6286
60290E24187j5813j3902j1846j0342r078p526n823m526l646k572j159k40n38j588
60276D35588k466l042l665m005l325j906j066j492k455k931k731k192j497q07
60262D02008m71o68j180j752k315k690k601k122j678j391r43j90N42R54J066Q70
60246C87439L12k05nQ82J484J110K52k26k97n46j063j214n20P66K042K918L283
60229C96412L142K638K110J872J880J807J603J667K230K814K817K486K648L453
60215D29579M200M599N253O424P233O948O235O139O389N988N043M676N173N524
$$ plain form
60201 509403 514442 518720 522749 526988 531439 535904 540089 543490 545732 547016 547887 548552 548745 548196 546937
60186 546937 545167 543047 540606 537698 534177 530178 526015 521670 516688 510806 504494 498700 494170 490997
60172 490997 488536 485811 482441 479231 477281 476541 475894 474776 473818 473530 473283 472276 470763 469532 468712 467936
60156 467936 467215 466863 466857 467067 467764 469116 470422 470776 470295 469960 470312 471101 472082 473281 474470 475240 475830 477193
60138 477193 480013 484209 489442 495523 502104 508568 514453 519557 523575 526190 527731 529145 530986 532904
60124 532904 534454 535949 538013 540555 542787 544322 545807 548181 551459 554655 557019 559009 561561 564599
60110 564599 566906 567609 567149 566431 565556 563967 561500 558698 556199 554276 552794 551215 548829 545436 541715
60095 541715 538550 536154 534155 532266 530504 529032 528183 528294 529113 529707 529503 529048 529191 529880 530423 530487 530062
$$ packed form
60201E09403N039M278M029M239M451M465M185L401K242J284Q71O65J93n49j259
60186E46937j770k120k441k908l521l999m163m345m982n882o312n794m530l173
60172D90997k461k725l370l210j950p40o47j118r58k88k47j007j513j231q20p76
60156D67936p21l52oK10O97J352J306L54m81l35L52P89R81J199J189P70N90J363
60138D77193K820M196N233O081O581O464N885N104M018K615J541J414J841J918
60124E32904J550J495K064K542K232J535J485K374L278L196K364J990K552L038
60110E64599K307P03m60p18q75j589k467k802k499j923j482j579k386l393l721
60095E41715l165k396j999j889j762j472q49J11Q19N94k04m55J43O89N43O4m25
$$ plain form
60078 530062 528801 526428 523627 521459 519833 517542 513943 509645 505277 500563 495104 489238 483518 477944
60064 477944 472306 466861 462099 458121 454675 451536 448470 445129 441429 437881 435257 433877 433395 433114 432494
60049 432494 431557 430968 431530 433490 436433 439862 443661 448000 453036 458683 464517 469972 474883 479681 484658
60034 484658 489211 492343 493861 494528 494933 494849 493928 492426 490784 488871 486101 482199 477511 472615 467803
60019 467803 462924 457621 451761 445599 439460 433352 427078 420690 414573 409113 404459 400548 397135 393892
60005 393892 390723 387925 385787 384104 382352 380273 378039 375994 374484 373775 373863 374533 375843 378225 381683
59990 381683 385269 387985 389971 392164 394977 398048 401141 404473 407998 411223 413927 416380 418558 419780
59976 419780 419487 417850 415274 411833 407648 403398 400000 397901 396888 396332 395487 393903 391820 389968 388900
$$ packed form
60078E30062j261k373k801k168j626k291l599m298m368m714n459n866n720n574
60064D77944n638n445m762l978l446l139l066l341l700l548k624j380m82k81o20
60049D32494r37n89N62J960K943L429L799M339N036N647N834N455M911M798M977
60034D84658M553L132J518O67M05q4r21j502j642j913k770l902m688m896m812
60019D67803m879n303n860o162o139o108o274o388o117n460m654l911l413l243
60005C93892l169k798k138j683j752k079k234k045j510p09Q8O70J310K382L458
59990C81683L586K716J986K193K813L071L093L332L525L225K704K453K178J222
59976D19780k93j637k576l441m185m250l398k099j013n56q45j584k083j852j068
$$ plain form
59961 388900 388691 389231 390374 391732 392801 393460 393977 394418 394515 394221 393928 393945 394180 394525 395098 395873 396522 396878
59943 396878 397192 397696 398252 398670 398946 399032 398758 398222 397826 397663 397306 396546 395910 396082 397132 398708 400698 403274
59925 403274 406502 410312 414713 419779 425526 432002 439193 446604 453179 458011 460979 462468 462758 462030 460787
59910 460787 459720 459092 458578 457898 457389 457745 459182 461036 462385 462986 463336 463772 463935 463492 462967 463306 464797
59893 464797 466969 469448 472298 475519 478936 482736 487495 493411 499996 506712 513360 519629 524940 529233
59879 529233 533394 538346 544001 549527 554349 558355 561354 562870 562556 560520 557231 553209 548701 543571
59865 543571 537697 531540 526014 521573 517787 514063 510500 507695 505927 504975 504649 505216 507209 511017 516614
59850 516614 523551 531259 539447 548115 557074 565483 571991 575493 575964 574646 573270 572905 573629 575212 577522
$$ packed form
59961C88900k09N40J143J358J069O59N17M41R7k94k93J7K35L45N73P75O49L56
59943C96878L14N04N56M18K76Q6k74n36l96j63l57p60o36J72J050J576J990K576
59925D03274L228L810M401N066N747O476P191P411O575M832K968J489K90p28j243
59910D60787j067o28n14o80n09L56J437J854J349O01L50M36J63m43n25L39J491
59893D64797K172K479K850L221L417L800M759N916O585O716O648O269N311M293
59879E29233M161M952N655N526M822M006K999J516l14k036l289m022m508n130
59865E43571n874o157n526m441l786l724l563k805j768r52l26N67J993L808N597
59850E16614O937P708Q188Q668Q959Q409O508L502M71j318j376l65P24J583K310
$$ plain form
59835 577522 579878 580630 578306 573201 567161 561681 556776 551741 546319 540837 535718 531210 527321 523801
59821 523801 520451 517433 514951 512669 509935 506547 502800 498836 494619 490570 487487 485549 484047 482305
59807 482305 480236 477848 475039 472230 470403 469906 469797 468992 467550 466286 465557 465020 464296 463302 462218 461501
59791 461501 461668 462631 463540 463666 463117 462389 461685 461088 460921 461320 461817 461892 461678 461549 461294 460375 458903 457687
59773 457687 457259 457331 457388 457445 457978 459242 460856 462166 462986 463781 464940 466195 467217 468525 471035 474715 478545
59756 478545 482006 485745 490359 495370 500057 504660 510010 516382 523427 530840 538337 545246 550857 555138
59742 555138 558612 561631 564266 566759 569529 572722 576102 579334 582079 584008 585023 585404 585503 585487 585523 585862
59726 585862 586425 586657 586162 585231 584421 583872 583323 582511 581255 579453 577310 575249 573356 571321 569169 567510
$$ packed form
59835E77522K356P52k324n105o040n480m905n035n422n482n119m508l889l520
59821E23801l350l018k482k282k734l388l747l964m217m049l083j938j502j742
59807D82305k069k388k809k809j827m97j09q05j442j264p29n37p24r94j084p17
59791D61501J67R63R09J26n49p28p04n97j67L99M97P5k14j29k55r19j472j216
59773D57687m28P2N7N7N33J264J614J310Q20P95J159J255J022J308K510L680L830
59756D78545L461L739M614N011M687M603N350O372P045P413P497O909N611M281
59742E55138L474L019K635K493K770L193L380L232K745J929J015L81R9j6L6L39
59726E85862N63K32m95r31q10n49n49q12j256j802k143k061j893k035k152j659
$$ plain form
59710 567510 566636 565921 564689 563264 562537 562826 563773 565105 566873 569089 571625 574458 577669 581333 585668
59695 585668 590976 597164 603624 609850 615730 620898 624371 625423 624525 622873 621249 619765 618334 616870
59681 616870 615270 613635 612194 610690 608246 604288 599148 593379 587066 580321 573822 568169 563213 558671
59667 558671 554806 551717 548627 544911 541383 539467 539299 539670 539679 539463 539393 539628 540566 542807 546397 550732 555310
59650 555310 560001 564565 568531 571539 573350 573633 572350 570161 567751 564879 560737 555091 548397 541025
59636 541025 533209 525688 519499 515014 511822 509487 507782 506252 504409 502402 500748 499404 497783 495704
59622 495704 493489 491091 487945 483892 479548 475552 471994 468625 465053 460746 455569 450331 446113 443060
59608 443060 440536 438381 437146 437021 437522 438407 439966 442044 443661 444119 443851 443756 444235 445240 446685 448389
$$ packed form
59710E67510q74p15j232j425p27K89R47J332J768K216K536K833L211L664M335
59695E85668N308O188O460O226N880N168L473J052q98j652j624j484j431j464
59681F16870j600j635j441j504k444l958n140n769o313o745o499n653m956m542
59667E58671l865l089l090l716l528j916j68L71Rk16p0K35R38K241L590M335M578
59650E55310M691M564L966L008J811K83j283k189k410k872m142n646o694p372
59636E41025p816p521o189m485l192k335j705j530j843k007j654j344j621k079
59622D95704k215k398l146m053m344l996l558l369l572m307n177n238m218l053
59608D43060k524k155j235j25N01Q85J559K078J617M58k68r5M79J005J445J704
$$ plain form
59592 448389 450044 451578 453197 454926 456470 457621 458311 458281 457307 455826 454691 454090 453337 451830 449574 446647
59576 446647 442980 438969 435544 433179 431378 429491 427493 425640 423918 422226 420649 419201 417717 416251
59562 416251 415108 414276 413330 412177 411331 411163 411412 411777 412420 413469 414533 415187 415606 416304 417600 419636 422610
59545 422610 426544 431111 436054 441644 448470 456927 467089 478980 492911 509508 528956 549561 567304
59532 567304 577825 579424 573883 564491 553938 544036 536194 531129 528470 527351 527283 528132 529560 531036
59518 531036 532258 533183 533663 533295 531618 528406 523889 518679 513263 507549 501102 493824 486133 478635 471984
59503 471984 466897 463719 461813 459857 456992 453499 450335 448260 447378 447169 447012 446912 447554 449293 451384
59488 451384 452726 453145 453373 454022 455247 457233 460184 463832 467612 471337 475133 478917 482652 486939 492419
$$ packed form
59592D48389J655J534J619J729J544J151O90l0r74j481j135o01p53j507k256k927
59576D46647l667m011l425k365j801j887j998j853j722j692j577j448j484j466
59562D16251j143q32r46j153q46j68K49L65O43J049J064O54M19O98J296K036K974
59545D22610L934M567M943N590O826Q457J0162J1891J3931J6597J9448K0605J7743
59532E67304J0521J599n541r392j0553r902p842n065k659j119o8Q49J428J476
59518E31036J222R25M80l68j677l212m517n210n416n714o447p278p691p498o651
59503D71984n087l178j906j956k865l493l164k075q82k09j57j00O42J739K091
59488D51384J342M19K28O49J225J986K951L648L780L725L796L784L735M287N480
$$ plain form
59473 492419 498638 504300 508596 511481 512836 512485 511048 509635 508511 507095 505383 504184 503688 503137 502424
59458 502424 502791 505203 509020 513073 517224 522068 527788 534110 540891 548085 555493 562958 570387 577230
59444 577230 582434 585244 585581 583547 579275 573446 567121 560786 554228 547540 541345 535844 530635 525741
59430 525741 521775 518725 515680 512251 509218 507279 506267 506135 507632 511361 517203 525199 535838 548890
59416 548890 563224 578501 595833 616188 639563 666246 696585 727808 752954 765389 763915 752163
59404 752163 734444 714253 695411 681561 674222 673262 678987 691392 707092 719331 722243 714243 697206
59391 697206 674157 648431 623416 601496 583363 568673 556880 547350 539530 533357 528994 526119
59379 526119 524140 523082 523412 524991 527068 529406 532540 536736 541508 546400 551440 556590 561447 565791
$$ packed form
59473D92419O219N662M296K885J355l51j437j413j124j416j712j199m96n51p13
59458E02424L67K412L817M053M151M844N720O322O781P194P408P465P429O843
59444E77230N204K810L37k034m272n829o325o335o558o688o195n501n209m894
59430E25741l966l050l045l429l033j939j012j32J497L729N842P996J0639J3052
59416E48890J4334J5277J7332K0355K3375K6683L0339L1223K5146J2435j474j1752
59404G52163j7719k0191j8842j3850p339r60N725J2405J5700J2239K912q000j7037
59391F97206k3049k5726k5015k1920j8133j4690j1793r530p820o173m363k875
59379E26119j979j058L30J579K077K338L134M196M772M892N040N150M857M344
$$ plain form
59365 565791 569900 574139 578744 584016 590133 596724 603220 609643 616416 623505 630471 637391 644906 653216
59351 653216 661767 670112 678416 686915 695542 704341 713708 723944 734883 746027 756736 766383 774775
59338 774775 782279 789058 794366 797221 797597 796258 793556 789121 782702 774582 765203 755070 744974 735518
59324 735518 726439 717125 707794 699317 691908 684913 678032 671868 666977 663122 659789 656785 654095 651752
59310 651752 650032 649259 649306 649901 651393 654475 659163 665014 672479 682784 695687 708032 715354 714779 706272
59295 706272 691855 674218 655617 637293 619781 603725 589947 578576 568712 559408 550728 543545
59283 543545 538488 535298 533011 530682 528200 526441 526380 528109 531089 535124 540466 546986 554084 561625 570211
59268 570211 580022 589935 598387 604894 610284 615580 620940 625591 628505 629120 627520 624052 618946 612447
$$ packed form
59365E65791M109M239M605N272O117O591O496O423O773P089O966O920P515Q310
59351F53216Q551Q345Q304Q499Q627Q799R367J0236J0939J1144J0709R647Q392
59338G74775P504O779N308K855L76j339k702m435o419q120r379j0133j0096r456
59324G35518r079r314r331q477p409o995o881o164m891l855l333l004k690k343
59310F51752j720p73M7N95J492L082M688N851P465J0305J2903J2345P322n75q507
59295G06272j4417j7637j8601j8324j7512j6056j3778j1371r864r304q680p183
59283E43545n057l190k287k329k482j759o1J729K980M035N342O520P098P541Q586
59268E70211R811R913Q452O507N390N296N360M651K914O15j600l468n106o499
$$ plain form
59254 612447 605063 597438 590059 583238 577114 571415 565617 559741 554660 551157 548974 547346 546156 545936
59240 545936 547008 549284 552651 556832 561045 564620 567858 571561 575837 580122 584173 588166 591905 594861
59226 594861 596947 598282 598214 595720 591009 585675 580968 576844 572982 569610 566838 564199 561562 559719 559343
59211 559343 560005 560822 561535 562329 563156 563865 564631 565651 566711 567435 567665 567266 566013 564042 562027 560512 559406
59194 559406 558442 557696 557256 556756 555662 553803 551428 549065 547468 547248 548313 550046 552190 555045 558621
59179 558621 562191 565054 567263 569321 571636 574542 578287 582599 586735 590378 594107 598624 603981 609878
59165 609878 616291 623383 631161 639520 648159 656179 662341 666237 668771 670988 672764 673065 671140 666937
59151 666937 660763 653129 644866 636823 629317 622057 614578 606650 598437 590318 582424 574399 565942 557442
$$ packed form
59254F12447p384p625p379o821o124n699n798n876n081l503k183j628j190k20
59240E45936J072K276L367M181M213L575L238L703M276M285M051L993L739K956
59226E94861K086J335o8k494m711n334m707m124l862l372k772k639k637j843l76
59211E59343O62Q17P13P94Q27P09P66J020J060P24K30l99j253j971k015j515j106
59194E59406r64p46m40n00j094j859k375k363j597k20J065J733K144K855L576
59179E58621L570K863K209K058K315K906L745M312M136L643L729M517N357N897
59165F09878O413P092P778Q359Q639Q020O162L896K534K217J776L01j925m203
59151F66937o174p634q263q043p506p260p479p928q213q119p894q025q457q500
$$ plain form
59137 557442 549622 542592 535838 529207 523209 518211 514027 510492 507760 505720 503859 502085 500948 500565
59123 500565 500088 498924 497909 498538 501422 506170 512319 519573 527416 535297 543263 551834 561237 571165 581218
59108 581218 591160 600815 609991 618523 626190 632743 638200 642881 646968 650283 652678 654257 654988 654499 652646
59093 652646 649946 647035 644019 640739 637411 634539 632334 630661 629419 628665 628339 628021 626897 624038 619062
59078 619062 612626 605852 599149 592067 584420 576917 570251 564233 558394 552963 548498 544833 541180 537193
59064 537193 533272 529713 526186 522288 518247 514735 512075 509831 507226 503936 500394 497288 494875 492989
59050 492989 491546 490671 490323 490178 489990 489779 489598 489354 488988 488567 488189 487999 488188 488691 489052 489065 489348 490741
59032 490741 493221 496013 498684 501459 504572 508197 512998 519701 527850 535993 543540 551491 560808 570986
$$ packed form
59137E57442p820p030o754o631n998m998m184l535k732k040j861j774j137l83
59123E00565m77j164j015O29K884M748O149P254P843P881P966Q571R403R928J0053
59108E81218R942R655R176Q532P667O553N457M681M087L315K395J579P31m89j853
59093F52646k700k911l016l280l328k872k205j673j242p54l26l18j124k859m976
59078F19062o436o774o703p082p647p503o666o018n839n431m465l665l653l987
59064E37193l921l559l527l898m041l512k660k244k605l290l542l106k413j886
59050D92989j443q75l48j45j88k11j81k44l66m21l78j90J89N03L61J3K83J393
59032D90741K480K792K671K775L113L625M801O703Q149Q143P547P951R317J0178
$$ plain form
59018 570986 581004 590865 601212 611900 621818 629887 635579 638743 639643 639057 637763 636012 633835 631617
59004 631617 629943 629093 629070 629878 631462 633675 636639 640772 646085 651746 656757 660713 663578 665153 665303
58989 665303 664439 663212 661804 659816 656732 652311 646809 641051 635964 631860 628520 626080 625198 626032 627701
58974 627701 629353 631323 634681 639963 646918 655171 664536 674761 685446 696252 706973 717450 727570
58961 727570 737123 745613 752468 757516 760980 762950 763260 761810 758555 753194 745490 735897 725250 713851
58947 713851 701559 688737 676164 663926 651488 639100 628040 619015 611363 604315 597964 592384
58935 592384 586971 581452 576538 572741 569507 566397 564070 563018 562271 560618 558411 556857 556126 555444 554627
58920 554627 554201 554203 554063 553587 553100 552730 552455 552689 553915 555867 557877 559890 562402 565647 569593 574464 580520
$$ packed form
59018E70986J0018R861J0347J0688R918Q069N692L164R00n86j294j751k177k218
59004F31617j674q50k3Q08J584K213K964M133N313N661N011L956K865J575J50
58989F65303q64j227j408j988l084m421n502n758n087m104l340k440q82Q34J669
58974F27701J652J970L358N282O955Q253R365J0225J0685J0806J0721J0477J0120
58961G27570R553Q490O855N048L464J970L10j450l255n361p704r593j0647j1399
58947G13851j2292j2822j2573j2238j2438j2388j1060r025p652p048o351n580
58935E92384n413n519m914l797l234l110k327j052p47j653k207j554p31o82q17
58920E54627m26Kj40m76m87l70k75K34J226J952K010K013K512L245L946M871O056
$$ plain form
58903 580520 587584 595532 604860 615952 628139 640298 651962 662974 672579 680084 686150 692291 699265
58890 699265 706980 715813 726725 739951 754705 770387 787098 804638 821842 837336 850391 860871
58878 860871 868882 874652 878308 879680 878604 875288 870053 862969 854213 844420 834194 823678 813159
58865 813159 803580 795644 788827 782075 775137 768431 762018 755575 748992 742058 733945 724065 713134 702342
58851 702342 691734 680540 668865 657789 647834 638565 629799 622028 615417 609396 603475 597554 591269
58838 591269 584019 575888 567717 560024 552652 545575 539240 533884 529325 525606 523094 521702 520734 519723
58824 519723 518851 518445 518699 519907 522312 525599 529165 532890 537028 541429 545565 549282 552812 556118 558983
58809 558983 561639 564489 567264 569271 570441 571291 571910 571804 570732 568890 566341 563090 559629 556441 553077
$$ packed form
58903E80520P064P948R328J1092J2187J2159J1664J1012R605P505O066O141O974
58890F99265P715Q833J0912J3226J4754J5682J6711J7540J7204J5494J3055J0480
58878H60871Q011N770L656J372j076l316n235p084q756r793j0226j0516j0519
58865H13159r579p936o817o752o938o706o413o443o583o934q113r880j0931j0792
58851G02342j0608j1194j1675j1076r955r269q766p771o611o021n921n921o285
58838E91269p250q131q171p693p372p077o335n356m559l719k512j392r68j011
58824E19723q72m06K54J208K405L287L566L725M138M401M136L717L530L306K865
58809E58983K656K850K775K007J170Q50O19j06j072j842k549l251l461l188l364
$$ plain form
58794 553077 548689 543448 538426 534140 530304 526965 524618 523044 521292 519222 517949 518344 520049 522418
58780 522418 525446 529288 533671 538335 543353 548616 553579 557833 561310 563752 564582 563534 560775 556386
58766 556386 550450 543666 537024 530737 524352 518002 512583 508506 505146 501856 498708 495998 493807 492284
58752 492284 491551 491214 490756 490509 491305 493054 494667 495620 496545 498024 499867 501987 504978 509250 514411 519911
58736 519911 525555 531048 535953 540525 545712 551788 557753 562543 566200 569428 572732 576361 580457 584775
58722 584775 588798 592369 595744 598948 601810 604699 608437 613327 619034 625481 632985 641365 649790 657606
58708 657606 664394 669238 671149 670421 668445 665845 661873 655856 647957 638155 625811 610922 594703 578315
58694 578315 562007 546024 531310 518592 507640 498021 489705 482547 476137 470656 466822 464425 461981
$$ packed form
58794E53077m388n241n022m286l836l339k347j574j752k070j273L95J705K369
58780E22418L028L842M383M664N018N263M963M254L477K442Q30j048k759m389
58766E56386n936o784o642o287o385o350n419m077l360l290l148k710k191j523
58752D92284p33l37m58k47P96J749J613R53R25J479J843K120K991M272N161N500
58736E19911N644N493M905M572N187O076N965M790L657L228L304L629M096M318
58722E84775M023L571L375L204K862K889L738M890N707O447P504Q380Q425P816
58708F57606O788M844J911p28j976k600l972o017p899r802j2344j4889j6219j6388
58694E78315j6308j5983j4714j2718j0952r619q316p158o410n481l834k397k444
$$ plain form
58681 461981 458435 454197 449920 445411 440545 436193 433269 431617 430594 430032 430032 430588 432018 434929 439209
58666 439209 443943 448854 454854 462598 471484 480616 489508 497127 501638 502262 500429 497959 495031 490983
58652 490983 486179 481746 478047 474589 471030 467310 463309 459288 456197 454620 453829 452685 451018 449417
58638 449417 448242 447635 447926 449135 450495 451316 451914 452991 454549 456118 457636 459297 460909 462096 462927
58623 462927 463742 464589 465258 465619 465718 465876 466799 468971 471886 474632 477327 480987 485775 490551 494554 498336
58607 498336 502439 506313 509299 511597 513485 514622 514923 515172 515857 516241 515461 513721 511668 509455 507223
58592 507223 505630 505039 504984 505208 506392 509108 512987 517629 523419 530551 538240 545730 553182 560780 568031
58577 568031 574798 581821 589182 595459 599680 603122 607904 614628 622593 631422 641161 651610 662916 676215
$$ packed form
58681D61981l546m238m277m509m866m352k924j652j023n62%N56J430K911M280
58666D39209M734M911O000P744Q886R132Q892P619M511O24j833k470k928m048
58652D90983m804m433l699l458l559l720m001m021l091j577p91j144j667j601
58638D49417j175o07K91J209J360Q21N98J077J558J569J518J661J612J187Q31
58623D62927Q15Q47O69L61R9J58R23K172K915K746K695L660M788M776M003L782
58607D98336M103L874K986K298J888J137L01K49O85L84p80j740k053k213k232
58592E07223j593n91n5K24J184K716L879M642N790P132P689P490P452P598P251
58577E68031O767P023P361O277M221L442M782O724P965Q829R739J0449J1306J3299
$$ plain form
58563 676215 692432 711034 731073 752704 776440 801529 826299 849549 870443 887622 899682
58552 899682 906283 908013 905724 900768 894999 889427 883519 876756 870038 864523 859898 854914 848809 841097
58538 841097 830799 817219 800901 782835 763470 743396 723974 706129 689478 673839 660523
58527 660523 650745 643778 638089 633369 629960 627323 624740 622713 621927 621486 619849 616959 613863 610832 607437
58512 607437 603948 601020 598506 596032 594205 593697 593689 592862 591426 590626 590697 590834 590681 590320 589302 587343 585529
58495 585529 585229 586155 587005 587537 588500 590071 592019 594901 599372 604660 609433 613877 619283 625966 633239
58480 633239 641149 650519 661488 673558 686852 701734 717397 732314 745732 757290 765706 769549
58468 769549 769074 765673 759882 751556 741591 731664 722498 714003 706935 702671 701500 702639 705731 710828
$$ packed form
58563F76215J6217J8602K0039K1631K3736K5089K4770K3250K0894J7179J2060
58552H99682O601J730k289m956n769n572n908o763o718n515m625m984o105p712
58538H41097j0298j3580j6318j8066j9365k0074j9422j7845j6651j5639j3316
58527F60523r778o967n689m720l409k637k583k027p86m41j637k890l096l031l395
58512F07437l489k928k514k474j827n08qq27j436q00P1J37j53l61j018j959j814
58495E85529l00R26Q50N32R63J571J948K882M471N288M773M444N406O683P273
58480F33239P910R370J0969J2070J3294J4882J5663J4917J3418J1558Q416L843
58468G69549m75l401n791q326r965r927r166q495p068m264j171J139L092N097
$$ plain form
58454 710828 717294 724398 732637 742809 754010 764115 771951 777488 780388 780087 776911 771497 763592 753098
58440 753098 741764 731976 724335 718119 713479 711091 710218 709354 708593 709354 711956 715391 719220 723844 729292
58425 729292 735597 743852 754801 766852 777542 786400 794214 800245 802791 802108 800015 796761 790952 782583
58411 782583 773566 765007 756385 747597 739556 732559 726245 721173 718276 716797 715009 712891 711896 712325 713343
58396 713343 715237 718963 723693 727609 731087 736202 742951 748918 752947 756178 759040 760099 758521 755013
58382 755013 749782 742193 733031 724580 717986 712940 710174 711397 716329 722536 728766 735811 743685 750934
58368 750934 757414 764911 774192 784011 793693 804138 815671 827485 839684 853246 867583 880842
58356 880842 892919 905272 917544 927499 934637 940538 945246 946938 945953 945498 947248 949630 951586 954596
$$ packed form
58454G10828O466P104Q239J0172J1201J0105P836N537K900l01l176n414p905j0494
58440G53098j1334r788p641o216m640k388q73q64p61P61K602L435L829M624N448
58425G29292O305Q255J0949J2051J0690Q858P814O031K546o83k093l254n809q369
58411G82583r017q559q622q788q041o997o314n072k897j479j788k118r95M29J018
58396G13343J894L726M730L916L478N115O749N967M029L231K862J059j578l508
58382G55013n231p589r162q451o594n046k766J223M932O207O230P045P874P249
58368G50934O480P497R281R819R682J0445J1533J1814J2199J3562J4337J3259
58356H80842J2077J2353J2272R955P138N901M708J692r85m55J750K382J956L010
$$ plain form
58342 954596 959737 966031 973036 981927 992712 1003538 1013936 1025643 1039058 1052190 1064351 1077578
58330 1077578 1093010 1109079 1124570 1140131 1155464 1168426 1178472 1187620 1196579 1203296 1206834 1209289
58318 1209289 1212358 1215386 1218305 1222913 1229558 1236011 1241337 1247556 1255987 1265536 1276054 1289464 1305789
58305 1305789 1321875 1336004 1350049 1365313 1380197 1393972 1408833 1425958 1443350 1459666 1476408
58294 1476408 1494329 1511684 1528098 1546028 1566241 1586088 1604452 1624040 1646520 1669989 1693674
58283 1693674 1720294 1750888 1782121 1811859 1842876 1877856 1915153 1952666 1991308 2031353 2069944
58272 2069944 2105728 2141608 2179658 2217773 2254553 2292748 2334566 2378396 2423529 2472979 2528068
58261 2528068 2585380 2642814 2703355 2769095 2836970 2904439 2973718 3046272 3118899 3189779 3262560
$$ packed form
58342I54596N141O294P005Q891J0785J0826J0398J1707J3415J3132J2161J3227
58330A077578J5432J6069J5491J5561J5333J2962J0046R148Q959O717L538K455
58318A209289L069L028K919M608O645O453N326O219Q431R549J0518J3410J6325
58305A305789J6086J4129J4045J5264J4884J3775J4861J7125J7392J6316J6742
58294A476408J7921J7355J6414J7930K0213J9847J8364J9588K2480K3469K3685
58283A693674K6620L0594L1233K9738L1017L4980L7297L7513L8642M0045L8591
58272B069944L5784L5880L8050L8115L6780L8195M1818M3830M5133M9450N5089
58261B528068N7312N7434O0541O5740O7875O7469O9279P2554P2627P0880P2781
$$ plain form
58250 3262560 3339949 3419183 3498509 3581892 3672314 3766719 3862872 3964814 4076055 4193812 4315550
58239 4315550 4444551 4583327 4728503 4878262 5037747 5210951 5394643 5586580 5791801
58230 5791801 6014160 6250078 6497778 6763824 7052920 7360598 7684335 8032235 8411843
58221 8411843 8820612 9257006 9730540 10250421 10815270 11425215 12092904 12830968 13640973
58212 13640973 14527721 15511965 16615713 17849110 19227121 20784778 22560381 24580882
58204 24580882 26883996 29540273 32637216 36264735 40541344 45633588 51722315 58971365
58196 58971365 67557455 77706571 89680675 103787479 120472552 140377406 164255077
58189 164255077 192850252 226794175 266178536 309535011 352835244 389785860 413895599
$$ packed form
58250C262560P7389P9234P9326Q3383R0422R4405R6153J01942J11241J17757J21738
58239D315550J29001J38776J45176J49759J59485J73204J83692J91937K05221
58230E791801K22359K35918K47700K66046K89096L07678L23737L47900L79608
58221H411843M08769M36394M73534N19881N64849O09945O67689P38064Q10005
58212A3640973Q86748R84244J103748J233397J378011J557657J775603K020501
58204B4580882K303114K656277L096943L627519M276609N092244O088727P249050
58196E8971365Q586090J0149116J1974104J4106804J6685073J9904854K3877671
58189A64255077K8595175L3943923L9384361M3356475M3300233L6950616K4109739
$$ plain form
58182 413895599 421117010 411233785 387306969 354021003 316130298 277530575 240885993
58175 240885993 207658646 178409660 153160468 131637808 113411977 98012847 85015274
58168 85015274 74050025 64781156 56914732 50219645 44512758 39630459 35431299 31810152
58160 31810152 28684455 25972130 23598251 21511433 19674190 18044509 16582746 15267901
58152 15267901 14090058 13032623 12076014 11211600 10436784 9741098 9110272 8539037 8027173
58143 8027173 7567091 7146909 6761592 6409978 6084843 5776832 5485070 5213991 4962692
58134 4962692 4726385 4504884 4300562 4110800 3930855 3761332 3605062 3459767 3321301
58125 3321301 3190784 3070947 2958782 2849472 2744433 2647904 2558500 2471632 2387602 2309942
$$ packed form
58182D13895599P221411r883225k3926816l3285966l7890705l8599723l6644582
58175B40885993l3227347k9248986k5249192k1522660j8225831j5399130j2997573
58168H5015274j0965249r268869p866424o695087n706887m882299m199160l621147
58160C1810152l125697k712325k373879k086818j837243j629681j461763j314845
58152A5267901j177843j057435r56609q64414p74816o95686o30826n71235n11864
58143H027173m60082m20182l85317l51614l25135l08011k91762k71079k51299
58134D962692k36307k21501k04322j89762j79945j69523j56270j45295j38466
58125C321301j30517j19837j12165j09310j05039r6529q9404q6868q4030p7660
$$ plain form
58115 2309942 2238161 2169158 2103521 2043530 1987126 1930596 1875148 1824361 1777134 1729564 1681801
58104 1681801 1636688 1593406 1548733 1503001 1458797 1415370 1370260 1324987 1283319 1245380 1209065
58093 1209065 1175761 1148852 1127801 1109270 1092914 1080544 1070805 1060232 1048655 1038233 1028102
58082 1028102 1015311 1000202 985515 970876 953449 933569 914559 897291 879806 862070 846214
58071 846214 832122 817408 801821 787399 774336 760876 747163 735124 724718 714278 704234
58060 704234 696468 690287 683058 674575 666743 659281 649945 638953 628987 620706 612296 603567 596432 590978
58046 590978 584968 577774 571116 565442 559178 552110 546073 541571 536920 531372 526094 521595 516991 512194
58032 512194 507993 503732 497743 490282 483196 476618 468943 460136 451984 444849 437327 429474 423280 419336
$$ packed form
58115B309942p1781o9003o5637n9991n6404n6530n5448n0787m7227m7570m7763
58104A681801m5113m3282m4673m5732m4204m3427m5110m5273m1668l7939l6315
58093A209065l3304k6909k1051j8531j6356j2370r739j0573j1577j0422j0131
58082A028102j2791j5109j4687j4639j7427j9880j9010j7268j7485j7736j5856
58071H46214j4092j4714j5587j4422j3063j3460j3713j2039j0406j0440j0044
58060G04234p766o181p229q483p832p462r336j0992r966q281q410q729p135n454
58046E90978o010p194o658n674o264p068o037m502m651n548n278m499m604m797
58032E12194m201m261n989p461p086o578p675q807q152p135p522p853o194l944
$$ plain form
58018 419336 415865 411657 407297 403014 398028 392618 388309 385494 383115 381018 380207 380529 380552 380055 380237 381214
58002 381214 381698 381400 381397 381946 382265 382534 383653 384997 384987 383954 383825 384798 384985 383424 380698 376451 369275
57985 369275 359571 349665 340518 331047 321289 313357 308385 305170 302700 301472 301407 301069 300035 299662 300503
57970 300503 301297 301503 302433 304650 306531 306785 306426 306900 308002 308907 309636 310308 310366 309598 308702 308049 307162 305915
57952 305915 304834 303719 301556 298296 295171 292835 290801 289047 288409 288934 289641 290370 292082 294886 297707
57937 297707 300385 304140 309342 314814 320028 325994 333129 340159 345985 350841 354787 356943 357154 356620 355885
57922 355885 353950 350325 346263 342823 339342 334908 329889 324963 319998 314882 310211 306270 302641 299474
57908 299474 297717 297401 297189 296409 295953 296393 296849 296685 296743 297771 299106 299931 300568 301509 302538 303747 306080
$$ packed form
58018D19336l471m208m360m283m986n410m309k815k379k097q11L22K3m97J82R77
58002C81214M84k98lN49L19K69J119J344j0j033j29R73J87j561k726m247p176
57985C69275r704r906r147r471r758p932m972l215k470j228o5l38j034l73Q41
57970C00503P94K06R30K217J881K54l59M74J102R05P29O72N8p68q96o53q87j247
57952C05915j081j115k163l260l125k336k034j754o38N25P07P29J712K804K821
57937B97707K678L755N202N472N214N966P135P030N826M856L946K156K11n34p35
57922C55885j935l625m062l440l481m434n019m926m965n116m671l941l629l167
57908B99474j757l16k12p80m56M40M56j64N8J028J335Q25O37R41J029J209K333
$$ plain form
57891 306080 309823 313773 316848 319324 321641 323304 323896 323891 323532 322209 319840 317494 315667 313297 309556
57876 309556 305324 301690 298180 293769 288693 284041 280373 277693 275994 274938 273775 272364 271494 271607 272203
57861 272203 272989 274415 276443 278126 279245 281062 284552 289094 293871 299291 305938 313195 319993 326021
57847 326021 331298 335543 338852 341961 344948 346722 346662 345600 344307 342169 338423 333601 328629 323577 318453
57832 318453 314177 311481 309577 307075 303645 299837 296061 292664 290259 289036 288411 288088 288630 290216 291823
57817 291823 292487 292427 292066 290953 288634 285587 282211 277842 271877 265069 258623 252774 247279 242484 238768
57802 238768 235592 232193 228719 225723 223155 220748 218824 217879 217813 218195 218638 218500 217121 215002 213732 214058
57786 214058 215081 216012 217457 220044 223080 225770 228682 232765 237790 243012 248548 254950 262177 269958
$$ packed form
57891C06080L743L950L075K476K317J663N92nl59j323k369k346j827k370l741
57876C09556m232l634l510m411n076m652l668k680j699j056j163j411q70J13N96
57861B72203P86J426K028J683J119J817L490M542M777N420O647P257O798O028
57847C26021N277M245L309L109K987J774o0j062j293k138l746m822m972n052n124
57832C18453m276k696j904k502l430l808l776l397k405j223o25l23N42J586J607
57817B91823O64o0l61j113k319l047l376m369n965o808o446n849n495m795l716
57802B38768l176l399l474k996k568k407j924r45o6L82M43j38j379k119j270L26
57786B14058J023R31J445K587L036K690K912M083N025N222N536O402P227P781
$$ plain form
57772 269958 278276 286454 292839 296627 299075 301710 304242 305509 305420 304509 302489 298885 294490 290668 287608
57757 287608 284590 281375 278044 274135 269404 264952 262120 260666 259368 257984 257213 257115 257064 257117 258023 259869
57741 259869 261838 263286 264120 264348 264186 264313 265133 266140 266875 267919 269905 272138 273457 274019 274985 276728
57725 276728 278609 280294 282142 284411 287067 290156 293480 296199 297710 298563 299651 300918 301727 301933 301654
57710 301654 300588 298590 296292 294094 291184 286764 281539 276768 272591 268718 265956 265330 266182 266918 267298
57695 267298 268255 269634 269998 268722 266572 264013 260560 256088 251298 246555 241575 236570 232426 229409 226893
57680 226893 224713 223678 224392 226605 230136 235532 243507 254506 269008 287539 310314 337643 370709
57667 370709 411066 459017 512561 567105 615415 648939 661513 652632 626651 589130 544755 497818
$$ packed form
57772B69958Q318Q178O385L788K448K635K532J267q9r11k020l604m395l822l060
57757B87608l018l215l331l909m731m452k832j454j298j384p71r8n1N3R06J846
57741B59869J969J448Q34K28j62J27Q20J007P35J044J986K233J319N62R66J743
57725B76728J881J685J848K269K656L089L324K719J511Q53J088J267Q09K06k79
57710C01654j066j998k298k198k910m420n225m771m177l873k762o26Q52P36L80
57695B67298R57J379L64j276k150k559l453m472m790m743m980n005m144l017k516
57680B26893k180j035P14K213L531N396P975J0999J4502J8531K2775K7329L3066
57667C70709M0357M7951N3544N4544M8310L3524J2574q881k5981l7521m4375m6937
$$ plain form
57655 497818 452366 411084 375024 344602 319810 299532 282073 266784 254239 244748 237801 232941
57643 232941 229939 227932 225662 222919 220652 219360 218468 217544 217025 217346 218275 219374 220292 220453 219415 217672
57627 217672 216141 214810 212898 210343 207985 206136 204288 202429 201345 201197 201012 200048 198647 197304 195938
57612 195938 194477 193190 191993 190375 188359 186570 185089 183290 181222 180000 180273 181295 182049 182392 182579
57597 182579 182556 182266 181831 180961 178977 175901 172706 170014 167360 164167 160725 157718 155520 154304 154058 154099
57581 154099 153409 151870 150458 149844 149610 149214 148833 148759 148727 148360 147639 146532 144838 142722 140744 139093 137500
57564 137500 136044 135186 134784 134102 133110 132733 133379 134248 134631 134868 135356 135608 135102 134313 134179 135119 137113 139967
57546 139967 142896 144581 144417 143208 142123 141506 141134 140931 140827 140562 140180 140182 140702 141098 140842 140180 139526 138872
$$ packed form
57655D97818m5452m1282l6060l0422k4792k0278j7459j5289j2545r491o947m860
57643B32941l002k007k270k743k267j292q92r24n19L21R29J099R18J61j038j743
57627B17672j531j331j912k555k358j849j848j859j084j48j85r64j401j343j366
57612A95938j461j287j197j618k016j789j481j799k068j222K73J022P54L43J87
57597A82579k3k90m35q70j984l076l195k692k654l193l442l007k198j216k46M1
57581A54099o90j539j412o14k34l96l81p4l2l67p21j107j694k116j978j651j593
57564A37500j456q58m02o82r92l77O46Q69L83K37M88K52n06p89j34R40J994K854
57546A39967K929J685j64j209j085o17l72k03j04k65l82KN20L96k56o62o54o54
$$ plain form
57528 138872 138267 138160 138681 139189 139124 138761 138669 138961 139551 140586 142113 143786 145302 146647 147726 148344 148789
57511 148789 149697 151054 152147 152781 153646 155083 156417 157053 157334 157716 157954 157708 157233 156812 156243 155456 154873
57494 154873 154573 153895 152479 150914 149727 148517 146835 145117 143951 143146 142298 141589 141232 140770 139739 138390
57478 138390 137037 135338 133060 130903 129597 128740 127487 125948 124894 124391 123673 122285 120596 119209 118382
57463 118382 117965 117594 117154 117145 118062 119284 119394 117992 116311 115538 115440 115281 115150 115499 116177 116876 117849 119240
57445 119240 120349 120556 120408 120806 121635 122186 122490 123202 124506 126088 127900 129999 131958 133342 134541 136263
57429 136263 138413 140264 141514 142402 143082 143643 144450 145621 146425 146053 144802 143739 143417 143617 144068 144614 144872
57412 144872 144597 144298 144827 146422 148708 151292 153742 155325 155632 155280 155241 155609 155650 154891 153543 152087 151042
$$ packed form
57528A38872o05j07N21N08o5l63r2K92N90J035J527J673J516J345J079O18M45
57511A48789R08J357J093O34Q65J437J334O36K81L82K38k46m75m21n69p87n83
57494A54873l00o78j416j565j187j210j682j718j166q05q48p09l57m62j031j349
57478A38390j353j699k278k157j306q57j253j539j054n03p18j388j689j387q27
57463A18382m17l71m40rR17J222J10j402j681p73r8j59j31L49O78O99R73J391
57445A19240J109K07j48L98Q29N51L04P12J304J582J812K099J959J384J199J722
57429A36263K150J851J250Q88O80N61Q07J171Q04l72j251j063l22K00M51N46K58
57412A44872k75k99N29J595K286K584K450J583L07l52l9L68M1p59j348j456j045
$$ plain form
57395 151042 150911 151676 152588 153067 153501 154560 156043 157197 157876 158667 160041 162070 164781 168087 171490 174407
57379 174407 176643 178161 178732 178316 177401 176449 175467 174533 174085 174016 173261 171233 169050 168353 169330 170942 172594
57362 172594 174454 176442 178110 179471 180870 182136 182784 182997 183440 184200 184815 185298 186210 187724 189472 191332
57346 191332 193517 195874 197813 199027 199654 199817 199597 199367 199506 199862 200060 200170 200619 201674 203465 206079
57330 206079 209080 211562 213343 215450 218600 221944 224336 226103 228290 230716 232223 232611 232950 234123 236233
57315 236233 239255 243005 246588 249113 250878 252765 254728 256173 257541 259983 263465 266697 269061 271179
57301 271179 273388 275168 276410 277910 280146 282760 285565 288901 292654 296181 299535 303523 308197 312556
57287 312556 316219 320086 324762 329542 333637 337318 341090 344796 348280 352032 356400 360909 365041 368987
$$ packed form
57395A51042j31P65R12M79M34J059J483J154O79P91J374K029K711L306L403K917
57379A74407K236J518N71m16r15r52r82r34m48o9p55k028k183o97R77J612J652
57362A72594J860J988J668J361J399J266O48K13M43P60O15M83R12J514J748J860
57346A91332K185K357J939J214O27J63k20k30J39L56J98J10M49J055J791K614
57330B06079L001K482J781K107L150L344K392J767K187K426J507L88L39J173K110
57315B36233L022L750L583K525J765J887J963J445J368K442L482L232K364K118
57301B71179K209J780J242J500K236K614K805L336L753L527L354L988M674M359
57287C12556L663L867M676M780M095L681L772L706L484L752M368M509M132L946
$$ plain form
57273 368987 373059 377171 381469 386671 393018 399581 405326 410385 415698 421831 428641 435692 442598 449307
57259 449307 456286 463971 471959 479313 485692 491456 496727 501333 505836 511436 518460 525902 532849 539385
57245 539385 545682 551404 556688 562727 570492 579597 589122 598795 608689 618570 628463 639265 651870 666048
57231 666048 680825 695563 710040 723980 737291 750513 764329 778714 792984 806574 819543
57220 819543 832515 846298 861251 876928 892673 908544 925130 942539 960313 978369 997183
57209 997183 1016792 1036515 1055977 1075590 1095628 1115605 1135034 1154158 1173471 1193128 1213186
57198 1213186 1233855 1255114 1276610 1298165 1319872 1341649 1363476 1386142 1410769 1437345 1464666
57187 1464666 1491997 1519728 1548012 1575986 1603036 1629834 1657274 1685127 1712406 1738416 1762867
$$ packed form
57273C68987M072M112M298N202O347O563N745N059N313O133O810P051O906O709
57259D49307O979P685P988P354O379N764N271M606M503N600P024P442O947O536
57245E39385O297N722N284O039P765R105R525R673R894R881R893J0802J2605J4178
57231F66048J4777J4738J4477J3940J3311J3222J3816J4385J4270J3590J2969
57220H19543J2972J3783J4953J5677J5745J5871J6586J7409J7774J8056J8814
57209I97183J9609J9723J9462J9613K0038J9977J9429J9124J9313J9657K0058
57198A213186K0669K1259K1496K1555K1707K1777K1827K2666K4627K6576K7321
57187A464666K7331K7731K8284K7974K7050K6798K7440K7853K7279K6010K4451
$$ plain form
57176 1762867 1785736 1807640 1829696 1852378 1875057 1896990 1918027 1938056 1956811 1974810 1993502
57165 1993502 2013815 2035354 2057653 2081210 2106577 2133332 2160799 2188997 2218106 2247746 2277541
57154 2277541 2307680 2338275 2368948 2399603 2430633 2461666 2491272 2518907 2546090 2574442 2603354
57143 2603354 2630749 2655461 2677819 2698633 2718813 2739305 2760122 2779855 2797359 2813578 2830659
57132 2830659 2849616 2869848 2890528 2911325 2932035 2952653 2973815 2996340 3020446 3046100 3073860
57121 3073860 3104667 3138973 3176620 3217212 3260131 3304764 3351430 3401726 3457539 3520275 3591479
57110 3591479 3673313 3767816 3876538 4001662 4146677 4315368 4511254 4739181 5006896 5324669
57100 5324669 5704937 6163935 6723306 7409614 8253378 9289167 10554530 12086270 13917164
$$ packed form
57176A762867K2869K1904K2056K2682K2679K1933K1037K0029J8755J7999J8692
57165A993502K0313K1539K2299K3557K5367K6755K7467K8198K9109K9640K9795
57154B277541L0139L0595L0673L0655L1030L1033K9606K7635K7183K8352K8912
57143B603354K7395K4712K2358K0814K0180K0492K0817J9733J7504J6219J7081
57132B830659J8957K0232K0680K0797K0710K0618K1162K2525K4106K5654K7760
57121C073860L0807L4306L7647M0592M2919M4633M6666N0296N5813O2736P1204
57110C591479Q1834R4503J08722J25124J45015J68691J95886K27927K67715L17773
57100E324669L80268M58998N59371O86308Q43764J035789J265363J531740J830894
$$ plain form
57091 13917164 16075463 18584486 21459744 24705422 28310963 32244576 36444444 40814314
57083 40814314 45223324 49500147 53424090 56740243 59217686 60722133 61245720 60872244
57075 60872244 59716501 57888832 55494883 52645322 49456471 46044504 42520205 38983927
57067 38983927 35519958 32193745 29053425 26132297 23449904 21013321 18819854 16859810
57059 16859810 15118363 13577279 12216685 11016280 9956341 9019149 8189790 7455162
57051 7455162 6802487 6219458 5695528 5222295 4792865 4401707 4044990 3720225 3425366
57042 3425366 3158579 2918523 2704052 2513558 2345097 2197046 2068126 1956966 1862261 1783375
57032 1783375 1720340 1673529 1643963 1633255 1641176 1661652 1681507 1684847 1660442 1606450 1529404 1439396
$$ packed form
57091A3917164K158299K509023K875258L245678L605541L933613M199868M369870
57083D0814314M409010M276823L923943L316153K477443J504447N23587l73476
57075F0872244j155743j827669k393949k849561l188851l411967l524299l536278
57067C8983927l463969l326213l140320k921128k682393k436583k193467j960044
57059A6859810j741447j541084j360594j200405j059939r37192q29359p34628
57051G455162o52675n83029n23930m73233m29430l91158l56717l24765k94859
57042C425366k66787k40056k14471j90494j68461j48051j28920j11160r4705p8886
57032A783375o3035m6811k9566j0708P921K0476J9855L340k4405n3992p7046r0008
$$ plain form
57020 1439396 1345529 1253982 1168250 1090074 1020112 958217 903567 854959 811347 772165 737021
57009 737021 705218 675952 648981 624605 602730 582436 562754 543506 525020 507372 490350
56998 490350 473860 457990 442896 428904 416357 405072 394398 384276 375720 369665 365885 363769
56986 363769 363750 367095 374481 385434 398712 412161 422453 426309 422596 412750 399125 383477 366945
56973 366945 350516 335109 321567 310670 302748 297353 293806 291931 291803 293158 295865 300746 309092
56960 309092 321448 337648 357763 381837 408388 433984 454577 466907 469027 460849 444536 423574
56948 423574 400973 378611 357867 339697 324023 310170 298262 289386 284152 282128 283008 287414 296030
56935 296030 308746 325205 345608 370519 400154 433635 467965 497655 516675 521790 513825 495807
$$ packed form
57020A439396r3867r1547q5732p8176o9962o1895n4650m8608m3612l9182l5144
57009G37021l1803k9266k6971k4376k1875k0294j9682j9248j8486j7648j7022
56998D90350j6490j5870j5094j3992j2547j1285j0674j0122q556o055l780k116
56986C63769j9L345P386J0953J3278J3449J0292L856l713r846j3625j5648j6532
56973C66945j6429j5407j3542j0897p922n395l547j875j28J355K707M881Q346
56960C09092J2356J6200K0115K4074K6551K5596K0593J2330K120q178j6313k0962
56948D23574k2601k2362k0744j8170j5674j3853j1908q876n234k024Q80M406Q616
56935B96030J2716J6459K0403K4911K9635L3481L4330K9690J9020N115p965j8018
$$ plain form
56923 495807 470808 441691 411394 382211 355136 330448 308398 288904 271332 255262 241030
56912 241030 229028 218962 210283 202853 196745 191823 187890 184794 182075 179098 175857 173117 171415 170546
56898 170546 170353 171282 173642 177031 181085 186244 193169 201897 212154 223990 237535 252504 268468
56885 268468 285067 301283 314866 323220 324867 319831 309163 294730 279067 264491 252100 241896
56873 241896 233760 227948 224725 224035 225704 229858 237042 247957 263065 282553 306766 336446 372214
56860 372214 413853 459986 507786 552405 587414 607262 610029 597734 574431 544596 512673 482419
56848 482419 455869 433450 415260 401684 392911 388879 389919 396640 409080 426999 451231 483738
56836 483738 526016 578413 640978 713065 790650 864792 924207 959948 968268 950670 912440 860556
$$ packed form
56923D95807k4999k9117l0297k9183k7075k4688k2050j9494j7572j6070j4232
56912B41030j2002j0066q679p430o108m922l933l096k719k977l241k740j702q69
56898A70546j93R29K360L389M054N159O925Q728J0257J1836J3545J4969J5964
56885B68468J6599J6216J3583Q354J647n036j0668j4433j5663j4576j2391j0204
56873B41896q136n812l223o90J669M154P184J0915J5108J9488K4213K9680L5768
56860C72214M1639M6133M7800M4619L5009J9848K767j2295k3303k9835l1923l0254
56848D82419k6550k2419j8190j3576q773m032J040O721J2440J7919K4232L2507
56836D83738M2278N2397O2565P2087P7585P4142N9415L5741Q320j7598l8230n1884
$$ plain form
56824 860556 801658 741171 683551 632061 587858 550281 518737 493792 476126 465357 460679 462044
56812 462044 470079 485442 508824 541085 582603 632474 687997 743895 791899 822828 830851 816084
56800 816084 783167 738156 686793 633958 583006 535650 493020 456339 426136 401680 382058
56789 382058 367202 357228 351536 349527 351603 358594 370688 387677 409640 436150 464796 491080
56777 491080 509874 517149 511432 494493 470174 441857 411312 379935 349773 322452 298057 276135
56765 276135 256995 240959 227142 214340 202719 193346 186277 180263 174256 168150 162078 155954 149867
56752 149867 144244 139441 135610 132835 130942 129368 127660 125904 124325 122791 121083 119296 117621 116176
56738 116176 115288 115352 116064 116513 116369 116142 115932 115034 113441 112582 113537 115476 116917 117699 118562 119627 120581 121707
$$ packed form
56824H60556n8898o0487n7620n1490m4203l7577l1544k4945j7666j0769m678J365
56812D62044Q035J5363K3382L2261M1518M9871N5523N5898M8004L0929Q023j4767
56800H16084l2917m5011n1363n2835n0952m7356m2630l6681l0203k4456j9622
56789C82058j4856r974n692k009K076O991J2094J6989K1963K6510K8646K6284
56777D91080J8794P275n717j6939k4319k8317l0545l1377l0162k7321k4395k1922
56765B76135j9140j6036j3817j2802j1621r373p069o014o007o106o072o124o087
56752A49867n623m803l831k775j893j574j708j756j579j534j708j787j675j445
56738A16176q88O4P12M49j44k27k10q98j593q59R55J939J441P82Q63J065R54J126
$$ plain form
56720 121707 123418 125239 126525 127781 130058 133359 136814 139965 142735 144543 144889 144559 144931 146185 147432
56705 147432 148437 149824 151532 152486 152212 151671 152005 153219 154465 155066 154984 154718 154807 155199 155277 154816 154421 154535
56687 154535 154633 154107 153341 152990 152756 151930 150784 150363 151100 152562 154303 156123 157687 158765 159561 160088 159697
56670 159697 158098 156274 155293 154752 153548 151720 150260 149478 148930 148715 149373 150551 151155 150952 150837 151462 152650
56653 152650 154132 155723 156821 156903 156594 157100 158520 159773 160188 160058 159603 158602 157251 156319 156177 156527 157068
56636 157068 157606 157611 156751 155708 155429 155649 155358 154570 154334 154942 155535 155613 155587 155552 154860 153382 151981 151215 150576
56617 150576 149478 148056 146555 144809 142825 141135 140199 140026 140451 141146 141380 140661 139635 139422 139973 140038 138836
56600 138836 136847 134881 133313 132351 132164 132618 133615 135583 138728 142031 144060 144646 144698 144648 144374 144456 145834
$$ packed form
56720A21707J711J821J286J256K277L301L455L151K770J808L46l30L72J254J247
56705A47432J005J387J708R54k74n41L34J214J246O01q2k66Q9L92P8m61l95J14
56687A54535R8n26p66l51k34q26j146m21P37J462J741J820J564J078P96N27l91
56670A59697j599j824r81n41j204j828j460p82n48k15O58J178O04k03j15O25J188
56653A52650J482J591J098Q2l09N06J420J253M15j30m55j001j351r32j42L50N41
56636A57068N38Nq60j043k79K20k91p88k36O08N93P8k6l5o92j478j401p66o39
56617A50576j098j422j501j746j984j690r36j73M25O95K34p19j026k13N51O5j202
56600A38836j989j966j568r62j87M54R97J968L145L303K029N86N2n0k74Q2J378
$$ plain form
56583 145834 148106 149641 149707 149090 148471 147734 147222 148032 150347 152804 154277 155147 156189 157389 158568 160154
56567 160154 162562 165598 169013 172877 177065 181309 186150 192895 202217 213579 226121 238963 250387
56554 250387 258150 261384 261278 259451 256609 253155 249857 247170 244762 242268 239737 237005 233649 229941
56540 229941 226855 224688 222692 220471 218665 217727 217083 216050 214596 212718 210094 206915 204087 202068 200373
56525 200373 198665 197366 196708 196187 195470 194903 194628 194070 192719 190609 187794 184339 180997 178742 177315 175443
56509 175443 172764 170308 168774 167705 166761 166347 166500 166595 166714 167789 169724 170991 170882 170628 171319 172264 172528
56492 172528 172646 173469 174495 174700 174135 173517 173081 172900 173463 174890 176373 177341 178356 180031 181965 183657
56476 183657 185503 187868 190092 191455 192351 193515 194822 195835 196755 197937 199111 199907 200472 200820 200417 199198
$$ packed form
56583A45834K272J535O6o17o19p37n12Q10K315K457J473Q70J042J200J179J586
56567A60154K408L036L415L864M188M244M841O745R322J1362J2542J2842J1424
56554B50387P763L234j06j827k842l454l298k687k408k494k531k732l356l708
56540B29941l086k167j996k221j806r38o44j033j454j878k624l179k828k019j695
56525B00373j708j299o58n21p17n67k75n58j351k110k815l455l342k255j427j872
56509A75443k679k456j534j069r44m14J53R5J19J075J935J267j09k54O91R45K64
56492A72528J18Q23J026K05n65o18m36j81N63J427J483R68J015J675J934J692
56476A83657J846K365K224J363Q96J164J307J013R20J182J174P96N65L48m03j219
$$ plain form
56460 199198 198191 198250 198866 198976 198329 197438 196872 197139 198427 200037 200923 201160 201841 203269 204624 205769 207694
56443 207694 210445 212362 212448 211911 212115 212505 211948 210786 210024 209590 208920 208406 208737 209505 209709 209113 208101 206876
56425 206876 205648 204772 203966 202396 200263 199057 199387 199971 199755 199593 200603 202299 203705 204940 206270 206928
56409 206928 206446 205967 206628 207761 208199 208200 208450 208366 207200 205814 205548 206173 206692 207232 208433 209832 210671 211446
56391 211446 212886 214196 214205 213582 214012 215704 217501 218949 220417 221688 222210 222445 223321 224678 225779 226842
56375 226842 228547 230507 231860 232860 234277 235647 235819 234861 233878 233265 232665 232245 232482 233038 233293 233619 234722
56358 234722 236195 237066 237302 237414 237254 236654 236516 237634 239130 239711 239813 240748 242367 243462 243957 244792 245990
56341 245990 246750 247162 248037 249232 249856 250010 250776 252650 255341 258745 262732 266483 269451 272322 275595 278109
$$ packed form
56460A99198j007N9O16J10o47q91n66K67J288J610Q86K37O81J428J355J145J925
56443B07694K751J917Q6n37K04L90n57j162p62m34o70n14L31P68K04n96j012j225
56425B06876j228q76q06j570k133j206L30N84k16j62J010J696J406J235J330O58
56409B06928m82m79O61J133M38JK50q4j166j386k66O25N19N40J201J399Q39P75
56391B11446J440J310Ro23M30J692J797J448J468J271N22K35Q76J357J101J063
56375B26842J705J960J353J000J417J370J72r58r83o13o00m20K37N56K55L26J103
56358B34722J473Q71K36J12j60o00j38J118J496N81J02R35J619J095M95Q35J198
56341B45990P60M12Q75J195O24J54P66J874K691L404L987L751K968K871L273K514
$$ plain form
56325 278109 278729 278542 279435 281314 282854 284181 286383 288916 290067 289822 289848 290681 291200 290952 290748 290847 290705
56308 290705 290683 291933 294331 296496 298102 300357 303955 308378 313390 319356 325808 331389 335576 339000 341975
56293 341975 344227 346084 348397 351249 354145 357289 361228 365556 369545 373605 378478 383510 387614 391419
56279 391419 396417 402430 408087 413448 419896 427656 435702 443982 453414 463784 473933 484059 495537
56266 495537 508427 521514 534872 550043 567482 586176 606084 628632 654452 682812 713675
56255 713675 748227 787076 830050 878048 932933 995325 1064556 1140946 1225894 1319466 1420080
56244 1420080 1526816 1639748 1757768 1878377 1999938 2121772 2241598 2355153 2458760
56235 2458760 2550064 2626081 2683142 2719493 2735787 2732545 2709467 2667659 2610078 2539035 2455510
$$ packed form
56325B78109O20j87Q93J879J540J327K202K533J151k45K6Q33N19k48k04R9j42
56308B90705k2J250K398K165J606K255L598M423N012N966O452N581M187L424K975
56293C41975K252J857K313K852K896L144L939M328L989M060M873N032M104L805
56279C91419M998O013N657N361O448P760Q046Q280R432J0370J0149J0126J1478
56266D95537J2890J3087J3358J5171J7439J8694J9908K2548K5820K8360L0863
56255G13675L4552L8849M2974M7998N4885O2392O9231P6390Q4948R3572J00614
56244A420080J06736J12932J18020J20609J21561J21834J19826J13555J03607
56235B458760R1304P6017N7061L6351J6294l242k3078m1808n7581p1043q3525
$$ plain form
56224 2455510 2361501 2260750 2156421 2050084 1943489 1839023 1737832 1639686 1545289 1456592
56214 1456592 1374309 1297333 1225059 1158142 1096603 1039539 987052 940075 897933 858533 821415
56203 821415 788065 758781 731893 706621 684057 664669 647438 632019 619120 608150 597225
56192 597225 586130 576556 568844 561402 553965 548320 544901 541710 537689 534229 532286 530885 529533 529190
56178 529190 529737 529467 528244 528180 529948 531435 531360 531213 532231 533477 534422 536518 540553 545230 549875 555823
56162 555823 563634 571710 579159 587312 597019 607222 617517 629152 642109 654361 665552 678268
56150 678268 694024 711202 728663 748097 770839 795594 821506 850478 884287 922349 964547
56139 964547 1013474 1071665 1139134 1215249 1299752 1389631 1477973 1558531 1629383 1690902 1743581
$$ packed form
56224B455510r4009j00751j04329j06337j06595j04466j01191r8146r4397q8697
56214A456592q2283p6976p2274o6917o1539n7064n2487m6977m2142l9400l7118
56203H21415l3350k9284k6888k5272k2564j9388j7231j5419j2899j0970j0925
56192E97225j1095r574p712p442p437n645l419l191m021l460j943j401j352l43
56178E29190N47k70j223o4J768J487p5j47J018J246R45K096M035M677M645N948
56162E55823P811Q076P449Q153R707J0203J0295J1635J2957J2252J1191J2716
56150F78268J5756J7178J7461J9434K2742K4755K5912K8972L3809L8062M2198
56139I64547M8927N8191O7469P6115Q4503Q9879Q8342Q0558P0852O1519N2679
$$ plain form
56128 1743581 1789930 1834940 1881644 1928401 1972139 2011016 2042091 2060443 2063867 2055726 2040568 2019621
56116 2019621 1992613 1960273 1921904 1873633 1812431 1739712 1658741 1571600 1481315 1393643 1313386
56105 1313386 1241236 1176701 1121205 1075672 1038119 1006537 981378 962584 947241 933090 921445
56094 921445 913830 908660 904030 900751 899825 899931 900095 901744 905498 909249 911992 915946 922243 928468 933399
56079 933399 939967 950186 961343 970840 980578 992603 1004602 1014127 1023456 1035748 1049914 1063630
56067 1063630 1077918 1094280 1110691 1124954 1138877 1154872 1171661 1187392 1203520 1221455 1239047
56056 1239047 1254648 1270823 1289677 1308467 1324369 1339526 1356687 1374058 1389462 1405404 1424749
56045 1424749 1445514 1465229 1486300 1511595 1538934 1565565 1593859 1626765 1661890 1696013 1731177
$$ packed form
56128A743581M6349M5010M6704M6757M3738L8877L1075J8352L424q141j5158k0947
56116B019621k7008l2340l8369m8271o1202p2719q0971q7141r0285q7672q0257
56105A313386p2150o4535n5496m5533l7553l1582k5159j8794j5343j4151j1645
56094I21445p615n170m630l279r26J06J64J649L754L751K743L954O297O225M931
56079I33399O568J0219J1157R497R738J2025J1999R525R329J2292J4166J3716
56067A063630J4288J6362J6411J4263J3923J5995J6789J5731J6128J7935J7592
56056A239047J5601J6175J8854J8790J5902J5157J7161J7371J5404J5942J9345
56045A424749K0765J9715K1071K5295K7339K6631K8294L2906L5125L4123L5164
$$ plain form
56034 1731177 1770123 1809969 1846761 1882121 1919130 1956052 1990654 2026113 2065767 2106526 2144553
56023 2144553 2182884 2226163 2272530 2318296 2365942 2419535 2476794 2533825 2593172 2659047 2729169
56012 2729169 2799633 2873034 2953177 3036750 3119259 3204122 3296605 3393930 3491109 3591307 3700273
56001 3700273 3815780 3933028 4055253 4188198 4329464 4474459 4627223 4793916 4971479
55992 4971479 5154775 5348712 5560645 5787264 6022477 6271593 6543488 6835589 7141781
55983 7141781 7468272 7825679 8212513 8623401 9066388 9554152 10085547 10655003 11272787
55974 11272787 11956040 12707976 13527764 14432933 15449146 16586754 17852820 19277927 20905371
55965 20905371 22765111 24889372 27345239 30222172 33602319 37581984 42310373 47965147
$$ packed form
56034A731177L8946L9846L6792L5360L7009L6922L4602L5459L9654M0759L8027
56023B144553L8331M3279M6367M5766M7646N3593N7259N7031N9347O5875P0122
56012B729169P0464P3401Q0143Q3573Q2509Q4863R2483R7325R7179J00198J08966
56001C700273J15507J17248J22225J32945J41266J44995J52764J66693J77563
55992D971479J83296J93937K11933K26619K35213K49116K71895K92101L06192
55983G141781L26491L57407L86834M10888M42987M87764N31395N69456O17784
55974A1272787O83253P51936Q19788R05169J016213J137608J266066J425107J627444
55965B0905371J859740K124261K455867K876933L380147L979665M728389N654774
$$ plain form
55957 47965147 54701990 62673795 72086143 83191343 96270215 111712891 130114044
55950 130114044 152212207 178744835 210365657 247356085 288700670 330924660 368043834
55943 368043834 393447830 402697016 395192656 373742690 342854414 307137412 270405066
55936 270405066 235314548 203351509 175097454 150604287 129649009 111848923 96761770
55929 96761770 83985840 73181726 64036056 56261397 49630708 43971962 39128903 34956700
55921 34956700 31347989 28227681 25521263 23153233 21071202 19243166 17631977 16195716
55913 16195716 14909928 13765544 12745851 11826168 10993824 10247458 9577389 8965644 8404281
55904 8404281 7895505 7434299 7007924 6611950 6250607 5921704 5616263 5332291 5074165
$$ packed form
55957D7965147O736843P971805R412348J1105200J3078872J5442676J8401153
55950A30114044K2098163K6532628L1620822L6990428M1344585M2223990L7119174
55943C68043834K5403996R249186p504360k1449966l0888276l5717002l6732346
55936B70405066l5090518l1963039k8254055k4493167k0955278j7800086j5087153
55929I6761770j2775930j0804114r145670p774659o630689n658746m843059m172203
55921C4956700l608711l120308k706418k368030k082031j828036j611189j436261
55913A6195716j285788j144384j019693r19683q32344p46366o70069o11745n61363
55904H404281n08776m61206m26375l95974l61343l28903l05441k83972k58126
$$ plain form
55895 5074165 4838964 4617514 4408386 4217279 4043082 3877872 3720314 3576164 3445653
55886 3445653 3322764 3206695 3101662 3005082 2907873 2807218 2708178 2612610 2517396 2423882
55876 2423882 2338104 2260765 2187016 2116497 2053511 1996784 1939249 1879080 1821376 1767962 1714935
55865 1714935 1661413 1611449 1565712 1519942 1473174 1429233 1388682 1347361 1304425 1264100 1228080
55854 1228080 1193663 1160705 1132974 1111073 1091100 1071590 1054777 1039847 1022210 1001110 981031
55843 981031 963795 945902 925460 905287 887151 869011 849971 832338 816876 801324 785220
55832 785220 771051 759271 747282 734498 723308 714013 704075 693382 684910 678935 671864 662078 651846
55819 651846 642241 631326 618777 607272 597816 588388 578511 570461 564702 558851 552387 547658 544952
$$ packed form
55895E074165k35201k21450k09128j91107j74197j65210j57558j44150j30511
55886C445653j22889j16069j05033r6580r7209j00655r9040r5568r5214r3514
55876B423882q5778p7339p3749p0519o2986n6727n7535o0169n7704n3414n3027
55865A714935n3522m9964m5737m5770m6768m3941m0551m1321m2936m0325l6020
55854A228080l4417l2958k7731k1901j9973j9510j6813j4930j7637k1100k0079
55843I81031j7236j7893k0442k0173j8136j8140j9040j7633j5462j5552j6104
55832G85220j4169j1780j1989j2784j1190r295r938j0693q472n975p071r786j0232
55819F51846r605j0915j2549j1505r456r428r877q050n759n851o464m729k706
$$ plain form
55806 544952 541392 536236 532635 532524 534146 536140 539797 545628 551764 557214 562893 568292 571128 571366 571550
55791 571550 572134 570636 566434 562024 558417 553715 547559 542538 539478 535470 528226 518485 506771 492017
55777 492017 475056 459378 446538 434519 422179 411481 403717 397451 391973 388863 388205 387041 383686
55764 383686 380114 378183 376930 375465 374935 375587 375266 373013 370907 370277 369236 366055 361921 358178 353732
55749 353732 347314 339645 331365 321407 309285 296550 284388 272377 260956 252207 246601 241875 236718
55736 236718 232636 230555 228773 226096 223897 223087 222114 220129 219099 220379 221915 221310 219155 216948 214226
55721 214226 210274 206472 204370 203242 201748 200224 199299 198114 195959 193956 193288 193467 193957 195520 198296
55706 198296 200575 201311 201855 203406 204764 204486 203319 202549 201732 199971 197750 195695 193197 190011 187516
$$ packed form
55806E44952l560n156l601j11J622J994L657N831O136N450N679N399K836K38J84
55791E71550N84j498m202m410l607m702o156n021l060m008p244r741j1714j4754
55777D92017j6961j5678j2840j2019j2340j0698p764o266n478l110o58j164l355
55764C83686l572j931j253j465n30O52l21k253k106o30j041l181m134l743m446
55749C53732o418p669q280r958j2122j2735j2162j2011j1421q749n606m726n157
55736B36718m082k081j782k677k199q10r73j985j030J280J536o05k155k207k722
55721B14226l952l802k102j128j494j524r25j185k155k003o68J79M90J563K776
55706A98296K279P36N44J551J358k78j167p70q17j761k221k055k498l186k495
$$ plain form
55691 187516 186723 186686 186398 186453 187293 187796 187302 187111 188189 189320 189431 189937 192714 197327 202129 206547 210501
55674 210501 213084 213694 213187 212328 210601 207921 205751 204913 204052 201981 199756 198637 197846 196350 195156 195675
55658 195675 197270 198538 199741 201950 204916 207652 210095 212465 214144 214789 215348 216420 216913 215877 214281
55643 214281 213253 211947 208934 204452 199538 194187 188090 182054 176983 172524 168179 164551 162053 159725
55629 159725 156833 154236 152634 151042 148657 146641 146244 146665 146680 146844 148065 149433 149660 149345 149626 149775
55613 149775 148389 145918 143797 142037 139854 137753 136692 135952 134082 131414 129558 128909 128564 128139 127751
55598 127751 126798 124692 122347 121147 120876 120367 119588 119313 119287 118589 117470 117088 117756 118924 120499 122646 124784
55581 124784 126229 127426 129208 131398 133506 136108 140166 145630 152048 159691 168641 177740 186023 194253
$$ packed form
55691A87516p93l7k88N5Q40N03m94j91J078J131J11N06K777M613M802M418L954
55674B10501K583O10n07q59j727k680k170q38q61k071k225j119p91j496j194N19
55658A95675J595J268J203K209K966K736K443K370J679O45N59J072M93j036j596
55643B14281j028j306l013m482m914n351o097o036n071m459m345l628k498k328
55629A59725k892k597j602j592k385k016l97M21J5J64J221J368K27l15K81J49
55613A49775j386k471k121j760k183k101j061p40j870k668j856o49l45m25l88
55598A27751r53k106k345j200k71n09p79k75k6o98j119l82O68J168J575K147K138
55581A24784J445J197J782K190K108K602M058N464O418P643Q950R099Q283Q230
$$ plain form
55567 194253 203321 212070 218500 222258 223963 223000 218246 210495 202070 194226 186720 179473 172725 165899
55553 165899 158269 150642 144613 140318 136522 132659 129142 126006 122966 120518 119257 118381 116621 114449
55539 114449 113556 114286 115386 116228 117470 119387 121235 122526 123499 124190 124322 124191 124404 124671 124045 122298 120008
55522 120008 117472 114657 111930 109682 107622 105579 104396 104647 105050 103771 100936 98252 96570 95429 94634
55507 94634 94437 94311 93309 91704 90684 90436 90049 89293 88941 89280 89778 90260 90998 91617 91318 90245 89351 88968
55489 88968 88731 88678 89080 89472 89300 89214 90142 91393 91411 90227 89322 89133 88618 87419 86554 86662 87327 88475 90663
55470 90663 93488 95397 95670 95152 94582 93635 92165 90884 90172 89482 88518 87846 87802 87912 87875 88029 88408 88434 87981
55451 87981 87727 88025 88378 88331 87927 87116 85752 84364 83856 84230 84613 84679 84891 85289 85321 85078 85380 86354 87172
$$ packed form
55567A94253R068Q749O430L758J705r63m754p751q425p844p506p247o748o826
55553A65899p630p627o029m295l796l863l517l136l040k448j261q76j760k172
55539A14449q93P30J100Q42J242J917J848J291R73O91J32j31K13K67o26j747k290
55522A20008k536k815k727k248k060k043j183K51M03j279k835k684j682j141p95
55507I4634j97j26j002j605j020k48l87p56l52L39M98M82P38O19k99j073q94l83
55489H8968k37n3M02L92j72q6R28J251J8j184r05j89n15j199q65J08O65J148K188
55470I0663K825J909K73n18n70r47j470j281p12o90r64o72m4J10l7J54L79K6m53
55451H7981k54K98L53m7m04q11j364j388n08L74L83O6K12L98L2k43L02R74Q18
$$ plain form
55432 87172 87491 87926 88738 89364 89622 90141 91156 92072 92646 93443 94617 95434 95520 95467 95690 95810 95691 95959 96807
55413 96807 97312 96674 95283 93895 92598 91219 90020 89301 88877 88399 87755 86898 85867 85158 85336 86127 86633
55396 86633 86554 86377 86256 85720 84725 84014 84085 84655 85429 86513 87744 88565 88969 89721 91196 92718 93430 93150
55378 93150 92160 90844 89806 89601 90093 90611 90802 90677 89975 88340 86178 84391 83266 82430 81834 81755 81946
55361 81946 81856 81648 81825 81977 81273 80238 80482 82364 84403 85463 86090 87101 88208 88813 89051 89258 89367
55344 89367 89408 89678 89877 89105 87269 85469 84481 83945 83696 84610 87166 90082 91512 91049 89778 88832 88628
55327 88628 88988 89363 89185 88447 87696 87335 87384 87860 88706 89373 89348 89096 89498 90326 90421 89477 88363 87470 86189
55308 86189 84486 83542 84114 85505 86888 88338 89715 89888 88274 86196 85466 86277 87460 88138 88167 87593 86702
$$ packed form
55432H7172L19M35Q12O26K58N19J015R16N74P97J174Q17Q6n3K23J20j19K68Q48
55413I6807N05o38j391j388j297j379j199p19m24m78o44q57j031p09J78P91N06
55396H6633p9j77j21n36r95p11P1N70P74J084J231Q21M04P52J475J522P12k80
55378I3150r90j316j038k05M92N18J91j25p02j635k162j787j125q36n96p9J91
55361H1946r0k08J77J52p04j035K44J882K039J060O27J011J107O05K38K07J09
55344H9367M1K70J99p72j836j800r88n36k49R14K556K916J430m63j271r46k04
55327H8628L60L75j78p38p51l61M9M76Q46O67k5k52M02Q28R5r44j114q93j281
55308H6189j703r44N72J391J383J450J377J73j614k078p30Q11J183O78K9n74q91
$$ plain form
55291 86702 86227 86629 87489 88235 88953 89885 90680 90854 90544 90165 89738 89106 88367 87599 86597 85368 84405 84026
55273 84026 83913 83629 83126 82509 81950 82059 83462 85658 87113 86985 86021 85368 85358 85904 87081 88665 89904
55256 89904 90447 90761 91107 90953 90046 89147 88914 88887 88431 87930 88090 88640 88633 87722 86428 85494 85487 86495 87668 87640
55236 87640 86012 83946 82813 82814 83382 84208 85228 86223 87064 87861 88425 88205 87149 85975 85142 84342 83453 83058
55218 83058 83456 84061 84403 84830 85558 86001 85805 85588 85821 85948 85551 85403 86268 87495 88007 87931 88054 88281 87922
55199 87922 87065 86384 85939 85318 84736 84810 85418 85839 85949 86319 87150 87977 88448 88654 88748 88817 89078 89607 90014 89849
55179 89849 89170 88345 87537 86787 86253 85983 85831 85864 86316 86875 86800 86175 86126 87235 88562 89002 88713 88422 88203
55160 88203 87915 88062 89111 90535 91570 92350 93342 94298 94728 94837 94912 94462 93131 91827 91640 92147 92111 91482
$$ packed form
55291H6702m75M02Q60P46P18R32P95J74l10l79m27o32p39p68j002j229r63l79
55273H4026j13k84n03o17n59J09J403K196J455j28r64o53j0N46J177J584J239
55256H9904N43L14L46j54r07q99k33k7m56n01J60N50pr11j294r34pJ008J173k8
55236H7640j628k066j133JN68Q26J020R95Q41P97N64k20j056j174q33q00q89l95
55218H3058L98O05L42M27P28M43j96k17K33J27l97j48Q65J227N12p6J23K27l59
55199H7922q57o81m45o21n82P4O08M21J10L70Q31Q27M71K06R4O9K61N29M07j65
55179H9849o79q25q08p50n34k70j52L3M52N59p5o25m9J109J327M40k89k91k19
55160H8203k88J47J049J424J035P80R92R56M30J09P5m50j331j304j87N07l6o29
$$ plain form
55142 91482 91273 91722 92009 91728 91309 90934 90243 89235 88389 87855 87501 87723 89088 91122 92516 92670 92063 91086
55124 91086 89615 87920 86869 86825 87247 87686 88378 89499 90581 91112 91192 91246 91532 92124 92950 93693 93969 93760
55106 93760 93390 93220 93581 94692 96173 97010 96654 95829 95603 95960 96063 95675 95442 95889 96967 98496 100198
55089 100198 101305 101073 99874 99050 99512 100997 102720 104118 104901 105065 105007 105141 105335 105138 104438 103404 101955
55072 101955 99971 97979 96940 97211 98237 99311 100174 100881 101544 102281 103050 103627 103999 104488 105123 105281 104471
55055 104471 103106 101951 101195 100736 100920 102089 103611 104304 103802 102784 101839 100863 99626 98345 97524 97538 98307
55038 98307 99113 99104 98348 97940 98629 99855 100712 101193 101684 101879 101271 100329 100089 100764 101730 102667 103702 104540 104467
55019 104467 103286 101514 99719 98374 98077 99008 100339 101035 101118 101321 101752 101766 100956 99417 97317 95156 94043
$$ packed form
55142I1482k09M49K87k81m19l75o91j008q46n34l54K22J365K034J394J54o07r77
55124I1086j471j695j051m4M22M39O92J121J082N31Q0N4K86N92Q26P43K76k09
55106I3760l70j70L61J111J481Q37l56q25k26L57J03l88k33M47J078J529J702
55089A00198J107k32j199q24M62J485J723J398P83J64n8J34J94j97p00j034j449
55072A01955j984j992j039K71J026J074Q63P07O63P37P69N77L72M89O35J58q10
55055A04471j365j155p56m59J84J169J522O93n02j018r45r76j237j281q21J4P69
55038I8307Q06rp56m08O89J226Q57M81M91J95o08r42k40O75R66R37J035Q38p3
55019A04467j181j772j795j345k97R31J331O96Q3K03M31J4q10j539k100k161j113
$$ plain form
55002 94043 94571 95626 95526 94227 93264 93640 94967 96614 98369 99914 100898 101724 103088 104601 105111 104537
54986 104537 104114 104536 105119 105214 105215 105598 106054 106209 106313 106628 106877 106804 106569 106218 105480 104449 103792 103939 104651 105550
54966 105550 106427 106953 106893 106710 107121 107936 108197 107596 106846 106521 106475 106562 106941 107473 107760 107980 108698 109742 110336
54947 110336 110525 111230 112596 113533 113319 112508 111800 111194 110760 111010 111819 112060 111063 109516 108287 107382 106695 106721
54929 106721 107708 109033 110270 112032 114910 118368 121475 124122 126796 129797 133329 137624 142340 146562
54915 146562 150035 153600 157742 161509 163622 163906 162924 160918 157942 154375 150519 146204 141374 136485 131851
54900 131851 127470 123923 122336 122673 123153 122349 120857 119894 119304 118304 117233 117023 117477 117637 117485 117835 118755
54883 118755 119562 120295 121834 124397 127158 129579 132142 135481 139642 144384 149413 154118 157820 160501 162668
$$ packed form
55002I4043N28J055j00j299r63L76J327J647J755J545R84Q26J364J513N10n74
54986A04537m23M22N83R5JL83M56J55J04L15K49p3k35l51p38j031o57J47P12Q99
54966A05550Q77N26o0j83M11Q15K61o01p50l25m6Q7L79N32K87K20P18J044N94
54947A10336J89P05J366R37k14q11p08o06m34K50Q09K41r97j547j229r05o87K6
54929A06721R87J325J237J762K878L458L107K647K674L001L532M295M716M222
54915A46562L473L565M142L767K113K84r82k006k976l567l856m315m830m889m634
54900A31851m381l547j587L37M80q04j492r63n90j000j071k10M54J60j52L50R20
54883A18755Q07P33J539K563K761K421K563L339M161M742N029M705L702K681K167
$$ plain form
54868 162668 164403 165191 164777 163514 161646 158845 154806 149974 145380 141858 139447 137418 135024 132305 129965
54853 129965 128299 126695 124455 121677 118911 116434 114370 113046 112578 112361 111633 110340 108965 107764 106740
54838 106740 106058 105824 105690 105284 104901 105154 106067 107080 107818 108332 108648 108653 108389 108044 107683 107302 106973 106663 106164
54819 106164 105521 105122 105010 104644 103847 103477 104369 106040 107317 107982 108840 110218 111414 111809 111749 111964 112611 113175
54801 113175 113042 112053 110770 110143 110576 111388 111587 111092 110820 111563 113165 114755 115461 114983 113841 113003 112945 113151
54783 113151 112840 111993 111335 111450 112324 113636 115046 116236 117053 117671 118413 119446 120825 122667 125030 127818
54767 127818 131027 134877 139468 144515 149677 154932 160411 166084 171754 177011 181057 183048 182877 181186
54753 181186 178396 174315 169009 163364 158190 153387 148575 144019 140207 136967 133856 131092 129345 128721
$$ packed form
54868A62668J735P88m14j263j868k801m039m832m594l522k411k029k394k719k340
54853A29965j666j604k240k778k766k477k064j324m68k17p28j293j375j201j024
54838A06740o82k34j34m06l83K53R13J013P38N14L16Nk64l45l61l81l29l10m99
54819A06164o43l99j12l66p97l70Q92J671J277O65Q58J378J196L95o0K15O47N64
54801A13175j33r89j283o27M33Q12J99m95k72P43J602J590P06m78j142q38n8K06
54783A13151l11q47o58J15Q74J312J410J190Q17O18P42J033J379J842K363K788
54767A27818L209L850M591N047N162N255N479N673N670N257M046J991j71j691
54753A81186k790m081n306n645n174m803m812m556l812l240l111k764j747o24
$$ plain form
54739 128721 128573 128203 127211 125426 123094 120984 119783 119534 119973 120983 122286 123295 123904 124917 126965 129514
54723 129514 131768 134012 137078 140912 144793 148689 153173 158055 162261 165168 167028 167942 167502 165731 163400
54708 163400 160927 157755 153288 147899 142627 138288 135096 132723 130534 128203 126141 124988 124692 124632 124485
54693 124485 124341 124057 123313 122342 121791 121673 121222 120087 118911 118398 118431 118472 118232 117516 115994 113735 111644 110818
54675 110818 111476 112754 113531 113365 112766 112553 112895 113127 112727 112132 112174 112943 113818 114408 114775 114805 114144 112951 112025
54656 112025 111886 112235 112486 112441 112259 112212 112608 113548 114641 115338 115566 115631 115532 114936 113858 112814 112152 111755 111512
54637 111512 111538 111783 111977 112176 112821 113973 114935 114928 113864 112277 110790 109763 109173 108750 108448 108664 109636 110806
54619 110806 111385 111419 111625 112133 112198 111405 110412 110122 110619 111366 112024 112679 113447 114176 114486 114127 113446 113289 114050
$$ packed form
54739A28721j48l70r92j785k332k110j201k49M39J010J303J009O09J013K048K549
54723A29514K254K244L066L834L881L896M484M882M206K907J860R14m40j771k331
54708A63400k473l172m467n389n272m339l192k373k189k331k062j153k96o0j47
54693A24485j44k84p44r71n51j18m51j135j176n13L3M1k40p16j522k259k091q26
54675A10818O58J278P77j66n99k13L42K32m00n95M2P69Q75N90L67L0o61j193r26
54656A12025j39L49K51m5j82m7L96R40J093O97K28O5r9n96j078j044o62l97k43
54637A11512K6K45J94J99O45J152R62pj064j587j487j027n90m23l02K16R72J170
54619A10806N79L4K06N08O5p93r93k90M97P47O58O55P68P29L10l59o81j57P61
$$ plain form
54600 114050 115035 115278 114808 114491 114817 115612 116825 118586 120378 121158 120625 119580 118677 117666 116337 115323
54584 115323 115312 116034 116637 116632 115971 114799 113609 113138 113535 114030 113930 113490 113299 113349 113320 113344 113780 114483 114936 114948
54564 114948 114707 114343 113965 113902 114320 114760 114612 114033 113888 114811 116682 118978 121213 123052 124402 125454 126396
54547 126396 127061 127074 126328 125119 123897 123102 123154 124309 126399 128855 131025 132468 133034 132721 131566 129773
54531 129773 128010 127215 127683 128502 128428 127356 126395 126403 127037 127488 127563 127577 127613 127425 126877 126074 125166 124326 123777 123573
54511 123573 123488 123268 122846 122149 120996 119445 118021 117295 117346 117822 118400 119036 119869 121014 122353 123496 124141
54494 124141 124441 124756 125111 125263 125271 125484 125896 126053 125816 125629 125749 125782 125400 125057 125419 126464 127699 129029 130826
54475 130826 133151 135403 136873 137389 137353 137273 137293 137217 137022 137155 137982 139073 139564 139238 138678 138292 137866 137341 137279
$$ packed form
54600A14050R85K43m70l17L26P95J213J761J792P80n33j045r03j011j329j014
54584A15323j1P22O03no61j172j190m71L97M95j00m40j91N0k9K4M36P03M53J2
54564A14948k41l64l78o3M18M40j48n79j45R23J871K296K235J839J350J052R42
54547A26396O65J3p46j209j222p95N2J155K090K456K170J443N66l13j155j793
54531A29773j763p95M68Q19p4j072r61QO34M51P5J4L6j88n48q03r08q40n49k04
54511A23573q5k20m22o97j153j551j424p26N1M76N78O36Q33J145J339J143O45
54494A24141L00L15L55J52QK13M12J57k37j87J20L3l82l43L62J045J235J330J797
54475A30826K325K252J470N16l6q0K0p6j95J33Q27J091M91l26n60l86m26n25o2
$$ plain form
54456 137279 138039 139093 139787 140224 140730 140914 140108 138517 137071 136179 135424 134573 134081 134311 134822 134887 134366 133690
54438 133690 133185 132821 132568 132644 133235 134094 134686 134740 134510 134368 134367 134453 134859 135889 137356 138696 139680 140594 141668
54419 141668 142763 143681 144338 144492 143847 142621 141528 140994 140817 140768 140880 140885 140104 138331 136248 134515 133110
54402 133110 132111 132254 133839 135721 136486 136320 136612 137916 139475 140769 142280 144362 146401 147731 148636 149727
54386 149727 150839 151191 150464 149202 148219 147905 147987 147762 146755 145394 144804 145652 147310 148475 148526 148026 147951 148696
54368 148696 149863 150793 151148 151110 151217 152002 153612 155640 157400 158557 159523 161132 163850 167331 170695 173074
54352 173074 173978 173369 171602 169242 166822 164702 162970 161324 159257 156640 154018 151967 150252 148144 145539
54337 145539 143202 141761 141051 140750 141006 141888 142679 142447 141203 139934 139552 140238 141659 143279 144409 144534
$$ packed form
54456A37279P60J054O94M37N06J84q06j591j446q92p55q51m92K30N11O5n21o76
54438A33690n05l64k53P6N91Q59N92N4k30j42jQ6M06J030J467J340R84R14J074
54419A41668J095R18O57J54o45j226j093n34j77m9J12Np81j773k083j733j405
54402A33110r99J43J585J882P65j66K92J304J559J294J511K082K039J330R05J091
54386A49727J112L52p27j262r83l14Q2k25j007j361n90Q48J658J165N1n00p5P45
54368A48696J167R30L55l8J07P85J610K028J760J157R66J609K718L481L364K379
54352A73074R04o09j767k360k420k120j732j646k067k617k622k051j715k108k605
54337A45539k337j441p10l01K56Q82P91k32j244j269l82O86J421J620J130J25
$$ plain form
54321 144534 143817 143027 142759 142884 142850 142361 141627 141037 140685 140253 139401 138259 137338 136919 136692 136157 135229 134340 134008
54302 134008 134391 135139 135633 135535 135169 135144 135602 136063 136052 135618 135165 135118 135752 136965 138090 138346 137687 136819 136273
54283 136273 135924 135657 135913 137143 139101 141131 142787 143820 143986 143378 142628 142291 142274 142312 142605 143463 144621
54266 144621 145583 146417 147565 149012 150246 151011 151507 151905 152246 152746 153604 154440 154548 153879 153255 153410 154199 154918
54248 154918 155036 154424 153218 151711 150222 148873 147568 146227 144945 143968 143606 144058 145117 146204 146905 147350
54232 147350 147848 148323 148430 148094 147641 147431 147611 148098 148592 148774 148710 148814 149151 149118 148220 146900 146034 145818 145648
54213 145648 144989 143840 142446 141109 140272 140231 140672 140935 140759 140384 139989 139512 139029 138808 138900 139154 139626 140464
54195 140464 141337 141562 141014 140456 140712 141840 143296 144501 145053 144772 143888 142991 142569 142691 143190 143892 144568 144957
$$ packed form
54321A44534p17p90k68J25l4m89p34n90l52m32q52j142r21m19k27n35r28q89l32
54302A34008L83P48M94r8l66k5M58M61j1m34m53m7O34J213J125K56o59q68n46
54283A36273l49k67K56J230J958K030J656J033J66o08p50l37j7L8K93Q58J158
54266A44621R62Q34J148J447J234P65M96L98L41N00Q58Q36J08o69o24J55P89P19
54248A54918J18o12j206j507j489j349j305j341j282r77l62M52J059J087P01M45
54232A47350M98M75J07l36m53k10J80M87M94J82o4J04L37l3q98j320q66k16j70
54213A45648o59j149j394j337q37m1M41K63j76l75l95m77m83k21R2K54M72Q38
54195A40464Q73K25n48n58K56J128J456J205N52k81q84q97m22J22M99P02O76L89
$$ plain form
54177 144957 144997 144870 144722 144534 144367 144487 145112 146175 147401 148465 149063 148969 148124 146640 144816 143169 142247
54160 142247 142099 142104 141604 140654 139872 139701 140113 140899 141872 142811 143534 144095 144640 145139 145435 145491 145352 145033 144681 144614
54140 144614 144884 145023 144616 143896 143379 143119 142817 142502 142536 143073 143966 145101 146308 147113 147194 146989 147229 147974 148723
54121 148723 149385 150306 151327 151742 151421 151247 152001 153459 154966 156344 157819 159429 160983 162316 163300 163808
54105 163808 163888 163737 163411 162795 161921 161026 160265 159758 159846 160851 162565 164446 166307 168312 170321 171926 173197
54088 173197 174757 176998 179869 183434 187792 192207 195270 196341 196086 195131 193081 189513 185190 181440 178757
54073 178757 176756 175131 173938 173184 172743 172560 172524 172393 172273 172758 174130 175735 176684 176847 176640 176242 175671
54056 175671 175328 175814 177266 179362 181813 184356 186609 188547 190910 194528 199330 204589 209944 215517 221171
$$ packed form
54177A44957M0j27j48j88j67J20O25J063J226J064N98r4q45j484j824j647r22
54160A42247j48Nn00r50p82j71M12P86R73R39P23N61N45M99K96N6j39l19l52o7
54140A44614K70J39m07p20n17k60l02l15L4N37Q93J135J207Q05Q1k05K40P45P49
54121A48723O62R21J021M15l21j74P54J458J507J378J475J610J554J333R84N08
54105A63808Q0j51l26o16q74q95p61n07Q8J005J714J881J861K005K009J605J271
54088A73197J560K241K871L565M358M415L063J071k55r55k050l568m323l750k683
54073A78757k001j625j193p54m41j83l6j31j20M85J372J605R49J63k07l98n71
54056A75671l43M86J452K096K451K543K253J938K363L618M802N259N355N573N654
$$ plain form
54041 221171 226412 231045 235292 239219 242682 245938 249654 254073 258674 262872 266592 269977 272996 275592
54027 275592 277840 279720 281017 281664 281894 281917 281741 281472 281443 281836 282456 283051 283560 283775 283089 280938 277365 272877
54009 272877 267880 262603 257448 252993 249474 246568 243829 241150 238615 236077 233202 229938 226646 223667
53995 223667 220989 218479 216231 214400 212830 211182 209407 207834 206668 205695 204506 202816 200514 197757
53981 197757 195142 193464 193034 193377 193769 193888 193879 194066 194800 196239 197955 198984 198660 197356 196142 195807 196409
53964 196409 197599 198988 200286 201469 202929 205190 208377 212080 215770 219170 222285 225326 228732 233125
53950 233125 239067 246877 256750 268994 284071 302067 321786 340346 354148 360857 360616 355353 347064
53937 347064 337031 326377 316575 308881 303403 299205 295472 292417 290894 291310 293137 295446 297677 299835
$$ packed form
54041B21171N241M633M247L927L463L256L716M419M601M198L720L385L019K596
54027B75592K248J880J297O47K30K3j76k69k9L93O20N95N09K15o86k151l573m488
54009B72877m997n277n155m455l519k906k739k679k535k538k875l264l292k979
53995B23667k678k510k248j831j570j648j775j573j166r73j189j690k302k757
53981A97757k615j678m30L43L92J19rJ87P34J439J716J029l24j304j214l35O02
53964A96409J190J389J298J183J460K261L187L703L690L400L115L041L406M393
53950B33125N942P810R873J2244J5077J7996J9719J8560J3802O709k41n263q289
53937C47064j0033j0654r802p694n478m198l733l055j523M16J827K309K231K158
$$ plain form
53923 299835 302199 305073 308692 313143 318372 324324 330968 338064 345128 351847 358456 365392 372605 379390
53909 379390 384888 388609 390623 391502 391976 392323 392159 391051 389150 386913 384406 381371 377844 374171 370444
53894 370444 366468 362275 358053 353506 347960 341314 334274 327371 320336 312832 305240 298277 292240 287009
53880 287009 282415 278201 273983 269651 265562 261990 258754 255661 252875 250404 247660 244104 240040 236267
53866 236267 233162 230544 228182 225924 223531 220906 218315 215977 213656 211107 208649 206740 205196 203479
53852 203479 201564 199893 198595 197472 196716 196855 197780 198542 198512 198247 198847 200724 203271 205442 206401 205868 204229
53835 204229 202224 200409 198888 197605 196638 196137 196114 196444 197006 197752 198656 199625 200426 200848 201002 201348 202271 203715
53817 203715 205354 206991 208611 210137 211381 212223 212754 213322 214440 216422 219013 221665 224390 227949 232919
$$ packed form
53923B99835K364K874L619M451N229N952O644P096P064O719O609O936P213O785
53909C79390N498L721K014Q79M74L47j64j108j901k237k507l035l527l673l727
53894C70444l976m193m222m547n546o646p040o903p035p504p592o963o037n231
53880B87009m594m214m218m332m089l572l236l093k786k471k744l556m064l773
53866B36267l105k618k362k258k393k625k591k338k321k549k458j909j544j717
53852B03479j915j671j298j123p56J39R25P62l0k65O00J877K547K171R59n33j639
53835B04229k005j815j521j283r67n01k3L30N62P46R04R69Q01M22J54L46R23J444
53817B03715J639J637J620J526J244Q42N31N68J118J982K591K652K725L559M970
$$ plain form
53802 232919 238861 244846 250561 256382 262489 268435 273616 277773 280992 283586 286017 288646 291453 294190
53788 294190 296720 299006 300925 302410 303591 304353 303920 301438 297083 292112 287696 284009 280493 276566 271972
53773 271972 266870 261806 257284 253277 249467 246006 243491 241921 240209 237247 233180 229202 226199 224039
53759 224039 222113 220126 218201 216541 215176 213979 212788 211572 210500 209752 209239 208667 207909 207166 206587 205924
53743 205924 204846 203571 202799 202891 203381 203560 203322 203146 203371 203827 204078 203839 203255 203001 203911 206140 208889 211292
53725 211292 213291 215148 216512 216911 216989 218172 220822 223703 225667 226939 228198 229350 230088 230912 232594
53710 232594 234989 237245 238945 240293 241476 242639 244261 246778 249890 252931 255749 258586 261362 263855
53696 263855 266482 270091 274906 280296 285517 290023 293156 294374 293884 292417 290346 287684 284904 282922
$$ packed form
53802B32919N942N985N715N821O107N946N181M157L219K594K431K629K807K737
53788B94190K530K286J919J485J181P62m33k482m355m971m416l687l516l927m594
53773B71972n102n064m522m007l810l461k515j570j712k962m067l978l003k160
53759B24039j926j987j925j660j365j197j191j216j072p48n13n72p58p43n79o63
53743B05924j078j275p72R2M90J79k38j76K25M56K51k39n84k54R10K229K749K403
53725B11292J999J857J364L99P8J183K650K881J964J272J259J152P38Q24J682
53710B32594K395K256J700J348J183J163J622K517L112L041K818K837K776K493
53696B63855K627L609M815N390N221M506L133J218m90j467k071k662k780j982
$$ plain form
53682 282922 282090 281902 281847 281874 281848 281298 280036 278438 276811 275047 273174 271753 271378 272074 273310 274224 273894
53665 273894 272053 269678 268227 268053 268175 267749 267084 266877 267170 267484 267473 266989 265993 264874 264412 265006 266200
53648 266200 267293 268030 268466 268628 268709 269140 270075 271132 271977 272831 274122 276053 278743 282262 286106 289182
53632 289182 290883 291816 292976 294572 296220 297948 300283 303469 307135 310777 314221 317696 321740 326870
53618 326870 332971 339177 344662 349388 353791 358063 362146 366141 370202 374135 377593 380629 383654 386924
53604 386924 390397 393982 397450 400207 401687 402091 402361 403250 404635 405796 406173 405773 405066 404511 404115 403506
53588 403506 402541 401607 401019 400340 398727 395983 392825 390024 387688 385545 383546 381760 379928 377591 374752
53573 374752 372027 369951 368398 366948 365583 364609 363977 363196 362103 361233 361082 361346 361300 360641 359562 358225
$$ packed form
53682B82922q32j88n5K7k6n50j262j598j627j764j873j421l75O96J236R14l30
53665B73894j841k375j451j74J22m26o65k07K93L14j1m84r96j119m62N94J194
53648B66200J093P37M36J62Q1M31R35J057Q45Q54J291J931K690L519L844L076
53632B89182J701R33J160J596J648J728K335L186L666L642L444L475M044N130
53618C26870O101O206N485M726M403M272M083L995M061L933L458L036L025L270
53604C86924L473L585L468K757J480M04K70Q89J385J161L77m00p07n55l96o09
53588D03506r65r34n88o79j613k744l158k801k336k143j999j786j832k337k839
53573C74752k725k076j553j450j365r74o32p81j093q70j51K64m6o59j079j337
$$ plain form
53557 358225 356731 355494 355013 355211 355434 355241 354807 354576 354848 355690 356850 357815 358380 359084 360570 362655 364705
53540 364705 366837 369919 374261 379193 384197 389519 395268 400835 405899 411283 417982 425881 434199 442806
53526 442806 452226 462614 473543 484704 496160 507924 519910 532310 545488 559518 574266 589851
53514 589851 606568 624402 643065 662497 682902 704275 726249 748434 770620 792743 814968
53503 814968 837702 861082 884522 907121 928464 948642 967568 984830 1000398 1015099 1030086
53492 1030086 1045955 1062460 1079015 1095351 1111672 1128194 1144677 1160704 1176361 1192199 1208355
53481 1208355 1224164 1239023 1253252 1267600 1282113 1295967 1308266 1318514 1326441 1331922 1335193 1336669
53469 1336669 1336314 1333458 1327514 1318751 1308187 1296731 1284612 1271735 1258368 1245111 1232076 1218549
$$ packed form
53557C58225j494j237m81J98K23j93m34k31K72Q42J160R65N65P04J486K085K050
53540C64705K132L082M342M932N004N322N749N567N064N384O699P899Q318Q607
53526D42806R420J0388J0929J1161J1456J1764J1986J2400J3178J4030J4748J5585
53514E89851J6717J7834J8663J9432K0405K1373K1974K2185K2186K2123K2225
53503H14968K2734K3380K3440K2599K1343K0178J8926J7262J5568J4701J4987
53492A030086J5869J6505J6555J6336J6321J6522J6483J6027J5657J5838J6156
53481A208355J5809J4859J4229J4348J4513J3854J2299J0248P927N481L271J476
53469A336669l55k856n944q763j0564j1456j2119j2877j3367j3257j3035j3527
$$ plain form
53457 1218549 1203842 1188100 1171733 1154478 1135948 1116890 1098738 1081735 1064683 1046935 1029413
53446 1029413 1012943 996804 980057 963435 948587 936023 925104 915683 908318 902974 898800 895307
53434 895307 892672 890772 889116 887962 888433 891091 895258 900110 905533 911534 917770 924334 932271 942572
53420 942572 955080 968932 983678 999448 1016404 1034538 1053816 1074157 1095509 1118186 1142748
53409 1142748 1169237 1196880 1224938 1253563 1283491 1315197 1348740 1384219 1421892 1461895 1504039
53398 1504039 1547868 1592847 1638692 1685637 1734100 1783952 1834390 1884714 1934970 1985628 2036789
53387 2036789 2087903 2138055 2186418 2232596 2276687 2318885 2359009 2396569 2431220 2462836 2491184
53376 2491184 2515919 2536868 2553902 2566526 2574195 2577179 2576467 2572423 2563937 2549296 2527572 2498940
$$ packed form
53457A218549j4707j5742j6367j7255j8530j9058j8152j7003j7052j7748j7522
53446A029413j6470j6139j6747j6622j4848j2564j0919r421p365n344m174l493
53434H95307k635j900j656j154M71K658M167M852N423O001O236O564P937J0301
53420I42572J2508J3852J4746J5770J6956J8134J9278K0341K1352K2677K4562
53409A142748K6489K7643K8058K8625K9928L1706L3543L5479L7673M0003M2144
53398A504039M3829M4979M5845M6945M8463M9852N0438N0324N0256N0658N1161
53387B036789N1114N0152M8363M6178M4091M2198M0124L7560L4651L1616K8348
53376B491184K4735K0949J7034J2624P669K984p12m044q486j4641k1724k8632
$$ plain form
53364 2498940 2464158 2424247 2380413 2333808 2285409 2236265 2187437 2139375 2091674 2043954 1996778
53353 1996778 1951330 1908347 1867773 1829232 1792330 1756548 1721332 1686407 1651713 1617035 1582025
53342 1582025 1546740 1511907 1478503 1447145 1417942 1390776 1365556 1342170 1320349 1299860 1280936
53331 1280936 1264272 1250276 1238371 1227323 1216222 1204805 1192946 1180403 1167245 1154032 1141265
53320 1141265 1128973 1117052 1105590 1094660 1084225 1074624 1066665 1060793 1056532 1053300 1051389 1051478 1053316
53307 1053316 1055631 1057408 1058780 1060560 1063477 1068020 1074584 1083425 1094587 1107977 1123322 1140112 1157899
53294 1157899 1176747 1197052 1218902 1241896 1265642 1290001 1314643 1338773 1361662 1383287 1404085
53283 1404085 1424096 1442587 1458542 1471372 1481124 1488132 1492508 1494018 1492450 1487985 1481079 1472057 1461044
$$ packed form
53364B498940l4782l9911m3834m6605m8399m9144m8828m8062m7701m7720m7176
53353A996778m5448m2983m0574l8541l6902l5782l5216l4925l4694l4678l5010
53342A582025l5285l4833l3404l1358k9203k7166k5220k3386k1821k0489j8924
53331A280936j6664j3996j1905j1048j1101j1417j1859j2543j3158j3213j2767
53320A141265j2292j1921j1462j0930j0435r601p959n872m261l232j911Q9J838
53307A053316K315J777J372J780K917M543O564Q841J1162J3390J5345J6790J7787
53294A157899J8848K0305K1850K2994K3746K4359K4642K4130K2889K1625K0798
53283A404085K0011J8491J5955J2830R752P008M376J510j568m465o906r022j1013
$$ plain form
53270 1461044 1448292 1434183 1418738 1401394 1381619 1359692 1336588 1313139 1289573 1265796 1241785
53259 1241785 1217517 1192831 1167640 1142166 1116754 1091462 1066076 1040523 1015141 990428 966663
53248 966663 943795 921622 900047 879160 859068 839635 820456 801202 781889 762714 743748
53237 743748 725061 707031 690174 674641 660252 647146 636015 627344 620662 614875 609168 603298
53225 603298 597132 590294 582316 572953 562349 551048 539742 528742 517675 505836 492838 478917
53213 478917 464748 451146 438702 427456 417008 407124 398060 390126 383173 376812 370900 365462 360294
53200 360294 355054 349601 343845 337485 330402 323171 316576 310645 304748 298652 292839 287690 283036 278792
53186 278792 275274 272471 269536 265586 260764 256048 252216 249355 247183 245456 244121 243262 242800 242259 241105
$$ packed form
53270A461044j2752j4109j5445j7344j9775k1927k3104k3449k3566k3777k4011
53259A241785k4268k4686k5191k5474k5412k5292k5386k5553k5382k4713k3765
53248I66663k2868k2173k1575k0887k0092j9433j9179j9254j9313j9175j8966
53237G43748j8687j8030j6857j5533j4389j3106j1131q671o682n787n707n870
53225F03298o166o838p978r363j0604j1301j1306j1000j1067j1839j2998j3921
53213D78917j4169j3602j2444j1246j0448r884r064p934o953o361n912n438n168
53200C60294n240n453n756o360p083p231o595n931n897o096n813n149m654m244
53186B78792l518k803k935l950m822m716l832k861k172j727j335q59m62n41j154
$$ plain form
53171 241105 239424 237827 236531 235025 232994 231001 229773 229203 228719 228328 228518 229191 229470 228814 227771 227309
53155 227309 227670 228172 227950 226707 224890 223316 222572 222623 222893 222721 221774 220210 218565 217426 217060 217292 217709
53138 217709 217916 217746 217416 217486 218391 219968 221665 223193 224637 225935 226846 227589 228957 231307 233910 235838
53122 235838 237160 238637 240431 241835 242261 241941 241497 241322 241469 241730 241714 241230 240701 240795 241535 242177 242145 241621
53104 241621 240949 239860 237768 234637 231206 228415 226882 226702 227370 227919 227556 226390 225320 225109 225661 226279
53088 226279 226485 226419 226540 227074 227792 228265 228221 227655 226617 225073 223158 221547 221210 222529 224731 226521 227296
53071 227296 227491 227686 227807 227454 226633 225717 224812 223636 222020 220154 218266 216402 214640 213206 212286 211936
53055 211936 212266 213343 214828 215995 216389 216286 216401 217243 218826 220720 222285 223126 223432 223620 223636 222995 221630
$$ packed form
53171B41105j681j597j296j506k031j993j228n70m84l91J90O73K79o56j043m62
53155B27309L61N02k22j243j817j574p44N1K70j72r47j564j645j139l66K32M17
53138B17709K07j70l30P0R05J577J697J528J444J298R11P43J368K350K603J928
53122B35838J322J477J794J404M26l20m44j75J47K61j6m84n29R4P40O42l2n24
53104B41621o72j089k092l131l431k791j533j80O68N49l63j166j070k11N52O18
53088B26279K06o6J21N34P18M73m4n66j038j544j915j611l37J319K202J790P75
53071B27296J95J95J21l53q21r16r05j176j616j866j888j864j762j434r20l50
53055B11936L30J077J485J167L94j03J15Q42J583J894J565Q41L06J88J6o41j365
$$ plain form
53038 221630 220228 219442 219206 219160 219336 219938 220797 221531 222049 222414 222395 221706 220609 219797 219684 220204 221207 222585
53020 222585 223962 224803 224945 224712 224433 224183 224031 224149 224579 225204 226007 227082 228311 229389 230242 231079 231962
53003 231962 232651 232995 233121 233121 232892 232454 232107 232067 232199 232315 232430 232566 232588 232501 232611 233140 233908 234663 235448 236282
52983 236282 236758 236410 235459 234771 235040 236314 238293 240722 243401 246137 248908 251880 255078 258136 260458
52968 260458 261602 261495 260458 259064 257845 256987 256335 255728 255201 254861 254700 254615 254445 253923 252776 251047 249142
52951 249142 247354 245492 243240 240753 238602 237221 236722 237140 238346 239657 240111 239439 238344 237506 236751 235667
52935 235667 234593 234313 234958 235912 236753 237561 238219 238156 237123 235670 234532 233980 234025 234677 235516 235534 234107 231936
52917 231936 230413 230141 230558 230925 231057 231050 230862 230437 229935 229580 229488 229750 230467 231492 232324 232457 231860 231034 230586
$$ packed form
53038B21630j402p86k36m6J76O02Q59P34N18L65j9o89j097q12j13N20J003J378
53020B22585J377Q41J42k33k79k50j52J18M30O25Q03J075J229J078Q53Q37Q83
53003B31962O89L44J26%k29m38l47m0J32J16J15J36K2q7J10N29P68P55P85Q34
52983B36282M76l48r51o88K69J274J979K429K679K736K771K972L198L058K322
52968B60458J144j07j037j394j219q58o52o07n27l40j61q5j70n22j147j729j905
52951B49142j788j862k252k487k151j381m99M18J206J311M54o72j095q38p55j084
52935B35667j074k80O45R54Q41Q08O58o3j033j453j138n52M5O52Q39J8j427k171
52917B31936j523k72M17L67J32pj88m25n02l55r2K62P17J025Q32J33n97q26m48
$$ plain form
52898 230586 230690 230920 230663 229811 228990 228935 229703 230699 231497 232411 234051 236418 238619 239579 238990 237469 235914
52881 235914 234908 234720 235419 236598 237253 236606 235134 234327 235169 237249 239582 241842 244362 247206 249811 251575
52865 251575 252440 252837 253200 253567 253569 252892 251743 250708 250111 249834 249794 250122 250623 250526 249197 246805 243906 240724
52847 240724 237243 233658 230199 226769 223324 220344 218295 216765 214863 212484 210512 209696 209934 210700 211529
52832 211529 211923 211481 210508 209956 210416 211494 212413 212831 212772 212256 211406 210579 209999 209467 208784 208224 208201 208649 209090
52813 209090 209271 209446 209998 210987 212086 212913 213480 214282 215729 217459 218465 218059 216486 214480 212491 210610
52797 210610 208950 207742 207058 206720 206522 206445 206648 207347 208656 210433 212217 213359 213337 212161 210588 209703 209976
52780 209976 210807 211261 211128 210936 211021 211111 210947 210778 210953 211321 211389 210926 210184 209655 209689 210176 210468 209899 208502 207034
$$ packed form
52898B30586J04K30k57q52q21n5P68R96P98R14J640K367K201R60n89j521j555
52881B35914j006j88O99J179O55o47j472q07Q42K080K333K260K520K844K605J764
52865B51575Q65L97L63L67Ko77j149j035n97k77m0L28N01r7j329k392k899l182
52847B40724l481l585l459l430l445k980k049j530j902k379j972q16K38P66Q29
52832B11529L94m42r73n52M60J078R19M18n9n16q50q27n80n32o83n60k3M48M41
52813B09090J81J75N52R89J099Q27N67Q02J447J730J006m06j573k006j989j881
52797B10610j660j208o84l38j98p7K03O99J309J777J784J142k2j176j573q85K73
52780B09976Q31M54j33j92Q5R0j64j69J75L68O8m63p42n29L4M87K92n69j397j468
$$ plain form
52760 207034 206187 206028 206290 206771 207239 207371 207170 207190 207924 209097 209933 210035 209766 209815 210627 212173 214029 215730
52742 215730 217216 218888 221140 224004 227339 231034 234746 237696 239127 238933 237656 236039 234824 234629 235503
52727 235503 236681 237268 237197 237103 237227 236947 235604 233389 231130 229394 228105 226864 225418 223867 222586 221968
52711 221968 222074 222600 223210 223835 224517 225108 225338 225184 224970 224991 225181 225272 225153 224930 224715 224600 224839 225715 227057
52692 227057 228199 228686 228845 229306 230108 230670 230635 230291 230045 229893 229633 229227 228655 227696 226249 224708 223646 223154
52674 223154 222805 222279 221722 221384 221164 220706 219890 219078 218812 219311 220364 221709 223330 225227 227055 228367 229218
52657 229218 230190 231735 233832 236422 239648 243282 246322 247754 247630 246935 246391 245858 244928 243584 242092 240633
52641 240633 239291 238141 237124 236046 234943 234248 234314 234929 235554 235884 235951 235824 235635 235875 237200 239739 242796
$$ packed form
52760B07034q47j59K62M81M68J32k01K0P34J173Q36J02k69M9Q12J546J856J701
52742B15730J486J672K252K864L335L695L712K950J431j94j277j617j215j95Q74
52727B35503J178N87p1r4J24k80j343k215k259j736j289j241j446j551j281o18
52711B21968J06N26O10O25O82N91K30j54k14K1J90R1j19k23k15j15K39Q76J342
52692B27057J142M87J59M61Q02N62l5l44k46j52k60m06n72r59j447j541j062m92
52674B23154l49n26n57l38k20m58q16q12k66M99J053J345J621J897J828J312Q51
52657B29218R72J545K097K590L226L634L040J432j24o95n44n33r30j344j492j459
52641B40633j342j150j017j078j103o95O6O15O25L30O7j27j89K40J325K539L057
$$ plain form
52624 242796 245437 247071 247318 245803 242708 239360 237505 237692 238777 239324 239097 238825 238935 239153 239239 239416 239868
52607 239868 240306 240341 240029 239748 239703 239780 239817 239812 239941 240441 241395 242569 243559 244180 244592 244987 245306 245409 245452 245904 247119
52586 247119 248916 250610 251572 251842 252074 252730 253485 253658 253127 252460 252147 252133 252207 252437 252920 253419 253580 253314 252686
52567 252686 251623 250131 248723 248124 248420 248849 248645 247856 247012 246153 244619 242010 239027 236934 236236 236257 236135
52550 236135 235754 235458 235324 235240 235393 235985 236549 236257 235051 233834 233282 233071 232627 232089 231955 232175 232311 232478
52532 232478 233418 235538 238301 240847 242841 244488 245898 246800 246953 246614 246358 246424 246468 246122 245596 245419 245712
52515 245712 246166 246739 247940 250224 253454 257119 260768 264060 266772 269059 271356 273673 275249 275263 273717
52500 273717 271292 268521 265508 262322 259237 256518 254244 252359 250750 249260 247811 246484 245395 244633
$$ packed form
52624B42796K641J634K47j515l095l348j855J87J085N47k27k72J10K18Q6J77M52
52607B39868M38L5l12k81m5P7L7nJ29N00R54J174R90O21M12L95L19J03M3M52J215
52586B47119J797J694R62K70K32O56P55J73n31o67l13j4P4K30M83M99J61k66o28
52567B52686j063j492j408n99K96M29k04p89q44q59j534k609k983k093o98K1j22
52550B36135l81k96j34q4J53N92N64k92j206j217n52k11m44n38j34K20J36J67
52532B32478R40K120K763K546J994J647J410R02J53l39k56O6M4l46n26j77K93
52515B45712M54N73J201K284L230L665L649L292K712K287K297K317J576J4j546
52500B73717k425k771l013l186l085k719k274j885j609j490j449j327j089p62
$$ plain form
52486 244633 244344 244645 245345 245972 246286 246546 247086 247914 248913 250076 251234 251886 251743 251213 250923 251009 251282 251874
52468 251874 253176 255189 257406 259326 260752 261743 262716 264438 267342 270830 273771 275718 277109 278205 278416
52453 278416 276977 273879 269891 265930 262602 260045 257974 256040 254221 252726 251572 250558 249632 248888 248167
52438 248167 247180 246185 246042 247179 248818 249667 249218 248014 246749 245548 244227 242954 242307 242685 243830 245122
52422 245122 246294 247630 249330 251034 252269 253155 254196 255491 256672 257675 259041 261262 264306 268081
52408 268081 272977 279561 287971 297908 308873 319886 329234 335156 336981 335270 330861 324295 316337 308406
52394 308406 301797 296582 291810 286939 282620 279869 278840 278821 279209 279970 281133 282366 283294 283936 284518 285087
52378 285087 285609 286280 287424 289108 291127 293360 296002 299406 303825 309189 315062 320891 326397 331558 336093
$$ packed form
52486B44633k89L01P00O27L14K60N40Q28R99J163J158O52j43n30k90Q6K73N92
52468B51874J302K013K217J920J426R91R73J722K904L488K941J947J391J096K11
52453B78416j439l098l988l961l328k557k071j934j819j495j154j014r26p44p21
52438B48167r87r95j43J137J639Q49m49j204j265j201j321j273o47L78J145J292
52422B45122J172J336J700J704J235Q86J041J295J181J003J366K221L044L775
52408B68081M896O584Q410R937J0965J1013R348N922J825j711m409o566p958p931
52394C08406o609n215m772m871m319k751j029j9L88P61J163J233R28O42N82N69
52378B85087N22O71J144J684K019K233K642L404M419N364N873N829N506N161M535
$$ plain form
52363 336093 339216 340223 339294 337452 335777 334748 334212 333726 333000 332206 331842 332192 333087 334290 335862 337908
52347 337908 340195 342413 344696 347496 351017 355022 359106 362929 366404 369969 374445 380241 386882 393747
52333 393747 401013 409303 418641 428478 438738 450109 463186 478013 494571 512958 532737 552855
52321 552855 572742 592957 614228 636246 657965 678739 698578 717486 735221 751742 767444
52310 767444 782823 798187 813696 829370 844962 860000 874016 886714 897993 907976 916937 925071
52298 925071 932359 938717 944074 948164 950349 949934 946707 941090 933781 925372 916247 906690 897043 887758
52284 887758 879284 871850 865368 859605 854538 850679 848989 850198 854053 859412 865358 872069 880427 890931
52270 890931 903324 917076 931732 946739 961444 975482 988938 1001999 1014695 1027044 1039226
$$ packed form
52363C36093L123J007r29j842j675j029n36m86p26p94l64L50Q95J203J572K046
52347C37908K287K218K283K800L521M005M084L823L475L565M476N796O641O865
52333C93747P266Q290R338R837J0260J1371J3077J4827J6558J8387J9779K0118
52321E52855J9887K0215K1271K2018K1719K0774J9839J8908J7735J6521J5702
52310G67444J5379J5364J5509J5674J5592J5038J4016J2698J1279R983Q961Q134
52298I25071P288O358N357M090K185m15l227n617p309q409r125r557r647r285
52284H87758q474p434o482n763n067l859j690J209L855N359N946O711Q358J0504
52270H90931J2393J3752J4656J5007J4705J4038J3456J3061J2696J2349J2182
$$ plain form
52259 1039226 1051442 1063755 1076034 1087841 1098514 1107727 1115929 1123810 1131334 1137774 1142655 1146052 1147803
52246 1147803 1147137 1143527 1137396 1129433 1119619 1107528 1093394 1078305 1063336 1048891 1034848 1020966
52234 1020966 1007104 993373 980201 968053 957010 946738 936942 927774 919767 913368 908518 904744
52222 904744 901744 899741 899026 899300 899825 900244 900898 902235 904341 907197 911007 915932 921686 927666 933338
52207 933338 938390 942730 946507 949951 953131 956071 959114 962729 966786 970396 972790 974169 975466 977515
52193 977515 980628 984634 989058 993455 997752 1002090 1006250 1009619 1011871 1013251 1013932 1013522 1011529 1007929 1002909
52178 1002909 996420 988403 979195 969342 959288 949582 941005 934025 928416 923864 920614 919029 918773 919063
52164 919063 919510 920187 921038 921915 923154 925430 928828 932488 935379 937149 938221 939304 940812 942530 943847
$$ packed form
52259A039226J2216J2313J2279J1807J0673R213Q202P881P524O440M881L397J751
52246A147803o66l610o131p963r814j2091j4134j5089j4969j4445j4043j3882
52234A020966j3862j3731j3172j2148j1043j0272r796r168q007o399m850l774
52222I04744l000k003p15K74N25M19O54J337K106K856L810M925N754N980N672
52207I33338N052M340L777L444L180K940L043L615M057L610K394J379J297K049
52193I77515L113M006M424M397M297M338M160L369K252J380O81m10j993l600n020
52178A002909o489q017r208r853j0054r706q577o980n609m552l250j585k56K90
52164I19063M47O77Q51Q77J239K276L398L660K891J770J072J083J508J718J317
$$ plain form
52149 943847 944465 944745 945174 945868 946876 948566 951100 953833 955901 957306 958771 960645 962646 964692 967258
52134 967258 970719 975052 980466 987758 997641 1010068 1024509 1040595 1058283 1077717 1099197 1123050
52122 1123050 1149207 1177048 1205743 1234666 1263450 1291913 1319986 1347539 1374200 1399531 1423299
52111 1423299 1445324 1465149 1482195 1496182 1507073 1514762 1519333 1521531 1522318 1521862 1519557 1515252 1509883
52098 1509883 1504498 1499124 1492964 1485397 1476449 1466443 1455499 1443245 1428945 1412226 1393726 1374726
52086 1374726 1356003 1337597 1319834 1303912 1290924 1280777 1272682 1266478 1262835 1262229 1264319 1268418 1274142
52073 1274142 1281423 1290226 1300500 1312335 1325965 1341456 1358274 1375274 1391450 1406792 1422091 1437729
52061 1437729 1452966 1466684 1478484 1488700 1497618 1505136 1511053 1515261 1517714 1518563 1518224 1516813 1513586
$$ packed form
52149I43847O18K80M29O94J008J690K534K733K068J405J465J874K001K046K566
52134I67258L461M333N414P292R883J2427J4441J6086J7688J9434K1480K3853
52122A123050K6157K7841K8695K8923K8784K8463K8073K7553K6661K5331K3768
52111A423299K2025J9825J7046J3987J0891P689M571K198P87m56k305m305n369
52098A509883n385n374o160p567q948j0006j0944j2254j4300j6719j8500j9000
52086A374726j8723j8406j7763j5922j2988j0147q095o204l643o06K090M099N724
52073A274142P281Q803J0274J1835J3630J5491J6818J7000J6176J5342J5299J5638
52061A437729J5237J3718J1800J0216Q918P518N917M208K453Q49l39j411l227
$$ plain form
52048 1513586 1507423 1497987 1485907 1471687 1454970 1435293 1413156 1389824 1366157 1342140 1317585 1292894
52036 1292894 1268912 1246256 1225086 1205488 1187835 1172583 1159725 1148602 1138335 1128435 1118881 1109640
$$ packed form
52048A513586o163r436j2080j4220j6717j9677k2137k3332k3667k4017k4555k4691
52036A292894k3982k2656k1170j9598j7653j5252j2858j1123j0267r900r554r241
$$ [...]
##END NTUPLES=NMR SPECTRUM
##END=
