##TITLE=AC1746_SEN00019_9280867_xYDTJdXImu
##JCAMPDX= 6.0         $$ Bruker NMR JCAMP-DX V2.0
##DATA TYPE= NMR SPECTRUM
##DATA CLASS= NTUPLES
##ORIGIN= BRUKER
##OWNER= Administrator
$$ 1.72 TOPSPIN		Version 2.1
$$ 2015-07-17 23:55:09.838 -0700  Administrator@X
$$ Compression mode = diff/dup
##.OBSERVE FREQUENCY= 400.02188249412
##.OBSERVE NUCLEUS= ^1H
##.ACQUISITION MODE= SIMULTANEOUS (DQD)
##.ACQUISITION SCHEME= undefined
##.AVERAGES= 8
##.DIGITISER RES= 22
##SPECTROMETER/DATA SYSTEM= spect
##.PULSE SEQUENCE= zg30
##.SOLVENT NAME= COFFEE_meoh
##.SHIFT REFERENCE= INTERNAL, COFFEE_meoh, 1, 14.98509
##AUDIT TRAIL= $$ (NUMBER, WHEN, WHO, WHERE, PROCESS, VERSION, WHAT)
$$ ##TITLE= Audit trail, TOPSPIN		Version 2.1
$$ ##JCAMPDX= 5.01
$$ ##ORIGIN= Bruker BioSpin GmbH
$$ ##OWNER= Administrator
$$ $$ E:\/data/COFFEE/nmr/AC1746_SEN00019_9280867_xYDTJdXImu/10/pdata/1/auditp.txt
$$ ##AUDIT TRAIL=  $$ (NUMBER, WHEN, WHO, WHERE, PROCESS, VERSION, WHAT)
(   1,<2015-07-17 23:55:02.838 -0700>,<Administrator>,<X>,<go>,<TOPSPIN 2.1>,
      <created by zg
	started at 2015-07-17 23:53:57.150 -0700,
	POWCHK enabled, PULCHK disabled,
       configuration hash MD5:
       21 0F 79 D6 B3 7B B4 F6 88 20 88 DB 03 48 BD 9F
       data hash MD5: 64K
       C9 D4 EE 5C 0D 32 A6 F4 D2 2E 68 07 55 71 53 76>)
(   2,<2015-07-17 23:55:06.197 -0700>,<Administrator>,<X>,<proc1d>,<TOPSPIN 2.1>,
      <Start of raw data processing
       efp LB = 0 FT_mod = 6 PKNL = 1 PHC0 = 0 PHC1 = 0 SI = 32K 
       data hash MD5: 32K
       16 2D 80 25 48 19 38 61 2C 37 BB 6A 09 0F E6 29>)
(   3,<2015-07-17 23:55:06.525 -0700>,<Administrator>,<X>,<proc1d>,<TOPSPIN 2.1>,
      <pk PHC0 = 88.9563 PHC1 = 0 
       data hash MD5: 32K
       A1 BB FD 05 4B 8D 2E 79 4B 37 AF CB 1F B4 DE 28>)
(   4,<2015-07-17 23:55:06.619 -0700>,<Administrator>,<X>,<proc1d>,<TOPSPIN 2.1>,
      <abs ABSG = 1 
       data hash MD5: 32K
       F1 BA 98 05 6E 7F 51 E1 80 04 83 26 C6 C6 94 14>)
(   5,<2015-07-17 23:55:06.682 -0700>,<Administrator>,<X>,<proc1d>,<TOPSPIN 2.1>,
      <abs ABSG = 2 
       data hash MD5: 32K
       9E 49 6F 21 64 1B 3E 15 49 D5 DF D9 5C 41 89 07>)
(   6,<2015-07-17 23:55:06.744 -0700>,<Administrator>,<X>,<proc1d>,<TOPSPIN 2.1>,
      <abs ABSG = 3 
       data hash MD5: 32K
       34 CD 8C 92 EA 92 A7 B4 07 70 D0 13 14 4B 1A 40>)
(   7,<2015-07-17 23:55:06.791 -0700>,<Administrator>,<X>,<proc1d>,<TOPSPIN 2.1>,
      <abs ABSG = 4 
       data hash MD5: 32K
       61 7E 47 03 3C 3F 41 74 DD 71 30 A9 2A 46 A9 BF>)
(   8,<2015-07-17 23:55:06.838 -0700>,<Administrator>,<X>,<proc1d>,<TOPSPIN 2.1>,
      <abs ABSG = 5 
       data hash MD5: 32K
       54 31 6A 58 D4 32 22 0D BD A7 C0 31 63 B8 89 14>)
$$ ##END=
$$ 
$$ $$ hash MD5
$$ $$ 99 D0 A7 4A E6 63 F6 90 F2 DA D2 20 DD 35 1B F4
##$RELAX= 
##$RELAX= 
##$RELAX= 
##$RELAX= 
##$RELAX= 
##$RELAX= 
##$RELAX= 
$$ Bruker specific parameters
$$ --------------------------
##$DU= <E:\>
##$EXPNO= 10
##$NAME= <AC1746_SEN00019_9280867_xYDTJdXImu>
$$ [...]
150 150 150 150 150 150 150 150
##$TP07= 0
##$TPNAME0= <>
##$TPNAME1= <>
##$TPNAME2= <>
##$TPNAME3= <>
##$TPNAME4= <>
##$TPNAME5= <>
##$TPNAME6= <>
##$TPNAME7= <>
##$TPOAL= (0..7)
0.5 0.5 0.5 0.5 0.5 0.5 0.5 0.5
##$TPOFFS= (0..7)
0 0 0 0 0 0 0 0
##$TUNHIN= 0
##$TUNHOUT= 0
##$TUNXOUT= 0
##$USERA1= <user>
##$USERA2= <user>
##$USERA3= <user>
##$USERA4= <user>
##$USERA5= <user>
##$V9= 5
##$VALIST= <valist>
##$VCLIST= <CCCCCCCCCCCCCCC>
##$VD= 0
##$VDLIST= <DDDDDDDDDDDDDDD>
##$VPLIST= <PPPPPPPPPPPPPPP>
##$VTLIST= <TTTTTTTTTTTTTTT>
##$WBST= 2048
##$WBSW= 25
##$XGAIN= (0..3)
0 0 0 0
##$XL= 0
##$YL= 0
##$YMAX_a= 606167
##$YMIN_a= -526613
##$ZGOPTNS= <>
##$ZL1= 120
##$ZL2= 120
##$ZL3= 120
##$ZL4= 120
##$ABSF1= 14.98509
##$ABSF2= -5.573092
##$ABSG= 5
##$ABSL= 3
##$ALPHA= 0
##$AQORDER= 0
##$ASSFAC= 0
##$ASSFACI= 0
##$ASSFACX= 0
##$ASSWID= 0
##$AUNMP= <proc_prof1d_extract_pilot.lims>
##$AXLEFT= 0
##$AXNAME= <>
##$AXNUC= <1H>
##$AXRIGHT= 0
##$AXTYPE= 0
##$AXUNIT= <>
##$AZFE= 0.1
##$AZFW= 0.1
##$BCFW= 0
##$BC_mod= 0
##$BYTORDP= 0
##$COROFFS= 0
##$CY= 15
##$DATMOD= 1
##$DC= 0
##$DFILT= <>
##$DTYPP= 0
##$F1P= 0
##$F2P= 0
##$FCOR= 0.5
##$FTSIZE= 32768
##$FT_mod= 6
##$GAMMA= 0
##$GB= 0
##$INTBC= 1
##$INTSCL= 1
##$ISEN= 128
##$LB= 0
##$LEV0= 0
##$LPBIN= 0
##$MAXI= 10000
##$MC2= 0
##$MEAN= 0
##$ME_mod= 0
##$MI= 0
##$NCOEF= 0
##$NC_proc= -8
##$NLEV= 6
##$NOISF1= 0
##$NOISF2= 0
##$NSP= 0
##$NTH_PI= 0
##$NZP= 0
##$OFFSET= 14.98509
##$PC= 1
##$PHC0= 88.9563
##$PHC1= 0
##$PH_mod= 1
##$PKNL= yes
##$PPARMOD= 0
##$PPDIAG= 0
##$PPIPTYP= 0
##$PPMPNUM= 2147483647
##$PPRESOL= 1
##$PSCAL= 4
##$PSIGN= 0
##$PYNMP= <proc.py>
##$REVERSE= no
##$SF= 400.02
##$SI= 32768
##$SIGF1= 0
##$SIGF2= 0
##$SINO= 400
##$SIOLD= 32768
##$SPECTYP= <>
##$SREGLST= <1H.CDCl3>
##$SSB= 0
##$STSI= 32768
##$STSR= 0
##$SW_p= 8223.68421052631
##$SYMM= 0
##$S_DEV= 0
##$TDeff= 65536
##$TDoff= 0
##$TI= <>
##$TILT= no
##$TM1= 0
##$TM2= 0
##$TOPLEV= 0
##$USERP1= <user>
##$USERP2= <user>
##$USERP3= <user>
##$USERP4= <user>
##$USERP5= <user>
##$WDW= 1
##$XDIM= 32768
##$YMAX_p= 451170786
##$YMIN_p= -683904
##$CURPLOT= <Network HP LaserJet P1505>
##$CURPRIN= <$Network HP LaserJet P1505>
##$DFORMAT= <normdp>
##$LAYOUT= <+/1D_H.xwp>
##$LFORMAT= <normlp>
##$PFORMAT= <normpl>
##$SURQMSG= 1
$$ End of Bruker specific parameters
$$ ---------------------------------
##NTUPLES= NMR SPECTRUM
##VAR_NAME=  FREQUENCY,     SPECTRUM/REAL,   SPECTRUM/IMAG
##SYMBOL=    X,             R,               I
##VAR_TYPE=  INDEPENDENT,   DEPENDENT,       DEPENDENT
##VAR_FORM=  AFFN,          ASDF,            ASDF
##VAR_DIM=   32768,         32768,           32768
##UNITS=     HZ,            ARBITRARY UNITS, ARBITRARY UNITS
##FACTOR=    0.250966925370066, 1,           1
##FIRST=     8223.43324360094, -193908,      -150674
##LAST=      0,             19737,           167349
##MIN=       0,             -683904,         0
##MAX=       8223.43324360094, 451170786,    0
$$ Real data points
##PAGE= N=1
##DATA TABLE= (X++(R..R)), XYDATA
$$ [...]
23893 -175453 79454 8397 126967 96035 -48599 150197 -73179 -41329 -78530 -34413 -89265
23882 -89265 -75398 -5275 -39564 66073 154405 -123571 -196825 157541 -108891 96738 -176128
23870 16681 377346 -40800 -160206 245435 -248872 -446721 -75751 -419961 168337 -199681
23859 -79967 126424 187029 -46311 1800 -171309 -110742 186485 -63504 128319 -26376 -22751
23848 -22751 -25841 56054 1316 -141224 -202372 45063 -206779 -160759 -123281 -198762 141694
23836 -43335 54983 -157865 -182985 -248490 314472 34923 -74013 143959 36638 169403 25969
23824 -447064 -49872 -176938 130645 -25331 -118152 189713 -99796 -218408 152440 51989
23813 19709 -172368 134347 68452 -90547 -95151 -57227 312496 30871 -103414 -182633 82477
23801 -185563 -53688 158234 409859 -136573 23824 -29925 -172618 -126711 131486 169655
23791 169655 -72601 211457 -146035 -18653 -16810 173873 -134125 -75061 143417 220974 -41010
23779 50375 -325143 200674 -175588 -108591 -202452 127525 -87535 195740 207339 -70203 221596
23767 -85737 67048 208878 40473 43578 -3131 6773 245353 138271 -199097 -63789 11396
23755 -47140 -238103 34549 -14034 -224724 -61910 -330723 -16197 132489 135039 97140 -161814
23743 11066 161780 -132958 63827 -15368 -108027 -98734 223862 175071 60579 -198199 -143675
23732 -143675 324001 -82714 -154730 -35024 76100 -54507 -136244 -153159 -160940 37343 45700 121131
23720 121131 -151605 100496 195092 -139325 95705 104532 -7820 101723 218099 298199 -3836
23708 -179209 5900 -191642 -184765 -81989 -33665 198039 202253 -51005 4199 81623 -112760 77253
23695 -203701 58735 36032 43145 64860 -32037 -34353 -326109 -161882 -65035 -51545 205920
23683 87622 90679 -233612 394417 216112 -97868 -11297 145998 -90134 -208566 18373 -199059
23671 -61546 -32701 -126168 5822 -272712 219825 -132900 116086 152653 -114801 -72970 -299309
23660 -299309 -74086 -19620 107332 -129134 -314921 117512 -10221 -46139 111070 194769
23650 194769 -4088 86928 -70513 30220 854 70105 56247 38502 -114040 -273718 51716 67957
23638 67957 -48746 -76618 71438 -245640 -107516 -103493 -77862 -345344 -68897 -208530 -27565
23626 60123 -42893 157266 47278 127224 74361 254820 -28347 220036 -74704 -189217 175637
23614 135757 -37610 -67167 -65837 359187 -233716 -121640 -105768 -121841 -150467 183298 -155868
23602 288026 45558 -424096 -102633 -182015 22823 -174443 -211037 100736 306566 367457
23592 367457 -270985 -155647 -75336 242455 -65327 87687 189536 -33122 -81477 35472 -130010
23580 123066 58030 277452 90958 -47004 -112959 -122111 -163518 79723 219577 -85079 40025
23568 340746 -131082 -41 9617 -113358 -109885 217500 -25099 123473 184647 -33758 -350371
23557 -350371 -172627 -246652 30987 -184395 -254859 -206438 109837 -76857 132333 -114758
23546 -57021 -34574 -23339 -101728 22234 -309002 -218569 -78805 -59765 -242167 106964 -24351
23534 27483 -167542 10846 -73169 242198 192758 -329057 -50395 -115225 -54934 -161270 50396
23522 -71315 -239881 246705 -247298 55538 216630 -69998 -139919 -62176 -7112 -345861 -18508
23510 -187525 241289 185707 74655 -146878 -439145 123065 215261 44818 72219 -60542 -162434
23499 -162434 -106510 -122130 -166647 158248 213035 -258446 58400 -115043 23913 67943 -231894
23487 117861 22485 -162596 -331535 -282571 -171815 -47875 -120478 288303 186964 82297
23476 84078 -74685 -35023 -47946 -24305 -96637 -170350 411606 202718 -388331 68740 -143461
23464 -290354 136825 -87026 -77248 -181783 46898 -2027 175273 105766 -191005 -191891 -11463
23452 -119976 -61769 -62442 -192291 5696 -296837 -31097 -25914 54414 -199932 54640 49741 -21404
23439 -255113 158649 29240 332375 -13254 274985 101325 -118495 -72736 -194037 -266079
23429 -266079 181746 51883 -116579 -20601 -34322 -97090 -208022 22601 104682 239330 -292376
23417 -63163 79724 87943 -309624 2377 -98450 -174788 -102812 22917 -68378 -350631 -275047 139643
23404 -172853 4727 -301706 57531 -50699 -198453 -192263 -215401 25095 -34263 75708 98028
23393 98028 -187588 -37542 244502 104619 -79101 58996 58383 -27913 -4646 -120800 -293158
23382 -293158 -224661 -35183 21097 -189400 185901 -74012 -43870 205685 -25838 -38760 -147579
23371 -147579 -194622 376119 -8531 139782 -347731 -65551 79200 -259582 5900 61907 -16437
23359 -21505 -9424 -145834 129172 212511 -237465 81122 -108577 -200958 -152332 63766 114742
23348 114742 -70991 68958 19638 270847 -214255 -31168 -69507 -200627 20410 69716 16668
23336 -178975 138057 -29092 110470 -18115 -134540 -109762 -328764 -91090 55069 -13771 -123372
23325 -123372 32587 41684 -96540 25077 58359 17946 271149 -184083 118147 214460 -2983
23313 -96743 -298794 233338 -148698 112972 30491 2174 -65064 -22222 99993 -6693 61195
23301 -155014 -371016 4557 10428 50073 103323 -40111 95033 -119460 -119479 -169601 79310 57737
23289 57737 23572 -5696 -164967 -169232 -209230 5087 229266 -176318 160809 -56694 32713
23277 -16790 -80129 58621 41539 56723 -11472 -99318 -25281 319874 29038 -112768 -106062
23266 -106062 4573 -208331 57016 36156 8320 -136855 -286750 347221 -415022 -51163 36614
23254 113347 26125 -278229 49225 30636 189288 233781 -351275 -142872 -76096 114300
23243 164712 396685 -29311 27976 42688 82034 157633 100224 66986 -111059 -55939 -374149
23232 -374149 51256 71660 353075 231847 -38550 162846 -4922 65165 114874 312794 233261
23221 233261 -44142 86197 -46601 -38184 -147053 -191570 22465 -47780 272531 221784 -296563
23209 -172025 421787 -122327 74230 -105908 -218748 16733 106429 -203183 -55437 139789
23198 190571 -10383 232395 -57421 -120910 -115715 -91488 4622 14188 -23112 -102533 38408 86573
23186 86573 143656 266578 90407 -65517 -88933 -122643 -12171 231506 247438 223863 -122263
23174 -319504 -125112 -83018 -187271 43374 100303 -242843 265201 -24975 214140 -362361
23163 -344042 -108953 -184180 -204905 148218 345672 93531 -98093 117142 -276611 -292633
23153 -292633 33984 -269389 49969 -17548 86527 160709 -114635 45456 -57899 91270 -222421
23141 67250 60186 32318 -243195 59194 67520 -161611 -222746 -139126 383919 -116250 -35300
23129 76119 12810 26716 -40745 -40185 143160 92120 92948 -61525 -124774 -121568 112446 5771
23116 161946 -235932 -43129 -338984 -82413 -293262 67862 -283735 123700 -95885 -243683
23106 -243683 133872 -93712 -222760 106088 85846 24449 -452796 -180788 281824 -41574
23095 -5278 -122091 -87441 181302 -31887 45130 -162134 -43656 -177609 -296129 370290 -214981
23083 222648 117494 -50673 127146 -135807 -41530 -36012 -64112 -55280 -80138 133251 9180
23071 -130829 -122144 324400 57049 -225477 148144 -129111 -115561 -9461 93069 -235752 -132443
23060 -132443 -97497 244895 59128 -152932 144272 8101 -203172 -58289 35264 -106588 -8500
23048 318099 323668 298323 217365 -217831 -268771 -125184 -8876 163580 295132 -137611 83239
23036 52841 -65733 -40883 54843 -143719 -36563 -107103 -5884 -122979 129155 282051 57449
23024 165806 14556 209284 -31212 -393724 18880 -34274 73036 320506 142252 164036 -60974
23012 -28385 -134061 130186 -60783 202277 -99544 -250363 -324527 57752 -124753 -72261 79623
23000 19689 4619 -61723 66478 -305306 57229 240654 164915 -182002 -66367 -328403 -140311
22988 259443 1771 -322699 -200924 106351 24980 -32603 -6030 84407 394772 -94557 316648
22976 -350176 23606 -293396 230661 -218510 331345 100958 18766 106666 99666 -204800
22965 -26046 94153 112788 -26942 173662 54478 124112 -72806 134742 48134 -173902 -108062
22954 -108062 -127211 135464 258624 141117 -35190 -136405 -192472 -25292 96085 -232745
22943 80618 145722 -289562 -447888 28655 -122882 -71110 -130323 203382 187319 -165298 223784
22931 -251796 4667 13327 50044 -85106 35626 126598 -48918 59779 -197329 -156410 -276151
22920 -276151 -249463 153111 11118 -159928 232236 62187 -181257 214095 216737 162454 -136709
22908 150584 150529 32923 81072 26929 40802 -208913 -128780 147608 425981 -116088 80708
22896 -356309 39603 -103293 -164629 -185809 -277544 -197324 102889 -62366 -319972 -142887 -163055
22885 -163055 123064 -295503 -11141 -13138 -165862 56062 -11394 -66668 3268 7163 53611
22874 53611 -208492 324938 88676 -44366 2437 -206830 14155 -206151 -121498 25886 159462
22863 159462 84225 -188994 -11941 -263753 46066 -443636 -31884 -260198 -117586 54342
22852 -31519 -118908 -166862 174567 5105 -222400 -26825 135083 10953 -188337 69207 -211784
22840 123270 275432 123783 15315 -28413 -198312 163087 -209202 -393074 -92256 -166393
22830 -166393 -150430 -128389 -26432 -96470 -247338 104983 62684 -150950 104265 155676 26558
22818 1775 34838 127646 66960 159572 -350336 -283185 -126131 45457 -85939 263636 -344271
22806 539298 66108 -296576 -201698 -2863 -200619 -298379 72761 -46347 90496 341748 64515
22794 -185465 -19022 -159922 21185 -134693 -298199 139335 -40039 116402 -170751 -64282
22783 -17632 -27618 -185657 -236879 170252 -239404 60325 -119544 -72617 7847 99081 40590
22771 170701 226306 22458 -2152 223251 132668 170139 -364110 -302240 -267482 -47810 -159904
22760 -159904 111046 262246 62195 -193917 -85399 -30938 71035 289378 186344 121608
22750 121608 12296 25318 169932 -255326 -215663 -108433 -251938 -209888 -23928 -72626 71464
22738 -80788 66895 -2032 268490 49884 112656 -91060 231383 -21873 171695 -93719 -112632
22727 -112632 -109499 464362 -224886 126145 -98210 38602 -139599 -273352 -4510 -239502 -39729
22715 293290 6265 101036 31998 161652 -45346 -264824 -127099 -38742 30117 -109822 -446865
22704 -446865 -51956 25650 -233473 -309865 -133354 -72664 221771 -170281 -197221 -356507
22694 -356507 23883 -119945 -122439 235177 194603 -62163 -406372 94335 -203993 194622 -75322
22682 -213332 -206508 -43801 -216173 -95743 274229 -16334 172829 -9031 -2576 93081 -142307
22670 -190839 61205 -35909 29957 154428 76973 191891 35483 -39860 -353697 -181611 31709
22658 -357314 -283031 89335 -21953 -11278 -71833 -328392 250841 116589 25466 -32659 62427
22646 -209453 30907 -51744 -284206 32314 237757 -138301 43368 49512 -610 -216453 -178986
22635 -178986 175814 66965 -69956 -19070 -65214 53659 -114640 66091 -148541 31228 -135298
22623 289256 -294873 66440 -128576 -191836 -366155 -62029 78270 160405 181082 -364829 317006
22611 32503 -139137 39047 -173449 73515 69662 -333835 18457 -140808 12503 -35283 -85543
22600 -85543 118023 -223699 66754 -315718 252257 -262312 180008 24441 -68865 57288
22589 -237237 -325028 -90143 127990 22124 146156 -207714 235870 238884 -179627 -27383 -212738
22578 -212738 -66046 -27520 254355 58644 -43439 882 -85076 -227793 168416 -388122 13383
22566 -75883 318776 378428 253832 4995 -189245 129289 -24826 70419 129472 275864 78805
22554 -179743 -358132 -126911 10139 -103877 -151360 -120122 19996 50465 -180982 82393 55434
22543 55434 246990 -95557 -99673 14658 -263790 -61706 -55566 41874 160837 -327399 -186910
22532 -186910 82118 -107551 -22937 -84414 -56819 -7933 23660 148320 -103154 -178611 -3277
22520 -54841 -209345 14070 -31628 -131642 -26758 201975 200087 -108088 -63122 226824 -46714
22508 -370754 105051 -28202 237588 126966 18147 -138629 -160021 -33816 179176 32139
22497 -216658 -190169 73985 -325111 -100453 297097 175101 286806 -100514 -189835 223136
22486 285136 107634 -89302 188671 105603 -44067 -60018 -214565 -167817 -130989 -17034 -219086
22475 -219086 67369 128859 -240488 -105956 29770 11210 46671 46304 -6112 -115429 -35806
22463 -289865 52310 16161 34122 -159635 104462 129404 12392 97187 -184454 -19009 96634
22451 -85808 -16014 169180 -197456 14565 -275765 -86715 -12017 -104937 -140297 -20912 21923
22439 -119505 -193472 288152 -241393 -82525 118654 112389 -185415 153642 -151485 -77380
22429 -77380 81176 -338876 223382 75257 -48872 -161306 -9830 -9568 279045 -262529 -45746
22417 264141 189777 -134796 -46032 13442 -334486 115721 -158195 15471 232166 11085
22406 -180498 225551 -205670 201647 -201447 -170453 144557 69996 51755 -289604 -51222
22395 -177797 -71936 -163400 -118625 22558 -199413 -62149 91693 -255650 280718 -130098 -6037
22383 -33014 -108990 77223 192886 167302 -101148 -151216 -291410 181000 36230 -64067 199118
22371 18636 -245692 -53135 183196 251690 7932 -448243 182381 24872 75287 191245 219944
22360 219944 -146863 129078 -268402 326638 46362 -50375 158351 214909 -94277 -280442
22350 -280442 225624 -74880 -134576 204436 -154844 -274259 252408 80008 47364 93002
22340 93002 -58178 -16611 150941 -90458 -125642 -335827 -36769 -27542 -243501 -216474 -103463
22328 1234 -198812 74826 -13468 -24625 -67223 152961 20583 115500 -143036 77786 97070
22317 97070 105405 -62159 205246 -138928 44239 -151994 -194114 37033 -181348 -209832 37359
22305 97867 -68090 -30145 -236399 -62874 -107378 132801 -192590 72831 -24031 160421 11977
22293 -107843 -217278 -161642 103382 -130656 23917 72424 -13399 -138852 158948 -31061
22282 48009 -14167 -163814 -301668 10680 -73309 -170313 -324634 -78877 -50744 85638 -250097
22270 -91280 -452060 -195408 -204543 187424 -27525 17480 111370 -38908 -117902 -70386 -74397
22259 -74397 -139092 -159679 70042 28654 -147707 -213076 -73368 90337 -217219 -62527 6489
22247 158460 -291883 125958 -117728 -241110 -427704 -199665 127893 116843 19618 35010
22237 35010 -221704 -192072 -350967 -139019 100393 -238483 -202083 -411152 -92645 -85956 -84079
22226 -84079 122020 540531 47475 -92838 23521 -189589 -100199 -104325 105992 -210954 84555
22214 -72204 75398 44491 3336 -116346 -353454 -36421 -4334 -131053 -422341 -30638 -30140 -94355
22202 -94355 32443 175523 143483 -316289 57691 -16805 323919 -125338 -188437 243659 142567
22191 142567 69685 75270 210239 -44414 -14225 -273255 119249 -211892 -9537 -106628 235998
22179 -44093 -223764 244288 -71782 124447 243089 -254472 -133369 -100248 240462 -402173
22168 -305930 -35369 168583 169078 -289938 -275214 -93100 6827 -59783 -177931 53818 95817
22157 95817 68481 65796 -145250 64378 34132 -33188 -149231 -267332 -59124 -17733 -204662
22146 -204662 -10286 23860 4543 -184872 -364148 54223 85542 11100 -184482 -49395 -64973
22135 -64973 149885 -208312 -160202 -193806 154856 -11940 105678 -53128 -7547 244395 307113
22124 307113 -119622 3702 171126 171744 -143895 -130109 -210820 -158719 -215836 -199238 69633
22112 153787 24996 -37252 66439 -64352 -179378 -74887 -199050 23140 -142104 45031 -68377
22100 207912 14230 74499 238928 -287867 13799 -345246 103264 203410 -81021 -41945
22090 -41945 60323 -44840 218326 25584 253968 179788 -178155 100698 -20278 -142811 -47231
22078 -388336 -90358 -79375 -213203 99344 60722 185476 197488 -45343 26461 -91794 -43242
22066 126043 -65901 -19303 8358 -12199 -427612 -63880 -290338 355938 164613 -383609 -163368
22054 -311575 -231608 17686 94736 -50553 100899 151935 -193212 107844 -114159 -20201 121467
22042 -277655 -232566 188938 78415 -48012 116911 224239 41573 3519 -104837 139530 -26930
22030 -34719 -139197 143116 88926 -211078 -125112 242003 -27633 -144024 -228143 -65843 -58365
22019 -58365 -170073 -265898 -10066 -219271 191163 -121204 131378 -56251 -34427 -157088
22009 -157088 235236 -176548 -120851 -237128 -206263 -36596 326749 39697 -177532 112838
21998 88396 -33521 -184105 155673 -299406 -87552 284432 -139287 -315339 69950 -288785
21987 45052 -325670 -160361 88483 150961 208482 -83792 -143704 63248 -38597 66345 -358380
21975 -189114 -187213 103370 262716 -10989 14000 -42619 -26168 -3242 78341 -162881 183464
21963 320421 -72931 -317021 158530 -404674 -75081 57122 -322505 -136009 155159 -370135
21952 49366 -90394 -174806 15527 -63532 -21395 -109874 -207678 157120 127830 -244295 -77998
21940 194300 -12377 -50313 -430097 215487 -9866 46608 -69000 121910 -19500 -218379 -90569
21928 12020 100089 1699 48389 21080 -25777 -154883 -126990 -152868 -145092 -115798 -66236 -49831
21916 -49831 -150632 -433523 31106 61867 -334206 -66018 -228570 112720 -31522 183382
21905 273162 -184052 57813 344347 -97545 -10814 -224969 114597 -49266 102310 -155641
21894 50284 -86028 10991 -115013 -59564 -231721 14562 -300464 -222407 -85276 -275995 45314
21882 -148352 138150 23267 -30393 188171 -19411 -176195 -68352 -310224 270912 254202
21872 254202 15985 -104724 278443 -202598 -70227 -56591 366528 -71254 -134392 28696 -238183
21860 -659 172764 48505 -241460 -192816 -80564 -172158 -421689 80483 -191308 205737 198719
21849 198719 -192571 -139797 -111766 -21943 44417 -28714 -9643 -8546 -90784 -237950 -41925
21837 155233 325755 -218196 -27172 123876 208079 -64058 54596 89541 139112 -251854 -363500
21826 -363500 75928 -122544 -80510 -107311 -249500 -105154 31432 -89668 -71540 185585 312238
21815 312238 -77484 144494 -183984 128028 -418874 47146 78954 -389824 43525 66304
21805 66304 -236129 -127645 103889 -80584 -38729 -279648 -353055 -98851 16904 14348 87487
21794 87487 -274330 -247463 -12759 177076 208197 -155474 -69157 -136425 104166 231588 10071
21782 -94434 -115703 195114 146281 102558 -227574 122862 46694 -7201 -31651 -112744 223083
21770 109618 82727 -94522 -16926 206885 -244380 214783 -193015 -363744 206787 -144901
21759 -397963 -215486 -7934 81600 244764 -57360 135385 -52046 -107486 -104924 -420076 -320842
21748 -320842 114933 -238530 121200 47790 75413 -81686 200406 -261696 -34629 273047
21737 -77688 -46213 -132617 359807 156215 176978 -60171 405993 83859 -235975 -163110 -11079
21725 71210 152242 -229492 244914 821 151274 -73029 -141218 -212216 -252185 -205811 168342
21713 -90840 -456236 -272936 -341417 185856 -296935 -257058 29838 -225300 -183025 -251481 -159376
21702 -159376 -349207 -162612 5125 -23283 -10331 54464 24237 -333568 -123599 21252 8476
21690 26200 -59130 -339642 352991 99036 -255213 -86919 -11643 -89746 96092 -181729 163141
21678 -224152 144019 -272204 260928 301503 29428 -142468 -162478 -109339 104042 103786 182001
21667 182001 90095 -15322 -210752 -54857 308570 -232505 160589 -124366 -252669 -105866
21656 101139 -88662 318418 -35068 -328641 -114869 179135 -24257 419688 385468 149059
21645 53572 -249572 -212735 13400 258870 47327 21940 -54068 112725 148638 -192860 -222285
21634 -222285 34335 -275769 4947 241572 282983 67552 -256903 -107447 -58562 -109984 -211498
21623 -211498 -87995 -43606 -188705 -26029 199623 36567 178977 -304990 250534 166597
21613 166597 -237145 -249487 214889 -170982 -185194 -11151 -1672 -112074 -44663 -138758 -250773
21602 -250773 -173273 -112993 -22378 -92841 -90745 -198293 -233973 -8453 -52082 -228075 -337547
21591 -337547 -145214 3088 -109283 73853 190266 -37901 198976 42529 -93770 38400 28637
21580 28637 -354798 -118187 97707 58951 20057 -15234 -274752 -155153 -64520 701 203731
21569 203731 160168 -399233 21890 90573 -24368 18047 241081 39311 -273960 -120648 167774
21557 205831 -78630 -160536 -97402 -3839 -89986 143781 -141852 -36956 -168834 -430156 -117541
21545 -222330 240755 -337608 86182 -237765 -65140 -45366 -196016 92468 -74496 27165 262817
21534 262817 -281107 325828 -10163 -84745 1116 220141 92049 -33437 141003 66730 -179179
21522 -13842 261186 -43128 69381 -10035 162139 31028 -179108 -273224 -211708 -33731 216224
21510 -117349 -240747 -351556 -58349 158094 70330 -81111 30253 -140517 -76531 -327259
21500 -327259 -72995 64525 -33629 -148213 -229000 -64140 -57287 -99808 -127392 -165244 -42017
21488 235518 -122115 -19996 -166740 -45431 -7254 -29014 15868 46470 -152670 -147659 21771
21476 55578 47102 -123075 199042 -142137 -53818 -126199 -144648 -20628 49936 134215 -176337
21464 -139071 -45953 -36906 -10128 -175929 5460 -72195 -50085 188928 120277 38740 63921
21453 63921 -125216 -264611 63671 -170324 -252144 -248714 187817 320868 -80363 -358075 -22366
21441 107889 78203 28253 -37376 281656 662610 328062 391704 36142 24428 16092 129920
21430 129920 54565 -70404 43926 214375 242847 -6810 -6277 -75001 181033 -77943 -36963 15593
21417 -59631 -188974 -212340 129387 8371 -303686 11150 58142 -115227 -81058 135265 -16012
21405 -90866 212247 92812 -360570 -31169 -309269 -184426 46465 98706 186461 -230101 -296762
21394 -296762 -135373 -251650 301312 87103 39125 168089 -219668 -196098 -10236 161646
21383 142476 115636 -104269 -72481 105620 165061 16791 -31126 -162045 10928 -220326 120463
21371 -303472 -203325 -97699 -128398 -92209 235906 29179 171023 -98087 -1116 -9865 -6245
21360 -6245 -247456 -137708 -87817 -623776 -264738 85856 115664 -90151 -73961 92404 -105952
21348 -331183 282336 -298762 -108611 105314 -87510 128705 -111574 -95601 110964 -382234
21337 -217778 -121379 -16035 -318300 -202139 167244 222542 -251315 70308 63450 -9160 299521
21325 12855 -378828 -528503 -148596 85008 -41642 -12969 -78016 159100 -218005 28365 60011
21314 60011 39161 56283 6549 -201501 119178 -122919 94735 20785 90763 -97907 -232023
21303 -232023 40687 -90752 9678 57177 -14720 -2463 -80606 45521 -136259 -126885 -94902 42256
21290 -245267 -27739 -46102 254 -36258 -226770 -232837 -81263 100908 -209734 -470689 -234334
21278 -63713 47057 -55422 -142788 -128904 89048 187137 164598 72041 23022 30970 -5226 8604
21265 148852 -177 -152942 -44780 189432 -173944 144218 -238527 77075 220073 15109 -535286
21253 34679 29902 -200181 131532 -257501 224092 126906 -107526 57940 -233626 -358905
21243 -358905 -136241 172764 334110 -50077 -70719 -52961 -63795 174778 -193489 -38326
21232 26718 -82143 72952 -202319 -257739 30303 -57620 187980 -189217 184119 86699 191317
21221 191317 -15203 76565 -156322 -181463 -181623 69021 -118969 -36289 28527 -218212 -243310
21210 -243310 162064 249218 24853 95324 -99369 147492 100414 -229051 335602 -20949 -128246
21199 -128246 315809 -152094 99228 -141783 -112224 -384664 -140292 84176 78889 83335 -98523
21187 -353045 -560357 -184944 62622 47043 -56835 79998 -221989 -19297 -75566 -4832 -399490
21176 -399490 -304690 -224738 -131232 -53572 -244930 -317179 -170572 11326 -191546 39697 -198116
21164 -196638 -77050 112688 42443 52273 186739 -21313 106285 73417 -150086 -179918 -266465
21153 -266465 -92649 -325351 -58892 14333 -66677 -135483 46750 11098 -57325 -131040 -260858
21142 -260858 179377 167157 -226062 -193622 -198666 110965 -135432 -295295 -52736 111248
21131 -260805 -208199 54460 -137628 195036 91699 146541 -375787 -23811 150386 -72187 -289194
21120 -289194 93563 -32039 -244593 -115059 62618 1936 42631 -53966 -466567 153978 144259
21109 144259 259526 147971 296359 -103626 27670 -112516 -193517 -81159 46871 276302
21099 276302 -94048 -268627 -187786 -185354 7464 145875 128967 -8547 -101913 287736 -22324
21087 -155433 198174 -130676 -127921 -47294 -63082 -108762 70534 -30241 -95855 136074 15906
21075 137566 98028 55149 100286 11189 125237 -109447 20071 -96513 -20907 -73784 1301
21063 13667 -102659 -453686 -96350 175759 -49736 -190154 -226754 -70514 -314558 -107207
21052 -201114 -184160 -137540 -159648 47530 37974 340662 27040 9980 101570 -147519 -154766 -215695
21040 -215695 -74959 312063 -290477 -324129 261974 -293248 -89292 157252 -106607 107061
21029 228200 -281640 -265592 -96301 -314335 36862 273879 -101829 -286157 -36048 -190631
21019 -190631 -200226 -91443 46490 -74710 -188841 -143371 135486 78345 128866 -228836 82999
21007 -151050 -127624 12247 137621 -4338 276320 -30723 50583 35485 -40386 148881 120125
20996 120125 -228465 -23481 -436348 -184538 160811 84105 386884 -188674 -284938 -109633
20985 115390 -192805 61030 -303105 -113383 -118458 123345 -192844 145856 150632 187943 -107739
20973 124693 -55752 46600 18832 10392 146323 2117 99942 104926 253024 -91698 -266207
20962 -266207 -31187 126086 -87420 11933 73952 -255377 2547 -77228 187715 -231299 -189182
20951 -189182 -192858 249539 -67716 -362522 -140967 115525 186854 -53430 -215486 125598
20940 41783 -93066 147839 -16786 -108330 -359269 -121477 302082 35164 -116554 138254
20929 -130264 48662 71992 91835 -280603 290101 -343445 128170 -244282 13645 -316824
20918 -236113 109249 163994 109411 103867 76351 -245892 -145518 29924 -197118 6605 -12297
20906 255447 70267 -132374 -214272 -38513 -48568 226319 23845 92658 228322 -121690 -3288
20894 101197 -48013 -312195 130854 231925 39219 -13160 -183157 22914 -111034 -179047
20884 -179047 264382 206587 -241249 21216 -120099 -104834 -165055 43186 -1032 -335122 7880
20872 50241 -294696 -2250 -487614 -95979 -62010 -25285 -97328 -181658 -94496 -156721 60622
20860 44152 -362120 -123699 -33535 -18390 -18778 -125505 -131404 3318 -170416 -243825 -150863 122629
20847 -143217 66768 -169303 -181320 -210039 16208 208232 322540 -33998 -23643 48027 -39069
20835 -23058 -224191 -172644 -240243 -162357 92530 -98458 136545 -21192 -83377 28171 -77664
20823 153655 47170 102216 -174028 -295418 -34503 46694 -101589 58792 -330749 103401
20812 13907 -205358 -114330 29989 38605 -68808 12174 154719 -153634 -278261 -190334 122603
20800 104197 28942 -203369 -94553 179802 -150179 -92110 61590 -267538 23616 -142516
20789 -219059 -41174 -95743 237322 -235973 -171471 -122190 79709 -78312 162789 -252217 -64820
20777 187694 145769 -93707 -189681 -228592 -103518 96151 -305826 -236392 36375 -187029 -22331
20765 254857 -218599 42373 -295160 -83152 -295633 -95793 167908 163827 59705 -142307 60037
20753 -171347 131258 -312261 -27022 114318 -198498 -169735 95112 -209628 -294184 -285643 191340
20741 185739 -38994 -74361 187781 -297485 -152673 -326135 119053 -188139 -319900 147200
20730 -80313 75219 238434 161361 -108370 -59043 -288560 -132454 -85698 -47340 -97147 10717
20718 -126609 45120 522458 35509 -81068 240171 -70438 -164298 -108775 -474638 -4246 52027
20706 -253034 -120599 -271214 59396 -27698 103844 -268652 -132232 -27741 -138726 58348
20695 -273768 -91235 51830 -368481 -152810 -9942 -33528 -218381 -98410 -109148 61920 76266
20684 76266 -15115 -171185 -134279 202464 81189 -231880 -252351 -46996 -144623 109147 -60029
20672 51749 -228519 -36537 -90057 -208707 -127392 129050 107157 9499 93242 -218113 178409
20660 -21422 74714 -363896 -105158 118615 166805 104046 -29179 129909 115730 -97607 -217375
20649 -217375 -330686 -207215 -161811 60793 -107769 -32221 25888 45891 192729 12501 21988
20638 21988 230708 286135 80887 -67940 -224681 -548641 -10517 -48111 -52738 405375 50386
20626 -200259 74142 -37365 120283 206103 164742 -55063 -84085 100502 -54731 -111734 -167382
20615 -167382 -372911 -98708 -218366 -100361 -30925 58696 44605 -105247 -273551 54901
20604 27771 -49142 -322966 -190819 -64221 199620 83355 131799 -40672 -174080 143337 -155334
20592 25766 -179893 -28664 -441947 115358 -141819 -72318 114427 6894 144276 170474 -291978
20580 243718 -80499 -162585 394846 118786 24788 -151750 -333629 -127918 -16568 -80043
20570 -80043 -13103 -111178 -43063 218813 12425 28528 -131578 -17116 -105778 -55417 -339550
20559 -339550 155454 5762 135929 -188487 -273469 -76347 218358 -120877 -171904 105605
20548 -130709 -109744 52711 -108915 -168267 105278 55614 209209 -72890 -58601 207233 -252115
20536 -169828 -25112 -106583 -292008 -466264 34258 109597 -170730 42389 -52324 -69763 221121
20524 -100826 -177141 -111519 -123879 -111940 -9173 -221570 -393281 -143522 -40341 60518 168831
20513 168831 -100 -254809 81124 100077 -21553 -207924 39265 -92276 -98090 -183437 -93575 -38906
20500 -127312 -168690 -148529 -536161 -274976 -59289 4999 -102719 -246870 147365 101858 -61817
20488 -200506 -215159 -4378 171156 -165928 -166612 -138187 -52400 122005 -186326 -74275 270983
20476 32492 83410 76823 65612 -69975 -361494 -182028 -174066 66851 196642 305588 -2594
20464 175768 -367938 66566 68696 -19295 -69772 -161649 -9580 -203966 178452 131549 -74594
20452 -15535 27221 80530 102930 108374 9893 -95957 -46166 -122893 -150431 74083 -106399 153313
20439 -107819 -52801 -57547 -84333 -175714 161732 318391 -125011 63028 166065 -98468 147620
20427 -50261 233912 81794 -48469 -143709 -157510 -15074 -128340 -19909 -221620 54313 -101719
20415 16227 49337 -195557 -168375 -123622 -277508 95229 -277038 146824 -33261 248916 63572
20403 -141805 -357043 258078 -86542 -111269 -132278 -14578 -85348 56043 141698 250403 -140134
20391 -95779 -200687 -357174 -188878 -117331 -31441 -247818 -14801 141096 -87164 -173152 155307
20379 -30049 -420585 291894 178699 -279997 19350 222760 -163939 19954 -186291 -62288
20368 189203 -27357 -170435 -123330 -67633 356786 187503 -25138 -207043 -60763 -60631 72097
20356 -119309 -156983 -269056 107179 -32056 -49751 -142004 -113157 399449 -151132 -49484 -95382
20345 -95382 -82415 55671 -57013 205878 -101759 -141698 -312267 384306 -106237 -37451 82218
20333 -195278 -75647 258393 41298 42969 -6681 -105438 -41673 -350189 55393 140407 101997
20322 101997 -296788 246507 -138907 -127480 284747 -255431 49376 -204946 46672 189911
20312 189911 65320 231841 -113873 18731 -289559 72174 -184226 41129 -324398 -252354
20302 -252354 -108946 -139849 -271368 -136434 13743 -202554 429798 -106303 -7537 264885
20291 -99520 -268284 -150938 -239845 -30794 -293248 -44995 -206940 -370382 -367989 63477 -12443
20279 -46540 -137945 -274066 -90415 319258 -114918 -30079 -11654 143889 -78449 6355 -180983
20267 118242 -101928 -218803 -63619 -91307 -105555 162286 105663 89840 86539 -77837 141575
20255 108680 67593 -46500 -201184 -238633 -200258 -44748 -47773 -270571 10618 -146208 74765
20243 206445 71100 29316 -180030 -42653 -219191 -472609 49142 39190 61626 84989 -128059
20231 -70432 56656 1198 -163469 -153663 -17444 -100569 -161825 197584 -308298 -124767 -58463
20219 31126 -209128 -205138 8529 -228312 -21565 -85954 248748 -6846 119312 -206880 49193
20207 -95904 -38173 104553 111313 -249460 -36965 190877 82562 -27934 -98136 -125336 -70640
20196 -70640 112059 84188 48433 147954 -117395 -228225 62282 -204035 -211351 171314 -344478
20184 -56313 34371 166884 -84812 251283 143484 -13345 151300 -83366 -113619 -19664 -12835
20173 -12835 -66450 166131 -97321 123398 -92403 -197258 -13875 44555 -47751 -111347 -92160
20162 -92160 -107442 174935 -240486 -11886 -205688 47645 -8667 -117760 10892 96235 -29180
20150 -8924 98354 -43684 250908 165443 -112029 -85409 55592 17928 394882 88443 226217
20139 226217 102769 -36036 34987 -99882 -6243 -208381 8922 -70851 15234 -47360 -117821
20128 -117821 -126512 -346249 -247578 85944 110748 -103248 60159 -54042 -157341 -142438 -54014
20116 100907 -110223 -81047 183774 -256548 126271 -66593 101532 -93181 -60202 -197039
20106 -197039 52318 -156797 -465887 -54750 -174363 36784 -161082 -75018 10344 -333082
20095 -311249 -535885 251117 169538 89358 -318200 -94632 -118653 -96168 -60663 -207029 43739
20083 -92559 -278672 -58195 46600 -249760 -213179 35670 79988 -84429 74294 -94564 -99911
20072 -99911 -7749 -156623 140714 60227 -181350 151482 -471016 -106780 237636 -167604
20061 -31505 33826 -234406 164640 45019 -134901 39235 -184424 -13328 10363 263072 273856
20050 273856 -292150 231175 123767 -152353 -14227 -222231 105214 -88960 60434 -255264
20039 -246094 -292988 143575 70650 -162490 -35736 -129712 269479 302113 -189309 -356706
20029 -356706 -29503 -82723 189950 -178256 -199260 48400 -313537 56879 271660 -8759 -36624
20018 -36624 -13772 -84491 5878 -66323 119234 42079 110700 106808 128564 -84261 -132772 -26410
20005 62947 115282 102276 -172103 -6775 -197780 -93720 -114000 19562 -155787 -67852 65026
19993 -105219 60297 113952 15531 182849 88857 178018 -132183 -43275 -113430 96415 -167614
19981 -224718 -208643 119275 94036 229078 -187595 -118288 -297100 -152629 149955 -321775
19970 -246651 306322 157152 -349306 269149 -100565 -37588 192707 -69081 133513 144508
19960 144508 54736 55304 117370 115420 81288 -26413 -139389 51767 -59870 178714 3175 -139415
19947 112647 -449085 -167278 183994 -255155 -276125 -168732 -216652 -34546 165773 126170
19937 126170 17953 -125147 94477 144896 -172260 -170101 -19050 -163329 -23826 -182394 336440
19925 -68097 -105092 7480 -144242 -147438 -136544 -16437 -130290 5710 -52473 -108337 21460 -149156
19912 -8850 2630 -222828 -39740 -32310 -406885 -9129 -275078 -141356 -34679 -133912 65018 44012
19900 44012 -47531 -2726 67275 -38890 -362415 183206 -46788 62746 87296 -221674 78741
19888 26058 -151606 -69752 -230407 -117161 -55168 -215921 -136286 -297351 95172 152673 -85845
19876 -173412 -476946 -265 52460 287967 -68243 -56548 -169780 221185 69051 130221 -364963
19864 49908 78248 -182012 -396475 -88810 224149 441101 89042 -215647 -305237 89219 329156
19853 329156 -17411 2549 -123733 -392432 -47578 175812 -165797 -244074 20264 -297574 -73843
19841 215626 -194471 184059 219709 124195 -113998 -278950 -281643 -111402 -107176 -107970 35701
19829 92625 184174 3530 -192887 51141 -224558 83994 -231835 166063 89572 -5408 114289
19817 -227140 -103141 234215 -10213 -57316 -169785 -66407 -344228 -287955 175833 201799
19807 201799 -12470 -273181 72061 -31863 -58741 132382 -93619 -21577 230515 -72483 -149741
19796 -149741 -86416 -47632 -185860 -233082 -238573 -27090 -11884 -90637 9137 -120199 -45725
19784 -85355 -263992 -117241 143827 -222302 48726 -280715 -36472 -278276 -356136 54180
19773 202447 102914 156472 -60941 -38197 -290883 115468 -218936 -390731 -188590 -36766
19762 281616 -106273 -189638 -119024 107726 -155589 -135123 -165633 -69578 -253238 186457
19751 -176337 -90732 70615 -60485 -3657 -48849 -324662 79967 -8942 -205942 -157378 -59278
19739 46407 481623 -351800 -181371 13169 251567 195092 40633 -57131 388958 8519 15101
19728 15101 -219901 236000 344645 -108733 -263676 -63773 -47159 -2187 -336180 -336386 248649
19716 3420 -26987 112077 -418426 -206885 12194 -346619 169526 -227809 144466 -44312
19705 217307 -108050 64173 -36062 -111006 -88227 -38072 -168388 -379808 251087 -156864
19694 -74732 -101317 -264618 414659 -8513 113135 -241258 -49282 -184745 250737 62371 -449101
19682 -145233 -339868 406943 -30879 48306 97981 -168827 -12245 -101052 277653 -344198
19671 -1180 -389112 -194022 30313 -219189 -243714 40238 79957 48086 210895 -244547 198274
19659 96535 -361874 141926 144447 154247 55084 57721 -275742 -8709 52346 188566 -245443
19647 -91412 -223776 -317374 183030 99185 -28662 186820 -84196 10476 -61564 153990 15162
19635 -445602 -72451 -44815 30345 -63141 -83632 -304665 -241825 -75964 -188237 -240175 -264244
19624 -264244 177469 191828 -71655 -163300 -47644 54974 -28770 26159 189568 106406 -105069
19612 140465 -111461 -32943 177435 -113581 233635 109472 -34440 490763 -112576 -63590
19602 -63590 31250 70436 195693 208123 91346 192055 34781 260161 59347 -326399 -81785
19590 -453860 -176346 56770 187641 207690 -83770 146548 155505 -114531 45355 48899 51399
19579 51399 60096 77789 45660 -175732 5736 -171024 54156 -94985 -303253 111260 -74444
19567 -136551 -156530 -237628 -329609 199027 -302377 178004 25956 -236032 -60055 31209 -184829
19555 68602 -265269 -163403 206628 -97153 -73999 151281 -286817 -79016 81351 -303210
19544 -241586 25070 54359 -175161 79964 8746 158072 239856 -381046 125170 -119885 103282
19532 -29541 -152548 -115570 -74783 -184387 -608 -249548 -125548 157908 113267 -273640 -90918
19520 -123174 -102796 -165711 149603 -233626 -152766 -315393 -178954 -500425 50273 -113408
19509 19577 -53293 -315814 -141053 46973 172332 81720 -155065 -104008 -60397 -8720 -74302
19498 -74302 9632 -205443 -120452 -124506 277473 95821 -143190 104530 -155884 -17225 -79637
19487 -79637 32410 66018 4046 15314 -328295 -131395 -398279 -23313 -25762 42647 -141138
19475 47148 -27142 -145665 -10009 45166 -56945 -114375 22311 28944 -292296 382974 -243020
19463 -283044 -319763 -259142 -366977 -418397 -77590 -232499 -76459 -352927 217793 -95048 293810
19451 -130940 251899 -14580 108448 -205953 -93208 -231258 125148 57346 -219716 -116617
19441 -116617 -73354 -126158 -6556 -2433 -187141 -485843 -56106 -149820 -138437 257337 -288832
19429 -64834 71798 -201774 -252215 273729 -116388 -38503 -81880 170956 -114164 -229038
19419 -229038 -19479 -268330 -15968 342056 -1073 160905 -85222 -75347 -198017 153556 95704
19408 95704 -55831 134312 32981 -89286 15986 -43198 64965 -238942 64909 -245451 47826
19396 345394 -253606 63494 -57148 -36012 -150093 -150403 146622 -244088 -64850 -167263 57241
19384 125804 44231 2477 -63435 75485 157727 108817 -44821 195280 -46285 -290231 -125003
19372 77478 -367666 -9392 -133516 145087 15084 308029 -114645 -110459 3165 22001 318078
19361 318078 596 -156888 -176622 -6787 6077 87274 -379678 -164643 71677 165026 66257 -49419
19348 -230325 -98692 -134335 -196968 -206318 -70998 -143947 139337 -141858 76057 -263738 32022
19336 -119228 -7149 76976 -275399 -384741 99900 131911 -102683 -223914 -80263 233379 169568
19325 169568 38645 -66870 -392282 -101412 -336725 -265400 104936 147201 342890 -275489
19314 -233069 -36545 -98724 -162593 -59521 27212 -175287 -60950 -88046 -71443 143901 -211303
19302 -142988 187138 293239 -79212 -245912 69848 -40926 -365821 194598 -65329 -286489
19292 -286489 -20989 30033 -76223 96848 -41974 29687 -227866 67384 53451 15666 -83982
19280 -188869 -100421 47991 38734 -244418 -393631 -25026 -218495 26893 -282927 -184048 -262666
19269 -262666 -135951 280864 135288 -53040 142135 37787 -148302 -401613 -178915 -196693
19259 -196693 47966 -186480 135638 -247026 137993 -80419 297923 182828 -17987 218294
19248 -53026 -176103 -529 -160036 254609 -49480 -189933 -280791 180778 190517 -235415 -493268
19237 -493268 -158912 -278393 210169 430376 -229128 111339 97321 -222775 102767 -5539
19226 -39948 -30667 77398 196296 225247 -18278 90824 -183684 -120819 -82422 78192 -148903
19214 -16072 117244 -154085 -378001 144217 -322504 214709 -27935 64156 -284210 116947
19203 -311683 -192974 -49378 253399 -344792 -162310 -300342 111054 -265188 -74322 17123
19192 -140144 -94352 -79914 -399576 -198934 -78294 157546 185634 20841 -50336 -334706 -120432
19180 -64197 -184040 -343545 11711 -114300 -57493 214587 -164488 -34274 -377525 41101
19169 -154013 38378 -137236 -4401 -187386 -225148 -475414 -146687 -108671 -5615 83627 -155411
19157 2956 68885 -503034 -40405 90119 141205 331597 37415 -156003 -78597 -151280 -180207
19146 -180207 -382166 148622 -200634 -183855 -27634 -3658 -112090 -427837 485830 -131546
19135 -267258 15622 422889 -281774 -88830 -139893 -275320 236535 -104227 -263897 70588
19124 -282212 -411134 -143609 -157632 121664 -354180 108659 291888 -76487 169855 -209296
19113 257594 62513 67735 -122918 -102296 -57555 45638 101631 91452 -133119 -48099 5714
19101 -228634 -91634 740 -10322 144559 -170971 -225149 -62944 105263 7845 -53193 -104434
19090 -104434 393 -15841 -225494 -19703 -328331 -4484 -209366 -167129 112657 -63703 33722
19078 90536 -173642 -255854 -267278 40835 -71938 189269 66368 -23191 -118388 -190202 78732
19066 -58321 -300432 235229 -289418 -120754 95179 55582 33848 126804 -104434 -314892
19056 -314892 65983 -72262 -3454 111599 -24465 -100112 -37448 -368149 -252788 74154 304606
19045 304606 185227 119495 -119789 -5922 -123702 -195417 -108365 -32999 11275 -98774 271807
19033 -122210 166716 -179265 33597 46184 80993 -156705 135976 86655 70915 -105519
19022 -147829 198380 116035 -16787 -45317 297694 472104 -32139 -276207 107866 49433
19011 -80058 -173546 -41267 221620 -72164 -152536 -113951 182596 1349 -81765 237087 254193
19000 254193 -227182 13558 243332 64991 51807 -125345 -83772 -156656 -20488 -84003 -12816
18988 170692 -146975 -68036 -22212 43937 18648 -254287 -241874 -275303 -255175 -26184 -194628
18977 -194628 -220043 91530 81887 -48822 102740 -113762 -8358 -276534 -257305 -313179 -199175
18966 -199175 -332433 -63702 124298 -113298 5988 -211226 11359 -93640 365285 132780
18955 -57894 117668 -227149 239254 376476 -70737 235762 32979 64656 -381661 -335485
18945 -335485 -136056 -199812 195274 19003 -285964 -3813 -272643 77876 194142 -94995 70798
18933 -124589 -3879 -163147 -205884 92237 -131405 179603 -92427 26582 170764 32451 -508627
18921 -225829 -340712 -230765 62883 -181887 81086 -170967 -70466 34283 3870 215933 -97711
18909 -174037 48149 -70194 -144084 311944 -194831 7103 -35868 -195226 69719 204904 -138635
18897 -30374 -154660 -91816 -69990 -99283 -57863 30585 -19499 9046 114958 50583 -102260
18885 27667 44116 133411 -137834 -92346 160472 -196367 -85202 -89692 -40740 -161901 -100514
18874 -100514 -92446 -119803 90237 -179743 65536 118161 226064 196961 -32605 -140915 30776
18862 -170429 -61214 -223864 -28668 28342 -51647 -74375 -83319 -31592 31643 351853 -209689
18850 118192 51129 52662 104547 -12874 298786 274150 139059 311703 327755 -131879 -99025
18839 -99025 -71389 214106 -44790 -39575 134560 -105363 -88212 92001 42643 -172281 62692
18827 205206 -193206 -186712 -140426 150908 -66507 -166367 -63857 62277 133961 12273 -21695
18815 242718 6117 -95610 -187345 295486 -116463 71171 -171960 55571 229279 -83665 90774
18803 16807 -216147 159357 -260610 -190459 -106151 18143 -20533 -72617 31651 -90093 156281
18791 108953 188410 -251552 -174288 -37439 -119321 -67851 -4262 17055 -311964 -205907 54074
18779 -52581 30194 -133349 101492 -156172 -67982 -17162 -41406 131124 -12530 -163955 50122
18767 -202844 -150635 -50856 -234590 126053 -430042 236061 -316131 105291 239157 -151734
18756 -212388 -10816 -77462 121050 -387863 -79722 -46191 -117755 -122081 -291447 -72560 193591
18744 -117647 -149941 -149765 291949 91179 -221639 -3841 -81976 -312743 -226158 114547 -400375
18732 -8581 -314222 -169947 -41268 191076 -49399 -63331 -132174 -309566 104961 -50850 118467
18720 -101018 -241930 -228894 75023 -372591 -147081 64805 1751 304133 -149143 -16777 384379
18708 163807 192127 -43080 89335 -164600 -166962 133076 -33255 73270 63747 -7418 121432
18696 103571 -42186 11169 86365 44992 284610 -142852 -209360 -113792 209288 119110 270800
18685 270800 -62320 134568 -51487 31360 -347856 -194129 -134475 111121 -98093 -345393
18675 -345393 -75836 -115249 157698 102058 -89952 101393 -181618 -159858 -125741 -416339 74539
18663 -147845 -32035 -481688 26945 -74026 -189668 -181173 -103915 -17730 -421466 82850 -37509
18651 50842 -6327 -30613 -213574 -136225 60769 -232253 18544 280203 -167636 247766 21565
18639 -16209 25073 -306890 61618 -6578 57380 -22299 -113559 162427 337893 -85361 16517
18627 52804 118208 -173198 197734 124074 -243070 -121253 -231405 -328161 159348 229984
18617 229984 -104102 -88648 -274209 -169455 -115845 92214 15247 138303 265820 -192855
18606 -156133 49582 -183706 -317541 -103426 8087 145434 -8978 306578 223415 -79960 162127
18594 4350 -1069 -153756 62955 -93918 -407036 -218228 107172 38487 244175 -204219 -199694
18583 -199694 -46809 -294625 400570 -81508 -152609 34306 -191204 -245488 118528 -81696 -179897
18572 -179897 48452 105957 71134 159195 -118993 -83540 -43314 -480986 -8481 -218366 -180425
18561 -180425 132386 2022 -160882 -120884 142046 -310207 -276004 -225200 29504 21288 268057
18550 268057 -269872 185817 45856 -12786 -2451 -344186 -378177 157579 -70830 6809 13546
18539 13546 -65811 67722 -8688 -345117 -68543 27871 256518 -248283 89037 -64714 -64637 -141414
18527 -141414 -159813 -288449 13017 -85994 -60273 271738 222661 -218921 -5183 -206582 202028
18515 245540 63919 -41023 118963 116815 -84242 -143219 29151 -249554 -386853 -44220 -238360
18504 -238360 149777 4243 -128 -147177 29873 -128778 -108174 175125 -457388 395211 -41858
18492 -61034 -388505 147988 27074 161403 -111239 -188259 362614 -93016 -80353 47629 -99588
18480 118590 7731 -95320 -60234 -253712 -234870 -406823 -111823 -167660 -159843 13422 -113651
18468 81706 -8878 177538 200510 -131720 -272790 -344563 -10613 -87355 126082 -43494 60143
18456 97640 370511 -11405 -170755 -228096 -211916 25352 -373999 50865 -138091 53592 -507427
18444 -89976 -22337 109767 -54149 326006 -198997 64915 112334 60455 -254582 -202197 -204676
18433 -204676 -125063 -334 -18415 39866 -47195 -233456 33892 -70300 -199723 -227457 -23994
18421 -92693 282922 -73021 -31483 -67945 2211 146361 -189009 -57332 -344054 167889 -175127
18409 -35199 72578 158547 -182996 145665 1542 117880 49870 -3057 -224680 -55665 38390
18397 88722 73580 166278 138428 23727 -292344 28387 211720 107190 -114687 -327844 256218
18385 81466 -560524 -214406 -137366 -26269 -150782 -24885 -126943 113789 -312278 -217263
18375 -217263 -205875 -166592 2853 -50527 -49751 123374 440992 278810 91703 -154646 164932
18363 -34333 1126 205508 -223389 255408 77402 16175 34215 87007 267275 173728 -269454
18351 -49648 97821 207068 204280 -164614 173821 -148530 -261368 121037 -436454 -331336
18341 -331336 331537 -5573 -155303 100557 159819 170764 -41383 32029 163938 -53583 -350058
18330 -350058 -235224 -226322 84434 -28262 260348 -148270 197922 149396 161630 -263477 -150555
18319 -150555 -109370 -98204 103124 302134 142057 -33006 80536 133730 98507 -229699 -324200
18308 -324200 -362774 -104389 33438 -103219 -103713 -120565 137167 -56087 -101838 -41143 -29641
18297 -29641 -114919 -417534 -92498 169560 -70762 -225201 -211332 92788 -74565 -218262 -113832
18286 -113832 128122 -241760 -309950 22637 -84235 -157259 -80419 -94107 -153724 -291166 16721
18274 195019 -73103 110330 -375186 -258854 31218 -121359 32289 -170903 17427 191265
18264 191265 97266 -360859 -418810 -344905 11092 -113184 -74348 -102946 60101 -22642 -28844
18253 -28844 -228883 127086 -154470 -104524 9031 -159879 -38071 -207973 -24347 -34588 29626
18241 -219468 39005 -96250 52979 12664 -256488 107032 -52545 -35681 -255830 56503 -29442
18229 6170 -296701 -48821 128623 -242038 -137217 -228342 -43289 -215293 61071 132433 58479
18217 78033 141907 535256 -139203 -14633 -128181 -173405 -132264 206065 346743 -410000
18206 -214840 -115279 -21896 162401 -155105 -158081 -299864 -172503 283818 -237692 181388
18195 -41010 226438 -308944 8817 202928 75384 56958 -83991 -20530 -467305 -65202 -182156
18184 -182156 199348 174463 -249426 -55504 100673 -62609 -13472 28413 47173 148654 -211495
18172 -40524 362102 572818 -55596 -176425 439208 -107240 69557 29190 -6496 -78533 153890
18160 -400431 -25482 -103593 277623 13711 -211147 -24106 -44745 92900 -168947 -486020 124625
18148 -145562 95314 244737 -49938 -162375 -212390 179703 -4004 41185 81690 -163388 279944
18136 155560 -100296 32736 -176668 -228130 -222270 37882 -334764 -181463 -121104 -48800 182502
18124 126681 125374 216769 -208486 82481 88716 -16001 -325042 273722 -157489 -168056 -69279
18112 201460 69103 100157 -35914 74353 70115 30567 -6047 -20344 -174507 83882 -58055 19840
18099 -219032 -204187 254155 -243482 173089 -364415 69323 -302846 -319690 127001 -61689
18088 -82903 12922 -123396 162743 -47639 -72891 -23436 -143325 101830 191718 -283386 153828
18076 -18528 178596 89065 80505 -90820 -54243 236445 -379802 -96682 -50679 -17951 78632
18064 52901 -256934 39662 27580 -1700 -119764 48040 -76427 -9156 333936 -268010 151710
18052 -127738 196543 -221395 -158735 -129300 -4174 -104871 -28109 -169603 -189946 -274850 75873
18040 -148108 -51903 -15582 284464 -115278 -212986 90516 -61660 222330 16680 -35836 141250
18028 -111455 -345215 -89396 -220449 -9524 96165 255148 -222199 1368 55963 25586 -136581
18016 -27184 95217 -179805 -26587 -414572 30067 -414480 37551 101640 -201996 -142826 44543
18004 -85651 20559 89019 98069 16736 -157563 12344 205202 44722 -82791 -99436 26347
17992 -45172 102089 -23258 99258 82946 11424 109420 149967 130937 -110398 257436 189259
17981 189259 107751 152168 26200 -252629 174688 56389 -108861 -435129 -197282 -10313
17970 -88858 -119904 -196100 -105646 62502 -123187 -55314 279744 91245 144115 -46892 -17950
17958 -114374 -292973 -4776 -139057 -85923 -344387 -389635 165385 257175 -269383 -77370 -59424
17947 -59424 4117 186358 -128221 -140757 14596 -93889 -295874 -48674 -11701 -151392 -52574
17935 -238019 55775 -404583 277251 140034 -129681 -46543 259298 -135654 -194099 -168013
17925 -168013 -136549 304756 -16910 -77862 -256029 2544 -247447 103589 58156 74380 128419
17914 128419 137846 -2079 -75125 40485 -27204 219230 185526 -20328 -45431 191913 161867
17903 161867 -509089 -8568 198413 -213767 62619 174275 245732 -123405 173691 -376364
17892 -86220 328255 -5778 341582 -196794 -49384 -126081 84417 239591 187454 27928 219834
17881 219834 171706 -56799 -297225 5773 -76784 -79179 -263901 5592 -256597 -109262 -25614
17869 233452 -25091 104378 220840 -123125 293599 -32379 -165094 84786 -162238 168037
17858 93179 201667 -95916 -50182 74346 97832 -80169 139326 -138650 132448 72819 -153679
17846 266747 8629 -233738 -105288 -279984 -32234 -51332 -163034 -26982 -79224 -67238 87308
17834 -200145 149528 258387 51579 200193 -126306 -1899 -230380 50651 -308746 146593
17823 -23630 23910 -55573 -229631 -247849 -192121 -183942 239941 31105 104512 179957 59386
17811 185463 -37472 -8679 -57499 -36803 -132522 -68426 -191467 -100833 -43121 -140366 34561
17799 169958 75746 -358147 209616 -218944 -4753 9311 -69114 -257608 -23944 168671 -132559
17787 -333 110064 -224006 -60553 181507 -563843 47120 -85168 -34379 125654 233069 -130035
17775 192669 172779 -123002 113866 -188937 -150687 -17398 -73668 -20295 350124 -149367
17764 11345 58020 -50581 -208685 -181551 -163659 -429331 -267114 82709 -133311 23700 -28811
17752 -195670 -170562 273194 -143399 88818 -108711 -30416 -10598 -266628 143581 -118381
17741 139545 161432 170220 -64318 -37943 -101774 -53212 30710 276362 -45655 59410 -99241
17729 272558 -113103 -407950 -18195 -88864 26183 -24151 -12680 97904 11949 -38999 -16753
17717 -131865 15880 116068 36423 100598 -164190 -280646 -289793 224073 -223823 275384
17706 19184 24509 -145466 -123652 368287 -13387 -123877 185063 -43809 -197689 88046 -25474
17694 2566 -268807 11249 85717 -90508 17295 -20449 36914 210251 -62387 460389 -143996
17682 316789 202923 -129009 150363 -67834 128127 240293 119397 360389 -391133 189780
17671 265398 -51222 -66948 -180626 57634 278739 -496004 26477 -28461 -79222 126386 -313351
17659 196280 50540 246091 -46468 220525 -95074 68974 50483 6938 -88451 -6821 188075
17647 -9193 -16483 -205067 71921 -122005 258743 -66317 24327 -27307 -85736 41626 -134291
17635 57799 32096 -306067 -59739 -7897 54645 -208973 -70857 -95804 52861 183290 16828
17623 215220 10408 -128566 196146 136727 254072 23928 233804 28258 93068 74147 -171109
17611 203131 271224 45960 119368 218965 126326 -224471 60022 144921 22498 -26518 -58878
17600 -58878 -82321 151932 -159777 -28752 141535 -209497 236833 25727 -12910 115478
17589 64216 120956 128213 -57828 136712 -249570 203109 184296 -69759 -10496 -280810 265366
17577 116402 -343 -347151 -182139 -142899 47921 147888 191208 -49891 -103951 73178 -59645
17565 -243284 -134499 -239467 117645 335913 244305 -114237 -107973 13516 -59732 18274 -158929
17553 4002 -161181 65482 -179657 46363 -94480 234805 230740 9381 128960 59849 226655
17542 226655 -28342 125871 95071 99670 -177895 80009 67305 27822 245291 184848 107932
17531 107932 89678 401352 -62988 161371 -21256 155408 102540 85952 145094 68629 -9804
17519 -340680 -178726 25205 -65155 94217 52632 60560 -150278 279983 99984 -8047 287412
17507 313944 418 93116 46503 75180 -32632 380170 244925 11505 21959 220847 250465
17496 250465 -151456 -22797 215531 -72041 65774 291376 344737 193971 37189 132231 106096
17485 106096 20269 -34333 56088 -71732 174938 136265 227914 343079 154869 47474 -20492
17473 293965 159931 166487 -79225 187363 -84557 227140 16441 299302 310432 -10999 222395
17461 350394 106837 120803 50303 202667 116495 -37979 157445 49958 146886 9674 143127
17450 143127 282851 284740 443697 345525 519566 -22269 52592 145673 84096 212327 379530
17439 379530 342177 -7323 251005 120374 434276 67059 251877 -42442 212104 290779 221046
17428 221046 182000 862 332994 246823 -154284 256320 254775 157146 231235 -64915 182437
17416 159991 421745 246842 232473 320406 331081 -100142 222395 266519 8669 430760 122128
17404 459572 -15276 -120948 155138 396401 12627 -58559 163195 489667 235200 331777
17394 331777 8138 -65925 284479 40912 291575 -191587 345861 93048 199672 255890 360902
17383 360902 215136 604612 158336 145815 -8808 230623 205849 -90808 -489948 85204 312192
17372 312192 -58908 103933 46856 21820 13217 722696 -340207 241934 58557 57315 -52106
17360 -117162 268363 129688 49145 225171 233536 -181784 67488 177279 318319 86220
17349 239705 281648 276027 -100101 153273 34361 212196 279002 -166760 388269 -151135
17338 -80857 -88862 -143651 -201149 257180 -7903 86566 -2535 97284 268069 360246 200129 197993
17326 197993 207252 397803 -115336 179554 151753 41225 -131661 10931 11440 314617 -38152
17314 105279 404349 -20971 244069 258276 -5477 306132 -41112 4999 177665 -21093 229061
17302 -130070 231518 -6528 210064 552164 385000 208905 -66558 93 85407 494442 237330
17290 -111927 320380 139410 84805 30330 276840 101573 105967 203729 125709 51793 105789
17279 105789 552585 -5706 181536 -91594 204453 -1317 258497 28845 70741 533173 16591
17267 453181 127774 125058 469539 446781 160165 35916 359409 313616 388189 60630 273527
17256 273527 281027 56466 -125723 237198 -18519 168530 312207 267362 129243 -224131
17245 -170550 -118885 432035 62266 165042 5752 174200 141338 587833 329817 468407
17235 468407 171611 206639 203471 400546 -40697 14172 60417 284636 284930 26466 323808
17224 323808 111485 140483 266354 346656 245423 376849 379071 234043 200101 191163 246656
17213 246656 342276 339444 -9509 372006 -42262 395697 147819 302830 170707 410366 229231
17202 229231 194642 367073 9979 493974 235155 -98516 490443 355480 467130 78773
17191 93272 151864 273794 541406 619926 263798 204831 104648 178977 142785 127138 283354
17180 283354 115884 352002 189177 232373 402658 206551 477766 503900 403157 268427
17170 268427 363925 327310 168157 95654 416888 320358 162326 339173 449909 272781
17160 272781 285957 259607 263492 543510 450475 188268 172389 608614 560345 712010 173370
17148 527698 279600 343719 178529 105151 378673 256857 624786 342407 317408 25227
17137 393663 331513 -108696 100795 294007 594302 396043 139902 431521 93974 420904
17127 420904 -12979 276216 255605 352522 208305 396574 547964 449107 179053 512287
17117 512287 389239 115061 325027 599009 215155 215028 705408 173951 101399 410645
17107 410645 346518 565396 354744 568184 413732 211786 434414 426312 429885 449391 380026
17096 380026 407073 565075 421611 409968 516352 686033 393120 427319 478367 538843
17086 538843 590591 1055463 490868 2408 857747 355113 369685 539533 421318 391365
17076 391365 640252 497431 810313 629112 295596 635379 731246 378534 597414 705810
17066 705810 556380 580314 358266 426289 462660 719805 379465 576785 327920 139637
17055 620943 255176 679456 538133 628301 430257 377619 298894 190293 952814 648720
17045 648720 565088 298833 576460 834095 575800 332280 623360 518154 161977 444910
17035 444910 463029 750104 171941 819242 710434 666486 511073 752250 586152 616210
17025 616210 287788 800616 657198 585172 614354 835707 860693 499704 858429 885934
17015 885934 854952 928341 899560 654411 851417 975796 705187 848778 913102 792993
17005 792993 543191 1017463 702187 901786 685921 538526 658942 690410 956916 927038
16995 927038 673220 798839 784997 632907 955410 697117 966677 696326 833122 989695
16985 989695 770172 797569 939014 730691 718759 1153217 978687 797934 962135 904890
16975 904890 909961 875039 754091 832004 1008672 1186258 805151 832886 940134 924865 957553
16964 957553 1345166 1136192 1262742 1068587 976874 1411369 657263 1110470 1058674 1061683
16954 1061683 1081865 1020446 1053303 1020332 1498331 1208667 1141971 1374887 1269055 1011557
16944 1011557 1016834 1010687 860680 1328793 1251584 1566696 1261750 1446654 1436787 1258620 1059067
16933 1059067 1283153 1095469 1060107 1213162 1352223 1291055 1327737 1418855 1532177 1312483
16923 1312483 1286770 1454783 1418634 1921092 1609166 1720191 1392491 1694190 1332261 1614295
16913 1614295 1729685 1651585 1707309 1585319 1571788 1984265 1551730 2025735 1870241 1725625
16903 1725625 1604540 1788949 1647819 2004526 1845413 1973022 1627267 2104792 1789222
16894 1789222 1874089 1922785 2167821 1796391 2322539 2121194 1973664 2085598 2344888 2028221
16884 2028221 2298898 1960193 2347834 2262310 2604770 2440169 2558631 2484643 2443242 2511271
16874 2511271 2636083 2727341 2482472 2800636 2690334 2912844 3183248 2770654 3115644 2757272
16864 2757272 2704111 2749574 2984799 2904406 3057811 2923592 2665462 3191352 3384089 3628564
16854 3628564 2977279 3449995 3122806 3136815 3338072 3530501 3953779 3424055 3652675 3676277
16844 3676277 3788951 3867095 3880008 3808900 3788724 4014325 3988518 4428399 4489393 4360445
16834 4360445 4251549 4340707 4513387 4933682 4664497 4739667 4962818 5066371 5000731 5092676
16824 5092676 5061017 5299444 5494341 5430779 5655299 5840254 6063362 5864511 6153152 6098404
16814 6098404 6531094 6354231 6523280 6892465 6664233 6864129 6952893 7408434 7609805 7479214
16804 7479214 7560492 8057314 8345637 8251864 8879320 8897999 8912319 9317397 9330847 9228601
16794 9228601 9502902 10162738 9965010 10520631 10966706 11044326 11266951 11852986 11984336 12434772
16784 12434772 12972067 12936310 13417668 13858676 14187050 14993402 15110922 15820423 16046750
16775 16046750 16566431 17213103 17433310 18434191 18962335 19666149 20344596 20792318 21499460
16766 21499460 22524354 22794387 23999175 24761833 25978215 26791233 28005090 28813658 30114364
16757 30114364 31292168 32633476 33938116 35592895 36953019 38535135 40364514 41878148
16749 41878148 43735563 45936668 48206005 50761122 52968911 55375405 58599923 61769024
16741 61769024 64745205 67949493 71269782 75162283 79123989 83438853 87958907 92225016
16733 92225016 97024839 102341517 107661911 112924657 118531487 123782154 129875586 134892586
16725 134892586 140451475 145568527 150361960 154703026 158508420 161604175 164117789 165593672
16717 165593672 166434929 166370441 165697971 163377315 161067509 157682727 153655738 149221993
16709 149221993 144366592 139028403 133625407 128004328 122219731 116999574 111141570 105847864
16701 105847864 100660564 95473522 90327523 85826745 81378694 77162874 73267416 69634465
16693 69634465 65658961 62783807 59262252 56353957 53854928 51295916 48392956 46754638
16685 46754638 44425821 42064105 40250819 38635950 36659745 35287559 33611547 32151029
16677 32151029 30982784 29575249 28401107 27377470 26116368 25381774 24199108 23031868
16669 23031868 22892817 21588112 20967426 20472128 19201489 18659580 18177319 17811400 16937092
16660 16937092 16370925 15985663 15781120 15132767 14420525 14097104 13683142 13250438 13143584
16651 13143584 12733624 12284996 12044918 11770971 11258300 10862673 10624600 10583404 10020796
16642 10020796 9737547 9873080 9278721 9105069 8808023 8941629 8393775 8194412 7974384
16633 7974384 8343114 7450377 7479121 6965334 6798763 6936499 6684984 6470500 6488836 6201299
16623 6201299 6381637 6191571 6126245 5905944 5670501 5648900 5489446 5279491 5751484 5473264
16613 5473264 5100663 5161830 4805179 4724927 4610106 4255318 4658639 4640370 4510234 4438129
16603 4438129 4417739 4275578 4162415 4142374 3832894 3592196 3618197 3676735 3604648 3622018
16593 3622018 3564881 3432200 3323419 3458089 3418429 3037439 3136115 3150207 2632575 3026877
16583 3026877 3188998 3029954 3077290 3109959 3127270 2465925 2820342 2986770 2643106 2636551
16573 2636551 2872416 2425895 2190135 2656450 2076392 2430792 2550409 2455570 2221464 2428280
16563 2428280 2364488 2266243 2210354 2266585 2279418 2030226 2110456 1975625 1959031 1810168 1841944
16552 1841944 1926549 1848312 1604774 1711207 1703714 1783292 1912375 1771441 1714925 1563291
16542 1563291 1887561 1480146 1832713 1692638 1500084 1560611 1879638 1723838 1470069 1689744
16532 1689744 1529541 1678549 1390199 1730094 1688440 1435259 1394716 1501229 1337977 1245854
16522 1245854 909847 1025634 1191873 1150148 1430292 1349907 1332111 1196615 975002 1174368
16512 1174368 1635302 1209536 1185382 1156758 1147879 1159608 1352248 1417082 1061204 968925 984040
16501 984040 754199 979996 1208821 946389 1129599 955478 985568 1366154 731332 811784
16491 811784 1018652 1189471 1066988 860768 874196 862686 595784 1038511 1111228 765552
16481 765552 914283 863535 831811 572562 933357 1064383 885103 1299544 766937 1016183
16471 1016183 915537 751643 265252 734039 963215 695543 860131 553770 419431
16462 419431 657371 694840 634270 719009 859958 588910 680367 769277 432423 412599 630832
16451 630832 690147 709854 684906 973769 532993 446462 577789 812786 517845 736858
16441 736858 523712 568345 835352 611514 566198 620714 567307 1039051 406290 376332
16431 376332 383657 522007 674824 631862 474038 540989 385674 403291 584107 132701
16420 616914 417574 461107 661736 631836 639223 332908 386086 591219 644954 445824 691261
16409 691261 573919 478480 296994 231362 531045 564846 438420 553767 588870 345491
16399 345491 151373 93301 400893 411552 432482 243144 399018 460476 365594 208951
16389 208951 178413 373666 260331 494236 486011 179359 199416 364058 557349 243694
16378 432145 422520 545107 165972 184342 486288 401135 308479 412153 365854 123842 443037
16367 443037 275406 456012 272077 -73259 435201 132986 426262 397507 462530 387927
16357 387927 415175 172727 229846 271802 382341 190662 335763 474467 240875 510526
16347 510526 390051 293910 311529 251475 325766 426733 421971 132717 274077 457137 165024
16335 317213 102555 119929 109281 140882 436203 650278 -56248 492294 138697 -202489
16324 602319 197193 75199 348072 414334 556669 427077 211332 1759 -178629 191179
16313 -59798 163942 229019 120684 99514 40532 366327 402047 391261 332161 311009 374834
16302 374834 283318 320492 -148415 107802 221497 248174 119054 235138 489929 62044
16291 -11653 124407 54063 174535 88941 349891 -15018 467859 190898 -121001 153342
16280 110663 326480 660554 284108 4721 16123 183083 460281 222474 46991 190311
16270 190311 406818 111045 158916 28749 345085 -29748 180435 217865 128863 276757
16260 276757 324744 247302 160017 117813 69235 271267 -143388 216009 -244342 79090 260332
16249 260332 34490 67609 -67125 83042 85216 206947 63265 118249 -152832 377904 131314
16237 57594 175840 -54429 51374 -78013 -73204 218092 -245133 141730 164257 -80350 134215
16225 -77970 43416 -191301 247563 -125968 -81614 -79436 59943 -165138 193838 122350 -18037
16213 51332 107834 63779 229862 -33807 32514 221309 19924 245067 142912 285439 188136
16202 188136 23138 124519 183462 91314 -34779 -144620 161476 29526 -30274 -157136 117436
16190 73241 200761 -14392 -240545 -103379 10144 -63694 290438 249982 207264 104106 265409
16179 265409 159625 3267 -32226 -256563 116046 -127360 -259384 71843 -105775 -138348
16169 -138348 23767 78612 247827 70 174554 81196 71127 122389 140689 155697 -102332
16157 38346 -49165 416738 -159113 238077 11660 131043 -25193 55210 179790 -50024 27683
16145 -128271 353595 45282 -44466 -113843 118896 -50135 166061 -936 221193 -159297 189777
16133 225607 201939 117565 -18330 -54574 -67177 -429981 84794 -41353 120536 46394 263539
16122 263539 -118787 408139 96941 210341 144673 273039 -5988 -121338 8744 496472 -189196
16110 109597 147741 162259 47602 -89188 132663 172431 127679 77455 126244 83611 51669
16099 51669 239997 161715 170624 148587 -180035 75991 -40827 -35000 -174351 39196 -229440
16087 184896 -76613 29681 44703 182478 185051 -5185 182985 190386 129357 86776 -51044 276958
16074 213254 -73391 -150465 171965 -416560 115472 252445 -269615 -145758 -236115 183242
16063 68498 137106 -153647 -23474 -115589 74515 51373 -215175 -30341 45496 167246 -53445
16051 -43732 174612 -188674 16846 202343 24630 -73884 19659 93932 -19921 -13768 207965
16039 -65556 35897 -91516 -58013 8982 152780 17720 -213929 27835 11008 -20729 71764
16027 -140217 146807 166210 214951 19382 -102788 -166505 -80504 -4105 -93055 -176140 -3965
16015 -3795 -86769 153478 -252295 -74217 118601 239838 -51 104434 73028 106304 -57360
16003 -90169 -77415 35537 31082 -255248 -191401 -61455 52218 3193 -187134 -14795 -414239
15992 -414239 -19768 -85111 94278 -263339 -63696 -64370 -29466 -278071 152736 681529 295693
15980 519626 114072 264252 301853 127510 213226 253338 120244 117148 19307 185034 16553
15968 -209006 192187 30861 -161117 53778 -50368 58679 -137150 -57424 56223 -31932 -153741
15957 -153741 -110431 29306 110907 80102 -86148 77110 -294421 -200563 82986 -328514 107299
15945 -59724 -49534 -311187 42992 57278 61111 -118208 170088 473550 -75995 138319 171950
15934 171950 48075 -99660 -31739 -11757 -268829 -87936 -412431 731 3468 -110664 343410
15922 -166145 -89710 -208686 34686 -369505 -167028 -258001 8203 -25644 -210694 -21179 136446
15910 -94731 -258506 -13891 -385764 11890 -204306 -156627 -49057 109388 131560 -90399 172897
15898 65333 -327591 144997 78910 55453 -209622 7712 48835 -127039 -184372 63386 -24203
15886 109456 -109656 112528 68740 -102749 324562 58256 -128733 20566 -56242 164616
15875 -75644 -30616 -220397 131244 -116383 -80027 -50710 -90049 198404 179895 -191629 -195531
15864 -195531 310791 296243 41545 -30727 -177330 -31553 75381 85002 -197369 -260916 -97048
15852 140348 31966 -65698 26287 -1345 128281 34859 381569 338098 -250388 25203 41491
15841 41491 -27089 -108169 95067 -164112 82305 -192956 -101728 184497 421938 -141467 163787
15829 -302886 304691 -198886 -242669 190543 -194570 -613050 -133652 -19425 193472 -158934
15818 -122192 32427 -291801 -175618 85308 167970 -226608 8090 -94099 -109597 368816 -319067
15806 -112746 290529 9365 136809 106750 -42051 161287 -118954 41712 -43138 43767 270337
15795 270337 -102659 -77333 -140839 -76772 187970 94335 324327 105791 -393056 -97110
15784 -117740 43622 -27343 86542 -171261 -124735 -26716 101392 58315 -104218 260136 -155537
15772 88203 215477 70934 -49533 -847 166585 -197953 276432 -227617 -112821 170378 44128
15760 91352 40029 105792 178454 -33566 241996 -36781 -154389 40777 -12982 173186 -148887
15748 116758 60095 170432 217919 34344 227733 -14264 -114448 -116253 -130076 50195 -180835
15736 15518 -298292 56196 100886 -452 -125471 -10709 -262782 -408532 -341285 72300 70359
15725 70359 -211043 26806 44182 -48515 -61369 -95242 -144305 220763 -63499 -19811 -96940
15714 -96940 -121376 14379 -70804 -1541 -136596 -64535 118845 -194288 -74780 97490 -120545
15702 -95744 -78195 -170762 87948 -159472 -457615 28498 -61692 -90901 190769 -153530 -201975
15691 -201975 211772 184105 254165 -4708 65613 11437 110045 -270430 -207467 -161040 -46159
15679 211426 -73819 220247 -36803 42092 359707 178103 -26893 -87418 546596 -190393
15668 131305 -39854 -171875 107884 -80597 -228137 180882 206541 -336280 -182541 -40607
15657 -101699 -127441 -135171 -188717 -129889 15292 -195614 -45128 -21680 -159932 146861 -36387
15645 -486500 141301 -51617 199313 166253 -136059 36179 -114636 8914 -399708 79483 -282753
15633 241747 -5675 -310653 -177313 -17174 193294 -146268 -57976 5229 -197763 42760 90369
15622 90369 167941 -110237 66269 366429 50958 84799 109164 130730 -230848 65449 -155765
15610 -29073 -43554 18041 196897 177270 -36727 84998 120979 -127262 333841 276880 -11868
15598 -202915 153778 -30111 -57753 -489419 30947 76436 -149510 72025 4782 -185613 220672
15586 71118 -263863 129129 230503 -169982 249340 -303673 -438370 50547 139632 139946 132834
15575 132834 -59815 -119638 381429 -75114 -139243 35147 -183299 -311238 80083 -124067 69090
15563 -111114 -137048 -73864 -44990 -61591 -48480 128649 -115767 -93270 81888 2020 -108471
15551 -33960 -161004 -267840 22192 44736 -255460 -32594 -10867 -179771 -18121 -48999 166025
15539 114378 176906 -73181 293210 43132 25363 87174 42176 8904 -59991 89844 221246
15528 221246 276581 133226 32464 -126773 125825 131070 82502 -81127 60985 7711 123842
15517 123842 87956 -81079 209327 18837 171154 36503 11336 211325 120204 -129520 115226
15505 256569 -311836 -149339 113650 -232851 24766 -343986 -27380 14989 -53304 -28026
15495 -28026 296612 -116707 61268 116520 -163789 43820 250970 236516 141205 126802 70248
15484 70248 112063 -148171 -13609 -109033 115933 -199838 -121262 -7116 -158310 -78582 283268
15472 -126921 124728 -3753 70377 143455 -112798 260132 68946 -120357 -175714 427873 249805
15461 249805 -77123 -205932 -417423 -164553 70274 -73998 -380059 253294 -216406 12 -109354
15449 207882 187081 241929 -292654 8094 -228812 -115126 -149238 -59457 -28232 -19058 -318843
15438 -318843 -93418 59807 -2997 -168918 762 -105900 -151006 -98811 -33458 258535 -104243
15426 -89419 121287 -61220 99770 434983 150698 -129833 -16501 -146615 387835 56349
15415 225407 348497 -207115 -43174 7596 106763 -85298 32875 39122 -76940 99903 -163205
15403 191100 -187317 -99094 -59465 -66890 -85089 83533 -71671 -103096 -224431 60592 -331326
15391 38876 -58933 -163717 28621 -158915 95488 143451 87850 203956 -144681 10325 193979
15380 193979 -300661 129385 -64050 11950 -37855 -128420 -210033 27617 -3383 -105013 -70628
15369 -70628 58873 226663 -41995 122640 -90401 -71689 -196738 203542 591249 -233750
15358 179686 370091 -250656 105174 -137300 81312 120988 92909 18347 207110 -491370
15347 331766 -252248 -121687 240435 121309 -100147 -185507 157937 256863 282013 40558
15336 -163515 181637 24888 -386928 313567 67280 74732 -81720 41116 -87771 -17664 2619
15324 139806 285215 213511 -151383 153271 356311 -252694 90100 22971 -9350 -148173
15314 -148173 35533 -27508 -61832 -58731 167414 112003 174225 -289234 42591 206178 -282753
15302 -17990 183498 -92853 111467 127702 339077 -29536 217944 116392 -90116 265353
15291 -244821 -40945 237286 91911 151635 191559 -220930 32411 62409 -18451 -214307 -55691
15279 244967 49211 -36336 45014 269631 99557 125164 101578 227951 -373658 -24143 37996
15267 -372016 -42238 -312306 -129266 72415 157616 -47172 63645 -165800 -142768 137250 441871
15256 441871 110332 409600 93855 178135 280722 136647 352947 655627 1563524 1434026
15246 1434026 1132668 850485 626880 305186 -157264 87553 71315 322453 16867 -137559
15235 136126 -29219 289037 93787 42866 -24661 -178875 242910 34104 -86574 -81769 15206
15223 -64949 588422 189491 65064 77998 26692 -226892 165602 -83969 212258 88464 539815
15212 539815 -99244 -58840 220962 -304324 342485 92843 -129806 76713 67209 -292171 -34898
15200 377848 173067 247033 266269 217730 81305 82852 -38768 136419 -291411 405937 -4961
15188 -221391 123085 119096 -276104 34792 32137 -121274 328711 289038 -10173 -280126 350270
15176 -120407 -336774 396435 73838 1361 250805 113328 7420 198933 202416 -21566 -84971
15165 -84971 409950 382403 -49017 183153 -78655 -39118 176045 164899 -31485 139792 65894
15153 103439 -26885 -16590 -109938 155835 -8124 70606 -46498 330845 -94171 299359 262645
15142 262645 224664 241260 148096 -26662 -86572 -18487 35650 496858 -85547 342897 356907
15131 356907 -46635 177713 58738 176177 -29621 131384 10907 102429 -124250 22653 -107471
15119 -91502 341025 -32389 -129890 444233 -45000 -121743 282926 75911 169632 91268 156071
15108 156071 8287 -63181 158191 90830 167164 137144 -93656 226194 319896 159352 -239240
15096 228819 17512 113095 191045 -179125 -13434 60685 -92203 -15608 86990 132758 -57851
15084 -84828 100907 567189 132620 246509 91316 -5605 174957 55717 -50325 -71481 329399
15072 278977 409873 412964 243916 240269 74692 -9677 100325 135110 -234646 373589 92467
15060 68115 388157 245985 -39762 -78486 255523 22479 257951 107092 235858 -104021
15049 133946 166617 473077 8326 294729 -20125 22575 99049 95628 245090 103677 -96628
15037 91787 259629 244058 114580 50277 87958 -44468 -62286 248932 196552 -9378 453644
15025 113938 296856 168944 502194 149622 256991 -27119 215131 255291 -106593 366947
15014 249359 138908 170012 166759 310598 185154 367074 150467 100061 29650 -9233 293791
15002 -115980 292891 517851 270865 320859 251313 137986 53879 110458 465593 174470
14991 355691 146869 233776 181446 -69765 139699 223048 122513 272777 258790 65964 725590
14980 725590 -192286 88702 231997 188454 -14344 106022 231771 82259 -118613 10485
14969 243717 266234 635271 418117 158884 36676 137348 322650 337313 165033 503107
14959 503107 439722 181296 128146 584403 298749 39272 259034 200201 -40621 346405
14948 224187 174544 262968 255164 416239 297803 373114 86994 -64305 407099 174637 250572
14937 250572 571911 222296 370445 302395 389265 199665 370627 442520 397446 368900
14927 368900 379258 458155 301342 280427 312657 310488 404540 75580 369950 347187 144234
14915 375880 318755 283678 295205 296743 17355 843567 448983 468499 481110 348000 440712
14904 440712 244327 559660 359599 211057 148227 392483 346360 3785 368452 73882
14893 163332 594612 160244 176793 214130 19124 440373 534320 -118686 55148 425175
14883 425175 772934 180640 285788 310351 373285 720162 283990 -49924 237602 539748
14873 539748 515089 227333 234671 33075 387232 143589 145419 435594 421067 159046 344768
14862 344768 265539 242933 467584 298881 322957 190264 398321 403501 431947 521462 158576
14850 281879 420796 452673 208356 367669 349933 427410 352620 540139 326407 410185
14840 410185 92903 205648 426473 450393 753342 197952 425028 339028 517352 631574
14830 631574 382352 353241 160935 710098 561115 457980 235011 638744 465401 479117
14820 479117 279053 325108 699514 556132 291971 308506 628413 451905 566428 304952
14810 304952 407439 765359 496945 369067 446232 371519 650240 360635 499308 526911
14800 526911 724688 653891 661547 760786 390854 585408 546995 273450 684948 271864
14789 577284 269685 412369 215706 557148 609627 307162 684308 651215 589149 542096
14779 542096 462624 543351 448985 637534 371281 575632 720511 176469 422018 152111
14768 347310 422975 681634 510060 733417 301506 747504 530198 790887 600358 170365
14757 229163 250733 885537 645980 487622 623564 520015 545962 578549 630960 626699 903054
14746 903054 562070 603047 772108 725228 801614 573972 611370 484843 414113 627721
14736 627721 423612 853932 724224 770431 674859 645186 1022723 529386 567532 644825
14726 644825 635098 818761 1146270 806393 912457 1077300 699288 894745 622452 723296
14716 723296 675722 878743 960369 675602 907046 954249 1014528 728629 624366 598657
14706 598657 604678 738699 888285 803325 783346 823536 946825 915772 1013073 418172 908316
14695 908316 703517 1119077 892378 344753 688717 760648 752898 703310 823412 1022206
14685 1022206 682265 1086846 778211 829619 1026585 1060515 1051662 1238156 989830 1181550
14675 1181550 746897 1376243 980288 960733 1376576 920944 870550 1094933 827587 853200
14665 853200 1472722 499219 810481 909805 1304771 1079665 1067799 1077473 960282 1421247
14655 1421247 1274193 1316116 1144027 1335300 1289665 961201 671767 1145970 935338 1095570
14645 1095570 1178478 1067332 1263230 812470 1020999 1106358 1129571 1150302 919860 1414272
14635 1414272 1341056 1589386 1031978 1127133 1094393 1249943 1333872 1452945 1152979 1364460
14625 1364460 1293896 1246077 1138136 1146134 1409861 1035278 1242825 1136158 1498502 1255790
14615 1255790 1467772 1686670 1354850 1585197 1508653 1459449 1422106 1600832 1461345 1584956
14605 1584956 1534485 1302713 1660342 1440554 1653187 1583496 1424040 1317709 1410586 1805532
14595 1805532 1348909 1371323 1412405 1808433 1656607 1706651 1597010 1625133 1981168 1823114
14585 1823114 1871138 1572815 1829739 1722448 1730567 1908200 1798823 1974033 1958338 1819446
14575 1819446 1980313 2037644 1916466 1890701 1968939 1920655 2105322 2137481 2215680 2099260
14565 2099260 2418925 2544615 2124718 2820497 2462781 2396995 2522742 2822115 2604785 2681381
14555 2681381 3273877 3400057 3582073 4042839 4418321 5674763 7657035 12441826 21821779
14546 21821779 41583913 43840840 19175609 7810742 3730552 2721866 1862456 1634689
14538 1634689 1834800 1768214 1768610 1846478 1969932 1969819 1944596 1831217 1599332 2059696 2134443
14527 2134443 2125453 1940187 2268955 1981828 2190676 2376688 2481391 2528970 2356465 2361409
14517 2361409 2494709 2473563 2370001 2505503 2490351 2410556 2583659 2559343 2848435 2629122
14507 2629122 2742500 2574639 3081110 3022276 3073558 2824562 3011168 2962722 2939658 3062869
14497 3062869 2964984 3239367 3144424 2970934 2888358 3179563 3160658 3216305 3072355 3421475
14487 3421475 3656221 3360490 3514210 3597742 3447991 3398769 3962051 3663853 3829829 3539416
14477 3539416 3864592 3806799 4233622 4116920 4147083 3964190 3937212 4123516 4065795 4066997
14467 4066997 4382248 4486849 4535532 4592343 4282464 4586944 4500359 4871244 4724823 4583470
14457 4583470 4927794 4743145 4970363 5182466 4756679 5124922 5141581 5229361 5136927 5487175
14447 5487175 5457734 5484239 5505941 5468313 5926797 5764355 5850957 5901339 5915377 5759458 6052297
14436 6052297 6181217 6421231 6301545 6555906 6266519 6615654 6974332 6843941 6744766 6836092
14426 6836092 6933659 7028993 7178375 7323813 7301719 7368652 7617237 7768452 7994181 7619567
14416 7619567 7959444 8313523 8088653 8495174 8299386 8641068 8674791 8780859 9042075 9253056
14406 9253056 9167772 9243157 9564383 9710818 9676629 9962258 10172927 10368899 10421595 10424989
14396 10424989 10990180 11201383 11313034 11074110 11370099 11556524 11856932 12031891 12537885
14387 12537885 12463005 12485406 13074086 13235320 13492050 13585542 13765229 14163556 14609815 15062390
14377 15062390 15158762 15124469 15750517 16382455 16056951 16236026 17069033 17149394 17261552 17825294
14367 17825294 18148975 18811535 19062847 19274706 19745532 20263270 20616793 20863852 21447009
14358 21447009 22197777 22808208 23231876 23517514 24127966 24659499 25360384 26077745 26507638
14349 26507638 27358881 27833652 28609132 29662664 30188079 31100286 31722535 32809416 33385358
14340 33385358 34505820 35651191 36400695 37617733 38755090 39660112 40764065 42001298
14332 42001298 43542378 44939666 46188948 47504543 48992824 50295252 52224065 54346284
14324 54346284 56194202 58003650 59760456 61923011 64496787 66727968 69420412 72008590
14316 72008590 74543704 77258274 80617753 83820990 87191194 90848920 94408317 98313206
14308 98313206 102692502 107343406 112174731 116985849 122610959 128361404 134413234 140701279
14300 140701279 147751952 154736377 162666162 170289461 179112370 188241972 198171457 208369161
14292 208369161 218737113 230283398 242319856 254818017 267836703 281381127 295639005
14285 295639005 309768595 324644012 339280024 353971729 368816325 383203918 396944254
14278 396944254 409725516 421490389 431895023 440845607 447738639 451170786 449784509
14271 449784509 448138554 446705117 443965202 439594946 433397195 425853301 416387762 404345337
14263 404345337 390944546 376824440 361782876 346748780 331456248 315904885 300995569
14256 300995569 286309703 272600990 259446500 246379293 234164634 222293003 211010359
14249 211010359 200537389 190552271 181350486 172134303 163885408 156578919 149070737 141930969
14241 141930969 135144943 129157096 123245381 118523606 113060348 108360082 103400693 99166802
14233 99166802 94968269 91489084 88052242 84272886 81239364 77923481 74784873 71885643
14225 71885643 69360022 66895954 64556287 62640258 60126693 58287979 56769906 54508463
14217 54508463 52610013 50791244 49340410 47936813 46760673 45409954 43821069 42393046
14209 42393046 41533840 40023424 39359466 38558919 37231904 35798027 34963731 34248018 33507762
14200 33507762 32682686 31676926 30473050 30067864 28927013 28758272 27880780 27507654 26431479
14191 26431479 25729264 25198532 24716326 23914786 23454013 23049363 22534377 21949192 21488162
14182 21488162 20866186 20668259 20373903 19920479 19255767 18791193 18867942 18231315 18050149
14173 18050149 17538463 16745377 16585109 16360081 15999733 15705161 15402579 15422381 15042573
14164 15042573 14635319 14143083 14310602 14153723 13570335 13296747 13133293 13283140 12818778
14155 12818778 12638318 12354190 12142899 11895433 11710227 11762247 11068358 11320811 11078786
14146 11078786 10911224 11009334 10521829 10227906 10144799 9940612 10105650 10047768 9392024 9417055
14136 9417055 9126471 9263969 9155608 8908137 8832856 8624475 8340375 8626801 8632042 8082055
14126 8082055 7988920 8024196 7918599 7600576 7776891 7758940 7446237 7299351 7129263 7192086
14116 7192086 6803059 6942151 7036991 6744991 6399172 6628677 6814496 6622582 6467456 5934243
14106 5934243 6188755 6583208 6032331 6171950 6111388 5639541 5863215 5717156 5632709 5427734
14096 5427734 5683824 5533396 5748584 5402084 5632693 5094224 5201286 5177090 4875015 4953013
14086 4953013 4892174 4821625 4670850 4216386 4737974 4982386 4510950 4761578 4317268 4460946
14076 4460946 4242904 4288816 4685412 4220173 4122623 4475461 4071293 4355586 3893240 3776614
14066 3776614 3869302 3789705 3779674 4061908 3721585 3883479 3544961 3620912 3428030 3517802
14056 3517802 3999801 3586747 3580229 3529999 2959780 3203489 3204174 3263165 3364815 3134244 3100155
14045 3100155 3045264 3193775 2985457 3244496 3189489 3102608 3136550 2911576 3286862 3079630
14035 3079630 3152406 3145135 3030986 2746937 3021517 2780913 3210506 2553386 2648964 2758335
14025 2758335 2732040 2769816 2430674 2605872 2982223 2556232 2622651 2714839 2509409 2493142
14015 2493142 2587873 2660613 2646189 2025678 2457184 2792598 2553565 2138142 2234126 2450808
14005 2450808 2259475 2225666 2172469 2092097 1946513 1767445 2090162 1677246 2068249 2057695
13995 2057695 2101627 1993530 1790620 2175741 2017224 2641682 4007432 6474773 14318751
13986 14318751 33774055 45349120 24081041 11439805 7166974 5401705 4124607
13979 4124607 3957148 3273825 3047205 3147784 2987545 2345696 2560097 2675167 2440486
13970 2440486 2516204 2277170 2325915 2246667 2176766 2189584 2066178 1997625 2143327 2251912
13960 2251912 2034603 1899787 2020410 1899833 1693382 2039375 2322589 2050812 1686798
13951 1686798 1763390 1644948 1953388 1735152 1691293 1684798 1772073 1487524 1756569 1934724
13941 1934724 1664177 1712209 1503763 1910089 1618576 1469989 1604246 1303987 1813561 1553705
13931 1553705 1501897 1386536 1560199 1698205 1739950 1392894 1420575 1526335 1324002 1582078
13921 1582078 1604792 1326371 1652770 1723950 1499958 1516422 1393276 1372040 1254324 1456240
13911 1456240 1210199 1167276 1334386 1268867 1136278 1523147 1383101 1330541 1220179 1109205
13901 1109205 1252394 1419416 1301362 1401683 956497 1173929 1353740 1196983 1350657
13892 1350657 1219119 1281481 1523959 1452650 1228206 950311 1155973 1420595 1324461 1104677
13882 1104677 1031631 1182992 1134287 1049086 975919 1243896 1600724 932146 891556 911858
13872 911858 1253393 971196 1032429 1213749 1121322 724758 976045 995476 1174402 1160901
13862 1160901 1151844 1102963 1071297 1043150 1311899 1047394 1151788 886999 1142153 952827
13852 952827 1093368 940956 1061846 605304 1001188 823091 1090844 956982 851336 1161250
13842 1161250 753922 922892 700829 1264129 791030 1072720 1025499 933761 1002605 756941
13832 756941 976173 1083296 1287519 834994 771412 1079241 853221 844616 1074429 787489
13822 787489 674993 1130326 884042 548996 598616 895596 597730 486662 1048743 869275
13812 869275 660191 1099641 791452 727082 897762 798665 1030070 488394 970244 931258
13802 931258 1055082 1044657 943962 1011749 568940 862126 947515 739623 602447 843268
13792 843268 869613 779203 913472 320521 987762 730166 626956 745564 767502 503315
13782 503315 624832 755163 652273 586211 544781 260354 557891 855391 746705 686450
13772 686450 539160 581123 913779 752013 540955 682863 187507 735535 995182 933853
13762 933853 421139 501229 815690 647237 590454 730616 440853 631381 689426 993039
13752 993039 622706 806824 820200 633538 595668 522564 609424 449750 681387 1114829
13742 1114829 871642 595583 454632 887352 961755 421605 491012 485471 432275 603438
13732 603438 671949 593697 584598 358060 491712 707671 598800 408357 647468 649065 448860
13721 448860 577027 422098 723285 635463 300924 662665 328629 754857 552241 547338
13711 547338 675565 342989 770636 343853 422739 347946 334330 447184 512621 801095
13701 801095 546827 330286 690035 600426 451731 856211 227034 533923 423725 466640
13691 466640 541084 467361 349134 254387 480911 402873 384967 551666 538689 411490 286193
13680 286193 352989 494980 412594 532368 106218 332551 331123 638011 501322 272802
13670 272802 420623 207683 535780 531962 774304 511902 402114 403267 639470 786687
13660 786687 325995 503553 580794 509850 211830 441014 423685 535429 500533 643684
13650 643684 741279 468493 404240 510636 242394 668430 672010 534445 461192 85830 633087
13639 633087 36044 430705 543113 370856 271143 637453 478619 272156 221682 540906
13629 540906 180146 255994 353291 495530 335329 234080 364987 366009 518676 187758
13618 34108 351069 78752 98854 360841 342274 215917 495185 599121 484370 233443
13607 311421 526287 712555 364193 70751 369244 0 195269 305824 553816 94134 75853
13596 75853 425294 406471 149328 295653 66450 326078 90403 135385 329649 190933
13586 190933 602097 428348 267800 393654 304289 176853 224784 496914 71725 615074
13576 615074 117123 449997 364537 364237 259403 267463 448971 207613 188552 15765 276848
13565 276848 390067 269600 266191 210797 257492 298365 495505 126536 8144 450206 254281
13554 254281 94021 407938 264495 142567 309137 353783 504866 248063 227384 235031
13544 235031 454633 227615 -83372 324563 344491 427704 104685 409723 414329 207429
13534 207429 84169 248149 431733 344402 314957 477602 251981 257342 260143 146334 47695
13522 435950 45149 385083 496301 295060 23356 -269385 81571 277459 316528 450967
13512 450967 157275 498935 521259 123724 301356 290287 231008 453395 261394 -64290
13501 423067 419999 269787 -141714 139638 152101 384680 247476 297 -120132 374879 -63236
13489 257535 -110823 309860 345242 369152 82535 -25765 -24096 269940 47851 25324 102539
13478 102539 509483 189523 474804 124474 279473 211914 282939 84681 450649 94756
13467 475858 10543 379481 484251 549433 307105 156922 195160 336761 239682 17033
13456 107186 198198 225349 483117 249744 523385 409090 -58038 221433 149197 121408
13446 121408 12775 459821 242630 302710 228414 -49460 108119 336112 584288 196179
13435 18810 577408 97597 -169530 173201 -123952 164273 387775 -41297 91535 145077
13425 145077 -71190 300889 302664 183207 266460 140513 286187 193890 -270099 233942
13414 263901 410510 382089 87305 118086 -71995 80212 -35421 344446 -156774 342889 259451
13403 259451 207139 -64430 140267 316155 366600 305184 112544 229117 407589 300628
13393 300628 134220 -62609 227652 151150 -12371 181167 148297 -12980 271028 203072 363415
13382 363415 317668 128351 37148 365443 480956 519062 240693 356341 212569 511795
13372 511795 183966 436015 69074 333946 127116 418541 392306 -62351 351014 286147
13362 286147 554710 62085 1344 233228 190146 308385 211189 -148312 143774 216781 293127
13351 293127 430851 279118 66889 241882 315638 246808 -42633 221031 213199 251372 326378
13340 326378 350345 35620 437963 228983 333004 314827 313257 507755 41902 468576 155713
13328 186707 25965 298325 292353 84929 523129 191341 276097 122418 160635 210142 411688
13317 411688 419845 312344 -38329 130771 197173 269289 -76620 295606 274056 -42921 25518
13305 -118527 62171 -98435 105557 533835 97295 -182680 100328 -211176 -68566 -8135 -31885
13294 -31885 199518 -28979 212773 362130 112776 -42270 272894 16891 62362 -146062
13283 159748 -55922 -24050 -195992 396437 54328 -42535 -120790 472851 -64537 148002 257822
13272 257822 370579 290661 4759 69143 -2734 -406169 33277 270232 249911 -52845 34818
13260 67387 301910 300332 265088 222477 -1846 -340581 -41312 234398 241722 160613 114327 -37803
13247 93798 205977 219725 -26875 199702 180507 -19440 -139365 89653 46538 234972 231524
13236 231524 132478 -9309 34290 141524 231255 3777 -138007 231711 -97830 589883 -27215
13224 83319 76066 52111 -247308 -177988 -112210 -24082 -55725 20709 266341 158655 179976
13213 179976 -117998 73782 145030 4289 129555 126577 102972 -34848 139361 -12220 59910
13201 323345 -64574 358150 -214073 80007 382467 77638 123891 182050 337490 110995
13190 74359 -49280 -49644 57090 -205580 -160569 -70640 -434282 251684 81137 408463 4358
13178 44276 -124599 116551 349464 335992 149789 97126 124896 205953 21350 254545 303881
13167 303881 81513 -132228 113068 -206262 8668 -32692 -17873 -36943 104430 -40230 -99757
13156 -99757 26454 -46233 180270 96028 -28748 70468 -63638 200962 97235 165139 23709
13144 52471 120795 50511 3285 140039 57973 417421 195155 76952 -194951 292569 104145
13132 8156 7518 -54709 293900 138571 165375 -24626 359625 99878 50732 128900 -184120
13120 -93132 253371 6372 318526 76898 89733 231938 -26339 152943 206828 274171 64509
13108 -22653 -53565 -278599 109764 -51665 397436 460609 277426 -66458 118983 192397 240271
13097 240271 196438 200354 81438 46817 236918 -144588 61280 108356 -80845 5122 -224547
13085 199492 3872 -136588 23005 233166 -45992 -27434 -200237 147468 -44141 -108304 -154661
13074 -154661 213134 340982 -188081 -61981 -179523 215301 -25572 -93623 -17730 -105701
13064 -105701 236525 -70535 103686 254526 175141 84022 -1794 273063 77528 -64838 -39541
13053 -39541 78871 36565 125014 98638 336869 90178 146043 -183551 134948 -83218 -8606
13041 223078 371290 -49175 -71955 272702 -64519 -175415 -37556 55941 155930 82183 368862
13030 368862 115141 72778 305853 74602 68790 57449 266368 -16765 174035 102051 470930
13019 470930 486255 159673 -159504 -26655 144350 -75687 49260 -36835 322514 144022
13008 25322 101309 -101586 27272 -139881 -11857 50469 50037 17537 88635 132443 -232425
12996 -25772 311166 -65149 32507 -26784 295244 84347 -189035 68274 63767 338185 251817
12985 251817 97266 59341 20340 138413 -77331 -15010 182693 -50800 315 230673 -30845
12973 -52322 219520 123880 340570 105522 -107680 111731 222071 -232489 239767 24121
12962 121220 -13535 -115670 347588 144479 -121906 37694 -119487 113446 -175013 -43122
12951 -76966 -112026 44326 189782 44507 -107770 195905 -25496 -48500 106970 259031 148868
12940 148868 219478 45605 -20213 96889 328996 -50129 230527 242386 -87685 61262 45712
12929 45712 113427 27606 -5790 60279 -226567 -287502 -271247 7636 -43270 -59442 -57441 -280234
12917 -280234 310368 -18194 -51223 145049 53871 -128001 -121857 58404 -275977 -76319 445105
12905 23639 -103480 161094 -21621 387282 109948 56829 268912 313498 157920 11581
12894 -76347 -48730 110295 -159376 212583 6959 178414 191638 167404 -257054 72490 15503
12882 49322 61349 155869 -129910 182780 -39709 144251 -52800 20468 -194495 2015 -304032
12870 223149 89847 456701 -75111 63534 108083 215997 -257222 128209 206506 38075 197966
12859 197966 -149674 176779 186752 108590 -198759 292624 -238154 -178817 90915 10260 -2027
12847 149938 62316 191589 -278850 -179316 -34709 -36717 121706 134600 -115430 -124652 45839
12835 -1342 -15088 -220546 -17516 -93435 78514 -60701 -11534 4636 12428 -25152 75793 354888
12823 354888 -33976 114735 -87238 -46268 -165599 338119 64457 -2450 -67224 138680 46716
12811 -205439 -292275 -234336 43614 -113179 -40252 22514 335375 -211410 25030 -210594 206548
12799 -3745 -160270 43593 -44126 242080 8123 285612 83545 224951 -200923 118961 -147136
12787 13528 -306047 -52412 172852 9069 99596 -141426 -27220 -267642 73788 35897 252071
12776 252071 215113 68160 108133 110545 109886 132894 -137971 -18841 72494 -101749 124267
12764 438186 354140 -20784 -183067 -39708 -13628 224498 130893 5174 -59658 28079 -8944
12752 165086 -42904 224291 117473 33182 4422 -233761 274961 110669 -57948 79282 171318
12741 171318 189661 26860 485788 -143083 60733 -120646 51815 316713 -48061 88517 -38404
12729 -222044 141518 43951 -100783 105817 51962 2578 276157 -176709 -196673 90638 741
12717 124890 -10223 -17262 -30643 -11963 124130 96335 -95050 146317 42 158434 51984 233764
12705 233764 202280 -300531 224049 291228 40113 170807 -109799 263703 -7398 71786 457638
12694 457638 154037 225533 -140212 -63276 -470572 250971 -336864 230970 -175943 237086
12683 49104 238484 194785 310034 611862 189928 188577 21680 60447 56334 325825 31430
12671 -3468 176209 -50476 235185 21056 -189157 231969 -71775 -41270 -129734 -5782 -325798
12660 -325798 118398 381875 257883 -111187 86620 83895 230108 184269 357697 44097
12649 -313646 2875 -222451 -361325 4785 162886 239121 -81533 25046 -124534 159080 12728
12637 -95975 -42940 13041 147620 48773 -9029 -128193 104559 482123 402493 204132 49984
12625 173664 261169 -171957 -320147 250694 122189 61747 178757 47704 85979 153895
12615 153895 66920 130433 -93620 -114724 -62327 359228 -61838 150398 -6530 367653 364794
12604 364794 -19400 121408 230360 254846 419880 -139113 174432 125708 19200 69240
12594 69240 -53206 16619 27144 -106594 597177 -34353 310244 -310497 -6520 -84111 33413
12582 161112 -107615 -35602 107633 226621 229412 -89926 -87828 -47682 92811 4905 122240
12571 122240 86002 169414 56914 -8079 80599 70705 -4264 26184 -89173 54172 64351 158300
12559 158300 -180571 47281 105286 134938 -138508 -200364 148431 -359151 79812 -4995 -111998
12548 -111998 85833 119189 60380 27778 -139111 -62890 -200491 -330929 109441 329 43676
12537 43676 11044 -129024 -193645 342436 -4365 -156159 -190797 2045 291911 30174 -285581
12525 -191190 -31953 165398 37625 184311 96700 -158638 251549 -25278 204039 457254
12515 457254 -232001 98931 19230 -166270 81435 157534 -255557 -51131 33867 189822 28631
12503 -166652 -163506 -116904 75597 -163243 29771 160562 -244135 130568 -205933 61803 -94220
12491 -125133 -125470 153601 76862 -125887 272105 111784 103687 131179 -13440 -24722 -238696
12480 -238696 -110550 -203718 139180 170929 -192762 -94541 -137541 6462 -150980 -329927 -250967
12469 -250967 150009 28509 121599 -126939 -66261 9899 -64995 -35864 7922 -38213 -215502
12458 -215502 250294 33722 -144525 -18156 -68768 -106569 -126902 312685 -81438 -30171 -75777
12447 -75777 -57265 -2294 -224218 295160 -177909 -281202 59208 115297 -220834 -378472 127298
12435 266185 -7561 -63885 -241965 -155634 312609 172197 -58802 92048 17361 -184914 -212831
12424 -212831 -58167 63941 91080 -32463 72490 55282 222291 -154691 -333048 -55142 -133416
12413 -133416 296899 -215658 48732 290174 -167652 -223510 9885 -6701 64179 15785 79832
12402 79832 -136676 -72446 312722 72387 200050 82668 -74430 -103646 -83038 -94172 -27576
12390 -17981 206767 11905 -207658 163659 133168 240960 -78915 -277757 153280 30608
12379 105956 11981 205606 202987 -54597 265390 211824 54780 -115958 234289 -433883 -18603
12367 -199211 -118631 -93325 352275 159787 -68330 -117761 -337245 -108597 113996 18533
12356 175514 -36074 239977 -58369 4350 -31941 62074 71919 91957 116294 -270396 6578 -272314
12343 143384 -61411 -14819 -193171 214166 142868 4735 43352 184158 40946 -93590 -138419
12332 -138419 -131600 -310468 87213 76059 -56312 100571 173663 -84822 119201 -22473 92661
12320 16936 211692 4664 1727 -88275 -199474 290777 114561 111988 -50339 341020 169882
12308 1297 -3287 444007 -183637 -135532 -26651 -14672 -30366 163608 180137 49875 -76556
12296 -104341 -83480 -136997 62043 266814 -36642 -88949 126172 -101032 231810 132562 96435
12285 96435 26600 11591 1915 -166397 95909 115289 -211731 150653 341877 307528 249843
12274 249843 -100835 -95314 140464 407315 -142270 351218 143151 44303 151934 138999
12264 138999 -9018 263603 17645 -38391 -47459 12145 621 -134861 94716 62606 72405 19764
12251 282454 147564 32633 277222 88308 20100 267777 328587 141364 212179 300764 359737
12240 359737 -121078 -193082 -80186 -310503 261351 270439 513173 262858 38033 -89879 266865
12228 -63835 192767 67117 77339 87720 69559 -59541 501840 381597 214548 67443 245915
12217 245915 122484 -83631 16898 -162841 -40213 151304 280183 -285105 106828 113644
12207 113644 455887 59108 173404 124598 -74451 -111701 95355 13605 143314 227956 422194
12196 422194 471239 302885 152699 132539 235333 -139637 69881 -100123 244192 30255
12185 23316 127193 345333 196402 -66037 227952 -172345 -121167 194669 93524 -15754
12174 -236764 -225493 167959 -135739 -163297 -31179 158290 -151258 -152257 315761 414307 134613
12162 148408 79026 77839 -45679 93763 -149189 206069 272693 -152567 -51180 140563 178535
12151 178535 203004 -29746 156861 -287917 226109 -36966 300711 138362 112672 146409
12141 146409 56314 22635 -135265 -33594 -92071 170348 46022 -295487 117822 -7623 263914
12129 34611 478406 1743 77147 111854 20531 -223962 -45910 87112 341800 -110584 -178210
12118 -178210 229124 -230426 16993 49455 97222 159550 96274 -21584 248476 69403 -92416
12106 141033 59502 132536 -38128 297800 -96245 -123495 278 53154 114856 -156202 -231585
12095 -231585 -40735 -143542 226999 139243 -135725 -363832 -59862 -14898 235271 -21220
12084 -166222 22274 444419 -208412 46383 283378 107455 249101 761041 1803013 789898
12073 155560 159847 41286 114180 313170 10846 294400 89071 -90696 -227328 -89417 -146539
12062 -146539 -368325 253998 -138182 148118 256167 -13377 -325068 17098 -69394 -186213
12052 -186213 -42200 -350065 146681 -201740 -10947 41813 -377584 -90337 164683 19716
12041 -280881 35854 -57474 275942 149415 45790 -200624 61358 179209 -60268 12356 -267480
12029 -64120 -142613 -353103 219944 48935 23941 -88199 -74071 -415109 -60548 20436 87259
12018 87259 92172 144255 -29450 -113466 -282314 133113 181146 14510 -69651 -241449 -301457
12007 -301457 -28683 -182629 -75030 -74332 16712 -38873 43070 -185179 -141915 -160593 210216
11995 -16974 38224 106529 43188 281245 -88723 26200 105848 130921 212737 -144252 289084
11983 -83055 -269276 202487 -251703 -27005 -24713 287659 97230 -100335 368560 -65114 9563
11971 45406 121630 52741 105422 133604 25922 -30644 -247463 -106681 85515 249233 -157232
11959 -37776 40760 153559 149587 14373 -200558 -178932 -114392 -79826 -197848 68862 -3879
11947 207118 170661 -156982 -4270 93567 -231375 -54884 179557 15284 -304610 49710 -134268
11935 16609 118104 -162328 -358022 73692 41484 22123 -122777 206268 -60413 304671
11924 58631 -233869 261420 -52645 -239956 -241518 -165366 264933 9153 148068 229650 197393
11913 197393 228072 -72609 219833 15464 1999 -76312 -2788 -156311 276426 130975 216060
11902 216060 -156496 124033 -151098 -148747 117329 32547 -355618 348999 61188 -231324
11891 1226 249297 -43133 226134 172530 23450 -43579 235777 -122532 -78929 257198 46894
11879 229649 -38330 -273511 200525 134553 -67046 8267 -85352 -26110 -315943 179889 40285
11867 138366 -240066 110020 -178094 -275239 243368 -183885 -38554 158210 127272 83803
11857 83803 -15190 -6255 -58209 -34907 -210956 -165340 111017 -155255 -205397 -20883 -66928
11846 -66928 72625 76730 -75639 32242 79846 -73146 -301611 -258318 113090 -322556 -69914
11834 -69144 154801 106157 110075 -270860 100400 -263529 187226 156925 95543 170166 71223
11822 -209940 -44711 -293936 -59373 48041 91862 34268 45612 -98153 -79706 144293 -188292
11810 -270794 42291 -34052 -34894 -69222 -52182 -286118 -121449 -108154 72653 105955 -7200 161078
11797 -101453 319600 -33628 -10926 -165792 -66782 244476 225844 191926 -266215 212171
11786 -56233 -84364 -38449 -7978 -93757 -243270 266093 99933 -70638 -154143 -251223 -146826
11775 -146826 -167313 -43074 230273 258460 -110389 76508 -122590 188078 286289 -129708
11764 -48926 -126116 41141 -207554 -60159 -72853 36780 -71289 -182753 -79391 -147372 -130138
11753 -130138 -280552 -47133 -52519 -113663 71614 224186 114722 152003 -43373 104334 -250566
11741 -30855 83240 -310358 -241202 -267228 48063 -183877 -59756 -95899 -352400 12728 101547
11730 101547 35230 28757 -14988 -198020 186245 -18435 -260878 235209 183756 -95139 -94913
11719 -94913 99243 -48904 121073 -88797 91908 -42484 -227916 129188 299288 107559 89985
11708 89985 314353 -58472 -13213 224130 248995 14602 -65925 256893 -166064 246424 74322
11696 94005 147851 42386 239534 -6881 -60542 14611 93032 -141565 -100956 -281557 157784
11684 50972 -135180 183670 29755 -194368 266837 186684 143023 208430 17333 49330 221768
11673 221768 -158625 -160989 98225 -2539 -25192 392694 47086 44751 65897 -91772 -68451 -71933
11661 -71933 60451 251356 -23663 -360989 41758 -241671 352731 -142615 120848 67917
11651 67917 -86350 -141212 -94007 -774 -192806 254819 32839 -48984 -53984 254471 -108910
11639 -37431 -101312 -369452 78598 -58223 100929 29936 -133528 24952 37473 196452 262948
11628 262948 7348 239063 -45509 218744 81123 -48870 -41525 159041 216295 46412 -54096
11616 159298 123538 26175 -77938 -156377 -141269 37614 101011 151459 383611 -94295 -38613
11604 -65814 -18298 -226056 -87074 252886 -34265 149733 -234302 15524 46127 21536 -66371
11592 15822 -11481 74465 93853 -59869 181331 372052 719314 151190 200560 -12210 50824
11580 205393 -24321 21897 92667 33241 -124569 -251806 -134621 254203 -54892 59978 102657
11569 102657 225960 210398 -193998 -322157 184157 134212 -3092 -154429 -30913 433050
11558 87877 126059 -347431 13552 -143558 40121 -24430 -20247 -202432 69555 -201717 -207871
11547 -207871 41506 90390 -261350 -208585 29941 47860 125452 -191240 -257516 -32465 -12350
11535 -3838 124716 -165079 -407363 294962 273606 -157525 64138 227238 13633 119242
11525 119242 294905 366725 21328 -116364 5621 124751 158820 237561 128138 96278 -83147
11513 129575 -48555 362018 -28664 168095 249666 96206 102082 -54755 198453 80285 169291
11502 169291 399372 151837 37987 -84886 476731 -19497 -164900 -101122 -49090 125320
11491 378416 257894 166327 256292 -188609 122422 574886 130464 79025 58034 23065
11480 16681 208283 82829 -59851 80745 47475 241745 170669 161626 163737 -199940 73545
11468 -155418 -65454 233969 99034 287814 74718 73935 -264751 138094 41717 298527 -71755
11456 53207 189038 363173 -82015 238570 95961 -145913 457500 -73682 115816 306298
11446 306298 -260303 119598 40219 214727 32998 -17063 -171079 191947 212408 -139965
11435 291571 24530 88336 -93757 106945 -328629 -50830 37339 241699 -124726 61015 -49837
11423 -74523 15765 -80528 153273 915 136804 282274 -82449 -58322 370173 112249 -178164
11411 124727 -103944 784 2867 -294774 160631 -145107 52868 330490 405938 152935 257347
11400 257347 -131722 -341173 -93532 -159614 82372 10460 228348 155900 -112649 107888
11389 -197767 312142 -21776 -71280 -219134 -14599 151920 168529 -22300 331553 40857 7636
11377 71057 -166987 110198 -193338 190193 76413 252781 30259 188169 -127177 74641
11366 -24186 -170697 -153342 231379 96091 80007 -118798 -349200 -16342 -53850 -8324 -55461
11355 -55461 -356318 -67484 205787 -156491 -318148 -142232 42433 -131798 259392 271500
11345 271500 -263087 -233557 -205675 279945 32866 -2990 32985 23190 -293339 -280318 2358
11333 88852 -107822 145710 332767 -37937 480408 165007 5842 -66371 76100 262487 -233398
11321 -123796 -28355 -138461 90293 -31199 42115 3795 -51341 -60203 -27992 260784 135065
11310 135065 257651 -14550 -191740 12309 283424 -45346 -233604 19238 -53174 211337
11299 -285201 306068 26318 228447 70585 19307 -5487 127340 -193103 192184 -259928
11288 -90282 -145383 300825 114150 -165851 -140445 76094 -123742 -37343 -354863 -187716
11278 -187716 181727 -171214 999 -188811 4303 -42109 69864 -15016 84952 -121724 68852
11266 158484 144437 -131211 -48660 -247224 -15320 -163769 -143035 309786 -149984 366590
11255 -24891 9193 -177074 -215630 -397391 121588 -254551 -254295 -7980 213963 -79377 64018
11243 191368 122327 -102097 144036 -161412 -65766 20917 -119588 35317 -114358 -348528
11233 -348528 33999 -26398 -270954 64156 222655 -166393 -23728 230850 214555 -47440 -107257
11222 -107257 -153372 -269626 393198 87797 -67699 -175697 -241726 17454 -161628 -201585 35680
11210 32038 95644 70961 -42866 341303 -23541 -107668 -57914 85845 194064 213228 -195747
11198 62813 18656 -217532 -229066 -233191 91441 -13755 -12838 109197 -100500 -123130 -111678 -9078
11185 56642 -15106 -97920 -68245 -129557 -115550 -6426 -252553 15049 -27259 94666 175537 -131216
11172 143350 211 18675 -68468 -179450 -12971 -54257 41524 136554 -98217 -143399 196367
11160 -181962 207634 -92585 -102079 155280 79153 117676 8413 66624 -47651 -141458 -212772
11149 -212772 -123303 -79718 -20868 -298554 142891 -378806 103275 84683 150659 16845 49181
11138 49181 61966 86880 -16963 200900 35292 49364 -19557 100866 89544 -62069 282475
11126 249009 -176574 18167 108138 87758 -117903 76766 -154882 20256 -384741 67467 -16833
11114 -50166 182380 166131 404089 162892 141768 -63898 155379 -274223 15606 81225 -48958
11102 -105589 27282 297155 84609 112663 67754 135639 504597 -86161 359058 135786 208815
11091 208815 82461 16607 371736 -78466 21858 115217 405446 63133 -180699 49390 129185
11080 129185 359532 144572 323297 233252 68449 395734 399505 328553 456052 415277 375839
11069 375839 248701 271410 250638 183864 129470 534816 300806 293396 530678 578277 283683
11057 299044 431672 306880 364374 621504 721851 697954 633805 725952 520101 218553
11046 739115 695312 879848 783683 743869 702805 870713 568774 612411 457037 563946
11036 563946 914155 467465 490574 779768 698929 238764 377126 457175 878694 817132
11026 817132 521062 420374 771510 655571 535525 807616 376862 578716 435720 702143
11016 702143 442696 325101 582696 528245 376220 552361 617054 416792 383821 888173
11006 888173 524891 657110 749459 645464 565452 616635 287470 604425 705206 695167
10996 695167 537797 671737 702574 612818 651783 523234 877495 600348 691127 767188
10986 767188 528855 585165 712080 847807 877794 1192971 897672 921067 1271640 1208562
10976 1208562 1605034 1574734 1837804 1921139 2130956 2448983 2186084 2135441 2368212 2175504
10966 2175504 2107028 1760263 1324202 1905166 1401256 1413050 1619176 1632115 1651656 1450592
10956 1450592 1510027 1484716 1705030 1158577 1410828 1341987 1217246 1121397 575402 734881
10946 734881 458122 324417 303372 191406 174569 160800 131409 -184473 275009 322040
10936 322040 384589 269064 69159 -49776 59737 401376 359618 -24640 292549 24152 -96292
10924 187404 -59131 76016 -234818 326802 11230 257492 96602 -241992 82664 32972 302427
10913 302427 -122891 39052 62016 -116171 -219884 -52934 77840 -72956 -240353 272176
10902 -383430 -44006 -117773 -351801 67583 55298 129736 -239551 -173410 304336 -161786 -173587
10891 -173587 -26789 -156770 137633 -153707 15943 -216778 -23992 172901 -28646 112007
10880 -77898 318644 320276 97287 122513 118433 -187024 97618 15808 216713 -134126 -229315
10869 -229315 -199109 -301028 33449 -27183 -123674 -194236 102291 -135666 -239560 176364
10858 98 -73396 -189227 55835 69472 234240 283087 -46908 -6185 99227 236705 2085 82058
10846 82058 24945 -230016 -162319 153023 -83350 49327 -152264 -17831 44291 -81601 50198
10834 -41873 -17685 -155101 404649 -58193 -6594 -86328 12414 68204 -100119 -147208 80378
10822 154928 -305817 -12033 -118668 -50718 132311 38736 37853 -23017 -308511 96096 -70562
10810 -169115 -191983 -121245 -105156 -94896 -55074 -49638 -106042 -132753 -47103 -131503 69352 -39710
10797 218409 -68521 -104317 14747 354114 102025 -8688 -176896 -225261 -524167 -645542 -89060
10785 -126333 254002 -114793 41098 390727 -74679 -238358 -331346 -212269 -216301 -109639
10775 -109639 76028 -125136 -252030 179101 -237404 -8462 -297799 -135295 -16714 -221978
10765 -221978 -147362 217258 -52889 -268226 -6818 -86299 68366 -41566 29550 -427953 159032
10753 81765 94970 -13929 -254547 -153883 140123 -237951 48156 -47630 52519 -102004 17001
10741 -134619 137252 -31759 -54121 28492 -274205 -67840 41172 94557 -307700 -204493 216402
10729 110146 -171828 -252897 51366 173213 159173 -37578 -171363 -213806 -155727 175424 13681
10717 -351077 82802 2982 -305494 -155692 -138085 31856 163399 -116890 28302 70605 236124
10706 236124 -21335 -62082 159048 -263955 -326607 97336 24925 -110745 -60110 -164456 -118753
10695 -118753 -174696 -241439 -138449 124644 -140376 -41995 -275407 30075 144407 -131482
10684 7332 -349056 12279 -103996 60426 150540 -16935 37682 -198549 -101409 -124082 -143730
10673 -143730 77515 191594 -75996 41723 -237431 -17287 -146696 392053 125100 -166617
10662 85757 -335265 -175248 157128 -202625 -180206 -66402 37061 147190 -80398 -100845 -26890
10650 93644 -24921 221534 230075 71388 -960 -76450 -52584 -82114 106200 58407 152006 -278511
10637 -476189 -219816 -235169 -277811 -82330 -1792 -257465 -197337 -29108 -29727 -75556 -17916 80276
10624 21653 452115 -190170 162231 -135736 147126 185417 -230883 24554 356534 -24277
10613 86780 68767 222197 -192112 36891 33848 -130132 -79193 -207197 -67409 -87320 -110337
10602 -110337 63526 19727 336766 82848 -63854 -46039 26901 -250103 -33108 169546 -165289
10590 -257481 -361791 49302 -103297 -91423 -232933 164723 169597 -62290 -204931 -223759 -46080
10578 -107965 -87524 42267 -251016 130808 -26002 147953 -107833 -177650 149080 -194263
10567 -123877 -172805 142030 -217304 348448 -317449 -24895 -118184 102057 131909 -18529
10556 -125046 81997 -143947 -31356 77216 27648 -74970 -62669 -204935 160886 -266189 -99381
10544 -17173 -341876 114866 -85007 36952 -316289 -61208 -164015 123825 228940 -19519
10533 -105007 -108391 56393 312373 160200 82449 -132835 -94837 540501 -170111 38618 363846
10522 363846 187323 85679 235213 39754 54081 -280813 -94146 35783 78 169233 -154019
10510 152914 -16333 -90817 -47770 -23529 -251122 -121449 -281725 33016 -256370 -71756 -133239
10499 -133239 -96881 -338446 -65095 13504 9786 -266741 -134794 77746 -231539 -36491 147313
10487 -54134 306864 -15363 -268499 195183 330592 252300 361746 593128 480677 423773
10477 423773 -83945 149871 155683 194633 57719 16112 -96925 113710 -117705 -175003 171154
10465 -190292 -359402 271174 -95256 -18210 -89877 88876 36142 147080 88900 -135503 -69490
10454 -69490 -114097 -198573 -164733 37856 316470 213991 149754 199062 281858 144328 -91865
10442 148886 -189036 21609 -101974 -155587 -65654 86207 -334249 -218684 49942 -85055 311737
10430 10289 111662 176621 15263 -247408 -201460 29667 -59187 -127647 144752 40029 -488176
10418 14415 50386 7831 -108568 -218994 7555 -334558 237716 128575 221102 66797 -8442
10406 -158422 88653 50986 -49945 -274278 -84047 18632 62590 -258013 67500 29251 -79159
10394 39566 341366 -76081 181784 162180 169226 -53150 -91999 149181 -114723 176668 39152
10382 52589 -155232 103143 3063 178261 408783 234629 19527 -119084 94794 176123 219015
10371 219015 325729 93384 365674 352510 366176 492051 384252 215500 350908 59402
10360 -56766 69043 -44895 87847 74891 313690 33310 -72346 487233 207363 380644 757550
10349 757550 359356 336788 605092 -98978 627329 541764 67819 233061 229745 185579 119198
10338 119198 149266 -41048 264329 133932 164073 -306235 183668 51128 -135657 13034
10327 233692 131328 -15057 -251558 136245 74676 276449 -197634 31320 510152 -3270
10316 292973 -282595 59431 198347 126326 234408 -112803 80265 360555 118451 -198046
10305 177509 -212238 17888 -70069 -224912 -190952 48392 -164420 224109 18513 160105
10295 160105 -216471 -102711 16920 -151330 -42268 -98421 30820 -33185 -26187 -99324 -183961
10284 -183961 65445 103215 -7149 11427 109994 -56025 -122768 -457382 113781 182637 -39056
10272 -69515 6506 -175248 100761 43418 -177422 10902 -17427 70056 -31087 62904 127107
10261 127107 -114463 -164217 19494 115691 731987 219358 85974 -193281 325927 -74204
10250 114143 317855 -252571 195826 -89814 -85042 -302167 233385 21187 -162002 -75460
10239 -47229 49698 140199 7363 -161541 -41011 115758 243546 -464766 -75768 -51428 -26275
10228 -26275 -197889 -67014 172198 -96595 34056 223283 102379 -88962 -261001 -354665 -103840
10216 -131965 142399 -113463 96299 23778 -67932 173675 -169508 -137161 -99937 113465
10205 -153045 -198629 -103475 -218685 -47745 -306840 17003 45872 -90518 167572 -97253 115489
10193 136902 -152742 -281742 -180680 132606 -121136 -171546 -157910 -233813 -81314 59263
10182 231337 18387 114388 -77126 -171538 -141769 -52499 232532 -90127 -97673 -385002 81119
10170 -244389 -129178 -375129 -453207 -238674 -279156 -107819 -48110 -250904 136949 -269893
10159 -111887 -60918 194622 38844 -309022 -144308 186338 -178270 14411 -14005 189057
10148 36910 232246 -2008 -107388 115346 78247 -128576 -5550 114946 321295 -55502 -26213
10136 -450877 -115387 48268 42266 69747 30068 36158 -54988 27551 -130452 -278168 -195159
10125 -195159 -154503 31673 -57029 -192307 -81507 -247071 -236557 -477289 -13406 50790 -123596
10113 -97687 57880 -167451 -37489 4028 -63977 63435 -91188 142949 91812 -324960 -278741
10102 -278741 128375 -110055 -112095 -58782 151086 -89651 -54290 279299 -229374 17040 -115811
10090 66132 -292956 -304176 -180839 179879 -169444 57426 17026 5186 32210 -69686 93563
10078 -181853 11647 -76658 176821 292221 60006 102923 104378 -41355 -346694 119219 168050
10067 168050 -180001 -230654 126046 77676 65184 -76093 -105208 -163923 -197360 42886 2837
10055 57754 -177509 -8096 -275242 187098 86913 63766 5576 143176 -7650 -182230 -17577
10043 -268579 225761 76018 305374 -161127 146731 180934 70068 -319104 250670 -72050
10032 -3950 -201953 -61335 -303020 -296992 72044 -207048 104947 -279567 -81093 21344 -5948
10020 -8523 -187742 -220569 -78955 39671 -61662 -361330 -229587 121157 222925 -399706 -183469
10008 209016 -71521 -150429 -404724 55705 44248 1927 156906 -222802 -282703 -344213 42189
9996 -524618 -207238 -98734 -89326 -227131 59910 243000 149876 151157 -89267 50589 -320554
9984 343287 -425455 -260404 -269270 -468385 -270980 131890 -50331 29960 50440 -16921 -154262
9973 -154262 -234069 -395458 -5886 -18332 -80025 50617 -277492 -369993 -149120 -505955 -87996
9961 341103 -140383 -75618 124451 38555 -155927 113927 -99514 -45771 -244053 -24001 -22459
9950 -22459 -306594 -372763 284974 -4757 -77531 -212008 13297 171109 38596 -33403 45530
9938 215964 -64545 -29123 -4635 -86731 -280837 -108945 225599 119390 -153641 -214990 -277395
9927 -277395 138856 70468 -297147 -163550 -272589 -88376 245385 -124298 -103190 108951
9916 283536 356139 -44513 -194121 -3543 103701 -92083 23290 14249 151332 -55683 -59877 122960
9903 19978 50190 -286749 169101 -449677 56082 -165226 -117549 3024 -73146 119850 -246105
9891 -143320 118005 -203369 -416511 128533 174318 -454660 -61048 15487 -100640 -249788
9881 -249788 25685 -65515 230372 -205825 -17807 -299102 -157693 161672 -198936 -178157
9871 -178157 100321 45872 -187850 136598 301814 -21500 184743 24840 -143001 -18883
9860 -295943 -671544 -194425 -179905 -296555 375560 270532 -352047 4594 254515 -93450
9849 266028 -476989 -202849 4422 -412979 -89458 45493 -100831 27032 -16789 215056 -66291
9837 -42026 -8575 -24628 8516 11545 -106671 -11396 -64118 -146851 -83713 -99719 74354 111336
9825 111336 9994 139177 -17174 60530 -16013 11895 250278 50429 -157154 -40225 7421
9813 -62341 -23893 -45669 -392305 55382 120774 -357510 -108350 -117619 -79579 123573 -90699
9801 -433496 -123175 -8056 -199895 -120332 86074 -261074 87349 -263337 -218762 246065 -219332
9789 -436667 149399 -217378 -104684 109929 -96670 -440693 272729 -159779 35309 -52378
9778 -134693 -103630 -177940 -124215 -223556 64144 99663 -142515 183090 -370488 -129171 163785
9766 -150048 -263746 -252287 -67331 -94847 -59266 -92392 -240465 -139003 -370911 321293 50385
9754 -107156 -442239 -153636 33714 119994 144433 244003 -122179 -77855 -230175 224338 -331442
9742 -53148 -157301 41484 167223 16222 -134971 -102747 154312 138983 44178 -215034 -23262
9730 7473 190384 -274072 -74119 152827 34625 -113963 -38484 -159991 133718 -11740 -363599
9719 -363599 -129724 59594 -326495 69053 -196077 180941 -186263 -48198 -174983 -16252
9708 -93661 -85146 -151834 -19825 -168987 169635 174007 -289018 -100874 -163622 423858 -224174
9696 -100954 -136759 260746 -26439 -111627 -138801 -348159 -125952 -61245 -112406 -1312 -62692
9685 -62692 -104900 66082 -31188 -45870 -111930 -121507 -105570 -47356 93598 -111685 214114 -107667
9672 164924 -69486 59606 -37060 -202863 -48943 -148796 -23151 -350398 72028 -377833 -126248
9660 -132148 54029 -312539 -404961 -28031 -403811 -59676 -122753 -45516 -59801 -98669 -86300
9649 -86300 -58604 -100652 122653 49301 -270081 -45431 160200 -83140 -74039 17743 19453 -59785
9636 -124028 -58966 -169932 -317580 -102847 -86410 152886 77964 -158199 -183813 188438
9625 234708 218938 -27988 -48529 -420580 -252959 169280 -289818 107849 -341559 -131928
9614 -51053 -4747 -719 28520 155790 -30752 -83007 274336 -137195 31470 251723 -83839 6141
9601 7342 43823 127122 -215451 -10221 -308670 330627 -96865 -97513 -136385 -195551 -106325 -39920
9588 73631 148812 174179 -254328 -111496 -51100 -51023 113142 21904 4846 -23133 57117 -211224
9575 -90421 -13788 -40777 65556 200212 -165067 221002 -86324 -234812 -420613 59448 -93909
9563 111031 -73926 77537 119977 -291643 21303 -52480 37540 -57447 -164967 337573 96647
9551 -39420 -287417 -158502 -364974 -224445 182241 -108799 -304581 -216158 -156108 100189
9540 56477 261880 -30170 6256 -139289 -117987 63866 -355417 -121375 -24689 90148 21943
9528 39841 -26314 -100086 -56515 -317266 109016 -13363 -68764 -178500 19466 67804 46634
9517 46634 249435 218852 -459542 -96889 -348241 -224128 -220877 -54873 136876 124053 -168792
9505 -79982 79342 -65926 -231129 38968 -345638 -48362 140327 -457210 -143600 -45672 -282454
9494 -282454 -48902 -35536 -87154 46725 65956 -231386 -39191 6355 -96272 -48069 -49332 -26359
9482 -26359 -49395 -169968 -216567 -93186 -71707 -159273 281361 -355451 15372 -13902 -160848
9471 -160848 -100562 -165384 -29121 -238663 22631 91618 -33086 -258264 -322412 167092 -16133
9459 -320904 186817 276353 -196100 111273 54177 -80533 87668 -194752 10768 -154377 210615
9447 -86784 7126 5339 368249 -457981 -32645 -210552 -257463 -30876 -53467 245247 15684
9435 -156230 90611 1818 -342073 -85708 -298392 359710 5808 -64534 -69475 143321 -187202
9423 -240649 -126221 120064 -192386 -176021 -61060 24004 1081 -26014 144223 129690 -255817
9411 43551 -328242 9673 79459 113750 40531 266374 -112618 153240 -152460 -120320 135647
9399 34350 -231934 19961 -92555 213910 -134740 -243504 -4411 -170157 1755 -110144 -47519
9387 -292897 16592 -111134 -2792 -27979 93431 -9597 63425 -146834 -172912 -401845 -1415 52605
9374 -129029 286722 -10600 -102157 -323771 30227 13170 -75966 -317875 133659 -189020 171902
9362 86117 -116615 98131 172105 -159547 52783 -255092 -166064 -353874 -166806 186428 93792
9351 93792 -55108 -70988 -193916 -60825 -39586 -49084 -105241 -399260 -244115 -414702 -87813
9339 -193465 9895 28768 178061 -158673 -263891 -92558 258935 -11135 -263664 -342598 80820
9327 290151 -41667 -83802 -29913 -14896 6224 -177225 120221 -34075 -218848 7594 -61434
9315 -83043 -264370 -41074 -139093 -120126 -105597 -203860 -249994 -186642 -90479 -231027 -7167 126832
9302 105566 -155394 156827 -611523 -78031 -423838 352281 209565 4121 -36994 47881 -151334
9290 131242 -57826 119080 -142241 106872 -178256 -19371 -33456 -209509 280910 -344969
9279 -59536 234319 20124 -22407 -27625 -162046 173994 -239606 16822 -31645 -82488 28355
9267 -271693 -225657 -30749 -61277 -93762 -203191 -152866 -62590 -309786 -75908 21102 189157
9256 189157 161237 -324621 -80201 -4486 117737 12223 97490 111106 -187051 -31212 -81372
9245 -81372 -179204 9550 -71335 -268229 198825 368362 127513 232359 149299 14246 73599
9234 73599 207879 -186783 268268 308976 -198781 -219476 -6443 -54896 -171288 -129257 -52091
9222 -147479 -130059 -105842 -240743 94259 209024 190872 76431 107333 -100608 92248 87096
9211 87096 -178867 -15937 89203 -186202 -411581 47535 232075 -50345 -50030 1978 -27771 -39747
9199 -39747 139771 -135479 198531 -323981 49051 -40722 -360692 102519 87809 -21363 292316
9187 1624 -196869 -189933 -68819 57574 -293308 -121349 -24872 -27983 37423 183819 -82443 -55802
9175 -55802 122320 -130171 -303044 21384 -74209 -316067 -1230 102794 99131 -128482 -7684
9163 61340 34809 -399950 129487 97725 -191298 -34182 -3079 419139 237378 -47170 -65086
9152 -65086 179272 -95143 -196282 154405 -98169 -55428 -113351 -91136 -88684 79798 -340164
9140 -105103 -39426 -62835 -188871 -227591 -513402 -265747 -167159 -169550 -308951 58087 2609
9128 -468537 -152285 10567 -107188 -1885 -168059 18607 162073 5587 -250974 31025 -254996
9116 29981 -64744 20010 74496 51773 267286 -138773 -186389 20344 -173872 23485 1396
9104 -139561 8719 93368 -108514 188245 -95532 28099 -45217 -72898 271134 271241 -153881
9092 170038 -207768 203830 51363 -13619 -42889 -52672 -100472 -91239 -174057 -119959 -210460 -55313
9079 -69236 5389 997 237680 -211331 -44491 -208048 91723 62898 291394 257926 -91768 116530
9066 -114677 -100351 145579 38593 -97955 64751 -125497 -171950 -41637 -289326 13085 287211
9055 287211 -38324 21633 -132773 -94588 -243556 63589 64821 34807 -167674 -197516 187472
9043 -30424 -36682 60105 -338173 -1515 -212870 -48347 100829 48704 -34087 -228723 155526
9031 -61352 -286831 -87008 -36308 -131733 -70978 -109158 181962 -276723 119352 39365 196885
9020 196885 -317130 -209416 -158125 -409194 -60659 37076 -63080 15542 -44606 -50760 -267153
9009 -267153 -44214 -94805 -190537 35266 132922 -310067 249849 -178091 332024 60146 207060
8998 207060 -18867 -98278 -152303 22083 103644 116020 48240 100102 -192729 -158671 -11393
8986 13314 74972 -121922 -283702 -219251 79204 -27126 37067 -116718 2697 31884 -205604
8974 84069 -25392 -157514 -74539 -32366 133164 -101617 136568 -270614 -127500 -127593 -79243
8963 -79243 -41676 73346 -149091 171418 -186011 -122170 -192683 151820 434783 -168620 67869
8951 -185223 -141091 102764 -62725 -80457 17707 -83487 -69888 -228308 -85010 -253790 -389758
8940 -389758 -49687 258429 89893 -269368 -202035 -211277 -711 126457 -259960 151137 115338
8929 115338 -39045 -191316 -371398 -5062 -2921 131069 50339 443072 728741 337884 211
8917 -274692 9566 -310442 -111899 -264641 -101653 -156645 -146216 -108913 59936 20728 -44120
8905 82697 -57744 -1118 -80440 26504 14222 -124853 -111173 -198845 -56318 21940 119227 -154188
8892 175839 -141362 -62407 -294115 96656 -243003 -326706 -359268 122837 25919 -266846 -40300
8880 141298 -158514 41790 3556 61241 -25880 93113 -70529 200651 9511 132291 -540884
8868 -224099 59040 115492 346943 -170397 -85602 179045 -413595 21426 -12027 138343 83257
8857 83257 -179466 -220829 -133901 -107061 -242231 88610 -311298 -248509 84382 -200334 43900
8845 -273115 -306375 -13010 -30731 -38788 -11806 141995 -26494 23663 57932 -5412 58545 -294506
8832 -103937 -268637 -130619 -231372 -195047 1334 189129 -184346 -146856 191056 -138509
8821 -87188 -1668 16166 355590 -81684 106181 -387258 77445 -119584 -214188 185658 190979
8810 190979 179430 -45186 20399 -30947 -85794 -140281 293762 -399643 -58569 -107680 -201779
8799 -201779 226572 -73440 10196 -15674 -201263 -283098 -241961 -45003 84123 -29867 -414651
8788 -414651 -182334 117366 10424 -92122 3580 -175743 89176 -78865 -259760 4669 65874
8777 65874 8427 -21105 -177389 -159745 9908 -103929 218872 71887 -78287 -87482 177178 140009
8765 140009 88811 -258125 -175870 -45599 -265781 -101349 -148377 50633 -107276 47929 163741
8754 163741 -84714 -18806 72592 -78418 81844 252509 120444 -154621 15966 -210253 -56091
8742 20288 147496 180338 299198 -267781 -40886 -317895 -315707 199270 39478 -229296 -371607
8731 -371607 -139228 98967 163994 42045 111529 -71512 -417707 163016 25056 -219275 -21684
8719 -43261 26914 122687 152995 -93268 -58184 -38472 274076 105755 -22765 -186196 182512
8707 67206 240970 -69125 -17737 -319634 141164 -54742 -81073 77916 225747 -63861 -51178
8696 -51178 109512 -287526 101677 -168745 -129718 356387 -46227 -162819 -318706 -32309
8685 -179682 -59217 -162558 -155154 -102383 -194967 -84826 239169 -363457 179375 -139913 -157756
8674 -157756 -12987 -40577 -121569 70760 -64936 -101174 -83164 -91803 233776 1910 -9643 44068
8661 -292316 -207254 -683904 -265649 -142991 -231469 -21420 -117468 169125 -157863 -250366 -10800
8649 58693 119979 -101883 126513 365374 51137 52011 -44649 -50031 468766 126235 -31207
8637 -181237 -188451 -54487 -152455 -36667 63956 -49320 -131974 -111256 -273386 -94049 289859
8625 -170599 -20429 287758 -314789 -60161 -30086 -122930 -11263 145425 -22418 -66644 -253759
8614 -253759 -159432 361515 -40104 -42757 46674 100295 -16668 -49168 202047 -148971 -100026
8603 -100026 275634 -46026 12619 -23938 -190603 -186940 -156416 -187615 -220858 -184062 22832
8591 159532 -160944 312505 -295339 85313 -206407 149 -234627 -120948 244403 -135696
8580 -71837 49896 -212559 -221439 58762 385458 -91951 -397949 36236 193049 21920 -104837
8568 -130259 -316571 -227857 62017 20018 -149447 -69901 43863 52134 60755 -110321 59819
8556 201364 -82236 96263 -168202 262786 -297562 -161077 -26126 59025 409314 -92720 -382561
8545 -382561 -308856 -10216 -131231 -193333 -360440 -64598 -98283 -145727 -222990 37233 -318686
8533 -84226 -260921 -193637 -107210 12958 -152048 -284264 322750 163125 -170218 269935
8522 67376 -166677 96565 -174575 254063 55455 -24586 343872 284591 -93160 -11380 -43543
8511 -43543 -119326 -36319 -39339 -60944 244857 253314 -92892 -126972 -227953 -33933 118418 -31078
8498 -253695 -91615 -61100 63663 -129313 -20695 -164381 129693 -158272 -93191 19445 -203051
8486 -120148 -142477 81967 137622 116749 -75984 -355424 -262167 -63947 34941 -72090 26352
8474 -59285 -114906 110681 -200172 42720 38109 -187161 37414 -186210 -25612 -144303 -256053
8463 -256053 -316877 -17421 182859 -180779 -23568 42646 17847 -10627 -99186 -76310 178606
8451 -167471 56102 -261604 134687 171932 -190352 124409 -81464 114869 -99209 -74829 -379266
8440 -379266 24292 141465 84628 -191294 -141260 -195197 -25452 -170579 -17686 -96445 43254
8428 121643 88321 181843 -139496 16831 95468 163130 20728 -119569 -110393 73250 109837
8417 109837 144704 -41045 -374223 149033 48524 111427 -235865 75640 -413873 37355 -13218
8405 -290829 265102 -114385 -195370 -304350 -98078 -27619 345892 -59725 107493 305865
8395 305865 -90974 -453500 -64526 47519 -435119 -76108 217673 47006 17226 197414 55037
8383 -375630 -217296 72507 -323379 104733 142580 -287346 113080 30019 69990 -60493 -258272
8372 -258272 9669 -77842 -278155 -26760 101691 49039 -56711 -30292 -195204 87490 -182089
8360 25181 32025 -282652 71839 139545 226246 67507 132578 -16193 1850 247168 -154751 258992
8347 -66592 -130077 -268081 45419 -74683 44897 146661 45365 -161260 -243586 -125087 4880
8335 -16770 -185563 -228369 -21763 169179 -178228 53901 286647 -138321 311116 -3281 40078
8323 170270 -199765 -277421 -320661 279758 123775 39798 -219065 189768 44755 54258 156757
8312 156757 -38234 267842 -273407 -68795 -78672 -261109 -230923 -309459 7975 -42933 -81128
8301 -81128 -11324 -44965 583178 -7524 -106424 118634 -163428 225672 -21411 126625 -319668
8289 -150311 -70833 -110140 -123980 -81401 370050 -358711 -52217 -163652 -230462 380831 150365
8277 144241 23296 11817 -172255 -201883 -43341 -71955 -10082 -145247 7834 -180740 -118659
8266 -118659 -367662 -208847 40540 -445035 374238 -88945 -129527 -194048 3838 76011 26161
8254 -126385 -4897 -11594 -30694 122932 -104333 78104 221270 -340092 110442 -260727 -219796
8243 -219796 -381244 -176710 -70474 -237943 12734 -157699 41491 -183406 -337351 111891
8232 56964 -73809 -149823 -137161 -162997 -18230 -50996 -156351 -217231 -104031 -137773 60517
8220 160737 -236309 105369 -94365 -376868 -58937 -96201 -98170 106772 -173218 -242924 25929
8208 -194025 -195317 -98394 13445 -112903 43821 39924 92833 -11380 202137 -8722 54049 179221
8196 179221 377634 -95736 -183720 -205624 169280 -88974 -107002 39201 -39023 -290973 342055
8184 24018 -118037 -10117 415592 89633 -246061 -76116 -79440 -340324 -46965 60814 62101
8173 62101 51379 77206 -256897 41189 32081 -333851 -25181 28324 -131447 78319 -231401
8161 -12409 43320 -30150 -13018 -245427 -329548 357946 -364626 -216083 113800 -287010 -119706
8149 -9511 215202 73965 41394 -213295 -97561 -28520 16011 -71434 -151188 -115099 260679
8137 -108601 35045 84027 -119832 92549 221151 -357775 219929 115018 -20882 262033
8126 -145955 -148910 105477 59696 -95833 -23950 -225083 136833 53148 -65881 127340 -72150
8114 -185616 -209008 -110637 112239 109998 -76393 153574 -263395 -8830 2940 127817 -209716
8102 -107578 -113597 -59495 -133743 67897 139864 -309743 92187 127911 -196579 -106136 159458
8090 312994 -255084 -75788 -25920 -172655 -59858 -36380 -186741 97525 -374463 -122210 -173832
8079 -173832 -93913 -116317 177197 121768 62456 -152008 84497 46269 53804 -104426 96732
8067 -128260 -64487 130133 -29112 -299479 115818 138763 27640 -3614 94794 2528 176819
8056 176819 -114449 240709 -84467 -536 141910 -133144 310371 -386147 -183972 266443
8045 -436431 163596 118734 -135219 237977 -299079 -5146 -68244 129181 -36925 -149451 12544
8033 -115256 95439 -40082 148708 -84093 1983 -298837 159315 140838 58320 334397 -73676
8021 216611 61068 -327038 -183437 36615 -85400 -27593 171745 -265987 -369335 73084 -165936
8009 -309665 -410099 10935 20713 -307309 36363 138014 -11355 -32439 -77629 143537 -42453
7997 -611535 -70482 121761 45137 -289647 124601 -32897 90863 -8402 22437 169268 -257029
7985 453373 -300645 114191 79306 -126782 -122043 -97584 48002 -35504 -100370 -78585 -283880
7974 -283880 -165708 104395 153880 -132490 290315 -11308 -54791 -163968 280213 -56429
7963 -78965 -197051 -224815 20610 229704 -201429 -282232 121093 146273 -88005 255163 -120746
7951 -126565 136308 -175461 -94624 -391800 236130 161973 -2955 52536 -144634 -113966 178895
7939 455821 150840 249415 207920 176892 258079 -216376 44095 -71945 -55406 -278426 -170350
7928 -170350 -63692 290452 -41009 -62790 -12157 -86850 -318751 32667 -409324 -70857 -493518
7917 -493518 -86060 -57259 -196060 66845 286470 266910 66698 -248688 -164200 -11381 -282787
7906 -282787 131508 73357 -2729 236116 103664 -23180 -158106 61484 -221109 -339869 97487
7894 -12862 -54337 103696 154484 -17406 189447 -143888 -304719 7484 -309068 -48563 -149543
7883 -149543 210451 -17257 48981 -279703 -309068 -21266 -577 226331 200556 90152 -284362
7871 3408 -200114 -124035 -352949 84752 -257078 -33819 -92295 76052 -170549 380606 7583
7859 -293453 -72554 -48550 -60276 -132854 -165817 -336642 -10265 -32314 -74104 144133 -78120
7847 14975 73628 -107191 -237117 -89086 -33811 -236706 -306544 86432 -93018 -41284 -224768
7836 -224768 -166243 3438 113081 -77767 -216444 -72401 -112187 273285 -313543 -44535 -58379
7825 -58379 17919 -238545 201949 -146014 -138944 53851 167582 -128396 -36600 -38245 -43656
7814 -43656 -42924 -106489 151381 18201 -350577 -215490 -205439 297724 -239435 -181165 204199
7802 90782 168401 -133656 69955 -69069 57252 79763 -233780 178090 -129337 33274 200365
7791 200365 -281993 -81142 -136052 -155241 308985 123661 15074 120829 -113791 -253505
7781 -253505 -95766 -24591 240521 -47866 -217211 -41339 -281720 49922 -59970 92626 -105589
7769 190272 237948 121664 135936 -102457 -92375 2924 206510 345343 170365 147706 90023
7758 90023 -102991 -403058 -15726 -64482 38148 144470 -72916 -75021 221408 -69299 -68813 -274650
7746 -274650 -136157 -267554 -52066 -86211 -179887 4895 16338 -134343 -230904 -300830 186405
7734 8314 -221910 -181713 -203511 215556 -54640 -76637 -253201 260002 -231585 123736 160592
7723 160592 -23978 84984 -167234 -25107 -36573 -94221 68865 -220937 -59446 -49256 -80061
7712 -80061 94556 -160984 134605 150294 37729 -249103 -61187 27873 -86308 -330130 -189644
7701 -189644 -87137 -218268 51864 -22939 -206524 -107262 302117 -168097 193204 -89136 -378243
7690 -378243 470877 25434 -102474 -125318 -427651 -81333 21250 -95820 -118669 -15899 -228044
7679 -228044 -209595 -221132 156162 121895 -241598 18378 106211 -115847 -28955 -140918 -192830
7668 -192830 102455 -29071 -26099 -145483 -200049 28932 8324 -302216 3993 21736 20594 53889
7656 53889 124641 86104 -71397 -130730 32629 335303 -188161 -309956 341173 -17401 -315135
7645 -315135 90469 145470 -69589 -127008 37809 30200 -230769 57754 50279 -247502 -166214 65695
7632 -143300 62309 -243179 230591 -39052 -12316 59380 -4724 222276 -347430 65825 -295038
7620 125134 -47486 292324 -16307 -77143 178585 373359 -216794 -28676 -305162 266501
7609 133364 -29271 12970 -152212 70344 -26311 -58137 30479 173334 -145656 -18577 -8428
7597 -119061 310413 -23472 149399 54801 -21986 161582 -136081 -144124 -325735 10180 11359
7586 11359 -203282 -58973 -102444 -239763 -125226 -152846 66397 -29134 111521 -32891 270375
7574 -273915 69055 -140960 363 8764 -150875 -262077 -62079 -199421 -13635 110398 104960
7563 104960 -68560 -220420 -28351 -127951 -18905 2348 -51171 149149 134239 -234525 23208
7551 -35994 -84084 -399387 -83863 -116558 -31704 -233780 -96538 254703 -109223 -52005 126189
7539 -323958 37740 3016 -247066 -207436 -165504 -105893 -232067 -209576 206752 79045 169948
7528 169948 268220 125974 -21970 -622113 -203012 -11247 -185455 -31848 -123736 194879 19850
7516 114094 7233 -78053 128466 40569 231574 -160116 -216065 -86652 -58213 54981 -192786
7504 112667 154922 -43885 -154797 -185000 21416 -300413 112607 130091 147108 -72178 -210598
7493 -210598 88698 -100130 -318323 -473984 -104250 -119591 26390 96961 -108350 -244177
7483 -244177 -359810 -305097 -136079 -86852 204983 129843 -45581 -202827 -353030 -202674
7473 -202674 -162248 8474 -50041 145190 -181754 -85327 282064 -99477 -178172 -33636 -51417
7462 -51417 -191841 8215 -260779 83489 -254652 65707 50609 -13532 -181575 -204953 160589
7450 -36065 171835 -63493 -31793 -31853 370868 -218779 -263105 43690 -282347 59548 -182653
7438 40797 -58347 -183475 65194 -205785 102363 159721 -170671 -99748 -382988 110606 -128545
7426 -19458 92824 80943 96537 168299 36835 -177925 -95055 188817 -40597 -14134 -132928
7415 -132928 -466445 86196 -95837 6159 -82991 -306979 -195174 -9261 -59374 -145555 62302
7403 -46420 216860 189869 -90446 -94249 -259643 55737 27754 -131427 114858 -34660 124512
7391 -282670 110762 -264815 -14633 -2764 -48564 15693 323639 148916 155635 -296858 41717
7379 126394 254493 29245 -221991 33260 -67863 110177 27273 120880 -40958 -112814 -177395
7368 -177395 -165446 664 -121082 -9791 -102786 -262516 100491 180025 -128436 -264091 -29881
7356 -168064 228795 -66184 -224081 188547 153500 129113 -19205 -17262 115730 3002 -148140
7344 -279453 32330 -50564 349505 109365 176548 107807 -61443 -152975 26179 58655 115026
7333 115026 32636 -15766 -97119 261912 -194068 360255 84565 -50205 -195722 179741 -82788
7321 -215350 -135313 -125224 -294779 31276 139010 230745 -44542 -70416 -12851 38004 118311
7310 118311 31167 -295470 -83035 15497 -97604 13754 -269423 -107354 -199931 -139876 -102420
7299 -102420 86774 95443 86227 -129625 -124633 40564 183714 -242801 40666 -118767 -227788
7288 -227788 -121702 -112554 85984 -81156 -355988 40067 -39346 82012 1409 -250070 77220
7276 85391 172337 -80509 32446 -209155 -186040 -228809 -184027 -263914 49130 6597 -136065 44911
7263 -131933 -300321 -92487 2225 -97849 -123646 -26797 137596 -93719 179194 280912 14907
7251 -109525 326586 20384 -228453 -178561 -14985 89517 -78941 10718 -126948 54824 -8753
7239 144268 -1133 19598 7442 72889 -200833 81329 109907 -343095 -191391 4600 38606 -96077
7226 150165 -47318 268435 -208654 -31546 7273 184638 -358302 103691 171428 -86488 -296976
7215 -296976 -143183 -294327 277531 -140314 432889 56748 -40462 -94098 84776 223470
7205 223470 -290292 -330450 77278 -142782 27306 69810 -245150 -281427 -228260 333385 -19761
7193 -90100 -191089 -206625 231607 -82092 -138905 80472 64868 26722 39305 -168300 -205291
7182 -205291 -89944 -149194 79367 -46024 220406 17431 -110890 -160180 -110897 -25902 -176625
7171 -176625 -217567 243215 -174594 -396140 -44894 -207029 266420 261856 169121 -193181 -60804
7159 -111555 -158826 -138042 127976 68604 -176901 185975 -262487 -212000 -111483 -179703 -271579
7148 -271579 347414 67014 82516 34929 176078 126950 129716 -49777 67030 406484 -64270
7136 -212294 133981 -44077 32694 -172010 -71158 -213750 99060 29214 411283 132211 93215
7125 93215 29191 -127142 338646 157320 194676 5032 70188 -64986 135950 -218816 -17690
7113 6628 -94055 -329627 378 -88467 -161147 322415 -53607 -83435 198975 -194014 -71859 69882
7100 17393 -34474 -53989 255091 -216737 -70481 -72726 46185 148772 75978 125264 -5359 -227016
7088 -227016 330323 206807 108309 76283 20011 -118771 -194728 -179571 23136 -343803 -49986
7076 116251 -128398 -51074 -327675 -133036 -174706 421848 -259338 129172 -40867 -107601
7066 -107601 -89637 137459 6311 90888 44090 -416815 -90914 -278751 57865 110386 21032
7054 -90946 -218861 94003 -146095 -320083 -242380 203202 94185 -91390 109512 -170674 -112359
7043 -112359 176781 -69360 163533 -144728 -308647 -65369 -151188 328118 -217187 31319
7032 105615 57492 79380 -136142 215569 89909 -142016 -141045 47877 -20672 -277704 -104585
7020 -78232 54295 -57795 -120861 -45285 3025 24080 -175864 62898 44409 -194995 149038
7008 -77929 163287 -290401 41160 79987 46986 13875 644454 -5758 89927 261676 -164378
6996 -59046 103504 94048 78472 108453 299073 82314 -276905 73842 -3972 273571 61716
6984 171188 -246297 -483565 -9861 -58940 7887 -112516 181732 97693 -156387 194490 -222510
6972 -29022 -198474 -320564 -101030 67983 -24057 272919 6562 -423592 276137 84745 59759
6961 59759 -47263 125049 -486656 84285 44272 172603 -76937 40158 -189840 -126759 -883
6949 80277 6812 -72430 306353 -223966 289306 16432 -163553 58434 -310930 -11718 177195
6937 -90665 5850 -38317 147472 97865 -198912 -39670 67912 -130657 29719 -136509 248996
6925 257901 35242 29721 134542 325037 24700 -347004 130678 -345071 -17212 -138948 126114
6913 -176313 93062 -116509 261514 14339 -148362 -96786 162288 324353 -100759 100754
6902 24493 -33742 356314 65200 -375469 -105651 19071 83894 -80101 -336140 -302608 128915
6890 113170 -175945 168800 -96302 94654 -58773 58175 119345 -21180 352989 3320 -327126
6878 -89161 17367 -104130 -131813 -212167 -39931 -104072 -182486 -176833 55286 117614 180941 -301897
6865 -132324 -342722 4902 -110238 150173 -103467 315271 -1931 225406 28418 33779 126666
6854 126666 -131976 1893 42254 -43262 -40884 -228021 -147690 101867 20749 -342954 -263116
6843 -263116 218837 103171 101968 146560 232315 -204114 -91132 103763 244362 132778 -36909
6831 3708 -281537 -101949 -136006 135328 -237515 1318 142106 24161 -259582 141869 110302
6820 110302 155921 -163304 125132 -84221 -58659 228356 123621 -181566 122086 -273086
6809 43986 -130432 -11677 8171 110532 -30988 -120946 99686 178651 42712 -126627 168778
6797 6565 41507 -366340 2297 -76237 170016 174630 -4843 105297 -285776 -68410 -232831 142093
6784 123233 -46727 -282971 -19138 57681 142436 9569 -214037 -14844 -60652 129395 -57694
6772 -33283 -93966 158733 21077 74479 24318 256785 81797 -167397 101464 -389853 -148099
6760 -78143 -153148 -113526 -389382 -76555 -93644 217199 34309 36907 178161 -127102 30926
6748 180732 73786 31589 -72879 -285954 -239052 -7461 -116029 124546 -10761 -82737 -21918
6736 -132835 -81173 -227470 -243742 208879 272706 155013 -11247 139961 -145194 98595 -33299
6724 -29675 43764 -111735 57535 8695 256675 195118 -315592 -4536 16534 -207920 -86331
6712 -194729 74304 168017 264094 -291679 -5612 -65175 84358 -9587 -263613 -135552 169722
6700 -59094 -182702 -198896 10919 -32214 88955 -19974 -77858 -61236 128535 -199207 -86521
6688 131504 168501 129608 41768 63737 -131565 18658 57902 -205 11932 -22538 -77638 -56959
6676 -56959 28700 -128587 -51409 -133618 -89288 147437 -262201 -256079 -159520 -186400 -52537
6664 -78774 2086 -47957 148529 -10900 -17348 39407 171803 -161100 153970 49461 -228075
6652 239893 263205 -9710 119676 139201 -81121 360539 -314512 -157208 -255125 200073 -77861
6640 94167 84098 -8150 -284912 -41159 -219480 124730 132913 -76152 -10713 66532 -43846 -166432
6628 -166432 -156169 225317 -51840 -132120 65576 -387748 38272 149084 -112556 97668 230331
6617 230331 -12559 108739 374759 -29512 -137678 32887 101281 271292 84699 68430 161596
6606 161596 39900 -69420 235346 56051 -177936 -25925 -53726 104764 127681 -73358 -28415
6594 -225952 173436 16323 -148632 63875 110103 47215 30570 -134847 -23434 -116580 151352
6582 -39134 -40529 -60166 -6540 -144104 -90092 287136 -42263 132496 108438 214308 -79547
6570 -200594 101798 -4668 -117596 8570 -160088 363933 63870 -195944 176962 -31270 -71452
6559 -71452 -99320 -126151 -41878 -80912 -155952 30929 -51362 -371162 252309 10249 -5593 39707
6546 142083 21486 -304165 -140919 -84839 108889 107715 -92527 40070 11225 -15798 138686
6534 -138955 203330 246295 -15673 -453151 44639 -329063 160733 26223 153408 -281669
6523 372632 63563 -63414 65574 -31945 153505 -124881 132155 -33603 393002 73883 -122697
6511 319613 116668 -107701 -233206 -463773 63166 -183404 211636 66260 -277090 24108
6500 61089 -132820 -391129 64445 8064 -170462 67334 -179130 146476 -5242 -7529 63204
6488 177887 -372935 -230417 -330688 29075 -49119 -474715 275825 69228 -238822 388928
6477 -414298 -357247 162594 -139403 -11001 115588 83700 -106610 -105411 109468 -150772 10238
6465 267006 16890 322617 12522 47931 301706 -212798 -121014 169284 111706 -296455 75409
6453 113652 289282 -46742 341714 -178080 56588 360274 228687 -11022 -321481 -295838
6443 -295838 88196 6332 -230716 41992 114927 -68375 -259607 -179704 -202576 31517 41869
6432 41869 -23376 8005 -134351 -165794 -22720 -302595 77949 -187759 63190 -235483 177801
6420 -28743 229644 -102836 226800 -32708 323949 -88268 -140697 -239179 154643 -249120 66680
6408 332606 82530 175547 190160 -182793 31474 158270 204495 -84290 114580 5355 -215345
6396 385336 -11368 -4862 -213961 80958 59286 98146 9919 -450722 21620 229326 -229313
6384 -160927 -227515 20359 -389715 -61035 -40920 -341060 168853 -337666 338014 -163727
6373 -256675 197375 -119987 224201 180658 -180758 104179 126496 22514 -151616 -424166
6363 -424166 -6394 -243821 75730 -146189 -388070 -120813 -233110 99113 106670 -74848 -185086
6352 -185086 -67212 -219819 366417 95711 51951 -73990 6907 -123935 -169578 -92086 104323
6340 120766 -20363 201113 -228445 -25543 -92660 -90839 -11413 4679 25293 -135488 -29022
6328 233975 47884 -211250 -107021 -83556 -283134 -15612 111781 208555 241589 -92331 55796
6316 33648 30935 100659 -14826 229895 102455 -80037 -64178 31098 -214146 -163644 82970
6304 -306459 -150861 31968 279961 -121146 -156482 177168 -56542 -174451 -130451 54339 -178455
6292 -27030 114216 391921 76481 150957 84366 -173850 -117710 156756 -302860 243229 289685
6281 289685 87706 -281030 111726 64773 -149163 150585 238617 129185 211666 -46056 -44212
6270 -44212 -65101 205480 -6744 103597 32413 358274 214126 200778 111518 -185114 -49152
6258 -213791 146741 49531 -41091 -112624 -23221 128607 20307 33634 46697 204059 123782
6247 123782 -215538 -250215 -13051 -9410 220894 400628 -54804 -16812 -326960 84688 -177508
6235 -168987 176044 -415534 53161 -74464 -112230 -284151 -200220 70427 105206 181348 144732
6224 144732 60502 -44953 -246747 -53719 -126682 211827 -62911 -222646 -103969 -134070 91506
6212 -75193 140809 230366 -183449 40492 113813 -277639 -393525 -148658 193781 197140 -268369
6200 -199035 195763 89851 -145383 271075 232105 -50338 -245023 86600 -263846 89562 62053
6189 62053 -162722 139291 -276521 114710 -142315 386514 159960 71023 -21466 118172
6178 -19239 -83686 214998 -347583 -3336 39046 -16683 -32785 -209583 -66370 17983 35565
6167 35565 -117017 -120327 -200368 225228 -308434 -35755 4482 148643 -311473 5672 -258965
6155 -93419 283408 83713 164172 239776 -23483 189153 27209 -80197 -198386 293875 -24707
6143 -63833 86325 414080 132420 -42536 78316 75208 -236262 57673 -125518 114841 58695
6132 58695 10679 231527 -266307 98187 272922 15119 52591 -373015 -62531 -92898 105422
6120 183898 -306194 -302249 -61807 -95191 160785 -150876 -380382 -422230 -118179 156870 147287
6109 147287 -76090 -122654 30972 -192810 -14104 -52903 -81041 222669 9463 -85651 121106
6097 41843 -285726 73390 -438161 -5722 144828 171740 155892 91858 -82761 182777 469673
6086 469673 58602 250281 -238318 102056 -88994 94752 -47348 -174861 21910 49959 75979
6075 75979 -215168 320743 -55759 61592 86464 106802 288093 -23543 -486378 -453579 -80440
6063 55620 -28766 -248647 -21508 -14977 45142 127205 -45336 141244 -1105 106456 -264703
6051 -142596 -162616 -233199 121242 -579095 98596 -359952 -100345 207149 199432 178069 -159900
6039 72325 100307 165097 22266 -110108 67 -56383 126268 266834 -5445 81477 155819 -156617
6026 -73646 -23555 -163664 259184 -99416 47281 -229845 223001 -20722 -17317 -85853 -124983
6015 -124983 -317094 -75581 -278201 210414 -252287 -310734 14377 -157777 161417 -4365 98325
6003 -89653 97362 5170 -46003 -345183 -115014 2300 -146128 19804 107265 -1910 -85525 172684
5990 255613 -172129 72719 -15396 -224399 179175 18821 138257 -147761 -128911 70619 133345
5979 133345 202620 76677 83567 -41957 230928 179055 -76239 232640 184364 324749 -94868
5967 204702 -382818 -186728 85647 -248426 -236663 114022 21417 256486 111770 -224187
5956 156623 -23500 184903 148569 111209 -250359 313325 -230177 94804 -143242 174037
5945 34628 105274 16318 31528 39153 170631 131267 134787 273962 52127 -156258 -98268 -267916
5933 -267916 -77666 -96831 194922 -66997 -54296 -167968 250752 -61792 -100271 -221759 -170235
5922 -170235 17387 184385 351560 98401 26814 -86789 -357634 -98045 -124207 -246667 47965
5910 -134447 -33001 -328184 -64914 -195510 -142438 -350805 -97283 -2941 96954 137801 -220887
5898 -78444 10647 -270099 -119528 247022 -415458 244162 445302 -70947 -25226 -36443 25172
5886 49066 -66358 119978 166201 229947 241122 62312 -167202 -110057 -48822 -312089 132225
5874 35416 138801 -331250 -250671 189871 -4744 -46101 -240484 -72481 -157404 87539 -24822
5862 -215388 -154039 60712 -7959 71805 -22608 -232473 185008 59400 48260 -62859 -28687
5850 721 -32171 -16959 197122 -137092 25800 -60906 -83184 221840 51917 -228628 102306
5838 70031 -126460 29527 37568 34456 103379 -436106 -79825 42664 19764 -68368 61865 121853
5826 121853 148233 -107060 142865 31842 -406893 129003 -5874 114971 -116223 -127342 -124031
5815 -124031 304674 71059 -9425 -40696 281423 198627 72658 124953 45944 46622 -237259 -13188
5802 121532 -88399 -163861 98844 188824 229564 -13129 -56852 -90978 -86387 -418021 140673
5790 332183 70746 -10208 138748 217208 -12140 95617 98083 91149 202637 112254 240220
5779 240220 -97775 298009 12477 63528 90630 110220 -86905 -441990 34435 -32497 119338
5767 -36519 124468 -118293 -11661 1320 -122956 -147239 -36649 227288 374760 -303648 79648
5755 -57049 121649 23790 73081 -81250 -23427 -153770 -284863 84169 96394 -62739 -177296
5744 -177296 135926 -13673 -110583 -66992 166644 160425 -34397 -85087 204642 32974 165694
5733 165694 51457 274285 241791 3482 -50375 71656 -28637 107777 76604 250008 339706
5722 339706 -128237 -137329 -243486 -182942 -84650 -112435 77159 -232116 62344 -284804 -379768
5711 -379768 360971 -11967 65039 -104122 77746 -74045 -157499 -7916 8501 -134563 -15738
5699 -33196 -34962 -237416 96491 69134 -79446 155414 -96665 16593 178210 193766 -130029
5687 -141761 128525 10297 9656 -269116 136276 -140521 39849 -1995 177112 -215956 72831
5675 -32627 125706 -191503 -39592 -30881 -125887 -160601 38536 82356 -140962 -46060 -60997
5664 -60997 61796 -241490 45533 -48480 -52258 -273334 226078 140854 100911 51150 445 -69888
5651 -64782 232727 -44384 328664 -113084 -103995 307760 -134409 -176671 -107587 275977 -62453
5639 93615 -38967 190365 91751 -237405 -35019 27801 32495 119132 -48843 -110767 61507 -121956
5626 -14857 193208 -97251 -48417 -196469 -195511 -230579 -177728 96838 183242 -231295 254541
5614 -258047 283563 -209398 -108899 -231373 66017 188925 -30038 -60690 -39461 -28725 2075
5602 -275985 -205217 -293491 -432238 -164113 28074 -231555 -258160 298860 -411873 -249493
5592 -249493 -368601 153848 23593 -41789 235411 -205197 38581 -184566 -109090 40949 -64890
5580 -229833 43082 -175763 -142525 149026 -198577 -32382 -57769 -406786 142583 -160470
5569 -76218 13002 149573 -253297 112825 31444 -22091 -477724 -4319 167413 135280 -288720
5557 138551 2748 149978 119760 -41165 283853 209131 -49267 -205752 130024 92131 -312972
5545 51101 14171 349619 49284 182469 34713 54932 8938 -66721 117557 140695 38755
5533 43096 233499 25818 -45140 -28671 41348 142775 -24019 81528 -53341 85935 352065
5522 352065 -27858 -77148 209406 48874 -11818 334692 231008 -70922 57801 309369 258328
5511 258328 81528 243976 86958 137971 35315 -311643 13676 77786 -149129 -172605 83123
5499 66110 -264595 -136305 109679 -172555 398598 226872 -87865 -104563 67078 175695
5489 175695 346185 42986 -178874 81122 84171 117516 -9644 -123577 5761 78457 -213693
5477 -109945 700 135994 543101 168461 31336 -84464 269674 -219784 88532 62059 473292
5466 473292 -122421 4239 -26248 61669 78859 19189 -19042 4358 -95388 -56455 -107014 -160189
5454 -160189 -100209 -39536 50232 142538 133199 -10743 44853 -109024 126510 -38314 169639
5442 -23389 -179879 119275 -94281 75892 -32113 222541 123928 131276 -224923 -102208 87462
5430 3140 -349234 196431 204330 -238510 -18703 44253 11429 -122346 -428148 15995 75862
5419 75862 -119302 -30408 97583 -164833 225084 107961 291816 145630 33983 14857 -180137
5407 -239388 155213 -125279 27211 17621 284628 261108 -115493 -253072 -45426 285709 -146104
5395 -45901 -65437 134900 -113265 -125550 -18001 -12785 68319 58339 49341 -135420 -443351 9404
5382 132062 -131786 85293 52287 104912 -61805 159837 -34315 -104689 28106 276086 -13914
5370 -55285 62993 -54663 106167 -130775 -208184 -194909 -339741 -255279 -16685 328651 143179
5358 150012 869 -231810 37048 292018 -152763 -9892 -34558 83822 173260 120307 -118390
5346 187128 230695 -1900 -145171 -220997 -53195 -129676 -138664 -253695 98855 39543 4508 -478363
5333 -30263 -297593 158070 -76580 -190043 299533 53394 130037 -275117 -160462 26826 41314
5322 41314 -103485 52635 -6650 -105522 118216 -85990 105928 102067 -106892 59007 -24418
5310 8760 -269695 -183699 123617 -82873 -21725 224345 -74104 134107 -297460 -145713 473689
5298 131993 -88331 -203531 -180729 62285 -247564 16046 568122 -228984 -189237 180219 -15570
5286 293659 51944 23555 192451 289709 273519 114868 -119192 -237577 63677 -127923 5749
5274 -38379 176947 -31668 -83421 47276 154295 101807 -44248 36523 136993 350701 -126217
5262 38132 -80603 218063 135124 -47029 82167 -17803 124014 -219315 -442643 -99712 215824
5250 -74393 106600 163121 -577687 29976 29728 -222341 -123571 261325 122532 365007 -57993
5238 372212 -35753 18682 99457 51167 -35559 -81237 377669 -96559 -132551 -303166 255191
5226 363566 -277704 88620 -226481 32494 15440 -74721 43752 157691 82702 -67717 -22828
5214 58756 150831 71763 960 234536 110149 -174662 -32217 79911 -307621 -165815 220365
5202 153095 251742 -115085 -16186 242700 145620 135703 95402 -99538 -111736 -87167 118081
5190 68439 -294807 -201461 -153934 94175 -336813 31351 -70074 127123 -230480 -180682 192119
5178 -56233 -34262 -423513 150038 290579 6768 -8270 249822 207286 -207237 169257 88647
5167 88647 244057 -188944 -211921 -128299 14101 -175075 93431 54709 -88910 58361 307458
5156 307458 -274085 50172 -233300 68839 69234 25851 -57895 62417 145587 48764 -120831
5144 -33546 -23554 48458 -393708 69028 -65910 170652 73034 153485 39431 258749 -31213
5132 -65132 -10565 -85855 -147626 1524 344960 153214 -395794 225778 -23035 166043 21650
5120 -148316 -107789 137168 189046 73546 168363 -24238 23179 24932 233475 -94382 -49014
5109 -49014 -87861 168564 -430243 10317 -153501 235579 -10529 20817 -62234 49820 -330340
5097 319571 -6554 307024 31090 -152348 -301068 364571 -43755 794 -93329 -90263 -32867 -378132
5085 -378132 7773 -76999 -129654 75884 -310485 127678 -96447 80625 -119935 -101254 -227953
5074 -227953 -76988 273780 228991 -44773 101551 150617 -2006 -79115 53454 64526 -202788
5062 -214896 106488 73137 37068 121558 305050 -295057 -32321 -27430 -459517 -106792 43540
5050 122866 -24405 451261 -254478 74791 149412 -335857 109493 200305 -210066 373306
5039 127012 121034 213119 53642 71357 85381 103115 -270138 10618 -359010 128689 -220050
5027 -224034 -217794 138882 346235 2594 34360 117567 -140457 -378668 -69452 58858 254961
5016 254961 -83945 -143320 -59833 197277 52013 113492 -143215 -65459 -128686 4058 -95003
5004 -102940 -82854 61258 -182675 -142458 187326 -100080 94974 126684 -45399 -26325 -10318
4992 -65121 79781 42937 -64192 -54138 105807 -36177 -241682 -88935 14733 -177540 102317
4980 23030 79980 264669 138853 41112 -7101 132296 -97687 111556 -84366 -172140 142248
4968 6941 -150718 -131161 -164735 13844 151654 -53360 155192 261346 17082 368049 -283202
4956 -106288 -368482 -28424 -202571 -12253 73466 -110795 9565 102591 377990 -280214 26325
4944 479981 -227663 109425 143527 208904 140339 -149133 18140 -90618 123326 -41980 1998
4932 18133 -61695 32303 -125779 104782 -17879 -419824 -180936 -149244 -35897 -324409 84004
4920 51380 -164028 120513 248129 -145391 -81885 -233 53687 -30828 -206445 -313935 361274
4908 -152100 -95706 -71299 -15189 195952 84568 -44171 34025 344446 77637 106668 3714
4896 -250620 -57612 -73963 77868 -241530 -102583 40273 -20929 180866 266804 100740 -62021
4884 25016 -43127 -3177 -31978 -17184 -194403 215347 67357 96086 -378368 -121953 224810
4872 291146 -33907 149386 11680 -63083 307408 140657 117088 91376 324962 129966 -258460
4860 -111905 137328 45569 275966 -162930 49119 197625 26959 -35123 121827 324086
4850 324086 126137 158112 -306689 -118070 -49285 -93384 229583 112506 -124153 -78046
4840 -78046 238200 5784 -62884 216607 64932 100434 88746 -4664 -232570 69596 87211 -238160
4827 292547 196653 -46426 -31609 30489 -291610 200260 -214725 -59390 74803 -77042 136688
4815 -77860 99957 -224903 355119 383097 -111069 162612 52831 -131381 103486 346040
4805 346040 74112 -27851 -231628 -315462 156558 126668 216577 23913 -302659 -259508 -49288
4793 -214548 108232 67854 -25963 36516 -64249 -77706 188478 184876 -87637 209826 286690
4782 286690 -29502 -181027 104116 169976 127412 27556 -326556 -237195 -119291 -1811 -188046
4771 -188046 -156551 -161089 -8175 -77876 -209855 -158837 86449 -473592 -220207 -1228 96690 -50236
4758 216868 154012 -11358 41114 -118285 41412 582264 -106244 63934 95989 88748 131900
4747 131900 -157940 -100477 6678 -64535 -33205 212887 83337 -221970 13955 -302994 -34519
4735 65714 89474 -7539 -198011 -102039 113194 -85414 133234 350548 -42913 46619 -151256
4723 195660 -84722 174690 9492 -73516 63954 164303 -28290 121684 -22401 340427 -63471
4711 -201222 -21781 -107658 145273 194448 63424 89890 1195 -67322 87803 86306 119326 -82450
4698 -20012 140455 140875 -35352 86709 115654 -94444 156274 225662 -301096 311986 -100070
4686 144630 -129878 -11382 190497 60420 -191869 -169285 -169737 87426 -156709 -66590 29565
4674 -144755 -133898 111812 89876 -264877 -77238 -79988 389395 382653 152001 -64736 -233403
4663 -233403 -79031 207826 -151566 -29227 90428 -28957 -190439 73197 66817 82124 -210427
4651 133276 424921 -29167 -11340 -85342 92461 16224 -19112 137020 -333315 307974 -170521
4639 29072 -31111 -213908 -47394 -59007 6384 -195824 253168 -116351 30745 253638 -570935
4627 838 117110 250727 -243940 -189443 -154297 -101524 125297 -55750 74183 -98715 60690
4615 -314902 -237281 -174655 -205244 177717 284327 73665 124098 -38351 116366 114872 49219
4603 8968 -111109 -59642 140154 147058 -13057 -45010 181103 76256 -11379 114045 85984
4592 85984 -197727 18306 285717 273166 85788 37917 -154247 146182 93629 212885 -169274
4580 132033 -2569 -40747 108233 57567 83169 75448 -61869 -24437 -402107 -324738 -239748 292212
4567 142750 -211624 -129412 128171 -58726 -12811 64874 -76457 338353 52257 -333374 2001
4555 76362 -82402 -212514 89404 234074 295217 -270693 13154 101341 -113363 -89615 205417
4543 81813 -312508 -283459 -114500 -79632 84010 -89420 -34166 -85947 -83533 135799 95592
4532 95592 -144534 95626 343690 161913 89210 -56388 340387 44092 200265 -127587 267017
4520 -131800 -43043 -121336 -177961 149882 -163660 -10625 351345 115422 -166497 54788 356121
4509 356121 159984 56878 34162 274594 -257601 145624 43235 -37246 -45942 -168396 -206323
4498 -206323 48062 -174788 -127996 -331005 -243292 182194 57262 -68930 -63066 -5393 -178918
4487 -178918 16724 -25827 46671 236606 85774 -198303 -57847 94523 54033 -435814 74252
4475 103462 -139059 -193244 247880 242967 -42677 -212628 -144069 -161665 -50568 110789 -24039
4463 -60771 112289 -168560 58472 72049 8337 -161750 -33722 356308 -21836 -197945 -169757
$$ [...]
##END NTUPLES=NMR SPECTRUM
##END=
