##TITLE=AC1746_SEN00019_9280867_xYDTJdXImu
##JCAMPDX= 6.0         $$ Bruker NMR JCAMP-DX V2.0
##DATA TYPE= NMR SPECTRUM
##DATA CLASS= NTUPLES
##ORIGIN= BRUKER
##OWNER= Administrator
$$ 1.72 TOPSPIN		Version 2.1
$$ 2015-07-18 00:08:15.650 -0700  Administrator@X
$$ Compression mode = diff/dup
##.OBSERVE FREQUENCY= 400.02188249412
##.OBSERVE NUCLEUS= ^1H
##.ACQUISITION MODE= SIMULTANEOUS (DQD)
##.ACQUISITION SCHEME= undefined
##.AVERAGES= 64
##.DIGITISER RES= 22
##SPECTROMETER/DATA SYSTEM= spect
##.PULSE SEQUENCE= noesygpps1d.comp
##.SOLVENT NAME= COFFEE_meoh
##.SHIFT REFERENCE= INTERNAL, COFFEE_meoh, 1, 14.96113
##AUDIT TRAIL= $$ (NUMBER, WHEN, WHO, WHERE, PROCESS, VERSION, WHAT)
$$ ##TITLE= Audit trail, TOPSPIN		Version 2.1
$$ ##JCAMPDX= 5.01
$$ ##ORIGIN= Bruker BioSpin GmbH
$$ ##OWNER= Administrator
$$ $$ E:\/data/COFFEE/nmr/AC1746_SEN00019_9280867_xYDTJdXImu/12/pdata/1/auditp.txt
$$ ##AUDIT TRAIL=  $$ (NUMBER, WHEN, WHO, WHERE, PROCESS, VERSION, WHAT)
(   1,<2015-07-18 00:08:10.213 -0700>,<Administrator>,<X>,<go>,<TOPSPIN 2.1>,
      <created by zg
	started at 2015-07-17 23:56:40.354 -0700,
	POWCHK enabled, PULCHK disabled,
       configuration hash MD5:
       21 0F 79 D6 B3 7B B4 F6 88 20 88 DB 03 48 BD 9F
       data hash MD5: 64K
       D6 07 5A 04 21 F8 59 C9 94 D4 57 E7 51 F7 02 F1>)
(   2,<2015-07-18 00:08:13.729 -0700>,<Administrator>,<X>,<proc1d>,<TOPSPIN 2.1>,
      <Start of raw data processing
       efp LB = 0.3 FT_mod = 6 PKNL = 1 PHC0 = 0 PHC1 = 0 SI = 128K 
       data hash MD5: 128K
       08 37 23 89 2E B4 2D 03 A5 5E 4E 95 EF E3 C4 67>)
(   3,<2015-07-18 00:08:14.697 -0700>,<Administrator>,<X>,<proc1d>,<TOPSPIN 2.1>,
      <pk PHC0 = -89.20349 PHC1 = 0 
       data hash MD5: 128K
       59 47 1B 72 63 23 AD DE D6 A0 B0 D2 D2 E0 8F FB>)
(   4,<2015-07-18 00:08:15.119 -0700>,<Administrator>,<X>,<proc1d>,<TOPSPIN 2.1>,
      <abs ABSG = 1 
       data hash MD5: 128K
       7E 97 3E 4F 3D 4E DD 57 FC BA 72 2E 6A 5E CA EA>)
(   5,<2015-07-18 00:08:15.229 -0700>,<Administrator>,<X>,<proc1d>,<TOPSPIN 2.1>,
      <abs ABSG = 2 
       data hash MD5: 128K
       2B F8 47 BB BD 18 64 E9 7C 1F FD 03 3B 41 DB F2>)
(   6,<2015-07-18 00:08:15.307 -0700>,<Administrator>,<X>,<proc1d>,<TOPSPIN 2.1>,
      <abs ABSG = 3 
       data hash MD5: 128K
       E1 7B 94 49 5D B3 66 DB 50 98 23 11 75 45 DE 16>)
(   7,<2015-07-18 00:08:15.385 -0700>,<Administrator>,<X>,<proc1d>,<TOPSPIN 2.1>,
      <abs ABSG = 4 
       data hash MD5: 128K
       5E E0 68 E4 55 A7 D2 92 04 D5 A4 5C A9 12 18 84>)
(   8,<2015-07-18 00:08:15.479 -0700>,<Administrator>,<X>,<proc1d>,<TOPSPIN 2.1>,
      <abs ABSG = 5 
       data hash MD5: 128K
       36 74 AC 93 69 08 1F 63 4B D3 64 9C CC 90 B3 B7>)
$$ ##END=
$$ 
$$ $$ hash MD5
$$ $$ BF 26 BF A2 22 E7 49 35 BC 40 85 49 95 36 F8 E8
##$RELAX= 
##$RELAX= 
##$RELAX= 
##$RELAX= 
##$RELAX= 
##$RELAX= 
##$RELAX= 
##$RELAX= 
$$ Bruker specific parameters
$$ --------------------------
##$DU= <E:\>
##$EXPNO= 12
$$ [...]
##$TP07= 0
##$TPNAME0= <>
##$TPNAME1= <>
##$TPNAME2= <>
##$TPNAME3= <>
##$TPNAME4= <>
##$TPNAME5= <>
##$TPNAME6= <>
##$TPNAME7= <>
##$TPOAL= (0..7)
0.5 0.5 0.5 0.5 0.5 0.5 0.5 0.5
##$TPOFFS= (0..7)
0 0 0 0 0 0 0 0
##$TUNHIN= 0
##$TUNHOUT= 0
##$TUNXOUT= 0
##$USERA1= <user>
##$USERA2= <user>
##$USERA3= <user>
##$USERA4= <user>
##$USERA5= <user>
##$V9= 5
##$VALIST= <valist>
##$VCLIST= <CCCCCCCCCCCCCCC>
##$VD= 0
##$VDLIST= <DDDDDDDDDDDDDDD>
##$VPLIST= <PPPPPPPPPPPPPPP>
##$VTLIST= <TTTTTTTTTTTTTTT>
##$WBST= 2048
##$WBSW= 25
##$XGAIN= (0..3)
0 0 0 0
##$XL= 0
##$YL= 0
##$YMAX_a= 5712977
##$YMIN_a= -10962828
##$ZGOPTNS= <>
##$ZL1= 120
##$ZL2= 120
##$ZL3= 120
##$ZL4= 120
##$ABSF1= 14.96113
##$ABSF2= -5.597052
##$ABSG= 5
##$ABSL= 3
##$ALPHA= 0
##$AQORDER= 0
##$ASSFAC= 0
##$ASSFACI= 0
##$ASSFACX= 0
##$ASSWID= 0
##$AUNMP= <proc_prof1d_extract.lims>
##$AXLEFT= 0
##$AXNAME= <>
##$AXNUC= <1H>
##$AXRIGHT= 0
##$AXTYPE= 0
##$AXUNIT= <>
##$AZFE= 0.1
##$AZFW= 0.1
##$BCFW= 0
##$BC_mod= 0
##$BYTORDP= 0
##$COROFFS= 0
##$CY= 15
##$DATMOD= 1
##$DC= 0
##$DFILT= <>
##$DTYPP= 0
##$F1P= 0
##$F2P= 0
##$FCOR= 0.5
##$FTSIZE= 131072
##$FT_mod= 6
##$GAMMA= 0
##$GB= 0
##$INTBC= 1
##$INTSCL= 1
##$ISEN= 128
##$LB= 0.3
##$LEV0= 0
##$LPBIN= 0
##$MAXI= 10000
##$MC2= 0
##$MEAN= 0
##$ME_mod= 0
##$MI= 0
##$NCOEF= 0
##$NC_proc= -2
##$NLEV= 6
##$NOISF1= 0
##$NOISF2= 0
##$NSP= 0
##$NTH_PI= 0
##$NZP= 0
##$OFFSET= 14.96113
##$PC= 1
##$PHC0= -89.20349
##$PHC1= 0
##$PH_mod= 1
##$PKNL= yes
##$PPARMOD= 0
##$PPDIAG= 0
##$PPIPTYP= 0
##$PPMPNUM= 2147483647
##$PPRESOL= 1
##$PSCAL= 4
##$PSIGN= 0
##$PYNMP= <proc.py>
##$REVERSE= no
##$SF= 400.020009584776
##$SI= 131072
##$SIGF1= 0
##$SIGF2= 0
##$SINO= 400
##$SIOLD= 131072
##$SPECTYP= <>
##$SREGLST= <1H.CDCl3>
##$SSB= 0
##$STSI= 131072
##$STSR= 0
##$SW_p= 8223.68421052631
##$SYMM= 0
##$S_DEV= 0
##$TDeff= 65536
##$TDoff= 0
##$TI= <>
##$TILT= no
##$TM1= 0
##$TM2= 0
##$TOPLEV= 0
##$USERP1= <user>
##$USERP2= <user>
##$USERP3= <user>
##$USERP4= <user>
##$USERP5= <user>
##$WDW= 1
##$XDIM= 131072
##$YMAX_p= 408304469
##$YMIN_p= -12223
##$CURPLOT= <Network HP LaserJet P1505>
##$CURPRIN= <$Network HP LaserJet P1505>
##$DFORMAT= <normdp>
##$LAYOUT= <+/1D_H.xwp>
##$LFORMAT= <normlp>
##$PFORMAT= <normpl>
##$SURQMSG= 1
$$ End of Bruker specific parameters
$$ ---------------------------------
##NTUPLES= NMR SPECTRUM
##VAR_NAME=  FREQUENCY,     SPECTRUM/REAL,   SPECTRUM/IMAG
##SYMBOL=    X,             R,               I
##VAR_TYPE=  INDEPENDENT,   DEPENDENT,       DEPENDENT
##VAR_FORM=  AFFN,          ASDF,            ASDF
##VAR_DIM=   131072,        131072,          131072
##UNITS=     HZ,            ARBITRARY UNITS, ARBITRARY UNITS
##FACTOR=    0.0627417313425164, 1,          1
##FIRST=     8223.62146879497, 6195,         -48915
##LAST=      0,             7538,            -48179
##MIN=       0,             -12223,          0
##MAX=       8223.62146879497, 408304469,    0
$$ Real data points
##PAGE= N=1
##DATA TABLE= (X++(R..R)), XYDATA
$$ [...]
61720D87912K410K568L321L596K860K025K189L025L239K309R51j05r46j824k500
61705E11030k714k747l018l387l356k751j899j266j246k022l259m171m271l900
61691D71023l679l667l518l196l016l015k863k473k247k559l238l695l427k491
61677D27939j629j654k477l035k600j785j649k152k322j751j010n31k8P42J434
61662D07492J719J740J631J248O95M58N82M57j59o05l61Q9J24R7P25J831K587
61645D20350K698K517K218J696J242J409K090K449J946Q64k56j170j778j976j898
61630D32401j917k216k631l028l448l833l906l478k692j851j223r26q30o18k09
61615C99595L8j93o79j012j255j758k506l108l457l863m454m950n086m872m372
$$ y = [487912, 490322, 492890, 496211, 499807, 502667, 504692, 506881, 509906, 513145, 515454, 516405, 516300, 515354, 513530, 511030, 508316, 505569, 502551, 499164, 495808, 493057, 491158, 489892, 488646, 486624, 483365, 479194, 474923, 471023, 467344, 463677, 460159, 456963, 453947, 450932, 448069, 445596, 443349, 440790, 437552, 433857, 430430, 427939, 426310, 424656, 422179, 419144, 416544, 414759, 413110, 410958, 408636, 406885, 405875, 405344, 405316, 406058, 407492, 409211, 410951, 412582, 413830, 414525, 414983, 415565, 416022, 415863, 415258, 414897, 414986, 415110, 415207, 415932, 417763, 420350, 423048, 425565, 427783, 429479, 430721, 432130, 434220, 436669, 438615, 439479, 439223, 438053, 436275, 434299, 432401, 430484, 428268, 425637, 422609, 419161, 415328, 411422, 407944, 405252, 403401, 402178, 401252, 400422, 399804, 399595, 399633, 399440, 398761, 397749, 396494, 394736, 392230, 389122, 385665, 381802, 377348, 372398, 367312, 362440, 358068]
61600C58068l648k966k617k501k284k056k276k964l467l283k680k251k166k120
61586C20789j792j196p58r77j755k166j465k45N4j002k255k482j858j341j219
61571C00332r70k89M85R31J010R29Q21O99N35M21N62R85J245R36M93Q58K054K778
61553C14815K028N66kO87J505J546J165J119J465J763J833J816J746J505J132
61538C34689Q34P81R80J336J659J733J501J120P69M26m6o61j267j717k027k301
61522C37809k554k671k530k130j596j086p79p83r63r26l90M44J076J248J084O99
61506C25952Or34j658j688j032j78L70M26J78OJ65N19P63Q74J111J498J666J449
61488C29493J243J462J898K037J870J841K132K399K291J879J478J308J349J353
$$ y = [358068, 354420, 351454, 348837, 346336, 344052, 341996, 339720, 336756, 333289, 330006, 327326, 325075, 322909, 320789, 318997, 317801, 317043, 316066, 314311, 312145, 310680, 310435, 310489, 309487, 307232, 304750, 302892, 301551, 300332, 299362, 299073, 299558, 300489, 301499, 302428, 303249, 303948, 304483, 304904, 305466, 306451, 307696, 308632, 309125, 309983, 312037, 314815, 316843, 317409, 317407, 318094, 319599, 321145, 322310, 323429, 324894, 326657, 328490, 330306, 332052, 333557, 334689, 335523, 336304, 337284, 338620, 340279, 342012, 343513, 344633, 345402, 345828, 345782, 345121, 343854, 342137, 340110, 337809, 335255, 332584, 330054, 327924, 326328, 325242, 324463, 323680, 322717, 321791, 321401, 321845, 322921, 324169, 325253, 325952, 325958, 325024, 323366, 321678, 320646, 320468, 320838, 321264, 321442, 321448, 321613, 322132, 322895, 323769, 324880, 326378, 328044, 329493, 330736, 332198, 334096, 336133, 338003, 339844, 341976, 344375, 346666, 348545, 350023, 351331, 352680, 354033]
61474C54033R85K45l21j56N26R09N80O7P2N27P58M11j17l07j45k4j29k34r5J97
61454C57782L99M37L68J29l20o98n88p2K39k9n23o63l06L99J392K517L166K774
61436C66403J674R31J186K011K578K544K165J785J547J399J159O55q9p70r72m22
61420C83784P20J793K022J325N18L76O82O29R0k25P4M16J96l05m38k42k32m97
61402C90686o49o91j158k118k687k052o18L43J80n58r58p52k55L38J102J896K180
61385C84229J604N58j29k6N62J075J346J685K363L163L562L358K986L007L359
61370D12702L445L009K560K690L230L509L221K715K416K372K395K337K163K000
61356D50764K150K819L829M809N581O082O087N460M651M327M417M105L081K148
$$ y = [354033, 355018, 355263, 354942, 354786, 355312, 356221, 356801, 356868, 356940, 357467, 358225, 358636, 358519, 358212, 358067, 358043, 357914, 357680, 357585, 357782, 358181, 358618, 358986, 359115, 358795, 358097, 357509, 357437, 357676, 357647, 357124, 356461, 356155, 356554, 357946, 360463, 363629, 366403, 368077, 369008, 370194, 372205, 374783, 377327, 379492, 381277, 382824, 384223, 385382, 386037, 385948, 385178, 384206, 383784, 384504, 386297, 388319, 389644, 390162, 390538, 391220, 391849, 391939, 391714, 391788, 392204, 392400, 392095, 391657, 391415, 391183, 390686, 390037, 389346, 388188, 386070, 383383, 381331, 380713, 381056, 381236, 380678, 379720, 378968, 378713, 379051, 380153, 382049, 384229, 385833, 386391, 386262, 386236, 386798, 387873, 389219, 390904, 393267, 396430, 399992, 403350, 406336, 409343, 412702, 416147, 419156, 421716, 424406, 427636, 431145, 434366, 437081, 439497, 441869, 444264, 446601, 448764, 450764, 452914, 455733, 459562, 464371, 469952, 476034, 482121, 487581, 492232, 496559, 500976, 505081, 508162, 510310]
61342E10310K129K658K689J872P67j62j012j902k576k838k892k983l031k941k952
61327D97136l369m023m326l872k842j800j189r35m97N87K067L052K998K522K837
61312D88346M313N984O833P128P952R581J1083J1654J1614J1638J1559J0739R216
61299F07640P667O264M471K111j10j535k396l247m105m665m994n413n922o288
61285E89478o541o837o953o412n196l928l246l203l355l160k393j288k61O19J632
61270E38956K720L190K606J668J549K504L738M604N264O016O687O996O995O779
61256F00272O151M935L348J791M98m89j285k220l519m814n358n005m479m385m468
61241E80973m238l816l618l591l377k972k579k035j032J53Q65J026J255J916K668
$$ y = [510310, 512439, 515097, 517786, 519658, 520425, 520263, 519251, 517349, 514773, 511935, 509043, 506060, 503029, 500088, 497136, 493767, 489744, 485418, 481546, 478704, 476904, 475715, 474780, 474283, 474870, 476937, 479989, 482987, 485509, 488346, 492659, 498643, 505476, 512604, 520556, 530137, 541220, 552874, 564488, 576126, 587685, 598424, 607640, 615307, 621571, 626042, 628153, 628043, 626508, 624112, 620865, 616760, 612095, 607101, 601688, 595766, 589478, 582937, 576100, 569147, 562735, 557539, 553611, 550365, 547162, 543807, 540647, 538254, 536966, 536705, 537324, 538956, 541676, 544866, 547472, 549140, 550689, 553193, 556931, 561535, 566799, 572815, 579502, 586498, 593493, 600272, 606423, 611358, 614706, 616497, 616995, 616506, 615221, 613001, 609482, 604668, 599310, 594305, 589826, 585441, 580973, 576735, 572919, 569301, 565710, 562333, 559361, 556782, 554747, 553715, 553868, 554733, 555759, 557014, 558930, 561598]
61226E61598L137L524M142M824N159N097M975N073N329N483N377N178N273N733
61212F29902O078N843N276M987M985M728M196M092M682N206N154N391P075R818
61198G07413J1960J2659J2766J3380J4390J4952J4727J4071J3283J2185J0362
61187H52148P639M353J342o43j635k320l152l973m715n885p841j0014j1461j2056
61173H01787j2494j3206j3890j4166j4189j4358j4806j5314j5495j4993j3798
61162F45078j2379j1212j0232r114p987p241o664n516l713k129j301n35R81K760
61148E70796L533K905J619L78p71j873k745l420m184m922n015m148k714j159N12
61133E48792K285L757M695N512O737Q335R947J1487J3009J4228J4828J5101J5795
$$ y = [561598, 564735, 568259, 572401, 577225, 582384, 587481, 592456, 597529, 602858, 608341, 613718, 618896, 624169, 629902, 635980, 641823, 647099, 652086, 657071, 661799, 665995, 670087, 674769, 679975, 685129, 690520, 697595, 707413, 719373, 732032, 744798, 758178, 772568, 787520, 802247, 816318, 829601, 841786, 852148, 859787, 864140, 865482, 864839, 863204, 860884, 857732, 853759, 849044, 843159, 835318, 825304, 813843, 801787, 789293, 776087, 762197, 748031, 733842, 719484, 704678, 689364, 673869, 658876, 645078, 632699, 621487, 611255, 602141, 594154, 586913, 580249, 574733, 571020, 568891, 567590, 567055, 568036, 570796, 574329, 577234, 578853, 579231, 578460, 576587, 573842, 570422, 566238, 561316, 556301, 552153, 549439, 548280, 548792, 551077, 554834, 559529, 565041, 571778, 580113, 590060, 601547, 614556, 628784, 643612, 658713, 674508]
61120F74508J7266J9138K0760K1734K1983K1689K1177K0637K0012J9329J8863
61109H97096J8633J7974J6226J3748J1618J0094Q123M741M78l235n805p975j0564
61096I71152j3348j5518j6817j7745j8763j9738k0299k0373k0116j9535j8502
61085G70398j7061j5441j3824j2291j0920r671q255o483m696l418k596j658m38
61072F63646N86J130J571K272L062L807M879O411P747Q405R055J0576J2513J3601
61058G49261J3725J4166J5730J7716J9094J9822K0491K1537K3204K5583K8124
61047I68453K9810L0413L0937L2261L3941L5029L5477L5891L6363L6564L6707
61036A341846L7382L8463L9106L9071L9152L9987M1094M1733M2160M3290M5153
$$ y = [674508, 691774, 710912, 731672, 753406, 775389, 797078, 818255, 838892, 858904, 878233, 897096, 915729, 933703, 949929, 963677, 975295, 985389, 993512, 998253, 998731, 995496, 989691, 981716, 971152, 957804, 942286, 925469, 907724, 888961, 869223, 848924, 828551, 808435, 788900, 770398, 753337, 737896, 724072, 711781, 700861, 691190, 682935, 676452, 671756, 668338, 665742, 664084, 663646, 664232, 665362, 666933, 669205, 672267, 676074, 680953, 687364, 695111, 703516, 712571, 723147, 735660, 749261, 762986, 777152, 792882, 810598, 829692, 849514, 870005, 891542, 914746, 940329, 968453, 998263, 1028676, 1059613, 1091874, 1125815, 1160844, 1196321, 1232212, 1268575, 1305139, 1341846, 1379228, 1417691, 1456797, 1495868, 1535020, 1575007, 1616101, 1657834, 1699994, 1743284, 1788437]
61025A788437M6413M5828M3887M2447M2809M4704M7365N0950N6177O3070P0961
61014B343048P9766R0325J03496J19971J41213J69402K05793K50166L02605L64833
61004D170618M38994N26233O27672P45913Q84298J045214J228760J427977J618396
60995A2714075J751504J766978J623553J327129R33898N27632J89318k4855r5231
60986B0714001m4795O1838J34450R0239j09705m43025q39735j216252j506530
60977A6840486j675950j720570j660222j528626j361175j184945j015918q62011
60969E831069p26336o08759n07653m21936l51231k94193k48106k10451j79936
60960B282468j55707j36482j20873j07774r6164q5267p5174o6488n9077n2049
$$ y = [1788437, 1834850, 1880678, 1924565, 1967012, 2009821, 2054525, 2101890, 2152840, 2209017, 2272087, 2343048, 2422814, 2513139, 2616635, 2736606, 2877819, 3047221, 3253014, 3503180, 3805785, 4170618, 4609612, 5135845, 5763517, 6509430, 7393728, 8438942, 9667702, 11095679, 12714075, 14465579, 16232557, 17856110, 19183239, 20117137, 20644769, 20834087, 20809232, 20714001, 20669206, 20731044, 20865494, 20955733, 20846028, 20403003, 19563268, 18347016, 16840486, 15164536, 13443966, 11783744, 10255118, 8893943, 7708998, 6693080, 5831069, 5104733, 4495974, 3988321, 3566385, 3215154, 2920961, 2672855, 2462404, 2282468, 2126761, 1990279, 1869406, 1761632, 1665468, 1580201, 1505027, 1438539, 1379462, 1327413]
60950A327413m5289m0019l7167l6032l5312l4756l4784l5030l4376l2438l0075
60939I32135k8250k6987k5713k4136k2527k1294k0437j9453j7848j5841j4223
60928F95426j3407j2884j1891j0367q817p553o531n752n287m980m549l969l323
60915E96116k427j092K33P91N45L02N43P58L46l29m02L11J081J173M81o52j854
60898E95924k911l859m917o094o970p152o790o338n984n713n764o407p185p131
60884E12709n996m713m268m615n124n579o077o320n827m782m000l921m154m097
60870D43236l556k672j683q38j81O60K019L462M078L629K876K650L050L792M649
60855D65171N200M858L689K720K770L427L792L785L864L887L184J776N25o5m05
$$ y = [1327413, 1282124, 1242105, 1204938, 1168906, 1133594, 1098838, 1064054, 1029024, 994648, 962210, 932135, 903885, 876898, 851185, 827049, 804522, 783228, 762791, 743338, 725490, 709649, 695426, 682019, 669135, 657244, 646877, 638060, 630507, 623976, 618224, 612937, 607957, 603408, 599439, 596116, 593689, 592597, 592830, 593621, 594166, 594468, 595011, 595769, 596115, 595786, 595384, 595695, 596776, 597949, 598430, 597778, 595924, 593013, 589154, 584237, 578143, 571173, 564021, 557231, 550893, 544909, 539196, 533432, 527025, 519840, 512709, 506713, 502000, 497732, 493117, 487993, 482414, 476337, 470017, 464190, 459408, 455408, 451487, 447333, 443236, 439680, 437008, 435325, 434487, 434306, 434966, 436985, 440447, 444525, 448154, 451030, 453680, 456730, 460522, 465171, 470371, 475229, 478918, 481638, 484408, 487835, 491627, 495412, 499276, 503163, 506347, 508123, 508648, 508583, 508178]
60840E08178r51j608k293l284m535n348n292m924m970n187m805l796k939k672
60826D55574k550k062j392j143j619k579l497l959l954l881m095m482m652m482
60812D11227m208l997l786l611l692l970l919l183k221j884k356k899k719j839
60798C66943r22m92m92n70n52n68p89j086j046l53Q14J853K245J940J308P74N68
60781C69575O82R44J169J308J423J537J598J544J301P24j75q89o89M92J776K283
60765C84603K131K014K046J650O49k70m70j94j15m49r41j394j743j822j496r72
60749C83227o21n15m39k75j33r2j41l55r02j839k963l871m206l939l519l382l345
60732C52690k837j917j457j936k535k167j014k76m74q78p31k28J11L78J004J895
$$ y = [508178, 507227, 505619, 503326, 500042, 495507, 490159, 484867, 479943, 474973, 469786, 464981, 461185, 458246, 455574, 453024, 450962, 449570, 448427, 446808, 444229, 440732, 436773, 432819, 428938, 424843, 420361, 415709, 411227, 407019, 403022, 399236, 395625, 391933, 387963, 384044, 380861, 378640, 376756, 374400, 371501, 368782, 366943, 366021, 365529, 365037, 364467, 363915, 363347, 362558, 361472, 360426, 360073, 360887, 362740, 364985, 366925, 368233, 369007, 369575, 370257, 371201, 372370, 373678, 375101, 376638, 378236, 379780, 381081, 381805, 381630, 380741, 380052, 380544, 382320, 384603, 386734, 388748, 390794, 392444, 393093, 392823, 392353, 392159, 392044, 391595, 390654, 389260, 387517, 385695, 384199, 383227, 382606, 382091, 381652, 381377, 381244, 381152, 381011, 380656, 379754, 377915, 374952, 371081, 366875, 362936, 359417, 356035, 352690, 349853, 347936, 346479, 344543, 342008, 339841, 338827, 338551, 338077, 337199, 336468, 336240, 336351, 336729, 337733, 339628]
60716C39628K434K293J850J647J754J771J447J014Q51R30R43R18J261J997K484
60701C63222K269J806J790K168K378K276K049J480K23j208j647p83L30N87j9q16
60685C76105j336j383q88j89N1k99n83k96K14M81P35J349J973J979J413Q31L70
60668C80527k89j219k093k752l250l482l246k689k198j844j427r94p70o17j57
60653C53500N68J076J197J318J751K315K760L051L074K517J397L28j96m95j291
60638C72870k639l742l868l218k683k809l179k961j971q96l91k67J47J035J891
60623C47319K194J875J177M32L4K09O24O64K59N8M93J048R31K22j75K60R86J121
60605C59731M95l06o83n49j38L24O98R02R64R84J015J036J107J327J608J725J692
$$ y = [339628, 342062, 344355, 346205, 347852, 349606, 351377, 352824, 353838, 354689, 355619, 356562, 357480, 358741, 360738, 363222, 365491, 367297, 369087, 371255, 373633, 375909, 377958, 379438, 379661, 378453, 376806, 376023, 376353, 376940, 376921, 376105, 374769, 373386, 372498, 372309, 372360, 372061, 371478, 371182, 371396, 371877, 372612, 373961, 375934, 377913, 379326, 380157, 380527, 380238, 379019, 376926, 374174, 370924, 367442, 364196, 361507, 359309, 357465, 356038, 355044, 354274, 353657, 353500, 354068, 355144, 356341, 357659, 359410, 361725, 364485, 367536, 370610, 373127, 374524, 374852, 374656, 374161, 372870, 370231, 366489, 362621, 359403, 356720, 353911, 350732, 347771, 345800, 344904, 344513, 344246, 344393, 345428, 347319, 349513, 351388, 352565, 352997, 353031, 353240, 353864, 354528, 354787, 354845, 355338, 356386, 357317, 357539, 357364, 357624, 358610, 359731, 360226, 359920, 359237, 358688, 358550, 358874, 359572, 360474, 361438, 362422, 363437, 364473, 365580, 366907, 368515, 370240, 371932]
60588C71932J826K189K315J854J187R46J097J087P99O49P42O60L45M72J471K844
60572C92415L909M683N503O260O698P132Q046R250J0039J0192J0094R909R294
60559D93424P985O132L853J079j961m473n640n340m135k792j814j229o75K60J714
60544D86388L553N478P113Q245R192J0574J2561J4569J6040J7026J7745J7943
60532F26427J7279J5827J3650J0356N895J401j760l678n555p774r406r773r410
60519F43479r047q642p913p038o180n133l948l234l118k640r32J489L486M875
60505E95504O437Q601J1053J3533J6191J9143K2359K6057L0478L5167L9057M1543
60493H65123M2984M3878M4070M3022M0549L6866L2095K6076J8688J0192J222p547
$$ y = [371932, 373758, 375947, 378262, 380116, 381303, 382249, 383346, 384433, 385232, 385881, 386623, 387283, 387628, 388100, 389571, 392415, 396324, 401007, 406510, 412770, 419468, 426600, 434646, 443896, 453935, 464127, 474221, 484130, 493424, 501409, 507541, 511394, 512473, 510512, 506039, 500399, 495059, 490924, 488132, 486318, 485089, 484414, 484674, 486388, 489941, 495419, 502532, 510777, 519969, 530543, 543104, 557673, 573713, 590739, 608484, 626427, 643706, 659533, 673183, 683539, 689434, 690835, 689075, 685397, 679842, 672068, 662662, 652889, 643479, 634432, 625790, 617877, 610839, 604659, 599526, 595578, 592344, 589226, 586586, 585654, 587143, 590629, 595504, 601941, 610542, 621595, 635128, 651319, 670462, 692821, 718878, 749356, 784523, 823580, 865123, 908107, 951985, 996055, 1039077, 1079626, 1116492, 1148587, 1174663, 1193351, 1203543, 1204765, 1197218]
60481A197218j5831k3835l1807l9445m5787m9856n1377n0884m9132m6542m3197
60470G49525l9283l5265l1535k8092k4785k1683j9006j6732j4646j2724j1142
60459D94632r912q824p857p216o884o436n590m629m057l997m123l982l326k259
60445D15540j225o65o01p50r93j460k089k536k632k539k314j751q92k85l34p31
60429C93743q78o22k79j37j86j83J86Q99J287O03q66j796j331o2R31J421J786
60412C94516J963J596R70Q56J357J707J363P00L07K66L61N62R63J471J833J886
60396D12677J705J608J936K647L239L305L050K918K932K750K305J894J723J786
60382D46475K099K603K885K522J756J321J534J997K270K351K364K283K111J943
$$ y = [1197218, 1181387, 1157552, 1125745, 1086300, 1040513, 990657, 939280, 888396, 839264, 792722, 749525, 710242, 674977, 643442, 615350, 590565, 568882, 549876, 533144, 518498, 505774, 494632, 484720, 475896, 468039, 460823, 453939, 447503, 441913, 437284, 433227, 429230, 425107, 421125, 417799, 415540, 414315, 413650, 413049, 412299, 411306, 409846, 407757, 405221, 402589, 400050, 397736, 395985, 395093, 394808, 394474, 393743, 392865, 392243, 391964, 391827, 391641, 391458, 391644, 392543, 393830, 394433, 393567, 391771, 390440, 390378, 391309, 392730, 394516, 396479, 398075, 399045, 399901, 401258, 402965, 404328, 405028, 405335, 405601, 405962, 406524, 407487, 408958, 410791, 412677, 414382, 415990, 417926, 420573, 423812, 427117, 430167, 433085, 436017, 438767, 441072, 442966, 444689, 446475, 448574, 451177, 454062, 456584, 458340, 459661, 461195, 463192, 465462, 467813, 470177, 472460, 474571, 476514]
60368D76514J696J160N05K90Q15J739K475K640K139J358J227K448M369N405M881
60353E09661L873L728M468N218N565N637N272M154K657J638J227O03p64k339l282
60338E47316l481l443l523l639l574l306l089l330m122m918m993m336l685l441
60324D94436l059j943n18K19rn05n64q0Q49K183L588M483M881N599P112Q725R477
60307E34874R559R920J0767J1344J1279J1173J1512J1774J1101R269O568L251
60295F52391l54l714o621r418j2116j3798j3706j2508j1639j1504j1235j0181
60283E35597q752p540o534n510m591l975l622l510l791m282m380l804l077k847
60269D69382l025l032k647k169j910j864j819j537r44k79J13K29M22Q53J252J421
$$ y = [476514, 478210, 479370, 479875, 480165, 480980, 482719, 485194, 487834, 489973, 491331, 492558, 495006, 499375, 504780, 509661, 513534, 517262, 521730, 526948, 532513, 538150, 543422, 547576, 550233, 551871, 553098, 553701, 552937, 550598, 547316, 543835, 540392, 536869, 533230, 529656, 526350, 523261, 519931, 515809, 510891, 505898, 501562, 497877, 494436, 491377, 489434, 488916, 489135, 489126, 488621, 488057, 487977, 488826, 491009, 494597, 499080, 503961, 509560, 516672, 525397, 534874, 544433, 554353, 565120, 576464, 587743, 598916, 610428, 622202, 633303, 642572, 649140, 652391, 652037, 648323, 641702, 632284, 620168, 606370, 592664, 580156, 568517, 557013, 545778, 535597, 526845, 519305, 512771, 507261, 502670, 498695, 495073, 491563, 487772, 483490, 479110, 475306, 472229, 469382, 466357, 463325, 460678, 458509, 456599, 454735, 452916, 451379, 450435, 450156, 450269, 450498, 450920, 451773, 453025, 454446]
60253D54446J517J570J165J30q83j059n64l49q51j426j205j92P37P00l30j394
60237D52012j351k0J575K265J880J120N89N04J068K375L804M295L599K752K862
60222D79329L802M631M936N171N802O741P683Q448Q812Q443P369O242N754N893
60208E69056O068N885N554N477N686N818N518M741L758K928K400K051J686J264
60194F27890P77P8r70k164l085l647m285n321o425o965o781o298n916n617n181
60179E66090m537l808l173k799k749k936l124k988k172o03J090J763Q02j068k368
60164E37420k325j401m85j8L0j88m21l65j3K27K5m18o05k60N15J440K173K485
60146E37816K503K604K931L216L280L376L750M124M099L867L950M301M277L657
$$ y = [454446, 455963, 457533, 458698, 458828, 457945, 456886, 456322, 455973, 455122, 453696, 452491, 452299, 453036, 453736, 453406, 452012, 450661, 450641, 452216, 454481, 456361, 457481, 458070, 458574, 459642, 462017, 465821, 470116, 473715, 476467, 479329, 483131, 487762, 492698, 497869, 503671, 510412, 518095, 526543, 535355, 543798, 551167, 557409, 563163, 569056, 575124, 581009, 586563, 592040, 597726, 603544, 609062, 613803, 617561, 620489, 622889, 624940, 626626, 627890, 628667, 628745, 627775, 625611, 622526, 618879, 614594, 609273, 602848, 595883, 589102, 582804, 576888, 571271, 566090, 561553, 557745, 554572, 551773, 549024, 546088, 542964, 539976, 537804, 537201, 538291, 540054, 540856, 539788, 537420, 535095, 533694, 533209, 533191, 533221, 533033, 532612, 532247, 532234, 532461, 532486, 532068, 531463, 531203, 531718, 533158, 535331, 537816, 540319, 542923, 545854, 549070, 552350, 555726, 559476, 563600, 567699, 571566, 575516, 579817, 584094, 587751]
60132E87751L186L647M711N223M584L449K863L044L329L186K815K615K504K188
60118F35095J855J993K486K475J443r5j256j863k348k900l287l412l494l637l653
60103F19402l504l460l663l824l617l136k698k278j546l89Q24J608J863J843J748
60088E99173J488R71M52L05M55K94o06j930k967l433l614l795l904l853l870m237
60072E70929m912n635o296o914p313p108o144m807l728l189k941k600k144j901
60058E05297k038k196j767o02P18J459J574J761K562L649M261M289M451N254O156
60043E34828O197N253M177L701L665L457K778J734M81q34j961k709l161l464l612
60028E50530l614l792m495n575o476o904p055p173p203p125p185p541p780p284
$$ y = [587751, 590937, 594584, 599295, 604518, 609102, 612551, 615414, 618458, 621787, 624973, 627788, 630403, 632907, 635095, 636950, 638943, 641429, 643904, 645347, 645252, 643996, 642133, 639785, 636885, 633598, 630186, 626692, 623055, 619402, 615898, 612438, 608775, 604951, 601334, 598198, 595500, 593222, 591676, 591287, 592111, 593719, 595582, 597425, 599173, 600661, 601632, 602084, 602389, 602844, 603138, 602532, 600602, 597635, 594202, 590588, 586793, 582889, 579036, 575166, 570929, 566017, 560382, 554086, 547172, 539859, 532751, 526607, 521800, 518072, 514883, 511942, 509342, 507198, 505297, 503259, 501063, 499296, 498694, 499412, 500871, 502445, 504206, 506768, 510417, 514678, 518967, 523418, 528672, 534828, 541025, 546278, 550455, 554156, 557821, 561278, 564056, 565790, 566271, 565437, 563476, 560767, 557606, 554142, 550530, 546916, 543124, 538629, 533054, 526578, 519674, 512619, 505446, 498243, 491118, 483933, 476392, 468612, 461328]
60014D61328o015m635l723l216k751k318k173k283k231j766j144o66k09M94J250
59999D29942J469R48K69K67J183K482L417L688L555L433L478L603L700L680L325
59984D68439K449J308M86J29l68j578l182m309m514l928k787j459p42j239k314
59969D46391k617j925j521k206k920k178k43J250J503J269J420J843K025J901
59955D43992J659J308Q93P39J036J391J225N21j19j77K24N31M30J41j0j06m77
59938D53201j018j164p00j71j48l99k78L77J225K081L019L952M643N122N540N663
59922D80945N128M116L190K423J410J75p01r97j146j300r27J50J137J287R29P97
59906D96616R24R32R45J257J485J009R2l48k0M95Q88J490K378L041L269L607M426
$$ y = [461328, 455313, 450678, 446955, 443739, 440988, 438670, 436497, 434214, 431983, 430217, 429073, 428407, 428198, 428692, 429942, 431411, 432359, 432628, 432895, 434078, 436560, 439977, 443665, 447220, 450653, 454131, 457734, 461434, 465114, 468439, 470888, 472196, 472682, 472811, 472443, 470865, 467683, 463374, 458860, 454932, 452145, 450686, 449944, 448705, 446391, 443774, 441849, 440328, 438122, 435202, 433024, 432781, 434031, 435534, 436803, 438223, 440066, 442091, 443992, 445651, 446959, 447852, 448591, 449627, 451018, 452243, 452764, 452645, 452468, 452692, 453223, 453653, 453794, 453784, 453678, 453201, 452183, 451019, 450319, 450148, 450000, 449601, 449323, 449700, 450925, 453006, 456025, 459977, 464620, 469742, 475282, 480945, 486073, 490189, 493379, 495802, 497212, 497387, 496686, 495689, 494543, 493243, 492316, 492466, 493603, 494890, 495819, 496616, 497540, 498472, 499417, 500674, 502159, 503168, 503260, 502912, 502892, 503387, 504275, 505765, 508143, 511184, 514453, 518060, 522486]
59889E22486N293N725N927O225O362O042N711N983O661P094P257P647Q186Q074
59875F14673O881N059L207J468o8j064j424j600k021k548k855k966l031l025l004
59860F07682l273l846m127l667k914k534k327j496N1J479K209K630L405M638N984
59845F03894P087P575P124N798M157K719J638J020J187K224L543M217L730K286
59831F58199N86o36j179j548k363l561m486m737m479l915l161k755l436n011o190
59816F11328o132n493n306n472n203m462l924l782l612l377l522l987m066l482
59802E49508k860k789l061l140k871k435k053j976k263k456j964r36k49m12j016
59787E19027j458j613j456p04O10J708J827J102L14lK55J109K352L247L055J982
$$ y = [522486, 527779, 533504, 539431, 545656, 552018, 558060, 563771, 569754, 576415, 583509, 590766, 598413, 606599, 614673, 621554, 626613, 629820, 631288, 631220, 630156, 628732, 627132, 625111, 622563, 619708, 616742, 613711, 610686, 607682, 604409, 600563, 596436, 592769, 589855, 587321, 584994, 583498, 583549, 585028, 587237, 589867, 593272, 597910, 603894, 610981, 618556, 625680, 631478, 635635, 638354, 639992, 641012, 642199, 644423, 647966, 652183, 655913, 658199, 658785, 658149, 656970, 655422, 653059, 649498, 645012, 640275, 635796, 631881, 628720, 625965, 622529, 617518, 611328, 605196, 599703, 594397, 588925, 583722, 579260, 575336, 571554, 567942, 564565, 561043, 557056, 552990, 549508, 546648, 543859, 540798, 537658, 534787, 532352, 530299, 528323, 526060, 523604, 521640, 520704, 520455, 520043, 519027, 517569, 515956, 514500, 513796, 514406, 516114, 517941, 519043, 519357, 519354, 519609, 520718, 523070, 526317, 529372, 531354]
59771E31354J203J608K875L859L807L022K349K250K485K674K884L328L781L699
59757E71178L020K400K459L109L773M024L873L619L611L922M180L959L315K753
59743F19195K569K584K517K256J741J044O24R64J812K334K225K084K403K770K616
59728F49738K113J802J767J794J953K370K682K418J687R60K94m96j141j176p75
59713F65990o83j113j463j207n55M3M79Q44J200J695K502L355L552K760J525P50
59697F79674Q50J651K778L853M443M243L316K043P92k99j305k318l171l438k949
59682F90163k233k097k667l221l226l160l887n396o718p077o677o161n701n034
59668F26908m146l435l104k832k183j131N3J127J933K350K509K786L303L641L451
$$ y = [531354, 532557, 534165, 537040, 540899, 544706, 547728, 550077, 552327, 554812, 557486, 560370, 563698, 567479, 571178, 574198, 576598, 579057, 582166, 585939, 589963, 593836, 597455, 601066, 604988, 609168, 613127, 616442, 619195, 621764, 624348, 626865, 629121, 630862, 631906, 632530, 633494, 635306, 637640, 639865, 641949, 644352, 647122, 649738, 651851, 653653, 655420, 657214, 659167, 661537, 664219, 666637, 668324, 669284, 669578, 669082, 667941, 666765, 665990, 665307, 664194, 662731, 661524, 660969, 661012, 661491, 662335, 663535, 665230, 667732, 671087, 674639, 677399, 678924, 679674, 680524, 682175, 684953, 688806, 693249, 697492, 700808, 702851, 703643, 703344, 702039, 699721, 696550, 693112, 690163, 687930, 685833, 683166, 679945, 676719, 673559, 669672, 664276, 657558, 650481, 643804, 637643, 631942, 626908, 622762, 619327, 616223, 613391, 611208, 610077, 610130, 611257, 613190, 615540, 618049, 620835, 624138, 627779, 631230]
59653F31230L054K874K546J406k31j237j321j556k801m424n335n484n538n677
59639F07506n646n580n745n714m821l391k477k365k323j935j718k095k743l346
59625E57607m104n000n356m800l980l636l514l012k415k531l317l787l318k302
59611E06535j367n62L49J256J762J686J297J085J274J529J209J25j069j502r91
59596E12616p0P97J570K177K218J454L25m73p54r14j228j446j213p09n48j064
59580E12738j883k287j929j060k49L6l66j217j988k260k112k008k219k532k572
59565D88092k216j555o41M72J431J642Q17n86j532j237J13J463J902J552J274
59550D90991J549J977K041K051K784M362N998P032P818R214J1448J3896J5819
$$ y = [631230, 634284, 637158, 639704, 641110, 640879, 639642, 638321, 636765, 633964, 629540, 624205, 618721, 613183, 607506, 601860, 596280, 590535, 584821, 580000, 576609, 574132, 571767, 569444, 567509, 565791, 563696, 560953, 557607, 553503, 548503, 543147, 538347, 534367, 530731, 527217, 524205, 521790, 519259, 515942, 512155, 508837, 506535, 505168, 504606, 504955, 506211, 507973, 509659, 510956, 512041, 513315, 514844, 516053, 516178, 515109, 513607, 512616, 512546, 513343, 514913, 517090, 519308, 520762, 521087, 520614, 519860, 518946, 517718, 516272, 515059, 514350, 513802, 512738, 510855, 508568, 506639, 505579, 505330, 505366, 505000, 503783, 501795, 499535, 497423, 495415, 493196, 490664, 488092, 485876, 484321, 483680, 484152, 485583, 487225, 488042, 487456, 485924, 484687, 484800, 486263, 488165, 489717, 490991, 492540, 494517, 496558, 498609, 501393, 505755, 511753, 518785, 526603, 535817, 547265, 561161, 576980]
59537E76980J6872J6783J5103J1655P047K330j720m703o209n938m386k784k000
59524F19030j797j510j063q52r23r30r12j413k698m341n753o725p205p048o378
59509E69482n806n842o220o242n658m838m134l523k910k403k125j951j630j052
59495E15148l32L13P61J125J670K425K981K921K374J927J919K100K106J982K048
59480E41468K410K852L199L513L943M469M821M626L714K397J314Q70Q65P95M37
59465E81693l8l86m21J01J330K962M385N291N881O299O297N763N228N232N450
59450F35067N022L806K650K244K175J496j34k236m177n644o581o984o886o365
59436F13453n566m726l994l276k391j480r09o25rJ349L054M530N919P758R870
$$ y = [576980, 593852, 610635, 625738, 637393, 644440, 646770, 645050, 640347, 634138, 628200, 623814, 621030, 619030, 617233, 615723, 614660, 613808, 612885, 611955, 611043, 609630, 606932, 602591, 596838, 590113, 582908, 575860, 569482, 563676, 557834, 551614, 545372, 539714, 534876, 530742, 527219, 524309, 521906, 519781, 517830, 516200, 515148, 514816, 515129, 515890, 517015, 518685, 521110, 524091, 527012, 529386, 531313, 533232, 535332, 537438, 539420, 541468, 543878, 546730, 549929, 553442, 557385, 561854, 566675, 571301, 575015, 577412, 578726, 579596, 580461, 581256, 581693, 581655, 581269, 580848, 580949, 582279, 585241, 589626, 594917, 600798, 607097, 613394, 619157, 624385, 629617, 635067, 640089, 643895, 646545, 648789, 650964, 652460, 652326, 650090, 645913, 640269, 633688, 626704, 619818, 613453, 607887, 603161, 599167, 595891, 593500, 592020, 591111, 590486, 590477, 591826, 594880, 599410, 605329, 613087, 622957]
59421F22957J1327J1763J2069J3291J5260J6893J7754J8579J9995K1172K0329
59410H01389J6466J0292L373l083q406j1918j2925j1327p797l253J472N363P217
59397G86863O287K879j915o869j0984j3634j4749j4688j3709j1777r029o085l529
59384F89061j481L2O93M39N1M69J631K591K795K553K264J863J238O49L65K49L9
59367G05501k38l23k7O40J428J944K049K150K729L693M577N366O462P821Q878
59352G52650R628J0930J3177J5303J5962J5293J4630J4628J4598J3810J2524J1238
59340I14371R641P064L689N81j539l027m643o589q518j0174j1612j2844j3670
59327H62730j3922j3575j2626j1214r894r383r817j0598j1128j1376j1475j1242
$$ y = [622957, 634284, 646047, 658116, 671407, 686667, 703560, 721314, 739893, 759888, 781060, 801389, 817855, 828147, 831520, 828437, 820031, 808113, 795188, 783861, 776064, 772811, 774283, 779646, 786863, 793150, 796029, 794114, 787245, 776261, 762627, 747878, 733190, 719481, 707704, 698675, 692590, 689061, 687580, 687612, 688305, 688744, 688795, 689264, 690895, 693486, 696281, 698834, 701098, 702961, 704199, 704848, 705213, 705462, 705501, 705263, 704940, 704913, 705553, 706981, 708925, 710974, 713124, 715853, 719546, 724123, 729489, 735951, 743772, 752650, 762278, 773208, 786385, 801688, 817650, 832943, 847573, 862201, 876799, 890609, 903133, 914371, 924012, 931076, 934765, 935346, 933807, 930780, 926137, 919548, 911030, 900856, 889244, 876400, 862730, 848808, 835233, 822607, 811393, 801499, 792116, 782299, 771701, 760573, 749197, 737722, 726480]
59315G26480j0529r673r102q710q110p259o383n488m495l614k971k063l31J870
59301F49622L685N056O683Q489R164P600M167N7l870p191r603j1119j2143j2708
59287F37889j2183j0228p583n194l057o62J700L085L302L379M284N851P217P974
59273F35774Q452R038R585R679R351R139R258R051P765N689L829K438P68j513
59259G28303l505m335m424m649m891m448l479k953l105l053k158r04o9L09P60
59244F87399J631K912M438N905O928P386P514P532P402O965O195N126L785K304
59230G63422Q48n92k202m026n800p200q079q501q655q743q799q631q166p696p494
59215F69686p299o595n377m287l780l671l593l559l679l653l064k107j563j828
$$ y = [726480, 715951, 706278, 697176, 688466, 680356, 673097, 666714, 661226, 656731, 653117, 650146, 648083, 647752, 649622, 653307, 658363, 665046, 673535, 682699, 690299, 694466, 694523, 690653, 683462, 673859, 662740, 650597, 637889, 625706, 615478, 607895, 602701, 599644, 598982, 600682, 603767, 607069, 610448, 614732, 620583, 627800, 635774, 644226, 653264, 662849, 672528, 681879, 691018, 700276, 709327, 717092, 722781, 726610, 729048, 729816, 728303, 724798, 720463, 716039, 711390, 706499, 702051, 698572, 695619, 692514, 689461, 687303, 686399, 686330, 686639, 687399, 689030, 691942, 696380, 702285, 709213, 716599, 724113, 731645, 739047, 746012, 752207, 757333, 761118, 763422, 764270, 763678, 761476, 757450, 751650, 744450, 736371, 727870, 719215, 710472, 701673, 693042, 684876, 677180, 669686, 662387, 655792, 650415, 646128, 642348, 638677, 635084, 631525, 627846, 624193, 621129, 619022, 617459, 615631]
59201F15631k289j991q14L95R28J088J675K900M154M816M916M915N213N870O564
59186F53971O742O137N232M867N274N836N893N357M470L465K723K691L234L528
59172G19420L018K133J618J532J402J008M58k18j077k029l032m174n218n551n192
59157G04098n288o827r211j0962j1546j1475j1059j0123r019q536q547p919o323
59144E87263n040n227o263o704o225n659n496n362m890m269l723l070k043p88
59130E22504K00N22K09k49k23O39K164L851N234O082O422O453O516P029Q280J0020
59114E85653J1386J1646J1109J0818J1139J1314J0712R853R470R218Q222O548
59102G07088M989L644J940J3j236j687k311l449m066l391k222j672j542j010j89
$$ y = [615631, 613342, 611351, 610537, 610932, 611860, 612948, 614623, 617523, 621677, 626493, 631409, 636324, 641537, 647407, 653971, 660713, 666850, 672082, 676949, 682223, 688059, 693952, 699309, 703779, 707244, 709967, 712658, 715892, 719420, 722438, 724571, 726189, 727721, 729123, 730131, 730589, 730371, 729294, 727265, 724233, 720059, 714841, 709290, 704098, 698810, 691983, 682772, 671810, 660264, 648789, 637730, 627607, 618588, 610052, 601505, 593586, 587263, 582223, 576996, 570733, 564029, 557804, 552145, 546649, 541287, 536397, 532128, 528405, 525335, 523292, 522504, 522704, 523226, 523435, 523186, 522963, 523602, 525766, 529617, 534851, 540933, 547355, 553808, 560324, 567353, 575633, 585653, 597039, 608685, 619794, 630612, 641751, 653065, 663777, 673630, 683100, 692318, 700540, 707088, 712077, 715721, 717661, 717674, 716438, 714751, 712440, 708991, 704925, 701534, 699312, 697640, 696098, 695088, 694899]
59087F94899J46r0m11q86k075l853n382o332p198q226q866q660p964p390o980
59072F20732o321n255m126l468l585m278m890m822m055l050k213j654j444j703
59058E69868k341k890k887k301j549j078r80j006q89o74o05p99j140j453j605
59043E47671j450r16k07L68P38J062J331J437J545K035K877L569L811L812L827
59028E71510L870M177N236P006Q607R322R424R592R945J0150R939R018O997M152
59014F78945J750P71O41J29q91j522j458j260j081l61R78K125K622L076M059N120
58998F93643N560N421N083M390K999J203k12p94p32n54q78k040l575m461m226
58983G00827l445k798k169j220j77P22J995M209O704Q136Q174P771P747Q095Q710
$$ y = [694899, 695045, 694955, 694544, 693658, 691583, 687730, 682348, 676016, 668818, 660592, 651726, 643066, 635102, 627712, 620732, 614411, 609156, 605030, 601562, 597977, 593699, 588809, 583987, 579932, 576882, 574669, 573015, 571571, 569868, 567527, 564637, 561750, 559449, 557900, 556822, 555842, 554836, 553947, 553273, 552668, 551869, 550729, 549276, 547671, 546221, 545305, 545098, 545466, 546204, 547266, 548597, 550034, 551579, 553614, 556491, 560060, 563871, 567683, 571510, 575380, 579557, 584793, 591799, 600406, 609728, 619152, 628744, 638689, 648839, 658778, 667796, 674793, 678945, 680695, 681466, 682107, 682236, 681345, 679823, 678365, 677105, 676024, 675663, 676641, 678766, 681388, 684464, 688523, 693643, 699203, 704624, 709707, 714097, 717096, 718299, 718087, 717293, 716561, 716007, 715129, 713089, 709514, 705053, 700827, 697382, 694584, 692415, 691195, 691018, 691740, 693735, 697944, 704648, 712784, 720958, 728729, 736476, 744571, 753281]
58968G53281R725J0725J0711R470Q147P779P950P635O690N593M227K057o74k990
58954H40326m553o133q457j1258j3672j5040j5172j4409j3553j3153j2778j1610
58942G00538r860q683q422p914o254m354l703m209m400l536k399j870j796j578
58928F31560j123o96l97k07k11m67q12j036r83m74N22J614K256K359K255K074
58912F36234J684J331J648K750L940M698N408O619Q130R408J0473J1667J2820
58899G16810J3368J3212J2782J2299J1638J1029J1196J2459J4217J5692J6794
58888H61496J7829J8670J8736J7765J6132J4298J2269R801O943M092J532q38l248
58875I95477n693p947r781j1050j1656j1636j1159j0408r426q284p187o315n725
$$ y = [753281, 763006, 773731, 784442, 793912, 802059, 809838, 817788, 825423, 832113, 837706, 841933, 843990, 843316, 840326, 835773, 829640, 821183, 809925, 796253, 781213, 766041, 751632, 738079, 724926, 712148, 700538, 690678, 681995, 673573, 665659, 659405, 655051, 651348, 647139, 642739, 639203, 636804, 634934, 633138, 631560, 630437, 629741, 629344, 629137, 628926, 628459, 627647, 626611, 625628, 625154, 625676, 627290, 629546, 631905, 634160, 636234, 637918, 639249, 640897, 643647, 647587, 652285, 657693, 664312, 672442, 681850, 692323, 703990, 716810, 730178, 743390, 756172, 768471, 780109, 791138, 802334, 814793, 829010, 844702, 861496, 879325, 897995, 916731, 934496, 950628, 964926, 977195, 986996, 993939, 998031, 999563, 998725, 995477, 989784, 981837, 972056, 961006, 949350, 937714, 926555, 916147, 906721, 898437, 891250, 884935, 879210]
58862H79210n542o077p417r095j0429j1122j1277j1041j0682j0711j1364j2026
58850G62427j1851j0933j0155r862r414q364p266o905p253p731p964p869p430
58837F49430o916o832p159p089o059m656l838l582l007j686j00J112J768K042
58823F03428K266K809L654M183L930L394L531M377M952M607L803L259K915K240
58809F53348J170K06k93n48r72j646k245k467k390k391k675l066l327l527l877
58794F25300m343m611m487m053l449k609j365K19J670K400K326K091K483L646
58780F15218N076O253O907O809N935M878M409M287L233N13k936n606p109q137
58766F39730r128r724r450q316o709n208m359m189m102l635l036k666k229j290
$$ y = [879210, 873668, 867591, 860174, 851079, 840650, 829528, 818251, 807210, 796528, 785817, 774453, 762427, 750576, 739643, 729488, 719626, 710212, 701848, 694582, 687677, 680424, 672693, 664729, 656860, 649430, 642514, 635682, 628523, 621434, 615375, 610719, 606881, 603299, 600292, 598606, 598506, 599618, 601386, 603428, 605694, 608503, 612157, 616340, 620270, 623664, 627195, 631572, 636524, 641131, 644934, 648193, 651108, 653348, 654518, 654724, 654431, 653883, 652911, 651265, 649020, 646553, 644163, 641772, 639097, 636031, 632704, 629177, 625300, 620957, 616346, 611859, 607806, 604357, 601748, 600383, 600602, 602272, 604672, 606998, 609089, 611572, 615218, 620294, 626547, 633454, 640263, 646198, 651076, 655485, 659772, 663005, 663518, 660582, 654976, 647867, 639730, 630602, 620878, 611428, 603112, 596403, 591195, 586836, 582647, 578545, 574910, 571874, 569208, 566979, 565689]
58752E65689j72L96M13N00Q18R63R45J342K322L333M043M800N747O269N866N049
58736F08323M795N441O520P363P470O688N473M707M830N342N527N424N620O251
58722F89774O811O988P153P669Q140P907P118O748P274P899P543O169M472K550
58708G84215j00l229n649o840p787r465j1441j2842j3918j5416j7021j7736j7584
58695F45187j7433j7239j5866j2994r877p757o599n869n487n368m937l913k913
58682E28935k605k768k742k280j471l85N86P26om47M75K317L765M399N036O395
58666E39930Q197R696J0558J0949J0996J0323Q258M677O36k390m021n195o685
58653E95929q028q489q377q495q701q006o170m244l217k837k175r56J52M62Q7
$$ y = [565689, 565517, 565913, 566326, 566826, 567644, 568607, 569552, 570894, 573216, 576549, 580592, 585392, 591139, 597408, 603274, 608323, 613118, 618559, 625079, 632442, 639912, 646600, 652073, 656780, 661610, 666952, 672479, 677903, 683523, 689774, 696585, 703573, 710726, 718395, 726535, 734442, 741560, 748308, 755582, 763481, 771024, 777193, 781665, 784215, 784115, 780886, 775237, 768397, 760610, 751145, 739704, 726862, 712944, 697528, 680507, 662771, 645187, 627754, 610515, 594649, 581655, 571778, 564021, 557422, 551553, 546066, 540698, 535761, 531848, 528935, 526330, 523562, 520820, 518540, 517069, 516684, 517270, 517996, 517990, 517543, 518018, 520335, 524100, 528499, 533535, 539930, 548127, 557823, 568381, 579330, 590326, 600649, 608907, 613584, 614220, 611830, 607809, 602614, 595929, 587901, 579412, 571035, 562540, 553839, 545833, 539663, 535419, 532202, 529365, 527190, 526234, 526386, 526848, 526935]
58638E26935j98J76J003J622J684J438J216R87N71J19k7J50K21k10j021j672j695
58621E31299j044J9J280K718M182N221N498N266N128N289N330M783L674K476J704
58606E82823J513J532J195M16k33l77m70j089j896k112j886k173l094l395k046
58591E68708L99K577L885M663N355O191P276Q444R225R468R665J0154J0442R961
58577F66413R198R185J0058J0897J1164J1452J2479J3995J5221J6052J7232J9330
58565H22676K2006K4435K6158K7184K7495K6789K4868K1842J7841J2903P431K412
58553A064040j328l828n613o803p231p144p136p370p585p928r046j1156j3625
58540I68247j5790j7629j9402k1101k2388k2732k1554j8864j5780j3694j2782
$$ y = [526935, 526737, 526913, 527916, 529538, 531222, 532660, 533876, 534863, 535434, 535553, 535526, 535676, 535897, 535687, 534666, 532994, 531299, 530255, 530274, 531554, 534272, 538454, 543675, 549173, 554439, 559567, 564856, 570186, 574969, 578643, 581119, 582823, 584336, 585868, 587063, 587479, 587246, 586869, 586399, 585310, 583414, 581302, 579416, 577243, 574149, 570754, 568708, 569107, 571684, 575569, 580232, 585587, 591778, 599054, 607498, 616723, 626191, 635856, 646010, 656452, 666413, 675611, 684796, 694854, 705751, 716915, 728367, 740846, 754841, 770062, 786114, 803346, 822676, 844682, 869117, 895275, 922459, 949954, 976743, 1001611, 1023453, 1041294, 1054197, 1061628, 1064040, 1062712, 1058884, 1053271, 1046468, 1039237, 1032093, 1024957, 1017587, 1010002, 1002074, 993028, 981872, 968247, 952457, 934828, 915426, 894325, 871937, 849205, 827651, 808787, 793007, 779313, 766531]
58529G66531j1997j0633r017p481n738l777k356j852j544q43m86j428l091l876
58515G02412l166j869r79n60k33L5Nm53j202j891k143j889j431j039o93l64k54
58498F84286n20r68j218r83j27J208K475L207L665M490N644O513P125Q362J0503
58483G33662J2515J3505J4065J5294J7039J8042J7444J5386J2439R107N768K484
58471H86750r33m256o653p612p662p624p620p279o415m933k586M65L356N435P061
58456H39494Q862J0697J2066J2953J3416J2810J0498O963L290k45m066p936j0738
58443I08064j1773j1518j0886j0298r586q395o601m498k498o12J374L122L921
58430H39816L960M478O085P822Q599Q713Q957R138Q545P217N506L049n27m274
$$ y = [766531, 754534, 743901, 734884, 727403, 721665, 717888, 715532, 713680, 712136, 711293, 710807, 709379, 706288, 702412, 699246, 697377, 696398, 695838, 695605, 695640, 695645, 695192, 693990, 692099, 689956, 688067, 686636, 685597, 684904, 684540, 684286, 683766, 682798, 681580, 680597, 680470, 681678, 684153, 687360, 691025, 695515, 701159, 707672, 714797, 723159, 733662, 746177, 759682, 773747, 789041, 806080, 824122, 841566, 856952, 869391, 878498, 884266, 886750, 885817, 881561, 874908, 867296, 859634, 852010, 844390, 837111, 830696, 825763, 823177, 823642, 826998, 832433, 839494, 848356, 859053, 871119, 884072, 897488, 910298, 920796, 927759, 931049, 930804, 926738, 918802, 908064, 896291, 884773, 873887, 863589, 854003, 845608, 839007, 834509, 832011, 831399, 832773, 835895, 839816, 843776, 848254, 854339, 862161, 870760, 879473, 888430, 897568, 906113, 913330, 918836, 921885, 921358, 917084]
58416I17084o631p314p324p377p473p714q261q578p922o535n337m562l699k605
58402H25752j578n04R11K286L022L457M309N200N083M052L321L357L382K910K361
58387H67321J946J193rj097j887k834m007m744m697m182l307j731M73K683M636
58372H49757O557Q370R817J1228J3009J4390J4155J2713J1960J2789J4147J4935
58360I93827J5252J5250J4337J2406J0509R374Q341O653M753L399K511J765J499
58347A099876K068K973L565M037M955O331P769R130J0485J1868J3409J5225J6894
58334A208585J7601J7137J6119J5004J3656J2082J0717R630Q270O537N184M697
58322A345219M517L958L278L183L805M710N590O509P643R000J0247J0938J1184
$$ y = [917084, 910453, 903139, 895815, 888438, 880965, 873251, 864990, 856412, 848490, 841955, 836618, 832056, 828357, 825752, 824174, 823670, 824581, 826867, 829889, 833346, 837655, 842855, 847938, 851990, 855311, 858668, 862050, 864960, 867321, 869267, 870460, 870451, 869354, 867467, 864633, 860626, 855882, 851185, 847003, 843696, 841965, 842438, 845121, 849757, 856314, 864684, 874501, 885729, 898738, 913128, 927283, 939996, 951956, 964745, 978892, 993827, 1009079, 1024329, 1038666, 1051072, 1061581, 1070955, 1079296, 1085949, 1090702, 1094101, 1096612, 1098377, 1099876, 1101944, 1104917, 1108482, 1112519, 1117474, 1123805, 1131574, 1140704, 1151189, 1163057, 1176466, 1191691, 1208585, 1226186, 1243323, 1259442, 1274446, 1288102, 1300184, 1310901, 1320531, 1328801, 1335338, 1340522, 1345219, 1349736, 1353694, 1356972, 1360155, 1363960, 1368670, 1374260, 1380769, 1388412, 1397412, 1407659, 1418597, 1429781]
58309A429781J1767J3079J4356J4730J4578J4925J5843J6535J6717J6833J7004
58298A596148J7019J7152J7835J8575J8510J7915J7921J8826J9904K0807K1826
58287A802438K2891K3677K4580K6196K8087K9440L0677L2788L5331L6970L7764
58276B130839L9076M1242M3319M5052M7108M9310N0700N1371N2228N3059N3062
58265B656366N3086N4827N7797N9778O0354O1190O2589O2912O1942O1677O2941
58254C315459O4257O5060O6960P0758P5072P9084Q3712Q9038R3601R7405J02529
58243D202935J09476J16137J21726J28350J37112J46036J53644J61379J70660
58234E447455J80788J91472K04131K18829K33413K47529K63934K83905L05148
$$ y = [1429781, 1441548, 1454627, 1468983, 1483713, 1498291, 1513216, 1529059, 1545594, 1562311, 1579144, 1596148, 1613167, 1630319, 1648154, 1666729, 1685239, 1703154, 1721075, 1739901, 1759805, 1780612, 1802438, 1825329, 1849006, 1873586, 1899782, 1927869, 1957309, 1987986, 2020774, 2056105, 2093075, 2130839, 2169915, 2211157, 2254476, 2299528, 2346636, 2395946, 2446646, 2498017, 2550245, 2603304, 2656366, 2709452, 2764279, 2822076, 2881854, 2942208, 3003398, 3065987, 3128899, 3190841, 3252518, 3315459, 3379716, 3444776, 3511736, 3582494, 3657566, 3736650, 3820362, 3909400, 4003001, 4100406, 4202935, 4312411, 4428548, 4550274, 4678624, 4815736, 4961772, 5115416, 5276795, 5447455, 5628243, 5819715, 6023846, 6242675, 6476088, 6723617, 6987551, 7271456, 7576604]
58225G576604L26206L49021L74967M02618M31757M65262N04505N47478N94003
58216A1572421O47967P11555P82516Q60262R49367J053839J173820J311727J475616
58207B0539090J672872J907400K187473K529618K951142L467371M100146M877618
58199D4232730N819058O932066Q233835R762889J1560047J3651900J6064678J8836648
58191A35093851K1996761K5532178K9345575L3128384L6154197L7225473L5036842
58184C53513261K8854625J9024869O911714n644171j6932874k5754052l1549648
58177C28423724l4368039l4696629l3218080l0600527k7394154k4008342k0715912
58170A23422041j7672791j4955146j2592036j0577637q879218p455411o270336
$$ y = [7576604, 7902810, 8251831, 8626798, 9029416, 9461173, 9926435, 10430940, 10978418, 11572421, 12220388, 12931943, 13714459, 14574721, 15524088, 16577927, 17751747, 19063474, 20539090, 22211962, 24119362, 26306835, 28836453, 31787595, 35254966, 39355112, 44232730, 50051788, 56983854, 65217689, 74980578, 86540625, 100192525, 116257203, 135093851, 157090612, 182622790, 211968365, 245096749, 281250946, 318476419, 353513261, 382367886, 401392755, 408304469, 402660298, 385727424, 359973372, 328423724, 294055685, 259359056, 226140976, 195540449, 168146295, 144137953, 123422041, 105749250, 90794104, 78202068, 67624431, 58745213, 51289802, 45019466]
58163D5019466n290824m481114l808928l251872k792429k411880k093916j828907
58155A9059596j609349j425225j267967j134328j021856r24516q36754p57974
58147A0081627o88899o26969n69056n15423m67305m23525l82873l46892l17108
58138E743577k92090k70153k52135k38576k26949k14672k02401j91520j80913
58129C674168j69100j57248j47109j38067j28917j20484j13823j07757j00844
58120B490819r3955q8446q3548p8071p2844o9043o5733o1598n7532n5080n3770
58109A711199n2271n0781m9983m8999m6756m4133m2502m1314l9295l6878l5273
58098A223014l4153l2405l0210k8373k6554k4109k1741k0358j9257j7397j5530
$$ y = [45019466, 39728642, 35247528, 31438600, 28186728, 25394299, 22982419, 20888503, 19059596, 17450247, 16025022, 14757055, 13622727, 12600871, 11676355, 10839601, 10081627, 9392728, 8765759, 8196703, 7681280, 7213975, 6790450, 6407577, 6060685, 5743577, 5451487, 5181334, 4929199, 4690623, 4463674, 4249002, 4046601, 3855081, 3674168, 3505068, 3347820, 3200711, 3062644, 2933727, 2813243, 2699420, 2591663, 2490819, 2396864, 2308418, 2224870, 2146799, 2073955, 2004912, 1939179, 1877581, 1820049, 1764969, 1711199, 1658928, 1608147, 1558164, 1509165, 1462409, 1418276, 1375774, 1334460, 1295165, 1258287, 1223014, 1188861, 1156456, 1126246, 1097873, 1071319, 1047210, 1025469, 1005111, 985854, 968457, 952927]
58087I52927j4992j5240j4742j3593j3202j3835j4460j4711j5217j6186j7219
58076G89530j8187j9028j9097j8108j7033j6730j6405j4912j2845j1653j1324
58065F14208j0680r477q505p876o939n754n138n317n839o644p878q889q728p603
58051E08941o654o326o084n552m970m613m643n307o391o914o245n116m579m519
58037D31028m181l625l449l577l522l509m082m982n544n905o644p490p655p170
58023C59693o762o563o116n448m959m443l374k151j781k347k822k532j773r95
58009C07627k96K15L97N17R32J416J481J266J302J605J836K131K863L744M068
57994C31104L749L292K821K034R49k02j679l923o518q461r441j0008j0483j0579
$$ y = [952927, 937935, 922695, 907953, 894360, 881158, 867323, 852863, 838152, 822935, 806749, 789530, 771343, 752315, 733218, 715110, 698077, 681347, 664942, 650030, 637185, 625532, 614208, 603528, 594051, 585546, 577670, 570731, 564977, 559839, 554522, 548683, 542039, 534161, 525272, 516544, 508941, 502287, 495961, 489877, 484325, 479355, 474742, 470099, 464792, 458401, 451487, 445242, 440126, 435547, 431028, 426847, 423222, 419773, 416196, 412674, 409165, 405083, 400101, 394557, 388652, 382008, 374518, 366863, 359693, 352931, 346368, 340252, 334804, 329845, 325402, 322028, 319877, 318096, 315749, 312927, 310395, 308622, 307627, 307331, 307546, 307943, 308460, 309392, 310808, 312289, 313555, 314857, 316462, 318298, 320429, 323292, 327036, 331104, 334853, 338145, 340966, 343000, 343949, 343747, 342068, 338145, 331627, 323166, 313725, 303717, 293234, 282655]
57980B82655j0158r489q629p279n453l635k211j196m72J50R47J817K156J684J039
57965B41926Q11N68k83j197j171m15r3n07q21n87l93p28j314j785k176k449k349
57948B27037j993j799j714j240k90P68J890L307M663N215N084N274O155O945P116
57933B66418P243P839Q227P410N487L405J673L0j745l367m478n188n979p038p869
57918B72068p758o763n775n350m905l665k005j075j251j769j911j745j559j292
57904B25245p55N5J035J984K532K464K082J809J642J517J903L224M830N446M767
57889B59780L784L392L488L623L734L845L698L114K271J424O75R4l74j164k580
57874B88804m073m697m358l892l810l702l151k372j643q67r1K04j01l31J06Q68
$$ y = [282655, 272497, 263008, 254379, 247100, 241647, 238012, 235801, 234605, 234133, 234283, 235230, 237047, 239203, 240887, 241926, 242737, 243305, 243022, 241825, 240654, 240239, 240146, 239639, 238818, 238231, 237838, 237110, 235796, 234011, 231835, 229386, 227037, 225044, 223245, 221531, 220291, 220001, 220769, 222659, 225966, 230629, 235844, 240928, 246202, 252357, 259302, 266418, 273661, 281500, 289727, 297137, 302624, 306029, 307702, 307732, 305987, 302620, 298142, 292954, 286975, 279937, 272068, 264310, 257547, 251772, 246422, 241517, 237852, 235847, 234772, 233521, 231752, 229841, 228096, 226537, 225245, 224490, 224545, 225580, 227564, 230096, 232560, 234642, 236451, 238093, 239610, 241513, 244737, 249567, 255013, 259780, 263564, 266956, 270444, 274067, 277801, 281646, 285344, 288458, 290729, 292153, 292828, 292922, 292548, 291384, 288804, 284731, 280034, 275676, 271784, 267974, 264272, 261121, 258749, 257106, 256239, 256148, 256352, 256251, 255920, 256026, 256894]
57858B56894J315J591K384L792N029N337M850M351M310M319L716K662K159K660
57844C05369L217K663J264L89O31J169J077M01k99p63r83r66q89j044j344j339
57828C08553r30n94o76r19r96j042j393k071k764l093k862k330k131k542l008
57813B81202k957k880l796n699p410q110q083p754p009n947n349n679o256o123
57799A98150n286m402l660k661j295p1M57L45K99J039K504L772M086L769L655
57784B00701L859L786L287K897K922L193L838N261P012P745O925N644N086M989
57770B67145M464L432K394J361J30q68j005n78n49j207j889k047j871j760j751
57755B65401j670j483j323j326j449j381q15Q5P72R84R77R70P44P2r01j880k590
$$ y = [256894, 258209, 259800, 262184, 265976, 271005, 276342, 281192, 285543, 289853, 294172, 297888, 300550, 302709, 305369, 308586, 311249, 312513, 312902, 313533, 314702, 315779, 316180, 315881, 315118, 314135, 313169, 312280, 311236, 309892, 308553, 307623, 307029, 306353, 305434, 304438, 303396, 302003, 299932, 297168, 294075, 291213, 288883, 286752, 284210, 281202, 278245, 275365, 271569, 265870, 258460, 250350, 242267, 234513, 227504, 221557, 216208, 210529, 204273, 198150, 192864, 188462, 184802, 182141, 180846, 180775, 181232, 181577, 181876, 182915, 185419, 189191, 193277, 197046, 200701, 204560, 208346, 211633, 214530, 217452, 220645, 224483, 229744, 236756, 244501, 251426, 257070, 262156, 267145, 271609, 275041, 277435, 278796, 278926, 278058, 277053, 276475, 275926, 274719, 272830, 270783, 268912, 267152, 265401, 263731, 262248, 260925, 259599, 258150, 256769, 255954, 256039, 256811, 257795, 258772, 259742, 260486, 260558, 259657, 257777, 255187]
57738B55187k654j847o79q5k37l76j06O0j40J8J013K032K121J693J775K316K490
57721B62581K229K229K554K576K237K145K284J818N59m84m91P4L53K70J98O7m66
57704B80733j262j782j829j763j994k475k774k544j935j518j679k266l000l946
57690B49966n116n903n565m318l299l241l719l925l606k872j570N26L118N541
57676B16017P510R426J1759J4525J7496K0740K4673K9538L4981M0159M3984M5157
57664E15965M2311L4701K2866Q365p063k1738l3699m1074m3345m1837l8488l4451
57652C62513l0157k6008k2336j8947j5521j2298r808q028o481n013l850k961k025
57639A99080j085n42m40l64j64j40l08k52P9P3n65j190j122p04p66j319j596j296
$$ y = [255187, 252533, 250686, 250007, 249922, 249685, 249309, 249203, 249263, 249123, 249141, 250154, 252186, 254307, 256000, 257775, 260091, 262581, 264810, 267039, 269593, 272169, 274406, 276551, 278835, 280653, 281212, 280728, 280237, 280311, 280664, 280934, 281132, 281199, 280733, 279471, 277689, 275860, 274097, 272103, 269628, 266854, 264310, 262375, 260857, 259178, 256912, 253912, 249966, 244850, 238947, 233382, 229064, 225765, 222524, 218805, 214880, 211274, 208402, 206832, 207358, 210476, 216017, 223527, 232953, 244712, 259237, 276733, 297473, 322146, 351684, 386665, 426824, 470808, 515965, 558276, 592977, 615843, 624208, 617145, 595407, 561708, 520634, 477289, 435452, 396964, 362513, 332356, 306348, 284012, 265065, 249544, 237246, 227438, 219410, 212929, 207916, 204066, 201105, 199080, 197995, 197453, 197013, 196649, 196485, 196345, 196037, 195785, 195864, 195937, 195372, 194182, 193060, 192356, 191590, 190271, 188675, 187379]
57621A87379j068j511k221k305j602q91q77j363j653j585j636k047k317j923j166
57606A63214q13j019j173q30l35k42m88n58k57l1m10j335k179k359j907j369j226
57589A46683j510j910k118j949j385o93l65o93j404j885j767j218p47p86j351
57574A26902j990k202k035k000k311k525k226j694j476j512j275o56j56j14l44
57559A04386o14r24j118p40K84J197J149K75m04j50P76J624K067K355K671K654
57543A15488J790K05j224j657j087k01L85N46M78L43J03m33j373k395k768k038
57527A06162o22N60J052J110J073Q97N39L51O97J348J671J451J166J324J791J999
57511A22569J728J356J284J408J357J125J055J209J162O34m0l67m54q40j678k480
$$ y = [187379, 186311, 184800, 182579, 180274, 178672, 177781, 176904, 175541, 173888, 172303, 170667, 168620, 166303, 164380, 163214, 162401, 161382, 160209, 159379, 159044, 158802, 158314, 157756, 157499, 157468, 157058, 155723, 153544, 151185, 149278, 147909, 146683, 145173, 143263, 141145, 139196, 137811, 137118, 136753, 136060, 134656, 132771, 131004, 129786, 129039, 128253, 126902, 124912, 122710, 120675, 118675, 116364, 113839, 111613, 109919, 108443, 106931, 105656, 105000, 104844, 104730, 104386, 103772, 102848, 101730, 100990, 101274, 102471, 103620, 103895, 103491, 103341, 104117, 105741, 107808, 110163, 112834, 115488, 117278, 117483, 116259, 114602, 113515, 113314, 113699, 114245, 114723, 115066, 115169, 114736, 113363, 110968, 108200, 106162, 105540, 106100, 107152, 108262, 109335, 110232, 110771, 111122, 111819, 113167, 114838, 116289, 117455, 118779, 120570, 122569, 124297, 125653, 126937, 128345, 129702, 130827, 131882, 133091, 134253, 134887, 134847, 134480, 134026, 133186, 131508, 129028]
57495A29028k798k829l054l524l789l512k838k110j479r61o70p21r08q42m64j34
57479I8395o9K7M86J100J307Q30k07j553k884l710l730l191k554j870r72j07K54
57462H1552J30m3k04o47j202j239p00l33n32p43m21J37M68P01J038J137P65M55
57444H0319Q14J561J961J823J426Q60J77k32j20N1k17o14n40j14J74L89Q18J066
57426H9602N55k47k78N15J073Q85N93P41R15N66j03n39n24j38M16P53N79J70K6
57407I5560O0k46q27r84n04QR0m0j49m30r03j144r58p16o38l26N64J704K504K704
57387I5329K333J663J304J755K680L215L146K991K873K277J166L34J25j11p84
57372A20296j272j128j083j908l063l492l139k692k354j873j361j127r61m77J35
$$ y = [129028, 126230, 123401, 120347, 116823, 113034, 109522, 106684, 104574, 103095, 102134, 101464, 100743, 99835, 98993, 98529, 98395, 98326, 98353, 98839, 99939, 101246, 102076, 101869, 100316, 97432, 93722, 89992, 86801, 84247, 82377, 81405, 81298, 81552, 81682, 81639, 81435, 80788, 79586, 78347, 77647, 77314, 76782, 76039, 75618, 75755, 76223, 76924, 77962, 79099, 79864, 80319, 81133, 82694, 84655, 86478, 87904, 88764, 88941, 88709, 88589, 88640, 88423, 87809, 87269, 87155, 87329, 87718, 88536, 89602, 90157, 89910, 89632, 90147, 91220, 92105, 92698, 93439, 94354, 94920, 94817, 94278, 93754, 93616, 94032, 94785, 95364, 95534, 95560, 95620, 95374, 94547, 93563, 93059, 93067, 93157, 93117, 92968, 92538, 91635, 90491, 89533, 88817, 88179, 87853, 88417, 90121, 92625, 95329, 97662, 99325, 100629, 102384, 105064, 108279, 111425, 114416, 117289, 119566, 120732, 121066, 121191, 121080, 120296, 119024, 117896, 116813, 114905, 111842, 108350, 105211, 102519, 100165, 98292, 96931, 95804, 94843, 94366, 94501]
57357I4501N15R12J713K558K869K921L429M250M542M139L797L997M439M706M610
57342A43898L901K519J215R94J807K550K520K030J493Q25O9l70n16j007k000k609
57326A57319k127j152q45j432k116k212j809j422j427j806k123j908j178m41k0
57311A35301K99Q18J453J953K183K012J290K83l16j76J67J14n4M03J444K159K018
57294A51351J597J784K638L403L554L344L241L147K599J693J294J938K910L085
57280A87578K507K319K999L581L178K446K624L612M124L561K656K183K050K017
57266B27435K286K845L084K726K479K892L261K608J407J131K239L674M468M736
57252B67271M836M587L896L308L279L532L746M210N150N931N874N350N268N667
$$ y = [94501, 95016, 95928, 97641, 100199, 103068, 105989, 109418, 113668, 118210, 122349, 126146, 130143, 134582, 139288, 143898, 147799, 150318, 151533, 152527, 154334, 156884, 159404, 161434, 162927, 163752, 163821, 163451, 162935, 161928, 159928, 157319, 155192, 154040, 153195, 151763, 149647, 147435, 145626, 144204, 142777, 140971, 138848, 136940, 135762, 135321, 135301, 135600, 136418, 137871, 139824, 142007, 144019, 145309, 145592, 145276, 145100, 145267, 145381, 145327, 145730, 147174, 149333, 151351, 152948, 154732, 157370, 160773, 164327, 167671, 170912, 174059, 176658, 178351, 179645, 181583, 184493, 187578, 190085, 192404, 195403, 198984, 202162, 204608, 207232, 210844, 214968, 218529, 221185, 223368, 225418, 227435, 229721, 232566, 235650, 238376, 240855, 243747, 247008, 249616, 251023, 252154, 254393, 258067, 262535, 267271, 272107, 276694, 280590, 283898, 287177, 290709, 294455, 298665, 303815, 309746, 315620, 320970, 326238, 331905]
57238C31905N758N248M669M405M266M145M331M862N260N222N069N224N676O210
57224D02250O707P026P023O925P251Q078Q892R342R784J0626J1611J2072J1710
57211E19297J0788R822R278R391J0015J0770J1445J2082J2667J3096J3443J3883
57199F55977J4258J4241J4047J4433J5661J7035J7816J8117J8426J8706J8552
57188H37269J8036J7799J8332J9483K0682K1455K1799K2220K3256K4861K6506
57177A071698K7864K9001K9845L0077K9861L0032L1077L2361L2885L2485L1679
57166A408865L0709K9419K7965K6894K6416K6129K5622K4945K4319K3668K2758
57155A697709K1615K0666K0347K0680K1258K1677K1796K1590K1024K0341K0201
$$ y = [331905, 337663, 342911, 347580, 351985, 356251, 360396, 364727, 369589, 374849, 380071, 385140, 390364, 396040, 402250, 408957, 415983, 423006, 429931, 437182, 445260, 454152, 463494, 473278, 483904, 495515, 507587, 519297, 530085, 539907, 549185, 558576, 568591, 579361, 590806, 602888, 615555, 628651, 642094, 655977, 670235, 684476, 698523, 712956, 728617, 745652, 763468, 781585, 800011, 818717, 837269, 855305, 873104, 891436, 910919, 931601, 953056, 974855, 997075, 1020331, 1045192, 1071698, 1099562, 1128563, 1158408, 1188485, 1218346, 1248378, 1279455, 1311816, 1344701, 1377186, 1408865, 1439574, 1468993, 1496958, 1523852, 1550268, 1576397, 1602019, 1626964, 1651283, 1674951, 1697709, 1719324, 1739990, 1760337, 1781017, 1802275, 1823952, 1845748, 1867338, 1888362, 1908703, 1928904]
57144A928904K1030K2431K3625K4341K4779K4994K4953K5035K5558K5813K4567
57133B196030K1685J8324J5281J2184Q737N662L722K669J901J540K148M024P304
57120B301211J2101J7841K3257K7680L1632L5361L7667L7235L4584L1815L0801
57109B621185L2382L6694M3244N1118O0019P0812Q4580J01972J24377J54824J96299
57098C577506K49379L12288L82501M57194N33081O07537O79914P50541Q18558
57089H368499Q81265R34577R72588R87004R68240R08018Q03575O64879N20118
57080A6008763M07347L49883L35930L26441K86426K07938J04131j2032j38974
57071A7875853k81336m40718o11540p81068r31815j046947j116414j139007j119971
$$ y = [1928904, 1949934, 1972365, 1995990, 2020331, 2045110, 2070104, 2095057, 2120092, 2145650, 2171463, 2196030, 2217715, 2236039, 2251320, 2263504, 2272241, 2277903, 2281625, 2284294, 2286195, 2287735, 2289883, 2293907, 2301211, 2313312, 2331153, 2354410, 2382090, 2413722, 2449083, 2486750, 2523985, 2558569, 2590384, 2621185, 2653567, 2690261, 2733505, 2784623, 2844642, 2915454, 3000034, 3102006, 3226383, 3381207, 3577506, 3826885, 4139173, 4521674, 4978868, 5511949, 6119486, 6799400, 7549941, 8368499, 9249764, 10184341, 11156929, 12143933, 13112173, 14020191, 14823766, 15488645, 16008763, 16416110, 16765993, 17101923, 17428364, 17714790, 17922728, 18026859, 18014827, 17875853, 17594517, 17153799, 16542259, 15761191, 14829376, 13782429, 12666015, 11527008, 10407037]
57062A0407037j068146r94254r08648q18801p29141o42962n63254m91656m28068
57053C762107l71902l23077k81518k46542k17081j92104j70635j51926j35698
57044A671624j21861j10041r9648r0243q1445p2804o4187n6047m8747m1893l4837
57033H49871k7570k0568j3920p154K91Q745J7951K6429L1633L1571K6156J6480
57021I39915L292j2816k9918m4702n4357n8201n7396n3747m8868m3853l9200l5012
57009D65137l1203k7514k3678j9858j6692j4538j2960j1330r630q221p138o126
56997B76249n113m186l261k253j345o40J99J549L214M681N763O674P662Q902J0330
56982C08425J1215J0369P382L218q87m640q228j1244j2969j3340j2765j1367r260
$$ y = [10407037, 9338891, 8344637, 7435989, 6617188, 5888047, 5245085, 4681831, 4190175, 3762107, 3390205, 3067128, 2785610, 2539068, 2321987, 2129883, 1959248, 1807322, 1671624, 1549763, 1439722, 1340074, 1249831, 1168386, 1095582, 1031395, 975348, 926601, 884708, 849871, 822301, 801733, 787813, 780659, 780950, 789695, 807646, 834075, 865708, 897279, 923435, 939915, 943207, 930391, 900473, 855771, 801414, 743213, 685817, 632070, 583202, 539349, 500149, 465137, 433934, 406420, 382742, 362884, 346192, 331654, 318694, 307364, 297734, 289513, 282375, 276249, 271136, 266950, 263689, 261436, 260091, 259451, 259650, 261199, 264413, 269094, 274857, 281531, 289193, 298095, 308425, 319640, 330009, 337391, 340609, 339722, 335082, 326854, 315610, 302641, 289301, 276536, 265169, 255909]
56969B55909p183n797m608k622M3K349M062O126R093J2357J5243J7753J9730K0237
56955C42692J8453J4527R090K542m547j0968j5508j7798j8179j7111j5129j2935
56943B75129j0972r019o621l749p89J999M697P553J0762J4379J8224K1924K4922
56930C48439K6361K5200K0887J3967N697k834j0846j7406k1617k3510k4099k4203
56918C16036k3643k1926j9301j6631j4536j2954j1513r958q285o666n301m264
56906A61058l522l013k607k075j315m87K50R54J613J936J917K298L779N801O996
56891A73583O993P029Q416J1025J3745J5774J6862J6691J4872J1496P152K414
56879C06052k278o313r010j0181j0240r580q190o049l582j279J017L984P839J1899
$$ y = [255909, 248726, 242929, 238321, 235699, 235742, 238091, 242153, 248279, 257372, 269729, 284972, 302725, 322455, 342692, 361145, 375672, 384762, 387304, 382757, 371789, 356281, 338483, 320304, 303193, 288064, 275129, 264157, 255138, 248517, 244768, 243979, 245978, 250675, 258228, 268990, 283369, 301593, 323517, 348439, 374800, 400000, 420887, 434854, 440551, 437717, 426871, 409465, 387848, 364338, 340239, 316036, 292393, 270467, 251166, 234535, 219999, 207045, 195532, 185574, 177289, 170623, 165322, 161058, 157536, 154523, 151916, 149841, 148526, 148039, 148289, 149243, 150856, 152792, 154709, 157007, 160786, 166587, 173583, 180576, 187605, 196021, 207046, 220791, 236565, 253427, 270118, 284990, 296486, 303638, 306052, 303774, 297461, 288451, 278270, 268030, 258450, 250260, 244211, 240629, 239350, 240367, 244351, 252190, 264089]
56865B64089J5409J8543K2133K6520L1156L5258L8128L8686L5462K7820J6984
56854E70188N280n476j4563k1668k6358k8282k7499k4448j9868j4573r060l363
56842C80310K562Q549J4589K1083K8272L5763M3094N0337N7374O2696O3772N8779
56830H27180M7561L1105J0967j0576l0581m6297n6072n9693n8325n3990m8330
56819E52949m1695l3797k5093j6797r484k523M774J2215J9366K6521L4274M2334
56807E63044M9101N2358N0267M2151K8751J1817o509k3871l7745m6247m9237m8225
56795E85655m4904m0169l4473k8452k2748j7606j2977q782m858r64L012P137J1660
56782C91531J6597K0983K3200K2307J8593J2668M740m738j4363k2410k7877l0671
$$ y = [264089, 279498, 298041, 320174, 346694, 377850, 413108, 451236, 489922, 525384, 553204, 570188, 575468, 569992, 555429, 533761, 507403, 479121, 451622, 427174, 407306, 392733, 383673, 380310, 382872, 391421, 406010, 427093, 455365, 491128, 534222, 584559, 641933, 704629, 768401, 827180, 874741, 905846, 916813, 906237, 875656, 829359, 773287, 713594, 655269, 601279, 552949, 511254, 477457, 452364, 435567, 426083, 423560, 428334, 440549, 459915, 486436, 520710, 563044, 612145, 664503, 714770, 756921, 785672, 797489, 790980, 767109, 729364, 683117, 633880, 585655, 540751, 500582, 466109, 437657, 414909, 397303, 384326, 375544, 370686, 369722, 372734, 379871, 391531, 408128, 429111, 452311, 474618, 493211, 505879, 510619, 505881, 491518, 469108, 441231, 410560]
56770D10560l1159l0005k8069k5906k3504k0804j8049j5383j2564r618p383o700
56758A81416p196p566o940n563m103k918k092j717j797k013j897j308o24l87o67
56743A34628r97r69p38o64o94m64N9N25O83N23L2o67j017n33L13M81j49n17J00
56724A29935J062J383J086Q65R69J136J289J566J806J615R05p3j059j775j781
56709A38929q35O45J864K351K097J252N7r99j433j210o89j67L62R50J451J478
56693A46103P18n99j599j516n36M19Q00Q09P47O22O18J186K223K783K193J031
56677A56002M31P48J459J991K022J323o6j527k253j967j000J57J075J467J415
56662A61277J264J052M16n69j029l56Q07J290Q24R3l45m71l18J29N33L84l15r95
$$ y = [410560, 379401, 349396, 321327, 295421, 271917, 251113, 233064, 217681, 205117, 195499, 188116, 181416, 174220, 166654, 159714, 154151, 150048, 147130, 145038, 143321, 141524, 139511, 137614, 136306, 135682, 135295, 134628, 133631, 132662, 131924, 131260, 130566, 130102, 130161, 130686, 131369, 131892, 131924, 131257, 130240, 129707, 130020, 130501, 130352, 129835, 129935, 130997, 132380, 133466, 134331, 135300, 136436, 137725, 139291, 141097, 142712, 143617, 143544, 142485, 140710, 138929, 138094, 138739, 140603, 142954, 145051, 146303, 146360, 145361, 143928, 142718, 142029, 141862, 142224, 143174, 144625, 146103, 146821, 146222, 144623, 143107, 142571, 142990, 143790, 144599, 145346, 145968, 146586, 147772, 149995, 152778, 154971, 156002, 156433, 157181, 158640, 160631, 162653, 163976, 163910, 162383, 160130, 158163, 157163, 157320, 158395, 159862, 161277, 162541, 163593, 164009, 163440, 162411, 162055, 162862, 164152, 164976, 165069, 164724, 164253, 163935, 164064, 164597, 164981, 164666, 163671]
56644A63671j253j228j167j072q14l70O1P7n45j321j340m83J63l53j434j678p44
56627A50170L28N70Q1n40r63j143j090r64r68j032r08o17m12l50k70k20m09p22
56609A40541p14k37L00M30J81m5P2M19N04K7n31k73Q84J860J740R63N79P53Q37
56590A48290O64P32J148J338R77M70J91M2k5L04J095J792J906J654J605K025K769
56573A66977L463L577K736J307L45O95K204M000N232N584N375N303N828O663P151
56558B26440P109O894O684O154N033L507J868J20j800l653m981n418m933l965
56544B39059l169k758k267j318m63n73j543k298k193j650j236r43o64o66j007
56529B16311j155q00m89p85j236r84j61K07l41j118j366j190j132j295j425j538
$$ y = [163671, 162418, 161190, 160023, 158951, 158137, 157767, 157828, 157905, 157360, 156039, 154699, 154216, 154379, 154026, 152592, 150914, 150170, 150498, 151068, 151149, 150609, 149646, 148503, 147413, 146449, 145481, 144449, 143541, 142924, 142512, 142162, 141892, 141672, 141263, 140541, 139827, 139590, 139890, 140320, 140501, 140456, 140528, 140947, 141451, 141478, 140947, 140674, 141558, 143418, 145158, 146121, 146700, 147453, 148290, 148954, 149686, 150834, 152172, 153149, 153619, 153810, 153852, 153827, 154131, 155226, 157018, 158924, 160578, 162183, 164208, 166977, 170440, 174017, 176753, 178060, 178405, 179100, 181304, 185304, 190536, 196120, 201495, 206798, 212626, 219289, 226440, 233549, 240443, 247127, 253281, 258314, 261821, 263689, 263809, 262009, 258356, 253375, 247957, 243024, 239059, 235890, 233132, 230865, 229547, 229084, 228511, 226968, 224670, 222477, 220827, 219591, 218648, 217984, 217318, 216311, 215156, 214356, 213867, 213082, 211846, 210862, 210701, 210908, 210567, 209449, 208083, 206893, 205761, 204466, 203041, 201503]
56513B01503j932k591l054k986k561k081j553r17m87o57j230j560j416j233j351
56498A75894j464j210p84n19k13N08J430J921J786J432J231J249J522K038K416
56483A87237K124J202L75K59P69J306J316O63k37o45j83P42J400J504J273R58
56467B00063O70N47N66L92j69o99o94l43j28P9P73J670J797Q98j04l83k34k62
56449B04439k71L45J472K295K372K102J985J808R21o84j976j941r21l04p33j273
56433B09636q17L57J174J332J323J180L71r67j823j555n95L90J195J679J496P05
56417B15081J0o8K30M52N67P18Q09O44J36p15j638j879r33M85J008M10q8M12J256
56398B16897J411J002R05J353J798J809J465J026P41Q28J190J375J092O05L47
$$ y = [201503, 199571, 196980, 193926, 190940, 188379, 186298, 184745, 183828, 183341, 182684, 181454, 179894, 178478, 177245, 175894, 174430, 173220, 172436, 171917, 171704, 172212, 173642, 175563, 177349, 178781, 180012, 181261, 182783, 184821, 187237, 189361, 190563, 190938, 191197, 191966, 193272, 194588, 195251, 195014, 194369, 194186, 194928, 196328, 197832, 199105, 200063, 200733, 201280, 201846, 202238, 202069, 201370, 200676, 200333, 200205, 200284, 201057, 202727, 204524, 205422, 205318, 204935, 204701, 204439, 204168, 204513, 205985, 208280, 210652, 212754, 214739, 216547, 217468, 216784, 214808, 212867, 211946, 211642, 210909, 209636, 208819, 209176, 210350, 211682, 213005, 214185, 214556, 213589, 211766, 210211, 209616, 210006, 211201, 212880, 214376, 215081, 215091, 215023, 215253, 215705, 216272, 216990, 217799, 218443, 218579, 217864, 216226, 214347, 213414, 213899, 214907, 215317, 215229, 215641, 216897, 218308, 219310, 220215, 221568, 223366, 225175, 226640, 227666, 228407, 229235, 230425, 231800, 232892, 233497, 233844]
56383B33844M42P84J218J455J175M93j00l71n17n76k86K27L01l37j070j195p50
56366B34737j59L72P46P86O20P75J469K166K197J485M39m02n07K26J022R45K17
56349B47134m6L54L36n78j237o40M54Q09P05J272K555L581L982M286M745N073
56333B72785N224N384N265M485L525L298L715L783L204K772K987L266K944K173
56319C24810J306J97j247k381k405j417l55O9j8m7K31N59O63P44J266K310L421
56302C27706M189M663N047N285N239M961M544L985L396L098L190L409L609M055
56288C86376M835N420N282M617M063L999M469N430O586P258P004O225N804O234
56274D63602P411Q937J0322J1205J1745J2529J3761J4955J5749J6563J7948J9748
$$ y = [233844, 234286, 235070, 236288, 237743, 238918, 239411, 239311, 238940, 238423, 237847, 237561, 237788, 238089, 237752, 236682, 235487, 234737, 234578, 234950, 235696, 236482, 237102, 237877, 239346, 241512, 243709, 245194, 245633, 245231, 244724, 244950, 245972, 246917, 247134, 247088, 247442, 247778, 247200, 245963, 245323, 245777, 246586, 247291, 248563, 251118, 254699, 258681, 262967, 267712, 272785, 278009, 283393, 288658, 293143, 296668, 299966, 303681, 307464, 310668, 313440, 316427, 319693, 322637, 324810, 326116, 326313, 325066, 322685, 320280, 318863, 318508, 318577, 318559, 318512, 318743, 319302, 319965, 320709, 321975, 324285, 327706, 331895, 336558, 341605, 346890, 352129, 357090, 361634, 365619, 369015, 372113, 375303, 378712, 382321, 386376, 391211, 396631, 401913, 406530, 410593, 414592, 419061, 424491, 431077, 438335, 445339, 451564, 457368, 463602, 471013, 479950, 490272, 501477, 513222, 525751, 539512, 554467, 570216, 586779, 604727, 624475]
56262F24475K1450K3115K5321K8420L2294L6729M1641M7043N3103N9931O7279
56251A060801P4749Q2421R0588R8777J05908J11798J17484J23359J27928J29397
56241B123210J27719J24052J18683J10672R9223Q4456O6970M7598K7485P589j1802
56230B925855l0635m8373o4255p7867q8876r6829j01894j05219j07739j09075
56220B095093j08455j06115j02819r8619r3258q7307q1629p6105p0155o4270n9662
56209A146699n6391n3167m9106m4615m0382l6609l3361l0738k8459k6096k3751
56198G24024k1750j9818j7467j4987j3083j1616r863p944o716o230n560m383l469
56185E81138l249l106k574k114k085j946j159j74K14p9n13o37k39P32J931K736
$$ y = [624475, 645925, 669040, 694361, 722781, 755075, 791804, 833445, 880488, 933591, 993522, 1060801, 1135550, 1217971, 1308559, 1407336, 1513244, 1625042, 1742526, 1865885, 1993813, 2123210, 2250929, 2374981, 2493664, 2604336, 2703559, 2788015, 2854985, 2902583, 2930068, 2937657, 2925855, 2895220, 2846847, 2782592, 2704725, 2615849, 2519020, 2417126, 2311907, 2204168, 2095093, 1986638, 1880523, 1777704, 1679085, 1585827, 1498520, 1416891, 1340786, 1270631, 1206361, 1146699, 1090308, 1037141, 988035, 943420, 903038, 866429, 833068, 802330, 773871, 747775, 724024, 702274, 682456, 664989, 650002, 636919, 625303, 615440, 607496, 600780, 594550, 588990, 584607, 581138, 577889, 574783, 572209, 570095, 568010, 566064, 564905, 564731, 564945, 564866, 564353, 563716, 563477, 564209, 566140, 568876]
56169E68876K893K803K975L476M105M721N299N847O372O796P109P664Q938J0718
56155F48592J2143J2843J3428J4341J5099J5508J6676J9593K3443K6673K9306
56144H47645L2666L7125M1727M6017N0745N6450O2630O8620P4073P8263P9936
56133A475897P8283P3460O6148N7430M9050M2628L8394L5270L2135K8227K2730
56122A999652J5150O116l068j1611j9125k5049k9483l4177m1082m9962n8804o6323
56110A682234p2544p7100p8822p7342p3530o8076o1049n3089m5512l8837l2538
56099A003795k6499k1330j7057j2979r064o107m252k707j170k6R23K417M174N055
56085I15173N018N305O345P166P269P403Q053Q713R142R801J0652J1023J1043
$$ y = [568876, 571769, 574572, 577547, 581023, 585128, 589849, 595148, 600995, 607367, 614163, 621272, 628936, 637874, 648592, 660735, 673578, 687006, 701347, 716446, 731954, 748630, 768223, 791666, 818339, 847645, 880311, 917436, 959163, 1005180, 1055925, 1112375, 1175005, 1243625, 1317698, 1395961, 1475897, 1554180, 1627640, 1693788, 1751218, 1800268, 1842896, 1881290, 1916560, 1948695, 1976922, 1999652, 2014802, 2020918, 2017850, 2006239, 1987114, 1962065, 1932582, 1898405, 1857323, 1807361, 1748557, 1682234, 1609690, 1532590, 1453768, 1376426, 1302896, 1234820, 1173771, 1120682, 1075170, 1036333, 1003795, 977296, 955966, 938909, 925930, 916866, 910759, 906507, 903800, 902630, 902604, 903527, 905944, 910118, 915173, 920191, 925496, 931841, 939007, 946276, 953679, 961732, 970445, 979587, 989388, 1000040, 1011063, 1022106]
56072A022106J1588J2616J3171J3200J3592J4261J4181J3491J3471J4176J4237
56061A170090J3472J3243J3787J3621J2332J1466J1845J2390J2536J3334J5125
56050A313241J6569J7052J7645J8618J8691J7852J8231K0645K3012K3825K4496
56039A529877K6447K8575K9642L0687L2891L5306L6807L8099L9749M0543L9968
56028A908591L9953M1785M3619M3499M2715M3485M5380M6779M7977N0035N2213
56017B406031N3355N4474N7270O1306O4944O7932P0942P3877P6553P9703Q3522
56006C149909Q6920Q9731R3655R9408J05286J10285J15950J23135J30026J35660
55996D239965J42285J51489J61194J69467J78202J89764K03075K16410K30959
$$ y = [1022106, 1033694, 1046310, 1059481, 1072681, 1086273, 1100534, 1114715, 1128206, 1141677, 1155853, 1170090, 1183562, 1196805, 1210592, 1224213, 1236545, 1248011, 1259856, 1272246, 1284782, 1298116, 1313241, 1329810, 1346862, 1364507, 1383125, 1401816, 1419668, 1437899, 1458544, 1481556, 1505381, 1529877, 1556324, 1584899, 1614541, 1645228, 1678119, 1713425, 1750232, 1788331, 1828080, 1868623, 1908591, 1948544, 1990329, 2033948, 2077447, 2120162, 2163647, 2209027, 2255806, 2303783, 2353818, 2406031, 2459386, 2513860, 2571130, 2632436, 2697380, 2765312, 2836254, 2910131, 2986684, 3066387, 3149909, 3236829, 3326560, 3420215, 3519623, 3624909, 3735194, 3851144, 3974279, 4104305, 4239965, 4382250, 4533739, 4694933, 4864400, 5042602, 5232366, 5435441, 5651851, 5882810]
55987E882810K48112K66249K83902L03059L25717L50410L75894M04658M38840
55978H879651M76424N15809N60108O12444O71353P35993Q11181R01728J006627
55969A5171318J125129J263874J431666J632621J871917K163288K523913K968429
55961C0152155L515724M192834N020915O005734P155259Q499031J0076423J1915276
55953H6533351J4039159J6485107J9291525K2469873K5978447K9632187L2899700
55946B47329349L4753534L3871415K9235801K0753662R433185k976152j4586608
55939C57814186k3890781l0059788l3006976l3231054l1519064k8664035k5308564
55932A52133924k1902687j8713059j5858960j3370625j1240788r443887p938933
$$ y = [5882810, 6130922, 6397171, 6681073, 6984132, 7309849, 7660259, 8036153, 8440811, 8879651, 9356075, 9871884, 10431992, 11044436, 11715789, 12451782, 13262963, 14164691, 15171318, 16296447, 17560321, 18991987, 20624608, 22496525, 24659813, 27183726, 30152155, 33667879, 37860713, 42881628, 48887362, 56042621, 64541652, 74618075, 86533351, 100572510, 117057617, 136349142, 158819015, 184797462, 214429649, 247329349, 282082883, 315954298, 345190099, 365943761, 375376946, 372400794, 357814186, 333923405, 303863617, 270856641, 237625587, 206106523, 177442488, 152133924, 130231237, 111518178, 95659218, 82288593, 71047805, 61603918, 53664985]
55925E3664985o681053n634355m769167m053981l459294k965152k557076k218227
55917B1326680j932290j690320j487685j316970j169741j042424r34373q42170
55909A0910707p60853o88722o26066n70967n20613m74908m34774l98661l64433
55900F070710l32887l05795k82202k59995k39405k21713k06247j91652j78388
55891C852426j67024j55999j44069j33017j24771j17699j09021r9294r1198q5331
55881B625003q0441p6593p4828p4486p3877p2958p2752p2748p1426o8772o6062
55870A820060o3750o1530n9579n7838n5072n0710m6489m4285m3318m1582l8953
55859A256954l6697l4923l2807l0448k8398k6115k2979k0042j8630j8105j7102
$$ y = [53664985, 46983932, 41349577, 36580410, 32526429, 29067135, 26101983, 23544907, 21326680, 19394390, 17704070, 16216385, 14899415, 13729674, 12687250, 11752877, 10910707, 10149854, 9461132, 8835066, 8264099, 7743486, 7268578, 6833804, 6435143, 6070710, 5737823, 5432028, 5149826, 4889831, 4650426, 4428713, 4222466, 4030814, 3852426, 3685402, 3529403, 3385334, 3252317, 3127546, 3009847, 2900826, 2801532, 2710334, 2625003, 2544562, 2467969, 2393141, 2318655, 2244778, 2171820, 2099068, 2026320, 1954894, 1886122, 1820060, 1756310, 1694780, 1635201, 1577363, 1522291, 1471581, 1425092, 1380807, 1337489, 1295907, 1256954, 1220257, 1185334, 1152527, 1122079, 1093681, 1067566, 1044587, 1024545, 1005915, 987810, 970708]
55848I70708j6159j6754j8471j9459j9329j9293j9713j9670j8923j8258j7873
55837G66806j7114j5884j4825j4110j3378j2662j2200j1613j0484r270q485p665
55825F19116o380n454n816o857p472p873q738r422q900p793p482p679o870m912
55811E17468l228k514k052j300l96Q43K825M977O079N972N556N280M859M277L668
55796E52314K360m27m093p209r388j1153j2332j2139j0814r466q312o735n058
55783D57548m596n667p164q420r850j1419j2027j1115r541q244p101n714m249
55770C52441l017k035j432j453j788j762j361j273j724k195k392k536k567k024
55756C24882r43J8N36Q18P76n6j642l445n378p756j0269j2073j3005j3643j3939
$$ y = [970708, 954549, 937795, 919324, 899865, 880536, 861243, 841530, 821860, 802937, 784679, 766806, 749692, 733808, 718983, 704873, 691495, 678833, 666633, 655020, 644536, 635266, 626781, 619116, 612736, 607282, 601466, 594609, 587137, 579264, 570526, 561104, 552204, 544411, 536929, 529250, 522380, 517468, 514240, 511726, 509674, 508374, 507978, 508821, 511646, 516623, 522702, 528674, 534230, 539510, 544369, 548646, 552314, 554674, 554247, 550154, 542945, 533557, 522404, 510072, 497933, 487119, 477653, 469341, 462606, 457548, 452952, 447285, 440121, 431701, 421851, 410432, 398405, 387290, 377749, 369505, 362404, 356690, 352441, 349424, 347389, 345957, 344504, 342716, 340954, 339593, 338320, 336596, 334401, 332009, 329473, 326906, 324882, 323939, 323957, 324493, 325311, 326087, 326031, 324389, 320944, 315566, 307810, 297541, 285468, 272463, 258820, 244881]
55741B44881j3096j1064q987p670o631n224l723k665j984j421j096j140j288j264
55727A77628j077o99r2L13j33j320k340k636k538k448k270j851j275n37M07J116
55711A60248J026M29J87M39N06K59L91J045J334P74O5j71l90j063j605j367q47
55694A61260r19j425j572j320j313j701j904j519p19K28J203J984K282K146J952
55679A58663J953K100K224K207J996J691J458J282R57M40j03o25j279j934k032
55664A68998j250k5Q65J176J381K084L394M805N601N443M607L537K409J219Q9
55649B04333q40j664k467l021l208l462m253n254n639n229m605m118l549k846
55635A54178k439k443k287j569p28m28o88j002j036q41o62q06j374j956j918j188
$$ y = [244881, 231785, 220721, 211734, 204064, 197433, 192209, 188486, 185821, 183837, 182416, 181320, 180180, 178892, 177628, 176551, 175852, 175760, 176073, 175940, 174620, 172280, 169644, 167106, 164658, 162388, 160537, 159262, 158725, 159132, 160248, 161274, 161703, 161890, 162329, 162835, 163094, 163485, 164530, 165864, 166638, 166703, 166532, 166142, 165079, 163474, 162107, 161260, 160341, 158916, 157344, 156024, 154711, 153010, 151106, 149587, 148868, 149096, 150299, 152283, 154565, 156711, 158663, 160616, 162716, 164940, 167147, 169143, 170834, 172292, 173574, 174531, 174971, 174868, 174243, 172964, 171030, 168998, 167748, 167723, 168588, 169764, 171145, 173229, 176623, 181428, 187029, 192472, 197079, 200616, 203025, 204244, 204333, 203493, 201829, 199362, 196341, 193133, 189671, 185418, 180164, 174525, 169296, 164691, 160573, 157024, 154178, 151739, 149296, 147009, 145440, 144712, 144284, 143596, 142594, 141558, 140717, 140055, 139249, 137875, 135919, 134001, 132813]
55619A32813m14j70m13q57j405j933k072j628r47n60o34r90j384j597j496j233
55603A15080j154j312j391j221j024r88r38o77l63k47k70k28j59l36q61j476j719
55586A00716j325m68L91R82J419J831K065K006J903K012K201K275K494L199M133
55571A25834M646M575M346M311M416M475M199L197J445l28j387j948k731l796
55557A51254m627n129n568n588m470k492r83o59q40o56r2N41J170J585J318M64
55541A25228k16m21o92j190j141j53Q98J034M44k52j084k110k607k058j365j775
55525A12540k972l458k693j651j273j429j554j388r45m14k73q17j575j818j594
55510H8686j559j743j437m51L70K86l94q56p92l73J80N46K83n77j164o68N01J082
$$ y = [132813, 132399, 132229, 131816, 130959, 129554, 127621, 125549, 123921, 122974, 122414, 121780, 120790, 119406, 117809, 116313, 115080, 113926, 112614, 111223, 110002, 108978, 107990, 107052, 106375, 106012, 105765, 105495, 105267, 105108, 104772, 103911, 102435, 100716, 99391, 98923, 99314, 100296, 101715, 103546, 105611, 107617, 109520, 111532, 113733, 116008, 118502, 121701, 125834, 130480, 135055, 139401, 143712, 148128, 152603, 156802, 159999, 161444, 161116, 159729, 157781, 155050, 151254, 146627, 141498, 135930, 130342, 125872, 123380, 122397, 121738, 120898, 120242, 120150, 120691, 121861, 123446, 124764, 125228, 125012, 124591, 123899, 122709, 121568, 121415, 122313, 123347, 123791, 123539, 122455, 120345, 117738, 115680, 114315, 112540, 109568, 106110, 103417, 101766, 100493, 99064, 97510, 96122, 95177, 94763, 94490, 93673, 92098, 90280, 88686, 87127, 85384, 83947, 83496, 83866, 84152, 83758, 82902, 82110, 81737, 81917, 82463, 82746, 82169, 81005, 80337, 80838, 81920]
55492H1920N38l29n46k55k51n89m46N52J592J727J110O13N38M18Ol58l81k42j38
55473H5479n3q3m30q56p66j48J86k63q67p42M1O49N64J1n01o03k67J24J01j89
55453H1387l9Q01J564J364K97q08j437j646j557j191o98k82K4L16O07R29J349
55436H0980J686J553R77N45N92P02L94j07l13k62k72k87j13O1l0j58PK23J04r7
55416H6185J34N99O09J80J04P23J364J215K23j063k034k285j833j198r41j024
55400H0958r65n96j88J07L99O72P57P62R79J295J245P31K19N1R5J25J07p3n83
55381H6097j169j189m53M25P43M51j06p09j228j406j115o33l13j56O8L42M05J48
55363H0202k13m16m53n27p22q17n13J54Q05J175J349J405J103K90o24j047r75
$$ y = [81920, 82458, 82129, 81583, 81328, 81077, 80488, 80042, 80594, 82186, 83913, 85023, 85636, 86174, 86592, 86598, 86240, 85859, 85617, 85479, 85426, 85343, 84913, 84057, 83291, 83143, 83329, 83066, 82199, 81457, 81498, 82147, 82711, 82722, 82221, 81618, 81351, 81475, 81576, 81387, 81348, 82149, 83713, 85077, 85374, 84566, 83129, 81483, 79926, 78735, 78037, 77755, 77779, 78095, 78702, 79631, 80980, 82666, 84219, 85196, 85741, 86333, 87035, 87429, 87322, 87009, 86747, 86475, 86188, 86075, 86136, 86106, 85948, 85955, 86178, 86282, 86185, 86319, 86918, 87527, 87707, 87811, 88534, 89898, 91113, 91336, 90273, 88239, 85954, 84121, 82923, 81982, 80958, 79993, 79397, 79209, 79316, 79715, 80387, 81144, 81906, 82885, 84180, 85425, 86156, 86375, 86426, 86521, 86646, 86753, 86680, 86097, 84928, 83739, 83286, 83711, 84454, 84905, 84799, 84090, 82862, 81456, 80341, 79708, 79395, 79239, 79307, 79649, 80054, 80202, 79989, 79573, 79120, 78593, 77871, 77054, 76541, 76695, 77500, 78675, 80024, 81429, 82532, 82822, 82198, 81151, 80176]
55346H0176r26j071r34r2J105J839J694J044O36Q43J322J429R35J88m18q10r91
55329H5969q02k22L75N83L80n2n80q95n28M40J035N05o16j224j169j183j500j521
55311G8995r47l14r1o3J16L91O77J091J448J180J76q55j294j363j480j413p15
55294G5539L90J200J419J310J120Q72O39N42N13L55M0l33p31j083j119o70J6M90
55276H0509O33O18N02J61l36o26m82q9J71J45j5j23j99l28l76r2M19N76O3n13
55256H0618k11R44J822J574O67J63L89P83Q42N76J02o47j567k151j899r18J56
55239H1243P87R69J027J088R14K98n20j020r72o63m41k60J82R06J428J151N9j046
55221H5130j163j31J072J286M15n57q10n75o28j213j761j619p43K85Q07O30J57
$$ y = [80176, 79250, 78179, 77245, 77153, 78258, 80097, 81791, 82835, 83471, 84314, 85636, 87065, 88000, 88188, 87770, 86960, 85969, 85167, 84945, 85320, 85903, 86283, 86231, 85651, 84756, 84228, 84668, 85703, 86208, 85592, 84368, 83199, 82016, 80516, 78995, 78048, 77734, 77643, 77580, 77696, 78087, 78764, 79855, 81303, 82483, 82659, 81804, 80510, 79147, 77667, 76254, 75539, 75929, 77129, 78548, 79858, 80978, 81850, 82489, 83031, 83544, 83899, 83939, 83606, 82875, 81792, 80673, 80003, 80019, 80509, 81142, 81760, 82262, 82423, 82087, 81461, 80979, 80890, 81061, 81206, 81191, 81068, 80869, 80541, 80165, 80073, 80492, 81068, 81131, 80618, 80407, 81351, 83173, 84747, 85414, 85577, 85966, 86749, 87591, 88167, 88269, 87622, 86055, 83904, 82005, 81087, 81243, 82030, 82999, 84026, 85114, 86028, 86326, 85806, 84786, 83814, 83151, 82710, 82450, 82632, 83538, 84966, 86117, 86176, 85130, 83967, 83836, 84908, 86194, 86609, 86052, 85242, 84667, 84039, 82826, 81065, 79446, 78703, 78988, 79795, 80425, 80582]
55204H0582k2K92P38Q27M91J20J22N80J226J639J468O55m45j194j173n66K0K00
55186H5560J53K04L19K99L17P97J616J969J280j2r41j025n47k9J97M1l01m26j21
55167H9350L64O34O21M76K20j88n50o33n00l39r8L03N28J64n77r40n82nJ11l24
55147H8035p81p05NQ72J215Q49K92J07K82N20P32Q31L82p72j821j713n74M10N80
55128H8746M57O19P77L87m56j239j607j349l38J008J711J202M5o88n68M7O47R75
55110I0376J006R37J007J102P90j3o42m01N70J429J561J063M36M0j46l08m64m21
55092I7922j64rq7J5N79J042P03jJ27J263K150J845R19L54J52j98n72m80k2K31
55072A05769J20r5l17n77o10j96K72J88l75q31r48r62r15n84oM55O57P45O80K87
$$ y = [80582, 80560, 80852, 81590, 82417, 82908, 83028, 83150, 83730, 84956, 86595, 88063, 88718, 88273, 87079, 85906, 85340, 85360, 85560, 85713, 85917, 86236, 86535, 86852, 87649, 89265, 91234, 92514, 92502, 91561, 90536, 89989, 89960, 90157, 90198, 89897, 89471, 89350, 89714, 90348, 90969, 91445, 91665, 91477, 90927, 90294, 89794, 89455, 89357, 89660, 90188, 90352, 89775, 88835, 88253, 88248, 88359, 88035, 87254, 86549, 86554, 87426, 88641, 89490, 89782, 89889, 90171, 90691, 91423, 92254, 92636, 91864, 90043, 88330, 87756, 88166, 88746, 89203, 89822, 90599, 90986, 90530, 89291, 87684, 86335, 85997, 87005, 88716, 89918, 89963, 89275, 88707, 88754, 89401, 90376, 91382, 92319, 93326, 94428, 95218, 95205, 94563, 94162, 94732, 96161, 97722, 98785, 99221, 99261, 99115, 98807, 98343, 97922, 97758, 97749, 97662, 97677, 98256, 99298, 100001, 100000, 100127, 101390, 103540, 105385, 106304, 106658, 106810, 106612, 106040, 105560, 105538, 105769, 105889, 105794, 105477, 104900, 104290, 104094, 104366, 104554, 104179, 103348, 102400, 101438, 100523, 99939, 99933, 100388, 101045, 101790, 102470, 102757]
55052A02757k10k71J36L79Oo24q94p57o79q85j024o81m5K10k30p78n97L11J132
55033I7256J284J012P68N84L45J84J87J23j49l77l72l28k88J46J105J898J806
55016A05184R78k0j030j984k253j290L25J440J805K081K457K267J180j10p13m62
55000A09855K18Q15R02L59l87p68p48p09p24n36k33k28n36p26o80p68j119j391
54982A02596j376j178o69M05J601J891J049J60K47R95J378J033M39J37K86P32
54966A09726J052P91np20r19q22q12q77q01n75k83J02N05O25L52l3k52l27k42
54947A06485J48O62P49K30l55n10m01l45k28Q2K96K40L34Q79J357J196Q17J045
54929A12681J804K317K449K830L618M154M084L970M297M626M265L284K252J328
$$ y = [102757, 102547, 102276, 102412, 102791, 102797, 102173, 101279, 100522, 99843, 98958, 97934, 97253, 97208, 97418, 97188, 96410, 95813, 96124, 97256, 98540, 99552, 100320, 100904, 101249, 101433, 101620, 101743, 101594, 101217, 100845, 100517, 100229, 100375, 101480, 103378, 105184, 106162, 106142, 105112, 103128, 100875, 99585, 99910, 101350, 103155, 105236, 107693, 109960, 111140, 111030, 110317, 109855, 110073, 110888, 111790, 112149, 111762, 110994, 110246, 109537, 108813, 108277, 108044, 107816, 107280, 106554, 105874, 105106, 103987, 102596, 101220, 100042, 99373, 99778, 101379, 103270, 104319, 104479, 104726, 105721, 107099, 108132, 108571, 108708, 108994, 109726, 110778, 111569, 111564, 110844, 109925, 109103, 108291, 107414, 106613, 106038, 105755, 105857, 106362, 106987, 107339, 107306, 107054, 106727, 106485, 106633, 107295, 108044, 108274, 107919, 107409, 107008, 106663, 106435, 106517, 106813, 107053, 107387, 108266, 109623, 110819, 111636, 112681, 114485, 116802, 119251, 122081, 125699, 129853, 133937, 137907, 142204, 146830, 151095, 154379, 156631, 157959]
54915A57959J86j259k614l511l973m166m098l729l290l149l271l078k085p13%
54900A19209l80j128j303q52l82j75n6j9k39m27R2J383K525K701K208K005K487
54883A27649L194L563L535L426L581M104M734M897M160K603O85j230k955m207
54869A57739m593m090l258k760k751k853k727k371j950j543j207j105j328j651
54855A23552j665j255p93p25j028j217q95k44J05k93j217j942j929j350q69r15
54839A07320j261j364r98m63j92l20o41q62q34n52j15L27O16O79O01N40O09P72
54821A03862Q41N84o9q08j036l98P71J662J764J318R19Q26Q45P42N35L35J08k36
54803A12565n82o31k84J36J95m3j6N99J336J489J063P11P31O59N3p95j310j358
$$ y = [157959, 158145, 156886, 154272, 150761, 146788, 142622, 138524, 134795, 131505, 128356, 125085, 122007, 119922, 119209, 119209, 118829, 117701, 116398, 115546, 115164, 114989, 114933, 114914, 114675, 114248, 114340, 115723, 118248, 120949, 123157, 125162, 127649, 130843, 134406, 137941, 141367, 144948, 149052, 153786, 158683, 162843, 165446, 166131, 164901, 161946, 157739, 153146, 149056, 145798, 143038, 140287, 137434, 134707, 132336, 130386, 128843, 127636, 126531, 125203, 123552, 121887, 120632, 119839, 119114, 118086, 116869, 115974, 115730, 115835, 115542, 114325, 112383, 110454, 109104, 108235, 107320, 106059, 104695, 103697, 103234, 103042, 102722, 102081, 101219, 100385, 99833, 99718, 100045, 100661, 101340, 101941, 102481, 103090, 103862, 104703, 105287, 105218, 104410, 103374, 102976, 103747, 105409, 107173, 108491, 109410, 110236, 111081, 111823, 112358, 112693, 112801, 112565, 111983, 111352, 111068, 111204, 111399, 111356, 111340, 111939, 113275, 114764, 115827, 116538, 117269, 117928, 117981, 117186, 115876, 114518]
54785A14518j111n32M39J366J632J286J035J307J800K091K208K373K562K603K520
54770A36097K502K707L205L995M860N347N068M047K674J354K31p85j730k402k639
54755A64531k686l016l605l870l572l376l902m611m329k844j191l19j37j30j65
54740A26778k80k46J42O43R06R61J097J414J791K035J876J196N28Q74K539M446
54724A46700N138M372L223K733K912L058K584J363l86k263l814m698m873m649
54710A51400m466m464m296l584k542j788j520j258o23Q4L49J48j82n45j031j476
54694A24206j488j016m49j38o6l1L9J05J24N9j52n04q89j119j088r44r83j240
54676A14426j306p78J65Q91J022O97J93k81m96l63k74p01j338j269k20R75J519
$$ y = [114518, 113407, 112875, 113314, 114680, 116312, 117598, 118633, 119940, 121740, 123831, 126039, 128412, 130974, 133577, 136097, 138599, 141306, 144511, 148506, 153366, 158713, 163781, 167828, 170502, 171856, 172087, 171302, 169572, 167170, 164531, 161845, 158829, 155224, 151354, 147782, 144406, 140504, 135893, 131564, 128720, 127529, 127210, 127073, 126943, 126778, 126498, 126252, 126394, 127037, 127943, 128904, 130001, 131415, 133206, 135241, 137117, 138313, 138841, 139715, 142254, 146700, 151838, 156210, 159433, 162166, 165078, 168136, 170720, 172083, 171697, 169434, 165620, 160922, 156049, 151400, 146934, 142470, 138174, 134590, 132048, 130260, 128740, 127482, 126859, 126943, 127292, 127440, 127258, 126713, 125682, 124206, 122718, 121702, 121253, 121115, 121049, 121018, 121057, 121162, 121286, 121345, 121193, 120689, 119800, 118681, 117593, 116649, 115666, 114426, 113120, 112342, 112507, 113398, 114420, 115117, 115310, 115029, 114533, 114170, 113896, 113195, 111857, 110588, 110368, 111343, 112862]
54659A12862J518J331Q07l5l27N57J650J317m75j983j945r32j07L52R25J547J619
54642A18681R56qp98j197j056l49N25Q97N02k27o77p03o06o09n54j71M83R92R91
54623A17072N41P0n7J52L85L98K25L4k02o01r77q07O9J043J323Q34J20m38p84
54604A18400p45p1R51J589J523J057L89o02j643j935j276n33m72p09m80J66O20
54587A16229O88N15P2m75l77P79K100K304J381L74k60r41j696j761q13M00J032
54570A19551J013P42M90L96M22J79n82j300j099m3Q89J135R90P00J13m90l62N01
54552A23245J102Q85M93M72L45k56n53J92J251J409Q18N83Q92Q39Q9n30l43K60
54534A31193N88N19K01l98j229j874j995j822j828k048j977j182J09J128J321
$$ y = [112862, 114380, 115711, 116518, 116483, 116156, 116713, 118363, 119680, 119205, 117222, 115277, 114345, 114238, 114590, 115515, 117062, 118681, 119637, 119629, 118831, 117634, 116578, 116229, 116754, 117651, 118153, 117926, 117249, 116546, 115940, 115331, 114777, 114606, 115089, 116081, 117072, 117613, 117683, 117626, 117778, 118163, 118561, 118786, 118820, 118618, 118017, 117040, 116233, 116302, 117345, 118668, 119502, 119622, 119184, 118400, 117655, 117584, 118535, 120124, 121647, 122704, 123093, 122491, 120848, 118913, 117637, 117104, 116632, 115923, 115443, 115609, 116229, 116917, 117432, 117504, 117029, 116652, 117431, 119531, 121835, 123216, 123590, 123330, 122389, 120693, 118932, 118119, 118519, 119551, 120564, 121306, 121796, 122192, 122614, 122793, 122211, 120911, 119812, 119769, 120658, 121793, 122783, 123483, 123596, 123106, 122744, 123245, 124347, 125232, 125725, 126197, 126542, 126286, 125733, 125925, 127176, 128585, 129403, 129986, 130878, 131717, 131806, 131276, 130933, 131193, 131781, 132300, 132501, 132103, 130874, 129000, 127005, 125183, 123355, 121307, 119330, 118148, 118257, 119385, 120706]
54519A20706R67Q47J235J578J318O59J70m9l38p38q85o29l40m13p54r42p41l59
54501A21292j39p6K26R76J683J619Q12J18J40N36O30L03j25m65o99o64k12M28
54483A26383Q52R36Q16O24M75N63Q70J054Q55M54J70J04L38J040J979K392J829
54466A41734P99N5l37o58p71m82k62o25j073o61M52J099P79K19O2M5j23j21K02
54447A40333K84k11o44l48K37K26l55o83m19j00k27o09p41m09J65O03O74N16M23
54428A38715M32L54K45M43Q31O38n58j961k328j431j73O70J143J563J851J728
54412A42162J119J52r35j735j796j099j43O12J214J865K369K267J458M18k68l48
54396A47312J03Q26J436J563J184O89M24K50j65p17r13o32m06o69j059q47L3Q61
$$ y = [120706, 121673, 122520, 123755, 125333, 126651, 127310, 127480, 127431, 127093, 126355, 125470, 124841, 124501, 124088, 123334, 122392, 121651, 121292, 121153, 121077, 121303, 122279, 123962, 125581, 126393, 126511, 126651, 127187, 127817, 128120, 127995, 127530, 126831, 126167, 125955, 126383, 127235, 128171, 128987, 129611, 130086, 130649, 131519, 132573, 133428, 133882, 134052, 134156, 134494, 135534, 137513, 139905, 141734, 142533, 142588, 142251, 141593, 140822, 140340, 140078, 139453, 138380, 137719, 138171, 139270, 140049, 140268, 140330, 140375, 140252, 140131, 140333, 140617, 140406, 139762, 139414, 139651, 139877, 139522, 138839, 138420, 138320, 138093, 137484, 136743, 136334, 136499, 137102, 137776, 138292, 138715, 139147, 139501, 139746, 140189, 141020, 141658, 141100, 139139, 136811, 135380, 135207, 135877, 137020, 138583, 140434, 142162, 143281, 143433, 142498, 140763, 138967, 137868, 137725, 138337, 139551, 141416, 143785, 146052, 147510, 147928, 147660, 147312, 147415, 148241, 149677, 151240, 152424, 153113, 153537, 153787, 153622, 152905, 151992, 151360, 150954, 150285, 149226, 148379, 148412, 149273]
54378A49273J019O10J58LJ51L93M50K14j5J80P46J122R97Q00J130J974K753L021
54360A64979K797K333J816J331Q98M65j0n17j054j657k314k915l357l540l244
54345A56011k308j066k75l08p02q15o63o37o42j91O57J128P93K32K00N67N76K4
54327A52581m94n29m72r48j797k159j532m28K22J50j30j30N7J44K12N05Q58P65
54309A46875O6q31j460j676j454p53J72P39P24O31R52J300Q65l67j487j795j432
54292A41069p44K88J531K235J792P06M7P9J25k30n22k99J02J52n3q0L5m1j52K41
54272A46281J084J513R65j8m34l0N90Q44P49O33O71Q32R93R74O80L48M23J031
54254A58129J685J811J403R10N26j3q63j661j939j649j069m01K06M49J57l15m30
$$ y = [149273, 150292, 150902, 151060, 151063, 151214, 151607, 152057, 152271, 152256, 152436, 153182, 154304, 155301, 156101, 157231, 159205, 161958, 164979, 167776, 170109, 171925, 173256, 174154, 174619, 174609, 174092, 173038, 171381, 169067, 166152, 162795, 159255, 156011, 153703, 152637, 152362, 152054, 151352, 150537, 149874, 149237, 148595, 148404, 149061, 150189, 150982, 151214, 151414, 151981, 152557, 152581, 152087, 151558, 151086, 150138, 148341, 146182, 144650, 144222, 144444, 144594, 144464, 144334, 144391, 144535, 144747, 145252, 146110, 146875, 146941, 146110, 144650, 142974, 141520, 140767, 140939, 141678, 142402, 143033, 143985, 145285, 146150, 145783, 144296, 142501, 141069, 140325, 140613, 142144, 144379, 146171, 146877, 146924, 147003, 147128, 146898, 146376, 146077, 146179, 146331, 146278, 146198, 146233, 146192, 146040, 146281, 147365, 148878, 149843, 149825, 149391, 149361, 149951, 150795, 151544, 152177, 152848, 153680, 154673, 155647, 156327, 156675, 157098, 158129, 159814, 161625, 163028, 163938, 164464, 164451, 163588, 161927, 159988, 158339, 157270, 156869, 157075, 157524, 157681, 157366, 156936]
54237A56936k22k93r12j595j718j184l22M95Q67N36j03j33P41J495R79m80j385
54220A53702q91L75J386J775J588P74m66j367j304o48l38p15j250j337r10k32
54204A50142M87J117J499J500J116N16N5J01O51J205J294J020P40L46o18k003
54188A59168k754k032l24R92J112M18k22l59q5K65L47J05m4L49J006J033J26p97
54170A58304p43o0N2p34j491j508j175j034q07m6P99R00K50l95o46p37p72n64
54152A49593k88m10q17p51J0O83N89J70K27P16R92Q87Q05Q80P54K37l11m65j95
54133A53306K52O59R35J068J021P06J13l56j08Q30J541J258L85m2J95L91J63L4
54115A62351M68J044J100O84L32K78L73N42Q34J172J482J882K368K527K096J554
$$ y = [156936, 156714, 156421, 155509, 153914, 152196, 151012, 150690, 151185, 152052, 152588, 152485, 152352, 153093, 154588, 155567, 155087, 153702, 152811, 153186, 154572, 156347, 157935, 158709, 158243, 156876, 155572, 154924, 154586, 153871, 152621, 151284, 150374, 150142, 150629, 151746, 153245, 154745, 155861, 156377, 156432, 156533, 157184, 158389, 159683, 160703, 161443, 161789, 161171, 159168, 156414, 154382, 154058, 155050, 156162, 156580, 156358, 155999, 155914, 156179, 156526, 156631, 156587, 156936, 157942, 158975, 159101, 158304, 157561, 157501, 157553, 156819, 155328, 153820, 152645, 151611, 150804, 150758, 151557, 152457, 152707, 152312, 151666, 150929, 150157, 149593, 149305, 148895, 148078, 147327, 147337, 148020, 148609, 148779, 149006, 149722, 150714, 151601, 152406, 153286, 154040, 154277, 153966, 153501, 153306, 153558, 154217, 155152, 156220, 157241, 157947, 158060, 157704, 157596, 158426, 159967, 161225, 161610, 161568, 161763, 162154, 162317, 162351, 162819, 163863, 164963, 165647, 165979, 166257, 166630, 167172, 168006, 169178, 170660, 172542, 174910, 177437, 179533, 181087]
54099A81087J592K059K185J806J517J439P54r43k585k785j682p76r78j628j564
54084A79498n44O45J131P71K65N06J602K601K545J648Q35L37m44j540j975j213
54068A86668j73L5l52m02j90o00j644k182j558m51K76O37R62J046O38K36N78J541
54050A85065K268K261J897J819K212K761L101L228L520M247N049N308N030M939
54036B32705N409N790N297M226L701M276N317N829N430M476L538K912K493K020
54022B93419J485J123R73P18J74l96p41j109j826k648l079l125l204l436l584
54007B74744l635l792l878l420k521j991k327l059l426l268k883k487k162k061
53993B33834k244k495k597k545k332j819j115p28r26j278j254j003j008j213j088
$$ y = [181087, 182679, 184738, 186923, 188729, 190246, 191685, 192439, 191496, 188911, 186126, 184444, 183668, 182690, 181062, 179498, 178954, 179599, 180730, 181501, 181766, 182272, 183874, 186475, 189020, 190668, 191503, 191840, 191396, 189856, 187881, 186668, 186495, 186530, 186178, 185776, 185586, 184986, 183342, 181160, 179602, 179151, 179427, 180064, 181026, 182072, 182710, 182946, 183524, 185065, 187333, 189594, 191491, 193310, 195522, 198283, 201384, 204612, 208132, 212379, 217428, 222736, 227766, 232705, 238114, 243904, 249201, 253427, 257128, 261404, 266721, 272550, 277980, 282456, 285994, 288906, 291399, 293419, 294904, 296027, 297000, 297718, 297892, 297496, 296755, 295646, 293820, 291172, 288093, 284968, 281764, 278328, 274744, 271109, 267317, 263439, 260019, 257498, 255507, 253180, 250121, 246695, 243427, 240544, 238057, 235895, 233834, 231590, 229095, 226498, 223953, 221621, 219802, 218687, 217959, 217033, 215755, 214501, 213498, 212490, 211277, 210189]
53978B10189n53j43j36q5M69J254J685J745J994K715L434L552L224L346M526O355
53962B43571P883Q719R276R873J0030Q996O644L489Q8l165n755p242p727p730
53948B76950p377o301m540k948k235k021j372j00J066J545J561J639J944K365
53934B60176K858L461M139M774N147M929L976K802K362L025M065M500M264M116
53920C14594M504N111N511N824O386P125P579P461O991O625O546O482O048N232
53906D02019M366L555K439P64r94k075k296k086j801j568j725k657m065n114n583
53891C83179o135p049p529o926n956n774o334o641o302n844n600n333n041n108
53877B97607n365n001l802k700k547l006l233l062k930l086l395l736m021m071
$$ y = [210189, 209636, 209493, 209357, 209272, 209741, 210995, 212680, 214425, 216419, 219134, 222568, 226120, 229344, 232690, 237216, 243571, 251454, 260173, 269449, 279322, 289352, 298348, 304992, 308481, 308569, 305404, 299649, 292407, 284680, 276950, 269573, 263272, 258732, 255784, 253549, 251528, 250156, 250056, 251122, 252667, 254228, 255867, 257811, 260176, 263034, 266495, 270634, 275408, 280555, 285484, 289460, 292262, 294624, 297649, 301714, 306214, 310478, 314594, 319098, 324209, 329720, 335544, 341930, 349055, 356634, 364095, 371086, 377711, 384257, 390739, 396787, 402019, 406385, 409940, 412379, 413143, 412149, 410074, 407778, 405692, 403891, 402323, 400598, 397941, 393876, 388762, 383179, 377044, 369995, 362466, 355540, 349584, 343810, 337476, 330835, 324533, 318689, 313089, 307756, 302715, 297607, 292242, 287241, 283439, 280739, 278192, 275186, 271953, 268891, 265961, 262875, 259480, 255744, 251723, 247652]
53863B47652l831l434k876k020j206j257k336l320l041j807r26r60j233j025m32
53848B17948R7L94M84L40o5o63j365j976k075j463o39l35n56o05j24M00M13K0
53830B10230l04l36o2N77J457K075J954J183L29j20o7K48M45L05K4L3M12P65Q05
53811B19953Q02J211K035K858L368L608L778M058M562N253N903O258O231N846
53797B75724N201M560M300M436M396L630K426J713J963K557K513J601M72k29n61
53782C14702r58j561k146k661l365m268m855m691m089l779l985m290m396m421
53768B65237m429m144l527l080l207l545l465k972k615k589k439j743p19l5j55
53753B26573r76j873k206j953j687j775j771j036K12J006Q26J43l43n20o31o79
$$ y = [247652, 243821, 240387, 237511, 235491, 234285, 233028, 230692, 227372, 224331, 222524, 221598, 220638, 219405, 218380, 217948, 218045, 218439, 218923, 219263, 219198, 218535, 217170, 215194, 213119, 211656, 211017, 210682, 210126, 209521, 209397, 209797, 210210, 210230, 209926, 209590, 209528, 210105, 211562, 213637, 215591, 216774, 217103, 216983, 216916, 217164, 217609, 217914, 217938, 217971, 218383, 219148, 219953, 220755, 221966, 224001, 226859, 230227, 233835, 237613, 241671, 246233, 251486, 257389, 263647, 269878, 275724, 280925, 285485, 289785, 294221, 298617, 302247, 304673, 306386, 308349, 310906, 313419, 315020, 315492, 315263, 314702, 313744, 312183, 310037, 307376, 304011, 299743, 294888, 290197, 286108, 282329, 278344, 274054, 269658, 265237, 260808, 256664, 253137, 250057, 246850, 243305, 239840, 236868, 234253, 231664, 229225, 227482, 226763, 226728, 226573, 225597, 223724, 221518, 219565, 217878, 216103, 214332, 213296, 213508, 214514, 215340, 215483, 215140, 214620, 213989, 213310]
53737B13310m86q3K82M49M25K84J69K93O39Q91Q39O82O87P45O39N63Q55J304J202
53718B23689L02o39o62L13J470K023J910J608J543J769K107K368K502K524K457
53703B45284K321K178K139K274K550K833K957K886K865L243L961M327L638K064
53689B85520N89q7l03q06j637k139j946j460j171r73n23Q0L49O1n08r78j167j035
53671B71866o61k91j66k42k90k96l85l71J64J122J693J322N19K08N27Q17O97M13
53653B76646J66k62q18q70m5J011J357R90P47J049J369J095M18R3O03J744K830
53636B88123L138K437J287O50R57J676J927J399N28j4J83J153K607M043N034N419
53620C20547N193M377L172K160J963K564L236L258K677K168K229K662K899K755
$$ y = [213310, 212824, 212741, 213023, 213472, 213897, 214181, 214350, 214643, 215282, 216173, 217012, 217694, 218381, 219126, 219765, 220328, 221183, 222487, 223689, 223991, 223352, 222690, 223003, 224473, 226496, 228406, 230014, 231557, 233326, 235433, 237801, 240303, 242827, 245284, 247605, 249783, 251922, 254196, 256746, 259579, 262536, 265422, 268287, 271530, 275491, 279818, 283456, 285520, 286109, 286022, 285719, 284913, 283276, 281137, 279191, 277731, 276560, 275587, 275064, 275144, 275493, 275554, 275046, 274068, 272901, 271866, 271205, 270914, 270748, 270506, 270216, 269920, 269535, 269164, 269328, 270450, 272143, 273465, 273984, 274192, 274719, 275536, 276233, 276646, 276812, 276550, 275732, 274862, 274817, 275828, 277185, 278175, 278922, 279971, 281340, 282435, 282853, 282946, 283549, 285293, 288123, 291261, 293698, 294985, 295635, 296592, 298268, 300195, 301594, 302122, 302108, 302291, 303444, 306051, 310094, 315128, 320547, 325740, 330117, 333289, 335449, 337412, 339976, 343212, 346470, 349147, 351315, 353544, 356206, 359105, 361860]
53606C61860K688L165L851L831K772J553J280J848K123J519P74P91J262J141J86
53591C90644p00p62l33j94n02q30r83j209j610j875j790j668j912k344k380j911
53575C69641j588j949k554k421j279K4N01O1o32j011r95o86j91K86M51K28j38
53558C57748l56l39j32K20O59J062J318J375J240R91P67O04L53j1j34M19J491
53541C67275K325K396J963J649J684J934K391L240M394N332N615N409N310N734
53527D16651O579P522Q513R732J1052J1863J1729J1083J0853J1336J1923J2086
53515E40922J2211J3007J4469J5854J6684J7254J8116J9321K0408K0983K1182
53504G30411K1475K1938K1907K0738J8884J7666J7688J8044J7655J6826J6636
$$ y = [361860, 364548, 367713, 371564, 375395, 378167, 379720, 381000, 382848, 384971, 386490, 387264, 388055, 389317, 390458, 390644, 389944, 389182, 388849, 388655, 388153, 387323, 386340, 385131, 383521, 381646, 379856, 378188, 376276, 373932, 371552, 369641, 368053, 366104, 363550, 361129, 359850, 359874, 360375, 360436, 359804, 358793, 357798, 357112, 356921, 357207, 357658, 357886, 357748, 357392, 357053, 356921, 357141, 357800, 358862, 360180, 361555, 362795, 363786, 364553, 365157, 365510, 365499, 365365, 365784, 367275, 369600, 371996, 373959, 375608, 377292, 379226, 381617, 384857, 389251, 394583, 400198, 405607, 410917, 416651, 423230, 430752, 439265, 448997, 460049, 471912, 483641, 494724, 505577, 516913, 528836, 540922, 553133, 566140, 580609, 596463, 613147, 630401, 648517, 667838, 688246, 709229, 730411, 751886, 773824, 795731, 816469, 835353, 853019, 870707, 888751, 906406, 923232, 939868]
53493I39868J7145J7234J6336J5334J5254J5943J6569J6840J6957J6859J6285
53482A120624J5461J5012J5138J5378J5312J5052J4901J4811J4381J3230J1351
53471A280651R146P150N531L982K153N7k110m354o729q984j0716j1881j2738j3323
53457A237835j3348j2811j2291j2381j3079j3975j4877j5919j7046j7743j7539
53446A076826j6648j5865j5686j5738j5302j4288j3276j2551j1614r973p979o396
53434I21510n297m075k474j006j30L93J044J858K604L361M398N647O738P512Q219
53419I50302R139J0295J1636J3201J5003J6856J8441J9497K0039K0384K0918K1660
53407A147371K2222K2384K2579K3534K5450K7880L0379L2867L5249L7181L8514
$$ y = [939868, 957013, 974247, 990583, 1005917, 1021171, 1037114, 1053683, 1070523, 1087480, 1104339, 1120624, 1136085, 1151097, 1166235, 1181613, 1196925, 1211977, 1226878, 1241689, 1256070, 1269300, 1280651, 1289797, 1296947, 1302478, 1306460, 1308613, 1308670, 1306560, 1302206, 1295477, 1286493, 1275777, 1263896, 1251158, 1237835, 1224487, 1211676, 1199385, 1187004, 1173925, 1159950, 1145073, 1129154, 1112108, 1094365, 1076826, 1060178, 1044313, 1028627, 1012889, 997587, 983299, 970023, 957472, 945858, 935885, 927906, 921510, 916213, 912138, 909664, 908658, 908528, 908921, 909965, 911823, 914427, 917788, 922186, 927833, 934571, 942083, 950302, 959441, 969736, 981372, 994573, 1009576, 1026432, 1044873, 1064370, 1084409, 1104793, 1125711, 1147371, 1169593, 1191977, 1214556, 1238090, 1263540, 1291420, 1321799, 1354666, 1389915, 1427096, 1465610]
53396A465610L9638M0999M2517M3900M5292M6974M8608M9435M9369M9185M9293
53385A970820M9012M7609M5493M3694M2458M1171L9494L7715L5893L3494L0229
53374B417082K6563K2993J9346J5280J0955O696K335k452p437j2108j6593k1617
53362B461043k7447l3309l8027m0975m2400m3095m3864m4909m5659m5425m4217
53351B011716m2688m1360m0231l9113l7914l6524l4856l3171l2036l1764l2095
53340A609964l2490l2465l1648l0005k8106k6713k5828k4652k2709k0492j8551
53329A316305j6556j4003j1454j0063r925r888r284q989j0133j2345j4044j4253
53317A175368j3403j2424j1697j1131j0661j0251r668q679p370o039m822l628
$$ y = [1465610, 1505248, 1546247, 1588764, 1632664, 1677956, 1724930, 1773538, 1822973, 1872342, 1921527, 1970820, 2019832, 2067441, 2112934, 2156628, 2199086, 2240257, 2279751, 2317466, 2353359, 2386853, 2417082, 2443645, 2466638, 2485984, 2501264, 2512219, 2518915, 2521250, 2518798, 2511361, 2499253, 2482660, 2461043, 2433596, 2400287, 2362260, 2321285, 2278885, 2235790, 2191926, 2147017, 2101358, 2055933, 2011716, 1969028, 1927668, 1887437, 1848324, 1810410, 1773886, 1739030, 1705859, 1673823, 1642059, 1609964, 1577474, 1545009, 1513361, 1483356, 1455250, 1428537, 1402709, 1378057, 1355348, 1334856, 1316305, 1299749, 1285746, 1274292, 1264229, 1254304, 1244416, 1235132, 1226143, 1216010, 1203665, 1189621, 1175368, 1161965, 1149541, 1137844, 1126713, 1116052, 1105801, 1096133, 1087454, 1080084, 1074045, 1069223, 1065595]
53305A065595k355r62O02K217L546M399N138O290P832R281J0613J2440J5004J7490
53291A157130J8871J9199J9478K0369K1502K2098K1849K1084K0234J9323J7898
53280A379035J5670J3194J1510J0840J0052P939M661J385j192l330n391p399r415
53267A427559j1605j3760j5461j6780j8161j9611k0721k1574k2694k3900k4342
53256A218950k4030k4195k5392k6350k5688k3924k2657k2353k2235k1864k1540
53245I58722k1256k0581j9669j9268j9541j9839j9790j9680j9536j8765j7182
53234G43615j5544j4583j4132j3596j2711j1495r982q450p416p013o799o515o481
53221F08898o954p640q262r057j0213j1244j1591j1465j1558j2075j2547j2397
$$ y = [1065595, 1063240, 1062278, 1062880, 1065097, 1068643, 1073042, 1078180, 1084470, 1092302, 1101583, 1112196, 1124636, 1139640, 1157130, 1176001, 1195200, 1214678, 1235047, 1256549, 1278647, 1300496, 1321580, 1341814, 1361137, 1379035, 1394705, 1407899, 1419409, 1430249, 1440301, 1448240, 1452901, 1454286, 1453094, 1449764, 1444373, 1436974, 1427559, 1415954, 1402194, 1386733, 1369953, 1351792, 1332181, 1311460, 1289886, 1267192, 1243292, 1218950, 1194920, 1170725, 1145333, 1118983, 1093295, 1069371, 1046714, 1024361, 1002126, 980262, 958722, 937466, 916885, 897216, 877948, 858407, 838568, 818778, 799098, 779562, 760797, 743615, 728071, 713488, 699356, 685760, 673049, 661554, 651572, 643122, 635706, 628693, 621894, 615379, 608898, 601944, 594304, 586042, 576985, 566772, 555528, 543937, 532472, 520914, 508839, 496292, 483895]
53209D83895j1439r997q850q699r368r832r425q575p946p453o692n989o078o970
53195C66582p925q471q734q719q147p132o251n712n096m277l926m591n736o268
53181B75597n729m479l011j600n68k80o77j192j327j164j147j427j622j240k76
53166B49858O65Q94K36q60j758k103j943j575j271j075q68o28n24o51p68n52m9
53149B37028L54L62J3n14j034j282j038m78j18j95l39j31K62L44N1j40R1M88O41
53130B34365N48N73R41J503J944K079J959J761J642J651J773J940J988J743J257
53115B57667Q79Q57R20N38l69j239j537j284p95k83j6m42j610k696k820k266k084
53098B43420k449k258q70O65R02J2n47q8N78N48n4o38r73r78m13N74J128O18l88
$$ y = [483895, 472456, 462459, 453609, 444910, 435542, 425710, 416285, 407710, 399764, 392311, 385619, 379630, 373552, 366582, 358657, 350186, 341452, 332733, 324586, 317454, 311203, 305491, 300395, 296118, 292192, 287601, 281865, 275597, 269868, 265389, 262378, 260778, 260210, 259930, 259253, 258061, 256734, 255570, 254423, 252996, 251374, 250134, 249858, 250523, 251417, 251653, 250793, 249035, 246932, 244989, 243414, 242143, 241068, 240200, 239572, 239048, 238397, 237629, 237077, 237028, 237382, 237744, 237757, 237243, 236209, 234927, 233889, 233411, 233293, 233098, 232759, 232628, 232890, 233234, 233285, 233145, 233236, 233724, 234365, 234913, 235486, 236427, 237930, 239874, 241953, 243912, 245673, 247315, 248966, 250739, 252679, 254667, 256410, 257667, 258546, 259403, 260323, 260861, 260492, 259253, 257716, 256432, 255637, 255354, 255338, 254896, 253286, 250590, 247770, 245504, 243420, 240971, 238713, 237843, 238508, 239410, 239422, 238875, 238787, 239365, 239913, 239859, 239221, 238248, 237270, 236857, 237431, 238559, 239177, 238789]
53079B38789p83l87n5m06j068j317r20j53N65Q34M63k58p46q14r15j465k178k379
53061B26807j820q97j14L85P29J030J231J209R57O49N15N69O52P14Q85J113J001
53044B35615L02n98j023q13m09k43l80q11j573k385k583j847o48K87P68J018J056
53027B25733P52L07J14J73J40K1K44Q61J288J125P41O96R27R84P26M07K58L36
53009B35833O14Q79P65K64j23p5j6m55j072j110n34p8j46l27j25M10J014J583
52991B37301K001K054J768J484J389J354J326J452J631J473R64P35J267K206K837
52976B61242K904K582J985J150K84l33o64p88o94l98r9J8%o2j87l05k04P6J33
52957B66640k11o27q65j215j915k513k457j987j733j641j069lP01M66j91m32j40
$$ y = [238789, 238006, 237619, 237564, 237158, 236090, 234773, 233853, 233700, 234265, 235099, 235562, 235304, 234558, 233744, 232829, 231364, 229186, 226807, 224987, 224090, 223976, 224361, 225090, 226120, 227351, 228560, 229517, 230166, 230681, 231250, 231902, 232616, 233501, 234614, 235615, 235917, 235319, 234296, 233483, 233074, 232831, 232451, 231640, 230067, 227682, 225099, 223252, 222604, 222891, 223659, 224677, 225733, 226485, 226792, 226906, 227079, 227219, 227240, 227484, 228345, 229633, 230758, 231499, 232195, 233122, 234106, 234832, 235239, 235497, 235833, 236447, 237326, 238091, 238355, 238232, 238157, 238141, 237686, 236614, 235504, 234970, 234892, 234746, 234419, 234294, 234704, 235718, 237301, 239302, 241356, 243124, 244608, 245997, 247351, 248677, 250129, 251760, 253233, 254197, 254932, 256199, 258405, 261242, 264146, 266728, 268713, 269863, 270147, 269814, 269150, 268362, 267668, 267270, 267171, 267189, 267189, 267127, 266940, 266635, 266431, 266507, 266640, 266429, 265802, 264937, 263722, 261807, 259294, 256837, 254850, 253117, 251476, 250407, 250404, 251105, 251571, 251380, 250948, 250808]
52940B50808J85K20P3j44n62j274k016k237j526p4J321J768R98l70j227q76K58
52923B45325R13L13q42j164l80L23L8n35j77R66J576J064K18j56l41r53j825k258
52905B42105k071j713j468j056k05P58J197R85P36R74J333R98mn95m5R04R92J69
52887B43994l90J5P03P02J00j76L09J010J166P98O09J008J484J273N26K70J050
52870B54451K184K780K906L144L427L151K242J244M18m38j250j579j463j488j867
52855B67862k181k283k600l175l287k595j880j991k631k942k749k455k094j415
52841B33584p03o11j114j375r09k59k42q39j278r79j99L79N03O08J126J801K029
52824B31522J684J163N72m52j866k762k264o27J009J705J339M18l56n22k13P3
$$ y = [250808, 250993, 251213, 251286, 251142, 250580, 249306, 247290, 245053, 243527, 243453, 244774, 246542, 247540, 247170, 245943, 245067, 245325, 246238, 246551, 245709, 244545, 244165, 244488, 244526, 243991, 243814, 244780, 246356, 247420, 247638, 247482, 247141, 246188, 244363, 242105, 240034, 238321, 236853, 235797, 235592, 236350, 237547, 238532, 239268, 240242, 241575, 242573, 242569, 241974, 241929, 242833, 243825, 243994, 243604, 243619, 244322, 245024, 245124, 244948, 245257, 246267, 247433, 248231, 248840, 249848, 251332, 252605, 253131, 253401, 254451, 256635, 259415, 262321, 265465, 268892, 272043, 274285, 275529, 275947, 275509, 274259, 272680, 271217, 269729, 267862, 265681, 263398, 260798, 257623, 254336, 251741, 249861, 247870, 245239, 242297, 239548, 237093, 234999, 233584, 232881, 232270, 231156, 229781, 228872, 228613, 228371, 227532, 226254, 225275, 225076, 225455, 225958, 226566, 227692, 229493, 231522, 233206, 234369, 234941, 234489, 232623, 229861, 227597, 226970, 227979, 229684, 231023, 231441, 231085, 230563, 230350, 230423]
52808B30423J89L94O06J87j026k131k196j502r88q93p09l21k28o18j021j106j058
52791B18002r93o23J10O67N91J63j6K00M30L00k37r10j246q71O8R14J139Q11L28
52772B18827j44o76j172j291q92k56K60O37J007J211Q73P0m86k50L79O20M34N29
52754B19680J164J650J351O32L44P66J564K417L135L396K975K154J439R18L85
52739B43970m5K3N69R98P75n2r82j424j021kQ02P35L5n33o63o76p96q57p92p91
52719B39273q58p12l50j92m13n56j82M80Q07N28j15p00r31p82m95l33k51l6K60
52700B34442L43J91J79M77P47N75j0o69j106j160q39m04j39R1N98J188J222O01
52682B36327P3J61L69K5n77o20l1M47L66k0m12p46p66p0J101J807J526Q66O77
$$ y = [230423, 230612, 231006, 231612, 231799, 230773, 228642, 226446, 224944, 223956, 223063, 222354, 222033, 221805, 221187, 220166, 219060, 218002, 217009, 216386, 216496, 217163, 217754, 217917, 217901, 218101, 218531, 218831, 218594, 217684, 216438, 215567, 215635, 216549, 217688, 218499, 218827, 218683, 218007, 216835, 215544, 214652, 214396, 214656, 215293, 216300, 217511, 218384, 218454, 217968, 217718, 218097, 218717, 219151, 219680, 220844, 222494, 223845, 224477, 224821, 225587, 227151, 229568, 232703, 236099, 239074, 241228, 242667, 243585, 243970, 243925, 243948, 244517, 245515, 246290, 246238, 245256, 243832, 242811, 242809, 243611, 244346, 244381, 243848, 243185, 242509, 241713, 240856, 240064, 239273, 238415, 237703, 237353, 237161, 236748, 236192, 236010, 236490, 237297, 237825, 237710, 237010, 236079, 235297, 234802, 234469, 234218, 234182, 234442, 234785, 234976, 235155, 235632, 236379, 236954, 236944, 236275, 235169, 234009, 233170, 232766, 232627, 232718, 233316, 234504, 235726, 236327, 236400, 236561, 236930, 236955, 236378, 235758, 235727, 236174, 236540, 236520, 236108, 235362, 234596, 234526, 235627, 237434, 238960, 239826, 240503]
52663B40503R47J130J137J354J826K134K118K125K356K510K311J922J521Q41m17
52648B64318j907k837k821k242j716j479j301q60j46M85O82N50M67M23K4o53q00
52631B50187J6R70J026M79M72J160J512J049N23M86L04n98j570j692j193q51o51
52614B51629n8P57J074Q04M76K51q4l18RO56Q76O32N77Q55Q51L56o6j14k15n89
52594B58359p57m49j21p7J52R37J773J959J536J003N33P0k34j27L95J165J899
52577B68016K099J394K01n72p47r68j417j376n69N5l34j170j426j133r98j127
52561B59928j188j283j625j739j063p3K87R7K13O80O01l08j175j275q91n46k33
52544B50407J64M43M93N61P71R06R20J055J275J169P09M62P71J217J282R52M39
$$ y = [240503, 241450, 242580, 243717, 245071, 246897, 249031, 251149, 253274, 255630, 258140, 260451, 262373, 263894, 264735, 264318, 262411, 259574, 256753, 254511, 252795, 251316, 250015, 249155, 249009, 249494, 250176, 250726, 251193, 251616, 251640, 250987, 250187, 250203, 251173, 252199, 252678, 253150, 254310, 255822, 256871, 257394, 257880, 258184, 257586, 256016, 254324, 253131, 252280, 251629, 251571, 252328, 253402, 254206, 254682, 254933, 254849, 254531, 254540, 255196, 256072, 256704, 257281, 258136, 258987, 259343, 259277, 259163, 258948, 258359, 257602, 257153, 257032, 256955, 257107, 258044, 259817, 261776, 263312, 264315, 264848, 264918, 264684, 264557, 264952, 266117, 268016, 270115, 271509, 271710, 271138, 270391, 269423, 268006, 266630, 266061, 266116, 265782, 264612, 263186, 262053, 261055, 259928, 258740, 257457, 255832, 254093, 253030, 252957, 253244, 253341, 253554, 254234, 254835, 254527, 253352, 252077, 251186, 250640, 250407, 250571, 251014, 251507, 252068, 252839, 253745, 254665, 255720, 256995, 258164, 258873, 259335, 260106, 261323, 262605, 263557, 263996]
52527B63996k13p90q49l59N2mL8Q83K268L191L082K270J404R35R75J309J509J376
52509B81073J215J436J940K171J663L90j260k650l226l023k665k663k813k581
52495B69007j889j173p12l72k6J35r4n78r87j180j194j038o26L6P91J466J922
52478B63488J963J421N04j67j71J80K61P5K95J176K007K046J593J578K288L139
52462B81676L573L540L096K168R13k67j281k440l668m202l506k161j336j513k186
52447B72406k641k602k118j309l99K60M53L00Q0r6l36o45p15k43M91P07J7r57
52429B62653j160l06Q55J397J022Q1q04j069n26M14J116J422J657J954K014J706
52413B72426J463J724K346K968L661M814O477Q152R201R174P958N904L660J626
$$ y = [263996, 263783, 262993, 262144, 261785, 261837, 261833, 261871, 262754, 265022, 268213, 271295, 273565, 274969, 275904, 276879, 278188, 279697, 281073, 282288, 283724, 285664, 287835, 289498, 289888, 288628, 285978, 282752, 279729, 277064, 274401, 271588, 269007, 267118, 265945, 265233, 264861, 264835, 264970, 264876, 264298, 263311, 262131, 260937, 259899, 259273, 259309, 260100, 261566, 263488, 265451, 266872, 267376, 267209, 267038, 267218, 267479, 267554, 267849, 269025, 271032, 273078, 274671, 276249, 278537, 281676, 285249, 288789, 291885, 294053, 294966, 294699, 293418, 290978, 287310, 283108, 279602, 277441, 276105, 274592, 272406, 269765, 267163, 265045, 263736, 263337, 263597, 264050, 264350, 264430, 264334, 263998, 263353, 262638, 262395, 262886, 263593, 263610, 262653, 261493, 261187, 262042, 263439, 264461, 264542, 263738, 262669, 262143, 262557, 263673, 265095, 266752, 268706, 270720, 272426, 273889, 275613, 277959, 280927, 284588, 289402, 295879, 304031, 313232, 322406, 330364, 336268, 339928, 341554]
52399C41554l46k484m496n811o257o176n876n337m502l517k590j751r67l02O8
52384B91210J06R7M53J176J652J371Q18J069K379L698M059L824L954M468M549
52369C24883L943L327L136K956K369J647J143N92l52j303j557j035l39L0J1k34
52353C39217m12j12P50J583J684J204R85J448K165K636K838K792K294J560J515
52338C62147K767M650N919O228O208O272O219O087O519P895R703J1249J2430J3390
52324D67683J3924J3827J3560J3862J4844J5860J6282J6012J5339J4766J4811
52313F30770J5591J6627J7471J8302J9445K0534K0833K0373K0020K0303K0804
52302H41073K0921K0578J9860J8660J7109J5770J4878J3774J1648Q621N545K952
$$ y = [341554, 341208, 338724, 334228, 328417, 322160, 315984, 310108, 304771, 300269, 296752, 294162, 292411, 291444, 291142, 291210, 291316, 291413, 291866, 293042, 294694, 296065, 296883, 297952, 300331, 304029, 308088, 311912, 315866, 320334, 324883, 328826, 332153, 335289, 338245, 340614, 342261, 343404, 343996, 343644, 342341, 340784, 339749, 339410, 339440, 339451, 339217, 338805, 338693, 339443, 341026, 342710, 343914, 344899, 346347, 348512, 351148, 353986, 356778, 359072, 360632, 362147, 364914, 369564, 375483, 381711, 387919, 394191, 400410, 406497, 413016, 420911, 430614, 441863, 454293, 467683, 481607, 495434, 508994, 522856, 537700, 553560, 569842, 585854, 601193, 615959, 630770, 646361, 662988, 680459, 698761, 718206, 738740, 759573, 779946, 799966, 820269, 841073, 861994, 882572, 902432, 921092, 938201, 953971, 968849, 982623, 994271, 1002892, 1008437, 1011389]
52290A011389P18j431l525n369o637p011o634o185o137o162n694m882m402m428
52276I43610m372l716k574j277J6J164J949K447L088M131N328O445P692R324J1067
52261I84322J2433J3493J4782J6452J7896J8432J8049J7286J6536J5794J4911
52250A160386J3858J2579J0894Q658O003L300R23r47k370l655n119o793q346r487
52236A179884j0315j1134j2039j2907j3683j4397j4874j4775j4008j2867j1720
52225A037165j0804j0275j0092r820r012p931p392p632p793o951n210l340j681
52212I39232l5J539K522K604K080J444R72P49Q20J195J929L107M553N660N905
52197I74276N565N490O093O923P330P169O660N834M490K575M50j369k648l651
$$ y = [1011389, 1012107, 1010676, 1007151, 1001782, 995145, 988134, 981500, 975315, 969178, 963016, 957322, 952440, 948038, 943610, 939238, 935522, 932948, 931671, 931687, 932851, 934800, 937247, 940335, 944466, 949794, 956239, 963931, 973255, 984322, 996755, 1010248, 1025030, 1041482, 1059378, 1077810, 1095859, 1113145, 1129681, 1145475, 1160386, 1174244, 1186823, 1197717, 1206375, 1212378, 1215678, 1216601, 1215654, 1213284, 1209629, 1204510, 1197717, 1189371, 1179884, 1169569, 1158435, 1146396, 1133489, 1119806, 1105409, 1090535, 1075760, 1061752, 1048885, 1037165, 1026361, 1016086, 1005994, 996174, 987162, 979231, 971839, 964207, 956414, 949463, 944253, 940913, 939232, 939197, 940736, 943258, 945862, 947942, 949386, 950358, 951107, 951927, 953122, 955051, 958158, 962711, 968371, 974276, 979841, 985331, 991424, 998347, 1005677, 1012846, 1019506, 1025340, 1029830, 1032405, 1032855, 1031486, 1028838, 1025187]
52183A025187m777o008o897p236p377p637p679o988n757m768m418m372m232l926
52169I43115l416k452r76O32J845K363K109J367R31J565L038M151L978K769J364
52154I62383K74l84n84m85m77o31m56L38J210J457J232J171J286J005K58k53r7
52137I67247K92L95M69J151K652M698P036R525J1858J3625J4737J5565J6668J8402
52123A084320K0695K2969K4421K4620K3980K3431K3580K4192K4564K4299K3585
52112A344656K2794K1985K0982J9770J8599J7615J6616J5313J3830J2682J2180
52101A537022J1944J1095R034N984K689l50l252o249r111j1316j2729j3717j4649
52088A506395j5622j6666j7808j8751j8912j8083j6654j4967j2964j0845r459
$$ y = [1025187, 1020410, 1014402, 1007505, 1000269, 992892, 985255, 977576, 970588, 964831, 960063, 955645, 951273, 947041, 943115, 939699, 937247, 936271, 936903, 938748, 941111, 943220, 944587, 945518, 947083, 950121, 954272, 958250, 961019, 962383, 962657, 962273, 961689, 961204, 960727, 960096, 959640, 959978, 961188, 962645, 963877, 965048, 966334, 967339, 967597, 967344, 967247, 967539, 967934, 968403, 969554, 972206, 976904, 983940, 993465, 1005323, 1018948, 1033685, 1049250, 1065918, 1084320, 1105015, 1127984, 1152405, 1177025, 1201005, 1224436, 1248016, 1272208, 1296772, 1321071, 1344656, 1367450, 1389435, 1410417, 1430187, 1448786, 1466401, 1483017, 1498330, 1512160, 1524842, 1537022, 1548966, 1560061, 1569095, 1575079, 1577768, 1577418, 1574166, 1567917, 1558806, 1547490, 1534761, 1521044, 1506395, 1490773, 1474107, 1456299, 1437548, 1418636, 1400553, 1383899, 1368932, 1355968, 1345123, 1335664]
52077A335664r262r229p813m947k167n70L89J782L754N869Q015J0205J1897J2595
52063A356182J2867J3853J5734J7519J8379J8405J7889J6715J4900J3019J1449
52052A526911R742P287M300J509p98k837m711o400q215j0427j2441j3182j2548
52039A478190j1766j1992j3117j4351j5320j6018j6218j5831j5571j6381j8097
52028A313528j9399j9345j8341j7394j6882j6460j5792j4874j3779j2504j1084
52017A137674r737q827q655r094r428q903p742p235q402j0734j2679j3349j3316
52004A009573j3605j4387j4973j4872j4380j4125j4342j4763j5046j5144j5254
51993H48682j5495j5768j5854j5712j5661j6133j7114j7885j7651j6482j5384
$$ y = [1335664, 1326402, 1317173, 1309360, 1304413, 1302246, 1301676, 1302065, 1303847, 1307601, 1313470, 1321485, 1331690, 1343587, 1356182, 1369049, 1382902, 1398636, 1416155, 1434534, 1452939, 1470828, 1487543, 1502443, 1515462, 1526911, 1536653, 1543940, 1548240, 1549749, 1548951, 1546114, 1541403, 1535003, 1526788, 1516361, 1503920, 1490738, 1478190, 1466424, 1454432, 1441315, 1426964, 1411644, 1395626, 1379408, 1363577, 1348006, 1331625, 1313528, 1294129, 1274784, 1256443, 1239049, 1222167, 1205707, 1189915, 1175041, 1161262, 1148758, 1137674, 1127937, 1119110, 1110455, 1101361, 1091933, 1083030, 1075288, 1068053, 1059651, 1048917, 1036238, 1022889, 1009573, 995968, 981581, 966608, 951736, 937356, 923231, 908889, 894126, 879080, 863936, 848682, 833187, 817419, 801565, 785853, 770192, 754059, 736945, 719060, 701409, 684927, 669543]
51982F69543j5194j5674j5958j5640j4943j3920j2205r770p389n818m867l714
51970E34451k004q1J701L346M770N483N154M145L099K146Q17j126l185m599n146
51955E48971n236n270n188m735l902k835j473L74K585M693O432Q009R661J1282
51941E63368J2666J3896J5200J6550J7743J8679J9188J8768J6989J4221J1511
51930G38779R479P646M898N02n405j1901j7719k1891k4309k5519k5935k5410k3728
51917E79487k1114j8095j5055j2267r986q185o424m374k368r70j51N65J252J430
51903D83745R17K21k21o83j666l160m747o268p823r267j0137j0079r122p590n935
51888D08185m538l371j965m2K025L658M840N878O641O752O568P131Q724J0120
$$ y = [669543, 654349, 638675, 622717, 607077, 592134, 578214, 566009, 556239, 548850, 543032, 538165, 534451, 532447, 532366, 534067, 537413, 542183, 547666, 552820, 556965, 560064, 562210, 563027, 561901, 558716, 554117, 548971, 543735, 538465, 533277, 528542, 524640, 521805, 520332, 520706, 523291, 527984, 534416, 542425, 552086, 563368, 576034, 589930, 605130, 621680, 639423, 658102, 677290, 696058, 713047, 727268, 738779, 748258, 755904, 760802, 761304, 755899, 743998, 726279, 704388, 680079, 654560, 628625, 603215, 579487, 558373, 540278, 525223, 512956, 502970, 494785, 488361, 483987, 481619, 480649, 480498, 481063, 482315, 483745, 484662, 484883, 484662, 483979, 482313, 479153, 474406, 468138, 460315, 451048, 440911, 430832, 421710, 414120, 408185, 403647, 400276, 398311, 398269, 400294, 403952, 408792, 414670, 421311, 428063, 434631, 441762, 450486, 460606]
51874D60606R898Q064N757L726J801k00j932l008l507l655l397k588j406l43J21
51859D69937j28o92r10n22o3l32j444k705l483l891m464n487o722p607p586o583
51843D17318n253m496m451m336l453k033q21q1M75J004J218Q50J21m33m23K9L21
51826C95556j41j289k340k584k116j538j130o55M8P12J037J107J163J193R31K75
51810C90229n30j087j167q16k86J90N21P55R57J076R93O69K41j10k93k95l3N49
51792C91563J103R63j21j482k112j721q52n8N57R13P04o9p50n76N74K266L973
51775C94875N262N882O043O316O904P311P058O335N523M494K979J268j32j331
51761D58787k812m493n785o531p114p624p632o991o183n626n237m833m422l916
$$ y = [460606, 470504, 478568, 484325, 488051, 489852, 489652, 487720, 484712, 481205, 477550, 474153, 471565, 470159, 469816, 469937, 469809, 469117, 468207, 467685, 467622, 467290, 465846, 463141, 459658, 455767, 451303, 445816, 439094, 431487, 423901, 417318, 412065, 407569, 403118, 398782, 395329, 393296, 392475, 392394, 392869, 393873, 395091, 395941, 396062, 395629, 395206, 395235, 395556, 395415, 394126, 391786, 389202, 387086, 385548, 384418, 383763, 383811, 384523, 385560, 386667, 387830, 389023, 389954, 390229, 389699, 388612, 387445, 386629, 386343, 386533, 387054, 387809, 388766, 389842, 390835, 391504, 391745, 391635, 391342, 391047, 391014, 391563, 392666, 393629, 393508, 392026, 389914, 388193, 387341, 387283, 387840, 388753, 389457, 389388, 388638, 388062, 388636, 390902, 394875, 400137, 406019, 412062, 418378, 425282, 432593, 439651, 445986, 451509, 456003, 458982, 460250, 460118, 458787, 455975, 451482, 445697, 439166, 432052, 424428, 416796, 409805, 403622, 397996, 392759, 387926, 383504, 379588]
51747C79588l130k244j677j321n67O98J832K489L153M222N261N715N704N544N062
51732D10329M060K947K202J677J115R66J844L457M810N242M656L031N23k086l910
51717D40863m805n139m910l897k524j642j433j379j295j527j964j855r53k2K44
51702D07762J20K17N65P96P10L16k59n79j39Q44J404R34j72j263k216l037l335
51685D02668k862k128j851k101k427k532k306j602n61K39N02P43J492K430L023
51670C92727L645N068P056Q463Q828Q923R422R815R084O882L654Q4l147n383o282
51655D58839n995m919l374j585K91K061L289L284J658j075l888o148p793q780
51641D25865q961q486p675o423m443k185p60o17r70r54o46m93m54l40m11q48j118
$$ y = [379588, 376458, 374214, 372537, 371216, 370649, 371347, 373179, 375668, 378821, 383043, 388304, 394019, 399723, 405267, 410329, 414389, 417336, 419538, 421215, 422330, 423296, 425140, 428597, 433407, 438649, 443305, 446336, 446859, 444773, 440863, 436058, 430919, 426009, 422112, 419588, 417946, 416513, 415134, 413839, 412312, 410348, 408493, 407540, 407518, 407762, 407882, 408099, 408664, 409460, 410170, 410486, 410227, 409648, 409509, 410353, 411757, 412691, 412519, 411256, 409040, 406003, 402668, 399806, 397678, 395827, 393726, 391299, 388767, 386461, 384859, 384298, 384537, 385039, 385782, 387274, 389704, 392727, 396372, 401440, 408496, 416959, 425787, 434710, 444132, 453947, 463031, 469913, 473567, 473651, 470504, 465121, 458839, 452844, 447925, 444551, 442966, 443257, 445318, 448607, 451891, 453549, 452474, 448586, 442438, 434645, 425865, 416904, 408418, 400743, 394320, 389877, 387692, 386932, 386315, 385345, 384391, 383745, 383252, 382798, 382458, 382047, 381199, 380081]
51624C80081p37k91p51j938k735k701k561k875l233l154l001l312l812l696k725
51609C42559j489p06n10l89L12J648K854L146K772K809L836N361O788Q205R646
51594C86842J0259R066O284L080J73k434m456n153m462l403k776k163p43J386
51580C91500L461N118O550P783Q603R143R847J0818J1713J2367J2921J3270J2993
51567E16087J2057J1140J0950J1639J3075J5258J8209K1733K5421K8605L0241
51556G14415K9505K6750K3205J9401J4632Q490K062l330p864j2546j7239k0746
51544G76735k2820k4604k6747k8335k8293k6821k4649k1843j8187j4179j0713
51533E29544q152o418n602n758o451p203q059r025r405q580p137o243o059n794
$$ y = [380081, 379344, 379053, 378302, 376364, 373629, 370928, 368367, 365492, 362259, 359105, 356104, 352792, 348980, 345284, 342559, 341070, 340364, 339854, 339465, 339777, 341425, 344279, 347425, 350197, 353006, 356842, 362203, 368991, 377196, 386842, 397101, 406167, 412451, 415531, 415704, 413270, 408814, 403661, 399199, 395796, 393020, 390857, 390114, 391500, 394961, 400079, 406629, 414412, 423015, 432158, 442005, 452823, 464536, 476903, 489824, 503094, 516087, 528144, 539284, 550234, 561873, 574948, 590206, 608415, 630148, 655569, 684174, 714415, 743920, 770670, 793875, 813276, 827908, 836398, 838460, 835130, 827266, 814720, 797481, 776735, 753915, 729311, 702564, 674229, 645936, 619115, 594466, 572623, 554436, 540257, 529544, 521392, 514974, 509372, 503614, 497163, 489960, 481901, 472876, 463471, 454891, 447754, 441511, 435452, 429658]
51519D29658n244n129n719o167n715m717l931l470k987k424j955j612j403j497
51505C77688j866k093j880j437j057o74k21Lk04n05m92k87j55J40R49J953K448
51488C72310K314K041J762J058j59j162j323r92j022j612k116k002j610j772k742
51473C62973l781l954l189k282j890j860j754j606j790k355k910l113k901k350
51459C27238j626j034p00k99N53J703K613L073L346L626L910M410N514P078Q331
51444C67736Q795Q893R284R941J0281R888Q720O880M676K688J332L79p45k280
51430D46468m045n831p457q483q450p443o066m825l861l279l194l356l217k684
51416C74277k306k434k582k066j009j67R3J42L81P19Q87Q94R64J276J885K698
$$ y = [429658, 424414, 419285, 413566, 407399, 401684, 396967, 393036, 389566, 386579, 384155, 382200, 380588, 379185, 377688, 375822, 373729, 371849, 370412, 369355, 368681, 368460, 368463, 368259, 367754, 367262, 366975, 366820, 366960, 367909, 369862, 372310, 374624, 376665, 378427, 379485, 379326, 378164, 376841, 375849, 374827, 373215, 371099, 369097, 367487, 365715, 362973, 359192, 355238, 352049, 349767, 347877, 346017, 344263, 342657, 340867, 338512, 335602, 332489, 329588, 327238, 325612, 324578, 323878, 323579, 324132, 325835, 328448, 331521, 334867, 338493, 342403, 346813, 352327, 359405, 367736, 376531, 385424, 394708, 404649, 414930, 424818, 433538, 440418, 445094, 447782, 449114, 449493, 448748, 446468, 442423, 436592, 429135, 420652, 412202, 404759, 398693, 393868, 390007, 386728, 383534, 380178, 376961, 374277, 371971, 369537, 366955, 364889, 363880, 363713, 363806, 363948, 364329, 365048, 365935, 366829, 367793, 369069, 370954, 373652]
51400C73652L360L413K806K117K060K836M046N163N956O635P676R340J1265J2771
51386D53096J3832J5410J8454K2679K6832L0119L2824L5529L8244M0616M2424
51375G70059M3381M2730L9609L3841K6133J7553Q991R23o703j4248k1763k8595
51363I11911l3961l7765m0445m2131m2427m1170l8850l6098l3137k9997k6826
51352E09104k3670k0341j6871j3865j1882j0701r619q386p343o713o222n527m596
51339C63368l548k494j611j082p58k90L46P80Q47Q77J085J185Q73L36j75q55j838
51322C57046k515k149j085n06q59j339j195p34n75o03l35J37L41K76L43N51N38
51305C47337K85J37L6n40j630k490k493j903j410j267j277j240j105q69o19m27
$$ y = [373652, 377012, 380425, 383231, 385348, 387408, 390244, 394290, 399453, 405409, 412044, 419720, 429060, 440325, 453096, 466928, 482338, 500792, 523471, 550303, 580422, 613246, 648775, 687019, 727635, 770059, 813440, 856170, 895779, 929620, 955753, 973306, 982297, 983220, 976517, 962269, 940506, 911911, 877950, 840185, 799740, 757609, 715182, 674012, 635162, 599064, 565927, 535930, 509104, 485434, 465093, 448222, 434357, 422475, 411774, 402155, 393769, 386426, 379713, 373491, 367964, 363368, 359820, 357326, 355715, 354633, 353875, 353585, 353931, 354711, 355558, 356435, 357520, 358705, 359578, 359914, 359739, 358884, 357046, 354531, 352382, 351297, 350791, 349932, 348593, 347398, 346664, 346089, 345486, 345151, 345288, 345629, 345905, 346248, 346799, 347337, 347622, 347759, 347795, 347255, 345625, 343135, 340642, 338739, 337329, 336062, 334785, 333545, 332440, 331571, 330952, 330525]
51289C30525JJ090K618L592L410K750K723L472M194M402M339M176L576K371J104
51274C74343M59M81O93Q36J128J815K696L184K891K139J695J789J652M18j618
51259C94601l176l500l126l002l354l793m105m323m263l648k711k182k393k782
51245C48243k567j716r14o19n29j84K59K35k60m69J31J060J496J431J475J718
51229C48790J543Q14L52P51J314R50k29j074r87n56m40m57j58L12N01M17M33O49
51211C52925Q67J107J610K265K599K488K443K814L164K805J805R52P70R85J045
51196C80644Q05N10L56L08K35Q3o0m0R4o7q39j812k081j323l04R6o0n8L02N06
51176C77295K50n7J09P32J386J674J401O11k63o37l95k5L0j12j10N7J83K62L84
$$ y = [330525, 330526, 331616, 334234, 337826, 341236, 343986, 346709, 350181, 354375, 358777, 363116, 367292, 370868, 373239, 374343, 374802, 375283, 375976, 376812, 377940, 379755, 382451, 385635, 388526, 390665, 392360, 394149, 395801, 396219, 394601, 391425, 387925, 384799, 381797, 378443, 374650, 370545, 366222, 361959, 358311, 355600, 353418, 351025, 348243, 345676, 343960, 343046, 342427, 341898, 341714, 341973, 342208, 341948, 341479, 341610, 342670, 344166, 345597, 347072, 348790, 350333, 351147, 351499, 352250, 353564, 354514, 354285, 353211, 352224, 351668, 351228, 350771, 350613, 350925, 351426, 351843, 352276, 352925, 353792, 354899, 356509, 358774, 361373, 363861, 366304, 369118, 372282, 375087, 376892, 377844, 378614, 379599, 380644, 381449, 381959, 382315, 382623, 382858, 382941, 382881, 382841, 382935, 382868, 382029, 380217, 378136, 376813, 376509, 376605, 376545, 376487, 376789, 377295, 377545, 377488, 377597, 378329, 379715, 381389, 382790, 383401, 383138, 382501, 382106, 382081, 382111, 381999, 381889, 381946, 382129, 382391, 382775]
51157C82775M01N0n78j033j051q34p78j076j587j975j951j532j070r49j163j308
51141C66341j007k59N36R60R71R40J211J653J812J506J098J025J291J571J694
51126C81343J753J860J917J724J238P25N85R26J337J383J255J501K097K325J809
51111D03778J164J080J245Q83J16p7P17J760K231K162J931J472O31j37j86L53
51095D19123O89N03L24N91R30Q09M19L59O69P70L85o0j42JM0J9J60M15O16Q19
51075D27439J072J137R85J203K309L724M282L787L255L422L984M723O327R226
51061D76875J2342J4189J4814J5572J7003J8041J7501J5490J3009J0858R401Q746
51049F43841Q646Q475P723O404M776K938Q45j459l813n963p577q408q460p797
$$ y = [382775, 383176, 383226, 382648, 381615, 380564, 379730, 378952, 377876, 376289, 374314, 372363, 370831, 369761, 368812, 367649, 366341, 365334, 365075, 365611, 366571, 367542, 368482, 369693, 371346, 373158, 374664, 375762, 376787, 378078, 379649, 381343, 383096, 384956, 386873, 388597, 389835, 390560, 391145, 392071, 393408, 394791, 396046, 397547, 399644, 401969, 403778, 404942, 406022, 407267, 408150, 408266, 408189, 408906, 410666, 412897, 415059, 416990, 418462, 419093, 418956, 418770, 419123, 419812, 420315, 420639, 421230, 422160, 422969, 423388, 423747, 424416, 425186, 425571, 425511, 425369, 425370, 425410, 425429, 425589, 426004, 426620, 427439, 428511, 429648, 430633, 431836, 434145, 437869, 442151, 445938, 449193, 452615, 456599, 461322, 467649, 476875, 489217, 503406, 518220, 533792, 550795, 568836, 586337, 601827, 614836, 625694, 635095, 643841, 652487, 660962, 668685, 675089, 679865, 682803, 683648, 682189, 678376, 672413, 664836, 656428, 647968, 640171]
51035F40171o372m513l403m303p062j0018j1713j2155j2081j1598j0252q022n521
51022E33158l327j592k49R26K308M029N614O485O828P433Q629R859J0517J0754
51008F01372J1090J1545J1562J0773R416P884O194M238K410J490J591J696O98
50995F81959j120k358k240j519j249j292o28J195L622O041Q471J1136J3822J5967
50981G31807J7227J7786J8185J8804J9431J9521J9091J9220K1190K5209L0316
50970I57787L5447M0176M4454M8284N1859N5555N9428O3045O6057O8510P0350
50959A560952P1009O9957O7352O3742N9325N3960M7734M0953L3694K5946J8190
50948B112814J1300N726J217k498n352p471r468j1717j3731j4894j5544j6709
$$ y = [640171, 633799, 629286, 625883, 621580, 614518, 604500, 592787, 580632, 568551, 556953, 546701, 538679, 533158, 529831, 528239, 527990, 528916, 531224, 535253, 540867, 547352, 554180, 561613, 570242, 580101, 590618, 601372, 612462, 624007, 635569, 646342, 655758, 663642, 669836, 674074, 676484, 677974, 679565, 681261, 681959, 680839, 678481, 676241, 674722, 673473, 672181, 671553, 672748, 676370, 682411, 690882, 702018, 715840, 731807, 749034, 766820, 785005, 803809, 823240, 842761, 861852, 881072, 902262, 927471, 957787, 993234, 1033410, 1077864, 1126148, 1178007, 1233562, 1292990, 1356035, 1422092, 1490602, 1560952, 1631961, 1701918, 1769270, 1833012, 1892337, 1946297, 1994031, 2034984, 2068678, 2094624, 2112814, 2124114, 2129840, 2131057, 2128559, 2123207, 2115736, 2106268, 2094551, 2080820, 2065926, 2050382, 2033673]
50936B033673j8726k0776k1964k2432k3104k4640k6985k9724l2570l5512l8683
50925A738557m2149m5767m9151n1813n3200n2931n1272m9299m8063m7334m5690
50914A201888m2166l7531l3426l0573k8344k5984k3496k1254j9311j7541j5985
50903I06277j4684j3453j2149j0936r982q987p474n473l626k471j891j360o46
50890H13145n7M2j63m4P01J656K321K903L997N511O643P095P650Q971J0411J0857
50874H81639J0492J0741J2354J4437J5754J6361J7284J9044K1206K3290K5492
50863A068094K8305L1846L5791L9876M4221M9180N4937O1388O8425P6229Q5004
50852A643296R4461J03908J12931J21636J30003J37472J43653J49068J54402J59101
$$ y = [2033673, 2014947, 1994171, 1972207, 1949775, 1926671, 1902031, 1875046, 1845322, 1812752, 1777240, 1738557, 1696408, 1650641, 1601490, 1549677, 1496477, 1443546, 1392274, 1342975, 1294912, 1247578, 1201888, 1159722, 1122191, 1088765, 1058192, 1029848, 1003864, 980368, 959114, 939803, 922262, 906277, 891593, 878140, 865991, 855055, 845073, 836086, 828612, 823139, 819513, 817042, 815151, 813791, 813145, 813088, 813130, 812967, 812923, 813624, 815280, 817601, 820504, 824501, 830012, 836655, 843750, 851400, 860371, 870782, 881639, 892131, 902872, 915226, 929663, 945417, 961778, 979062, 998106, 1019312, 1042602, 1068094, 1096399, 1128245, 1164036, 1203912, 1248133, 1297313, 1352250, 1413638, 1482063, 1558292, 1643296, 1737757, 1841665, 1954596, 2076232, 2206235, 2343707, 2487360, 2636428, 2790830, 2949931]
50842B949931J61380J59872J54626J46172J34350J18700R9658P8546N6520L4223
50832D093978J2504p230k3822l7134m7623n5405o0025o1025n8471n3038m5831
50821C656878l8152l1192k5827k2778k2736k6180l2934m2126n2668o3799p5155
50810C223331q6387r6949j06296j14201j20610j25180j27259j26478j23106j17656
50800B079209j10451j01877r2668q3384p3869o3897n4252m6239m0014l4319k8224
50789A350015k2241j7189j2853q713n249l378k922k737k225j763j667j840k487
50776A264751m050o165p665q145q569r834j1529j2796j3587j4366j5146j5685
50764A137214j6120j6612j6685j5805j4304j2947j1817j0473q976p789o627m502
$$ y = [2949931, 3111311, 3271183, 3425809, 3571981, 3706331, 3825031, 3924689, 4003235, 4059755, 4093978, 4106482, 4099252, 4075430, 4038296, 3990673, 3935268, 3875243, 3814218, 3755747, 3702709, 3656878, 3618726, 3587534, 3561707, 3538929, 3516193, 3490013, 3457079, 3414953, 3362285, 3298486, 3223331, 3136944, 3039995, 2933699, 2819498, 2698888, 2573708, 2446449, 2319971, 2196865, 2079209, 1968758, 1866881, 1774213, 1690829, 1616960, 1553063, 1498811, 1452572, 1412558, 1378239, 1350015, 1327774, 1310585, 1297732, 1289019, 1283770, 1280392, 1277470, 1274733, 1272508, 1270745, 1269078, 1267238, 1264751, 1260701, 1254536, 1246871, 1238726, 1230157, 1220323, 1208794, 1195998, 1182411, 1168045, 1152899, 1137214, 1121094, 1104482, 1087797, 1071992, 1057688, 1044741, 1032924, 1022451, 1013475, 1005686, 999059, 994557]
50752I94557j188K241M819O912R488J2782J6276J9663K3160K7002L1168L5597
50740A182477M0272M5089M9884N4630N9380O4030O8295P1897P4682P6754P8544
50729A865934Q0523Q2530Q3595Q2852Q0536P7530P3866O8296N9766M8831L7030
50718B641289K5033J2156k219j7280l1151m2214m9751n3708n4371n2245m7880
50707B327659m1781l4552k7004j9925j3943r708p841q281j0125j2700j6618k2994
50695B102187l1706m1139m9760n7185o3469o8199p0769p1082o9433o6060o1292
50684A452093n5718m9776m3381l6382k9092k2066j5566r597m149J003O336J1931
50672A205636J7023K0652K2595K3338K3375K3002K2428K1618K0246J8302J6447
$$ y = [994557, 993369, 995610, 1000429, 1007341, 1016829, 1029611, 1045887, 1065550, 1088710, 1115712, 1146880, 1182477, 1222749, 1267838, 1317722, 1372352, 1431732, 1495762, 1564057, 1635954, 1710636, 1787390, 1865934, 1946457, 2028987, 2112582, 2195434, 2275970, 2353500, 2427366, 2495662, 2555428, 2604259, 2641289, 2666322, 2678478, 2676259, 2658979, 2627828, 2585614, 2535863, 2482155, 2427784, 2375539, 2327659, 2285878, 2251326, 2224322, 2204397, 2190454, 2180746, 2172905, 2164624, 2154499, 2141799, 2125181, 2102187, 2070481, 2029342, 1979582, 1922397, 1858928, 1790729, 1719960, 1648878, 1579445, 1513385, 1452093, 1396375, 1346599, 1303218, 1266836, 1237744, 1215678, 1200112, 1190515, 1186366, 1187369, 1193705, 1205636, 1222659, 1243311, 1265906, 1289244, 1312619, 1335621, 1358049, 1379667, 1399913, 1418215, 1434662]
50661A434662J5286J4526J3542J2459J2003J2362J2923J3131J2977J2744J2814
50650A579429J3688J5550J7782J9647K1325K3624K6646K9590L2005L4376L7150
50639A850812L9888M1822M2728M2874M2525M1803M0598L8581L5725L2937L1432
50628B281725L1324L1398L0357K7436K1684J1956j492j6126k8740l7581m2438
50617B309503m3554m1428l7131l1710k5352j8042j0727m920j217Q56J619P30j998
50604B096629o165j1426j7774k4924l2156l9070m5813n2139n6966n9430n9967
50593A690799n9707n9169n8105n6396n4324n2000m9194m5940m2750l9940l7180
50582A136094l4026l0605k7289k3940k0048j5677j1667q654o303l863j124J586
$$ y = [1434662, 1449948, 1464474, 1478016, 1490475, 1502478, 1514840, 1527763, 1540894, 1553871, 1566615, 1579429, 1593117, 1608667, 1626449, 1646096, 1667421, 1691045, 1717691, 1747281, 1779286, 1813662, 1850812, 1890700, 1932522, 1975250, 2018124, 2060649, 2102452, 2143050, 2181631, 2217356, 2250293, 2281725, 2313049, 2344447, 2374804, 2402240, 2423924, 2435880, 2434388, 2418262, 2389522, 2351941, 2309503, 2265949, 2224521, 2187390, 2155680, 2130328, 2112286, 2101559, 2096639, 2095422, 2096278, 2097897, 2098627, 2096629, 2090464, 2079038, 2061264, 2036340, 2004184, 1965114, 1919301, 1867162, 1810196, 1750766, 1690799, 1631092, 1571923, 1513818, 1457422, 1403098, 1351098, 1301904, 1255964, 1213214, 1173274, 1136094, 1102068, 1071463, 1044174, 1020234, 1000186, 984509, 972842, 964188, 957885, 954022, 952898, 954484]
50570I54484M125O639R088J1204J2985J4706J6396J7802J8920K0053K1258K2287
50558A129947K3268K4719K6599K7987K8222K7822K7648K7663K7239K6353K5681
50547A423148K5594K5792K5994K6382K7205K8521L0423L3159L6868M1388M6370
50536A770844N1316N5640N9077O2106O5598P0020P5231Q0887Q6685R2235R7171
50525B566810J01426J05045J07723J08851J07988J04907R9256R0740P9676O6922
50515C539344N2992L7701K0841K777j5700l3755n0494o5074p7133q6814r4075
50504C230610r8271r8726r5410q8802p9273o7029n2532l6668k0582n414Q050J9638
50492B615591K9551L7490M2330M2885L8835L0524J8139J707j7997l9054n9233
$$ y = [954484, 958609, 965248, 974336, 985540, 998525, 1013231, 1029627, 1047429, 1066349, 1086402, 1107660, 1129947, 1153215, 1177934, 1204533, 1232520, 1260742, 1288564, 1316212, 1343875, 1371114, 1397467, 1423148, 1448742, 1474534, 1500528, 1526910, 1554115, 1582636, 1613059, 1646218, 1683086, 1724474, 1770844, 1822160, 1877800, 1936877, 1998983, 2064581, 2134601, 2209832, 2290719, 2377404, 2469639, 2566810, 2668236, 2773281, 2881004, 2989855, 3097843, 3202750, 3302006, 3392746, 3472422, 3539344, 3592336, 3630037, 3650878, 3653655, 3637955, 3604200, 3553706, 3488632, 3411499, 3324685, 3230610, 3132339, 3033613, 2938203, 2849401, 2770128, 2703099, 2650567, 2613899, 2593317, 2587903, 2595953, 2615591, 2645142, 2682632, 2724962, 2767847, 2806682, 2837206, 2855345, 2857052, 2839055, 2800001, 2740768]
50481B740768p6953r1318j01747j08072j10891j11225j09644j05986j00154r2760
50471A732018q4790p6856o9262o2594n7532n3928n0579m6353m1230l5962l0999
50460A121933k6200k1416j6831j2682r008n738k786n3K486M691O480Q071R849
50447A058796J2028J4667J7753K1007K3761K5344K5520K4253K1413J7245J2874
50436A274661R517P172M842K168P7n42r9L10K86L09R20K236M095O241Q432J0726
50420A331351J3478J6784K0226K3499K6972L1118L5681L9977M3953M8199N2834
50409A684072N6990N9626O0450N9767N7809N4703N0805M6572M1974L6360K9096
50398B238224K0212J0257k72j1101k1887l2124m1554n0308n8269o4468o7636o7457
$$ y = [2740768, 2663815, 2572497, 2470750, 2362678, 2251787, 2140562, 2030918, 1924932, 1824778, 1732018, 1647228, 1570372, 1501110, 1438516, 1380984, 1327056, 1276477, 1230124, 1188894, 1152932, 1121933, 1095733, 1074317, 1057486, 1044804, 1035796, 1030058, 1027272, 1027219, 1029705, 1034396, 1040876, 1048947, 1058796, 1070824, 1085491, 1103244, 1124251, 1148012, 1173356, 1198876, 1223129, 1244542, 1261787, 1274661, 1284178, 1291350, 1296192, 1298360, 1298437, 1297895, 1297796, 1298106, 1298392, 1298701, 1299621, 1301857, 1305952, 1312193, 1320625, 1331351, 1344829, 1361613, 1381839, 1405338, 1432310, 1463428, 1499109, 1539086, 1583039, 1631238, 1684072, 1741062, 1800688, 1861138, 1920905, 1978714, 2033417, 2084222, 2130794, 2172768, 2209128, 2238224, 2258436, 2268693, 2268421, 2257320, 2235433, 2203309, 2161755, 2111447, 2053178, 1988710, 1921074, 1853617]
50386A853617o4876o1040n6328n0557m3704l5993k7618j8797j0053k057M842J0651
50374A498087J5283J8301J9083J7211J2814O630l79p733j5551k3813l1649l7718
50362A470566m1273m2614m2566m1790m0613l9104l7170l4741l1960k9010k5799
50351A063926k2113j8311j5503j4678j5669j7326j8708j9809k0891k1516k0810
50340H58592j8566j5587j2682r913p197n082m181m018l307j535M73J822K708L888
50326G85415N483O938P793Q038P900P719P859Q279Q409P846O968O445O349O249
50312H87690N930N552N255N188N705O928Q187Q662Q597R113J0682J2542J3891
50299I93922J4878J5959J7095J8237K0029K3130K7129L0955L4138L6780L8147
$$ y = [1853617, 1788741, 1727701, 1671373, 1620816, 1577112, 1541119, 1513501, 1494704, 1484651, 1482594, 1487436, 1498087, 1513370, 1531671, 1550754, 1567965, 1580779, 1587409, 1587030, 1579297, 1563746, 1539933, 1508284, 1470566, 1429293, 1386679, 1344113, 1302323, 1261710, 1222606, 1185436, 1150695, 1118735, 1089725, 1063926, 1041813, 1023502, 1007999, 993321, 977652, 960326, 941618, 921809, 900918, 879402, 858592, 840026, 824439, 811757, 801844, 794647, 789565, 785384, 781366, 778059, 776524, 776997, 778819, 781527, 785415, 790898, 797836, 805629, 813667, 821567, 829286, 837145, 845424, 853833, 861679, 868647, 875092, 881441, 887690, 893620, 899172, 904427, 909615, 915320, 922248, 930435, 939097, 947694, 956807, 967489, 980031, 993922, 1008800, 1024759, 1041854, 1060091, 1080120, 1103250, 1130379, 1161334, 1195472, 1232252, 1270399]
50288A270399L6200K9143J7174K417j2551k5753l5747m1457m2564l9967l5410
50277A121884l0345k5188j9726j4058q924n033k455p81L29J061J718K685M026
50264A025193N413O640Q011R967J2431J4770J6481J7645J8572J9211J9215J8469
50252A192018J7235J5785J4200J2692J1721J1508J1574J1049R328O351K513j496
50240A314478n020q022j1138j4714j7966j9621j9339j7930j6191j4192j1943j0098
50228A148304r549j0685j3365j7169k1294k4523k5996k5873k4973k3814k2433
50217I28630k0816j9101j7332j5519j3914j2815j2076j1163r794q233o900n958
50205G75009n357m980m666m333m183m510n210n741n790n724o145p053p746p501
$$ y = [1270399, 1306599, 1335742, 1352916, 1355333, 1342782, 1317029, 1281282, 1239825, 1197261, 1157294, 1121884, 1091539, 1066351, 1046625, 1032567, 1023643, 1018610, 1016155, 1015374, 1015703, 1016764, 1018482, 1021167, 1025193, 1030606, 1037246, 1045257, 1055224, 1067655, 1082425, 1098906, 1116551, 1135123, 1154334, 1173549, 1192018, 1209253, 1225038, 1239238, 1251930, 1263651, 1275159, 1286733, 1297782, 1307110, 1313461, 1315974, 1314478, 1309458, 1301436, 1290298, 1275584, 1257618, 1237997, 1218658, 1200728, 1184537, 1170345, 1158402, 1148304, 1138755, 1128070, 1114705, 1097536, 1076242, 1051719, 1025723, 999850, 974877, 951063, 928630, 907814, 888713, 871381, 855862, 841948, 829133, 817057, 805894, 796100, 787867, 780967, 775009, 769652, 764672, 760006, 755673, 751490, 746980, 741770, 736029, 730239, 724515, 718370, 711317, 703571, 696070]
50191F96070o329m900l836l142k424j615j186j521k282k761k767k779l222l889
50177F53417m237l979l221k215j187l01L82Q65J179J363J542J798K025K071K021
50162F51523K110K357K574K775L229M003M803N514O521Q234J0438J2535J4185
50149G30801J5466J6551J7598J8907K0766K3141K5747K8449L1271L4093L6615
50138I99405L8615M0033M0767M0744M0161L9425L8748L8024L7051L5542L2911
50127A421426K8510K2280J4826O741j831j0750j9389k6959l3110l7941m1487m3543
50115A278773m3911m2656m0177l7072l3797l0380k6648k2896j9909j8145j7232
50104I45950j6604j6247j6271j6135j5078j3312j1999j1726j1652j0591q545o572
$$ y = [696070, 689741, 684841, 681005, 677863, 675439, 673824, 672638, 671117, 668835, 666074, 663307, 660528, 657306, 653417, 649180, 645201, 641980, 639765, 638578, 638277, 638659, 639524, 640703, 642066, 643608, 645406, 647431, 649502, 651523, 653633, 655990, 658564, 661339, 664568, 668571, 673374, 678888, 685409, 693643, 704081, 716616, 730801, 746267, 762818, 780416, 799323, 820089, 843230, 868977, 897426, 928697, 962790, 999405, 1038020, 1078053, 1118820, 1159564, 1199725, 1239150, 1277898, 1315922, 1352973, 1388515, 1421426, 1449936, 1472216, 1487042, 1493783, 1491952, 1481202, 1461813, 1434854, 1401744, 1363803, 1322316, 1278773, 1234862, 1192206, 1152029, 1114957, 1081160, 1050780, 1024132, 1001236, 981327, 963182, 945950, 929346, 913099, 896828, 880693, 865615, 852303, 840304, 828578, 816926, 806335, 797790, 791218]
50092G91218n392m601l444j930q46p34j139j139m93J66M24Q45K177M009N042M715
50076G88878L918L803M469N173N410N266N022M906N039N201M787L466J804O87
50062H47829K28k69j196k118k562k817l488m482m944m292k938j858j619j967k289
50047H11218k228j739p60Q40K939N080O906Q538J0218J1789J2814J3198J3403
50034H92216J3926J4799J5699J6393J6966J7628J8431J9125J9313J8870J8209
50023A081575J8036J8786K0276K1842K2721K2366K0664J7945J4725J1457Q594
50012A278987O662N948O030N868M569K032j242m823q713j3130j8028k2888k6988
49999A214284k9922l1762l2723l2790l1880l0207k8227k6247k4387k2899k2083
$$ y = [791218, 785826, 781225, 777781, 775851, 775005, 774271, 773132, 771993, 771500, 771666, 772090, 772935, 775112, 779121, 784163, 788878, 792796, 796599, 801068, 806241, 811651, 816917, 821939, 826845, 831884, 837085, 841872, 845338, 847142, 847829, 848057, 847788, 846592, 844474, 841912, 839095, 835607, 831125, 826181, 821889, 818951, 817093, 815474, 813507, 811218, 808990, 807251, 806491, 807331, 810270, 815350, 822256, 830794, 841012, 852801, 865615, 878813, 892216, 906142, 920941, 936640, 953033, 969999, 987627, 1006058, 1025183, 1044496, 1063366, 1081575, 1099611, 1118397, 1138673, 1160515, 1183236, 1205602, 1226266, 1244211, 1258936, 1270393, 1278987, 1285649, 1291597, 1297627, 1303495, 1308064, 1310096, 1308854, 1304031, 1295318, 1282188, 1264160, 1241272, 1214284, 1184362, 1152600, 1119877, 1087087, 1055207, 1025000, 996773, 970526, 946139, 923240, 901157]
49988I01157k1778k1365k0526j9663j9168j8690j7576j5917j4452j3415j2127
49977G06480j0084p892o637o475o455n659m126k546j515j281j846k846l501l164
49963F42453j984p18J52Q55J788K942M113N314O562P428P419O690N963N547M957
49948F99481L723K164R13M4q51j888k781l499m428n675o773p427q096r305j0631
49933F44971j1069j0392r487r160r101q469p057n392l934k735j820j276q53L9
49919E64265J566L097L899L982L960M278M904N595O111O301O274O498P337Q473
49905F36540R134Q979Q438Q074P937P773P513P198O560N066K529n26l196m896
49891G07123n765o533p890r847j1652j2415j1880j0581r288q376p730p084o322
$$ y = [901157, 879379, 858014, 837488, 817825, 798657, 779967, 762391, 746474, 732022, 718607, 706480, 696396, 688504, 681867, 675392, 668937, 663278, 659152, 656606, 655091, 653810, 651964, 649118, 645617, 642453, 640469, 639751, 639903, 640758, 642546, 645488, 649601, 654915, 661477, 668905, 676324, 683014, 688977, 694524, 699481, 703204, 705368, 706281, 706325, 705474, 703586, 700805, 697306, 692878, 687203, 680430, 673003, 664907, 655602, 644971, 633902, 623510, 614023, 604863, 595762, 587293, 580236, 574844, 570910, 568175, 566355, 565079, 564226, 564265, 565831, 568928, 572827, 576809, 580769, 585047, 589951, 595546, 601657, 607958, 614232, 620730, 628067, 636540, 645674, 654653, 663091, 671165, 679102, 686875, 694388, 701586, 708146, 713212, 715741, 715215, 712019, 707123, 701358, 694825, 686935, 677088, 665436, 653021, 641141, 630560, 621272, 612896, 605166, 598082, 591760]
49878E91760n513m791m251l870l507l032k501k071j715j141j41J124K330L390
49864E66071M461N635O956Q562J0504J2359J3475J3666J3283J2463J0887Q540
49852F86862O185M635L830L169K416J667P18r20l358o202r024j1404j2625j2084
49838F53865j0164q111o766n950n194m486l947l286k175q24K18P72J215K060L524
49823F10751N344O950P979Q666R356R770R242P837O548O029N732M750L026J247
49809G03227p5q31j088j227j988l674n443o072n352m209l520l506m116n337o863
$$ y = [591760, 586247, 581456, 577205, 573335, 569828, 566796, 564295, 562224, 560509, 559368, 559227, 560351, 562681, 566071, 570532, 576167, 583123, 591685, 602189, 614548, 628023, 641689, 654972, 667435, 678322, 686862, 693047, 697682, 701512, 704681, 707097, 708764, 709482, 708562, 705204, 699002, 689978, 678574, 665949, 653865, 643701, 635590, 628824, 622874, 617680, 613194, 609247, 605961, 603786, 602962, 603180, 603952, 605167, 607227, 610751, 616095, 623045, 631024, 639690, 649046, 658816, 668058, 675895, 682443, 688472, 694204, 698954, 701980, 703227, 703152, 702321, 701233, 700006, 698018, 694344, 688901, 682829, 677477, 673268, 669748, 666242, 662126, 656789, 649926]
$$ [...]
##END NTUPLES=NMR SPECTRUM
##END=
