##TITLE=AC1747_SEN00020_9281017_PIq1CJPhvs
##JCAMPDX= 6.0         $$ Bruker NMR JCAMP-DX V2.0
##DATA TYPE= NMR SPECTRUM
##DATA CLASS= NTUPLES
##ORIGIN= BRUKER
##OWNER= Administrator
$$ 1.72 TOPSPIN		Version 2.1
$$ 2015-07-17 22:06:03.432 -0700  Administrator@X
$$ Compression mode = diff/dup
##.OBSERVE FREQUENCY= 400.02188249412
##.OBSERVE NUCLEUS= ^1H
##.ACQUISITION MODE= SIMULTANEOUS (DQD)
##.ACQUISITION SCHEME= undefined
##.AVERAGES= 8
##.DIGITISER RES= 22
##SPECTROMETER/DATA SYSTEM= spect
##.PULSE SEQUENCE= zg30
##.SOLVENT NAME= COFFEE_meoh
##.SHIFT REFERENCE= INTERNAL, COFFEE_meoh, 1, 14.98509
##AUDIT TRAIL= $$ (NUMBER, WHEN, WHO, WHERE, PROCESS, VERSION, WHAT)
$$ ##TITLE= Audit trail, TOPSPIN		Version 2.1
$$ ##JCAMPDX= 5.01
$$ ##ORIGIN= Bruker BioSpin GmbH
$$ ##OWNER= Administrator
$$ $$ E:\/data/COFFEE/nmr/AC1747_SEN00020_9281017_PIq1CJPhvs/10/pdata/1/auditp.txt
$$ ##AUDIT TRAIL=  $$ (NUMBER, WHEN, WHO, WHERE, PROCESS, VERSION, WHAT)
(   1,<2015-07-17 22:05:56.588 -0700>,<Administrator>,<X>,<go>,<TOPSPIN 2.1>,
      <created by zg
	started at 2015-07-17 22:04:50.697 -0700,
	POWCHK enabled, PULCHK disabled,
       configuration hash MD5:
       21 0F 79 D6 B3 7B B4 F6 88 20 88 DB 03 48 BD 9F
       data hash MD5: 64K
       A4 D1 73 11 04 88 DE DF 29 E7 C6 7C 65 F5 19 DA>)
(   2,<2015-07-17 22:05:59.807 -0700>,<Administrator>,<X>,<proc1d>,<TOPSPIN 2.1>,
      <Start of raw data processing
       efp LB = 0 FT_mod = 6 PKNL = 1 PHC0 = 0 PHC1 = 0 SI = 32K 
       data hash MD5: 32K
       F1 A1 5A 66 83 8C 96 B7 19 DB 38 25 3D FB BA 95>)
(   3,<2015-07-17 22:06:00.135 -0700>,<Administrator>,<X>,<proc1d>,<TOPSPIN 2.1>,
      <pk PHC0 = 87.64343 PHC1 = 0 
       data hash MD5: 32K
       CE A4 F1 38 25 84 5D A6 0E 19 E2 B9 51 3A 86 D1>)
(   4,<2015-07-17 22:06:00.229 -0700>,<Administrator>,<X>,<proc1d>,<TOPSPIN 2.1>,
      <abs ABSG = 1 
       data hash MD5: 32K
       A4 56 BE 5B 92 C9 77 C0 7C 6F EB C1 E6 BB 0F 8B>)
(   5,<2015-07-17 22:06:00.275 -0700>,<Administrator>,<X>,<proc1d>,<TOPSPIN 2.1>,
      <abs ABSG = 2 
       data hash MD5: 32K
       60 2D 3E 87 A7 E5 53 D5 92 B6 1E A5 ED 6F 3B 53>)
(   6,<2015-07-17 22:06:00.338 -0700>,<Administrator>,<X>,<proc1d>,<TOPSPIN 2.1>,
      <abs ABSG = 3 
       data hash MD5: 32K
       1A 22 31 FE BD F8 EA AF BA B4 A7 C3 86 65 96 2E>)
(   7,<2015-07-17 22:06:00.400 -0700>,<Administrator>,<X>,<proc1d>,<TOPSPIN 2.1>,
      <abs ABSG = 4 
       data hash MD5: 32K
       42 FA BD AA 6B 08 73 86 FC 95 D1 25 69 5E 23 F9>)
(   8,<2015-07-17 22:06:00.447 -0700>,<Administrator>,<X>,<proc1d>,<TOPSPIN 2.1>,
      <abs ABSG = 5 
       data hash MD5: 32K
       7C FA 68 29 79 09 7E 7B 37 49 31 3C B7 83 74 50>)
$$ ##END=
$$ 
$$ $$ hash MD5
$$ $$ B0 42 14 8F 89 3E 84 0C 5C A6 E2 3E DC 2D F9 35
##$RELAX= 
##$RELAX= 
##$RELAX= 
##$RELAX= 
##$RELAX= 
##$RELAX= 
##$RELAX= 
$$ Bruker specific parameters
$$ --------------------------
##$DU= <E:\>
##$EXPNO= 10
##$NAME= <AC1747_SEN00020_9281017_PIq1CJPhvs>
$$ [...]
##$TP= (0..7)
150 150 150 150 150 150 150 150
##$TP07= 0
##$TPNAME0= <>
##$TPNAME1= <>
##$TPNAME2= <>
##$TPNAME3= <>
##$TPNAME4= <>
##$TPNAME5= <>
##$TPNAME6= <>
##$TPNAME7= <>
##$TPOAL= (0..7)
0.5 0.5 0.5 0.5 0.5 0.5 0.5 0.5
##$TPOFFS= (0..7)
0 0 0 0 0 0 0 0
##$TUNHIN= 0
##$TUNHOUT= 0
##$TUNXOUT= 0
##$USERA1= <user>
##$USERA2= <user>
##$USERA3= <user>
##$USERA4= <user>
##$USERA5= <user>
##$V9= 5
##$VALIST= <valist>
##$VCLIST= <CCCCCCCCCCCCCCC>
##$VD= 0
##$VDLIST= <DDDDDDDDDDDDDDD>
##$VPLIST= <PPPPPPPPPPPPPPP>
##$VTLIST= <TTTTTTTTTTTTTTT>
##$WBST= 2048
##$WBSW= 25
##$XGAIN= (0..3)
0 0 0 0
##$XL= 0
##$YL= 0
##$YMAX_a= 599216
##$YMIN_a= -524173
##$ZGOPTNS= <>
##$ZL1= 120
##$ZL2= 120
##$ZL3= 120
##$ZL4= 120
##$ABSF1= 14.98509
##$ABSF2= -5.573092
##$ABSG= 5
##$ABSL= 3
##$ALPHA= 0
##$AQORDER= 0
##$ASSFAC= 0
##$ASSFACI= 0
##$ASSFACX= 0
##$ASSWID= 0
##$AUNMP= <proc_prof1d_extract_pilot.lims>
##$AXLEFT= 0
##$AXNAME= <>
##$AXNUC= <1H>
##$AXRIGHT= 0
##$AXTYPE= 0
##$AXUNIT= <>
##$AZFE= 0.1
##$AZFW= 0.1
##$BCFW= 0
##$BC_mod= 0
##$BYTORDP= 0
##$COROFFS= 0
##$CY= 15
##$DATMOD= 1
##$DC= 0
##$DFILT= <>
##$DTYPP= 0
##$F1P= 0
##$F2P= 0
##$FCOR= 0.5
##$FTSIZE= 32768
##$FT_mod= 6
##$GAMMA= 0
##$GB= 0
##$INTBC= 1
##$INTSCL= 1
##$ISEN= 128
##$LB= 0
##$LEV0= 0
##$LPBIN= 0
##$MAXI= 10000
##$MC2= 0
##$MEAN= 0
##$ME_mod= 0
##$MI= 0
##$NCOEF= 0
##$NC_proc= -8
##$NLEV= 6
##$NOISF1= 0
##$NOISF2= 0
##$NSP= 0
##$NTH_PI= 0
##$NZP= 0
##$OFFSET= 14.98509
##$PC= 1
##$PHC0= 87.64343
##$PHC1= 0
##$PH_mod= 1
##$PKNL= yes
##$PPARMOD= 0
##$PPDIAG= 0
##$PPIPTYP= 0
##$PPMPNUM= 2147483647
##$PPRESOL= 1
##$PSCAL= 4
##$PSIGN= 0
##$PYNMP= <proc.py>
##$REVERSE= no
##$SF= 400.02
##$SI= 32768
##$SIGF1= 0
##$SIGF2= 0
##$SINO= 400
##$SIOLD= 32768
##$SPECTYP= <>
##$SREGLST= <1H.CDCl3>
##$SSB= 0
##$STSI= 32768
##$STSR= 0
##$SW_p= 8223.68421052631
##$SYMM= 0
##$S_DEV= 0
##$TDeff= 65536
##$TDoff= 0
##$TI= <>
##$TILT= no
##$TM1= 0
##$TM2= 0
##$TOPLEV= 0
##$USERP1= <user>
##$USERP2= <user>
##$USERP3= <user>
##$USERP4= <user>
##$USERP5= <user>
##$WDW= 1
##$XDIM= 32768
##$YMAX_p= 451073155
##$YMIN_p= -792079
##$CURPLOT= <Network HP LaserJet P1505>
##$CURPRIN= <$Network HP LaserJet P1505>
##$DFORMAT= <normdp>
##$LAYOUT= <+/1D_H.xwp>
##$LFORMAT= <normlp>
##$PFORMAT= <normpl>
##$SURQMSG= 1
$$ End of Bruker specific parameters
$$ ---------------------------------
##NTUPLES= NMR SPECTRUM
##VAR_NAME=  FREQUENCY,     SPECTRUM/REAL,   SPECTRUM/IMAG
##SYMBOL=    X,             R,               I
##VAR_TYPE=  INDEPENDENT,   DEPENDENT,       DEPENDENT
##VAR_FORM=  AFFN,          ASDF,            ASDF
##VAR_DIM=   32768,         32768,           32768
##UNITS=     HZ,            ARBITRARY UNITS, ARBITRARY UNITS
##FACTOR=    0.250966925370066, 1,           1
##FIRST=     8223.43324360094, 86112,        90696
##LAST=      0,             111823,          -64641
##MIN=       0,             -792079,         0
##MAX=       8223.43324360094, 451073155,    0
$$ Real data points
##PAGE= N=1
##DATA TABLE= (X++(R..R)), XYDATA
$$ [...]
$$ plain form
19549 -94986 156838 183872 -27931 134235 -31887 -103074 7161 334260 -393028 -43602 154822
19537 11565 75870 -37829 -80664 -315561 -352645 50471 146722 -246764 -143020 129046 17157
19525 8273 -286948 -304088 43894 175391 193062 -112714 26225 -159905 182939 132467 -125630
19513 -73549 -182876 175458 -264507 -54732 -141879 -62436 -28654 -154059 -29549 -174350 -18087
19501 -296033 2529 -235786 1124 12223 -3061 -171630 -38668 -7580 -86280 159333 -387730
19489 207799 85018 319528 200109 134707 -121245 -67969 -120186 117638 -208506 172372
19478 -174178 -110009 -125256 -335123 -120375 -230110 -496052 4162 237034 175793 -230138
19467 -265458 -152591 -442591 33836 -246547 160421 -224572 -72724 -6719 -44618 193622
$$ packed form
19549i4986A56838K7034b7931A34235c1887p1187G161L27099c93028d3602A54822
19537A1565O4305c7829m2835k34897l7084E0471R6251b46764J03744A29046A7157
19525H273b86948j7140D3894J31497J7671a12714B6225a59905A82939n0472a25630
19513g3549j09327A75458b64507e4732q7147f2436b8654j25405b9549j44801a8087
19501b96033B529b35786A124J1099c061j68569c8668g580p8700A59333c87730
19489B07799H5018K34510j19419o5402a21245N3276n2217A17638b08506A72372
19478a74178O4169j5247k09867a20375j09735k65942D162K32872o1241b30138
19467b65458J12867k90000C3836b46547A60421b24572g2724f719l7899A93622
$$ plain form
19456 53848 198469 -67634 -282192 -212303 -32728 -418539 -46457 -166084 -290207 106043
19445 -139825 -397781 15458 -278044 -8990 -243992 -113988 -169496 -249327 33447 59813 -74851
19433 423490 -64869 50448 -169273 -42078 -66917 -183835 -151880 -348822 198396 -230762
19422 -247939 -103233 -10126 -58310 130066 59246 18145 299247 73002 -102808 338933
19411 -70154 -44660 -142999 30982 -81482 -279537 -226384 -206385 80266 -42855 55235 -73028
19399 -433419 12701 124463 -52574 128204 -91970 -454907 81840 -77082 -218069 -197445 67848
19387 48341 -42765 -232237 -248243 73015 5960 -14485 -319180 -167682 -53595 -333937 -3426
19375 87344 51266 -80033 85143 6208 320985 -120639 178324 96844 -122422 -325168 -87474
$$ packed form
19456E3848J44621f7634k14558O9889c2728l85811d6457j19627j24123A06043
19445a39825k57956A5458b78044h990k35002a13988n5508p9831C3447K6366g4851
19433D23490f4869E0448a69273d2078k4839j16918L1955j96942A98396b30762
19422b47939a03233a0126m8184A30066E9246A8145K81102G3002a02808C38933
19411g0154K5494r8339C0982h1482j98055N3153J9999H0266d2855E5235g3028
19399d33419A2701J11762e2574A28204i1970l62937H1840g7082j40987K0624F7848
19387D8341d2765j89472j6006G3015E960a4485l04695J51498e3595k80342c426
19375H7344l6078h0033H5143F208L14777a20639A78324q1480a22422k02746h7474
$$ plain form
19363 -176362 -356954 -105110 -282976 328221 -32609 -686 -139657 -180461 -300466 7167 -195148
19351 -27879 64521 -95036 -149935 -252276 -270104 -131000 -102322 -328491 -53144 149891 -134476
19339 177151 141730 59748 -10335 -63662 -115548 79577 -245636 113239 144978 28015 175525
19328 175525 22159 -77800 -148839 -77465 -26108 -159634 -47935 210443 -408271 356435 88192
19316 47516 -281781 -152719 -236709 -81673 -264416 -205771 122525 -130557 13930 -16996 -148277
19305 -148277 67975 14782 56262 -333193 -122501 -116878 -217797 136555 -149353 -340576
19295 -340576 163983 -337576 176685 -334169 11601 248548 11883 23869 66434 -7085 -267240
19284 -267240 31389 -39157 -403673 152083 -161348 -296936 267205 -74917 76741 44681
$$ packed form
19363a76362j80592a05110j77866C28221c2609f86j38971m0804j20005G167a95148
19351b7879F4521i5036n4899j02341j7828a31000K8678k26169e3144A49891a34476
19339A77151l5421E9748a0335n3327n1886G9577b45636A13239L1739B8015J47510
19328A75525B2159g7800p1039P1374b6108j33526d7935B10443d08271C56435H8192
19316D7516b81781J29062q3990h1673j82743N8645A22525a30557A3930a6996j31281
19305a48277F7975A4782M1480c33193a22501N623j00919A36555a49353j91223
19295c40576A63983c37576A76685c34169A1601K36947A1883J1986M2565g085k60155
19284b67240C1389c9157l64516A52083a61348j35588B67205g4917G6741l2060
$$ plain form
19274 44681 -180604 -35308 39111 -292736 171557 -50289 -179404 -70413 8820 -136140 -218305
19263 -218305 -5651 145724 -52301 -101984 65189 153153 48518 -149371 -67930 214893 -43941
19251 -73784 -41920 -43104 -122044 -253592 -163698 181821 194138 -12857 -229383 -68610 -10088
19239 251233 -67237 56052 -47315 -43943 -181033 -225580 234897 11951 -85979 12486 -123109
19227 151663 -258187 -182929 -290981 95847 -161750 -135185 -282382 328856 218702 223385
19217 223385 134117 -134547 -59425 -168391 -170158 225466 -32489 -52944 -156424 -128283 34199
19205 13966 -116392 -137523 -97988 18716 134847 -32892 -205049 -122229 -108677 -7433 27148
19193 -41072 -29008 -163165 83687 -103906 38031 -189306 -253157 81635 -217242 48450 -122920
$$ packed form
19274D4681a80604c5308C9111b92736A71557e0289j29115g0413H820a36140q2165
19263b18305e651A45724e2301m9683F5189Q7964D8518a49371f7930B14893d3941
19251g3784L1864j184p8940j31548Q9894A81821J2317a2857k16526f8610a0088
19239B51233f7237E6052d7315L372j37090m4547B34897A1951h5979A2486a23109
19227A51663b58187P5258j08052I5847a61750K6565j47197C28856j10154M683
19217B23385q9268a34547e9425j08966j767B25466c2489k0455j03480K8141C4199
19205A3966a16392k1131L9535A8716J16131c2892j72157Q2820J3552g433B7148
19193d1072J2064j34157H3687a03906C8031a89306o3851H1635b17242D8450a22920
$$ plain form
19181 66593 268612 198387 153287 -367442 -253318 285127 -201375 -75090 -208440 -234642
19171 -234642 114064 -26002 -305746 -378131 -78098 128386 -83049 -80226 -235580 64925 -363653
19159 69865 -75781 -202972 -163494 301109 -180659 -66928 -18495 -313766 -132482 18133 248427
19148 248427 124749 -158277 -17 106506 -130301 -77076 -93911 -132640 -93692 -161480 -14595
19136 -157025 -152659 -25577 -93035 -219926 -234988 234466 -123991 -51127 2740 -349948 92434
19124 257182 -121172 -12128 -330332 80260 -72303 -124028 -107204 -222300 -229780 77890 -244561
19112 -153771 7342 -7875 200755 48620 -166316 4210 -197788 -167002 126736 300753 82743
19100 1387 -210496 -68269 143767 179823 -114215 95578 30536 -178124 13325 -3500 24165
$$ packed form
19181F6593K02019p0225m5100c67442J14124B85127b01375g5090j33350k6202
19171b34642A14064b6002k79744p2385g8098A28386h3049K823j55354F4925c63653
19159F9865g5781j27191L9478C01109a80659f6928a8495k95271a32482A8133K30294
19148B48427j23678a58277a7A06506a30301N3225j6835l8729L8948o7788a4595
19136a57025M366b5577o7458j26891j5062B34466a23991e1127B740c49948I2434
19124B57182a21172a2128l18204H0260g2303n1725J6824j15096p480G7890b44561
19112a53771G342g875B00755D8620a66316D210a97788L0786A26736J74017H2743
19100A387b10496f8269A43767L6056a14215I5578C0536a78124A3325c500B4165
$$ plain form
19088 -208792 -226036 -385984 -123554 -102563 -38768 107854 -285890 -89475 289252 150978
19078 150978 -277410 -65083 -10346 -91009 -109996 68651 -94829 -194263 143724 -182333 -150796
19067 -150796 -311602 1529 -254857 191841 181375 -191319 -280061 -56888 66254 -286778 -309583
19056 -309583 -129150 110252 86845 363218 -40272 -224527 -47086 -5620 129144 -303174
19045 -81494 184926 156474 267289 187522 -139402 331507 -311535 -172351 -116199 -298274
19035 -298274 -209244 -188694 -61494 245513 -118088 102423 -364764 75620 416646 260903
19025 260903 -56230 -116735 106366 -34039 -266689 -312425 -52612 -354346 -85015 95725 104862
19014 104862 -112443 -113005 -49978 -90811 -99832 -159753 61656 16995 -180576 -98544 8260 -121355
$$ packed form
19088b08792j7244j59948a23554K0991c8768A07854b85890h9475B89252j38274
19078A50978b77410f5083a0346q0663j8987F8651i4829r9434A43724a82333L1537
19067a50796j60806A529b54857A91841j0466a91319q8742e6888F6254b86778k2805
19056c09583a29150A10252k3407K76373d0272j84255d7086e620A29144c03174
19045h1494A84926k8452J10815p9767a39402C31507c11535J39184N6152j82075
19035b98274Q9030K0550f1494B45513a18088A02423c64764G5620L41026j55743
19025B60903e6230o0505A06366c4039k32650m5736e2612l01734h5015I5725R137
19014A04862a12443n62d9978m0833r021n9921F1656A6995a80576Q2032H260a21355
$$ plain form
19001 -236313 5835 113757 -12388 -207673 -301860 -202545 -285775 23299 28042 -92515 91131
18989 -44099 -135670 148654 147476 167746 -44268 -30097 -385386 -51619 -99294 -121925 -14660
18977 -161187 -55709 11822 -88782 -68884 -98584 154674 72198 -48910 -18001 100268 148447
18966 148447 209553 -74328 -208140 132588 -115432 -2213 -94002 -176076 -2630 -213658 -68963
18954 -433441 -201064 58645 133908 -103666 -71247 -410360 85992 -32165 -103486 33699 68226
18943 68226 -83979 75240 -156284 -152372 -26699 98267 196798 197380 -104944 -132805 -211567 -469122
18931 -469122 42661 -158911 -150426 -4661 77078 3085 178757 27498 -216973 -77705 161645
18919 -285275 -76144 32306 -47828 4809 58261 -203943 -123638 12739 -11462 -21616 21328
$$ packed form
19001b36313E835J07922a2388j95285r4187R9315q3230B3299M743i2515I1131
18989d4099r1571A48654j178K0270d4268J4171l55289e1619m7675k2631a4660
18977a61187e5709A1822h8782J9898k9700A54674G2198d8910a8001A00268M8179
18966A48447O1106g4328j33812A32588a15432b213r1789q2074b630k11028f8963
18954d33441b01064E8645P5263a03666L2419l39113H5992c2165p1321C3699L4527
18943F8226h3979G5240a56284L912b6699I8267R8531N82a04944k7861p8762k57555
18931d69122D2661a58911Q485d661G7078C085J75672B7498b16973g7705A61645
18919b85275g6144C2306d7828D809N3452b03943Q0305A2739a1462j0154B1328
$$ plain form
18907 116763 -90152 -188789 -151286 -206978 20305 -227933 -197134 -212482 59059 -158902 -70242
18895 345117 8597 -169893 134239 -45196 52887 -248101 -52056 -175831 -190851 -217763 -66255
18883 -291148 174646 193710 207194 19646 238144 -367428 -408921 -5207 -82968 -112437 198197
18871 -273779 -67600 -3126 -74713 -66084 -65385 -167362 -117401 72217 57374 196008 145240 -233010
18858 145640 121203 208974 -98085 -49580 31592 76424 211517 -249696 384522 207322 -192326
18846 -55868 58784 -113255 -87041 -123313 288994 63725 21373 -72703 14251 -351100 16962
18834 111024 -99093 173973 -141549 93506 -34265 385533 40034 -37772 -220440 269737
18823 -118035 -269317 -136273 8279 -111095 -17251 136632 85936 3750 -4895 147938 486654
$$ packed form
18907A16763i0152r8637L7503n5692B0305b27933L0799j5348E9059a58902g0242
18895C45117H597a69893A34239d5196E2887b48101e2056j23775j5020k6912f6255
18883b91148A74646J9064J3484A9646K18498c67428m1493e207p7761k9469A98197
18871b73779f7600c126p1587Q629O99j01977M9961G2217j4843J38634n0768b33010
18858A45640k4437Q7771i8085M8505C1592M4832J35093b49696C84522j77200a92326
18846e5868E8784a13255K6214l6272B88994F3725B1373g2703A4251c51100A6962
18834A11024i9093A73973a41549I3506c4265C85533D0034c7772j82668B69737
18823a18035j51282J33044H279a11095a7251A36632n0696C750d895A47938L38716
$$ plain form
18812 486654 -110548 161931 410969 121614 5787 -372579 133646 331108 -21923 -197799
18802 -197799 56680 -372285 -246716 172694 -244223 -138604 82209 -180756 -279952 -56382
18791 -186528 -118652 -205262 -94839 -38500 -113196 -47344 -88906 238065 11145 282641 -203483
18779 -249001 -26888 130564 -64562 205442 -75361 -5913 134038 -124414 -98547 -262901 -330403
18768 -330403 -252761 -158868 -169870 -207415 -34275 -70513 -47150 -151389 -41944 -131065 -140204
18757 -140204 -56299 -287906 -266425 -196496 -329676 -7270 22082 282778 -74512 69094 -338888
18745 242160 141011 74261 -284594 -82770 153728 -64672 67916 -113232 11935 -215838
18734 -27652 142004 -130905 -354807 -217427 -140231 152333 -125185 -82599 44289 -180278
$$ packed form
18812D86654a10548A61931K49038A21614E787c72579A33646J97462b1923j75876
18802a97799E6680c72285J25569A72694b44223J05619H2209a80756r9196e6382
18791a86528O7876q6610i4839c8500p4696d7344m1562B38065A1145K71496b03483
18779b49001b6888A30564f4562B05442g5361e913A34038a24414K5867j64354o7502
18768c30403P7642R3893j1002l7545c4275l6238K3363j04239d1944q9121r139
18757a40204e6299k31607K1481O9929j33180g270B2082K60696g4512F9094c38888
18745B42160j01149o6750b84594h2770A53728f4672F7916a13232A1935b15838
18734b7652A42004a30905k23902J37380P7196A52333a25185M2586D4289a80278
$$ plain form
18723 171768 291339 -395 -140751 -326218 -179474 -6998 137949 69016 -286919 -70101 -79288
18712 -79288 -5515 -91038 -36155 -102897 -157962 74405 461339 76903 -39535 165576 -251370
18700 -223639 123687 206 186040 -112687 151878 -165510 -143521 -97527 27148 216144 177782
18689 177782 333448 -213220 -92165 168414 70072 -247043 133428 -172427 41183 -126556
18678 245574 271263 322004 -138089 37775 100347 73496 -293941 260588 -144655 -155691 -77468
18666 95721 -203526 57334 -376118 64576 203907 124501 -406141 257282 58339 -330516
18655 -218231 6958 -245794 173933 -26426 -94532 -126966 222966 184812 -187315 275082 -529738
18643 -3104 -179183 201979 -21872 69893 -302731 11112 75591 -32792 106304 96094 34653
$$ packed form
18723A71768J19571c95j40356j85467J46744f998A37949o8933b86919g0101r187
18712g9288e515q5523c6155o6742n5065G4405L86934G6903c9535A65576b51370
18700b23639A23687B06J85834a12687A51878a65510K1989M5994B7148J88996l8362
18689A77782J55666b13220i2165A68414G0072b47043A33428a72427D1183a26556
18678B45574K5689N0741a38089C7775O2572k6851b93941B60588a44655j1036g7468
18666I5721b03526E7334c76118F4576J39331p9406d06141B57282E8339c30516
18655b18231F958b45794A73933b6426o8106l2434B22966l8154a87315B75082e29738
18643c104j76079B01979b1872F9893c02731A1112O4479c2792A06304j0210C4653
$$ plain form
18631 -180290 12879 -473567 -156689 -239639 -35985 -32010 -279124 -29864 -410134 -15203 108795
18619 -46930 29251 -216836 119843 -112868 -107963 86032 99052 152329 7805 49 -376750 -75864
18606 155027 -32848 -140218 5610 58941 9915 -295314 -81383 -96038 -181117 -183888 -142128 -141369
18594 -141369 -55588 234313 -427870 -87025 -93058 70112 -259485 -214224 -49891 40288 -450697
18582 -237031 -70724 -2266 89393 -3664 29952 -248627 150575 -173330 253584 35832 45474
18571 45474 -59870 -231987 -322308 199710 -285876 33873 -153540 -309495 147835 -76233
18560 -84605 102327 100702 -124161 -176358 -23813 -43323 16051 81597 -26044 -38856 150277
18548 -97155 -60333 -212980 210893 -50868 155191 -82127 66873 221336 -3659 -174246 -20595
$$ packed form
18631a80290A2879d73567a56689q2950c5985L975k47114b9864l80270a5203A08795
18619d6930B9251b16836A19843a12868M905H6032J3020N3277G805D9c76750g5864
18606A55027c2848j07370E610N3331I915b95314h1383j4655q5079k771M1760P59
18594a41369e5588B34313d27870h7025o033G0112b59485M5261d9891D0288d50697
18582b37031g0724b266H9393c664B9952b48627A50575a73330B53584C5832R642
18571D5474e9870j72117r0321A99710b85876C3873a53540j55955A47835g6233
18560h4605A02327j625a24161n2197b3813j9510A6051O5546b6044j2812A50277
18548i7155L6822j52647B10893e0868A55191h2127F6873J54463c659j70587b0595
$$ plain form
18536 -275663 -188129 4305 220575 -105427 -183068 257434 -252228 364323 -176501 -180599 -290914
18525 -290914 -155666 -247099 -202539 266326 -138503 -22773 932 -54759 214761 175748 221365
18514 221365 291332 55136 -103264 -23380 -299447 -28310 -63236 -271173 -88398 -223701 -75027
18502 -143892 -22115 -291991 -355786 -71280 -39521 -7234 33026 186054 -393637 97139 -2670
18490 -326643 -156118 -38391 184510 20030 -17265 -248606 -74623 151666 -107583 29641
18479 -216480 144676 -199056 -133321 26939 -191132 6893 -202001 -107771 15645 26977 -87951
18467 -303077 173563 -196353 191648 125835 -109362 6130 -25288 -144030 -109252 -50699 -133816
18456 -133816 -1536 -292649 -214782 -72454 -108896 -15849 -219660 -246869 -181835 81235 -113169
$$ packed form
18536b75663Q7534D305K16270a05427p7641B57434b52228C64323a76501m098j10315
18525b90914J35248r1433M4560B66326a38503b2773I32e4759B14761l9013M5617
18514B21365O9967E5136a03264b3380k76067b8310l4926k07937h8398j35303g5027
18502a43892b2115k69876o3795g1280L1759g234C3026J53028c93637I7139b670
18490c26643a56118c8391A84510B0030a7265k31341g4623A51666a07583B9641
18479b16480A44676a99056O5735B6939a91132F893b02001R4230A5645J1332h7951
18467c03077A73563a96353A91648o5813a09362F130b5288j18742L4778e0699q3117
18456a33816a536k91113P7867g2454l6442a5849k03811k7209O5034H1235a13169
$$ plain form
18444 186241 16415 -6187 -127695 170747 240369 64613 -162836 -1949 -41083 24471 -80206
18432 -277762 -106412 15215 8969 -303408 -64257 -146324 -110230 -282983 271582 49643 115093
18421 115093 136094 8834 50827 -37868 64715 -105489 220714 -46195 -226421 -208096 -105101
18410 -105101 48936 -14442 -138525 81218 -219564 67543 162130 -90998 -77234 204685 64527
18398 78026 -85075 20357 -38758 -108462 -186476 -106411 -47010 32298 -1639 -357546 -31208 214573
18385 28043 -213436 76235 80535 -42184 117210 -260477 66204 37889 168773 158468 -16279
18373 -34925 -130206 -41681 -178020 -179286 -27629 100365 -45482 90955 255402 -178433 138847
18361 60705 33574 -230864 -24829 275334 24925 36802 -198889 183001 133971 188095 -158395
$$ packed form
18444A86241A6415f187j21508A70747O9622F4613a62836a949l9134B4471h0206
18432b77762a06412A5215o246c03408f4257q2067L6094j72753B71582D9643O5450
18421A15093K1001H834M1993c7868F4715a05489B20714d6195j80226J8325J02995
18410a05101D8936a4442j24083H1218b19564F7543R4587i0998J3764B04685F4527
18398G8026h5075B0357c8758o9704p8014Q0065d7010C2298a639l55907c1208B14573
18385B8043b13436G6235M300d2184A17210b60477F6204k8315J30884j0305a6279
18373c4925r5281d1681j36339j266b7629A00365d5482I0955J64447a78433A38847
18361F0705k7131b30864b4829B75334B4925J1877a98889A83001m9030N4124a58395
$$ plain form
18349 -8277 -323569 149408 -9164 -346232 -281408 -130133 -58085 97910 123917 -162048 -3433
18337 -54188 106528 -226318 -265476 -150498 -11181 -92345 158594 44389 104498 -143403 -208759
18326 -208759 -162842 -53951 -107900 -20779 319773 115447 -137969 1723 64191 290455 -200470
18314 -368298 270783 -276923 -47347 -46890 -142288 354340 -78750 -230055 -70542 -408964 109995
18302 -17917 286616 18623 -28372 -386822 81010 -45094 134069 -46317 293291 129858 -174193
18290 -109314 268571 -79186 79594 -121008 -30130 -99834 -323078 -45765 19805 -69752 63475
18278 67587 122994 215051 118179 -109238 33959 -118507 -287383 -243445 9420 96516 -199575
18266 268987 -185940 -139778 -48034 44841 -49522 56263 217144 -227551 198732 -65960 -64521
$$ packed form
18349h277l15292A49408i164l37068O4824a30133e8085I7910K6007a62048c433
18337e4188A06528b26318l9158J14978a1181q1164A58594D4389O0109a43403o5356
18326b08759M5917e3951n3949b0779C19773A15447a37969A723O2468K26264b00470
18314c68298B70783b76923d7347M57r5398C54340g8750j51305g0542l38422A09995
18302a7917B86616A8623b8372l58450H1010d5094A34069d6317B93291A29858a74193
18290a09314B68571g9186G9594a21008c0130o9704k23244d5765A9805f9752F3475
18278F7587N5407R2057r6872a09238C3959a18507j68876M3938I420Q7096a99575
18266B68987a85940M6162d8034D4841d9522E6263J60881b27551A98732f5960J439
$$ plain form
18255 -64521 -118052 1458 150391 -138119 62885 -89807 342873 13314 -44126 -285598 210477
18243 -42282 -64845 244196 -58053 -229777 -152656 -298662 -131079 167222 -155888 -3857 -110439
18232 -110439 -236648 -144234 203675 97988 -13273 29638 -336157 126206 -177001 -158323
18222 -158323 -149112 -170348 268763 -1462 -116062 170480 -63363 -120247 20080 46124 74634
18211 74634 -222078 -209463 -267435 -53490 174 213213 53095 -159177 90748 -114043 11131
18199 -212520 -409771 -159197 10815 -222988 125058 -384298 -15800 -60446 -149945 -4323 218531
18187 150921 -198631 -98845 124740 -153354 -354229 -197171 -205790 86386 109057 -33391 112678
18175 -237019 108638 -190268 -31300 122104 150381 103905 133305 -82181 -90825 -381408 126702
$$ packed form
18255f4521n3531A458J48933a38119F2885h9807C42873A3314d4126k41472B10477
18243d2282k2563B44196e8053j71724P7121j46006a31079A67222a55888c857j06582
18232a10439j26209R2414B03675I7988a3273B9638c36157A26206a77001J8678
18222a58323R211k1236B68763a462j14600A70480f3363n6884B0080K6044K8510
18211G4634b22078J2615n7972e3490A74K13039E3095a59177I0748a14043A1131
18199b12520j97251a59197A0815b22988A25058c84298a5800m4646q9499d323B18531
18187A50921a98631i8845A24740a53354k00875J57058q619H6386K2671c3391A12678
18175b37019A08638a90268c1300A22104K8277m6476K9400h2181q644k90583A26702
$$ plain form
18163 224712 188485 88936 92964 -88149 -309171 -331 149895 -87676 65888 -216435 54106
18151 -111071 -293847 209257 282994 -171063 16654 51664 -27408 -130775 -98052 -201171
18141 -201171 26383 18851 -62737 39103 -6833 -277713 111744 -83777 -51377 -123890 -213849
18130 -213849 -25733 -131900 186447 -151344 -100795 -74306 -115292 -135645 -46394 -109271 -114865
18119 -114865 147443 40676 -199593 -81189 260716 -110894 -230339 -16487 -124215 -190018
18109 -190018 172537 80806 1037 -139221 49710 42199 -50027 38090 73745 -355006 170256
18097 -144104 -103785 -9926 -7997 48149 208601 -10844 -51787 -372600 95475 -322608 -4373
18085 228548 240217 -251947 -152958 -434571 158021 -65342 6953 -124465 66858 -192160 -70689
$$ packed form
18163B24712l6227H8936M028h8149k21022c31A49895h7676F5888b16435E4106
18151a11071j82776B09257P3737a71063A6654L5010b7408j03367L2723j03119
18141b01171B6383p532f2737C9103f833k70880A11744h3777L2400p2513q9959
18130b13849b5733j06167A86447a51344N0549K6489m0986k0353d6394o2877n594
18119a14865A47443D0676a99593h1189B60716a10894j19445a6487j07728o5803
18109a90018A72537H0806A037a39221D9710p511e0027C8090L5655c55006A70256
18097a44104M0319i926J929D8149J60452a0844m0943l20813I5475c22608d373
18085B28548J1669b51947R8989k81613A58021f5342F953a24465F6858a92160g0689
$$ plain form
18073 -34840 104674 -309513 40204 88825 -177765 -133775 156516 -130701 35487 130798 113850
18062 113850 326771 23527 -218840 80346 -244754 -9277 43910 122351 198989 23250 -98935
18050 -204240 182985 20953 -141624 156738 -160506 -327434 -37449 100338 217266 -53535
18039 135876 83520 -112745 44117 156461 169183 -154622 34809 21209 -240280 -16123 22310
18027 366323 -60807 290300 85751 -615729 -133706 200887 -139288 33233 155915 226891
18017 226891 -104136 53241 -166676 -200651 32395 243907 106556 -788 -124552 91998 -331532
18005 -49567 -209546 -259060 -1181 26201 -45158 -161782 267365 281767 -39219 183117 52087
17993 255279 291316 196870 228659 -260238 156467 -116862 -55250 -518 -136194 -166963 -126950
$$ packed form
18073c4840A04674c09513D0204M8621a77765M3990A56516a30701C5487R5311j6948
18062A13850K12921B3527b18840H0346b44754i277D3910P8441P6638B3250i8935
18050b04240A82985B0953a41624A56738a60506j66928c7449A00338J16928e3535
18039A35876n2356a12745D4117J12344J2722a54622C4809j3600b40280a6123B2310
18027C66323f0807B90300H5751f15729a33706B00887a39288C3233J22682P0976
18017B26891a04136E3241a66676l3975C2395K11512A06556g88j23764I1998c31532
18005d9567j59979m9514a181B6201d5158j16624B67365J4402c9219A83117E2087
17993B55279L6037r4446L1789b60238A56467a16862e5250e18j35676l0769M0013
$$ plain form
17982 -126950 133007 29982 -256178 -295858 160508 -49682 155730 -146825 182402 -107664
17971 -364945 -26454 266554 54711 -229953 -96729 232049 318441 -161850 108624 122821
17961 122821 -175846 248741 127253 -131629 -90889 -201902 505286 345820 73591 -261616
17950 329132 -200789 -146433 -41213 426516 173166 -78746 30151 65386 -5642 83163 47091
17939 47091 189281 -243189 111974 100071 -137181 76915 -210792 293081 60617 -161919
17928 166414 161486 306931 -179596 23392 -61874 289310 -155606 -137980 85028 -64232 -128389
17917 -128389 -399732 -63885 138152 58334 -152563 -38631 98940 -156246 -258638 -137027
17907 -137027 256636 -156890 -178515 181684 -4012 -105621 -298339 -15148 -14482 -265625 -175080
$$ packed form
17982a26950A33007B9982b56178l9680A60508d9682A55730a46825A82402a07664
17971c64945b6454B66554E4711b29953i6729B32049Q6392a61850A08624J4197
17961A22821a75846B48741j21488a31629M0740j11013E05286j59466G3591b61616
17950C29132b00789N4356d1213D26516A73166g8746C0151L5235e642H3163l6072
17939D7091J42190b43189A11974j1903a37181G6915b10792B93081F0617a61919
17928A66414m928J45445a79596B3392f1874B89310a55606J7626H5028f4232o4157
17917a28389k71343f3885A38152E8334a52563c8631I8940a56246j02392J21611
17907a37027B56636a56890k1625A81684d012j01609j92718a5148O66k51143R0545
$$ plain form
17896 -175080 -24258 -99286 77508 -162351 -44604 201341 115404 -207942 -164074 34907 83323
17885 83323 -32742 -94715 260592 172640 -52727 111621 268067 211177 57715 -54963 -167577
17874 -167577 35600 -225911 63369 -115478 -202016 -191924 -187898 34078 186963 -49974 -296016
17863 -296016 -56474 -35109 -7991 -224185 -57829 -14787 -41230 322761 -9714 -225377 -94353
17851 130375 110898 171541 -19952 -21517 57245 139425 -131733 148562 226008 94506 -46203
17839 -106853 -111345 58722 55044 234897 -143749 -288367 252127 37914 -175660 -46633 -183711
17828 -183711 -145973 178552 259847 -25343 -50185 10233 -175710 71933 -57613 64257 131979
17817 131979 -207899 1153 -103883 75426 81055 186587 -17233 -272665 93398 106260 -80370
$$ packed form
17896a75080b4258p5028G7508a62351d4604B01341q5937b07942M3868C4907M8416
17885H3323c2742o1973B60592q7952e2727A11621J56446n6890E7715e4963j12614
17874a67577C5600b25911F3369a15478q6538J0092M026C4078J52885d9974k46042
17863b96016e6474K1365g991k16194e7829a4787k6443C22761i714k15663i4353
17851A30375j9477O0643a9952j565E7245Q2180a31733A48562P7446I4506d6203
17839a06853m492E8722l678J79853a43749j44618B52127C7914a75660d6633j37078
17828a83711L7738A78552Q1295b5343k4842A0233a75710G1933e7613F4257O7722
17817A31979b07899A153a03883G5426N629J05532a7233k55432I3398J2862h0370
$$ plain form
17805 373476 -36463 -17001 142096 104983 -242675 -221181 -80975 167172 137859 -17557 -17805
17794 -17805 108970 342072 -52848 51968 -77204 -5219 94061 66326 -233572 10384 247135
17783 247135 239203 -300139 -172154 -4820 30163 -66274 -29175 -81652 423066 -105025 108344
17771 -68151 214891 68155 -81865 37107 -188650 366213 -176744 74484 -99299 -34285 -142094
17760 -142094 183549 -347130 144968 138051 -119430 -43088 208556 35588 301462 435133
17750 435133 -76595 -150842 -46782 -90855 -212014 19934 79851 123851 115517 -87638 2992 182473
17738 182473 79467 33169 -110860 -63530 49515 10178 172530 10588 106946 4621 -22175
17726 140005 100758 101482 314673 633234 -67862 -190567 156917 -326180 208640 -111454
$$ packed form
17805C73476c6463a7001A42096l7113b42675K1494h0975A67172k9313a7557k48
17794a7805A08970K33102e2848E1968g7204e219I4061k7735b33572A0384K36751
17783B47135p932c00139J27985d820C0163f6274b9175n2477D23066a05025A08344
17771f8151B14891F8155h1865C7107a88650C66213a76744G4484i9299c4285j07809
17760a42094A83549c47130A44968o917a19430d3088B08556C5588K65874J33671
17750D35133g6595p4247d6782m4073j21159A9934N9917M4000q334h7638B992J79481
17738A82473G9467C3169a10860M7330D9515A0178J62352A0588R6358D621b2175
17726A40005l9247P24K13191L18561f7862j22705A56917c26180B08640a11454
$$ plain form
17715 14440 123560 68970 309420 212233 -58404 -76855 52663 -270391 -87494 66195 169573
17704 169573 21308 74722 79329 213347 25849 -156748 20916 -106228 173180 69287 -67652
17692 179493 219157 -153534 16808 232035 67165 340863 70779 -52488 295493 -78585 -14591
17680 -213371 -36447 -48314 -300247 366092 -75274 119501 -376880 230563 172887 34834
17669 123482 63333 269348 -333216 16145 79675 -105716 170925 -211424 134115 208932
17659 208932 -73224 -310872 183581 -253234 66882 164440 -314903 185538 270662 78277
17648 -39447 30523 -211204 137578 218091 87169 -62250 67343 -15479 240040 68423 -150061
17636 -241588 257918 -217500 193897 384408 -124800 -185099 260906 90858 71243 83861
$$ packed form
17715A4440J09120n4590K40450r7187e8404j8451E2663b70391h7494F6195J03378
17704A69573B1308N3414M607J34018B5849a56748B0916a06228A73180F9287f7652
17692A79493L9664a53534A6808K15227F7165K73698G0779e2488B95493g8585a4591
17680b13371c6447j1867k51933C66092g5274A19501c76880B30563n7676C4834
17669A23482o0149K06015c33216A6145O3530a05716A70925b11424A34115P4817
17659B08932g3224k37648A83581b53234F6882R7558c14903A85538Q5124G8277
17648c9447C0523b11204A37578Q0513H7169f2250F7343a5479B40040F8423a50061
17636b41588B57918b17500A93897J90511a24800o0299B60906I0858j9615J2618
$$ plain form
17626 83861 225182 -305106 130399 -202503 -46860 144777 45751 28432 -10246 321751
17615 -48189 61070 -127746 128445 200462 99233 105206 -551529 162764 -124826 179399 -92041
17603 141457 19182 -91522 -165736 221367 144423 112857 -131533 205596 373348 53850 -167713
17591 171221 -157516 96619 248425 176306 28278 282994 92354 -83549 109549 166712 -188340
17579 -146550 -48699 -168525 30777 -66728 84418 -83756 202995 333046 -24366 -270917 -16145
17567 78580 172258 -130923 137213 -17516 67231 40781 199544 12239 -89120 -116406 236275
17555 -104743 205181 46131 -33679 75167 -117943 129514 204186 -105274 42524 51345 -309125
17543 -206298 -97103 336652 49011 -172350 -63076 322225 -30004 85724 105095 42419 313470
$$ packed form
17626H3861J41321c05106A30399b02503d6860A44777D5751j7319a0246C21751
17615d8189F1070a27746A28445P2017I9233N973e51529A62764a24826A79399i2041
17603A41457A9182i1522p4214B21367p6944l1566a31533B05596J67752E3850a67713
17591A71221a57516I6619J51806p2119B8278K54716I2354h3549A09549N7163a88340
17579a46550d8699j19826C0777f6728H4418h3756B02995J30051b4366k46551a6145
17567G8580R3678a30923A37213a7516F7231k6450J58763A2239h9120k7286B36275
17555a04743B05181D6131c3679G5167a17943A29514P4672a05274D2524Q821c09125
17543b06298i7103C36652D9011a72350f3076C22225c0004H5724J9371D2419K71051
$$ plain form
17532 313470 301780 415675 -147584 252269 -108119 22025 -29824 113998 308343 137923
17521 -106266 36953 114911 76097 105840 -47508 -116730 -121277 367236 -55599 228488 50047
17509 399212 284698 335051 303546 -176754 171963 -9928 76200 -113395 191581 256739 233001
17498 233001 -24431 228150 -215511 214070 138600 126096 82903 38475 100653 75947 138394
17487 138394 74991 -122440 300640 276915 -37694 -43186 496047 -22128 -48140 -1363 156155
17475 94345 169430 290726 -131137 346894 192733 -205673 92908 312225 22961 -50701
17464 -7960 366974 -30412 474999 69817 146067 35880 196629 139406 149341 124562 331601
17453 331601 518945 165146 226879 104504 -24066 256423 219890 360143 495243 373044
$$ packed form
17532C13470j1690J13895a47584B52269a08119B2025b9824A13998J94345A37923
17521a06266C6953P7958l8814K9743d7508o9222m547C67236e5599B28488E0047
17509C99212j14514N0353l1505a76754A71963i928G6200a13395A91581O5158k3738
17498B33001b4431B28150b15511B14070p5470j2504m3193C8475O2178k4706O2447
17487A38394o3403a22440C00640k3725c7694n492D96047b2128k6012a363A56155
17475I4345P5085J21296a31137C46894j54161b05673I2908K19317B2961e0701
17464g960C66974c0412D74999F9817P6250C5880J60749n7223R935k4779K07039
17453C31601J87344A65146O1733A04504b4066B56423l6533J40253J35100j22199
$$ plain form
17443 373044 61612 189057 253284 172480 114594 206560 172144 510889 324423 343865 431067
17432 431067 281881 184230 244311 -77203 209631 213644 134496 -28135 337588 213448 208686
17421 208686 217792 32731 329264 399591 233861 294872 224766 155740 461384 20296 234566
17410 234566 152436 -379313 28919 299580 158694 136308 390329 -69113 -51630 -266746
17400 -266746 168752 36356 -36426 446589 249596 358703 371042 113370 556784 71706
17389 -146984 199101 108813 107694 96107 -129537 -271938 113856 67604 -3409 323956 -75912
17377 416432 288897 -33593 104155 297631 112330 81385 211929 420325 -126279 247498
17366 128417 313465 239021 333220 -123621 279859 342588 97149 68816 230427 344517
$$ packed form
17443C73044F1612J27445O4227q0804n7886R1966l4416L38745j86466J9442Q7202
17432D31067j49186r7651O0081g7203B09631M013p9148b8135C37588j24140m762
17421B08686R106C2731K96533P0327j65730O1011p0106o9026L05644B0296K14270
17410B34566q2130c79313B8919K70661j40886k2386K54021f9113J7483k15116
17400b66746A68752C6356c6426D46589j96993J09107J2339A13370M43414G1706
17389a46984A99101r0288j119j1587a29537j42401A13856m6252c409C23956g5912
17377D16432j27535c3593A04155J93476A12330l0945J30544K08396a26279B47498
17366A28417J85048p4444R4199a23621B79859O2729I7149k8333J61611J14090
$$ plain form
17356 344517 169121 -111390 246476 216162 83796 -112906 41120 258506 153677 168616
17346 168616 523752 35863 -20070 -48888 -5477 169978 34841 85447 112296 -73997 166390
17334 131317 248234 -81336 122093 -36544 118062 119084 256125 -71839 57338 72508 -22164
17322 -44270 193533 169712 429232 389326 180341 161828 574800 275413 5221 70361 25146
17310 270940 58405 456820 69889 286056 228102 454586 47180 213212 180606 132073 -64204
17298 331303 3748 -448088 88440 301227 240055 -16704 282929 88767 51766 193274 -44645
17286 74908 15799 11061 193428 22297 462485 -4199 -150319 242742 168722 -74390 343499
17274 131828 218206 146461 99602 18751 126376 323507 96650 143209 189896 -26655 585280
$$ packed form
17356C44517A69121a11390B46476l0314H3796a12906D1120K17386j04829J4939
17346A68616L55136C5863b0070k8818e477A69978C4841N0606K6849g3997A66390
17334A31317J16917h1336A22093c6544A18062J022J37041g1839E7338J5170b2164
17322d4270A93533k3821K59520l9906A80341j8513M12972B75413E221O5140B5146
17310B70940E8405L98415F9889K16167n7954K26484D7180J66032l2606m8533f4204
17298C31303C748d48088H8440K12787o1172a6704B82929H8767l7001J41508d4645
17286G4908A5799m738J82367B2297M40188d199j46120B42742p4020g4390C43499
17274A31828Q6378p1745m6859A8751J07625J97131I6650M6559M6687b6655E85280
$$ plain form
17262 113708 245862 165959 156531 143937 18968 -7953 71183 332729 242179 295106 -1308 108741
17249 366794 569179 -67529 413502 235186 115868 317078 321089 78514 24025 327117
17239 327117 110283 135660 299818 -86497 233752 45951 -120703 162822 228405 -7365 397554
17227 267564 -90293 226099 62434 278372 406703 -68681 -14991 142084 169904 -81052 436762
17215 33677 547112 126752 48660 123144 321017 171303 26877 470327 126150 366249
17205 366249 452211 298797 209754 292952 567112 181595 579547 68252 396284 336874
17195 336874 500688 362095 263409 88057 277258 131948 225064 355540 238762 409561
17185 409561 79810 389546 251582 355651 394466 556720 547477 96417 363927 370129 53423
$$ packed form
17262A13708J32154p9903r428j2594A8968g953G1183K61546r0550N2927a308A08741
17249C66794K02385f7529D13502j78316A15868K01210M011G8514B4025L03092
17239C27117A10283K5377J64158h6497B33752D5951a20703A62822O5583g365C97554
17227B67564i0293B26099F2434K15938J28331f8681a4991A42084K7820h1052D36762
17215C3677N13435A26752D8660P4484J97873j49714B6877M43450A26150K40099
17205C66249Q5962j53414q9043Q3198K74160A81595L97952F8252L28032n9410
17195C36874J63814j38593r8686H8057J89201A31948R3116J30476j16778J70799
17185D09561G9810L09736j37964J04069L8815J62254r243I6417K67510O202E3423
$$ plain form
17173 12805 186244 236639 297153 133922 424562 354464 250982 301723 295366 476157 427821
17162 427821 67813 137808 128838 293237 -147287 178837 145708 343520 532433 315782
17152 315782 162834 259290 284216 543676 -33947 156449 494915 214771 -50126 216343
17141 408646 600382 346970 475509 137922 590957 556519 376793 427811 331635 253952
17131 253952 261893 393335 207140 394527 -167764 361636 311129 190906 2937 405578
17121 405578 406833 573264 376950 499086 316848 304147 73999 251728 220088 179819 5237
17109 687177 612022 629753 261950 206590 581230 399716 395162 260280 185752 361624 251510
17098 251510 470839 539755 231473 368876 580730 266204 688531 256629 455947 470506
$$ packed form
17173A2805J73439N0395O0514A33922K90640p0098j03482N0741o357J80791m8336
17162D27821F7813O9995q970J64399a47287A78837l3129J97812J88913k16651
17152C15782j52948R6456K4926K59460c3947A56449L38466B14771e0126B16343
17141D08646J91736k53412J28539A37922M53035l4438j79726N1018r6176p7683
17131B53952P941J31442j86195J87387a67764C61636n0507j20223B937M02641
17121D05578J255J66431j96314J22136j82238j2701G3999J77729l1640m0269E237
17109F87177p5155J7731B61950n5360L74640j81514m554j34882p4528J75872j10114
17098B51510K19329O8916B31473J37403K11854B66204M22327B56629J99318J4559
$$ plain form
17088 470506 598752 501130 549305 604155 568925 722298 495945 505170 445776 641098 408277
17077 408277 552370 150814 551508 403810 405825 490372 467557 673648 488221 702845
17067 702845 639275 356595 701729 636993 647983 524622 382959 230387 532739 791080
17057 791080 631641 540678 531677 534961 716835 536951 529113 478196 638354 717135 284559
17045 362998 654579 839598 404062 452103 612628 462375 590937 750353 499676 649413
17035 649413 777273 505561 749842 773167 708695 851196 891252 332800 775266 371963
17024 651718 621823 550368 749499 603521 585265 950060 759374 788090 495890 400060
17014 400060 886160 424967 897654 1035178 598050 850231 774459 700381 558444 777052
$$ packed form
17088D70506J28246r7622M8175N4850l5230J53373k26353R225n9394J95322k32821
17077D08277J44093A50814M00694j47698K015Q4547k2815K06091j85427K14624
17067G02845o3570k82680L45134o4736J0990j23361j41663j52572L02352K58341
17057G91080j59439r0963r001L284J81874j79884p838n0917J60158P8781B84559
17045C62998K91581J85019D04062M8041J60525j50253J28562J59416k50677J49737
17035F49413J27860k71712K44281K3325o4472J42501M0056C32800M42466C71963
17024F51718k9895p1455J99131j45978j8256L64795j90686K8716k92200r5830
17014D00060M86100D24967M72687J37524m37128K52181p5772p4078j41937K18608
$$ plain form
17004 777052 792170 679214 696820 759174 599300 965591 829958 747179 679883 725625 728889
16993 728889 922317 1055963 537455 723417 906361 652123 971844 778645 908234 999483
16983 999483 1025813 986940 790713 1069358 1014338 765021 948066 1137695 736393 1061783
16973 1061783 1140915 1143417 956196 932380 667180 968302 714802 1058093 1051726 1169817
16963 1169817 1214226 905640 1285259 1069729 940884 1308645 1212510 1231702 1293928 1209211
16953 1209211 996440 1064833 1250944 1210961 1144213 1193605 1421779 874126 1232938 1274553
16943 1274553 1168148 1179669 1134955 1141122 1205116 1550343 1210244 1321122 1173024 1151632
16933 1151632 1364912 1401640 1525092 1543577 1486712 1364081 1286534 1333847 1299943 1463856
$$ packed form
17004G77052J5118j12956J7606O2354j59874L66291j35633q2779o7296M5742L264
16993G28889J93428J33646n18508J85962J82944k54238L19721j93199J29589R1249
16983I99483K6330l8873j96227K78645n5020k49317J83045J89629m01302L25390
16973A061783P9132K502j87221k3816k65200L01122k53500L43291o367J18091
16963A169817M4409l08586L79619k15530j28845L67761r6135J9192O2226q4717
16953A209211k12771O8393J86111l9983o6748M9392K28174n47653L58812M1615
16943A274553j06405J1521m4714O167O3994L45227l40099J10878j48098k1392
16933A151632K13280L6728J23452J8485n6865j22631p7547M7313l3904J63913
$$ plain form
16923 1463856 1266484 1305644 1819183 1603216 1436466 1273289 1697357 1588353 1241557 1730591
16913 1730591 1785697 1809357 1813438 1786521 1628955 1787355 1737530 1897458 1922770 1835852 2018955
16902 2018955 1858639 1784600 1817210 2065660 1997410 1873721 2014680 2006194 1820560 1882287
16892 1882287 2402627 2055430 2233275 2259965 2186602 1896914 2267277 2118193 2388700 2329229
16882 2329229 2000760 2497764 2416017 2407727 2188410 2471123 2541271 2625887 2674755 2588766 2675503
16871 2675503 2627940 3048744 2733787 2878448 2823327 2680587 3017320 3046301 2814795 3212151
16861 3212151 3091896 3497429 3156719 3587298 3458074 3265140 3401641 3515021 3432913 3506579
16851 3506579 3391595 3598974 3696668 3707686 3781600 3637762 4091017 4296438 4258195 3929765
$$ packed form
16923A463856j97372L9160N13539k15967j66750j63177M24068j09004l46796M89034
16913A730591N5106K3660M081k6917j57566J58400m9825J59928K5312q6918J83103
16902B018955j60316p4039L2610K48450o8250j23689J40959q486j85634O1727
16892A882287N20340l47197J77845K6690p3363k89688L70363j49084K70507n9471
16882B329229l28469M97004q1747q290k19317K82713P0148Q4616M8868q5989Q6737
16871B675503m7563M20804l14957J44661n5121j42740L36733K8981k31506L97356
16861C212151j20255M05533l40710M30579j29224j92934J36501J13380q2108P3666
16851C506579j14984K07379R7694J1018P3914j43838M53255K05421l8243l28430
$$ plain form
16841 3929765 4306454 4284809 4268046 4474305 4509448 4380956 4448192 4608335 4555840 4838813
16831 4838813 4975379 4970714 5280715 5162500 5357307 5629224 5604029 5734065 5729869 5857464
16821 5857464 6259618 6084674 6031777 6268642 6521877 6623286 6722284 6907705 6882817 7344786
16811 7344786 7104366 7959230 7447315 7742759 8248334 7901795 7725435 8498163 8539231 8377923
16801 8377923 8696225 9080211 9328743 9720446 9575533 9933255 10300961 10371883 10847973 11219081
16791 11219081 11463333 11624508 11765342 12417694 12584144 12871920 13113643 13784755 14209094
16782 14209094 14556649 14909820 15055616 15432836 16172296 16559837 17141882 17655827 18442010
16773 18442010 18916318 19481118 20258319 20784651 21477684 22247927 22990669 23995228 24800984
$$ packed form
16841C929765L76689k1645j6763K06259L5143j28492O7236J60143n2495K82973
16831D838813J36566m665L10001j18215J94807K71917k5195J30036m196J27595
16821E857464M02154j74944n2897K36865K53235J01409R8998J85421k4888M61969
16811G344786k40420Q54864n11915K95444N05575l46539j76360P72728M1068j61308
16801H377923L18302L83986K48532L91703j44913L57722L67706P0922M76090L71108
16791A1219081K44252J61175J40834O52352J66450K87776K41723O71112M24339
16782A4209094L47555L53171J45796L77220P39460L87541N82045N13945P86183
16773A8442010M74308N64800P77201N26332O93033P70243P42742J004559Q05756
$$ plain form
16764 24800984 25478548 26536584 27734293 28583069 29729001 31037357 32102348 33536182
16756 33536182 34663189 36246880 37999021 39648137 41327005 43016584 44914900 47353124
16748 47353124 49416839 51652677 54376192 56655223 59922501 62703091 65793617 68784939
16740 68784939 72556757 76403576 80282720 84569711 89040914 93807694 98752414 103442546
16732 103442546 108297916 113868529 119081030 124242563 129700273 135498969 140041982 144851825
16724 144851825 149479239 153910023 156654901 159722662 161586874 162850889 163250923 162978710
16716 162978710 161438323 159442696 156789277 153111441 149469728 144858558 139740984 134211394
16708 134211394 129005896 123541590 118188374 112561905 107310222 101776497 97085736 91886907
$$ packed form
16764B4800984O77564J058036J197709Q48776J145932J308356J064991J433834
16756C3536182J127007J583691J752141J649116J678868J689579J898316K438224
16748D7353124K063715K235838K723515K279031L267278K780590L090526K991322
16740F8784939L771818L846819L879144M286991M471203M766780M944720M690132
16732A03442546M855370N570613N212501N161533N457710N798696M543013M809843
16724A44851825M627414M430784K744878L067761J864212J264015M00034k72213
16716A62978710j540387j995627k653419l677836l641713m611170n117574n529590
16708A34211394n205498n464306n353216n626469n251683n533725m690761n198829
$$ plain form
16700 91886907 87272563 82962486 78527755 74424320 70617341 67024902 63717989 60548500
16692 60548500 57584586 54748739 51910748 49814513 47341563 45057064 43397503 41110202
16684 41110202 39042083 37439869 35679950 34517030 32703219 31735524 30125738 28998781
16676 28998781 28274539 26730488 25811047 24659744 23848456 22703029 22511352 21259438 20680403
16667 20680403 19758435 19443180 18326830 17770634 17488688 16543726 16196941 15648176 14931914
16658 14931914 14828494 14442420 14089682 13442069 13115645 12508473 12272220 11742145 11465870
16649 11465870 11224356 11025813 10830495 10554515 10200294 9709905 9701969 9532333 9133617 8570477
16639 8570477 8516477 8630294 8208763 7839346 8414554 8014954 7424173 7364714 7241126 7322020
$$ packed form
16700I1886907m614344m310077m434731m103435l806979l592439l306913l169489
16692F0548500k963914k835847k837991k096235k472950k284499j659561k287301
16684D1110202k068119j602214j759919j162920j813811r67695j609786j126957
16676B8998781p24242j544051r19441j151303q11288j145427j91677j251914n79035
16667B0680403r21968l15255j116350n56196k81946r44962l46785n48765p16262
16658A4931914j03420l86074l52738o47613l26424o07172k36253n30075k76275
16649A1465870k41514j98543j95318k75980l54221m90389p936j69636l98716n63140
16639H570477n4000J13817m21531l69417N75208l99600n90781n9459j23588Q0894
$$ plain form
16629 7322020 6800095 6734734 6680180 6078982 6133538 6052751 6294372 5860450 6032103 5929679
16619 5929679 5528548 5630125 5524256 5353846 5442081 5250870 4837044 5317376 4766623 4453680
16609 4453680 4677576 4426711 4398974 4376786 4599171 4216410 4424023 4100451 3824672 4083185
16599 4083185 3900101 3770934 3897936 3986201 3505858 3249822 3724535 3350755 3483515 3783775
16589 3783775 3297311 3263723 3085510 2970931 2995243 3128490 3013181 3152992 2942551 3117736
16579 3117736 3005984 2649421 2746330 2444662 2701844 2717257 2537613 2636018 2485331 2443463
16569 2443463 2465496 2264095 2251210 2220841 2048168 2237669 2232280 2264737 2216410 2245015 2370981
16558 2370981 2308436 2002094 2093814 2214490 2014713 2089703 1902185 2119043 1994676 1825512
$$ packed form
16629G322020n21925o5361n4554o01198N4556q0787K41621m33922J71653j02424
16619E929679m01131J01577j05869j70410Q8235j91211m13826M80332n50753l12943
16609D453680K23896k50865k7737k2188K22385l82761K07613l23572k75779K58513
16599D083185j83084j29167J27002Q8265m80343k56036M74713l73780J32760L00260
16589C783775m86464l3588j78213j14579K4312J33247j15309J39811k10441J75185
16579C117736j11752l56563R6909l01668K57182J5413j79644R8405j50687m1868
16569B443463K2033k01401j2885l0369j72673J89501n389L2457m8327K8605J25966
16558B370981o2545l06342R1720J20676j99777P4990j87518K16858j24367j69164
$$ plain form
16548 1825512 1823715 2064767 1625589 1879662 1488081 1800215 1565276 1775149 1333740 2101656
16538 2101656 1601575 1604529 1558428 1453313 1658677 1309047 1523706 1587160 1597646 1626522
16528 1626522 1445321 1485706 1487875 1612037 1449122 1668169 1627043 889897 1322051 1406345
16518 1406345 952979 1054575 1519155 1309815 1086849 1118958 1212639 1011643 1082208 1028306
16508 1028306 1376207 1216662 932622 1043273 896913 1318430 1319342 1085161 1018764 1033131
16498 1033131 1309819 1310806 1065541 1353148 526656 1236882 889686 744104 1018163 966109
16488 966109 1102882 895177 786270 910997 494904 826062 840935 1173331 1091918 752537
16478 752537 814873 1010075 947724 904525 820571 1055943 868475 702971 820078 613181
$$ packed form
16548A825512j797K41052m39178K54073l91581L12134k34939K09873m41409P67916
16538B101656n00081K954m6101j05115K05364l49630K14659O3454J0486K8876
16528A626522j81201M0385K169J24162j62915K19047m1126p37146M32154Q4294
16518A406345m53366J01596M64580k09340k22966L2109R3681k00996P0565n3902
16508A028306L47901j59545k84040J10651j46360M21517R12k34181o6397J4367
16498A033131K76688R87k45265K87607E26656P10226l47196j45582K74059n2054
16488I66109J36773k07705j08907J24727m16093L31158J4873L32396q1413l39381
16478G52537O2336J95202o2351m3199q3954K35372j87468j65504J17107k06897
$$ plain form
16468 613181 719180 890849 913249 718193 781982 1043481 707908 797857 586716 644422
16458 644422 607469 781788 767751 1018264 859357 386512 860132 780367 713457 1038589
16448 1038589 422499 895078 486573 469064 375323 622921 669612 839421 742266 435717
16438 435717 854551 414253 596442 825613 405851 540671 653241 769806 857016 690061
16428 690061 282294 875472 965198 869416 607272 300592 465266 676842 569191 424151
16418 424151 573729 372083 499644 666305 615494 383167 415008 160860 900927 670469
16408 670469 663226 524670 310452 603370 378806 176967 192051 277667 458235 623597
16398 623597 585108 513168 373425 504527 528015 717336 632230 227188 710460 162355
$$ packed form
16468F13181J05999J71669K2400j95056O3789K61499l35573Q9949k11141N7706
16458F44422l6953J74319j4037K50513j58907C86512M73620p9765o6910L25132
16448A038589D22499M72579m08505j7509r3741K47598M6691J69809r7155l06549
16438D35717M18834D14253J82189K29171D05851J34820J12570J16565Q7210j66955
16428F90061B82294N93178Q9726r5782k62144C00592J64674K11576j07651j45040
16418D24151J49578k01646J27561J66661n0811k32327L1841A60860P40067k30458
16408F70469p243j38556k14218K92918k24564A76967J5084Q5616J80568J65362
16398F23597l8489p1940j39743J31102K3488J89321q5106B27188M83272A62355
$$ plain form
16387 283635 393369 497408 416945 402015 270658 565409 421672 319320 415558 263014
16377 263014 370470 396326 473133 613210 449420 400886 194134 219122 70338 293242
16367 293242 452043 395517 132826 328645 219918 105290 428721 520526 274935 360032
16357 360032 284964 241427 320224 489397 134766 349590 321099 427648 359108 413744 312884
16346 312884 179836 597007 265116 172724 -93648 80623 225380 261035 350920 305346 297540
16335 297540 383260 336398 276024 360084 350636 478616 419433 550545 195200 300715 193883
16324 193883 139417 279415 530189 429720 219214 507207 -59875 108023 54371 587930
16314 587930 392268 134820 119313 500092 418155 418201 391252 353804 581914 491070 231075
$$ packed form
16387B83635J09734J04039q0463j4930j31357K94751j43737j02352R6238j52544
16377B63014J07456K5856P6807J40077j63790m8534A94134K4988G0338K22904
16367B93242J58801n6526A32826J95819j08727A05290L23431R1805k45591Q5097
16357C60032p5068m3537P8797J69173A34766K14824k8491J06549o8540N4636j00860
16346C12884j33048M17171B65116r2392i3648H0623J44757L5655Q9885m5574p806
16335B97540Q5720m6862o0374Q4060r448J27980n9183J31112A95200J05515j06832
16324A93883n4466J39998K50774j00469k10506K87993e9875A08023n3652N33559
16314E87930j95662A34820j5507L80779q1937M6k6949l7448K28110r0844B31075
$$ plain form
16302 381406 281434 309449 287155 128021 125796 360987 540841 372251 206544 277701 24073
16290 327598 64924 -113967 184620 544167 53591 519244 275030 341547 17412 428264
16280 428264 68177 576542 191828 271771 303849 265575 145558 -22921 558391 224666
16269 223455 417000 22234 58357 402406 352720 240960 95017 152147 257152 6726 494818
16258 494818 253854 258467 191422 338328 119645 256433 -18728 -8259 182266 123582 53136
16246 -46242 238830 172912 263059 224669 90278 50403 59395 43952 168655 111232 -47258
16234 274348 -37942 37533 483313 292344 57612 292501 -22523 344324 83640 -207800
16223 135570 103796 -83414 254221 380937 -34090 401630 -44877 321312 76320 234283
$$ packed form
16302C81406r9972K8015k2294A28021k225K35191J79854j68590j65707P1157B4073
16290C27598F4924a13967A84620L59547E3591M65653k44214O6517A7412M10852
16280D28264F8177N08365A91828P9943L2078l8274j20017b2921E58391B24666
16269B23455J93545B2234L6123L44049m9686j11760I5017N7130J05005F726M88092
16258D94818k40964M613o7045J46906A19645J36788a8728h259A82266n8684E3136
16246d6242B38830o5918R0147l8390I0278l9875Q992j5443J24703n7423d7258
16234B74348c7942C7533M45780j90969E7612K34889b2523C44324H3640b07800
16223A35570l1774h3414B54221J26716c4090D01630d4877C21312G6320J57963
$$ plain form
16213 234283 105324 -27484 -51461 -160412 167049 31422 -84793 189944 247408 -14330 -26859
16202 -26859 165033 126970 265766 15091 444504 109093 185894 -128199 346146 -92801
16191 85668 241054 376470 18671 132526 109930 63722 -18868 -187416 -49483 222156 -101555
16179 260209 185975 7827 91798 -41959 279503 258381 -145734 88266 237103 191724 170125
16168 170125 86459 398385 -152863 201726 -266092 -34706 -10966 313015 -82425 296545
16157 -157370 -128779 -35581 -53815 -247226 210490 195881 26650 12967 28053 169518 -81916
16145 120335 353926 -189013 165350 32286 164420 137391 106506 -146069 332950 -74892
16134 126082 6596 60387 -122898 -36003 128164 187453 275976 153544 172732 27369 -155925
$$ packed form
16213B34283A05324b7484k3977j08951A67049C1422h4793A89944N7464a4330j2529
16202b6859A65033l8063J38796A5091M29413A09093P6801a28199C46146i2801
16191H5668J55386J35416A8671J13855k2596m6208a8868j68548d9483B22156a01555
16179B60209p4234G827Q3971d1959B79503k1122a45734H8266J48837m5379k1599
16168A70125q3666L11926a52863B01726b66092c4706a0966C13015h2425B96545
16157a57370K8591c5581j8234j93411B10490j4609B6650A2967J5086J41465h1916
16145A20335K33591a89013A65350C2286J32134k7029l0885a46069C32950g4892
16134A26082F596N3791a22898c6003A28164N9289Q8523j22432J9188B7369a55925
$$ plain form
16122 -19548 -304248 -98044 19394 -27072 278846 -73068 -42972 122771 -148002 138654 -63291
16110 -141949 2498 186185 -126119 -124844 -15433 120718 245735 17392 -71108 -58543 134826
16098 4524 -160028 -166408 92603 246284 -13307 -18835 -31726 162627 -107159 -317179 52261
16086 143468 268643 -7294 369197 37791 51565 224124 58145 100601 -76360 -237665 41335
16074 12255 65923 135869 278221 26746 148487 -193391 -102399 144404 -293447 299852
16063 81980 178134 8676 195374 -84318 -202183 -17414 -51613 95984 -200270 -183386 -301450
16052 -301450 -72586 -62621 220767 43244 103193 -244419 78347 110777 325202 -122120 25960
16040 -4386 -88823 -277850 -213256 168617 -223783 109727 141814 -22113 -18905 -245948 -264937
$$ packed form
16122a9548k84700i8044A9394b7072B78846g3068L0096A22771a48002A38654f3291
16110a41949B498J83687a26119J275a5433A20718J25017A7392g1108J2565A34826
16098D524a60028o380I2603J53681a3307n528j2891A62627a07159k10020E2261
16086A43468J25175g294C69197C7791J3774J72559E8145M2456g6360j61305D1335
16074A2255N3668O9946J42352B6746J21741a93391R0992A44404b93447B99852
16063H1980R6154H676J86698h4318j17865a7414l4199I5984b00270J6884j18064
16052c01450g2586R965B20767D3244N9949b44419G8347L2430K14425a22120B5960
16040d386q4437j89027O4594A68617b23783A09727L2087b2113L208k27043j8989
$$ plain form
16029 -264937 105236 -105033 -97736 -60561 -13261 -26687 -341318 -28588 -44537 -382924 -79180
16017 -140542 38634 69825 -48486 -95252 132774 171521 132153 -26169 -11254 152832 -96451
16005 4165 210422 -127809 102939 -267356 -61999 175613 234531 156847 100682 -36460 8039
15993 -25568 -140649 42996 -27462 -233319 44865 -20431 196178 270000 31453 376364 344224
15982 344224 319614 314538 60971 409781 132739 380758 -22352 -54453 132539 171073 100610
15971 100610 145084 224853 -12672 -151818 -39567 -56190 -166644 -101182 89659 26313 -27212
15959 95193 -307664 -125163 -10987 -175682 -78304 -253901 -120664 253950 261428 -217753
15948 -68830 7267 -262741 -61179 98488 312241 -101163 299147 -92758 153194 -299387 154702
$$ packed form
16029b64937A05236a05033P297L7175a3261j3426l14631b8588j5949l38387g9180
16017a40542C8634L1191d8486m6766A32774L8747l9368b6169a1254A52832i6451
16005D165K06257a27809A02939b67356f1999A75613N8918p7684n6165c6460H039
15993b5568j15081D2996b7462k05857D4865b0431A96178P3822C1453L44911l2140
15982C44224k4610n076F0971L48810A32739K48019b2352l2101A32539L8534p0463
15971A00610M4474P9769a2672j39146c9567j6623j10454O5462H9659B6313b7212
15959I5193c07664a25163a0987j64695g8304j75597a20664B53950P478b17753
15948f8830G267b62741f1179I8488K13753a01163B99147i2758A53194b99387A54702
$$ plain form
15936 -90997 187627 -368929 139542 -295754 -135680 248420 -173771 -36311 -219938 -198696
15926 -198696 -206757 -26005 212001 -441793 -52801 -85185 120286 37285 -214082 -353660 12787
15914 -165385 37531 186630 -246949 -300100 60234 92288 209796 2583 68743 106037 141456
15903 141456 -66999 49219 -59318 -133359 2012 352688 226236 -7843 -63891 -236484 -348681
15892 -348681 134514 44678 -260917 35774 -51479 -105673 61356 95253 54058 126306 5457
15880 -131762 -83674 65260 -90017 -169160 189071 84384 -250790 242190 -41781 -458866 72177
15868 17252 6664 -3142 105810 264313 -91925 99312 132155 -19824 56701 -154930 68535
15856 -13435 349499 -221732 17223 116785 -210731 242752 -316236 57765 154737 -63231 -382872
$$ packed form
15936i0997A87627c68929A39542b95754a35680B48420a73771c6311j83627K1242
15926a98696q061b6005B12001d41793e2801l2384A20286C7285b14082j39578A2787
15914a65385C7531J49099b46949n3151F0234L2054J17508B583O6160L7294L5419
15903A41456f6999D9219e9318p4041B012L50676j26452g843n6048j72593j12197
15892c48681A34514D4678b60917C5774e1479n4194F1356L3897m1195P2248E457
15880a31762M8088F5260i0017p9143A89071H4384b50790B42190d1781m17085G2177
15868A7252F664c142A05810J58503i1925I9312L2843a9824E6701a54930F8535
15856a3435C49499b21732A7223R9562b10731B42752c16236E7765R6972f3231l19641
$$ plain form
15845 -382872 -186536 -289566 -217789 35106 -355266 54295 -28436 240292 174426 205465 -204490
15833 86605 -124278 -230900 -22899 -35020 -189714 -228449 161231 -246511 -35095 40926 -315662
15821 116553 64960 -227613 147955 -287005 -141644 229284 187698 -338996 -7780 -269194
15811 -269194 -64882 -230350 -280380 137105 224803 5373 183852 149233 2145 22554 -126130
15799 -26703 -186491 -51680 -213405 -17020 -130987 -67420 -95783 66942 20679 -149364 -5564
15787 -252710 -9370 -346882 -50278 -103061 87391 83480 -173979 228380 -22236 -152879 -72220
15775 -37989 -199286 -11800 22766 -53238 91714 -253838 6244 205429 42262 326579 24144
15763 35458 -24783 125648 157571 -154191 -28066 414861 23689 68678 -238104 -16571 129208
$$ packed form
15845c82872a86536j03030P1777C5106c55266E4295b8436B40292o5866L1039b04490
15833H6605a24278j06622b2899j2121j54694l8735A61231b46511c5095D0926c15662
15821A16553n1593b27613A47955b87005a41644B29284m1586c38996g780k61414
15811b69194f4882j65468n0030A37105Q7698E373J78479l4619B145K0409a26130
15799b6703j59788e1680j61725a7020j13967O3567k8363F6942B0679a49364e564
15787b52710i370l37512e0278n2783H7391l911a73979B28380b2236j30643g2220
15775c7989j61297a1800B2766e3238I1714b53838F244J99185D2262K84317B4144
15763C5458b4783A25648L1923a54191b8066D14861B3689M4989b38104a6571A29208
$$ plain form
15751 -541588 170814 -210246 -145090 -54652 -10084 -20503 70246 -74053 -42645 -227876 -71915
15739 44718 151798 -170295 -67703 87963 132369 -44658 -106191 1799 64969 -338707 -22397
15727 83973 125789 -42198 95977 -60342 -337787 347191 -116140 -50323 44149 269844 142380
15716 142380 -331613 -125530 -232185 75085 -280528 4522 244739 -134141 -194103 70920
15705 -49540 -82758 206572 -63809 122945 -51145 43791 -159105 3237 128741 56902 118625
15694 118625 -206997 89060 -303727 15274 328792 197803 -30474 144373 -189655 -56042
15683 406662 -23230 -89113 -979 68155 39699 -25790 285176 180748 404 20402 215094 -169045
15670 -33826 30571 -164121 -32879 234270 -30117 -223972 6711 -104064 -125882 -48336 -159296
$$ packed form
15751e41588A70814b10246O5156e4652a0084j0419G0246g4053L1408j85231g1915
15739D4718J07080a70295f7703H7963M4406d4658o1533A799O3170c38707b2397
15727H3973M1816d2198I5977f0342k77445C47191a16140e0323D4149K25695j27464
15716A42380c31613a25530j06655G5085b80528D522K40217a34141n9962G0920
15705d9540l3218B06572f3809A22945e1145D3791a59105C237J25504E6902O1723
15694A18625b06997H9060c03727A5274L13518j30989c0474A44373a89655e6042
15683D06662b3230o5883i79F8155k8456b5790B85176j04428D04J9998J94692a69045
15670c3826C0571a64121c2879B34270c0117j93855F711a04064k1818d8336j10960
$$ plain form
15659 -159296 35340 10981 -160712 272587 124563 -60058 -220578 92020 -282322 164839
15648 -96464 216094 325929 43126 84139 -83105 54568 -3651 77883 105985 115698 -156930
15636 48302 -192282 -321808 -107354 214782 127664 25338 -324539 -92851 11648 -76586 -134946
15625 -134946 -68304 26156 -52226 109936 145472 58620 332586 35754 202145 15263 -224076
15613 332278 188242 -299312 -286355 65444 -134605 -20007 262551 384814 -26342 17148
15602 -237950 -201794 -318457 -338624 282420 -131136 98347 182149 -133363 -27065 6351 282210
15591 282210 -40378 -150831 139712 290433 126553 -40694 -23609 135151 -352450 -178731
15581 -178731 -21774 27204 -1043 86168 55789 -305913 -84597 20451 -152351 12823 -119611
$$ packed form
15659a59296C5340A0981a60712B72587A24563f0058j60520I2020b82322A64839
15648i6464B16094J09835D3126M1013h3105E4568c651G7883K8102R713a56930
15636D8302a92282j29526a07354B14782q7118B5338c24539i2851A1648g6586n8360
15625a34946O6642B6156e2226A09936L5536E8620K73966C5754J66391A5263b24076
15613C32278j44036b99312J2957F5444a34605b0007B62551J22263b6342A7148
15602b37950L6156j16663k0167B82420a31136I8347Q3802a33363b7065F351K75859
15591B82210d0378j10453A39712J50721A26553d0694J7085A35151c52450J73719
15581a78731b1774B7204a043H6168l0379c05913h4597B0451a52351A2823a19611
$$ plain form
15569 -186369 -117386 -9197 -171291 115715 172439 71079 66362 34680 -93611 -215362 33370
15557 104846 -44165 112781 -210797 -136514 -849 80415 93704 273751 -309048 -384420 237270
15545 -116082 192909 275487 -68539 -147492 -228505 -147891 5336 -22385 481818 257496 261898
15534 261898 215628 -81983 93902 -224502 22011 -113538 -34414 77396 -97075 156576 -42018
15522 -90067 299396 -33822 37745 132602 286165 -171287 287861 26066 -144830 220266
15511 66490 -99543 29120 -207554 -322254 -422781 13955 222267 5784 -91441 56976 -489932
15499 -188434 264146 -269774 350128 -137817 -18668 -19680 291942 -85552 178540 -174669
15488 -163172 159900 -84132 -71516 -184471 169547 -227466 43676 -77505 15809 133530
$$ packed form
15569a86369O8983i197j62094A15715N6724G1079m717l1682i3611j21751C3370
15557A04846d4165A12781b10797P4283h49H0415J3289J80047c09048p5372B37270
15545a16082A92909Q2578f8539p8953q1013Q0614E336b2385D81818k24322M402
15534B61898m6270h1983I3902b24502B2011a13538c4414G7396i7075A56576d2018
15522i0067B99396c3822C7745R4857J53563a71287B87861B6066a44830B20266
15511F6490i9543B9120b07554j14700j00527A3955K08312E784i1441E6976d89932
15499a88434B64146b69774C50128a37817a8668j012B91942h5552A78540a74669
15488a63172A59900h4132J2616j12955A69547b27466D3676g7505A5809J17721
$$ plain form
15478 133530 -116790 227633 162683 -275061 101280 185923 77215 113290 -91990 -135703 60440
15466 -222680 135965 244213 -142601 -202262 21631 -153457 172868 22753 79564 -208635
15455 -18490 -136250 -75998 13160 -211580 -78490 55261 -145698 147509 267463 -218411
15444 -9652 400996 -246540 281638 -469273 -82836 57333 38774 -58849 81375 -158798 -159831
15433 -159831 117976 -68528 -155337 -194276 149518 -153038 10107 57160 -62164 54169 49449
15422 49449 -3968 -57289 -199181 -112986 23781 -238885 135174 188568 188139 -24908 135345
15410 -100516 58196 -259827 -6151 -243192 -30336 115594 170628 200083 -100818 80087 44659
15399 44659 -126275 75523 222477 -34569 219967 116282 -173835 166580 69797 111747
$$ packed form
15478A33530a16790B27633o4950b75061A01280Q4643G7215L6075i1990m3713F0440
15466b22680A35965J08248a42601n9661B1631a53457A72868B2753N6811b08635
15455a8490j17760O0252A3160b11580g8490E5261a45698A47509J19954b18411
15444i652D00996b46540B81638d69273h2836E7333j8559e8849H1375a58798j033
15433a59831A17976f8528q6809l8939A49518a53038A0107M7053f2164E4169m720
15422D9449c968n3321j41892Q6195B3781b38885A35174N3394m29b4908A35345
15410a00516E8196b59827f151k37041c0336A15594N5034K9455a00818H0087l5428
15399D4659a26275G5523J46954c4569B19967j03685a73835A66580F9797M1950
$$ plain form
15389 111747 49998 -153706 -40049 -227772 -154218 81203 -66051 125840 -211578 -412 22616
15377 31667 -255388 -37621 64745 320722 -12961 -166428 -155100 -6849 137903 -201725 162563
15365 46219 -50035 116699 448261 101608 161282 146172 -156280 24442 198463 70805 47039
15354 47039 47894 -99619 -159415 -106429 69450 -26125 -238384 195619 -293250 -161359 -61826
15342 431851 74909 -177994 -39611 48687 -34932 347559 -282394 251817 -48609 143740
15331 7309 -33056 288661 204356 -31846 95264 119956 113839 -131379 131532 -21346 -145708
15320 -145708 134346 71511 238918 68310 -201843 -115683 249896 -160462 -58686 279286
15309 -41368 -46576 -12723 -85728 -154123 -301955 -8983 143290 21134 -62154 95535 -71639 24865
$$ packed form
15389A11747D9998a53706d0049j87723P3554H1203f6051A25840b11578d12B2616
15377C1667b55388c7621F4745K55977a2961j53467J1328f849A37903b01725A62563
15365D6219e0035A16699L31562A01608N9674j5110a56280B4442J74021G0805k3766
15354D7039Q55i9619n9796N2986F9450b6125k12259A95619b93250J31891f1826
15342D31851G4909a77994c9611D8687c4932C47559b82394B51817d8609A43740
15331G309c3056B88661q4305c1846I5264K4692o117a31379A31532b1346j24362
15320a45708A34346o2835J67407F8310b01843Q6160B49896a60462e8686B79286
15309d1368n208a2723p3005o8395j47832h983A43290B1134f2154I5535g1639B4865
$$ plain form
15296 28272 45184 200472 270884 -139309 305946 238630 -31975 -119039 192254 153242 19805
15284 121860 74810 101312 251960 -360846 -95091 148062 34423 181126 -70523 315283
15273 185407 276227 65295 54256 27713 245980 58507 -35162 58714 265205 43268 87627
15262 87627 262657 -141570 10363 -36391 9644 112782 216296 -40904 581416 -39116 -77418
15251 -77418 110212 159692 802459 1592790 1205785 996182 1497728 722303 334236 348383
15241 348383 -41161 308088 -40701 15335 101988 48735 3942 218947 382306 50168 48375
15230 48375 217996 -17466 -227817 -134989 81012 167544 52701 422359 33626 31943 39938
15219 39938 40290 71692 -153592 -283164 -133208 -25629 -211084 9975 93518 270630 193572
$$ packed form
15296B8272J6912J55288P0412a39309C05946o7316c1975q7064A92254l9012A9805
15284A21860m7050K6502J50648c60846i5091A48062C4423J46703g0523C15283
15273A85407R0820F5295j1039k6543K18267E8507c5162E8714K06491D3268M4359
15262H7627J75030a41570A0363c6391I644J03138J03514d0904E81416c9116l8302
15251g7418A10212M9480O42767P90331l87005k09603N01546G22303C34236J4147
15241C48383d1161C08088d0701A5335Q6653D8735C942K15005J63359E0168j793
15230D8375J69621a7466k10351R2828H1012Q6532E2701L69658C3626j683P995
15219C9938L52L1402a53592j29572a33208b5629j85455I975Q3543J77112p7058
$$ plain form
15208 193572 -34343 319852 192042 183414 -88728 428309 297891 134571 123417 259818
15198 259818 -69305 -13757 119167 -28676 137078 63201 194974 166516 -96246 -124282 -110587
15187 -110587 115803 -77546 -32888 252161 -70112 259858 20307 15223 -267419 -112284 -461
15175 84791 205308 -55327 -59786 45514 -14128 -12157 -218557 -110061 -201564 -52924 73392
15163 -98029 116192 35022 -107913 129862 25191 155046 233413 254801 316868 175090 189247
15152 189247 268876 201282 191285 -159383 34566 35771 59788 75525 184065 209797 107404
15141 107404 347867 -123030 175362 305209 188849 72834 239107 349445 -354362 151
15130 177896 -19921 78947 -144792 -18652 426349 -102156 62417 340271 289571 275787 168545
$$ packed form
15208A93572c4343C19852j27810q628h8728D28309j30418A34571j1154J36401
15198B59818f9305a3757A19167b8676A37078F3201J31773k8458i6246k8036J3695
15187a10587A15803g7546c2888B52161g0112B59858B0307n084b67419a12284d61
15175H4791J20517e5327m459D5514a4128J971k06400J08496r1503e2924G3392
15163i8029A16192C5022a07913A29862B5191J29855P8367K1388O2067j41778J4157
15152A89247P9629o7594r997a59383C4566J205K4017J5737J08540K5732j02393
15141A07404K40463a23030A75362J29847j16360G2834J66273J10338c54362A51
15130A77896a9921G8947a44792a8652D26349a02156F2417K77854n0700j3784j07242
$$ plain form
15119 168545 -13998 229611 361164 198400 47429 327751 128946 -67372 47289 57211 446974
15108 446974 -5744 234503 360284 870 395581 132139 62849 19622 368734 106675 103135
15097 103135 -140343 308356 150702 -12484 -34539 -49663 453045 236020 82291 125889
15087 125889 357236 12140 129088 96004 -137262 38727 -29691 374251 -123239 43033
15076 324730 56057 173681 197393 282601 -29595 184728 163655 264890 172835 56308 -36283
15064 204274 54854 416522 -107808 56999 -23976 124824 30621 234202 395621 77733
15053 109389 147758 175233 445981 169185 69342 41612 -77628 329385 -14109 384188 73297
15041 50056 228870 38369 169557 77924 229136 235698 39217 382846 28991 177862 401263
$$ packed form
15119A68545a3998B29611J31553j62764D7429K80322A28946f7372D7289R922L89763
15108D46974e744B34503J25781H70L94711A32139F2849A9622L49112A06675l540
15097A03135a40343C08356A50702a2484k2055j5124D53045k17025H2291M3598
15087A25889K31347A2140J16948l3084a37262C8727b9691C74251a23239D3033
15076C24730E6057J17624K3712Q5208b9595A84728k1073J01235r2055E6308c6283
15064B04274E4854L61668a07808E6999b3976A24824C0621K03581J61419G7733
15053A09389L8369K7475K70748A69185F9342k7730g7628C29385a4109C84188G3297
15041E0056J78814C8369J31188G7924J51212O562C9217L43629B8991J48871K23401
$$ plain form
15030 401263 -46212 -81493 58684 193461 267627 223903 82997 273916 -66415 140694 50094
15018 82276 154729 -137573 137819 395473 107984 36515 239006 296450 265404 315350 248246
15007 248246 185629 223479 447761 475155 343180 121002 161322 -70100 81086 191126 147594
14996 147594 -215613 265418 285564 78254 412627 167324 -65837 128774 143669 227714
14986 227714 269180 41706 212762 226872 316063 366905 123711 -65385 287031 -29467 151854
14974 241145 126902 91311 560744 339229 432350 200257 367019 302879 116806 221604
14964 221604 111738 305896 464883 182848 276757 361153 104689 241198 238852 -12425
14953 -39556 393394 607573 195636 124234 336634 551591 557502 200953 206837 304746 26730
$$ packed form
15030D01263d6212l5281E8684J34777P4166m3724H2997J90919f6415A40694E0094
15018H2276P2453a37573A37819K57654A07984C6515K02491N7444l1046M9946o7104
15007B48246o2617L7850K24282K7394j31975A21002M0320g0100H1086J10040m3532
14996A47594b15613B65418K0146G8254L34373A67324f5837A28774J4895Q4045
14986B27714M1466D1706J71056J4110Q9191N0842A23711f5385B87031b9467A51854
14974B41145j14243l5591M69433k21515R3121B00257J66762o4140A16806J04798
14964B21604j09866J94158J58987A82848R3909Q4396A04689J36509k346a2425
14953c9556C93394K14179A95636p1402K12400K14957N911B00953N884R7909B6730
$$ plain form
14941 269718 224910 168463 504779 297617 418808 325637 28921 400137 112197 246411
14931 246411 464580 208500 316565 262726 261304 98774 60986 299869 36674 222928 312602
14920 312602 179557 171253 319733 28648 202052 -3546 124447 496132 323639 490573
14910 490573 223415 442487 297909 333281 395437 330027 138557 178651 -13873 132432
14899 26656 134760 495220 57160 481974 208753 613804 410521 716416 325296 266905
14889 266905 51526 427937 310913 296750 180594 743302 433506 286278 299683 519340
14879 519340 189455 420773 398741 391152 250754 258563 690949 97827 317447 374394 418851
14868 418851 123474 469609 258822 757963 379781 187517 170529 493753 402279 618625
$$ packed form
14941B69718m4808n6447L36316k07162J21191r3171B8921L71216A12197J34214
14931B46411K18169B08500J08065n3839j422I8774l7788K38883C6674J86254Q9674
14920C12602j33045q304J48480B8648J73404c546A24447L71685j72493J66934
14910D90573B23415K19072j44578L5372O2156o5410A38557M0094a3873A32432
14899B6656J08104L60460E7160M24814B08753M05051k03283L05895C25296n8391
14889B66905E1526L76411j17024j4163j16156N62708l09796j47228J3405K19657
14879E19340A89455K31318k2032p589j40398P809M32386I7827K19620N6947M4457
14868D18851A23474L46135k10787M99141l78182A87517j6988L23224r1474K16346
$$ plain form
14858 618625 286689 538589 31428 587708 508925 519406 382345 376346 407649 540006 155383
14846 456801 -43085 569766 337984 545211 584614 474236 463462 716672 109192 300489
14836 300489 308614 451131 366929 389808 370464 502363 256550 865292 354196 509583
14826 509583 581950 225052 541281 695404 386339 426568 226099 485634 403679 461386
14816 461386 156048 484539 515517 578614 705297 20737 801759 483493 455337 702529
14806 702529 193886 578743 528521 673781 551353 530158 597911 380278 669033 245185
14795 544854 401694 482585 461849 639373 822425 486412 430953 361853 634417 513782
14785 513782 580377 493819 405574 521170 169392 424603 471684 490653 450510 315961 636220
$$ packed form
14858F18625B86689K51900C1428N56280p8783J0481j37061n999L1303J32357A55383
14846D56801d3085E69766k31782K07227L9403j10378j0774K53210A09192J91297
14836C00489Q125J42517q4202K2879j9344J31899k45813O08742C54196J55387
14826E09583P2367B25052L16229J54123l09065M0229k00469K59535q1955N7707
14816D61386A56048L28491L0978O3097J26683B0737P81022l18266k8156K47192
14806G02529A93886L84857n0222J45260j22428k1195O7753k17633K88755B45185
14795E44854j43160Q0891k0736J77524J83052l36013n5459o9100K72564j20635
14785E13782O6595q6558q8245J15596A69392K55211M7081J8969m0143j34549L20259
$$ plain form
14774 636220 609829 475464 450897 578816 498528 467912 653292 621624 525715 450643 945820
14763 945820 471733 629518 533744 537717 555105 520388 674123 265399 803650 778384 109873
14751 808694 823617 662358 464716 495759 674123 827243 542476 829971 684554 563096
14741 563096 729482 871759 578055 574928 687196 396273 772119 783083 306962 265354
14731 265354 708417 582268 478787 1009971 775264 506181 611433 744053 733539 556222
14721 556222 660965 865697 824609 778404 818364 922877 856175 582672 646413 645087 789187
14710 789187 889754 514974 765814 808487 873860 992709 1115599 1020617 986744 1201608
14700 1201608 1121934 1081288 1087651 511987 721024 1111693 1100490 981765 896901 507351
$$ packed form
14774F36220k6391j34365k4567J27919q0288l0616J85380l1668r5909p5072M95177
14763I45820D71733J57785r5774L973J7388l4717J53735B65399N38251k5266A09873
14751H08694J4923j61259j97642L1043J78364J53120k84767K87495j45417j21458
14741E63096J66386J42277k93704l127J12268k90923L75846J0964C06962m1608
14731B65354M43063j26149j03481N31184k34707k69083J05252J32620j0514j77317
14721E56222J04743K04732m1088m6205L9960J04513o6702k73503O3741j326J44100
14710G89187J00567l74780K50840M2673O5373J18849J22890r4982l3873K14864
14700A201608p9674m0646O363E11987K09037L90669j1203j18725q4864l89550
$$ plain form
14690 507351 1063859 1221491 866141 1000124 954447 899500 746805 782571 817431 656413
14680 656413 950615 908738 938184 761307 999548 1037250 1520408 974984 1138252 1228314
14670 1228314 1105460 1294929 765295 1083515 902848 978994 800562 751800 1336684 1041203
14660 1041203 801297 894325 975497 1174568 1107177 1072841 996932 956241 1291630 931527
14650 931527 1168623 1338436 1222572 1206001 1228891 1182503 1011852 1282952 1036800 1220195
14640 1220195 1412500 918282 1267700 1233406 1151535 1102744 1271880 1229029 1321664 918066
14630 918066 1171678 1321384 1470626 1250891 1192387 1102666 1237318 1323060 1364648 1411442
14620 1411442 1305216 1381482 1491076 1426523 1705405 1294611 1153215 1549176 1479772 1282930
$$ packed form
14690E07351N56508J57632l55350J33983m5677n4947j52695L5766L4860j61018
14680F56413K94202m1877K9446j76877K38241L7702M83158n45424J63268R0062
14670A228314j22854J89469n29634L18220j80667P6146j78432m8762N84884k95481
14660A041203k39906R3028Q1172J99071o7391l4336p5909m0691L35389l60103
14650I31527K37096J69813j15864j6571K2890m6388j70651K71100k46152J83395
14640A220195J92305m94218L49418l4294q1871m8791J69136m2851R2635m03598
14630I18066K53612J49706J49242k19735n8504q9721J34652Q5742M1588M6794
14620A411442j06226P6266J09594o4553K78882m10794j41396L95961o9404j96842
$$ plain form
14610 1282930 1388601 1698954 1459152 1800237 1379218 1660533 1937050 1573033 1315796
14601 1315796 1416013 1925274 1751184 1925002 1719147 2120268 1778144 2061219 1515980
14592 1515980 1597976 1653096 1655960 1654533 1898497 1979384 1587926 2168735 2034563 1736820 1757312
14581 1757312 2064878 1887384 1799566 1914915 2160235 2293736 2152159 2128896 2081084 2148106
14571 2148106 2206162 2256501 2118395 2117703 2226173 2507436 2271112 2433815 2677752 2869065
14561 2869065 2516393 2602083 2535959 2684661 2826897 3126962 3448541 3630336 3698576 3706958
14551 3706958 4480185 5792400 7208503 11751145 21567912 41513990 41725531 19099628
14542 7700037 4281451 2835653 2212784 2521515 1684645 1694734 1984538 1721255 2031410
$$ packed form
14610A282930J05671L10353k39802L41085m21019K81315K76517l64017k57237
14601A315796J00217N09261j74090J73818k05855M01121l42124K83075n45239
14592A515980Q1996N5120K864j427K43964Q0887l91458N80809j34172k97743K0492
14581A757312L07566j77494q7818J15349K45320J33501j41577k3263m7812O7022
14571B148106N8056N0339j38106o92J08470K81263k36324J62703K43937J91313
14561B869065l52672Q5690o6124J48702J42236L00065L21579J81795O8240Q382
14551C706958P73227J312215J416103M542642R816767J9946078K11541A9099628
14542G700037l418586j445798o22869L08731q36870J0089K89804k63283L10155
$$ plain form
14533 2031410 1767394 2029150 2030696 2216553 2180421 2243654 2472797 2287778 2291965 2413174
14523 2413174 2283384 2357821 2547102 2304728 2307216 2508268 2842336 2820498 2509171 2243116
14513 2243116 2744260 2623383 2591574 2503739 3017133 2848420 2938822 2795556 2952568 3094658
14503 3094658 3011409 2802009 2864527 2953884 3050577 3119369 3137536 2778058 3275788 3341878 3332068
14492 3332068 3318881 3485311 3532787 3679064 3266142 3247381 3471090 3406692 3820137 3512434
14482 3512434 3826182 4158553 4066922 3770628 3984600 3989342 3956157 4131589 4267743 3905290
14472 3905290 4213123 4342981 4260370 4269958 4443641 4313033 4444465 4663197 4492522 4850541
14462 4850541 4619910 4697066 4536153 4923831 5098979 4963436 4632865 4975121 4776670 5101219
$$ packed form
14533B031410k64016K61756J546J85857l6132O3233K29143j85019M187J21209
14523B413174j29790P4437J89281k42374K488K01052L34068k1838l11327k66055
14513B243116N01144j20877l1809q7835N13394j68713R0402j43266J57012J42090
14503C094658q3249k09400O2518Q9357R6693O8792J8167l59478M97730O6090r810
14492C332068j3187J66430M7476J46277m12922j8761K23709o4398M13445l07703
14482C512434L13748L32371r1631k96294K13972M742l3185J75432J36154l62453
14472C905290L07833J29858q2611R588J73683j30608J31432K18732j70675L58019
14462D850541k30631P7156j60913L87678J75148j35543l30571L42256j98451L24549
$$ plain form
14452 5101219 5228740 5237255 5468573 5446831 5541937 5524771 5431022 5564797 5623536 5797173 6080648
14441 6080648 5791145 6090275 5855127 6268228 6159566 6473824 6364357 6276763 6473407 6564381
14431 6564381 6785656 6726811 6662115 7004498 7170657 7155525 7085595 7463059 7241898 8144377
14421 8144377 7587678 7917227 7848555 7972598 8005720 8391690 8122515 8508728 8298022 8747460
14411 8747460 8778414 8937847 9198456 9392307 9621406 9735680 9688861 10192861 10137337 10138821
14401 10138821 10779491 10854132 10892400 10998744 11121312 11159975 11397990 11716209 11936879 12183597
14391 12183597 12189772 12142688 13014199 12741687 13157529 13258692 13320151 13738630 14178497 14491363
14381 14491363 14329038 14948936 15130837 15438600 15702298 15948040 15890120 16370470 17108250
$$ packed form
14452E101219J27521Q515K31318k1742R5106j7166r3749J33775N8739J73637K83475
14441F080648k89503K99130k35148M13101j08662L14258j09467q7594J96644R0974
14431F564381K21275n8845o4696L42383J66159j5132o9930L77464k21161R02479
14421H144377n56699L29549o8672J24043L3122L85970k69175L86213k10706M49438
14411H747460L0954J59433K60609J93851K29099J14274m6819N04000n5524J484
14401A0138821O40670P4641L8268J06344J22568L8663K38015L18219K20670K46718
14391A2183597O175m7084Q71511k72512M15842J01163O1459M18479M39867L12866
14381A4491363j62325O19898J81901L07763K63698K45742n7920M80350P37780
$$ plain form
14372 17108250 16982381 17467801 17953054 18646988 18791280 18774342 19578733 19739811 20080730
14363 20080730 20720510 21143260 21744818 21948302 22509402 23033796 23533101 24184054 24766830
14354 24766830 25286529 25846768 26432800 27232761 27606451 28435014 29262801 29749379 30602919
14345 30602919 31466380 32270729 33144776 33737259 35083666 35823407 36807912 37774541 38721192
14336 38721192 39559115 40668612 42387282 43587700 44924820 45984507 47677722 49275899
14328 49275899 50441300 51932580 54034147 55502770 57578368 59273380 61279027 63483700
14320 63483700 65712820 68124028 70724837 73454350 76008691 79116719 81709560 84714640
14312 84714640 88683843 92122413 95925912 99529148 103809135 108516896 113170500 117977310
$$ packed form
14372A7108250j25869M85420M85253O93934J44292j6938Q04391J61078L40919
14363B0080730O39780M22750O01558K03484N61100N24394M99305O50953N82776
14354B4766830N19699N60239N86032P99961L73690Q28563Q27787M86578Q53540
14345C0602919Q63461Q04349Q74047N92483J346407P39741R84505R66629R46651
14336C8721192Q37923J109497J718670J200418J337120J059687J693215J598177
14328D9275899J165401J491280K101567J468623K075598J695012K005647K204673
14320F3483700K229120K411208K600809K729513K554341L108028K592841L005080
14312H4714640L969203L438570L803499L603236M279987M707761M653604M806810
$$ plain form
14304 117977310 123421511 129182198 134804607 141190198 147475949 155097168 162355930 170601198
14296 170601198 179040886 187734783 196955579 207403964 217763455 229089222 240574189
14289 240574189 252616771 265549413 278604453 292247458 306813717 321025076 335496307
14282 335496307 350275422 364864358 379472288 393372042 406929002 419257709 430363931
14275 430363931 439871290 447065317 451056791 451073155 448531867 446730087 444254655 438045269
14267 438045269 431519124 422242038 411748800 400571464 387763672 373510804 358689477
14260 358689477 343562601 328114446 312710093 297581388 282691195 268916873 255807097
14253 255807097 242766796 230249904 218668938 207525326 197002735 187336789 177617706
$$ packed form
14304A17977310N444201N760687N622409O385591O285751P621219P258762Q245268
14296A70601198Q439688Q693897R220796J0448385J0359491J1325767J1484967
14289B40574189J2042582J2932642J3055040J3643005J4566259J4211359J4471231
14282C35496307J4779115J4588936J4607930J3899754J3556960J2328707J1106222
14275D30363931R507359P194027L991474J6364k541288j801780k475432o209386
14267D38045269o526145r277086j0493238j1177336j2807792j4252868j4821327
14260C58689477j5126876j5448155j5404353j5128705j4890193j3774322j3109776
14253B55807097j3040301j2516892j1580966j1143612j0522591r665946r719083
$$ plain form
14246 177617706 169000140 161004518 152964253 146026008 139148438 132547563 126590480 120718273
14238 120718273 115741095 110747637 105831420 101317286 97058374 92951216 89284797 86205534
14230 86205534 82566123 79257868 76458139 73526647 70843017 67967610 65221517 63289192
14222 63289192 61026711 58770411 57052970 55002156 53274101 51504884 49672482 48319841
14214 48319841 46980405 45548774 43924551 42780508 41316197 40147974 39229996 38506231
14206 38506231 37354703 36139899 34753601 33970899 32879259 32348528 31756201 30880213 29791495
14197 29791495 28895846 28385087 27675865 26787084 26224558 25861139 25184832 24639656 23682530
14188 23682530 23311786 22906814 22437425 21853977 21385055 20732546 20485787 20311820 19377277
$$ packed form
14246A77617706q617566p995622q040265o938245o877570o600875n957083n872207
14238A20718273m977178m993458m916217m514134m258912m107158l666419l079263
14230H6205534l639411l308255k799729k931492k683630k875407k746093j932325
14222F3289192k262481k256300j717441k050814j728055j769217j832402j352641
14214D8319841j339436j431631j624223j144043j464311j168223r17978p23765
14206C8506231j151528j214804j386298p82702j091640n30731n92327q75988j088718
14197B9791495q95649n10759p09222q88781n62526l63419o76307n45176r57126
14188B3682530l70744m04972m69389n83448m68922o52509k46759j73967r34543
$$ plain form
14179 19377277 19448429 18709892 18372720 17822290 17576803 17272793 16906582 16699254 16278271
14170 16278271 15850834 15493700 15187664 14637147 15133182 14648048 14175629 13897903 13579009
14161 13579009 13401125 13332810 13214552 13066314 12720965 12301093 12339748 11832457 11792297 11518786
14151 11518786 11301821 11182440 11074727 10791297 10593298 10431164 10418341 10101784 10138484 9740337
14141 9740337 9956602 9882643 9437102 8992402 9371284 9231639 8673908 8617455 8772426 8453838
14131 8453838 8494564 8601061 8188625 7845175 8372293 7863451 7956310 7324153 7641949 7612363
14121 7612363 7541508 7385021 7284279 7173842 7118598 7166912 6893958 6794019 6669099 6314495
14111 6314495 6576354 6614405 6104988 6149482 6069657 6176898 5613817 5718762 6193682 5760376
$$ packed form
14179A9377277P1152p38537l37172n50430k45487l04010l66211k07328m20983
14170A6278271m27437l57134l06036n50517M96035m85134m72419k77726l18894
14161A3579009j77884o8315j18258j48238l45349m19872L8655n07291m0160k73511
14151A1518786k16965j19381j07713k83430j97999j62134j2823l16557L6700l98147
14141I740337K16265p3959m45541m44700L78882j39645n57731n6453J54971l18588
14131H453838M0726J06497m12436l43450N27118n08842R2859o32157L17796k9586
14121G612363p0855j56487j00742j10437n5244M8314k72954r9939j24920l54604
14111F314495K61859L8051n09417M4494p9825J07241n63081J04945M74920m33306
$$ plain form
14101 5760376 5937764 5801789 5429498 5353431 5170435 5482164 5094358 5366134 5501630 5214892
14091 5214892 5247317 5002800 5178429 5115455 4946402 4776284 4819001 4665004 4568069 4734221
14081 4734221 4433561 4458277 4474617 3981623 4328124 4478256 4286583 4212728 4409483 4248416
14071 4248416 3994813 4161115 3982903 4150312 4076351 3622371 3855822 3830212 3912116 3664659
14061 3664659 3758611 3797885 3680569 3892466 3746140 3705753 3467381 3406021 3136608 3378702
14051 3378702 3594219 3342504 3075211 3207507 3230076 3105579 3068149 3097749 3144747 2767047
14041 2767047 2988380 3141474 3061858 3136604 3070589 2705658 2859180 3056643 3095825 2737804
14031 2737804 2846697 2820122 2790994 2635225 2900735 2715603 3016156 2595323 2480776 2663900
$$ packed form
14101E760376J77388j35975l72291p6067j82996L11729l87806K71776J35496k86738
14091E214892L2425k44517J75629o2974j69053j70118M2717j53997r6935J66152
14081D734221l00660K4716J6340m92994L46501J50132j91673p3855J96755j61067
14071D248416k53603J66302j78212J67409p3961m53980K33451k5610Q1904k47457
14061C664659R3952L9274j17316K11897j46326m0387k38372o1360k69413K42094
14051C378702K15517k51715k67293J32296K2569j24497l7430K9600M6998l77700
14041B767047K21333J53094p9616P4746o6015l64931J53522J97463L9182l58021
14031B737804J08893k6575k9128j55769K65510j85132L00553m20833j14547J83124
$$ plain form
14021 2663900 2339228 2486121 2573965 2635860 2230884 2265461 2295567 2271759 2422099 2694414
14011 2694414 2109847 2033144 2493851 2046605 2220815 2145639 2235049 2313967 2192288 2214182
14001 2214182 2182778 1934560 1982649 2012388 2055990 2200871 1904696 2235950 2367869 2044477
13991 2044477 2445877 2573586 3374350 6204780 14156660 33208102 43810423 22523031
13983 22523031 11740765 7240678 5678697 4460215 3613252 3351555 3178446 2915900
13975 2915900 2955568 2746102 2660970 2355591 2305696 2372329 2188681 2067378 2237301 2057300
13965 2057300 1927779 2234388 2237408 2124112 1993415 2110566 1815013 2092019 1552655 1743272
13955 1743272 2145993 1756588 1772098 1863985 1666578 1936188 1964323 1824824 1764120 1979521
$$ packed form
14021B663900l24672J46893Q7844O1895m04976L4577L0106k3808J50340K72315
14011B694414n84567p6703M60707m47246J74210p5176Q9410P8918j21679K1894
14001B214182l1404k48218M8089K9739M3602J44881k96175L31254J31919l23392
13991B044477M01400J27709Q00764K830430P951880J9051442J0602321k1287392
13983B2523031j0782266m500087j561981j218482q46963k61697j73109k62546
13975B915900L9668k09466q5132l05379m9895O6633j83648j21303J69923j80001
13965B057300j29521L06609L020j13296j30697J17151k95553K77006n39364J90617
13955A743272M02721l89405J5510R1887j97407K69610K8135j39499o0704K15401
$$ plain form
13945 1979521 1753346 1507157 1755205 1728685 1699106 1718563 1455035 1651327 1679275 1798911
13935 1798911 1507711 1940868 1465717 1537227 1270974 1271649 1567256 1479775 1323158 1407985
13925 1407985 1418467 1384923 1978218 1385161 1304319 1524748 1664823 1403379 1239458 1443291
13915 1443291 1290410 1251400 1613814 1431399 1266870 1277823 1253427 1159740 1304356 1308939
13905 1308939 1378101 1324629 994540 1436007 1182183 1512582 1241967 1277598 1041717 1007418
13895 1007418 1280522 1426321 934983 1303890 1227489 1449794 1071128 1362644 1198285 884776
13885 884776 1178873 1332290 833884 965984 1205952 1152977 1306641 1279586 1078038 886184
13875 886184 1106014 997682 1079149 1016778 1150952 952579 779028 1008141 720566 1085174
$$ packed form
13945A979521k26175k46189K48048k6520k9579J9457k63528J96292K7948J19636
13935A798911k91200M33157m75151P1510k66253O75K95607q7481j56617Q4827
13925A407985J0482l3544N93295n93057q0842K20429J40075k61444j63921K03833
13915A443291j52881l9010L62414j82415j64529J0953k4396r3687J44616M583
13905A308939O9162n3472l30089M41467k53824L30399k70615L5631k35881l4299
13895A007418K73104J45799m91338L68907p6401K22305l78666K91516j64359l13509
13885H84776K94097J53417m98406J32100K39968n2975J53664k7055k01548j91854
13875H86184K19830j08332Q1467o2371J34174j98373j73551K29113k87575L64608
$$ plain form
13865 1085174 1128512 1095249 1144026 1279900 886249 951977 967168 1011641 992425 1207284 891379
13854 891379 1133059 700623 1316721 934934 971804 738433 601637 1095986 1035652 1077705
13844 1077705 923166 747119 800939 938256 674915 1008449 980745 825921 908834 857806
13834 857806 932688 1063737 931265 897355 575684 831888 1001256 701829 905730 971621
13824 971621 1076294 718502 875105 735072 1006769 1130404 699919 722039 1013309 717389
13814 717389 883113 829084 784935 569403 732256 799787 657632 945153 880122 526694
13804 526694 721581 364537 510914 434657 836225 747821 684053 719824 751324 730271 980219
13793 980219 924858 750226 728003 505759 701271 1074590 620163 783257 732107 626452
$$ packed form
13865A085174M3338l3263M8777J35874l93651O5728J5191M4473j9216K14859l15905
13854H91379K41680m32436O16098l81787L6870k33371j36796M94349o0334M2053
13844A077705j54539j76047N3820J37317k63341L33534k7704j54824Q2913n1028
13834H57806P4882J31049j32472l3910l21671K56204J69368k99427K03901O5891
13824I71621J04673l57792J56603j40033K71697J23635m30485K2120K91270k95920
13814G17389J65724n4029m4149k15532J62853O7531j42155K87521o5031l53428
13804E26694J94887l57044J46377p6257M01568q8404o3768L5771L1500k1053K49948
13793I80219n5361j74632k2223k22244J95512L73319m54427J63094n1150j05655
$$ plain form
13783 626452 752630 857365 878328 790666 617153 525291 610556 833556 984719 500500
13773 500500 855822 592829 1014478 819371 480067 909418 713334 374040 644788 327539
13763 327539 455933 660152 650595 708012 508583 550279 868270 600701 357245 539128
13753 539128 672325 364966 425449 626819 577959 806488 645231 886216 204363 394986
13743 394986 645955 729939 212051 895959 475337 550274 378387 643758 563453 464437
13733 464437 585675 136726 560252 780151 472081 264259 632485 640242 446693 581812
13723 581812 334427 461910 436996 979497 591785 372859 757280 337198 509526 381187
13713 381187 577556 475111 485205 503750 461872 507092 555813 452619 605191 474217
$$ packed form
13783F26452J26178J04735K0963q7662j73513r1862Q5265K23000J51163m84219
13773E00500L55322k62993M21649j95107l39304M29351j96084l39294K70748l17249
13763C27539J28394K04219r557N7417j99429M1696L17991k67569k43456J81883
13753E39128J33197l07359O0483K01370m8860K28529j61257K40985B04363J90623
13743C94986K50969Q3984B12051O83908m20622P4937j71887K65371q0305r9016
13733D64437J21238A36726M23526K19899l08070k07822L68226P757j93549J35119
13723E81812k47385J27483k4914N42501l87712k18926L84421C37198J72328j28339
13713C81187J96369j02445J0094J8545m1878M5220M8721j03194J52572j30974
$$ plain form
13703 474217 356540 257386 311438 390907 348585 303017 360944 424388 231026 158479 102294
13692 102294 355299 590150 355226 484654 701909 763609 444221 742628 253721 468501
13682 468501 626281 327614 444950 634915 416912 430263 517109 463408 262005 427706
13672 427706 342760 473225 572946 404358 538640 429774 729854 427570 208254 175389
13662 175389 426720 796068 564910 532679 76753 310869 794473 671244 642341 318963
13651 444443 405772 326591 624836 339075 236117 236378 141731 452206 469829 393704 107792
13639 188806 153751 52590 310720 588175 25858 331844 559426 654585 451602 424694
13629 424694 422585 585126 161955 415709 319427 161722 411073 134408 612355 345643
$$ packed form
13703D74217j17677r9154N4052P9469m2322m5568N7927O3444j93362p2547n6185
13692A02294K53005K34851k34924J29428K17255O1700l19388K98407B53721K14780
13682D68501J57780k98667J17336J89965k18003J3351Q6846n3701k01403J65701
13672D27706q4946J30465R9721j68588J34282j08866L00080l02284B08254l2865
13662A75389K51331L69348k31158l2231G6753K34116M83604j23229k8903C18963
13651D44443l8671p9181K98245k85761j02958K61r4647L10475J7623p6125A07792
13639A88806l5055E2590K58130K77455B5858L05986K27582R5159k02983k6908
13629D24694k109J62541A61955K53754r6282j57705K49351A34408M77947k66712
$$ plain form
13619 345643 358300 675840 438203 360602 213178 235231 231588 498562 256213 404765
13609 404765 260912 295334 248096 338246 84078 271270 381031 277588 206290 280129 301931
13598 301931 319134 76167 537711 -37166 268001 432419 298180 43398 400096 309771
13588 309771 382379 546530 225718 428381 426037 290126 401242 216724 350086 62310
13577 376525 371722 336169 397833 201763 473984 423435 491809 234654 236428 308419 63636
13565 597293 523711 7340 189000 386617 305905 124375 245985 64602 353344 247931
13555 247931 241830 208886 329859 189296 429826 -167229 319915 318683 178054 440564
13545 440564 351852 170652 162275 79933 389441 112122 -47572 48013 74265 217357 476244
$$ packed form
13619C45643J2657L17540k37637p7601j47424K2053l643K66974k42349J48552
13609D04765j43853L4422m7238R0150H4078J87192J09761j03443p1298P3839K1802
13598C01931J7203G6167M61544c7166B68001J64418j34239D3398L56698r0325
13588C09771P2608J64151B25718K02663k344j35911J11116j84518J33362F2310
13577C76525m803l5553O1664j96070K72221n0549O8374B34654J774P1991F3636
13565E97293p3582G340J81660J97617q0712A24375J21610F4602K88742j05413
13555B47931o101l2944J20973j40563K40530a67229C19915j232j40629K62510
13545D40564q8712A70652q377G9933L09508A12122d7572D8013K6252J43092K58887
$$ plain form
13534 476244 512792 117085 539112 31384 180046 446764 278855 239239 -62056 453263
13523 58705 179253 141699 224154 -14329 71280 -30812 457242 248075 278426 447163 250522
13512 250522 112694 335710 515273 276166 70071 149768 -189321 329420 392716 333152
13502 333152 388700 336153 448632 332219 91999 340871 384708 257050 278442 128768
13491 73039 36224 23105 143268 485701 140746 398249 -224308 139893 106141 175127
13481 175127 220852 378180 195712 387110 -17025 402996 159617 138707 135367 325121
13471 325121 -67384 49731 355845 471285 391264 192858 245101 162583 40213 388768 72023
13459 184632 105956 272450 317051 438164 55775 137146 25440 230723 217450 155366 503515
$$ packed form
13534D76244L6548A17085M22027C1384J48662K66718j67909l9616f2056D53263
13523E8705J20548l7554Q2455a4329G1280c0812D57242k09167L0351J68737j96641
13512B50522A12694K23016J79563k39107G0071P9697a89321C29420O3296n9564
13502C33152N5548n2547J12479j16413I1999K48872M3837j27658K1392A28768
13491G3039C6224j3119J20163L42433A40746K57503b24308A39893l3752O8986
13481A75127M5725J57328j82468J91398a7025D02996A59617k0910l340J89754
13471C25121f7384D9731L06114J15440q0021A92858N2243q2518D0213L48555G2023
13459A84632p8676J66494M4601J21113E5775Q1371B5440K05283j3273o2084L48149
$$ plain form
13448 503515 364880 183064 180407 85717 -18672 188016 215845 387726 231210 108870
13437 396027 67785 437653 22017 490006 206730 -23992 -211056 -30799 145956 -71497
13426 -45206 -27018 220158 -2643 105511 277875 46481 197313 279400 42782 519 94843
13415 94843 315982 369412 173010 -68425 261798 308431 251866 58069 47178 70263 298562
13404 298562 104796 283346 228259 -10396 514961 288992 110282 150266 37043 44291 295288
13393 295288 -180002 137547 341943 159815 163381 104864 247548 418569 241656 349973
13383 349973 317852 134441 310905 -24936 313820 404516 368834 -32770 303200 11799 546465
13372 546465 429115 247956 -108060 122065 31167 49526 411442 -245654 396216 243571
$$ packed form
13448E03515j38635j81816k657H5717a8672A88016K7829J71881j56516A08870
13437C96027F7785L69868B2017M67989B06730b3992j87064c0799A45956g1497
13426d5206J8188B20158b643A05511J72364D6481J50832Q2087D2782E19R4324
13415I4843K21139N3430A73010f8425B61798M6633n6565E8069j0891K3085K28299
13404B98562A04796J78550n5087a0396E14961k25969A10282L9984C7043P248K50997
13393B95288a80002A37547K04396A59815L566n8517J42684J71021j76913J08317
13383C49973l2121A34441J76464b4936C13820R0696l5682c2770C03200A1799N34666
13372E46465j17350j81159a08060A22065C1167J8359L61916b45654C96216j52645
$$ plain form
13362 243571 229926 204258 163860 284233 63144 -116111 217801 126639 84583 113572 407228
13351 407228 129031 100850 41421 310744 257378 -30545 234732 370210 279200 266228 45387
13339 293885 360799 458617 385602 350298 261026 84212 489718 211447 220728 244713 126060
13328 126060 38888 384535 91155 437844 97708 -104388 30654 213126 233216 100698
13317 150634 275151 188974 50796 91896 366742 227736 -83521 206104 15041 53029 -298337
13305 161063 241945 259104 120282 383285 14239 13987 18499 -34491 215018 225022 374622
13294 374622 -8767 4620 79753 274736 154396 179711 236358 391689 25255 121121 172706
13283 172706 79619 -191621 77872 -164610 319973 -261499 349434 82421 190556 347160
$$ packed form
13362B43571j3645k5668m0398J20373F3144a16111B17801r1162m2056K8989K93656
13351D07228A29031k8181D1421K69323n3366c0545B34732J35478r1010j2972D5387
13339B93885O6914R7818p3015l5304q9272H4212M05506B11447R281K3985j18653
13328A26060C8888L45647I1155L46689I7708a04388C0654J82472K0090A00698
13317A50634J24517q6177E0796M1100K74846j39006h3521B06104A5041L7988b98337
13305A61063Q0882J7159A20282K63003A4239k52M512c4491B15018J0004J49600
13294C74622h767D620P5133J94983j20340K5315N6647J55331B5255R5866N1585
13283A72706G9619a91621G7872a64610C19973b61499C49434H2421J08135J56604
$$ plain form
13273 347160 92655 112000 -155928 230878 61059 41917 298024 213172 427031 -78516 330893
13261 45080 -275757 18161 73983 232649 394950 162526 96142 -221047 26572 -41069 116866
13249 277892 -139062 341269 126198 548509 62479 54984 283841 39809 -43146 315098
13238 123993 164557 274749 415242 359232 272296 21426 350392 -14413 -71302 -28137 117906
13226 20855 37391 224974 -56660 137472 111057 211787 -237829 98621 230568 89506 3290
13214 172118 208926 59108 -100685 -35267 -212561 71151 197866 111218 -128114 71260 126887
13203 126887 327129 -159324 251508 156239 276150 -76568 -260411 291941 119674 289617
13193 289617 367551 384247 277508 298242 -46378 196426 -176537 194414 -57378 377992
$$ packed form
13273C47160I2655J9345a55928B30878F1059j9142K56107q4852K13859g8516C30893
13261D5080b75757A8161N5822J58666J62301A62526o6384b21047B6572d1069A16866
13249B77892a39062C41269A26198M22311F2479p495K28857C9809d3146C15098
13238A23993M0564J10192J40493n6010q6936B1426L28966a4413n6889b8137A17906
13226B0855J6536J87583e6660A37472k6415J00730b37829I8621J31947H9506C290
13214A72118L6808E9108a00685c5267j77294G1151J26715q6648a28114G1260N5627
13203A26887K00242a59324B51508r5269J19911g6568j83843B91941A19674J69943
13193B89617P7934J6696j06739K0734d6378A96426a76537A94414e7378C77992
$$ plain form
13182 -121611 22990 -96101 281672 -106543 -62191 315820 -16523 -212145 -169745 -238209 174227
13170 -69383 271899 16725 -193359 -172681 97667 399598 192343 -18026 39939 212124 243959
13159 243959 202384 4182 198440 -125667 185134 248382 64835 -4546 291384 46129 144072
13148 144072 -160237 -131630 -21144 -147119 295550 312100 178872 -188446 -148945 18455
13137 -161280 262960 117665 245710 330913 -50394 384948 71580 81582 -57651 103265
13126 83685 -184581 7461 -139410 247192 -247292 123826 333390 -38248 -222304 -236631
13116 -236631 -132682 244031 323267 69671 -19018 359199 -225693 288068 -255332 8202
13105 -1496 -124136 143818 -222298 47529 92132 -73351 64830 105060 124452 188831 -55736
$$ packed form
13182a21611B2990i6101B81672a06543M4352C15820a6523j95622M2400o8464A74227
13170f9383B71899A6725a93359K0678I7667L01931A92343a8026C9939J72185L1835
13159B43959m1575D182J94258a25667A85134O3248F4835d546B91384D6129R7943
13148A44072a60237K8607b1144j25975B95550J6550j33228a88446L9501A8455
13137a61280B62960A17665J28045Q5203e0394C84948G1580J0002e7651A03265
13126H3685a84581G461a39410B47192b47292A23826K09564c8248j84056j4327
13116b36631J03949B44031P9236F9671a9018C59199b25693B88068b55332H202
13105a496j22640A43818b22298D7529M4603g3351F4830M0230J9392O4379e5736
$$ plain form
13093 -89805 43747 -10693 38553 216344 -215620 139917 -71450 -253268 -3259 122007 -132779
13081 343398 198806 189238 -32776 -172919 112704 61945 155958 188070 12664 43210 153258
13070 153258 34288 44199 68669 22916 134809 -75656 143629 89539 -96744 173600 -249519
13058 530747 286647 -330503 68587 -227114 26103 312180 407220 18960 92236 129472 19455
13046 268219 449910 497504 270913 -87888 79688 -20307 74498 -142594 131647 -120270
13035 81090 63977 72818 27234 -84319 -118504 -132153 111674 208073 -25179 15300 -19560 -165085
13023 -165085 556968 380933 -31292 157325 210536 -61723 78455 446062 95583 72307 126666
13012 126666 -122313 163189 186667 -103852 132636 -65465 346997 -7133 55549 182663
$$ packed form
13093h9805D3747a0693C8553J77791b15620A39917g1450j81818c259A22007a32779
13081C43398j44592r568c2776j40143A12704n0759R4013L2112A2664L0546J10048
13070A53258C4288R911K4470B2916J11893g5656A43629n4090i6744A73600b49519
13058E30747k44100c30503F8587b27114B6103K86077R5040A8960P3276L7236A9455
13046B68219J81691M7594k26591h7888G9688b0307G4498a42594A31647a20270
13035H1090j7113Q841B7234h4319l4185j3649A11674R6399b5179A5300a9560j45525
13023a65085E56968j76035c1292A57325N3211f1723G8455L67607I5583k3276N4359
13012A26666a22313A63189K3478a03852A32636f5465C46997g133E5549J27114
$$ plain form
13002 182663 248578 109395 373830 64821 -57063 205310 -316784 341267 310662 -129396
12991 101460 -507119 274185 113126 395689 56162 -71279 96441 -22755 188143 -492922
12980 319408 -12223 236746 100724 -72071 -91025 -336290 -29513 160217 124853 289324
12970 289324 170391 -102931 105442 13600 270140 -107128 282373 -20658 235460 165626
12960 165626 -75481 365434 36949 162554 -3638 199271 139333 -177935 41615 77871 -247186
12948 221471 -106430 -60542 -286803 -60066 52166 56103 -16586 -70502 34022 86292 -170940
12936 -38504 -145101 -214650 15407 -98857 164558 13783 231183 63032 277419 -33312 -38096
12925 -38096 -222359 149391 350509 -18268 117235 -105039 133898 -227777 194606 249503
$$ packed form
13002A82663O5915A09395K64435F4821e7063B05310c16784C41267l0605a29396
12991A01460e07119B74185A13126K82563E6162g1279I6441b2755A88143d92922
12980C19408a2223B36746A00724g2071j8954k45265b9513A60217l5364J64471
12970B89324j18933a02931A05442A3600K56540a07128B82373b0658B35460o9834
12960A65626g5481C65434C6949J25605c638A99271n9938a77935D1615L6256b47186
12948B21471a06430M5888k26261f0066E2166L937a6586n3916C4022N2270a70940
12936c8504j06597o9549A5407i8857A64558A3783K17400F3032K14387c3312m784
12925c8096j84263A49391K01118a8268A17235a05039A33898b27777A94606N4897
$$ plain form
12915 249503 415848 -298282 327678 166542 -135372 -8908 234453 99949 -91132 -178922
12905 -178922 394448 258197 181504 -33972 -58703 -208880 -288824 47620 -38350 -142632 54409
12893 30959 -19043 -168764 105856 148012 128021 267704 -144761 -124109 -137176 168748 79515
12881 78627 -163146 -398391 -148190 -14630 53155 16558 -177150 -63463 45496 8963 310623
12870 310623 -84812 -38763 73458 162676 42087 251706 -104011 -131597 -143222 312304 -118108
12858 -156740 119323 145448 -299339 -103743 10535 -257454 2165 118872 172645 221081 104396
12846 157638 -99235 -235434 43303 -2803 212028 8199 272920 343540 107611 82154 -249040
12834 344462 30578 -63832 187662 84520 -313884 -214899 110861 229571 119121 125086 12954
$$ packed form
12915B49503J66345b98282C27678j61136a35372h908B34453I9949i1132q7790
12905a78922C94448j36251p6693c3972k4731j50177p9944D7620c8350j04282E4409
12893C0959a9043j49721A05856M2156j9991J39683a44761K0652j3067A68748G9515
12881G8627a63146k35245a48190a4630E3155A6558a77150f3463D5496H963L01660
12870C10623h4812c8763G3458Q9218D2087K09619a04011k7586j1625C12304a18108
12858a56740A19323K6125b99339a03743A0535b57454B165J16707N3773M8436A04396
12846A57638i9235j36199D3303b803B12028H199K64721P0620A07611k5457b49040
12834C44462C0578f3832A87662H4520c13884R8985A10861J18710j10450N965A2954
$$ plain form
12822 -97686 -79411 -34577 149184 17854 37580 107670 122286 62945 -3604 400640 -7244 -308007
12810 -308007 -278962 60190 258712 120152 229044 -9816 -274389 -46177 -46011 25806 18693
12799 18693 363004 -145896 83320 86211 -15056 -339989 86297 164196 -81663 140500 -36431
12787 95063 144190 9650 -304698 141896 165334 -63760 52271 -203004 -235480 -190150 166904
12775 307212 123633 -40166 207240 139175 2003 -159585 27188 -81180 104430 44697 273002
12764 273002 237890 -2844 -7977 -138111 261312 83216 -11919 -34163 -141659 -134097 29828
12752 -58563 -189802 -338910 120312 -322969 82533 -97390 -166370 194385 -22674 -202651
12742 -202651 370499 279108 302911 20110 363728 77697 -163704 4246 -202634 226192 235736
$$ packed form
12822i7686J8275c4577A49184A7854J9726P0090J4616n9341c604D00640g244l00763
12810c08007K9045F0190J98522A20152J08892i816k64573d6177J66B5806p113
12799A8693L44311a45896H3320K891a5056l24933H6297P7899h1663A40500c6431
12787I5063M9127I650c04698A41896K3438f3760E2271b03004l2476M5330A66904
12775C07212A23633d0166B07240o8065B003a59585B7188h1180A04430D4697K28305
12764B73002l5112b844n133j30134B61312H3216a1919k2244j07496P562B9828
12752e8563j31239j49108A20312c22969H2533i7390o8980A94385b2674j79977
12742b02651C70499r1391K3803B0110L43618G7697a63704D246b02634B26192R544
$$ plain form
12731 235736 224826 11226 33723 -302238 -333985 66608 25840 -51502 67583 95517 -99180
12719 63372 9419 38178 -252901 -2668 -50885 -7141 -159627 -98685 367249 -14228 115751
12707 -68810 284861 76102 567962 69259 42212 341073 -20051 25179 -125342 -125079 -77771
12696 -77771 166033 -44799 26732 -360740 -230128 263947 -152194 -28402 -105174 51711 -156591
12684 79593 124254 79841 260122 294383 68337 117663 28049 -59248 182600 -135714 197657
12672 152801 246963 -83506 57789 -34124 -233219 90413 62870 127914 -26706 -109104 -133322
12661 -133322 2136 182439 -227250 57818 286695 140347 133542 63317 430552 163684 71601
12649 112162 -25531 231685 -293567 -148618 -73092 164924 27786 27023 -61736 -53241 27863
$$ packed form
12731B35736j0910A1226K2497c02238l1747F6608B5840e1502F7583K7934i9180
12719F3372I419K8759b52901b668m8217g141j52486O0942C67249a4228A15751
12707f8810B84861G6102M91860F9259k7047K98861b0051B5179a25342K63M7308
12696g7771A66033d4799B6732c60740J30612B63947a52194b8402p6772E1711a56591
12684G9593M4661m4413J80281L4261F8337M9326B8049e9248A82600a35714A97657
12672A52801R4162h3506E7789c4124j99095I0413k7543O5044b6706q2398k4218
12661a33322B136J80303b27250E7818K28877A40347o805F3317L67235A63684G1601
12649A12162b5531B31685b93567J44949g3092A64924B7786p63f1736Q495B7863
$$ plain form
12637 -28829 -68327 -191275 111418 -88388 -40025 -65587 347506 97261 366488 107097 71072
12626 71072 -25493 371502 293330 283871 286123 45286 -266906 344562 241830 329735 51862
12614 81765 42054 114961 180972 55405 -19724 93833 34459 -116119 133132 135375 208599
12603 208599 2927 108137 376233 226455 379883 -170786 -88724 -179802 108430 39270
12592 91745 313897 27588 225099 13591 62166 -114212 -48255 -160566 236180 -441475
12581 76786 -134331 339615 82270 11692 190795 -108275 -2149 -305009 16256 352928 -347218
12569 158090 -99370 -29938 319094 149142 -75773 -192904 115386 33268 133569 -21571
12558 4901 74187 -37849 77430 -70286 -322 -106862 -81762 10416 263372 -4932 185744 110363
$$ packed form
12637b8829l9498j22948A11418h8388d0025k5562C47506I7261K69227A07097l6025
12626G1072b5493C71502p8172r459K252D5286b66906C44562j02732Q7905E1862
12614H1765l9711P2907O6011E5405a9724I3833C4459a16119A33132K243P3224
12603B08599B927J05210K68096j49778J53428a70786Q2062r1078A08430C9270
12592I1745K22152B7588J97511A3591M8575a14212d8255j12311B36180d41475
12581G6786a34331C39615H2270A1692J79103a08275b149l02860A6256L36672c47218
12569A58090i9370b9938C19094A49142g5773j17131A15386C3268J00301b1571
12558D901O9286c7849G7430g0286c22j06540K5100A0416K52956d932A85744p5381
$$ plain form
12546 110363 273169 136912 -155152 132321 -74343 245587 -50731 -1798 321263 -258759
12535 230286 -162739 -27447 -235258 30952 -113104 270560 57215 23644 -111466 49886
12524 292060 -147575 -255913 -53364 58177 -42498 -59684 -14450 -101016 -119889 -181663 282027
12512 122842 35955 -391095 -339996 -78509 18686 157599 -125745 48947 127028 -182617 -291338
12501 -291338 -7020 -64324 87061 -52843 -170466 226713 -112248 -323761 -45102 -49877 133300
12489 66012 202726 -239248 -107066 -489929 40668 34435 -37070 97501 -12236 80277 -44714
12477 287202 -194767 46284 -237225 -103701 -301482 270788 -57799 -107115 -110787 -371337
12467 -371337 -56196 -102657 -30333 244310 9379 -44971 -196637 -170962 -200171 -32068 503 -9457
$$ packed form
12546A10363J62806j36257a55152A32321g4343B45587e0731a798C21263b58759
12535B30286a62739b7447k07811C0952a13104B70560E7215B3644a11466D9886
12524B92060a47575j08338e3364E8177d2498j7186a4450q6566j8873o1774B82027
12512A22842C5955c91095N1099g8509A8686J38913a25745D8947P8081a82617j08721
12501b91338g020n7304H7061e2843j17623B26713a12248k11513d5102m775A33300
12489F6012J36714b39248a07066l82863D0668o233c7070I7501a2236H0277d4714
12477B87202a94767D6284b37225a03701j97781B70788e7799m9316l672k60550
12467c71337e6196m6461c0333B44310I379d4971j51666K5675k9209c2068E03i457
$$ plain form
12454 -52663 -179205 -41985 -57829 142080 -303471 -5517 -95620 -100008 -24359 -191713 301313
12442 -2107 -28534 30634 -16203 5384 316855 -14602 -182261 53307 85832 -7902 -58122 154675
12429 114996 109377 -328830 133247 -33229 141266 -273538 -189272 -120631 83411 -252901 -166790
12418 -166790 -257127 245956 -161437 263235 52633 127454 3499 -205424 -55473 225791 258870
12407 258870 44253 84795 125942 212649 77528 -124711 -204081 8353 -115223 125630 16235
12395 201153 63495 -20100 -23470 151557 -27244 -24933 180362 157584 -40801 174125 -42697
12383 -61462 -130711 -49415 -156243 230375 9144 201154 -128581 300855 -251796 -109510
12372 108622 165585 -198944 25178 -45803 237167 172546 22361 81277 8209 32637 256311
$$ packed form
12454e2663j26542d1985j5844A42080c03471e517r0103m388b4359j67354C01313
12442b107k6427C0634a6203E384L11471a4602j67659E3307L2525g902n0220A54675
12429A14996n619c28830A33247c3229A41266b73538Q4266O8641H3411b52901Q6111
12418a66790r0337B45956a61437B63235E2633P4821C499b05424e5473B25791L3079
12407B58870D4253M0542M1147Q6707G7528a24711p9370H353a15223A25630A6235
12395B01153F3495b0100l370A51557b7244K311A80362k2778d0801A74125d2697
12383f1462o9249d9415j06828B30375I144J92010a28581C00855b51796a09510
12372A08622N6963a98944B5178d5803B37167o4621B2361N8916H209K4428K23674
$$ plain form
12361 256311 124463 -30096 95343 172528 -173096 -286878 -216573 23528 -72480 -74052 16567
12349 34843 399710 -217243 34269 -69653 30793 205137 88131 208200 171046 -30357 27588
12337 -164872 88206 4891 13688 -134309 155727 85022 -236046 -200810 245193 277985 -272349
12325 88066 174315 50873 -142394 -53864 -262094 -197555 -258097 60997 60238 27441 14040 123114
12313 123114 -183716 165852 -359264 194260 -53912 -217431 -56637 -44962 38688 99468
12303 99468 -6582 260073 -115563 279758 107374 -11745 -367832 335188 55306 71996 167511
12292 167511 203565 100914 229373 -11255 -233610 -112741 -253058 -128939 40640 -52943
12281 246455 345508 -86637 -118123 -55099 87238 14944 64532 356299 -170804 -358213 -163194
$$ packed form
12361B56311A24463c0096I5343P7185a73096j13782P0305B3528g2480j572A6567
12349C4843L64867b17243C4269f9653C0793J74344H8131J20069l7154c0357B7588
12337a64872H8206D891Q797a34309A55727p0705b36046L5236B45193L2792b72349
12325H8066Q6249E0873a42394e3864k08230O4539o0542F0997p59B7441j3401J09074
12313A23114a83716A65852c59264A94260e3912j63519e6637J1675C8688O0780
12303I9468f582B60073a15563B79758A07374a1745l56087C35188E5306J6690R5515
12292A67511L6054A00914J28459a1255k22355a12741j40317J24119D0640e2943
12281B46455R9053h6637l1486e5099H7238A4944M9588K91767a70804j87409a63194
$$ plain form
12269 -48840 85441 128121 107405 -91935 -141767 -150172 -219426 -87852 457736 -78135 88272 270632
12257 270632 -114845 168634 92868 37293 111683 -235404 -249978 253193 111815 283126
12247 283126 98493 -177669 426610 110311 339579 326429 221446 -44212 -58125 -308073
12237 -308073 -140108 -153622 298417 114920 -201517 99168 416955 39572 53672 159183
12227 159183 94556 343020 -63835 207293 292815 272888 141946 263321 203790 235031 8919
12215 5822 49126 229452 129084 120062 338023 170963 54446 147001 84856 598161 -191408
12203 308925 273643 -52023 246094 320110 64709 360251 351742 -25460 199587 104543 169535
12192 169535 66545 161183 -121054 185360 -10682 120360 145607 -35949 146290 96897 90442
$$ packed form
12269d8840H5441M2680k0716i1935m9832q405o9254h7852D57736g8135H8272J82360
12257B70632a14845A68634p5766C7293P4390b35404j4574B53193A11815J71311
12247B83126I8493a77669D26610A10311K29268j3150j04983d4212j3913k49948
12237c08073a40108j3514B98417A14920b01517I9168L17787C9572J4100J05511
12227A59183o4627K48464f3835B07293Q5522j9927j30942J21375n9531L1241H919
12215E822M3304J80326j00368r022K17961j67060E4446R2555o2145N13305a91408
12203C08925l5282e2023B46094P4016F4709K95542q509b5460A99587r5044O4992
12192A69535F6545R4638a21054A85360a0682A20360K5247c5949A46290m9393o455
$$ plain form
12181 90442 32044 -241531 75330 57956 -164199 -57888 101709 32109 373775 87267 451319
12170 451319 40416 -373960 136467 254133 82293 210166 219631 189147 -107399 -19334 -111611
12159 -111611 -100464 123516 91383 167982 -50139 44260 13164 152485 134189 -245368 202595
12147 64854 33088 -4757 -59434 -133630 -53289 -54639 184552 271888 -116066 -201726 -120642 -60692
12135 -60692 -38395 -4071 380653 17553 -70467 -46018 189961 70283 23783 -260228 168107
12123 49978 350351 221024 -174451 -41458 128344 -89495 4156 145911 -163627 -5409 323781
12111 203135 -18434 156157 -148148 191041 223285 -219037 84765 211888 -38866 -65110
12101 -65110 153584 -50132 77870 17103 -104249 30416 -126304 -83734 -342859 -24225 -338584
$$ packed form
12181I0442C2044b41531G5330j7374a64199e7888A01709C2109L41666H7267L64052
12170D51319D0416c73960A36467J17666H2293J27873R465l0484a07399a9334r2277
12159a11611J1147A23516l2133P6599e0139D4260A3164J39321j8296b45368B02595
12147F4854l1766d757n4677p4196e3289j350A84552Q7336a16066q5660Q1084N9950
12135f0692K2297d071C80653A7553g0467K4449A89961G0283B3783b60228A68107
12123D9978L00373j29327a74451d1458A28344h9495D156J41755a63627e409C23781
12111B03135a8434A56157a48148A91041L2244b19037H4765J27123c8866k6244
12101f5110A53584e0132G7870A7103a04249C0416a26304M2570k59125b4225l14359
$$ plain form
12090 -338584 260038 54995 55403 -208758 -239744 -113286 -24328 151582 297036 -64398 -60670
12079 -60670 2358 49006 161331 274896 607754 1730227 1342238 328520 157689 201914
12069 201914 313953 -24331 -113636 -18983 418089 10701 280463 82704 -158955 -234227 24759
12057 161556 238806 -44464 170832 -176901 93961 191579 193503 93084 -43283 214525 124855
12046 124855 149330 318448 70724 16679 -286375 -168461 -41864 -64259 40030 -8615 -123726
12035 -123726 -238618 116409 48922 172435 -171887 297202 -136711 -124357 40464 -156576
12024 135262 -249955 321567 -40375 54620 -134683 109745 -169181 633 9347 307863 23647
12012 40317 -44288 -14517 -70102 -192841 -234239 -78346 -52936 118744 -139562 48954 51749
$$ packed form
12090c38584B60038E4995M08b08758l0986a13286b4328A51582J45454f4398L728
12079f0670B358M6648J12325J13565L32858J122473l87989C28520A57689M4225
12069B01914J12039b4331q9305a8983D18089A0701K69762H2704a58955p5272B4759
12057A61556P7250d4464A70832a76901I3961R7618J924I3084d3283B14525q9670
12046A24855K4475J69118G0724A6679b86375J17914d1864k2395D0030h615j15111
12035a23726j14892A16409D8922J23513a71887B97202a36711J2354D0464a56576
12024A35262b49955C21567d0375E4620a34683A09745a69181F33Q714K98516B3647
12012D0317d4288a4517n5585j22739m1398g8346K5410A18744a39562D8954K795
$$ plain form
12001 51749 196492 -290750 -189547 -265236 120159 -2164 -21991 -160966 88131 -122560 -121476
11990 -121476 -500476 -103258 93348 220436 -124494 -103360 168212 90044 -53096 35924
11979 126981 158722 78507 -99562 73439 133247 -471579 34012 233522 -396641 53734 -316564
11967 -136662 58437 190621 -290479 54630 62308 -39055 -259887 58989 -318406 -233647 47721
11955 -151960 -101330 67215 221075 29175 250213 -84792 -55328 87328 65956 -59473 -64020
11944 -64020 -216746 -39906 245951 11381 -113063 35163 -164996 96311 121900 19899 -154900
11932 -22431 29383 92401 -140179 295811 161541 -163893 5701 -345494 -32571 -197976 -13035
11920 310376 -40651 -262554 -61802 220273 -245847 -122276 60028 -201788 -40957 38224
$$ packed form
12001E1749J44743b90750J01203p5689A20159b164j9827j38975H8131a22560J084
11990a21476l79000a03258I3348J27088a24494K1134A68212p8168e3096C5924
11979A26981L1741G8507i9562G3439N9808d71579C4012J99510c96641E3734c16564
11967a36662E8437J32184b90479E4630P678c9055k20832E8989c18406Q4759D7721
11955a51960N0630F7215J53860B9175K21038h4792K9464H7328k1372e9473m547
11944f4020j52726c9906B45951A1381a13063C5163a64996I6311K5589A9899a54900
11932b2431B9383O3018a40179B95811j34270a63893E701c45494c2571j65405a3035
11920C10376d0651k21903f1802B20273b45847a22276F0028b01788d0957C8224
$$ plain form
11909 222496 25172 -376961 -117915 -28545 -282671 -43788 182211 -80117 336564 -83524
11898 -33314 -53223 -204299 -48084 -362104 -324309 -164134 -16392 -238668 32841 299658 35486
11886 -317397 317768 -222603 236841 -131725 -125123 249870 271510 66337 -197242 172235
11875 -220371 -101230 30753 -20836 -83895 51713 51423 94632 -217967 -3186 84689 56479 -239641
11862 -71855 -169808 -447466 -104132 -1798 -37953 132900 -285433 132267 157281 286111 171682
11851 171682 -159248 -91779 239801 9688 33940 31644 54050 -59475 -129916 -129126 236539 50979
11838 141556 -69682 129103 -124215 -164937 88873 -74518 8634 127847 -344214 -248249 204664
11826 -47732 -203993 107515 -223420 -24257 -330441 30842 -213296 -72347 56067 -360890
$$ packed form
11909B22496B5172c76961a17915b8545k54126d3788A82211h0117C36564h3524
11898c3314j9909j51076d8084l14020L7795J60175a6392k22276C2841K66817C5486
11886c17397C17768b22603B36841a31725O602B49870K1640F6337a97242A72235
11875b20371a01230C0753b0836o3059E1713k90M3209b17967c186H4689k8210b39641
11862g1855r7953k77658a04132a798l6155A32900b85433A32267K5014J28830j14429
11851A71682a59248O7469B39801I688K4252k296K2406e9475p0441P90B36539E0979
11838A41556f9682A29103a24215m0722H8873g4518H634J19213c44214R5965B04664
11826d7732j56261A07515b23420b4257l06184C0842b13296g2347E6067c60890
$$ plain form
11815 226938 -53977 158478 -216179 -500318 -331620 -13790 216539 -48920 -221379 -248194
11805 -248194 -292700 254031 39634 118773 -148676 296979 198339 225448 9806 -73527 -85793
11794 -85793 271985 52401 280861 -71691 -302687 -39316 -7534 -125433 -164320 -342574 260567
11782 -222099 323241 -31452 83438 98255 298261 -60329 -219666 240062 99280 325467
11772 325467 153617 117031 321277 -20029 8712 44569 232403 -280562 192281 218223 1629
11760 -25330 -103477 -178782 292015 -251126 -232234 230606 -95546 136574 -106794 29548 78750
11749 78750 -153745 -164525 -164667 117022 208588 186071 -421076 -151656 3841 64887 -30683
11737 -122296 -50805 -294738 25548 -63533 -114454 79700 -187206 -127597 193938 232595 199563
$$ packed form
11815B26938e3977A58478b16179k84139J68698a3790B16539d8920j72459k6815
11805b48194m4506B54031C9634P9139a48676B96979r8640K7109I806g3527j2266
11794h5793B71985E2401K28460g1691k30996c9316g534j17899l8887j78254B60567
11782b22099C23241c1452H3438J4817K00006f0329j59337B40062I9280K26187
11772C25467A53617l6586K04246b0029H712L5857J87834b80562A92281K5942A629
11760b5330p8147p5305B92015b51126J8892B30606i5546A36574a06794B9548M9202
11749G8750a53745j0780j42A17022R1566k2517d21076a51656C841O1046c0683
11737a22296e0805k43933B5548f3533n0921G9700a87206N9609A93938L8657l3032
$$ plain form
11726 199563 224402 155245 93212 20098 -195533 17691 119630 226070 77542 -307377 -295743
11715 -295743 95555 193451 67265 -133868 173110 140365 -196346 -42016 469611 54611 -221230
11703 292483 -250913 146908 -10298 116166 73912 -14804 -123059 -104802 64861 -48955 13236
11691 -27589 -23555 -149404 -12591 411321 9117 -70094 -54228 -160686 -62700 -2730 98964 315471
11679 315471 131084 -88651 -169670 19075 97234 44487 -163907 21722 -247717 144917 -180678
11667 110486 -28968 -37232 34994 -164335 106775 -27141 156137 87392 10785 -210910 110344
11655 -165917 41271 217019 185186 144412 27894 -90956 -90140 -105166 90684 14930 162193
11644 162193 -124927 -186946 -55616 -17663 -157597 -52603 -132255 460923 -315372 15663 96016
$$ packed form
11726A99563K4839o9157o2033B0098a95533A7691J01939J06440G7542c07377J1634
11715b95743I5555R7896F7265a33868A73110l2745a96346d2016D69611E4611b21230
11703B92483b50913A46908a0298A16166m2254a4804j08255J8257F4861d8955A3236
11691b7589M034j25849a2591D11321I117g0094J5866j06458f2700b730I8964K16507
11679C15471A31084h8651q1019A9075P8159D4487a63907B1722b47717A44917a80678
11667A10486b8968q264C4994a64335A06775b7141A56137o8745A0785b10910A10344
11655a65917D1271J75748l1833m0774B7894i0956Q16j5026I0684A4930J47263
11644A62193a24927o2019e5616a7663j39934e2603p9652D60923c15372A5663Q0353
$$ plain form
11633 96016 298033 -89097 -64673 12626 205869 -743 74013 140599 196462 35034 -29010 -17289
11621 -17289 10366 -76015 -2589 17267 21329 -358229 -10524 -303734 89073 135486 396972
11610 396972 22593 -238461 384150 -67807 311931 -332305 213130 -88702 -185889 -72943
11599 25878 257352 -114805 -177534 214866 -136317 347213 158517 76048 -62307 245980
11588 184578 157576 -61290 156636 32761 -69075 156978 -155779 6888 120875 4428 158466
11577 158466 223044 -231012 -402649 47442 -146039 -55738 159530 -195245 -20501 106717
11566 119317 114881 207600 -169438 -6624 115859 158362 112460 262911 187560 -4798 75568
11554 9721 178770 -81260 -51330 -81107 -40051 206338 83344 -116863 -78355 170146 126833
$$ packed form
11633I6016K02017h9097K4424A2626J93243g43G4013O6586N5863C5034b9010J1721
11621a7289A0366g6015b589A7267M062c58229a0524k93210H9073M6413K61486
11610C96972B2593b38461C84150f7807C11931c32305B13130h8702r7187g2943
11599B5878K31474a14805o2729B14866a36317C47213A58517G6048f2307B45980
11588A84578k7002f1290A56636C2761f9075A56978a55779F888J13987D428J54038
11577A58466O4578b31012j71637D7442a46039e5738A59530a95245b0501A06717
11566A19317m436R2719a69438f624A15859M2503m5902J50451p5351d798G5568
11554I721J69049h1260K9930k9777d0051B06338H3344a16863L8508A70146m3313
$$ plain form
11543 126833 38371 208227 93450 458490 -34304 -319557 226396 3896 27629 180714 302301
11532 302301 -214961 -129105 -112300 -62337 163788 112988 253433 -14875 53802 55460 211721
11521 211721 -54370 -15159 -18559 203653 -39710 70848 -43193 253985 -244956 206418 4147
11509 397119 352092 175068 -48077 191046 159182 179053 375443 96115 381125 9574 57872
11498 57872 15822 63938 461823 -264527 -25472 76067 140056 -107363 246726 116982 -179594
11486 111623 -42420 11583 114691 227048 -77347 305398 133330 -109903 267835 534358
11476 534358 252781 -44526 49409 155179 -193731 104760 42862 85573 20760 59169 104466
11465 104466 202610 309858 79470 -55467 168270 77118 -59624 -272440 -158369 193441
$$ packed form
11543A26833C8371J69856I3450L65040c4304k85253B26396C896K3733J53085J21587
11532C02301b14961Q5856J6805M9963A63788n0800J40445a4875E3802J658J56261
11521B11721e4370a5159l400B03653c9710G0848d3193B53985b44956B06418D147
11509C97119m5027A75068d8077A91046l1864J9871J96390I6115K85010I574M8298
11498E7872A5822M8116L97885b64527b5472G6067O3989a07363B46726A16982a79594
11486A11623d2420A1583J03108J12357g7347C05398A33330a09903B67835K66523
11476E34358B52781d4526D9409J05770a93731A04760D2862M2711B0760L8409M5297
11465A04466R8144J07248G9470e5467A68270G7118e9624k12816J14071A93441
$$ plain form
11454 31578 128177 6085 -105631 -97467 -16674 150805 152988 206666 42396 226417 -95784 116278
11441 -24573 300943 -101505 -137914 36000 245318 22225 9079 74667 360106 551 61618
11430 61618 122759 -235943 55355 26978 60419 220501 113449 -66818 -52413 204906 193819
11419 193819 -178924 -267366 -173164 316471 -57524 46477 148973 -106785 86337 17916 -115364
11407 193410 271596 506264 -186057 51997 173542 -33783 90908 237875 -5182 152732 135103
11396 135103 -128888 163764 -58124 228175 119260 -196691 -148757 -107903 15781 -15717
11385 77521 -113943 -17370 251288 -86675 13750 279927 174235 -16501 45019 101976 293163
11374 293163 130092 52537 5705 -42720 31050 -287079 -36122 -55586 -19586 -113740 -148150
$$ packed form
11454C1578R6599F085a05631Q164a6674A50805K183N3678D2396J84021i5784A16278
11441b4573C00943a01505l6409C6000K09318B2225I079O5588K85439E51O1067
11430F1618O1141b35943E5355B6978L3441J60082j07052f6818J4405B04906j1087
11419A93819a78924q8442R4202C16471e7524D6477J02496a06785H6337A7916a15364
11407A93410P8186K34668a86057E1997J21545c3783I0908J46967e182A52732j7629
11396A35103a28888A63764e8124B28175j08915a96691M7934M0854A5781a5717
11385G7521a13943a7370B51288h6675A3750K66177j05692a6501D5019N6957J91187
11374B93163A30092E2537E705d2720C1050b87079c6122j9464a9586r4154l4410
$$ plain form
11363 -148150 -49388 38067 -123164 -41428 -16063 143957 -43318 -12729 -71260 -143011 151726
11351 -51490 -8437 180203 21788 105575 15238 78951 -101004 -56869 -134518 309354 -8406
11339 -159258 7869 283515 -197048 -89970 -42268 3409 -342323 24259 -278892 -91717 -79773
11328 -79773 81623 -116446 -17377 -40986 -440861 -270412 20469 -62273 35111 65958 49881
11317 49881 -145003 61383 -22707 -386780 31165 -55626 257204 85477 -15065 -29672 103203
11305 -51495 -31667 111975 -124272 -227087 -135288 251495 190228 -96656 244603 26613 142610
11294 142610 -115801 185232 -99806 27086 213048 268222 100331 -62827 -123726 -88229 -111048
11283 -111048 -191867 -97855 -77700 -78534 24265 -219642 -148550 137649 -130785 -414629 -305007
$$ packed form
11363a48150d9388C8067a23164d1428a6063A43957d3318a2729n8531p1751A51726
11351e1490h437A80203B1788Q3787A5238O3713a01004M4135p7649C09354h406
11339a59258G869K75646a97048h9970d2268C409c42323B4259b78892i1717J1944
11328g9773H1623a16446a7377k3609l99875J70449B0469f2273C5111L0847j6077
11317D9881a45003F1383b2707l64073C1165e5626B57204H5477a5065j4607A03203
11305e1495J9828A11975a24272j02815R1799B51495o1267i6656B44603B6613J15997
11294A42610a15801A85232i9806B7086J85962N5174A00331f2827o0899L5497k2819
11283a11048q0819R4012K0155q34B4265b19642P1092A37649a30785k83844J09622
$$ plain form
11272 -305007 -120530 -58238 -39094 -276674 166693 -442957 -240653 -97462 -111044 182823
11261 15734 247471 163659 -175980 -212331 -83365 168382 175778 120596 -118616 224299 -34984
11249 52983 -89673 132274 -289431 176416 -57814 239573 169644 -163296 155319 -313469
11238 -130466 141316 70936 51413 31145 -40344 142699 133601 -78862 -173282 -136425 -187524
11227 -187524 173205 86395 -76119 83141 -194204 -73472 -253965 316587 -8518 -106397 -17224
11215 -184163 293211 235572 -92687 -58680 262959 -309315 51471 -26572 -414969 -142780
11204 12202 68101 -65473 12739 -379336 -74930 -108638 -161975 -222363 18080 116954 -250624
11192 -49231 58957 -257823 135997 -140403 149735 -24451 8444 17461 -223780 26318 -175908
$$ packed form
11272c05007a20530e8238J9144k37580A66693d42957K02304i7462j3582A82823
11261A5734K31737q3812a75980l6351h3365A68382P396n5182a18616B24299c4984
11249E2983h9673A32274b89431A76416e7814B39573o9929a63296A55319c13469
11238a30466A41316p0380j9523k0268d0344A42699r098g8862r4420L6857n1099
11227a87524A73205H6395g6119H3141a94204g3472j80493C16587h518r7879a7224
11215a84163B93211n7639i2687L4007B62959c09315E1471b6572l88397a42780
11204A2202N5899f5473A2739c79336g4930l3708n3337o0388A8080R8874b50624
11192d9231E8957b57823A35997a40403A49735b4451H444R017b23780B6318a75908
$$ plain form
11180 139256 -398522 -15623 73764 -68497 49834 25478 -151937 196944 -43458 85607 97426
11169 97426 -37081 -317590 199670 -153107 -96517 -311783 -47972 -430 -145602 295614 -126432
11157 -45635 120141 -212739 93563 67898 48297 220222 -86010 188359 29958 -2495 -126276
11146 -126276 58297 -133979 -161944 -117033 -89445 166124 -287430 -197016 -306330 -12568 102669
11134 119430 -223035 -172657 54503 267262 40999 144936 217325 154996 -59518 -268394 265271
11122 130117 -75146 -33947 -17863 -258120 261877 65077 -109146 96988 -75861 145526 24741
11110 -369773 -97840 16785 46196 87950 160606 379964 2842 39095 -15413 259854 254469
11099 254469 174580 87437 250070 143317 109923 269885 -52544 399302 371208 -75046 181622
$$ packed form
11180A39256c98522a5623G3764f8497D9834k4356a51937A96944d3458H5607J1819
11169I7426c7081k80509A99670a53107N6590k15266d7972d30j45172B95614a26432
11157d5635A20141b12739I3563k5665j9601J71925h6010A88359B9958b495j23781
11146a26276E8297a33979k7965M4911K7588A66124b87430R0414j09314a2568A02669
11134A19430b23035N0378E4503K12759D0999J03937P2389o2329e9518k08876B65271
11122A30117g5146c3947J6084k40257B61877F5077a09146I6988g5861A45526B4741
11110c69773i7840A6785K9411M1754P2656K19358B842L6253a5413B59854n385
11099B54469p9889q7143J62633j06753l3394J59962e2544C99302k8094g5046A81622
$$ plain form
11087 55486 365699 217682 54177 356865 145932 188937 279270 235719 482491 219020
11076 381022 188826 468972 141717 281009 461362 155099 780359 253902 355965 148896
11065 118732 135496 34772 322920 603569 516600 415004 562316 407512 302304 490350
11055 490350 443767 620903 479382 545112 771776 554705 749477 1016256 744562 947323
11045 947323 765059 989972 447395 851540 546005 216521 492631 685301 826026 631503
11035 631503 387953 597413 619666 742183 683142 387936 422176 491942 598192 666445
11025 666445 760545 894573 790541 757791 642289 686149 394533 351770 690939 451740
11015 451740 541369 518577 303871 615634 469462 642851 241185 513117 536057 506161
$$ packed form
11087E5486L10213j48017E4177L02688A45932M3005R0333m3551K46772B19020
11076C81022A88826K80146A41717J39292J80353A55099O25260B53902J02063A48896
11065A18732J6764C4772K88148K80649q6969j01596J47312j54804j05208J88046
11055D90350m6583J77136j41521O5730K26664k17071J94772K66779k71694K02761
11045I47323j82264K24913D47395M04145l05535B16521K76110J92670J40725j94523
11035F31503k43550K09460K2253J22517n9041k95206L4240O9766J06250O8253
11025F66445R4100J34028j04032l2750j15502M3860k91616m2763L39169k39199
11015D51740Q9629k2792k14706L11763j46172J73389B41185K71932K2940k9896
$$ plain form
11005 506161 814292 320804 499132 839832 622344 931919 853191 743135 635864 664699
10995 664699 585389 549655 557648 733621 490485 1012447 883547 643877 638674 480920 1044762
10984 1044762 484855 801102 737405 1371596 992081 924611 1184970 1311255 1542084 1908441
10974 1908441 1987423 2289204 2511534 2723767 2628276 2478497 2834139 2573996 2137222 1776530
10964 1776530 1566351 1798683 1661943 1454642 1654001 1617992 1563307 1838176 1488623 1425074
10954 1425074 1520819 1636186 1320281 798539 673265 629980 713244 431152 518328 9216
10943 464168 94844 152149 222252 313701 392117 155069 69902 188150 -199351 -29466 -145890
10932 -145890 -115445 302772 114606 423154 146448 180580 -90322 -43804 197791 -34452
$$ packed form
11005E06161L08131C20804J78328L40700k17488L09575p8728j10056j07271K8835
10995F64699p9310l5734P993J75973k43136N21962j28900k39670n203j57754N63842
10984A044762D84855L16247o3697O34191l79515o7470K60359J26285K30829L66357
10974A908441P8982L01781K22330K12233r5491j49779L55642k60143m36774l60692
10964A776530k10179K32332j36740k07301J99359l6009n4685K74869l49553o3549
10954A425074R5745J15367l15905n21742j25274m3285Q3264k82092Q7176I216
10943D64168I4844N7305P0103R1449P8416A55069F9902J18248a99351b9466j16424
10932a45890L0445C02772A14606L08548A46448L4132i0322d3804A97791c4452
$$ plain form
10921 -153461 -208505 106885 227489 52671 -44310 -88518 -37154 15097 -410780 205173 -37255
10909 93648 -319335 79686 190360 44405 -188907 31282 136256 -44445 -82389 -285716 -236452
10898 -236452 121142 121576 -224972 -42161 -266041 216742 -338510 -164816 288176 -14082
10887 39869 -110971 -136690 60924 83722 -272980 -292015 -10128 126990 312803 -54131 -295335
10876 -295335 78578 -76249 129475 -5791 72159 -26183 -40180 64234 -95870 -123247 -283230
10865 -283230 -81290 7563 -49190 -8645 -38094 151545 222805 220997 -241874 -184022 232430
10853 152586 -318930 359597 50368 -380761 -57626 288440 -170388 -52436 -30480 56557
10842 -259773 -115137 -92749 -332968 -31111 -181884 -222911 242338 -198819 201042 -5972
$$ packed form
10921a53461n5044A06885J20604E2671d4310m4208c7154A5097d10780B05173c7255
10909I3648c19335G9686J10674D4405a88907C1282J04974d4445l7944k03327M9264
10898b36452A21142M34b24972d2161k23880B16742c38510a64816B88176a4082
10887C9869a10971k5719F0924K2798b72980j9035a0128A26990J85813e4131k41204
10876b95335G8578g6249A29475e791G2159b6183j3997F4234i5870k7377j59983
10865b83230h1290G563d9190h645k9449A51545P1260j808b41874N7852B32430
10853A52586c18930C59597E0368c80761e7626B88440a70388e2436K1956E6557
10842b59773a15137K2388k40219c1111j50773m1027B42338a98819B01042e972
$$ plain form
10831 23685 -347777 -64203 31081 175389 -343405 -37730 -160208 -115319 -67731 7490 -230483
10819 -316574 -168110 163354 -194749 -240177 -67972 -288279 25745 -243486 -139430 -362333
10809 -362333 133937 57693 -83871 -408244 -38882 -150341 -160355 187104 -105345 -239592
10799 -239592 -182054 67186 251973 -272347 76622 51176 -208325 17894 195626 -161177
10788 -2167 2422 -200505 131573 -28602 -184596 -33007 -11718 -68484 56251 23793 -226924
10776 141845 -195804 -22095 -47189 -216869 -165166 -153189 86204 68622 -7020 -27804 -43581
10765 -43581 3800 -311529 4442 -234712 85388 150953 -56258 -220456 141134 35046 28130
10754 28130 34898 25604 106242 -71270 -90028 13610 16615 -16262 122355 -54506 -136482 100908
$$ packed form
10831B3685c47777f4203C1081J44308c43405c7730j22478M4889M7588G490b30483
10819c16574J48464A63354a94749m5428f7972k20307B5745b43486J04056k22903
10809c62333A33937E7693h3871l24373c8882j11459j0014A87104a05345j34247
10799b39592N7538F7186J84787b72347G6622k5446b08325A7894J77732a61177
10788b167B422b00505A31573b8602j55994c3007a1718n6766E6251B3793b26924
10776A41845a95804b2095k5094j69680N1703J1977H6204j7582g020k0784j5777
10765d3581C800c11529D442b34712H5388O5565e6258j64198A41134C5046o916
10754B8130O768r294Q0638g1270j8758A3610L005a6262A22355e4506q1976A00908
$$ plain form
10741 187979 -368003 203602 172849 -9259 -72327 -39464 -180538 -7549 61238 23983 -367378
10729 46987 -188987 -3285 -123608 -27716 -303512 12267 63700 -122846 22128 -332417 194847
10717 -23857 -322242 -75839 -4748 227781 148113 -224568 66643 -55845 99084 -52717 -244240
10706 -244240 -241345 -68862 53924 48602 289333 -167845 -104170 42432 19104 -38033 -66840
10695 -66840 -17195 -119676 -190716 -100378 302621 -474446 20497 -73176 -58813 -104115 -289607
10684 -289607 126947 14744 -272591 141768 137076 -164935 -184864 164081 -207343 -203349 -139795
10673 -139795 83946 105578 -183837 -39298 187290 -401407 307381 223508 184432 -46895 -147699
10662 -147699 -138352 57024 -161465 -172445 208715 137466 386734 81254 -94027 -237466 156708
$$ packed form
10741A87979c68003B03602l0753i259o3068L2863j41074g549F1238B3983c67378
10729D6987a88987c285j20323b7716k75796A2267N1433a22846B2128c32417A94847
10717b3857k98385g5839d748B27781p9668b24568F6643e5845I9084e2717j91523
10706b44240K895f8862E3924n322K40731a67845O3675D2432A9104c8033k8807
10695f6840a7195j02481p1040R0338C02621d74446B0497g3176J4363m5302j85492
10684b89607A26947A4744b72591A41768m692a64935j9929A64081b07343L994O3554
10673a39795H3946K1632a83837c9298A87290d01407C07381q3873l9076d6895j00804
10662a47699R347E7024a61465j0980B08715p1249K49268H1254i4027j43439A56708
$$ plain form
10650 143910 -150467 13920 -295651 -189597 10101 -84813 -60798 92193 135762 83843 71570
10639 71570 115713 102281 -207796 166557 -253626 -237429 -55938 31687 30252 300020 55597
10627 -123273 -231061 -127125 133885 -31310 -23319 -265408 -145188 -121279 119993 23130
10616 -116032 135794 65243 -49622 -110523 -301908 100457 -53306 218510 -136969 -47269
10605 -107333 -173900 -204408 -85386 137979 -25743 -113620 116403 33645 -123876 -67920 -26611
10593 -109968 128549 -267880 70313 -132913 -103248 -161931 -107083 -104151 -20890 176753 10340
10581 136815 -92434 -116331 -262446 -48948 -23224 -206821 -238607 -94608 -462667 81941 -226216
10569 -170845 -89599 -133421 198436 -74265 10698 -136502 -292500 12674 -59418 69467 42602
$$ packed form
10650A43910a50467A3920b95651J06054A0101h4813K4015I2193M3569n1919j2273
10639G1570M4143j3432b07796A66557b53626J6197e5938C1687j435K69768E5597
10627a23273j07788J03936A33885c1310P991k42089J20220K3909A19993B3130
10616a16032A35794F5243d9622o0901j91385A00457e3306B18510a36969d7269
10605a07333o6567l0508h5386A37979b5743q7877A16403C3645a23876N5956b6611
10593a09968A28549b67880G0313a32913K9665n8683N4848K932b0890A76753A0340
10581A36815i2434k3897j46115d8948b3224j83597l1786i4608l68059H1941b26216
10569a70845Q1246m3822A98436g4265A0698a36502j55998A2674e9418F9467k6865
$$ plain form
10558 42602 26128 208063 -6960 -125045 -116951 -51928 120444 -67121 85148 -374219 -114033
10546 -42973 -22790 -258555 38584 -206718 164671 -57896 -42851 -191921 135433 -228441
10535 -201792 -147310 -167595 -30294 20684 -45192 55384 -9830 -46294 151733 223532 -232355
10523 263482 -20283 -264073 -15324 42940 -203501 106450 -67269 181706 92853 114574 -225045
10511 -24595 -87606 -35214 -72281 -203105 -17181 26030 -48485 -190318 -46667 -50558 -78620
10500 -78620 -49796 96517 -287736 -335315 -35534 -61057 48354 -179732 29513 -263749 140413
10488 74944 3660 -291803 7121 106215 306831 252201 206148 415688 268724 474188 359460
10477 359460 450817 253038 -45742 -232112 89286 260981 153307 125905 -76170 -59837 59298
$$ packed form
10558D2602j6474J81935f960j18085Q094e1928A20444f7121H5148c74219a14033
10546d2973K0183k35765C8584b06718A64671e7896J5045j49070A35433b28441
10535b01792N4482k0285c0294B0684d5192E5384i830l6464A51733P1799b32355
10523B63482b0283k43790a5324D2940b03501A06450f7269A81706q8853K1721b25045
10511b4595o3011c5214l7067j30824a7181B6030d8485j41833d6667l891k8062
10500g8620K8824I6517b87736m7579c5534k5523D8354a79732B9513b63749A40413
10488G4944C660b91803G121R9094K00616n4630m6053K09540j46964K05464j14728
10477C59460R1357j97779d5742j86370H9286J71695j07674k7402g6170J6333E9298
$$ plain form
10465 172765 -10013 -128419 89864 2781 -53946 -370276 -147910 -39197 211392 -412147 -50072
10453 -41072 -66718 -284774 -146195 76603 60720 209003 -227902 -13536 85680 -260395 -16553
10441 -21936 198668 40438 -228325 -344316 -266173 -831 221956 -42352 -129881 -375843 62418
10429 -143969 -121867 223182 76642 -94904 -139855 36546 56536 17378 48328 108673 207323
10418 207323 36546 -465074 -423200 258766 -218498 -255383 -117810 -11501 149797 -1224 142082
10406 -223433 -95179 88927 47500 -58780 183171 -75712 -111975 -275268 -232215 -75694 -139454
10395 -139454 -223300 21796 179374 59734 264835 27781 236120 -79922 -435309 310580
10384 90142 191834 -120750 23722 86691 -175635 -185690 253055 362913 274654 747136
$$ packed form
10465A72765a0013j18406H9864B781e3946l16330a47910c9197B11392d12147e0072
10453d1072k5646k18056J38579G6603j5883J48283b27902a3536H5680b60395a6553
10441b1936A98668D0438b28325j15991P8143h31B21956d2352q7529k45962F2418
10429a43969K2102B23182G6642i4904m4951C6546J9990A7378L0950O0345R8650
10418B07323C6546d65074M1874B58766b18498l6885a17810a1501A49797a224A42082
10406b23433i5179H8927m1427e8780A83171g5712l6263j63293M3053g5694o3760
10395a39454q3846B1796J57578E9734K05101B7781K08339g9922l55387C10580
10384I0142J01692a20750B3722O2969a75635j0055B53055J09858q8259M72482
$$ plain form
10374 747136 378180 260045 -50323 165048 90451 611448 296084 211993 611144 377100
10364 377100 487620 4595 142197 140235 86361 118420 161166 425356 185263 123341 303223
10353 303223 213397 465914 170576 556938 574826 323109 756988 427279 143945 364468
10343 364468 338652 414410 187600 -6779 391925 -68323 162683 -32613 149595 -56430 -25754
10331 177966 74248 210534 -24988 286894 150492 119121 -7529 188035 -98938 368981 277829
10320 277829 -2439 390172 213664 105166 51024 49274 111099 -115784 -297232 123746 -7881
10308 -37868 175515 -212862 39657 -77450 -171284 -245152 102278 -230911 107358 230410
10298 230410 8276 21910 294885 -50909 -86707 2101 -38541 -17988 -14978 -159316 -101951 88547
$$ packed form
10374G47136l68956j18135e0323A65048p4597N20997B96084q4091L99151k34044
10364C77100J10520D595J37602j962n3874L2059M2746K64190A85263o1922J79882
10353C03223q9826K52517A70576L86362J7888k51717M33879l29709A43945K20523
10343C64468k5816P5758A87600f779C91925f8323A62683c2613A49595e6430b5754
10331A77966G4248J36286b4988B86894j36402l1371g529A88035i8938C68981r1152
10320B77829b439C90172j76508A05166E1024j750O1825a15784j81448A23746g881
10308c7868A75515b12862C9657g7450r3834p3868A02278b30911A07358J23052
10298B30410H276J3634K72975e0909l5798B101c8541a7988L010j44338N7365H8547
$$ plain form
10285 243954 104765 -143463 25974 -43080 49603 -71873 -195386 -179259 -187081 -64990 72346
10273 -255571 139226 -177422 -179944 270975 20193 -16489 343013 33693 48723 22033 280065
10262 280065 130920 154207 222283 43417 549684 171660 133197 207131 179466 -127167 -98114
10251 -98114 117527 53025 -214101 17286 31690 -82491 -95010 293909 -214643 61814 341142
10240 341142 -39732 -164957 -221894 -158531 125791 25575 -364453 180652 -254832 178701
10229 -79488 -12732 -132516 -78193 196532 15910 136919 15582 72363 -192764 -47816 94681
10217 -185933 40977 -91627 27614 -27041 -453930 -60504 183693 -210528 -41967 -108807 -160377
10206 -160377 12655 63266 65995 46401 -19888 -166806 -141232 -240517 -34662 -310993 -248442
$$ packed form
10285B43954A04765a43463B5974d3080D9603g1873j23513J6127p822f4990G2346
10273b55571A39226a77422k522B70975B0193a6489C43013C3693J5030B2033K58032
10262B80065A30920K3287O8076D3417N06267A71660l8463P3934k7665a27167K9053
10251i8114A17527E3025b14101A7286J4404h2491j2519B93909b14643F1814K79328
10240C41142c9732j25225n6937O3363A25791B5575c64453A80652b54832A78701
10229g9488a2732j19784N4323A96532A5910J21009A5582N6781a92764d7816I4681
10217a85933D0977i1627B7614b7041m26889f0504A83693b10528d1967o6840n1570
10206a60377A2655N0611K729j9594a9888j46918K5574r9285c4662k76331O2551
$$ plain form
10195 -248442 -32761 -17624 62976 48471 -160072 -95844 -58393 242432 89709 46902 -146613
10183 -507951 119423 45491 -424168 -193078 186528 -125879 -159006 -91846 244412 -28016
10172 106005 -25255 -195710 -91175 17290 -188029 -195336 -183746 -472908 -317280 -183806 35703
10160 -139250 -123537 -107618 33412 -173037 -64875 -125966 186870 -334881 -17659 -33182 20235
10148 70676 -311547 45332 54901 57737 -192788 -195876 14264 34615 83346 67683 -218971 -305042
10136 -305042 41146 126838 -285314 -96417 -217571 -47845 -238003 -372632 -44299 -112029 7815
10124 32646 -7871 -373572 -100543 -60882 260062 28593 329370 -258136 -64639 -137916 336016
10112 -140680 293892 -265874 9860 -357261 -113864 -168990 -183133 -72433 -471362 112043
$$ packed form
10195b48442c2761J5137F2976j4505a60072O4228L7451B42432H9709m2807a46613
10183e07951A19423D5491d24168a93078A86528a25879l3127O7160B44412b8016
10172A06005b5255j70455i1175A7290a88029p307J1590k89162J55628J33474C5703
10160a39250J5713J5919C3412a73037f4875o1091A86870c34881a7659j5523B0235
10148G0676c11547D5332R569K836a92788l088A4264K0351M8731j5663b18971q6071
10136c05042D1146Q5692b85314i6417j21154d7845j90158j34629d4299o7730G815
10124C2646g871l65701a00543L9661B60062B8593L00777b58136f4639p3277C36016
10112a40680B93892b65874I860c57261a13864n5126j4143g2433l98929A12043
$$ plain form
10101 60718 -42530 -115986 185443 -115148 148114 95541 220768 -176670 -42799 -173450
10091 -173450 -77732 -53888 -235292 33712 154085 28517 -118797 -47644 -340776 -21009 40415
10079 -10413 25467 9013 -193361 9124 -189558 -113353 -7748 259768 -149844 -122849 -167338
10068 -167338 -11536 -75152 -281439 -9797 511969 -272216 -316137 -113167 -277801 87751 -91492
10056 -290648 146923 -95588 -112030 -280362 -39613 135825 -9641 286359 -107716 -401726
10046 -401726 -66639 71267 -401 -150229 -250829 -9526 -10348 -236299 -122105 105436 352917
10035 352917 -122607 -84490 93861 376268 -66265 -162306 -29546 71593 -329667 -221886 -193091
10024 -193091 -318815 -7544 -60176 -1462 -70013 358027 72017 67546 220732 192936 7890 -233704
$$ packed form
10101F0718d2530p3456A85443a15148A48114n2573J25227a76670d2799j30651
10091a73450g7732K3844j81404C3712J20373B8517a18797d7644k93132b1009D0415
10079a0413B5467I013a93361I124a89558P6205g748B59768a49844K6995m4489
10068a67338a1536o3616k06287i797E11969b72216m3921a13167j64634H7751i1492
10056b90648A46923i5588j6442j68332c9613A35825i641B86359a07716k94010
10046d01726f6639G1267d01j49828j00600i526q22k25951J14194A05436K47481
10035C52917a22607L8117I3861K82407f6265r6041b9546G1593c29667J07781K8795
10024a93091j25724g544n2632a462o8551C58027G2017m471J53186k7796G890b33704
$$ plain form
10011 -106322 -347097 -80002 -51696 175489 -96954 -174368 -5238 -21168 -178783 -13179 -200999
10000 -200999 -222249 -112055 -83604 -174076 86703 -138123 179518 -29513 243226 -173428
9989 231043 -213815 -59786 129949 49221 71794 -130030 101137 -227769 -288469 108216
9978 72355 -92918 142080 -187656 -167046 -172163 -134853 -231111 184471 -170318 -96368 267566
9966 120634 4024 -123398 81481 -173650 -180793 35887 54244 29112 2664 -422573 -289285
9955 -289285 4058 -118388 -109559 -52405 -143017 -141865 188568 112394 -214711 390992 80586
9943 -92717 158649 -173814 -87679 -151788 106850 -118095 -410235 -99762 -378151 -176631
9932 127551 -411270 -79401 -340670 -217927 77004 -260129 291792 -150469 106564 89325
$$ packed form
10011a06322k40775h0002K8306A75489i6954p7414e238j5930j57615a3179j87820
10000b00999k1250J10194K8451r0472H6703a38123A79518b9513B43226a73428
9989B31043b13815e9786A29949D9221K2573a30030A01137b27769o0700A08216
9978G2355i2918A42080a87656K0610n117L7310r6258A84471a70318P3950B67566
9966A20634D024a23398H1481a73650p143C5887J8357k5132B664d22573J33288
9955b89285D058a18388Q829e2405r0612J152A88568p6174b14711C90992H0586
9943i2717A58649a73814Q6135o4109A06850a18095k92140i9762k78389a76631
9932A27551d11270g9401k61269J22743G7004b60129B91792a50469A06564j7239
$$ plain form
9922 89325 -143556 -11046 -67030 -275632 -72769 95292 -86846 203215 -84712 64583 -275643
9910 -305606 -49337 -120221 -188372 -226518 -8366 248054 -155806 215567 -100957 46976 -162517
9898 27346 -257278 -225093 -295839 -54732 -131662 110576 -263314 183148 94223 147335 319626
9887 319626 -196120 52358 -210511 -122088 -132434 -125087 229116 -146929 167506 -108288 -89407
9876 -89407 268720 54539 -40041 -132169 -227448 10757 -254764 -82182 -39989 -178959 124966
9864 -3517 -7402 -402664 92975 230245 14632 55139 -77530 -34469 43696 -262375 -138970
9853 -138970 -36604 35898 39401 19326 163209 -80741 176559 -104041 -234421 44201 -100210
9841 127697 -254948 -123634 43702 -19498 -49875 -200326 -2305 140821 -876 -339495 -324245
$$ packed form
9922H9325a43556a1046n5984k08602g2769I5292h6846B03215h4712F4583b75643
9910c05606d9337p0884o8151l8146h366B48054a55806B15567a00957D6976a62517
9898B7346b57278L2185p0746e4732p6930A10576b63314A83148q8925N3112J72291
9887C19626a96120E2358b10511Q8423j0346P347B29116a46929A67506a08288J8881
9876h9407B68720E4539d0041r2128r5279A0757b54764h2182c9989j38970A24966
9864c517l885l95262I2975J37270A4632M0507g7530c4469D3696b62375J23405
9853a38970c6604C5898L503A9326J43883h0741A76559a04041j30380D4201a00210
9841A27697b54948a23634D3702a9498l0377j50451b305A40821h76l38619J5250
$$ plain form
9830 -324245 -402913 -4226 83389 -145243 -80154 58355 54430 -405579 -276108 -323847 7100 349083
9818 349083 -154103 -38428 -300333 -301361 -75184 -28483 1074 -123774 237672 -112401 105730
9806 -375855 -136893 -119394 -259778 176634 126032 -61530 -45812 -79895 166612 42060 -67316
9794 -111559 -358353 -256060 10478 197938 -332074 -383 160172 78286 10420 -210480 -8873
9782 83789 -173726 -113083 -39483 -17412 4611 -36419 -85861 278405 -24462 -123415 -229800
9771 -229800 237389 -149630 59946 -96087 -173797 -49236 90634 -108436 202997 -89526 56650
9759 -25876 -279528 68330 167133 -196079 -153760 -92085 46385 -196569 78172 -38389 -87278
9748 -87278 -120671 -162323 -193530 -265039 -364667 -145759 -429378 -119817 -65355 -210433 -100950
$$ packed form
9830c24245p8668d226H3389a45243O5089E8355l925d05579J29471m7739G100L41983
9818C49083a54103c8428k61905j028g5184b8483A074a23774B37672a12401A05730
9806c75855a36893J7499j40384A76634n0602f1530J5718l4083A66612D2060f7316
9794a11559k46794J02293A0478J87460c32074c83A60172G8286A0420b10480h873
9782H3789a73726O0643c9483a7412D611c6419m9442B78405b4462r8953j06385
9771b29800B37389a49630E9946i6087p7710d9236I0634a08436B02997h9526E6650
9759b5876k53652F8330R8803a96079M2319O1675D6385a96569G8172c8389m8889
9748h7278l3393m1652l1207p1509r9628a45759k83619a19817N4462j45078a00950
$$ plain form
9736 -2576 -6117 152949 -231088 -52560 101682 -310785 -79178 -91518 13604 -92129 -135501
9725 -135501 -27112 -152565 118904 367017 47071 -125184 58866 175745 112724 53153 26472
9713 -63628 -146487 -364066 18464 196284 -102981 128565 8387 104634 -34975 -48511 -178197
9702 -178197 54612 -284106 -1397 -35725 125653 -205820 114571 -95734 -125908 184310 -186080
9690 120369 -792079 52130 -41456 -69364 25263 -4103 -71152 -104558 -38420 73047 119474 28848
9677 -217353 -42428 -88202 201429 -323062 -210626 162222 114651 217816 33774 -50604 -267761
9666 -267761 31307 -78155 -61183 114317 86392 -153835 -152938 -68938 -82622 -26438 156191
9654 -188349 -201865 -56685 22731 -380733 -322525 -108958 347053 -471730 5349 -205839 -35331
$$ packed form
9736b576l541A52949b31088e2560A01682c10785g9178j2340A3604i2129m3372
9725a35501b7112j25453A18904K48113D7071a25184E8866J16879o3021E3153B6472
9713f3628q2859k17579A8464J77820a02981A28565H387R6247c4975j3536j29686
9702a78197E4612b84106a397l4328A25653b05820A14571i5734l0174A84310a86080
9690A20369g92079E2130d1456k7908B5263d103o7049l3406c8420G3047M6427B8848
9677b17353d2428m5774B01429c23062J12436A62222m7571J03165C3774e0604k17157
9666b67761C1307g8155J6972A14317k7925a53835Q97f8938j3684b6438A56191
9654a88349j3516e6685B2731c80733N8208a08958C47053d71730E349b05839c5331
$$ plain form
9642 86352 -1012 35662 -25120 -182924 -131760 -153153 -235888 -190798 -126331 -13154 -68994 75247
9629 -131505 -43166 195219 -158270 177901 -18515 -280948 -113339 165555 93352 -299540
9618 78070 -303254 23489 127600 -187119 -28106 72096 -48134 -290587 255264 -94702 -117834
9607 -117834 -25898 -180088 169963 -58384 460183 39274 8795 106808 -9331 -43205 -113611
9596 -113611 95688 -153046 24985 -276860 -643820 155093 -137719 -231009 -74629 163534
9585 -280797 -270209 -452063 -181768 -42952 -183965 7243 -153689 80765 -92415 -207221 -123310
9574 -123310 12475 102965 -270148 -46652 -77267 196140 -192475 -392584 -267100 -300408 19130
9562 -1080 -203707 -355256 -245428 64134 -189554 -274937 -116657 53595 -240837 -79736 -18945
$$ packed form
9642H6352a012C5662b5120j57804N1164k1393q2735M5090O4467a3154n5840G5247
9629a31505d3166A95219a58270A77901a8515k62433a13339A65555p2203b99540
9618G8070c03254B3489J04111a87119b8106G2096d8134k42453B55264i4702k3132
9607a17834b5898j54190A69963e8384D60183C9274H795R8013i331l3874p0406
9596a13611I5688a53046B4985b76860l66960A55093a37719r3290g4629A63534
9585b80797J0588j81854a81768d2952j41013G243a53689H0765i2415j14806Q3911
9574a23310A2475R0490b70148d6652l0615A96140a92475k00109J25484l3308A9130
9562a080k02627j51549J09828F4134a89554q5383a16657E3595b40837g9736a8945
$$ plain form
9550 -53419 100899 169365 275356 179025 270625 -51906 27950 -72774 131424 -136789 -419240
9539 -419240 -129838 -472357 -267962 -97099 -326918 338897 -232507 117213 382730 -33887
9528 -77194 248309 -64976 -278612 96637 139603 188861 85327 -95740 7103 154297 139927
9517 139927 -82110 34346 111256 173364 82386 -106406 -122655 519887 302595 -146700 -139601
9506 -139601 -49086 183492 -186013 -159383 -224659 162759 -115115 -89429 -47779 -233472 -354008
9495 -354008 -21758 -281625 26817 251860 91197 64651 -61350 -6468 297641 -166348 -394690
9484 -394690 227387 -87090 -157712 68491 -148378 -5686 -102554 147053 234842 51435 171093
9473 171093 156288 115470 111854 -130783 -143118 -14529 -105264 -268716 46024 -245853 107505
$$ packed form
9550e3419A00899O8466J05991r6331R1600e1906B7950g2774A31424a36789k82451
9539d19240a29838l42519K04395i7099k29819C38897b32507A17213K65517c3887
9528g7194B48309f4976k13636I6637M2966M9258H5327i5740G103J47194j4370
9517A39927h2110C4346P6910O2108H2386a06406j6249E19887k17292a46700P099
9506a39601d9086A83492a86013K6630o5276A62759a15115K5686M1650j85693j20536
9495c54008b1758k59867B6817K25043I1197k6546f1350f468B97641a66348k28342
9484c94690B27387h7090p0622F8491a48378e686r6868A47053Q7789E1435J19658
9473A71093j4805m0818l616a30783j2335a4529r0735j63452D6024b45853A07505
$$ plain form
9461 96567 160128 -108341 -232970 -133377 -55179 -76690 -167424 127589 -222049 58859 230643
9450 230643 80788 17601 -65410 94015 -223568 20278 113169 -114106 -130486 191706 -48969
9438 -169676 -397093 -96031 -159828 92037 57652 -37518 -79127 47843 -146166 174426 -96340
9426 53667 5216 -62681 173161 -99768 98404 15382 -102439 -132300 58799 -26456 -64527 -273173
9414 -273173 -102003 18078 -9846 -51801 -15329 -35411 161864 288457 157473 -140934 -24759
9402 -137055 -113729 -363315 159009 174310 49467 25085 -90631 -25730 21910 -67358 -72494
9391 -72494 -120496 10336 -83075 -209577 -44593 -309852 -210365 -229748 325212 -131724 -344556
9380 -344556 -148028 -104922 -142577 -331880 -23052 -55458 -118979 -75678 -147335 67234 23583
$$ packed form
9461I6567O3561a08341j24629R9593e5179k1511r0734A27589b22049E8859J71784
9450B30643H0788A7601f5410I4015b23568B0278R2891a14106j6380A91706d8969
9438a69676k27417i6031o3797I2037l4385c7518m1609D7843a46166A74426i6340
9426E3667E216f2681A73161i9768I8404A5382a02439k9861E8799b6456l8071k08646
9414b73173a02003A8078i846m1955a5329k0082A61864J26593j30984a40934b4759
9402a37055K3326k49586A59009J5301D9467k4382i0631b5730B1910f7358n136
9391g2494m8002A0336h3075j26502d4593k65259R9487j9383C25212a31724k12832
9380c44556a48028M3106l7655j89303b3052l2406o3521M3301p1657F7234B3583
$$ plain form
9368 156584 -408015 -74304 -4404 142658 61877 -57304 -68959 59043 -115295 -47846 -40775
9357 -40775 -50844 7438 220611 -172964 -75352 -23386 195415 -384640 175042 -200177 -305188
9346 -305188 -176494 111903 -215560 -136909 66295 7322 -102192 -191877 -152044 167520 157928
9335 157928 -360679 -79023 -153147 -340379 -163195 -260357 -41717 -208854 -132236 -65139 -26246
9323 159261 121941 -328898 156730 289487 -122254 -37091 213888 133569 148076 81903 271391
9312 271391 51815 -364712 -21407 196701 129360 -106258 -139884 -90294 93475 160695 -89390
9300 -197246 -79602 -1151 -296850 -91956 -283592 -38896 -71599 -210016 -350911 290683 -86371
9288 -35156 -89704 -37510 43844 -59754 -97606 -60787 -76486 -85401 129941 135943 -222381 -153440
$$ packed form
9368A56584d08015g4304d404A42658F1877e7304j1655E9043a15295d7846P071
9357d0775j0069G438K13173a72964g5352b3386A95415c84640A75042b00177j05011
9346c05188J28694A11903b15560P8651F6295G322a02192q9685L9833A67520r592
9335A57928c60679g9023p4124j87232a63195r7162d1717j67137P6618f5139b6246
9323A59261l7320c28898A56730J32757a22254c7091B13888q0319J4507o6173J89488
9312B71391E1815c64712b1407A96701o7341a06258l3626M9590I3475O7220h9390
9300a97246g9602a151k95699i1956j91636c8896l2703j38417j40895B90683h6371
9288c5156n4548c7510D3844e9754l7852L6819j5699q915A29941O002b22381O8941
$$ plain form
9276 -153440 217243 -130894 -458002 122359 -178167 -282113 -257290 -334416 -206189 -133544
9266 -133544 -284008 -52893 223476 -151894 -292625 67279 -289976 235113 -29864 120004
9255 -213554 41624 -473772 -162654 -169721 -166122 33519 25692 -95008 -30838 -584950 -288548
9243 -23308 100458 -232126 -365754 -64702 -158912 119019 106339 1658 404460 -17615 19258
9231 9598 -149325 6438 2411 118407 15452 265008 -308256 -242403 -301692 -88379 20665 -172924
9218 -45852 -113879 -120618 144861 147302 86215 -208357 183945 -96193 -88459 -25174 41188 -15455
9205 -156559 -92838 -33029 -206282 -265320 48449 48654 -180642 -25247 275214 -158406 -14444
9193 -24252 -116531 -111747 -1560 -147548 -151176 12718 -185272 -45635 175793 -101674 -20108 180141
$$ packed form
9276a53440B17243a30894l27108A22359a78167j03946K4823p7126J28227P2645
9266a33544j50464e2893B23476a51894j40731F7279b89976B35113b9864A20004
9255b13554D1624d73772a62654p067L599C3519p827i5008c0838n54112b88548
9243b3308A00458b32126j33628f4702r4210A19019j2680A658M02802a7615A9258
9231I598a49325F438B411J15996A5452K49556c08256O5853n9289h8379B0665a72924
9218d5852o8027o739A44861K441o1087b08357A83945i6193P734b5174D1188a5455
9205a56559O3721c3029j73253n9038D8449K05a80642b5247B75214a58406a4444
9193b4252r2279M784a560j45988l628A2718a85272d5635A75793a01674b0108A80141
$$ plain form
9180 -37448 -113330 -168360 -109102 68 20322 164096 31450 -157267 -158105 76568 -268888 -129560
9167 201372 40319 -251516 86376 -328488 142682 61184 354783 79743 250448 109280
9156 -14468 -279514 463759 -81186 -50128 -65269 -92421 15159 -133224 -58276 -206330 121194
9144 -23496 -275820 -90766 -5042 17429 157820 -307388 -229384 -179055 12557 5334 135602
9133 135602 21054 175644 -512999 -29727 -23448 -116602 -5628 -215476 -58914 -71948 -132368
9122 -132368 50830 -87070 58103 -285588 -134451 162321 -165836 -236711 -42712 -196429 29695
9110 -349711 72028 172327 202072 -39604 49332 242201 -103032 -246686 -391032 -194284
9099 1484 111258 51547 -299935 45882 165380 -23626 -154131 53031 -142057 64726 -263961
$$ packed form
9180c7448p5882n5030N9258F8K0254J43774C1450a57267q38G6568b68888a29560
9167B01372D0319b51516H6376c28488A42682F1184K93599G9743J70705A09280
9156a4468k65046D63759h1186L1058j5141k7152A5159a33224e8276j48054A21194
9144b3496k52324i0766e042A7429J40391c07388P8004N0329A2557E334J30268
9133A35602B1054J54590e12999b9727O279r3154e628k09848e8914j3034o0420
9122a32368E0830h7070E8103b85588a34451A62321a65836p0875d2712j53717B9695
9110c49711G2028J00299K9745c9604D9332J92869a03032j43654j44346a94284
9099A484J09774E1547b99935D5882J19498b3626j30505E3031a42057F4726b63961
$$ plain form
9087 -40253 121542 229098 132503 61278 -145113 -146566 47790 -177074 223938 115385 -105649
9075 -125500 -40945 41800 -189344 -220057 47086 -67638 -92175 83975 25799 41675 -35275
9063 155489 -20554 -56554 -35905 -262573 -11699 -203785 -39910 -80709 -50880 239958 33164
9051 -199595 129101 816 57554 -110385 60216 -49986 -258952 -7558 83637 55617 -91896 -142327
9039 -142327 15549 62637 -173993 -370673 -164518 -225889 -28027 -320692 95373 -224411 36216
9027 -74253 -6091 37865 23737 -68284 -73280 -125311 -239123 -176697 -88505 -320970 -111159 -40053
9014 -5121 -155390 -349573 176421 114513 249182 171355 -9779 -94451 -275939 -158283 157673
9002 -56708 125489 -137908 306715 169368 226992 125123 -138109 -37138 -109772 -166936 -233512
$$ packed form
9087d0253A21542J07556r6595F1278a45113j453D7790a77074B23938j08553a05649
9075a25500d0945D1800a89344l0713D7086f7638k4537H3975B5799J5876c5275
9063A55489b0554l6000K0649k26668a1699j92086c9910m0799K9829B39958C3164
9051a99595A29101H16N6738a10385F0216d9986k08966g558H3637k8020i1896n0431
9039a42327A5549M7088a73993j96680a64518o1371b8027k92665I5373b24411C6216
9027g4253f091C7865j4128f8284m996n2031j13812O2426Q8192k32465a11159d0053
9014e121j50269j94183A76421o1908J34669p7827i779q4672j81488J17656A57673
9002e6708A25489a37908C06715j37347N7624j01869a38109c7138p2634n7164o6576
$$ plain form
8991 -233512 -134543 96502 -62541 34121 -311875 86674 -119932 -347426 -69505 -186719 -296554
8980 -296554 -88669 54791 -162819 -223544 -103244 -30513 -85091 -21559 -226764 155964 -328338
8968 -147803 -103756 -209327 -230441 47828 -180708 -99942 -155696 140671 -66505 144982 -383769
8956 36099 160406 -154593 151829 225109 -106301 241068 -43554 31316 -148680 67589 180616
8945 180616 72012 -53425 -467457 100770 45118 -14401 -206887 -66792 238153 -136170 211899
8933 7025 -20387 -289720 39589 -365004 -301330 41382 -324843 -141616 147759 -231135 -291210
8922 -291210 153372 391291 58387 72726 92216 -306305 -12798 -238728 -128693 -107773 -23912
8910 -209412 12863 -171326 131369 258343 -211818 -305853 44310 -210059 103002 -83947
$$ packed form
8991b33512R8969I6502f2541C4121c11875H6674a19932k27494f9505j17214j09835
8980b96554h8669E4791a62819o0725a03244c0513n4578b1559k05205A55964c28338
8968a47803M4047j05571k1114D7828a80708Q0766n5754A40671f6505A44982c83769
8956C6099J24307a54593A51829P3280a06301B41068d3554C1316a48680F7589J13027
8945A80616G2012e3425m14032A00770D5118a4401j92486f6792B38153a36170B11899
8933G025b0387k69333C9589c65004O3674D1382c24843a41616A47759b31135o0075
8922b91210A53372K37919E8387J4339J9490c06305a2798k25930J10035K0920b3912
8910b09412A2863a71326A31369J26974b11818r4035D4310b10059A03002h3947
$$ plain form
8899 -293619 -180748 -93794 -44447 104726 22092 -93063 120938 36531 -55082 -117242 -115225
8888 -115225 -63409 86886 -295255 203669 -23915 -34988 -88989 -76971 -24135 -134135 112490
8876 331321 -439305 72779 -136416 95227 19274 -178100 -113990 -233459 63696 -103965 34990
8864 -52470 11984 62891 -289220 -295324 -115318 115934 -83826 31264 156085 -8983 -122834
$$ packed form
8899b93619J12871Q6954d4447A04726B2092i3063A20938C6531e5082o2160K017
8888a15225N1816H6886b95255B03669b3915j1073n4001J2018b4135j10000A12490
8876C31321d39305G2779a36416I5227A9274a78100O4110j19469F3696a03965C4990
8864e2470A1984N0907b89220o104a15318A15934h3826C1264J24821h983j13851
$$ [...]
##END NTUPLES=NMR SPECTRUM
##END=
