##TITLE=AC1747_SEN00020_9281017_PIq1CJPhvs
##JCAMPDX= 6.0         $$ Bruker NMR JCAMP-DX V2.0
##DATA TYPE= NMR SPECTRUM
##DATA CLASS= NTUPLES
##ORIGIN= BRUKER
##OWNER= Administrator
$$ 1.72 TOPSPIN		Version 2.1
$$ 2015-07-17 22:19:09.697 -0700  Administrator@X
$$ Compression mode = diff/dup
##.OBSERVE FREQUENCY= 400.02188249412
##.OBSERVE NUCLEUS= ^1H
##.ACQUISITION MODE= SIMULTANEOUS (DQD)
##.ACQUISITION SCHEME= undefined
##.AVERAGES= 64
##.DIGITISER RES= 22
##SPECTROMETER/DATA SYSTEM= spect
##.PULSE SEQUENCE= noesygpps1d.comp
##.SOLVENT NAME= COFFEE_meoh
##.SHIFT REFERENCE= INTERNAL, COFFEE_meoh, 1, 14.96102
##AUDIT TRAIL= $$ (NUMBER, WHEN, WHO, WHERE, PROCESS, VERSION, WHAT)
$$ ##TITLE= Audit trail, TOPSPIN		Version 2.1
$$ ##JCAMPDX= 5.01
$$ ##ORIGIN= Bruker BioSpin GmbH
$$ ##OWNER= Administrator
$$ $$ E:\/data/COFFEE/nmr/AC1747_SEN00020_9281017_PIq1CJPhvs/12/pdata/1/auditp.txt
$$ ##AUDIT TRAIL=  $$ (NUMBER, WHEN, WHO, WHERE, PROCESS, VERSION, WHAT)
(   1,<2015-07-17 22:19:04.307 -0700>,<Administrator>,<X>,<go>,<TOPSPIN 2.1>,
      <created by zg
	started at 2015-07-17 22:07:34.057 -0700,
	POWCHK enabled, PULCHK disabled,
       configuration hash MD5:
       21 0F 79 D6 B3 7B B4 F6 88 20 88 DB 03 48 BD 9F
       data hash MD5: 64K
       F3 3C E7 8C 24 28 DE 34 3A 07 2D C9 A9 99 F6 DA>)
(   2,<2015-07-17 22:19:07.807 -0700>,<Administrator>,<X>,<proc1d>,<TOPSPIN 2.1>,
      <Start of raw data processing
       efp LB = 0.3 FT_mod = 6 PKNL = 1 PHC0 = 0 PHC1 = 0 SI = 128K 
       data hash MD5: 128K
       A3 A2 75 DD EE 08 47 74 7F 4A 21 97 C9 A0 AA BA>)
(   3,<2015-07-17 22:19:08.760 -0700>,<Administrator>,<X>,<proc1d>,<TOPSPIN 2.1>,
      <pk PHC0 = -89.70337 PHC1 = 0 
       data hash MD5: 128K
       3F 3E CA 93 F6 54 43 CF 64 52 5D 03 90 4D 66 2F>)
(   4,<2015-07-17 22:19:09.166 -0700>,<Administrator>,<X>,<proc1d>,<TOPSPIN 2.1>,
      <abs ABSG = 1 
       data hash MD5: 128K
       2A 00 EF DE B0 FB 9C 54 84 2A 70 59 9F 6C D5 51>)
(   5,<2015-07-17 22:19:09.275 -0700>,<Administrator>,<X>,<proc1d>,<TOPSPIN 2.1>,
      <abs ABSG = 2 
       data hash MD5: 128K
       87 B3 89 10 7D 38 D0 3D 2E F4 4B EA 00 82 2D 66>)
(   6,<2015-07-17 22:19:09.354 -0700>,<Administrator>,<X>,<proc1d>,<TOPSPIN 2.1>,
      <abs ABSG = 3 
       data hash MD5: 128K
       00 83 DD BA EA 08 B5 B5 BB 6C C8 85 85 B6 FF E3>)
(   7,<2015-07-17 22:19:09.432 -0700>,<Administrator>,<X>,<proc1d>,<TOPSPIN 2.1>,
      <abs ABSG = 4 
       data hash MD5: 128K
       0A 41 F2 56 B6 39 7A 31 46 5F B7 23 05 2D BB E2>)
(   8,<2015-07-17 22:19:09.525 -0700>,<Administrator>,<X>,<proc1d>,<TOPSPIN 2.1>,
      <abs ABSG = 5 
       data hash MD5: 128K
       D6 DF AD 30 7B 94 C2 98 00 DC CC 86 2D 8D 8E 41>)
$$ ##END=
$$ 
$$ $$ hash MD5
$$ $$ 8F 74 F2 AC 3F BD FD 2F 7A 9A 1E 7A 06 EB 55 B2
##$RELAX= 
##$RELAX= 
##$RELAX= 
##$RELAX= 
##$RELAX= 
##$RELAX= 
##$RELAX= 
##$RELAX= 
$$ Bruker specific parameters
$$ --------------------------
##$DU= <E:\>
##$EXPNO= 12
$$ [...]
##$TP07= 0
##$TPNAME0= <>
##$TPNAME1= <>
##$TPNAME2= <>
##$TPNAME3= <>
##$TPNAME4= <>
##$TPNAME5= <>
##$TPNAME6= <>
##$TPNAME7= <>
##$TPOAL= (0..7)
0.5 0.5 0.5 0.5 0.5 0.5 0.5 0.5
##$TPOFFS= (0..7)
0 0 0 0 0 0 0 0
##$TUNHIN= 0
##$TUNHOUT= 0
##$TUNXOUT= 0
##$USERA1= <user>
##$USERA2= <user>
##$USERA3= <user>
##$USERA4= <user>
##$USERA5= <user>
##$V9= 5
##$VALIST= <valist>
##$VCLIST= <CCCCCCCCCCCCCCC>
##$VD= 0
##$VDLIST= <DDDDDDDDDDDDDDD>
##$VPLIST= <PPPPPPPPPPPPPPP>
##$VTLIST= <TTTTTTTTTTTTTTT>
##$WBST= 2048
##$WBSW= 25
##$XGAIN= (0..3)
0 0 0 0
##$XL= 0
##$YL= 0
##$YMAX_a= 6317184
##$YMIN_a= -11586650
##$ZGOPTNS= <>
##$ZL1= 120
##$ZL2= 120
##$ZL3= 120
##$ZL4= 120
##$ABSF1= 14.96102
##$ABSF2= -5.597161
##$ABSG= 5
##$ABSL= 3
##$ALPHA= 0
##$AQORDER= 0
##$ASSFAC= 0
##$ASSFACI= 0
##$ASSFACX= 0
##$ASSWID= 0
##$AUNMP= <proc_prof1d_extract.lims>
##$AXLEFT= 0
##$AXNAME= <>
##$AXNUC= <1H>
##$AXRIGHT= 0
##$AXTYPE= 0
##$AXUNIT= <>
##$AZFE= 0.1
##$AZFW= 0.1
##$BCFW= 0
##$BC_mod= 0
##$BYTORDP= 0
##$COROFFS= 0
##$CY= 15
##$DATMOD= 1
##$DC= 0
##$DFILT= <>
##$DTYPP= 0
##$F1P= 0
##$F2P= 0
##$FCOR= 0.5
##$FTSIZE= 131072
##$FT_mod= 6
##$GAMMA= 0
##$GB= 0
##$INTBC= 1
##$INTSCL= 1
##$ISEN= 128
##$LB= 0.3
##$LEV0= 0
##$LPBIN= 0
##$MAXI= 10000
##$MC2= 0
##$MEAN= 0
##$ME_mod= 0
##$MI= 0
##$NCOEF= 0
##$NC_proc= -2
##$NLEV= 6
##$NOISF1= 0
##$NOISF2= 0
##$NSP= 0
##$NTH_PI= 0
##$NZP= 0
##$OFFSET= 14.96102
##$PC= 1
##$PHC0= -89.70337
##$PHC1= 0
##$PH_mod= 1
##$PKNL= yes
##$PPARMOD= 0
##$PPDIAG= 0
##$PPIPTYP= 0
##$PPMPNUM= 2147483647
##$PPRESOL= 1
##$PSCAL= 4
##$PSIGN= 0
##$PYNMP= <proc.py>
##$REVERSE= no
##$SF= 400.020009627911
##$SI= 131072
##$SIGF1= 0
##$SIGF2= 0
##$SINO= 400
##$SIOLD= 131072
##$SPECTYP= <>
##$SREGLST= <1H.CDCl3>
##$SSB= 0
##$STSI= 131072
##$STSR= 0
##$SW_p= 8223.68421052631
##$SYMM= 0
##$S_DEV= 0
##$TDeff= 65536
##$TDoff= 0
##$TI= <>
##$TILT= no
##$TM1= 0
##$TM2= 0
##$TOPLEV= 0
##$USERP1= <user>
##$USERP2= <user>
##$USERP3= <user>
##$USERP4= <user>
##$USERP5= <user>
##$WDW= 1
##$XDIM= 131072
##$YMAX_p= 397510310
##$YMIN_p= -10974
##$CURPLOT= <Network HP LaserJet P1505>
##$CURPRIN= <$Network HP LaserJet P1505>
##$DFORMAT= <normdp>
##$LAYOUT= <+/1D_H.xwp>
##$LFORMAT= <normlp>
##$PFORMAT= <normpl>
##$SURQMSG= 1
$$ End of Bruker specific parameters
$$ ---------------------------------
##NTUPLES= NMR SPECTRUM
##VAR_NAME=  FREQUENCY,     SPECTRUM/REAL,   SPECTRUM/IMAG
##SYMBOL=    X,             R,               I
##VAR_TYPE=  INDEPENDENT,   DEPENDENT,       DEPENDENT
##VAR_FORM=  AFFN,          ASDF,            ASDF
##VAR_DIM=   131072,        131072,          131072
##UNITS=     HZ,            ARBITRARY UNITS, ARBITRARY UNITS
##FACTOR=    0.0627417313425164, 1,          1
##FIRST=     8223.62146879497, 3517,         -56369
##LAST=      0,             5523,            -54855
##MIN=       0,             -10974,          0
##MAX=       8223.62146879497, 397510310,    0
$$ Real data points
##PAGE= N=1
##DATA TABLE= (X++(R..R)), XYDATA
$$ [...]
61602C62628m590m822n070n193n017m510l954l638l440l060k528k124j938j939
61588C10805k202k598k519j567l61J00k43n90o25q82j667k407k457j853j016k14
61572B89704L98O91P35O73L15n04j254j118k16M12K98J17M56Q56P34M20N23R34
61554B94174J185J338J680J915J537P48K68L15M60M10L86O78J315K125K777K919
61538C14230K645K567K976L270K731J620Q07N84N31M85O95J001O87m95j820k553
61522C29961k833l107l181k521j339o67j130k088k337j511l88K01L48O77J204
61507C11289J162O6j480k350k033r95p7K15k2l36m08l78m84n51k06M14P64Q28
61489C05418J220K028K334J530L84n0L1k06n44N0J504K340J645L10k83R9P67J250
$$ y = [362628, 358038, 353216, 348146, 342953, 337936, 333426, 329472, 325834, 322394, 319334, 316806, 314682, 312744, 310805, 308603, 306005, 303486, 301919, 301558, 301658, 301415, 300825, 300200, 299318, 297651, 295244, 292787, 290934, 289918, 289704, 290102, 290793, 291528, 292201, 292516, 292012, 290758, 289640, 289424, 289836, 290134, 290251, 290707, 291563, 292297, 292717, 293240, 294174, 295359, 296697, 298377, 300292, 301829, 302577, 302845, 303160, 303620, 304030, 304416, 305094, 306409, 308534, 311311, 314230, 316875, 319442, 322418, 325688, 328419, 330039, 330846, 331430, 331961, 332446, 333141, 334142, 334829, 334334, 332514, 329961, 327128, 324021, 320840, 318319, 316980, 316313, 315183, 313095, 310758, 309247, 308859, 309060, 309408, 310085, 311289, 312451, 312517, 311037, 308687, 306654, 305659, 305582, 305797, 305775, 305439, 305031, 304653, 304169, 303618, 303412, 303826, 304590, 305418, 306638, 308666, 311000, 312530, 312914, 312864, 312895, 312689, 312145, 312195, 313699, 316039, 317684, 317994, 317711, 317810, 318577, 319827]
61471C19827J481J365Q67K82j04l73o62q40p98p15o47k91M17R64J009J012J511
61454C24305K139K150J605J226J206J037N63L13N63P97N71L28P97J988L222L942
61438C46752M067L756L256K895K827K826K639K442K597K951K796J724L12l84M1
61423C81497R29J317R20K82k2PJ6j04j28K6J23K9l8J6k51j296k711l425l016k302
61403C71869k303k866k928k027r78q38j612k365k337j610p42r0M06R48J524J832
61387C55883J577Q40M5n08q60j077r44k63P32J630K381L163L755L563K509J379
61371C73805R53J128J284J292J522K004K154J608Q92R19J970L473M638N104N022
61356D07768M799M881N502O515P524Q217Q578Q635Q313P584O668N820M999M045
$$ y = [319827, 321308, 322673, 323540, 323822, 323718, 323345, 322683, 321843, 321045, 320330, 319683, 319392, 319809, 320773, 321782, 322794, 324305, 326444, 328594, 330199, 331425, 332631, 333668, 334231, 334544, 335107, 335904, 336475, 336803, 337600, 339588, 342810, 346752, 350819, 354575, 357831, 360726, 363553, 366379, 369018, 371460, 374057, 377008, 379804, 381528, 381840, 381456, 381497, 382426, 383743, 384663, 384945, 384923, 384930, 384946, 384842, 384714, 384740, 384863, 384892, 384854, 384870, 384619, 383323, 380612, 377187, 374171, 371869, 369566, 366700, 363772, 361745, 360767, 359929, 358317, 355952, 353615, 352005, 351263, 351173, 351579, 352527, 354051, 355883, 357460, 358300, 358345, 357837, 356977, 355900, 354956, 354693, 355425, 357055, 359436, 362599, 366354, 369917, 372426, 373805, 374758, 375886, 377170, 378462, 379984, 381988, 384142, 385750, 386642, 387561, 389531, 393004, 397642, 402746, 407768, 412567, 417448, 422950, 429465, 436989, 445206, 453784, 462419, 470732, 478316, 484984, 490804, 495803, 499848]
61342D99848L177K912L338L772L442K376J288P25N48K49n65j902l333m161m001
61327E07713l267k792k913l193l118k670k091j492r88q39j019q96J50J850L257
61312D87692L932M533N949Q130J0059J0860J0738J0717J1469J2488J2561J1008
61300F00136Q286N375K824O54j131k354l054l624m364n063n283n031m916n525
61286E76930o623p156o310m488k968k472k484k142j414q51m54L99J816K902K882
61271E47567K172J868K389L226L808M104M330M615N123O131P628R045R675R326
61257F21007Q341P114N778M394L134K166J383M21j011k818m476n370n253m476
61243F30334l745l565l893m323m478m191l424k307j292r68j431j984j760o38O76
$$ y = [499848, 503025, 505937, 509275, 513047, 516489, 518865, 520153, 520878, 521426, 521675, 521110, 519208, 515875, 511714, 507713, 504446, 501654, 498741, 495548, 492430, 489760, 487669, 486177, 485189, 484350, 483331, 482435, 482585, 484435, 487692, 491624, 496157, 502106, 510236, 520295, 531155, 541893, 552610, 564079, 576567, 589128, 600136, 608422, 613797, 616621, 617275, 616144, 613790, 610736, 607112, 602748, 597685, 592402, 587371, 582455, 576930, 570307, 563151, 556841, 552353, 549385, 546913, 544429, 542287, 540873, 540022, 539568, 539967, 541783, 544685, 547567, 549739, 551607, 553996, 557222, 561030, 565134, 569464, 574079, 579202, 585333, 592961, 602006, 611681, 621007, 629348, 636462, 642240, 646634, 649768, 651934, 653317, 653738, 652727, 649909, 645433, 640063, 634810, 630334, 626589, 623024, 619131, 614808, 610330, 606139, 602715, 600408, 599116, 598148, 596717, 594733, 592973, 592335, 593011]
61228E93011J545K052K598L202L526L506L543L967M569M907M871M759M844N074
61214F45974N256N279N102M667L982L236K711K568K779L270M024N023O150P244
61200G07265Q240R341J0975J3416J6285J8595J9561J9321J8565J7497J5562J2446
61188H87069Q930O329N153M711M023K716J010q03k580m143n261n842o157o718
61174H88437p863r384j0687j1410j1768j2129j2494j2689j2918j3630j4719j5395
61162G43351j5116j4290j3689j3341j2481j0551p904n473l936l176k425r57J116
61149F41128K724K776J241q68k651m097n634p233q359q664q285p388n832l564
61135E85294j107P83J901K745L784M967O094P323Q933J0759J2366J3737J5324
$$ y = [593011, 594556, 596608, 599206, 602408, 605934, 609440, 612983, 616950, 621519, 626426, 631297, 636056, 640900, 645974, 651230, 656509, 661611, 666278, 670260, 673496, 676207, 678775, 681554, 684824, 688848, 693871, 700021, 707265, 715505, 724846, 735821, 749237, 765522, 784117, 803678, 822999, 841564, 859061, 874623, 887069, 895999, 902328, 907481, 912192, 916215, 918931, 919941, 919138, 916558, 912415, 907154, 901312, 895155, 888437, 880574, 871190, 860503, 849093, 837325, 825196, 812702, 800013, 787095, 773465, 758746, 743351, 728235, 713945, 700256, 686915, 674434, 663883, 655979, 650506, 646570, 643394, 640969, 640012, 641128, 643852, 646628, 647869, 647001, 644350, 640253, 634619, 627386, 619027, 610363, 602078, 594690, 588858, 585294, 584187, 584970, 586871, 589616, 593400, 598367, 604461, 611784, 620717, 631476, 643842, 657579, 672903]
61122F72903J7367J9541K1450K3060K4420K5405K6050K6735K7545K7850K7036
61111I39362K5497K4204K3410K2453K0900J9117J7340J4935J1163O318J454k786
61099A123367o518r929j2937j5601j8272k1043k3346k4528k4609k4248k4050k4109
61087H94177k4148k3870k3151k2042k0714j9295j7739j5879j3733j1678j0210
61076F91718r418q793p679n959m127k744j936j435q70K0J225K348K936L147L746
61061F62179N129O660P478P699Q198R290J0419J1311J2518J4456J6545J7989J8914
61048H08785K0086K1812K3768K5609K7108K7977K8268K8768L0132L1743L2391
61037A106447L2068L2095L3211L4638L5529L6238L7404L8676L9407L9995M1381
$$ y = [672903, 690270, 709811, 731261, 754321, 778741, 804146, 830196, 856931, 884476, 912326, 939362, 964859, 989063, 1012473, 1034926, 1055826, 1074943, 1092283, 1107218, 1118381, 1124699, 1126153, 1123367, 1116849, 1106920, 1093983, 1078382, 1060110, 1039067, 1015721, 991193, 966584, 942336, 918286, 894177, 870029, 846159, 823008, 800966, 780252, 760957, 743218, 727339, 713606, 701928, 691718, 682300, 673507, 665828, 659869, 655742, 652998, 651062, 649627, 648757, 648777, 650002, 652350, 655286, 658433, 662179, 667308, 673968, 681446, 689145, 697343, 706633, 717052, 728363, 740881, 755337, 771882, 789871, 808785, 828871, 850683, 874451, 900060, 927168, 955145, 983413, 1012181, 1042313, 1074056, 1106447, 1138515, 1170610, 1203821, 1238459, 1273988, 1310226, 1347630, 1386306, 1425713, 1465708, 1507089]
61026A507089M3422M4913M5215M4987M5342M7074N0761N6679O4326P2746Q1665
61015B104219R1690J03255J16163J30649J48331J71644K02851K44023K97388L64999
61005C975212M48191N47952O65869Q04536R67275J157512J376743J618867J860277
60996A3422434K050842K117380J989943J644820J136291N86684J33745j29415
60988B2952724j82728p0173J22261K84123L02927J04008l07802q40842j359196
60979B1005302j747823j954804j989957j896227j722606j511424j294847j093377
60971G794237r16131p64564o37273n32301m47066l78380l23211k79052k43675
60962C272584k15186j92219j73545j57594j42968j29352j17189j06451r6337q6295
$$ y = [1507089, 1550511, 1595424, 1640639, 1685626, 1730968, 1778042, 1828803, 1885482, 1949808, 2022554, 2104219, 2195909, 2299164, 2415327, 2545976, 2694307, 2865951, 3068802, 3312825, 3610213, 3975212, 4423403, 4971355, 5637224, 6441760, 7409035, 8566547, 9943290, 11562157, 13422434, 15473276, 17590656, 19580599, 21225419, 22361710, 22948394, 23082139, 22952724, 22769996, 22699823, 22822084, 23106207, 23409134, 23513142, 23205340, 22364498, 21005302, 19257479, 17302675, 15312718, 13416491, 11693885, 10182461, 8887614, 7794237, 6878106, 6113542, 5476269, 4943968, 4496902, 4118522, 3795311, 3516259, 3272584, 3057398, 2865179, 2691634, 2534040, 2391072, 2261720, 2144531, 2038080, 1941743, 1855448]
60952A855448p6670o8140o1127n6006n3132n2155n1771n0782m9167m7590m6180
60941A242728m4406m2053l9668l7804l6317l4700l2822l1031k9533k8060k6287
60930H60047k4342k2587k1040j9347j7405j5620j4332j3350j2350j1429j0774
60919F77471j0102q959p470o219n438m889m468m267l968k945j257Q9L22k12o61
60904F17027p08n17j90J70J89m17j372k234k984l813m492m592m220m050m488n219
60888E78090n579n120l888k486j802k293l466m392m679m718n017n622o189o318
60874E16521n818m896m092l800l900l985l889l658l179k269j084o3O03J062J348
60859D78901J247P69L83N28J032J339J135O17K23K23N49Q58P91K33n88j312j728
$$ y = [1855448, 1778778, 1710638, 1649511, 1593505, 1540373, 1488218, 1436447, 1385665, 1336498, 1288908, 1242728, 1198322, 1156269, 1116601, 1078797, 1042480, 1007780, 974958, 943927, 914394, 886334, 860047, 835705, 813118, 792078, 772731, 755326, 739706, 725374, 712024, 699674, 688245, 677471, 667369, 658410, 650940, 644721, 639283, 634394, 629926, 625659, 621691, 618746, 617489, 617578, 617900, 617688, 617027, 616319, 615802, 615612, 615782, 615971, 615554, 614182, 611948, 608964, 605151, 600659, 596067, 591847, 587797, 583309, 578090, 572511, 567391, 563503, 561017, 559215, 556922, 553456, 549064, 544385, 539667, 534650, 529028, 522839, 516521, 510703, 505807, 501715, 497915, 494015, 490030, 486141, 482483, 479304, 477035, 475951, 475888, 476491, 477553, 478901, 480148, 480917, 481300, 481828, 482860, 484199, 485334, 485951, 486174, 486397, 486946, 487804, 488595, 488828, 488240, 486928, 485200]
60842D85200j979k428l236m095m503m346l976l698l451l093k749k540k217j401
60828D41488j39R70J251N29o13j186o91K25M30l22j151j365j372j816k469k626
60812D31143k241j848j665j546j585k015k552k630k273k013k017k019k044k357
60798D02338k650k261j324p61q95j067r78j341k543l650l650k910k466k406k005
60783C71431j132m90m73o61n79l50l56p21j216j441j100k98N17J082J556K115
60767C67884K670L182L804M323M060K910J968K324L567M253L718K622J797J353
60753D10435J005N73j6o73j057r62p80j030j517j638j442j618k351l031l288l522
60737C89088m066m622m925n229n587n368m163k628j702j409j219j192j844k991
$$ y = [485200, 483221, 480793, 477557, 473462, 468959, 464613, 460637, 456939, 453488, 450395, 447646, 445106, 442889, 441488, 441349, 442319, 443570, 444099, 443486, 442300, 441609, 441834, 442264, 441942, 440791, 439426, 438054, 436238, 433769, 431143, 428902, 427054, 425389, 423843, 422258, 420243, 417691, 415061, 412788, 410775, 408758, 406739, 404695, 402338, 399688, 397427, 396103, 395342, 394447, 393380, 392402, 391061, 388518, 384868, 381218, 378308, 375842, 373436, 371431, 370299, 369809, 369336, 368675, 368096, 367746, 367390, 366669, 365453, 364012, 362912, 362614, 363131, 364213, 365769, 367884, 370554, 373736, 377540, 381863, 385923, 388833, 390801, 393125, 396692, 400945, 404663, 407285, 409082, 410435, 411440, 412013, 411997, 411324, 410267, 409305, 408525, 407495, 405978, 404340, 402898, 401280, 398929, 395898, 392610, 389088, 385022, 380400, 375475, 370246, 364659, 359291, 355128, 352500, 350798, 349389, 348170, 346978, 345134, 342143]
60723C42143l607l042j766o38J8L64N52O05N84N43L89K8m01n26j46N01Q34M88
60705C36923k71p61n42K65J244K021K311K036J617J744K555L360L513L230L078
60690C62323K945K332J437J161J823K618K764K564K736L203L239K637K015J920
60676C95717K179K300K091J678J192P18L41J5m52j201k133l055l806m160l847
60661C87577k941k081j941k395k534j687k41P77Q66M81L40O07R73J309J806K415
60645C83331K609J948O42p81k153l601m863n196m279k784j753j540j661j510r15
60630C57494j0J027J982K524K285J159m52j708j917j185l37m0j83k72j17J56N20
60613C60926R59J145P41P4k9P35J715K075J652Q69J95o4K02P33J011Q38O11P36
$$ y = [342143, 338536, 335494, 333728, 333090, 333108, 333472, 334024, 334629, 335213, 335756, 336145, 336173, 335772, 335246, 335100, 335601, 336435, 336923, 336652, 335891, 335349, 335614, 336858, 338879, 341190, 343226, 344843, 346587, 349142, 352502, 356015, 359245, 362323, 365268, 367600, 369037, 370198, 372021, 374639, 377403, 379967, 382703, 385906, 389145, 391782, 393797, 395717, 397896, 400196, 402287, 403965, 405157, 405875, 406216, 406231, 405779, 404578, 402445, 399390, 395584, 391424, 387577, 384636, 382555, 380614, 378219, 375685, 373998, 373757, 374534, 375400, 375881, 376221, 376828, 377801, 379110, 380916, 383331, 385940, 387888, 388530, 387749, 385596, 381995, 377132, 371936, 367657, 364873, 363120, 361580, 359919, 358409, 357494, 357484, 358511, 360493, 363017, 365302, 366461, 366009, 364301, 362384, 361199, 360862, 360822, 360639, 360367, 360250, 360406, 360926, 361885, 363030, 363771, 363845, 363816, 364551, 366266, 368341, 369993, 370862, 371057, 370993, 371195, 371928, 372939, 373777, 374388, 375124]
60595C75124J023J024Q03Q70J403J935J923J415R07P29P05M64m7n35q37j156j635
60578C84115j872j285R1J633K927M092N180N911O241O715P715Q836R479R749J0185
60563D59712J0777J0911J0182Q746O891M756K501L06j867m064n874o634o191n105
60549D85047l970k877j677m02P84J853K909M048N296O634Q037R550J1224J2868
60535E39324J4030J4396J4059J3213J1781R612O907M084J361j179l302m795n795
60522F13696o510o734o103m821l616k928k564k201j815j520j355j275j138o90
60508E70426J09R52J710K832M707O986R241J1993J6057K0983K5286K8471L1662
60495G31415L5744L9975M3090M4874M5748M5541M3619L9793L4232K6849J7584
$$ y = [375124, 376147, 377171, 377974, 378844, 380247, 382182, 384105, 385520, 386427, 387156, 387861, 388325, 388278, 387743, 386906, 385750, 384115, 382243, 380958, 381049, 382682, 385609, 389701, 394881, 400792, 407033, 413748, 421463, 430299, 439778, 449527, 459712, 470489, 481400, 491582, 500328, 507219, 511975, 514476, 514782, 512915, 508851, 502977, 496343, 490152, 485047, 481077, 478200, 476523, 476121, 476905, 478758, 481667, 485715, 491011, 497645, 505682, 515232, 526456, 539324, 553354, 567750, 581809, 595022, 606803, 616415, 623322, 627406, 628767, 627588, 624286, 619491, 613696, 607186, 600452, 594349, 589528, 585912, 582984, 580420, 578219, 576404, 574884, 573529, 572254, 571116, 570426, 570535, 571487, 573197, 576029, 580736, 587722, 596963, 608956, 625013, 645996, 671282, 699753, 731415, 767159, 807134, 850224, 895098, 940846, 986387, 1030006, 1069799, 1104031, 1130880, 1148464]
60484A148464P132l455j3665k3394l2156l9158m4106m7215m8526m7872m5527m2251
60472G68271l8610l4764l0952k7614k4906k2551k0280j8053j5903j3940j2460
60461E08238j1644j1103j0258r088q030p149o034m585l383k935l079l340l474
60448D24136l457l311l181l261l363k938j825o14R1M32P87Q99J21j427k670k800
60432C97619k136j458r50l46K05K54l0J58J010J606J189L04l3K07L27L05Q06J799
60414D00836K358K124J822J881J590M08q28r84k59K71K92L62P00R50J057J409
60398D13989K048K513K589K537K506K402K284K306K308K116K113K720L399L114
60384D48944J876R59J253K247K908K901K519K134K053K386K743K613K224K369
$$ y = [1148464, 1155596, 1152141, 1138476, 1115082, 1082926, 1043768, 999662, 952447, 903921, 856049, 810522, 768271, 729661, 694897, 663945, 636331, 611425, 588874, 568594, 550541, 534638, 520698, 508238, 496594, 485491, 475233, 466145, 458115, 450966, 444932, 440347, 436964, 434029, 430950, 427610, 424136, 420679, 417368, 414187, 410926, 407563, 404625, 402800, 402186, 402277, 402709, 403496, 404395, 404516, 403089, 400419, 397619, 395483, 394025, 393075, 392729, 392934, 393188, 393158, 393316, 394326, 395932, 397121, 397425, 397392, 397599, 397926, 398231, 399037, 400836, 403194, 405318, 407140, 409021, 410611, 411019, 410191, 409207, 408948, 409219, 409511, 409873, 410573, 411523, 412580, 413989, 416037, 418550, 421139, 423676, 426182, 428584, 430868, 433174, 435482, 437598, 439711, 442431, 445830, 448944, 450820, 451779, 453032, 455279, 458187, 461088, 463607, 465741, 467794, 470180, 472923, 475536, 477760, 480129]
60370D80129L087L377K664J784J768K337K376J601R07J103J942K593K685K768
60356E11121L692N536P346Q307Q902J0249J2276J3519J2918J0990Q704O215L326
60343F23101M27k012m295o841q986r553q555p417p332q063q583q282p354o391
60329E29864n829n613n322m736m122l818l746l601l251k674j862j018n01j20R85
60314D84636L223N719P302Q031Q964J0631J2540J4178J5590J6805J7442J7239
60302F22300J6466J5486J4168J2002Q582M010r98n472q997j1962j4686j6660j7193
60289F17046j6472j5293j3918j2091j0082q681q000p201n822m590m362m941n486
60276E00107n609n521n358m992m351l562k841k402k332k418k345k083j818j500
$$ y = [480129, 483216, 486593, 489257, 491041, 492809, 495146, 497522, 499123, 500030, 501133, 503075, 505668, 508353, 511121, 514813, 520349, 527695, 536002, 544904, 555153, 567429, 580948, 593866, 604856, 613560, 619775, 623101, 623528, 621516, 617221, 610380, 601394, 591841, 583286, 575869, 568537, 560474, 551891, 543609, 536255, 529864, 524035, 518422, 513100, 508364, 504242, 500424, 496678, 493077, 489826, 487152, 485290, 484272, 483771, 483651, 484636, 487859, 493578, 500880, 508911, 517875, 528506, 541046, 555224, 570814, 587619, 605061, 622300, 638766, 654252, 668420, 680422, 689004, 693014, 692016, 686544, 677547, 665585, 650899, 634239, 617046, 600574, 585281, 571363, 559272, 549190, 540509, 532509, 525308, 519486, 514896, 510534, 505593, 500107, 494498, 488977, 483619, 478627, 474276, 470714, 467873, 465471, 463139, 460721, 458376, 456293, 454475, 452975]
60262D52975r05j91J40pj60q8j80o96j169r24J43J626L015L771L525K589J808
60245D65272J560J331O43k19q67j529k445l089k790j814r44l10N42J572K239K516
60229D61668K972L708M061L678L141L169L699M219M453M418M212M131M622N690
60215E17841O721P211P429P874Q396Q385P746P126P044P208O930O045N078M548
60201F15582M349L970L152K125J207M96K0j36o9k29r64k096l174m065m871n490
60185F09807n705n688n822n955n437m108k808k458k986l534l504k956k272j786
60171E54788j704j940k039j584o92R6M06K70j62p34j110q82o0Q44J413J770K155
60154E50835K357K003J313J037J523K244K486K207J841J613J453J529K182L305
$$ y = [452975, 452070, 451879, 452019, 452012, 451852, 451764, 451584, 450888, 449719, 448795, 448938, 450564, 453579, 457350, 460875, 463464, 465272, 466832, 468163, 468806, 468587, 467720, 466191, 463746, 460657, 457867, 456053, 455109, 454799, 455341, 456913, 459152, 461668, 464640, 468348, 472409, 476087, 479228, 482397, 486096, 490315, 494768, 499186, 503398, 507529, 512151, 517841, 524562, 531773, 539202, 547076, 555472, 563857, 571603, 578729, 585773, 592981, 599911, 605956, 611034, 615582, 619931, 623901, 627053, 629178, 630385, 630881, 630901, 630765, 630696, 630467, 629503, 627407, 624233, 620168, 615297, 609807, 604102, 598414, 592592, 586637, 581200, 577092, 574284, 571826, 568840, 565306, 561802, 558846, 556574, 554788, 553084, 551144, 549105, 547521, 546829, 546925, 547331, 547601, 547439, 546705, 545595, 544713, 544653, 545497, 546910, 548680, 550835, 553192, 555195, 556508, 557545, 559068, 561312, 563798, 566005, 567846, 569459, 570912, 572441, 574623, 577928]
60140E77928M237M568M685N221O219P145P532P311O647N738M734L661K536J625
60126F49787J296J405J226M45j56L82J797K822K735K012J346Q19K52k85p78j490
60110F63615k468l237l464l520l896m376m400l944l484l237k976k580k260k162
60096F17611k101j772r79K38J514K354K660K855L206L330K878K359K522L065K807
60081F42547J266o45j817k203k457k930l488m048m756n736o897p919q361q050
60067E84506p475p352p665p575o583n246m307l671k832j924j517j561j368o56
60053E24774R3M80P68J329K047K650L217M015N025N915O332O029N030L783K989
60038E74476K957L244L075K026K01j896l593m421m576m757n341n959o198o327
$$ y = [577928, 582165, 586733, 591418, 596639, 602858, 610003, 617535, 624846, 631493, 637231, 641965, 645626, 648162, 649787, 651083, 652488, 653714, 654159, 654003, 654385, 656182, 659004, 661739, 663751, 665097, 665916, 666168, 665883, 665105, 663615, 661147, 657910, 654446, 650926, 647030, 642654, 638254, 634310, 630826, 627589, 624613, 622033, 619773, 617611, 615510, 613738, 612759, 612997, 614511, 616865, 619525, 622380, 625586, 628916, 631794, 634153, 636675, 639740, 642547, 643813, 643168, 641351, 639148, 636691, 633761, 630273, 626225, 621469, 615733, 608836, 600917, 592556, 584506, 577031, 569679, 562014, 554439, 547856, 542610, 538303, 534632, 531800, 529876, 528359, 526798, 525430, 524774, 524867, 525347, 526115, 527444, 529491, 532141, 535358, 539373, 544398, 550313, 556645, 562674, 567704, 571487, 574476, 577433, 580677, 583752, 585778, 585979, 584083, 580490, 576069, 571493, 566736, 561395, 555436, 549238, 542911]
60024E42911o871p667p964p451o629o097n901n830n819n878n902n860n877n859
60010D53306n360m181k829j981j655j344p97k17K56P12J105J225J154J300J745
59995D42439K086K118K209K596K861K678K622L431M621M782L341J290j03o54r08
59980D75409j164j379j636k055k472k768l213l964m403l725k123p29k73m11n16
59965D44578m67l69q4M73R69J121J165J466J821J745J249Q28P12O50M49K62J65
59948D56733n5m32n64j36N48Q88O43p1j150k449l429l460k658j957k037k430k128
59931D35856r25L60R93J229J804K866L836M234M199M192M454M992N777O661P206
59916D87734O851N463L559J883Q04J89j72k03K38Q99J247J157J232K041L136L354
$$ y = [542911, 536040, 528373, 520409, 512958, 506329, 500232, 494331, 488501, 482682, 476804, 470902, 465042, 459165, 453306, 447946, 443765, 440936, 438955, 437300, 435956, 435159, 434942, 435198, 435910, 437015, 438240, 439394, 440694, 442439, 444525, 446643, 448852, 451448, 454309, 456987, 459609, 463040, 467661, 472443, 475784, 477074, 476971, 476317, 475409, 474245, 472866, 471230, 469175, 466703, 463935, 460722, 456758, 452355, 448630, 446507, 445778, 445505, 445094, 444578, 444111, 443742, 443658, 444131, 445100, 446221, 447386, 448852, 450673, 452418, 453667, 454495, 455207, 455857, 456306, 456568, 456733, 456678, 456246, 455682, 455546, 456094, 456982, 457625, 457554, 456404, 453955, 450526, 447066, 444408, 442451, 440414, 437984, 435856, 434931, 435291, 436284, 437513, 439317, 442183, 446019, 450253, 454452, 458644, 463098, 468090, 473867, 480528, 487734, 494585, 500048, 503607, 505490, 506294, 506483, 506311, 506108, 506346, 507245, 508492, 509649, 510881, 512922, 516058, 519412]
59900E19412K234P43K83J165K460L239L465L585L685L470K940K658L143M159M829
59885E61470M491L293J956J084Q48J147J784K459K855K873K653K270J597N73o26
59870E90727j809k946l928m429m273l825l583l513l152k359j530r53m47J70O66
59855E54816Q10R17J561K905M658O575Q543J0180J0856J0337R115P769O243M054
59841F39339J238j272k402j968q02J20N20O15L47q32l188o008q055q722q408p825
59825E92697p239o569n853n200m502l580k673k385k987l977m586m495l945l299
59811E31407k794k565k614k605k056r45O9K88j42l50J52P58M94o99j834k116j846
59794E12602j782k001j948j473j143j386j869k087k060k076k070j780j337j137
$$ y = [519412, 521646, 522389, 522672, 523837, 526297, 529536, 533001, 536586, 540271, 543741, 546681, 549339, 552482, 556641, 561470, 565961, 569254, 571210, 572294, 573142, 574289, 576073, 578532, 581387, 584260, 586913, 589183, 590780, 591353, 590727, 588918, 585972, 582044, 577615, 573342, 569517, 565934, 562421, 559269, 556910, 555380, 554427, 553980, 554150, 554816, 555626, 556543, 558104, 561009, 565667, 572242, 580785, 590965, 601821, 612158, 621273, 629042, 635285, 639339, 640577, 639305, 636903, 634935, 634133, 634253, 634773, 635388, 635735, 634903, 631715, 625707, 617652, 608930, 600522, 592697, 585458, 578889, 573036, 567836, 563334, 559754, 557081, 554696, 551709, 547732, 543146, 538651, 534706, 531407, 528613, 526048, 523434, 520829, 518773, 517828, 517897, 518185, 518043, 517693, 517845, 518603, 519097, 518398, 516564, 514448, 512602, 510820, 508819, 506871, 505398, 504255, 502869, 501000, 498913, 496853, 494777, 492707, 490927, 489590, 488453]
59780D88453j202j211j119j209j444j325n89L86J136J646K073K346K337K188K078
59765D94544J936J734J778K324L105L650L883M041M197M368M911O089P297P419
59751E51276O262M993M763N369N770N532N088M743M139K931J487N14K57M07O89
59736F04220J087J462J335L82j005k019k250j973j580j082l40M95J066J169P78
59721F01745n7j050j578j268n92m55j043j594j482j062r95j159p89L77J644K224
59705E92866K116J883J824J772J575J419J511J706J716J579J639K005K290J966
59691F17867Q75o56k053k764k615k042j756j940k047j633j082j121j820k645l323
59676E91245m075m903n339n119m673m574m910n415n855n947n295l844k177j000
$$ y = [488453, 487251, 486040, 484921, 483712, 482268, 480943, 480354, 480740, 481876, 483522, 485595, 487941, 490278, 492466, 494544, 496480, 498214, 499992, 502316, 505421, 509071, 512954, 516995, 521192, 525560, 530471, 536560, 543857, 551276, 557538, 562531, 567294, 572663, 578433, 583965, 589053, 593796, 597935, 600866, 602353, 602867, 603124, 603531, 604220, 605307, 606769, 608104, 608486, 607481, 605462, 603212, 601239, 599659, 598577, 598237, 598732, 599798, 600967, 601745, 601688, 600638, 599060, 597792, 597200, 596745, 595702, 594108, 592626, 591564, 590569, 589410, 588621, 588998, 590642, 592866, 594982, 596865, 598689, 600461, 602036, 603455, 604966, 606672, 608388, 609967, 611606, 613611, 615901, 617867, 618742, 618086, 616033, 613269, 610654, 608612, 606856, 604916, 602869, 601236, 600154, 599033, 597213, 594568, 591245, 587170, 582267, 576928, 571809, 567136, 562562, 557652, 552237, 546382, 540435, 535140, 531296, 529119, 528119]
59662E28119m97l90l91k53L50J478K639L275L418L543L821L986L854L487K865
59647E59304J833M71q74k012l035l977m666n004m996m534l561k503k032k207k379
59632E19828k168j991k174k144j240JJ88j179l009l863l392k316j445j152j409
59617D92535j906k181k017j668j467j300p12L89J478J956J737J205P71O02P24
59602D90146J078J471J688J718J797K073K280J921Q86k21o17j84M05M83Q5l21
59586E04688n54p46q47n66m4l3j030k467l286l141k617k299k150j905j594j424
59570D79985j372j260j027p18l38L1J48j16n10o38m20j00J32L16N52Q82J330J827
59552D78704K061J741J095Q71J574K839L850M330M838N959P537R002J0332J2194
$$ y = [528119, 527622, 527232, 526841, 526588, 526938, 528416, 531055, 534330, 537748, 541291, 545112, 549098, 552952, 556439, 559304, 561137, 561608, 560734, 558722, 555687, 551710, 547044, 542040, 537044, 532510, 528949, 526446, 524414, 522207, 519828, 517660, 515669, 513495, 511351, 510111, 510112, 510300, 509121, 506112, 502249, 498857, 496541, 495096, 493944, 492535, 490629, 488448, 486431, 484763, 483296, 481996, 481284, 481673, 483151, 485107, 486844, 488049, 488820, 489422, 490146, 491224, 492695, 494383, 496101, 497898, 499971, 502251, 504172, 505058, 504837, 504220, 504036, 504441, 504924, 505009, 504688, 504134, 503388, 502541, 501975, 501931, 501898, 500868, 498401, 495115, 491974, 489357, 487058, 484908, 483003, 481409, 479985, 478613, 477353, 476326, 475608, 475270, 475301, 475449, 475333, 474823, 474185, 473765, 473665, 473797, 474113, 474665, 475547, 476877, 478704, 480765, 482506, 483601, 484472, 486046, 488885, 492735, 497065, 501903, 507862, 515399, 524401, 534733, 546927]
59538E46927J4896J7504J8318J6280J1728N940L55l892o089o182m740k607m41
59525F07997J352K504K911K675K052J335P54L14l80j824l978o064p250p515p599
59510E87284q168r148r890r841r026p968p115o421n530m374l331k745k540k392
59496D98795k123j681j061m32j27k08k74PL69L32k4j04M46J378K292K988L439
59479E04012L738M185N017N962O405O095N403M715L995L135K361K010K106K410
59465E61549K725K909K813K480K306K718L739N046O362P579Q600R276R528R363
59451F36993Q758P737O518N443M633L769K348J46k493m952o931q648j0293j1435
59437F31593j1272r623p337n492m381l530k550j573q58k99M63J616L045M619O431
$$ y = [546927, 561823, 579327, 597645, 613925, 625653, 631593, 631948, 628056, 621967, 615785, 611045, 608438, 607997, 609349, 611853, 614764, 617439, 619491, 620826, 621580, 621894, 621514, 619690, 615712, 609648, 602398, 594883, 587284, 579116, 569968, 560078, 550237, 541211, 533243, 526128, 519707, 514177, 509803, 506472, 503727, 501187, 498795, 496672, 494991, 493930, 493498, 493371, 493163, 492889, 492896, 493265, 493597, 493573, 493469, 493915, 495293, 497585, 500573, 504012, 507750, 511935, 516952, 522914, 529319, 535414, 540817, 545532, 549527, 552662, 555023, 557033, 559139, 561549, 564274, 567183, 569996, 572476, 574782, 577500, 581239, 586285, 592647, 600226, 608826, 618102, 627630, 636993, 645751, 653488, 660006, 665449, 670082, 673851, 676199, 676345, 673852, 668900, 661969, 653321, 643028, 631593, 620321, 610698, 603361, 597869, 593488, 589958, 587408, 585835, 584977, 584678, 585141, 586757, 589802, 594421, 600852]
59422F00852Q646J1170J3584J5521J6976J8175J9191J9942K0510K1057K1219J9780
59410H06623J5423P988j053r351j4950j7096j6219j3308r208m381O78M877O636
59397G56659M839j49o504j2134j5980j8182j9167j8872j7037j3958j0531p518
59385F21466n117l306k264k051k087j469P3J779K723K877K997L478L765L183K106
59370F28153J693K445L543L881L422L047L318L909M283M391M565N052N894O995
59356F84591Q129R020R644J0292J1269J2553J3838J4770J5173J5178J5163J5371
59344H34991J5548J5095J3690J1492Q834N958L074L58k284n130q203j1068j3283
59331H69072j4764j5619j5931j5866j5692j5397j4568j3013j1267j0119r722r536
$$ y = [600852, 609498, 620668, 634252, 649773, 666749, 684924, 704115, 724057, 744567, 765624, 786843, 806623, 822046, 830034, 828981, 819630, 804680, 787584, 771365, 758057, 748849, 744468, 745146, 750023, 756659, 761498, 761349, 754845, 742711, 726731, 708549, 689382, 670510, 653473, 639515, 628984, 621466, 616349, 613043, 610779, 608728, 606641, 605172, 605245, 607024, 609747, 612624, 615621, 619099, 622864, 626047, 628153, 629846, 632291, 635834, 639715, 643137, 646184, 649502, 653411, 657694, 662085, 666650, 671702, 677596, 684591, 692720, 701740, 711384, 721676, 732945, 745498, 759336, 774106, 789279, 804457, 819620, 834991, 850539, 865634, 879324, 890816, 899650, 905608, 908682, 909040, 906756, 901626, 893423, 882355, 869072, 854308, 838689, 822758, 806892, 791200, 775803, 761235, 748222, 736955, 726836, 717114, 707578]
59319G07578r109q516q032p615o961n978n044m675m881n065m700l876k918j669
59305F28539J99K330L846M643N692P718J0200J2129J3006J2467R660M185k693
59292G11921q776j2824j5012j5700j4898j3005j0932r063o946m336j860j68R05
59279E99306J848K841M033N819Q200J0367J1570J2047J2527J3094J3219J2672
59267G07543J1730J0584R102P210N055K791M98j637l461n058o584p926q821r182
59253G11844r103q636p866p027o212n229l965k653j355L93K788M885N382M309
59239F77555L254L616N195O741P314O879N993N285M917M323K788M32j781l153
59225G29358l981m896n987o989p871q749r427r526q985q119p239o536o135o005
$$ y = [707578, 698469, 689953, 681921, 674306, 667345, 661367, 656323, 651648, 646767, 641702, 637002, 633126, 630208, 628539, 628738, 631068, 634914, 639557, 645249, 652967, 663167, 675296, 688302, 700769, 710429, 714614, 711921, 703145, 690321, 675309, 659609, 644711, 631706, 620774, 611711, 604765, 600429, 598569, 598401, 599306, 601154, 603995, 608028, 613847, 622047, 632414, 643984, 656031, 668558, 681652, 694871, 707543, 719273, 729857, 738959, 746169, 751224, 754015, 754513, 752876, 749415, 744357, 737773, 729847, 721026, 711844, 702741, 694105, 686239, 679212, 673000, 667771, 663806, 661153, 659798, 660191, 662979, 667864, 673246, 677555, 680809, 684425, 689620, 696361, 703675, 710554, 716547, 721832, 726749, 731072, 733860, 734292, 732511, 729358, 725377, 720481, 714494, 707505, 699634, 690885, 681458, 671932, 662947, 654828, 647589, 641053, 634918, 628913]
59211F28913n887n585n165m699m053l251k691k575k423j672o05p7l44p43n86N9
59195E88616O11O08Q5l93p8J169K485K887K498K314K793L435L882M569N754O700
59179F27935O507N381M312L878L980M510N457O456O974P099P470Q216Q572P898
59165G14645O616N666N243M626L248J467oj214k957n552q025r136r022r139j0365
59150F86095j1839j2195j1351j0374r893r465q532p241o168n725o016o814p468
59137E73014p275o141m650l375k450j842j508j210o12K26Q93J344K079L310M466
59122E56269M979N188N848P018Q011Q409Q613R251J0393J1536J2167J2263J2275
59109F72220J2593J3013J2866J1771J0074Q378O878N349L659J916K49j301k624
$$ y = [628913, 623026, 617441, 612276, 607577, 603524, 600273, 597582, 595007, 592584, 590912, 590307, 590230, 589886, 589143, 588557, 588616, 589227, 589835, 589920, 589527, 589449, 590618, 593103, 595990, 598488, 600802, 603595, 607030, 610912, 615481, 621235, 627935, 634442, 639823, 644135, 648013, 651993, 656503, 661960, 668416, 675390, 682489, 689959, 698175, 706747, 714645, 721261, 726927, 732170, 736796, 740044, 741511, 741505, 740291, 737334, 731782, 723757, 714621, 705599, 696460, 686095, 674256, 662061, 650710, 640336, 630443, 620978, 612446, 605205, 599037, 593312, 587296, 580482, 573014, 565739, 559598, 554948, 551573, 549123, 547281, 545773, 544563, 543951, 544177, 545070, 546414, 548493, 551803, 556269, 561248, 566436, 572284, 579302, 587313, 595722, 604335, 613586, 623979, 635515, 647682, 659945, 672220, 684813, 697826, 710692, 722463, 732537, 740915, 747793, 753142, 756801, 758717, 758966, 757665, 755041]
59096G55041l531l989m170m219m035l377k216r36j36j11o02j149j595k062k607
59081G20306l192l903m867n918o728p290p849q318q316p856p511p577p578o984
59067F26419n977n117m653m508m504m245l225j567k31J04q7mJ70l23j398k060
59051E88794j824j271r85p55k08L76M49L9k37M5O61J000O74j40q65j018m76O52
59033E84911K087L263L648L424L525M581O226P763R071J0260J1021J1049J0777
59020F71606J0780J0717R780P998O105M295K220K15p73p40q46j612k090j453k61
59005G15941O38J452K704M047M915N655O792P686P246N743M605M380M128L076
58991G79008J734Q82K76q47k521l946m557m633m792n137n125m299k909j648p42
$$ y = [755041, 751510, 747521, 743351, 739132, 735097, 731720, 729504, 728568, 728432, 728321, 727719, 726570, 724975, 722913, 720306, 717114, 713211, 708344, 702426, 695698, 688408, 680559, 672241, 663925, 656069, 648558, 640981, 633403, 626419, 620442, 615325, 610672, 606164, 601660, 597415, 594190, 592623, 592392, 592496, 592409, 592405, 592575, 592252, 590854, 588794, 586970, 585699, 584714, 583959, 583751, 584127, 584576, 584615, 584378, 584423, 585084, 586084, 586758, 586618, 585753, 584735, 584259, 584911, 586998, 590261, 593909, 597333, 600858, 605439, 611665, 619428, 628499, 638759, 649780, 660829, 671606, 682386, 693103, 702883, 710881, 716986, 721281, 723501, 723716, 722943, 722203, 721357, 719745, 717655, 716202, 715941, 716579, 718031, 720735, 724782, 729697, 735352, 742144, 749830, 757076, 762819, 767424, 771804, 775932, 779008, 780742, 781624, 781900, 781053, 778532, 774586, 770029, 765396, 760604, 755467, 750342, 746043, 743134, 741486, 740744]
58976G40744K78J889L968O086P939R318J0016J0202J0422J0920J1290J1264J1264
58963H45600J1606J1667J0602Q623O716N248L713J702o96l457o644r783j2082
58950H72815j3497j4711j5849j6092j4956j3195j1789j0747r494p906o339n018
58938G33222l984l389l335l634m061m508m609l797k184q20m07k63N73J675J724
58923G02203N22n83n11L01Q25Q35Q28J171J887K940M183N258N947O476P157P955
58907G47394Q609R021R247R343R479R902J0502J0694J0122R244Q788Q834Q874
58894H70053Q718Q753R391J0690J2585J5020J7657J9886K1229K1552K0746J8643
58882A054923J5342J1312O998K638j427m651o789q190r410j0690j1979j3145j3959
$$ y = [740744, 741022, 742911, 746879, 752965, 760904, 770222, 780238, 790440, 800862, 811782, 823072, 834336, 845600, 857206, 868873, 879475, 888098, 894814, 900062, 903775, 905477, 904781, 901324, 894680, 884897, 872815, 859318, 844607, 828758, 812666, 797710, 784515, 772726, 761979, 752485, 744579, 738240, 733222, 729238, 725849, 722514, 718880, 714819, 710311, 705702, 701905, 699721, 698901, 698494, 698231, 698804, 700479, 702203, 702725, 702142, 701631, 701932, 702757, 703592, 704420, 705591, 707478, 710418, 714601, 719859, 725806, 732282, 739439, 747394, 756003, 765024, 774271, 783614, 793093, 802995, 813497, 824191, 834313, 843557, 852345, 861179, 870053, 878771, 887524, 896915, 907605, 920190, 935210, 952867, 972753, 993982, 1015534, 1036280, 1054923, 1070265, 1081577, 1088575, 1091213, 1089786, 1085135, 1078346, 1070156, 1060746, 1050056, 1038077, 1024932, 1010973]
58869A010973j4163j3773j3118j2382j1480j0517j0020j0341j1167j1948j2497
58858H79567j2899j3197j3570j4365j5437j5857j4853j2851j0989r841r212q896
58846G27600q872q882q582q160q120q388q353p842p342p163o994o463n596m536
58832F22307l424k612k351k172j342K1R95J262J526K317L237L885M543N360N671
58817F39223M983L968L628L922L992L358K211Q75l00q81q58r23j623k564l087
58802F55924l309l730m224m233l758l321l144l134l450m262n071n146m570m018
58788F00554l529k436n72J290K449K978L257L433L605L911M271M467M547M638
58774F32863M337L036R01j130k489l422m241m858n278n780o287o244n505m696
$$ y = [1010973, 996810, 983037, 969919, 957537, 946057, 935540, 925520, 915179, 904012, 892064, 879567, 866668, 853471, 839901, 825536, 810099, 794242, 779389, 766538, 755549, 745708, 736496, 727600, 718728, 709846, 701264, 693104, 684984, 676596, 668243, 660401, 653059, 645896, 638902, 632439, 626843, 622307, 618883, 616271, 613920, 611748, 610406, 610427, 611422, 612684, 614210, 616527, 619764, 623649, 628192, 633552, 639223, 644206, 648174, 651802, 655724, 659716, 663074, 665285, 666160, 665860, 664979, 664121, 663198, 661575, 659011, 655924, 652615, 648885, 644661, 640428, 636670, 633349, 630205, 627071, 623621, 619359, 614288, 609142, 604572, 600554, 597025, 594589, 594017, 595307, 597756, 600734, 603991, 607424, 611029, 614940, 619211, 623678, 628225, 632863, 637200, 640236, 641137, 640007, 637518, 634096, 629855, 624997, 619719, 613939, 607652, 601408, 595903, 591207]
58760E91207m333m140l638k834j944r63M9P64J092J385J800J950J658J486J949
58745E85488K675L046L310M288O154Q167R505R846R224P993O943O847P587Q130
58731F79203P671O509N623N497N684N544N082M839N000N100M806M619N234O408
58717G56819P093O743N900N315N113N045M981M678L589J421j338l967o306q554
58703G86532j0615j2208j3545j5228j7314j9017j9589j9133j8261j7150j5398
58692F09074j2820j0012p846o564n760n196n117n550n805n199m050l324l404l736
58678E24691l725l356k816k007p20R98K893M604N726O132O306O924Q095R431J0771
58663E73947J2160J3015J2226R466N769K292q55m006o749q173q146p589p426p651
$$ y = [591207, 586874, 582734, 579096, 576262, 574318, 573355, 573404, 574168, 575260, 576645, 578445, 580395, 582053, 583539, 585488, 588163, 591209, 594519, 598807, 604961, 613128, 622633, 632479, 641703, 649696, 656639, 663486, 671073, 679203, 686874, 693383, 699006, 704503, 710187, 715731, 720813, 725652, 730652, 735752, 740558, 745177, 750411, 756819, 763912, 770655, 776555, 781870, 786983, 792028, 797009, 801687, 805276, 806697, 805359, 801392, 795086, 786532, 775917, 763709, 750164, 734936, 717622, 698605, 679016, 659883, 641622, 624472, 609074, 596254, 586242, 578396, 571832, 566072, 560876, 555759, 550209, 544404, 539205, 535155, 531831, 528427, 524691, 520966, 517610, 514794, 512787, 512067, 513065, 515958, 520562, 526288, 532420, 538726, 545650, 553745, 563176, 573947, 586107, 599122, 611348, 620814, 626583, 628875, 628020, 624014, 617265, 609092, 600946, 593357, 585931, 578280]
58649E78280p551o600n100l970l781m020l662k406r40Q1P18J282J777K186K687
58634E48981L219L353K959K466K081J378J73q36r28l10M45J253K126K530K167
58619E71057J896K784M516N805O264O623P125O894N385L411K108J548R82J8r71
58604F25445j373r80k30K8o74j881k730k977l057l178k952k080q11N32J988L652
58588F08722N352O899Q398R970J1444J2512J2963J2632J1493R950Q670P837O921
58575G33763N494M015L410M046N492P216R169J1622J4702J8271K2049K5690K8680
58562H93619L0451L0763K9937K8455K6235K2675J7566J1719O341J978j581m540
58550A093618o607p387o885n670m655m695o061q332j1022j4078j7531k0811k2995
$$ y = [578280, 570729, 564129, 559029, 555059, 551278, 547258, 543596, 541190, 540250, 540331, 541049, 542331, 544108, 546294, 548981, 552200, 555553, 558512, 560978, 563059, 564437, 564610, 563774, 562846, 562536, 562981, 564234, 566360, 568890, 571057, 572953, 575737, 580253, 586058, 592322, 598945, 606070, 612964, 618349, 621760, 623868, 625416, 626398, 626416, 625445, 624072, 623092, 622862, 622890, 622216, 620335, 617605, 614628, 611571, 608393, 605441, 603361, 602550, 603082, 605070, 608722, 614074, 620973, 629371, 639341, 650785, 663297, 676260, 688892, 700385, 710335, 719005, 726842, 733763, 739257, 743272, 746682, 750728, 756220, 763436, 772605, 784227, 798929, 817200, 839249, 864939, 893619, 924070, 954833, 984770, 1013225, 1039460, 1062135, 1079701, 1091420, 1097761, 1099739, 1098158, 1093618, 1087011, 1079624, 1072739, 1067069, 1062414, 1057719, 1051658, 1043326, 1032304, 1018226, 1000695, 979884, 956889]
58537I56889k3734k3474k2713k1465j9673j7626j5651j3727j1663r568p806o517
58525G63272n379l905j994j55Q50P17n1o87q94r50j183j612k112k608l011l212
58509G37086l214l167l127k894k227j180k21Q8l88j179j641j603j378j219j078
58494G12658r40r41r38l34J213L187M721N587O274P236Q468R785J1182J2818J4803
58479G94779J6937J8572J8937J7755J5394J2285Q603M656J050j970m841p766r904
58466H84487j0201q746o531m082j247J753M047N219N914O914Q224R421J0328J0875
58452I16375J0697R435P205M315P89l377p518j0451j1508j1176j0481r871r000
58439H75434p521n732m198l007j850o38N17J895M027O786R163J0406J0818J1112
$$ y = [956889, 933155, 909681, 886968, 865503, 845830, 828204, 812553, 798826, 787163, 777595, 769789, 763272, 757893, 753988, 751994, 751839, 752689, 753406, 753355, 752668, 751774, 750824, 749641, 748029, 745917, 743309, 740298, 737086, 733872, 730705, 727578, 724684, 722457, 721277, 721056, 721144, 720756, 719577, 717936, 716333, 714955, 713736, 712658, 711718, 710777, 709839, 709505, 710718, 713905, 718626, 724213, 730487, 737723, 746191, 755976, 767158, 779976, 794779, 811716, 830288, 849225, 866980, 882374, 894659, 903262, 907918, 908968, 906998, 902157, 894391, 884487, 874286, 865540, 859009, 854927, 853680, 855433, 859480, 864699, 870613, 877527, 885751, 895172, 905500, 916375, 927072, 936507, 943712, 948027, 948816, 945439, 937921, 927470, 915962, 904786, 894305, 884434, 875434, 867913, 862181, 857983, 854976, 853126, 852488, 853005, 854900, 858927, 865713, 874876, 885282, 896100, 907212]
58425I07212J1463J1700J1838J1762J0755Q186M479Q16k045m175n932p550r126
58412I49383j0435j0962j0521r676r007q369p350o184n406m839l748j892K21K096
58398H63311L586M586N076N418N949O345O015M997L901L050K290J537Q31N2q49
58383I16095j420j152j01J456L520N897P716Q404Q608R170R647R150Q147P987
58369I93124Q783R359R338R651J0814J2194J3371J4645J5766J5701J4336J3009
58357A140091J2503J1807R785O941M523K827J391K05l38j40O78K151M100N881
58343A202405P039P786Q563R608J1219J3671J6482J8516J9225J9178J9099J9099
58331A371890J8969J8386J6632J3193Q994N945M839M646M228L582L050K602K548
$$ y = [907212, 918675, 930375, 942213, 953975, 964730, 972916, 977395, 978211, 976166, 971991, 966059, 958509, 949383, 938948, 927986, 917465, 907789, 898782, 890413, 883063, 876879, 871473, 866634, 862886, 860994, 861215, 863311, 866897, 871483, 876559, 881977, 887926, 894271, 900286, 905283, 909184, 912234, 914524, 916061, 916892, 916944, 916095, 914675, 913523, 913422, 914878, 918398, 924295, 932011, 940415, 949023, 958193, 967840, 976990, 985137, 993124, 1001907, 1011266, 1020604, 1030255, 1041069, 1053263, 1066634, 1081279, 1097045, 1112746, 1127082, 1140091, 1152594, 1164401, 1174186, 1181127, 1185650, 1188477, 1189868, 1190073, 1189735, 1189595, 1190273, 1192424, 1196524, 1202405, 1209444, 1217230, 1225793, 1235401, 1246620, 1260291, 1276773, 1295289, 1314514, 1333692, 1352791, 1371890, 1390859, 1409245, 1425877, 1439070, 1448064, 1454009, 1458848, 1463494, 1467722, 1471304, 1474354, 1476956, 1479504]
58318A479504L628N667P303P877Q381R705J1203J2048J2797J4320J6116J7064
58306A605613J7187J7444J8245J9196J9954K0481K0778K0943K1121K1014K0188
58295A822164J9166J9177K0339K1250K1077K0812K1567K2880K3784K4507K5794
58284B062517K7392K8486K9030K9627L0593L1927L3600L5228L6271L7155L9159
58273B420985M2560M6022M8541N0685N2993N4609N4777N4440N5134N7207O0204
58262B998157O3785O7197O9135O9325O9067O9096O8440O6600O5260O6234O9073
58251C741369P2337P5848Q0094Q4719Q9384R4825J01394J07825J13159J18458
58241D679412J24887J31688J37961J44800J53508J63201J72537J82294J93732
$$ y = [1479504, 1483132, 1488799, 1496102, 1503979, 1512360, 1522065, 1533268, 1545316, 1558113, 1572433, 1588549, 1605613, 1622800, 1640244, 1658489, 1677685, 1697639, 1718120, 1738898, 1759841, 1780962, 1801976, 1822164, 1841330, 1860507, 1880846, 1902096, 1923173, 1943985, 1965552, 1988432, 2012216, 2036723, 2062517, 2089909, 2118395, 2147425, 2177052, 2207645, 2239572, 2273172, 2308400, 2344671, 2381826, 2420985, 2463545, 2509567, 2558108, 2608793, 2661786, 2716395, 2771172, 2825612, 2880746, 2937953, 2998157, 3061942, 3129139, 3198274, 3267599, 3336666, 3405762, 3474202, 3540802, 3606062, 3672296, 3741369, 3813706, 3889554, 3969648, 4054367, 4143751, 4238576, 4339970, 4447795, 4560954, 4679412, 4804299, 4935987, 5073948, 5218748, 5372256, 5535457, 5707994, 5890288, 6084020]
58232F084020K05797K16708K27238K39767K54868K71329K88768L07921L29147
58223H425563L52756L79919M11231M45600M82439N23455N70238O22031O78212
58214A2891444P40940Q12832Q94223R85683J090955J214487J358585J526280J724407
58205B3239836J960581K240407K572216K972581L464488M074738M838230N800309
58197E1163386P008121Q501345J0314921J2485197J5046934J8027786K1444807
58190A43992497K5277635K9388660L3398907L6570560L7786814L5764434K9580599
58183C71760106J9328813O421391o846806j8279651k6607441l1625076l3765266
58176B80386070l3637189l1845840k8986262k5608361k2138058j8848421j5892717
$$ y = [6084020, 6289817, 6506525, 6733763, 6973530, 7228398, 7499727, 7788495, 8096416, 8425563, 8778319, 9158238, 9569469, 10015069, 10497508, 11020963, 11591201, 12213232, 12891444, 13632384, 14445216, 15339439, 16325122, 17416077, 18630564, 19989149, 21515429, 23239836, 25200417, 27440824, 30013040, 32985621, 36450109, 40524847, 45363077, 51163386, 58171507, 66672852, 76987773, 89472970, 104519904, 122547690, 143992497, 169270132, 198658792, 232057699, 268628259, 306415073, 342179507, 371760106, 391088919, 397510310, 390663504, 372383853, 345776412, 314151336, 280386070, 246748881, 214903041, 185916779, 160308418, 138170360, 119321939, 103429222]
58169A03429222j3339690j1192252r413343p955937o772881n812478n024021m370089
58161C9548531l825496l367037k973306k632113k338580k086057j865312j670925
58153A8789705j501241j352522j219069j098461r91281q96106q09597p30868o61204
58144I529356n99904n44465m94301m50422m12028l77142l46062l20645l00491
58135E683896k82949k66511k51262k36557k21215k05644j91207j77849j64679
58126C686023j52175j41437j31993j22723j14144j07389j01774r5783q9747q5030
58116B543828q1345p7316p3139p0089o7928o5123o1398n7796n4599n1338m8402
58105A835355m6525m4981m2503l9554l7602l6464l4618l1928k9821k8854k8118
$$ y = [103429222, 90089532, 78897280, 69483937, 61528000, 54755119, 48942641, 43918620, 39548531, 35723035, 32355998, 29382692, 26750579, 24411999, 22325942, 20460630, 18789705, 17288464, 15935942, 14716873, 13618412, 12627131, 11731025, 10921428, 10190560, 9529356, 8929452, 8384987, 7890686, 7440264, 7028236, 6651094, 6305032, 5984387, 5683896, 5400947, 5134436, 4883174, 4646617, 4425402, 4219758, 4028551, 3850702, 3686023, 3533848, 3392411, 3260418, 3137695, 3023551, 2916162, 2814388, 2718605, 2628858, 2543828, 2462483, 2385167, 2312028, 2241939, 2174011, 2108888, 2047490, 1989694, 1935095, 1883757, 1835355, 1788830, 1743849, 1701346, 1661792, 1624190, 1587726, 1553108, 1521180, 1491359, 1462505, 1434387]
58094A434387k7145k6467k6090k5244k3769k2218k0703j9046j7920j8099j8832
58083A188854j8637j7605j7202j7890j8646j8877j9050j9366j9363j9002j8686
58072I84530j8206j7032j5617j4929j4796j4176j3032j2277j1878j0781q834p224
58060H25748o578o242n783n740o401p183p716q385r307r838r605r011q357p408
58046G18194o140n070m510m236m066m063m153m273m778n839o670o357n266m577
58032F48196m593m645m540m770n337n628n572n701n967n786n301n285n650n439
58018E73982m580m183m701n170m817m143l737l191k051q18j95l7J95N19O06L73
58002E38052J7k31j13L74O69J80q09j440j435j120m17J093K988M066L889L199
$$ y = [1434387, 1407242, 1380775, 1354685, 1329441, 1305672, 1283454, 1262751, 1243705, 1225785, 1207686, 1188854, 1170217, 1152612, 1135410, 1117520, 1098874, 1079997, 1060947, 1041581, 1022218, 1003216, 984530, 966324, 949292, 933675, 918746, 903950, 889774, 876742, 864465, 852587, 841806, 832972, 825748, 819170, 812928, 807145, 801405, 795004, 787821, 780105, 771720, 762413, 752575, 742970, 733959, 725602, 718194, 712054, 706984, 702474, 698238, 694172, 690109, 685956, 681683, 676905, 671066, 664396, 658039, 652773, 648196, 643603, 638958, 634418, 629648, 624311, 618683, 613111, 607410, 601443, 595657, 590356, 585071, 579421, 573982, 569402, 565219, 560518, 555348, 550531, 546388, 542651, 539460, 537409, 536591, 536396, 536359, 536554, 537073, 537679, 538052, 538069, 537838, 537725, 538099, 538768, 538948, 538139, 536699, 535264, 534144, 533727, 534820, 537808, 541874, 545763, 548962]
57986E48962K480J278n52k030k307j890j909k703l738m372m224l377k510k372
57972E20736k765k745j952j029n24k24M2l0l98l49M01J105J111P77O54N77K56
57955E15643Q3M37Q45O33K5k79j72kK26P22J230J275J042J234K127L314M438N634
57937E38455P132Q817J0250J0920J0540R317P916O859O016M784K777K03k295m124
57923F17567n151n769o478p404q251q608q185o974n414m141l313k440j197l4N80
57908E44788J110K366M214N672O212O125N638M594L219K287K128K191J878J252
57894E93674O62K08q7j65j78l84o26m50J19M84K69l48j144k068k844l117l115
57877E80890l448m076m218l497k434j623j191j121j338j216nJ960L419L862M087
$$ y = [548962, 551442, 552720, 552168, 550138, 547831, 545941, 544032, 541329, 537591, 533219, 528995, 525618, 523108, 520736, 517971, 515226, 513274, 512245, 511721, 511497, 511539, 511509, 511111, 510762, 511163, 512268, 513379, 514156, 514810, 515387, 515643, 515726, 516163, 517008, 517641, 517666, 517387, 517215, 517213, 517439, 518161, 519391, 520666, 521708, 522942, 525069, 528383, 532821, 538455, 545587, 554404, 564654, 575574, 586114, 595431, 603347, 610206, 616222, 621006, 623783, 623986, 621691, 617567, 612416, 606647, 600169, 592765, 584514, 575906, 567721, 560747, 555333, 551192, 547879, 545439, 544242, 544208, 544788, 545898, 548264, 552478, 558150, 564362, 570487, 576125, 580719, 583938, 586225, 588353, 590544, 592422, 593674, 594336, 594544, 594457, 594292, 594114, 593730, 593104, 592654, 592773, 593257, 593526, 593178, 592034, 589966, 587122, 584005, 580890, 577442, 573366, 569148, 565651, 563217, 561594, 560403, 559282, 557944, 556728, 556723, 558683, 562102, 565964, 570051]
57862E70051M740N428N814O414P495Q225P915P272P378Q034Q175P401O169M791
57848F65302L232J659M05n20j332k060k683l377m127m518m365m186m499n067n304
57833F28560n009m249k975j401k10J46Oj02j34j08L37J328K278K684K820L004
57817F26975K828J977J160J140J408Q34o53k169l375m704o138o878o397m989l125
57802E97894j106N76J322J116N92K33pk70m89n41k60O20K065L428M053M127M403
57785F17756N156O023O754P531Q463R358R999J0294J0112R404Q439P502O498N185
57771G28474L626K036L82j352k770l480l718m026m458m700m745m844m902m556
57757F90967l780k898k097j406r91r39q71l27O28J668K754L845M384L941L100
$$ y = [570051, 574791, 580219, 586033, 592447, 599942, 608167, 616082, 623354, 630732, 638766, 646941, 654342, 660511, 665302, 668534, 670193, 670598, 670078, 668746, 666686, 664003, 660626, 656499, 651981, 647616, 643430, 638931, 633864, 628560, 623551, 619302, 616327, 614926, 614716, 614862, 614868, 614766, 614632, 614524, 614861, 616189, 618467, 621151, 623971, 626975, 629803, 631780, 632940, 634080, 635488, 636322, 635669, 633500, 630125, 625421, 619283, 612405, 606008, 601019, 597894, 596788, 597364, 598686, 599802, 600394, 600627, 600620, 600350, 599861, 599320, 599060, 599680, 601745, 605173, 609226, 613353, 617756, 622912, 628935, 635689, 643220, 651683, 661041, 671040, 681334, 691446, 700850, 709289, 716791, 723289, 728474, 732100, 734136, 734518, 733166, 730396, 726916, 723198, 719172, 714714, 710014, 705269, 700425, 695523, 690967, 687187, 684289, 682192, 680786, 679795, 678856, 677985, 677658, 678286, 679954, 682708, 686553, 690937, 694878, 697978]
57742F97978K873L364L820L928M076M359M315L852L562L762M008L887L613L535
57728G50932L601L635L648L618L412L129L038L048K756K197J952K256K495J988
57714G91705Q82m9l03q5Nm16j150j725k016k292k486j971n07J082J856K026K489
57697G87045L398M036L984L501K771J702N69r1l12o45j153j292r41n71k54N66
57681H02313K049L619N074P016R746J2575J4939J7368K0707K5014K9959L5719
57669I86098M2591N0043N6746O1138O1498N5927M3280K4371K069j9701l7204m8054
57657A278802n2129n1221m7451m2010l5465k8669k2663j8008j4606j2030r715
57646I44835p133m270j792l88l4p9R2O88J497K027J922J454J321J831K584L073
$$ y = [697978, 700851, 704215, 708035, 711963, 716039, 720398, 724713, 728565, 732127, 735889, 739897, 743784, 747397, 750932, 754533, 758168, 761816, 765434, 768846, 771975, 775013, 778061, 780817, 783014, 784966, 787222, 789717, 791705, 792587, 792538, 792235, 792150, 792155, 791739, 790589, 788864, 786848, 784556, 782070, 780099, 779592, 780674, 782530, 784556, 787045, 790443, 794479, 798463, 801964, 804735, 806437, 807006, 806915, 806603, 805958, 804805, 803513, 802572, 802001, 801747, 802313, 804362, 807981, 813055, 820071, 829817, 842392, 857331, 874699, 895406, 920420, 950379, 986098, 1028689, 1078732, 1135478, 1196616, 1258114, 1314041, 1357321, 1381692, 1383761, 1364060, 1326856, 1278802, 1226673, 1175452, 1128001, 1085991, 1050526, 1021857, 999194, 981186, 966580, 954550, 944835, 937702, 933432, 931640, 931252, 931218, 931139, 931231, 931919, 933416, 935443, 937365, 938819, 940140, 941971, 944555, 947628]
57630I47628L249L293L296L362L605L826L650L149K840K885K852K546K406K699
57616I91286L026L072L215L748M191M051L756L995M527M597M220M110M406M403
57602A046603L680K748K285K342K565K753K851K715K269J765J713K427L565M251
57588A084532L835K691J906K101K841L400L705M152M855N498N760N504M777L902
57574A139459L454L708M281M597M494M146L676L266L401M417N922P040P261O803
57560A205925O234O035O350O878P065O718O244O129O388O787P248P756Q143Q387
57546A302287Q835R665J0334J0090Q874P359O153N413N093N150N499O031O630
57533A397413P065P071O740O530O627O702O581O663P281Q080Q583Q831Q922Q512
$$ y = [947628, 950877, 954170, 957466, 960828, 964433, 968259, 971909, 975058, 977898, 980783, 983635, 986181, 988587, 991286, 994312, 997384, 1000599, 1004347, 1008538, 1012589, 1016345, 1020340, 1024867, 1029464, 1033684, 1037794, 1042200, 1046603, 1050283, 1053031, 1055316, 1057658, 1060223, 1062976, 1065827, 1068542, 1070811, 1072576, 1074289, 1076716, 1080281, 1084532, 1088367, 1091058, 1092964, 1095065, 1097906, 1101306, 1105011, 1109163, 1114018, 1119516, 1125276, 1130780, 1135557, 1139459, 1142913, 1146621, 1150902, 1155499, 1159993, 1164139, 1167815, 1171081, 1174482, 1178899, 1184821, 1191861, 1199122, 1205925, 1212159, 1218194, 1224544, 1231422, 1238487, 1245205, 1251449, 1257578, 1263966, 1270753, 1278001, 1285757, 1293900, 1302287, 1311122, 1320787, 1331121, 1341211, 1350085, 1357444, 1363597, 1369010, 1374103, 1379253, 1384752, 1390783, 1397413, 1404478, 1411549, 1418289, 1424819, 1431446, 1438148, 1444729, 1451392, 1458673, 1466753, 1475336, 1484167, 1493089, 1501601]
57519A501601P586P138Q081R774J0760J0736J0644J0888J0804J0108R588R798
57507A617506J0040R428Q193P215O886P035P542Q287Q835Q793Q324P914P850Q123
57493A731971Q591Q868Q493P594P044P513Q587R250R061Q413P880P737Q025Q615
57479A847642R232R646R924J0284J0782J1260J1508J1435J1180J1159J1674J2476
57467A978202J2990J3118J3317J3737J3780J3036J2132J2037J2753J3397J3492
57456B121991J3480J3861J4352J4244J3278J1942J1013J0856J1142J1242J1032
57445B258433J1117J1975J3167J3792J3663J3435J3588J3806J3647J3308J3354
57434B403285J3965J4799J5360J5245J4294J2881J1896J2041J3133J4355J5151
$$ y = [1501601, 1509187, 1516325, 1524406, 1534180, 1544940, 1555676, 1566320, 1577208, 1588012, 1598120, 1607708, 1617506, 1627546, 1636974, 1645167, 1652382, 1659268, 1666303, 1673845, 1682132, 1690967, 1699760, 1708084, 1715998, 1723848, 1731971, 1740562, 1749430, 1757923, 1765517, 1772561, 1780074, 1788661, 1797911, 1806972, 1815385, 1823265, 1831002, 1839027, 1847642, 1856874, 1866520, 1876444, 1886728, 1897510, 1908770, 1920278, 1931713, 1942893, 1954052, 1965726, 1978202, 1991192, 2004310, 2017627, 2031364, 2045144, 2058180, 2070312, 2082349, 2095102, 2108499, 2121991, 2135471, 2149332, 2163684, 2177928, 2191206, 2203148, 2214161, 2225017, 2236159, 2247401, 2258433, 2269550, 2281525, 2294692, 2308484, 2322147, 2335582, 2349170, 2362976, 2376623, 2389931, 2403285, 2417250, 2432049, 2447409, 2462654, 2476948, 2489829, 2501725, 2513766, 2526899, 2541254, 2556405]
57423B556405J5557J5774J5815J5685J5568J5604J5683J5610J5401J5292J5485
57412B727879J5989J6601J7103J7521J8136J9018J9676J9485J8506J7501J7088
57401B924503J7164J7357J7582J7853J7988J7895J7902J8305J8810J8956J8946
57390C123261J9406K0310K0824K0461J9833J9823K0458K1036K1080K0720K0287
57379C347499J9919J9593J9203J8583J7692J6847J6539J6933J7635J8088J8135
57368C546666J8097J8263J8443J8259J7826J7841J8753K0098K1012K1244K1316
57357C757818K1707K2346K2929K3380K3737K3921K3870K3735K3789K4129K4572
57346D015933K4772K4474K3811K3226K2933K2648K2087K1533K1486K1942K2470
$$ y = [2556405, 2571962, 2587736, 2603551, 2619236, 2634804, 2650408, 2666091, 2681701, 2697102, 2712394, 2727879, 2743868, 2760469, 2777572, 2795093, 2813229, 2832247, 2851923, 2871408, 2889914, 2907415, 2924503, 2941667, 2959024, 2976606, 2994459, 3012447, 3030342, 3048244, 3066549, 3085359, 3104315, 3123261, 3142667, 3162977, 3183801, 3204262, 3224095, 3243918, 3264376, 3285412, 3306492, 3327212, 3347499, 3367418, 3387011, 3406214, 3424797, 3442489, 3459336, 3475875, 3492808, 3510443, 3528531, 3546666, 3564763, 3583026, 3601469, 3619728, 3637554, 3655395, 3674148, 3694246, 3715258, 3736502, 3757818, 3779525, 3801871, 3824800, 3848180, 3871917, 3895838, 3919708, 3943443, 3967232, 3991361, 4015933, 4040705, 4065179, 4088990, 4112216, 4135149, 4157797, 4179884, 4201417, 4222903, 4244845, 4267315]
57335D267315K2932K3467K3871K3748K3295K3279K3886K4367K4163K3650K3370
57324D527343K3197K2846K2636K3013K3741K4215K4321K4349K4321K4095K3871
57313D787948K4000K4334K4393K4110K3924K4117K4506K4746K4679K4395K4207
57302E055359K4417K4879K5096K4958K4950K5293K5422K4868K4175K4155K4640
57291E328212K4808K4512K4389K4676K4807K4339K3513K2763K2263K2140K2466
57280E588888K2918K2978K2632K2293K2000K1349K0377J9772J9885K0146J9926
57269E823164J9415J9223J9440J9615J9399J8804J8027J7323J6981J7118J7496
57258F026005J7711J7533J7021J6404J5947J5782J5791J5700J5300J4570J3663
$$ y = [4267315, 4290247, 4313714, 4337585, 4361333, 4384628, 4407907, 4431793, 4456160, 4480323, 4503973, 4527343, 4550540, 4573386, 4596022, 4619035, 4642776, 4666991, 4691312, 4715661, 4739982, 4764077, 4787948, 4811948, 4836282, 4860675, 4884785, 4908709, 4932826, 4957332, 4982078, 5006757, 5031152, 5055359, 5079776, 5104655, 5129751, 5154709, 5179659, 5204952, 5230374, 5255242, 5279417, 5303572, 5328212, 5353020, 5377532, 5401921, 5426597, 5451404, 5475743, 5499256, 5522019, 5544282, 5566422, 5588888, 5611806, 5634784, 5657416, 5679709, 5701709, 5723058, 5743435, 5763207, 5783092, 5803238, 5823164, 5842579, 5861802, 5881242, 5900857, 5920256, 5939060, 5957087, 5974410, 5991391, 6008509, 6026005, 6043716, 6061249, 6078270, 6094674, 6110621, 6126403, 6142194, 6157894, 6173194, 6187764, 6201427]
57247F201427J2887J2496J2376J2042J1259J0385R842R483Q821P750O635N779
57235F321182N179M711M187L384K405J815J976K385K249J626J357J853K515K512
57221F359336J625K68q86j190l61J173K487K858K199R74r9n07m47p27j830l311
57205F361562m426n045n457n728n876o364p568r068j0223j1193j2484j3688j3864
57192F250578j3176j3061j4366j6237j7318j7198j6342j5239j4159j3292j2717
57181F087473j2480j2764j3539j4109j3657j2316j1095j0675j0927j1543j2326
57170E952042j2861j2719j2245j2359j3426j4958j6438j7670j8369j8413j8469
57159E784115j9304k0417k0465j9249j8031j7681j7833j8112j8812j9816k0406
$$ y = [6201427, 6214314, 6226810, 6239186, 6251228, 6262487, 6272872, 6282714, 6292197, 6301018, 6308768, 6315403, 6321182, 6326361, 6331072, 6335259, 6338643, 6341048, 6342863, 6344839, 6347224, 6349473, 6351099, 6352456, 6354309, 6356824, 6359336, 6360961, 6361229, 6360343, 6359153, 6358792, 6359965, 6362452, 6365310, 6367509, 6368483, 6368384, 6367877, 6367430, 6366703, 6364873, 6361562, 6357136, 6352091, 6346634, 6340906, 6335030, 6328666, 6321098, 6312030, 6301807, 6290614, 6278130, 6264442, 6250578, 6237402, 6224341, 6209975, 6193738, 6176420, 6159222, 6142880, 6127641, 6113482, 6100190, 6087473, 6074993, 6062229, 6048690, 6034581, 6020924, 6008608, 5997513, 5986838, 5975911, 5964368, 5952042, 5939181, 5926462, 5914217, 5901858, 5888432, 5873474, 5857036, 5839366, 5820997, 5802584, 5784115, 5764811, 5744394, 5723929, 5704680, 5686649, 5668968, 5651135, 5633023, 5614211, 5594395, 5573989]
57148E573989k0772k2289k5466k8984l1742l4457l8034m1694m4186m5824m7755
57137E192786m9965n1527n2279n2769n2896n1912m9655m6699m3418l9861l6324
57126D665481l3233l0637k8499k7127k6616k6351k5805k5343k5481k5835k5510
57115D365044k3954k0771j5359p589J772J2045K3382L5796M8355O0362P2702Q7222
57103D639007J05486J28882J59005J97191K44621L03637L77854M70291N82699
57094G208673P17171Q76023J058490J259145J470340J683536J886831K064492
57086A8224701K200766K280656K286504K204708K047077J860543J698518J573942
57078C4377415J445993J257328R79147O18764J96433k70414p61506j245392j683675
$$ y = [5573989, 5553217, 5530928, 5505462, 5476478, 5444736, 5410279, 5372245, 5330551, 5286365, 5240541, 5192786, 5142821, 5091294, 5039015, 4986246, 4933350, 4881438, 4831783, 4785084, 4741666, 4701805, 4665481, 4632248, 4601611, 4573112, 4545985, 4519369, 4493018, 4467213, 4441870, 4416389, 4390554, 4365044, 4341090, 4320319, 4304960, 4297371, 4299143, 4311188, 4334570, 4370366, 4418721, 4479083, 4551785, 4639007, 4744493, 4873375, 5032380, 5229571, 5474192, 5777829, 6155683, 6625974, 7208673, 7925844, 8801867, 9860357, 11119502, 12589842, 14273378, 16160209, 18224701, 20425467, 22706123, 24992627, 27197335, 29244412, 31104955, 32803473, 34377415, 35823408, 37080736, 38059883, 38678647, 38875080, 38604666, 37843160, 36597768, 34914093]
57069C4914093k041706k295671k435828k467746k409193k283120k112207j917305
57061A6951317j716338j522195j342591j182469j045064r30422q34998p54184
57053G623056o84611o23936n69912n20600m74699m31153l89266l49411l12751
57044C266717k79885k50458k24173k01289j81800j64973j49950j36266j23653
57035A554270j11885j00805q9949p8350o5369n1350l6627k0299j316J9165L7314
57024A054799M8406M8250L3937N807l0360o4908q9737j02420j05137j01063r2566
57013F05008q1617p0073n9269m9858m2110l6025l1280k7461k4255k1437j8864
57002A42759j6585j4678j3006j1444j0233r615r189q191o504m717l178j560N18
$$ y = [34914093, 32872387, 30576716, 28140888, 25673142, 23263949, 20980829, 18868622, 16951317, 15234979, 13712784, 12370193, 11187724, 10142660, 9212238, 8377240, 7623056, 6938445, 6314509, 5744597, 5223997, 4749298, 4318145, 3928879, 3579468, 3266717, 2986832, 2736374, 2512201, 2310912, 2129112, 1964139, 1814189, 1677923, 1554270, 1442385, 1341580, 1251631, 1173281, 1107912, 1056562, 1019935, 999636, 998320, 1017485, 1054799, 1103205, 1151455, 1185392, 1191199, 1160839, 1095931, 1006194, 903774, 798637, 697574, 605008, 523391, 453318, 394049, 344191, 302081, 266056, 234776, 207315, 183060, 161623, 142759, 126174, 111496, 98490, 87046, 76813, 67198, 58009, 49818, 43314, 38597, 35419, 33859, 34377]
56989C4377L036N954R356J2981J6179J8542K0083K0495J8922J4927R259L293k018
56976A85386o378r712j1926j2898j2577j1167r219p204n072k608l8K250M500P297
56962A10634J0563J3592J6287J9343K2789K5276K5299K2511J7269R735L50r322
56950B84326j7224k2213k4343k4097k2047j9041j5930j2921r669n996k156J546
56938A10235M986Q157J1252J4724J8911K3568K7947L1117L1999K9480K3154J3832
56926C49362L064p781j7532k4841k8679k9367k8394k6941k5026k2295j9050j6044
56914A06476j3659j1737j0078q649p367o128n057m436m201l796k754j322j60M84
56900B7616R89J598J948J723J499K286M252O456Q064R303J0983J3487J6572J9692
$$ y = [34377, 37413, 43367, 52723, 65704, 81883, 100425, 120508, 141003, 159925, 174852, 184111, 187404, 185386, 179008, 169296, 157370, 144472, 131895, 120728, 111509, 104305, 99233, 96625, 96587, 98837, 103337, 110634, 121197, 134789, 151076, 170419, 193208, 218484, 243783, 266294, 283563, 293298, 293648, 284326, 267102, 244889, 220546, 196449, 174402, 155361, 139431, 126510, 116841, 110845, 108689, 110235, 115221, 123378, 134630, 149354, 168265, 191833, 219780, 250897, 282896, 312376, 335530, 349362, 352426, 344645, 327113, 302272, 273593, 244226, 215832, 188891, 163865, 141570, 122520, 106476, 92817, 81080, 71002, 62353, 54986, 48858, 43801, 39365, 35164, 31368, 28614, 27292, 27132, 27616, 28605, 30203, 32151, 33874, 35373, 37659, 41911, 48367, 56431, 65734, 76717, 90204, 106776, 126468]
56886A26468K2038K2616K0882J7258J2595P316J560m011q262j0592j1359j1139
56874A85370j0024p932n177k370K05K831N994R831J3917J7721K1440K6022L1896
56861B89724L7903M2088M3499M2320L8208K9764J6579J015j3155k3660l0451l3992
56849D39842l4139l0985k5612j9416j3212p357j963L498J0087J8183K6805L4843
56837D00574M2495N0682N9362O7170P2406P3348O7740N3508L0933L660k3088m5109
56825H53681o0210o7734o8236o3455n5707m6915l8160k9875k2010j4206o230J711
56813C82654R317J6680K4151L1828L9530M6961N3237N6240N3145M2229K4297K463
56801G82732j9216l7148m9151n4875n5505n2837m8346m2873l6778l0321k3844
$$ y = [126468, 148506, 171122, 192004, 209262, 221857, 229173, 230733, 226722, 218460, 207868, 196509, 185370, 175346, 167414, 162237, 159867, 160072, 162903, 168897, 178728, 192645, 210366, 231806, 257828, 289724, 327627, 369715, 413214, 455534, 493742, 523506, 540085, 541100, 527945, 504285, 473834, 439842, 405703, 374718, 349106, 329690, 316478, 309121, 307158, 310656, 320743, 338926, 365731, 400574, 443069, 493751, 553113, 620283, 692689, 766037, 833777, 887285, 918218, 921878, 898790, 853681, 793471, 725737, 657501, 594046, 538339, 491424, 453264, 423389, 401379, 387173, 380943, 382654, 391971, 408651, 432802, 464630, 504160, 551121, 604358, 660598, 713743, 755972, 780269, 782732, 763516, 726368, 677217, 622342, 566837, 514000, 465654, 422781, 386003, 355682, 331838]
56790C31838j7744j2231p246k659J612N778J0268J5250K0143K3864K5463K4257
56778D18593J9615J1314K89j1369k1513k8902l3186l4568l3749l1773k9387k6616
56766A98748k3201j9242j5309j2094j0141r492r393q726p165n529m661m350l893
56753F5552l238k869k766k393j675j170j118j121r17p03m29K94J175J101k77j599
56737D7847j424j92N24K57n1J90N24O18Q50J311J312N58j54r6L26M53N69J277
56719E4699K254K642K348K005J839J540J169J119J205P51j85o54j75N38O79M05
56703G2179L27M90N08K72l7l79q19j242j357r39Q2J421K347K258J525J058R52
56686G8646L25j065k042j608n17j85n78m32O68J671J644Q68K6o87j261j435j104
$$ y = [331838, 314094, 301863, 294617, 291958, 293570, 299348, 309616, 324866, 345009, 368873, 394336, 418593, 438208, 449522, 449811, 438442, 416929, 388027, 354841, 320273, 286524, 254751, 225364, 198748, 175547, 156305, 140996, 128902, 118761, 109269, 99876, 91150, 83985, 78456, 73795, 69445, 65552, 62314, 59445, 56679, 54286, 52611, 51441, 50323, 49202, 48285, 47582, 47153, 47447, 48622, 49723, 49446, 47847, 46423, 46231, 46755, 47012, 46961, 47151, 47675, 48293, 49143, 50454, 51766, 52324, 52170, 52074, 52400, 52853, 53422, 54699, 56953, 59595, 61943, 63948, 65787, 67327, 68496, 69615, 70820, 71571, 71386, 70732, 70557, 71095, 71774, 72179, 72506, 72996, 73504, 73776, 73739, 73360, 72541, 71299, 69942, 69003, 69085, 70506, 72853, 75111, 76636, 77694, 78646, 78971, 77906, 75864, 74256, 73739, 73554, 72976, 72544, 73212, 74883, 76527, 77395, 77421, 76734, 75473, 74038, 72934]
56669G2934n38J66J261K526K970J999M30l54Q4J091J950K353K125J335O75R33
56653I1940J905K503K189J669J723K024J686O63k10m16k91k63k08Q6L62J95l57
56636A05200q76j108j042o99j70K47L41L03L01k9j087k395k902k364j708j694
56620I0318j896j486m99L17N38L13j58p98j294j209n51J67N38N99N50M74L99M31
56602H6753O82J148J640J774J259L58k09m8M13N24K16r0j40LL00P15J005R63P85
56583I8051P74Q35O92M97O45J030J118Q25O69R10J147J038R26J332K246L285M260
56566A20280N267O360P438Q338R010R595J0436J1706J3045J3766J3447J2108R939
56553B50735P212M477K339R36l7p25r87r38j046j553k187k660l006l221l093k717
$$ y = [72934, 72396, 72562, 73823, 76349, 79319, 81318, 81748, 81394, 81478, 82569, 84519, 86872, 88997, 90332, 91007, 91940, 93845, 96348, 98537, 100206, 101929, 103953, 105639, 106302, 106092, 105676, 105385, 105122, 104914, 105000, 105362, 105557, 105200, 104324, 103216, 102174, 101475, 101305, 101552, 101893, 102196, 102497, 102468, 101381, 98986, 96084, 93720, 92012, 90318, 88422, 86936, 86437, 86754, 87292, 87605, 87447, 86649, 85355, 84146, 83595, 83762, 84300, 84899, 85449, 85923, 86322, 86753, 87435, 88583, 90223, 91997, 93256, 93614, 93405, 93357, 93770, 94294, 94510, 94420, 94280, 94283, 94583, 95298, 96303, 97266, 98051, 98825, 99660, 100352, 100849, 101494, 102524, 103642, 104467, 105136, 106046, 107193, 108231, 109157, 110489, 112735, 116020, 120280, 125547, 131907, 139345, 147683, 156693, 166288, 176724, 188430, 201475, 215241, 228688, 240796, 250735, 257947, 262424, 264763, 265699, 265662, 264937, 263950, 263012, 261966, 260413, 258226, 255566, 252560, 249339, 246246, 243529]
56537B43529k695l394m380m979n101n157n396n693n797n430m440l158k329k332
56523A83248k712k881k905l168l487l282k469j672j477j903k613l189l180k436
56509A45874j444q93p98n14K17P15K73q33j681j819j557j290j082r38r60j068
56493A32202r18m08N9J63J48L57N00M3p56q77R4J294J692J396J265J569J699J243
56475A40765O35N91J222J884J759O18q01j301m13J014J743J481Q83M37j8n98q99
56458A49002n51J90O95O15J16l26k85K06O19N34K01J30K96L01J96M39R65J149
56440A54492Q72P98J188J232K66j037j473r13l16l09n40l68K93R88J195P60Q7
56423A57215k02M0L70M73N84R17J147R64P95J221J907J875Q36l80q41m58K62Q82
$$ y = [243529, 240834, 237440, 233060, 228081, 222980, 217823, 212427, 206734, 200937, 195507, 191067, 187909, 185580, 183248, 180536, 177655, 174750, 171582, 168095, 164813, 162344, 160672, 159195, 157292, 154679, 151490, 148310, 145874, 144430, 143537, 142739, 142225, 142442, 143157, 143430, 142597, 140916, 139097, 137540, 136250, 135168, 134230, 133270, 132202, 131284, 130876, 130935, 131098, 131246, 131603, 132103, 132146, 131390, 130513, 130607, 131901, 133593, 134989, 136254, 137823, 139522, 140765, 141400, 141991, 143213, 145097, 146856, 147474, 146673, 145372, 144959, 145973, 147716, 149197, 150080, 150517, 150499, 149901, 149002, 148451, 148641, 149336, 149951, 150067, 149741, 149456, 149662, 150281, 150815, 151016, 151146, 151442, 151743, 151939, 152378, 153343, 154492, 155364, 156162, 157350, 158582, 158848, 157811, 156338, 155425, 155109, 154800, 154260, 153892, 154185, 155173, 156368, 157128, 157215, 157013, 157053, 157423, 157896, 158480, 159397, 160544, 161508, 162303, 163524, 165431, 167306, 168142, 167762, 166921, 166463, 166725, 167607]
56405A67607J203J099N36l10j041j212o10M30J181J239J001J137J709K151K110
56390A78230J825J617J414J044O55N02N35N18M72O77J100J224O98l1j79L06O46
56373A91253L67K8L79J224J736J663J474J387J042L43j23J50Q62J365J444J318
56357B05912J247J390J750K003J793J341J245J510J414O94J62N21J246J326P72
56342B24326M55P47J106J023O80N43Q04J326J808J933J674J444J676K330L015
56327B44890L445L588L561L587L816L953L470K472J827J992K211J532K95k36M35
56312B80838J456J777J299O88N91J199K229L215L924M460M920N151N073M877M616
56297C26313M035L125K412K244K236K027K025K757L841M558N062O059P408Q078
$$ y = [167607, 168810, 169909, 170445, 170135, 169094, 167882, 167272, 167702, 168883, 170122, 171123, 172260, 173969, 176120, 178230, 180055, 181672, 183086, 184130, 184785, 185287, 185822, 186340, 186812, 187489, 188589, 189813, 190511, 190480, 190301, 190607, 191253, 191620, 191648, 192027, 193251, 194987, 196650, 198124, 199511, 200553, 200896, 200773, 200923, 201785, 203150, 204594, 205912, 207159, 208549, 210299, 212302, 214095, 215436, 216681, 218191, 219605, 220299, 220461, 220982, 222228, 223554, 224326, 224781, 225528, 226634, 227657, 228337, 228880, 229684, 231010, 232818, 234751, 236425, 237869, 239545, 241875, 244890, 248335, 251923, 255484, 259071, 262887, 266840, 270310, 272782, 274609, 276601, 278812, 280344, 280639, 280403, 280838, 282294, 284071, 285370, 286058, 286649, 287848, 290077, 293292, 297216, 301676, 306596, 311747, 316820, 321697, 326313, 330348, 333473, 335885, 338129, 340365, 342392, 344417, 347174, 351015, 355573, 360635, 366694, 374102, 382180]
56283C82180P626O822O573O981P678Q413R001R252R291R542J0205J1093J2030
56270D96687J3017J3959J4720J5539J6917J8978K1366K3782K6223K8725L1398
56259G21311L4687L8957M3871M8756N3752N9876O7730P6662Q5508R3756J01722
56248A426588J09914J18376J26358J32581J36107J37011J35752J32073J25112
56239B579872J14603J01239Q5630O7605M6990K4589J899j9875m0156n8556p4505
56228B829335q7423r7139j04016j08619j11214j11812j10676j08422j05404j01471
56218A783139r6626r1512q6727q2055p6998p1601o6264o1060n6012n1582m8078
56207I94624m4917m1284l7311l3704l0510k7339k4450k2426k0895j8840j6281
$$ y = [382180, 389806, 396628, 403201, 410182, 417860, 426273, 435274, 444526, 453817, 463359, 473564, 484657, 496687, 509704, 523663, 538383, 553922, 570839, 589817, 611183, 634965, 661188, 689913, 721311, 755998, 794955, 838826, 887582, 941334, 1001210, 1068940, 1145602, 1231110, 1324866, 1426588, 1536502, 1654878, 1781236, 1913817, 2049924, 2186935, 2322687, 2454760, 2579872, 2694475, 2795714, 2881344, 2948949, 2995939, 3020528, 3022427, 3002552, 2962396, 2903840, 2829335, 2741912, 2644773, 2540757, 2432138, 2320924, 2209112, 2098436, 1990014, 1884610, 1783139, 1686513, 1595001, 1508274, 1426219, 1349221, 1277620, 1211356, 1150296, 1094284, 1042702, 994624, 949707, 908423, 871112, 837408, 806898, 779559, 755109, 732683, 711788, 692948, 676667]
56196F76667j4313j3298j2339j0849r388q383p324n941m984m980n172m595l505
56183E71596k782k580k418k128j925j818j639j402j027j09J539L304M293M258
56169E67162L678L247L388M069M806N220N600O535P980R290J0179J0993J1946
56156F54093J2908J4030J5642J7371J8415J9080K0879K4552K9110L3608L8787
56145H98475M5908N4820O4386P4263Q5059R6870J08555J18340J24403J25130J19802
56134A916011J09228R5488Q1076O8384N9201N3758N0420M6905M1780L4657K5503
56123B582411J4603K997p762j6612k3720l0431l8633m9676o3445p8449r2773j04717
56111B093793j12796j15959j14231j08609j00199q9771p8194o6563n5698m6043
$$ y = [676667, 662354, 649056, 636717, 625868, 616480, 608097, 600773, 594832, 589848, 584868, 579696, 575101, 571596, 568814, 566234, 563816, 561688, 559763, 557945, 556306, 554904, 553877, 553768, 555307, 558611, 562904, 567162, 570840, 574087, 577475, 581544, 586350, 591570, 597170, 603705, 611685, 620975, 631154, 642147, 654093, 667001, 681031, 696673, 714044, 732459, 751539, 772418, 796970, 826080, 859688, 898475, 944383, 999203, 1063589, 1137852, 1222911, 1319781, 1428336, 1546676, 1671079, 1796209, 1916011, 2025239, 2120727, 2201803, 2270187, 2329388, 2383146, 2433566, 2480471, 2522251, 2556908, 2582411, 2597014, 2600011, 2592249, 2575637, 2551917, 2521486, 2482853, 2433177, 2369732, 2291283, 2198510, 2093793, 1980997, 1865038, 1750807, 1642198, 1541999, 1452228, 1374034, 1307471, 1251773, 1205730]
56101A205730l8016l1716k6355k0983j5866j2060r557p168m515k591j779q28J184
56088A035480L273M080L895L875M236M521M877N743O815P526Q094Q977R889J0351
56074A121632J0726J1573J2532J3038J3579J5016J6928J8004J7929J7716J8091
56063A286764J8643J8695J8217J7643J7311J7262J7211J6889J6495J6524J6959
56052A478613J7251J7350J7952J9307K0627K1215K1384K1701K2108K2474K3127
56041A703109K4169K5123K5879K7050K8778L0276L1358L3105L6097L9183M1226
56030B045353M2874M5269M8103N0284N1651N2643N3178N3170N3376N4454N5948
56019B606303N7378N9319O2187O5032O6911O8451P0728P3661P6841Q0674Q5213
$$ y = [1205730, 1167714, 1135998, 1109643, 1088660, 1072794, 1060734, 1051177, 1044009, 1039494, 1036903, 1035124, 1034296, 1035480, 1038753, 1042833, 1046728, 1050603, 1054839, 1059360, 1064237, 1069980, 1076795, 1084321, 1092415, 1101392, 1111281, 1121632, 1132358, 1143931, 1156463, 1169501, 1183080, 1198096, 1215024, 1233028, 1250957, 1268673, 1286764, 1305407, 1324102, 1342319, 1359962, 1377273, 1394535, 1411746, 1428635, 1445130, 1461654, 1478613, 1495864, 1513214, 1531166, 1550473, 1571100, 1592315, 1613699, 1635400, 1657508, 1679982, 1703109, 1727278, 1752401, 1778280, 1805330, 1834108, 1864384, 1895742, 1928847, 1964944, 2004127, 2045353, 2088227, 2133496, 2181599, 2231883, 2283534, 2336177, 2389355, 2442525, 2495901, 2550355, 2606303, 2663681, 2723000, 2785187, 2850219, 2917130, 2985581, 3056309, 3129970, 3206811, 3287485, 3372698]
56008C372698Q9190R1906R4828R9512J05193J10315J15177J21015J27668J34302
55998D461804J41316J49351J57570J65106J73038J82603J92730K01875K11109
55989F036502K22671K36498K51016K66476K84622L05790L29125L54936L84084
55980H671720M15925M49612M86518N28603N75531O26382O83010P48445Q23244
55971A4008990R07043J002609J114708J246141J398758J577519J790077K043937
55963B5089782K348420K718818L175673L742859M451230N341695O458782P841970
55955F1169229R526522J1548199J3940845J6732534J9946216K3583731K7563182
55948A84010458L1608074L5117178L7080143L6175933L1206006K1797011Q941154
$$ y = [3372698, 3461888, 3553794, 3648622, 3748134, 3853327, 3963642, 4078819, 4199834, 4327502, 4461804, 4603120, 4752471, 4910041, 5075147, 5248185, 5430788, 5623518, 5825393, 6036502, 6259173, 6495671, 6746687, 7013163, 7297785, 7603575, 7932700, 8287636, 8671720, 9087645, 9537257, 10023775, 10552378, 11127909, 11754291, 12437301, 13185746, 14008990, 14916033, 15918642, 17033350, 18279491, 19678249, 21255768, 23045845, 25089782, 27438202, 30157020, 33332693, 37075552, 41526782, 46868477, 53327259, 61169229, 70695751, 82243950, 96184795, 112917329, 132863545, 156447276, 184010458, 215618532, 250735710, 287815853, 323991786, 355197792, 376994803, 385935957]
55941C85935957n142910j7883443k7392589l2981430l4979409l4229575l1679599
55934B01647002k8178433k4383587k0722918j7421599j4571106j2184144j0222069
55927G3963146q620515p316778o258959n399029m691985m103524l610216l191814
55919C0770326k830080k514097k239150j999442j786926j596595j427372j277640
55911A5099024j144307j025968r22617q32402p52248o81187o19717n66535n19184
55902H034859m77044m40489m07979l77207l48214l22251k98481k75048k52452
55893D835694k32607k15284j98665j82753j69039j57288j45724j34044j23376
55884C276914j13650j03896r4816q8282q4437q1945q0702q1550q3502q4130q2837
$$ y = [385935957, 380793047, 362909604, 335517015, 302535585, 267556176, 233326601, 201647002, 173468569, 149084982, 128362064, 110940465, 96369359, 84185215, 73963146, 65342631, 58025853, 51766894, 46367865, 41675880, 37572356, 33962140, 30770326, 27940246, 25426149, 23186999, 21187557, 19400631, 17804036, 16376664, 15099024, 13954717, 12928749, 12006132, 11173730, 10421482, 9740295, 9120578, 8554043, 8034859, 7557815, 7117326, 6709347, 6332140, 5983926, 5661675, 5363194, 5088146, 4835694, 4603087, 4387803, 4189138, 4006385, 3837346, 3680058, 3534334, 3400290, 3276914, 3163264, 3059368, 2964552, 2876270, 2791833, 2709888, 2629186, 2547636, 2464134, 2380004, 2297167]
55873B297167q1131p9596p7162p3574p0041o6988o3416n9021n4834n1371m7995
55862A572038m4445m1258l8468l5586l2946l1347l0311k8660k6734k6097k6873
55851A209313k7424k6936k6305k6122k5783k5109k4891k5252k5150k4162k3053
55840I29126k2097k0527j8310j6701j6221j5700j4261j2721j2005j1579j0597
55829G58407r487r106r205q866p939p126p003p673q929j0268j1086j1222j0966
55816F39531j0460r609q608p775o885n421l593k115j011L78K023L048L193L317
55802E96013L944M482M426M235M288L908K307k72l129o122r233j1686j2458j1559
55788E69144r983q594p572o865o608p077q420j0475j2637j4109j4469j3852j2572
$$ y = [2297167, 2216036, 2136440, 2059278, 1985704, 1915663, 1848675, 1785259, 1726238, 1671404, 1620033, 1572038, 1527593, 1486335, 1447867, 1412281, 1379335, 1347988, 1317677, 1289017, 1262283, 1236186, 1209313, 1181889, 1154953, 1128648, 1102526, 1076743, 1051634, 1026743, 1001491, 976341, 952179, 929126, 907029, 886502, 868192, 851491, 835270, 819570, 805309, 792588, 780583, 769004, 758407, 748920, 739814, 730609, 721743, 713804, 706678, 699675, 692002, 683073, 672805, 661719, 650497, 639531, 629071, 619462, 610854, 603079, 596194, 590773, 587180, 585065, 584054, 584432, 586455, 589503, 592696, 596013, 599957, 604439, 608865, 613100, 617388, 621296, 623603, 623331, 620202, 614080, 604847, 593161, 580703, 569144, 559161, 550567, 542995, 536130, 529522, 522445, 514025, 503550, 490913, 476804, 462335, 448483, 435911]
55775D35911j0824q791o729m833l266k268j934j859j496r02p99j735l408m956
55761C82111n688n595n265n179n059m272k998k340k840l552l293k258j520j415
55747C30837j444j562k340l920n745p351q535q813p790o109m987m627m096k929
55733B60589j758j061n20l5k71j436k559k759k443k423k602k419k067k217k763
55718B33256k819k023j083q13j118j254q18k02l5l75o83o22m33l72j31O19J459
55701B22553J554O29q86k494l744m018l008j501p92j191j737j577r41n48o27p87
55685B00885m18Q34K596L853M015L670L641L595K651J123L56O77Q42K4r37r92
55669B26415n59p00j338j359j86J596L015L638L764M016M636N097M708L556K382
$$ y = [435911, 425087, 416296, 409567, 404734, 401468, 399200, 397266, 395407, 393911, 393009, 392210, 390475, 387067, 382111, 376423, 370828, 365563, 360384, 355325, 351053, 348055, 345715, 342875, 339323, 336030, 333772, 332252, 330837, 329393, 327831, 325491, 321571, 315826, 308475, 299940, 291127, 283337, 277228, 272241, 267614, 263518, 260589, 258831, 257770, 257250, 257215, 256944, 255508, 252949, 250190, 247747, 245324, 242722, 240303, 238236, 236019, 233256, 230437, 228414, 227331, 226518, 225400, 224146, 223328, 223126, 223091, 222716, 222033, 221411, 220978, 220606, 220475, 221094, 222553, 224107, 224736, 223850, 221356, 217612, 213594, 210586, 209085, 208293, 207102, 205365, 203788, 202847, 202299, 201672, 200885, 200467, 201301, 203897, 207750, 211765, 215435, 219076, 222671, 225322, 226445, 226801, 227478, 228320, 228344, 227407, 226415, 225856, 225156, 223818, 222459, 222273, 223869, 226884, 230522, 234286, 238302, 242938, 248035, 252743, 256299, 258681]
55654B58681J584R90N76N22M77k87j703k884l552m475o019p344p670p383p128
55639B14385o785o171n841o141o236n202l449k048j141k38M17N2j153k005j851
55624A66593j232q56p43o41n22m62m65o37j134j820k328k478k416k319k235k144
55608A44161j940j438o33J68O09N58Q6n26q21o21m58r30j637j605q55n80j328
55591A32210k110j948j261q33m30M57J289J237P26Q41J595K032J933K022K570
55576A40330L014L215L821N104O428P213P570P668P276O350N305M304K915Q93
55562B11406j259k887l937m725n399n859o041o011n900n743n276m165k686j780
55548A49738j909k258j792p43j95m09n91k69J44L67P61J458J839J440O14j01o74
$$ y = [258681, 260265, 261255, 261831, 262353, 262830, 262543, 260840, 257956, 254404, 249929, 243910, 236566, 228896, 221513, 214385, 207600, 201429, 195588, 189447, 183211, 178009, 174560, 172512, 171371, 171133, 171550, 171602, 170449, 168444, 166593, 165361, 164505, 163762, 163121, 162599, 162137, 161672, 161035, 159901, 158081, 155753, 153275, 150859, 148540, 146305, 144161, 142221, 140783, 140150, 140318, 140927, 141485, 141571, 141045, 140224, 139603, 139145, 138215, 136578, 134973, 134118, 133538, 132210, 130100, 128152, 126891, 126058, 125628, 126085, 127374, 128611, 129337, 130178, 131773, 133805, 135738, 137760, 140330, 143344, 146559, 150380, 155484, 161912, 169125, 176695, 184363, 191639, 197989, 203294, 207598, 210513, 211406, 210147, 207260, 203323, 198598, 193199, 187340, 181299, 175288, 169388, 163645, 158369, 154204, 151518, 149738, 147829, 145571, 143779, 143036, 142841, 142432, 141841, 141572, 141716, 142083, 142844, 144302, 146141, 147581, 148195, 148094, 147420]
55531A47420j176j406j378j612k329k903k675j968j677k083k689l007l037k936
55517A16544k703k266j695j221j041j106j127r21o99p77j087j229j015o59m81
55502I8517o14r29j095q29l32j67m24m22L10J201J411J048P88O46J75m24m65o4
55484I8331n0m84m79J88N14j27r63j070o02j15M66J240J625J141L37om2l63q45
55465I8696r76q60j015j375j425j056n82q3M65O82J76o48j009p65l10L15J318
55448I1548K283K322J225k66j417k071k220j772r25j56L48P86J168J209Q66M85
55432I3413K89K46M51J027J603J488O26k38n07l72k66k05K1M16Q49J197J253Q12
55414A02103N6m84n41l66k99l73m97o35o48l10L76J081J456J274M00r15j841j654
$$ y = [147420, 146244, 144838, 143460, 141848, 139519, 136616, 133941, 131973, 130296, 128213, 125524, 122517, 119480, 116544, 113841, 111575, 109880, 108659, 107618, 106512, 105385, 104464, 103765, 102988, 101901, 100672, 99657, 98998, 98517, 97903, 96974, 95879, 95050, 94718, 94551, 94127, 93705, 94015, 95216, 96627, 97675, 98463, 99109, 99284, 98860, 98395, 98331, 98281, 97797, 97318, 97506, 98020, 97893, 96930, 95860, 95258, 95143, 95609, 96849, 98474, 99615, 99952, 99946, 99904, 99541, 98696, 97720, 96860, 95845, 94470, 93045, 91989, 91407, 91324, 91789, 92471, 92647, 91999, 90990, 90225, 89915, 90230, 91548, 93831, 96153, 97378, 97112, 95695, 93624, 91404, 89632, 88707, 88551, 88899, 89685, 90853, 92062, 92928, 93413, 93702, 93948, 94399, 95426, 97029, 98517, 99143, 98905, 98398, 98026, 97760, 97555, 97576, 97992, 98841, 100038, 101291, 102103, 102159, 101675, 101134, 100768, 100469, 100096, 99599, 98964, 98316, 98006, 98382, 99463, 100919, 102193, 102593, 101678, 99837, 98183]
55396I8183o60K02O23J049J474J099k94j607j748j090p53r71r87l37N70J079R23
55379I6755K75l25k36O35J564J742J143K79n59j288j605j264o50m15o12p65o70
55362I4004n56n05m10m32p97j147q60j19J28m60j128j192r35q68p80j94P45J434
55344H5928J600J420J142R66J027J042M71o12j234p52J04J35o43j073n57K15L72
55327H9551n2m51m75j98J86M54M42K12K7J0R9L30Q05J305J317O60k11p15o97l54
55307I2245J06M63M72J07l19m76l86k96l80n95p55o80l93j29J1L05R41J459J257
55288I2957O18N19J183J584Q77l78j055j031r46q79l05O24Q66j8j046j050j47
55271I2373O21P16N24N14O41O28L78ol84o07n58k93MK18L45L63K18L1N1L39N81
$$ y = [98183, 97523, 97725, 98348, 99397, 100871, 101970, 101676, 100069, 98321, 97231, 96478, 95507, 94520, 94183, 94753, 95832, 96755, 97030, 96705, 96469, 97104, 98668, 100410, 101553, 101832, 101273, 99985, 98380, 97116, 96466, 96051, 95439, 94674, 94004, 93448, 92943, 92533, 92101, 91304, 90157, 89297, 89178, 89306, 88846, 87718, 86526, 85591, 84723, 83943, 83749, 84494, 85928, 87528, 88948, 90090, 91056, 92083, 93125, 93596, 92984, 91750, 90998, 91102, 91237, 90594, 89521, 88964, 89179, 89551, 89499, 89048, 88573, 88375, 88561, 89015, 89457, 89669, 89696, 89706, 89805, 90135, 90940, 92245, 93562, 94222, 94011, 93296, 92599, 92245, 92351, 92814, 93286, 93393, 93074, 92598, 92212, 91916, 91536, 90941, 90186, 89506, 89113, 88984, 88995, 89300, 90241, 91700, 92957, 93575, 94094, 95277, 96861, 97738, 97360, 96305, 95274, 94328, 93449, 93144, 93768, 94634, 94616, 93570, 92520, 92373, 92994, 93710, 94234, 94748, 95389, 96017, 96395, 96389, 96005, 95398, 94840, 94547, 94551, 94769, 95114, 95477, 95695, 95726, 95777, 96116, 96697]
55250I6697M34j9l77m25l52m11n87o96o52n52n46p43j053j061l41R00J731J463
55232I3410M96j86k41j32k00k26p4p4l78m98JP35R41N08Lr7J75N75Q59P58J71
55211I6526n71r39p46k28K96O30O68M34J48K4R0L06O46Q58N31k86q84p64l46k73
55191I6120l89j11M13M55j2j56M25J042R44L06k00k71M9O27J111R27m7j148j671
55172I8414j657j546j399r26j10P10J265J517J463J114O23J84j51m09n47m87k38
55155I7820Q3K96K65R2Q9L50N30L91L59R08J497J028n27j793j715q19k53k94m90
55136I7817o32p28m94K22P84M23n66j061n60L60R38R74O26J89O1M05O94K68o57
55117I9063j126p14NM78Q75J444J733J154o4r87j031m71N8K65L15M30N56M88K50
$$ y = [96697, 97131, 97112, 96735, 96310, 95958, 95547, 94960, 94264, 93612, 93060, 92514, 91771, 90718, 89657, 89316, 90216, 91947, 93410, 93906, 93720, 93479, 93347, 93147, 92921, 92847, 92773, 92395, 91897, 91898, 92633, 93574, 94082, 94085, 93988, 94163, 94738, 95597, 96355, 96526, 95955, 95016, 94270, 94042, 94338, 94968, 95636, 96070, 96218, 96242, 96332, 96638, 97284, 98142, 98673, 98387, 97503, 96739, 96393, 96120, 95731, 95620, 96033, 96488, 96476, 96320, 96745, 97787, 98731, 99037, 98837, 98566, 98615, 99242, 100353, 101280, 101233, 100085, 98414, 96757, 95211, 93812, 92886, 92776, 93486, 94751, 96268, 97731, 98845, 99468, 99652, 99501, 99092, 98545, 98058, 97820, 97903, 98199, 98464, 98556, 98645, 98995, 99525, 99916, 100275, 101183, 102680, 103708, 103181, 101388, 99673, 98854, 98601, 98307, 97817, 97185, 96457, 95963, 96185, 96969, 97392, 96826, 95765, 95205, 95565, 96503, 97477, 98103, 98292, 98353, 98758, 99452, 99720, 99063, 97937, 97223, 97228, 97706, 98581, 100025, 101758, 102912, 102848, 101861, 100830, 100359, 100417, 100682, 100997, 101427, 101983, 102471, 102721]
55098A02721J46L19M77L61K16M43Q83R16L44l21n24k82L5K50M85Q63J301J527
55080A10160J309P60L05J83J31k35q32j275j449j500j354p11L79J386J844J743
55064A10844J294O83J19k52n09p87q85m88K26O30M28k6l05m05n23p44j098j559
55046A06643j884j765j306q62m44K55J082J360Q73L00K60M89M21J41Q5K26J80
55029A06054j19m03o07q42r80p51k14L13O68P93M77l31j049r72k62J79j4j53M25
55010A02212J281J438P13r4l25k69n62j118j165l17Q08J301J039O86P40J098J525
54993A08991J989K328K041Q84n55j302r69k5Q19J268J477J673J774J453O12l02
54977A22156p79q74r56q67m1J352K129J525L20j37L27P07L33l81o92m10J23M50
$$ y = [102721, 102867, 103186, 103663, 104024, 104240, 104683, 105566, 106482, 106826, 106505, 105981, 105699, 105734, 105984, 106469, 107332, 108633, 110160, 111469, 112229, 112534, 112717, 112848, 112613, 111781, 110506, 109057, 107557, 106203, 105492, 105871, 107257, 109101, 110844, 112138, 112821, 112940, 112688, 112179, 111392, 110507, 110019, 110245, 110875, 111303, 111277, 110972, 110567, 110044, 109300, 108202, 106643, 104759, 102994, 101688, 100826, 100382, 100637, 101719, 103079, 103952, 104252, 104512, 105001, 105422, 105563, 105648, 105874, 106054, 105935, 105532, 104925, 104083, 103103, 102352, 102138, 102451, 103119, 103912, 104389, 104058, 103009, 102037, 101775, 101954, 101940, 101787, 102212, 103493, 104931, 105644, 105550, 105225, 104956, 104394, 103276, 102111, 101794, 102602, 103903, 104942, 105628, 106368, 107466, 108991, 110980, 113308, 115349, 116233, 115678, 114376, 113407, 113382, 114201, 115469, 116946, 118619, 120393, 121846, 122458, 122156, 121377, 120503, 119547, 118680, 118639, 119991, 122120, 123645, 123965, 123828, 124155, 124862, 125195, 124814, 124122, 123712, 123835, 124285]
54959A24285K96k23o01m74p5J41J62K41K39k88j304k136k240j672p61K27R59J074
54941A17850O00N4j03J43N13P40O93M75M45Q63J548K126K492K653K412J798J596
54924A36898K689M780O583P348P445P215O235M268K084N04p34k374m218n270n165
54909A68288m631m468m634m559l915k915k070j749j817j772j379r72r48j155j169
54894A30135r25p12n92l07K55Q91J399J837K345K947L557M065M381M535M645M722
54878A63178M642M396M160L908L280K049N21r20k310l772m964n431n330n236n207
54863A52964m732l723k882k780l073k988k284j312m53R2J24n07j575k508k839
54848A21524k576k132j902j944j990j753j183m26L43R70J281J184P66K19k07k02
$$ y = [124285, 124581, 124358, 123757, 123283, 123208, 123349, 123511, 123752, 123991, 123703, 122399, 120263, 118023, 116351, 115590, 115817, 116776, 117850, 118450, 118504, 118401, 118544, 119057, 119797, 120490, 120965, 121410, 122273, 123821, 125947, 128439, 131092, 133504, 135302, 136898, 139587, 144367, 150950, 158298, 165743, 172958, 179193, 183461, 185545, 186049, 185315, 182941, 178723, 173453, 168288, 163657, 159189, 154555, 149996, 146081, 143166, 141096, 139347, 137530, 135758, 134379, 133407, 132459, 131304, 130135, 129210, 128498, 127906, 127599, 127854, 128745, 130144, 131981, 134326, 137273, 140830, 144895, 149276, 153811, 158456, 163178, 167820, 172216, 176376, 180284, 183564, 185613, 186134, 185214, 182904, 179132, 174168, 168737, 163407, 158171, 152964, 148232, 144509, 141627, 138847, 135774, 132786, 130502, 129190, 128737, 128829, 128953, 128446, 126871, 124363, 121524, 118948, 116816, 114914, 112970, 110980, 109227, 108044, 107618, 107961, 108931, 110212, 111396, 112162, 112381, 112174, 111972]
54832A11972M00J196J351N56m02m89K89R75R74N98K70o9n09p29n55m46q77j539
54814A12966j685j085k04M71P78O80K26k31j89M26J164J539J486J185P35J12n89
54797A17785j090j115o77o1N39J259K157K689K074M06j055j167j77P51J002R72
54781A24292J163J463J491J206R76J203J985K923L429L371L318L755M387M763
54767A59725N205O245P300P003N217L524L047K739Q33k590n644o940o779o181
54753A72704n714n482n388n074m189k952k017j643j472j184q53n77l60m02q52
54738A34545j161n27Q16J568J062J46p3M25J167K181L524M496M512M261M863O146
54722A67951O910O656N815M418J966j085l203l733l834m729o040o690o550o133
$$ y = [111972, 112372, 113568, 114919, 115475, 115073, 114584, 114873, 115848, 116822, 117420, 117690, 117621, 117112, 116383, 115828, 115382, 114505, 112966, 111281, 110196, 109992, 110463, 111241, 111921, 112147, 111916, 111727, 112153, 113317, 114856, 116342, 117527, 118262, 118374, 117785, 116695, 115580, 114903, 114842, 115381, 116640, 118797, 121486, 123560, 123966, 122911, 121744, 121567, 122318, 123320, 124292, 125455, 126918, 128409, 129615, 130591, 131794, 133779, 136702, 140131, 143502, 146820, 150575, 154962, 159725, 164930, 171175, 178475, 185478, 190695, 194219, 197266, 200005, 200838, 198248, 192604, 185664, 178885, 172704, 166990, 161508, 156120, 151046, 146857, 143905, 141888, 140245, 138773, 137589, 136736, 136159, 135799, 135397, 134545, 133384, 132857, 133673, 135241, 136303, 136449, 136376, 136801, 137968, 140149, 143673, 148169, 152681, 156942, 161805, 167951, 174861, 181517, 187332, 191750, 193716, 192631, 189428, 185695, 181861, 177132, 171092, 164402, 157852, 151719]
54708A51719n415m106k705k137k375k417j684o89k04l65p64r25o53k39k62q58
54692A25921j357j141n71n20j128j728j834j520q71P8Q62Q19J10l10KM31M03K33
54674A17879L90N77L06j61k08R8R1m32r12q29l02K26N27O43P06P15M99j41j069
54655A18603j832k052j713r24K46J489K188K009J386J040J155J373J389J170P31
54640A26258K07k4K40N53L24k62l83J49M79j41j270j848j520q74m95l49j49J00
54622A20995J70K8p8N6L41N58O23N95M51P1m72q01n91k1L80K90j42n85q27p84
54602A20257l70M14J286J781J632J098P51Q42R74O27n0l28J21O98O40J9m63m11
54584A29518n1K98M99L48l51j319j811j450o73r7J33J33j63p49j115o81L68J152
$$ y = [151719, 146304, 142198, 139493, 137356, 134981, 132564, 130880, 130191, 129987, 129622, 128858, 127933, 127280, 127041, 126779, 125921, 124564, 123423, 122852, 122332, 121204, 119476, 117642, 116122, 115251, 115329, 116191, 117010, 117120, 116810, 116812, 117243, 117646, 117879, 118269, 118846, 119152, 118991, 118783, 118881, 118972, 118540, 117628, 116799, 116497, 116723, 117250, 117893, 118599, 119314, 119813, 119672, 118603, 116771, 114719, 113006, 112082, 112328, 113817, 116005, 118014, 119400, 120440, 121595, 122968, 124357, 125527, 126258, 126465, 126441, 126681, 127234, 127558, 127296, 126913, 127062, 127541, 127400, 126130, 124282, 122762, 121888, 121393, 121044, 120895, 120995, 121165, 121193, 121115, 121171, 121512, 122070, 122693, 123288, 123739, 123810, 123338, 122537, 121946, 121925, 122305, 122595, 122453, 121868, 121041, 120257, 119887, 120301, 121587, 123368, 125000, 126098, 126849, 127691, 128665, 129292, 129242, 128914, 129035, 129733, 130373, 130392, 129929, 129518, 129467, 129765, 130264, 130612, 130261, 128942, 127131, 125681, 125008, 124911, 125044, 125177, 125014, 124265, 123150, 122469, 122837, 123989]
54566A23989J126O85N83J000J377J053Kj085j398p96Q3N42N25M32M89O19P84J046
54548A31056J252J104O88M77O23O94M28L16Q24J447J238J84o86p21m37n96j136
54531A36755j511j593j609j521j102m91o5J79M97P48N20l9k01K70O95M60j44n00
54513A31348n93q10j126j131o80m3M92P47N80J17n9N02J362J522O34n85j208r91
54495A30078l07L71P21O65M07K02pm25q78q10l5Q31J017M59j68j82N06J428K003
54476A35876J970J558J172R85Q81P24N09K31j25m65o08m68j00M21Q65Q26J48o37
54458A43763p73k46J79J3l29k45J85L92J03m86j073j414j263n97J59M77L07Q7
54440A39239J55L58K81j59m96k07N26Q31J63q71j178n51J87M29M26N49O07L67
$$ y = [123989, 125115, 125800, 126383, 127383, 128760, 129813, 129815, 128730, 127332, 126536, 126619, 127161, 127686, 128118, 128607, 129226, 130010, 131056, 132308, 133412, 134100, 134577, 135200, 135894, 136322, 136638, 137462, 138909, 140147, 140331, 139645, 138924, 138487, 137891, 136755, 135244, 133651, 132042, 130521, 129419, 128928, 128863, 129042, 129539, 130287, 130807, 130768, 130567, 130837, 131532, 131992, 131848, 131348, 130755, 129945, 128819, 127688, 127008, 126965, 127457, 128204, 128784, 128901, 128842, 129344, 130706, 132228, 132862, 132277, 131069, 130078, 129771, 130142, 130863, 131528, 131935, 132137, 132130, 131705, 130827, 130017, 129982, 130813, 131830, 132289, 132121, 131939, 132445, 133873, 135876, 137846, 139404, 140576, 141561, 142442, 143166, 143675, 143906, 143781, 143316, 142708, 142240, 142140, 142561, 143426, 144252, 144400, 143763, 142990, 142744, 142923, 142936, 142607, 142362, 142547, 142939, 143042, 142556, 141483, 140069, 138806, 138209, 138368, 138845, 139152, 139239, 139394, 139752, 140033, 139874, 139378, 139171, 139697, 140528, 140691, 139820, 138642, 138091, 138278, 138707, 139133, 139682, 140289, 140656]
54422A40656J18J89M22O41J120J943K417J887P82N5r0q9L6O05J285J203K16q94
54404A52502j587j985j987j057O23J837J776J068P17P00M19j17l49n4N48J185
54388A54239J421O33j048k227j626J82J459J542J327J471J349L17r71j359p13
54373A55996J31N65P01P75P13L97l2k58o7M26Q04Q05P91J447K831M059M242L471
54355A77797K462J580O95j84p80j051j295j557j491j033p82j275k155k515j999
54340A66417j181q13r89j195j052p54p57j130j421j186n16J33M85O15O51O07N24
54323A58438M35J66m24r76q46n9M39n6j032j448j091o06l87k10n1l80j276j974
54305A48662j810j151p74p07l54L54O66Q7q67j252p80K6O12R59J328J694J707
$$ y = [140656, 140774, 140963, 141385, 142026, 143146, 145089, 147506, 149393, 150175, 150230, 150140, 150051, 150087, 150692, 151977, 153180, 153396, 152502, 150915, 148930, 146943, 145886, 146509, 148346, 150122, 151190, 151907, 152607, 153026, 152909, 152560, 152506, 153054, 154239, 155660, 156293, 155245, 153018, 151392, 151574, 153033, 154575, 155902, 157373, 158722, 159039, 158068, 156709, 155996, 156127, 156692, 157393, 158168, 158881, 159278, 159246, 158988, 158921, 159347, 160151, 160956, 161747, 163194, 166025, 170084, 174326, 177797, 180259, 181839, 182534, 182350, 181570, 180519, 179224, 177667, 176176, 175143, 174361, 173086, 170931, 168416, 166417, 165236, 164423, 163434, 162239, 161187, 160433, 159676, 158546, 157125, 155939, 155423, 155556, 156041, 156656, 157307, 157914, 158438, 158873, 159039, 158615, 157639, 156793, 156734, 157173, 157117, 156085, 154637, 153546, 152940, 152553, 152343, 152292, 151912, 150636, 148662, 146852, 145701, 144927, 144220, 143866, 144220, 144886, 144973, 144106, 142854, 142074, 142100, 142712, 143671, 144999, 146693, 148400]
54288A48400J195M78L0m3K8Q1J89M02O27P62P63N40P7l75n02m08m46n66k82M61
54268A51411R43O18p1l48j52N9K70R16J975K805K997K729K195J304J63p43j213
54251A65858j590k029j994j106NL26k04p05o83o00r25j240p89L86J472J919J976
54234A60077K006J765P93o81j738j753r87j37L91N45L63M6K7N09J014Q91K45j44
54216A63232O3K79j75j125j827j848j339o39l3J64j94p56r01m57N0M6l59n66l24
54197A53291n7k65q53j242j087n75p5K58M30M59M23N22P98J020R91Q51Q32Q35
54179A56556N93J71J4M10J133J657J503N24r55k143k338j621p95n30p11o96j13
54162A52659P87J412J393Q79L11l5k11k86j91rj12o30r79m74O63J410J151L45
$$ y = [148400, 149595, 150073, 150103, 150060, 150088, 150169, 150358, 150760, 151387, 152149, 152912, 153452, 153529, 153154, 152652, 152244, 151798, 151232, 150950, 151411, 152354, 152972, 152901, 152553, 152401, 152460, 152730, 153646, 155621, 158426, 161423, 164152, 166347, 167651, 167814, 167071, 165858, 164268, 162239, 160245, 159139, 159144, 159470, 159266, 158561, 157878, 157278, 156353, 155113, 154324, 154710, 156182, 158101, 160077, 162083, 163848, 164641, 163960, 162222, 160469, 159482, 159345, 159736, 160281, 160644, 160690, 160717, 161226, 162240, 163131, 163376, 163232, 163295, 163574, 163399, 162274, 160447, 158599, 157260, 156621, 156588, 156752, 156558, 155802, 154901, 154444, 154494, 154540, 154181, 153615, 153291, 153234, 152969, 152116, 150874, 149787, 149212, 149137, 149395, 149825, 150284, 150707, 151229, 152027, 153047, 154038, 154889, 155721, 156556, 157149, 157320, 157334, 157744, 158877, 160534, 162037, 162561, 161606, 159463, 157125, 155504, 154709, 154179, 153468, 152772, 152659, 153446, 154858, 156251, 157130, 157441, 157406, 157195, 156909, 156718, 156709, 156597, 155967, 154988, 154514, 155177, 156587, 157738, 158083]
54144A58083j81j71N2J53P9k6MK01L75L40K10K56M79O84Q69J141J227O81k99q13
54124A63344m07K49K88j57k43L54J090J404J372J414J642J688J128M6q57r04k27
54107A71224L88M93M91Q86J402J310M66m13n59J09J064J727J879J600J044L81
54091A83492J0N34K123M023N217N586N859O297O103M569K186K8j499k678l612
54076B18238m133m412m850n283n018l810k299j206o22k92k17m83q19p30j44M41
54060A84361N07J17k12j47J77N19R18J463J914K001J995K436L276L795L603L218
54044B09941L346M059N025O076P100P739P729P293O822O417N991N530M910L911
54030B91889K726K032K018J971J380Q71J225J925J805P50k54p21j135j744j994
$$ y = [158083, 157902, 157731, 157783, 157936, 158015, 157989, 157993, 158194, 158569, 158909, 159119, 159375, 159854, 160538, 161407, 162548, 163775, 164456, 164157, 163344, 162937, 163186, 163474, 163317, 163074, 163428, 164518, 165922, 167294, 168708, 170350, 172038, 173166, 173212, 172355, 171451, 171224, 171612, 172105, 172596, 173482, 174884, 176194, 176660, 176247, 175688, 175797, 176861, 178588, 180467, 182067, 183111, 183492, 183502, 184036, 186159, 190182, 195399, 200985, 206844, 213141, 219244, 223813, 225999, 226027, 224528, 221850, 218238, 214105, 209693, 204843, 199560, 194542, 190732, 188433, 187227, 186605, 186313, 186096, 185613, 184794, 184064, 183920, 184361, 184868, 184985, 184773, 184626, 184803, 185322, 186240, 187703, 189617, 191618, 193613, 196049, 199325, 203120, 206723, 209941, 213287, 217346, 222371, 228447, 235547, 243286, 251015, 258308, 265130, 271547, 277538, 283068, 287978, 291889, 294615, 296647, 298665, 300636, 302016, 302887, 304112, 306037, 307842, 308592, 308338, 307617, 306482, 304738, 302744]
54015C02744j583j194j600k633l524l816l677l594m000m859n500n281m441l876
54001B53166l978m254m097l456k646k029j930k300k440j688n02j08r80k289l033
53986B17436l011k475j617p62l73m81o32o31o78o50r9P05P43j92q58k74Q76J369
53968B08396J193J147J286R70J85l11j05M24Q04R24Q87R94J721L064M142M126
53952B29847L364K904L150L832N042P240J0136J2566J3774J4033J3792J2872J0889
53939C43441P837M012m3l327m853m739m254m349m698m550l929l315k658j491R4
53924C13178J396K057K499L216M096M691M911N119N647O397O994P214P178P180
53910C81773P310P417P264O652N433L641J684J76n89r11j292j832k218k289k373
$$ y = [302744, 301161, 299967, 298367, 295734, 292210, 288394, 284717, 281123, 277123, 272264, 266764, 261483, 257042, 253166, 249188, 244934, 240837, 237381, 234735, 232706, 230776, 228476, 226036, 224348, 223846, 223738, 222758, 220469, 217436, 214425, 211950, 210333, 209571, 209198, 208717, 208085, 207454, 206776, 206126, 206027, 206732, 207475, 207283, 206425, 206151, 207027, 208396, 209589, 210736, 212022, 212992, 213177, 212866, 212761, 213185, 213989, 214913, 215800, 216794, 218515, 221579, 225721, 229847, 233211, 236115, 239265, 243097, 248139, 255379, 265515, 278081, 291855, 305888, 319680, 332552, 343441, 351278, 355290, 355247, 351920, 347067, 342328, 338074, 333725, 329027, 324477, 320548, 317233, 314575, 313084, 313178, 314574, 316631, 319130, 322346, 326442, 331133, 336044, 341163, 346810, 353207, 360201, 367415, 374593, 381773, 389083, 396500, 403764, 410416, 415849, 419490, 421174, 421350, 420761, 419850, 418558, 416726, 414508, 412219, 409846]
53895D09846k964m178n618o716p155p015o698o618o855p100p085p006p241p621
53881C19976p402o183m584l568l353l424l443l615m118m734n158n252m863l900
53867B56379k780k317k841l715m093l824l334k898k508k210k158k274k195j630
53853B17602o91P6J33m04o50J05J358J785Q66m26r03n67l25o31j092j231j082
53836B13923r46r37r15p03l39m5P7K58O83J054R91P08P37R43O55o5j94P51J833
53817B18469J981J432J081J063R13P00J015J972L020L639L631L049K442K725M038
53802B51170N117M777L636L376M521O013O829O887O284M958L318K239K003K046
53788C13174J949J852J741J230M24l3j04o79k165l663m184m010m139m878n613
$$ y = [409846, 406882, 402704, 397086, 390370, 383215, 376200, 369502, 362884, 356029, 348929, 341844, 334838, 327597, 319976, 312574, 306391, 301807, 298239, 294886, 291462, 288019, 284404, 280286, 275552, 270394, 265142, 260279, 256379, 253599, 251282, 248441, 244726, 240633, 236809, 233475, 230577, 228069, 225859, 223701, 221427, 219232, 217602, 216911, 216987, 217120, 216716, 216066, 216171, 217529, 219314, 220180, 219754, 218851, 218284, 217959, 217328, 216236, 215005, 213923, 212977, 212040, 211125, 210422, 210083, 210038, 210115, 210373, 211056, 212110, 213101, 213809, 214546, 215489, 216144, 216079, 215885, 216636, 218469, 220450, 221882, 222963, 224026, 224939, 225639, 226654, 228626, 231646, 235285, 238916, 241965, 244407, 247132, 251170, 256287, 261064, 264700, 268076, 272597, 278610, 285439, 292326, 298610, 303568, 306886, 309125, 311128, 313174, 315123, 316975, 318716, 319946, 320370, 320337, 320233, 319554, 317389, 313726, 309542, 305532, 301393, 296515, 290902]
53773B90902n731n216m554m291m504m603m048l227l035l558l897l484k744k195
53759B35815j775j419j453j895k108j801j617k068k539k133j007j46j18o84j322
53744B13730j604j336p99m74l00L04J324J803J159J42k24j8O8m8J5J83J29J4J94
53725B14262M37L77L55Q86J588J668J291J314J695J364k6j307j172L10K088L318
53709B28448L815L760L443L115K804K469K299K548L096L505L523L254K896K659
53695B71634K767L134L219K644J796J285R92K98q28j658j645j000k33K96L83P3
53679B83157j68J47Q62J395J434J024J41j088j922j622n54J70J54mP6K8l29n73
53661B82328n16n82q33n68M90J420J250K76n33q54j017j144j062q26o15l12K54
$$ y = [290902, 285171, 279955, 275401, 271110, 266606, 262003, 257955, 254728, 251693, 248135, 244238, 240754, 238010, 235815, 234040, 232621, 231168, 229273, 227165, 225364, 223747, 221679, 219140, 217007, 216000, 215854, 215736, 215052, 213730, 212126, 210790, 209991, 209517, 209217, 209521, 210845, 212648, 213807, 213949, 213725, 213707, 213775, 213727, 213742, 213925, 214054, 214068, 214262, 214699, 215076, 215431, 216317, 217905, 219573, 220864, 222178, 223873, 225237, 225211, 223904, 222732, 223042, 225130, 228448, 232263, 236023, 239466, 242581, 245385, 247854, 250153, 252701, 255797, 259302, 262825, 266079, 268975, 271634, 274401, 277535, 280754, 283398, 285194, 286479, 287471, 287769, 286941, 285283, 283638, 282638, 282405, 282701, 283084, 283157, 282989, 283136, 283998, 285393, 286827, 287851, 287992, 286904, 284982, 283360, 282806, 282976, 283130, 283126, 283202, 283230, 282901, 282328, 281812, 281230, 280397, 279829, 280319, 281739, 282989, 283265, 282732, 281878, 280861, 279717, 278655, 277829, 277214, 276902, 277156]
53644B77156Q90J283J469J552J315O51O0J62Q72J589J975K035J764J285J097J525
53628B96680K052J920J287J082J710K539K862K748K727L105L790M487M873M875
53614C36737M823N091N522N616N232M719M272L654K695J708J149J141J502K001
53600C85862K357K284J733R78K89k97p51q61m92J61P81J280J669J694R45m95j797
53583C95340k102j478q42q78j252j230p95o79j295k200k807l097l243k990k055
53568C68397q21J2L61P15J138J085L06n79q37m52J01N58R17J105J031Q19P27Q32
53550C75415J018J185J257J133Q23N05L17J81P2K07Q08J732K576L056L162L083
53534C96530L186L825M921N869O194O194O586P645Q984J0077J0685J0776J0537
$$ y = [277156, 278046, 279329, 280798, 282350, 283665, 284316, 284376, 284538, 285410, 286999, 288974, 291009, 292773, 294058, 295155, 296680, 298732, 300652, 301939, 303021, 304731, 307270, 310132, 312880, 315607, 318712, 322502, 326989, 331862, 336737, 341560, 346651, 352173, 357789, 363021, 367740, 372012, 375666, 378361, 380069, 381218, 382359, 383861, 385862, 388219, 390503, 392236, 393214, 393503, 393206, 392455, 391594, 391102, 391263, 392044, 393324, 394993, 396687, 397632, 397137, 395340, 393238, 391760, 390918, 390040, 388788, 387558, 386763, 386084, 384789, 382589, 379782, 376685, 373442, 370452, 368397, 367576, 367588, 367949, 368664, 369802, 370887, 371193, 370614, 369777, 369325, 369426, 369984, 370901, 372006, 373037, 373856, 374583, 375415, 376433, 377618, 378875, 380008, 380831, 381336, 381653, 381834, 381906, 382113, 382921, 384653, 387229, 390285, 393447, 396530, 399716, 403541, 408462, 414331, 420525, 426719, 433305, 440950, 449934, 460011, 470696, 481472, 492009]
53521D92009J0446J0922J1828J2628J3151J3774J4702J5547J5967J6347J7397
53510F44718J9188K0995K2124K2595K2969K3628K4288K4304K3473K2371K1628
53499H92281K1074K0134J8997J8592J9189J9798J9584J9141J9480K0292K0326
53488A108888J9299J8246J7884J7768J7425J7282J7800J8404J8162J7049J5912
53477A304119J5455J5748J6424J6779J6017J3940J1244Q738O519M322K198K39
53465A431742j964m762p537r220r762j0239j1388j2753j3542j3764j4113j5185
53453A307513j6991j8951k0211k0376j9964j9753j9777j9516j9027j9000j9520
53442A094427j9635j8651j7059j5611j4199j2347j0253q451o854n068l406k630
$$ y = [492009, 502455, 513377, 525205, 537833, 550984, 564758, 579460, 595007, 610974, 627321, 644718, 663906, 684901, 707025, 729620, 752589, 776217, 800505, 824809, 848282, 870653, 892281, 913355, 933489, 952486, 971078, 990267, 1010065, 1029649, 1048790, 1068270, 1088562, 1108888, 1128187, 1146433, 1164317, 1182085, 1199510, 1216792, 1234592, 1252996, 1271158, 1288207, 1304119, 1319574, 1335322, 1351746, 1368525, 1384542, 1398482, 1409726, 1418464, 1424983, 1429305, 1431503, 1431742, 1429778, 1425016, 1417479, 1408259, 1398497, 1388258, 1376870, 1364117, 1350575, 1336811, 1322698, 1307513, 1290522, 1271571, 1251360, 1230984, 1211020, 1191267, 1171490, 1151974, 1132947, 1113947, 1094427, 1074792, 1056141, 1039082, 1023471, 1009272, 996925, 986672, 978221, 971367, 966299, 962893, 960263]
53430I60263k707k650j741j52J724L767N654O657O537O179O834Q788J1206J3137
53416A023496J4347J5246J6299J7652J9174K0750K2356K3848K4933K5613K6464
53405A250178K8054L0115L1789L2760L3642L5139L7294L9776M2393M4960M7094
53394A653194M8639M9977N1459N2808N3564N3828N4034N4184N3940N3359N2830
53383B231816N2311N1254M9433M7188M4708M1821L8691L5937L3619L0813K6883
53372B684474K2509J8715J5330J1371O620J757l043q568j5398k3028l0511l7143
53360B643085m2294m5445m6968m8169m9847n1272n1351n0293m9317m8912m8337
53349B110880m6931m5071m3577m2686m2068m1504m1165m1265m1635m1763m1227
$$ y = [960263, 957556, 954906, 953165, 953013, 954737, 958504, 964158, 970815, 977352, 983531, 990365, 999153, 1010359, 1023496, 1037843, 1053089, 1069388, 1087040, 1106214, 1126964, 1149320, 1173168, 1198101, 1223714, 1250178, 1278232, 1308347, 1340136, 1372896, 1406538, 1441677, 1478971, 1518747, 1561140, 1606100, 1653194, 1701833, 1751810, 1803269, 1856077, 1909641, 1963469, 2017503, 2071687, 2125627, 2178986, 2231816, 2284127, 2335381, 2384814, 2432002, 2476710, 2518531, 2557222, 2593159, 2626778, 2657591, 2684474, 2706983, 2725698, 2741028, 2752399, 2759019, 2760776, 2757733, 2749165, 2733767, 2710739, 2680228, 2643085, 2600791, 2555346, 2508378, 2460209, 2410362, 2359090, 2307739, 2257446, 2208129, 2159217, 2110880, 2063949, 2018878, 1975301, 1932615, 1890547, 1849043, 1807878, 1766613, 1724978, 1683215, 1641988]
53338A641988m0113l8803l7347l5354l2661k9751k7144k4712k2047j9300j7076
53327A317680j5579j4484j3660j3378j3652j3944j3860j3727j4038j4601j4664
53316A162093j3810j2385j1012r878q655p047n309l968l109k168p19R09K155L136
53302A090233M509O433Q256R368J0023J1085J3096J5718J7969J9172J9750K0884
53290A246496K3052K5306K6430K6464K6332K6232K5377K3439K1234J9666J8697
53279A508725J7776J6586J4970J2792J0320Q119O097L355m86m413p240r157j1233
53266A566211j3796j6167j7854j9156k0616k2438k4504k6439k7699k8081k8063
53255A321398k8250k8622k8764k8618k8402k7969k6917k5431k4348k4218k4729
$$ y = [1641988, 1601875, 1563072, 1525725, 1490371, 1457710, 1427959, 1400815, 1376103, 1354056, 1334756, 1317680, 1302101, 1287617, 1273957, 1260579, 1246927, 1232983, 1219123, 1205396, 1191358, 1176757, 1162093, 1148283, 1135898, 1124886, 1115008, 1106353, 1099306, 1093997, 1090029, 1086920, 1084752, 1084033, 1084942, 1087097, 1090233, 1094742, 1101175, 1109431, 1118799, 1128822, 1139907, 1153003, 1168721, 1186690, 1205862, 1225612, 1246496, 1269548, 1294854, 1321284, 1347748, 1374080, 1400312, 1425689, 1449128, 1470362, 1490028, 1508725, 1526501, 1543087, 1558057, 1570849, 1581169, 1589288, 1595385, 1598740, 1598254, 1593841, 1586601, 1577444, 1566211, 1552415, 1536248, 1518394, 1499238, 1478622, 1456184, 1431680, 1405241, 1377542, 1349461, 1321398, 1293148, 1264526, 1235762, 1207144, 1178742, 1150773, 1123856, 1098425, 1074077, 1049859, 1025130]
53244A025130k5157k5116k4669k4105k3633k3249k2799k2292k1886k1494k0739
53233G69991j9539j8290j7118j5542j3352j1379j0539j0590j0654j0569j0745
53222F21674j0878j0115q680q062r110j0852j1823j1840j1816j2381j3296j3875
53210D88946j3561j2342j0883r936r439q660p414o470o429o824o859o476o095
53197C77558n774n367n156n547o259o464n866n031m598m579m654m749n027n417
53183C03070n464m811l726k973k966l288l248k724k112j578r93n14n80j200j787
53168B65106j954j895j767j333n90j32l97r76j192r36n00n0J78k89j439k296j920
53151B47618o80K36L81L40N41O25J94n50j138j407j460j439j421j311q01J89J102
$$ y = [1025130, 999973, 974857, 950188, 926083, 902450, 879201, 856402, 834110, 812224, 790730, 769991, 750452, 732162, 715044, 699502, 686150, 674771, 664232, 653642, 642988, 632419, 621674, 610796, 600681, 592001, 583939, 574829, 563977, 552154, 540314, 528498, 516117, 502821, 488946, 475385, 463043, 452160, 442224, 432785, 424125, 416711, 410241, 403812, 396988, 390129, 383653, 377558, 371784, 366417, 361261, 355714, 349455, 342991, 337125, 332094, 327496, 322917, 318263, 313514, 308487, 303070, 297606, 292795, 289069, 286096, 283130, 279842, 276594, 273870, 271758, 270180, 269187, 268673, 268093, 266893, 265106, 263152, 261257, 259490, 258157, 257567, 257435, 257038, 256062, 254870, 253934, 253434, 253384, 253562, 253273, 251834, 249538, 247618, 246938, 247174, 247555, 247895, 248436, 249061, 249255, 248705, 247567, 246160, 244700, 243261, 241840, 240529, 239728, 239917, 241019]
53134B41019J292R13P90J325K010K185J830J414J275J418J614J608J319R15N66
53119B61493K74J94P01J744K354J568k75j840k410k425k354k061j589j586k244
53104B51544k591j714k17M71J7n46m28l9j48p44j165r30j70N96R41Q91Q48J013
53086B47629J033M90l38o97l83l9j77m89m57k24l27p27q19l99K1O9R7M68P41J69
53066B45641j108k058k045j553j368j483j231k77R54J788J891J441Q79N66N16
53051B42553N41O62J069J620J764J269N98K08r3n69q16m17On20j690k135j446
53034B42604p84r78j217m90O56R65M07%O4r3p84j367j272o51J36Q86J214P31j59
53015B39868m55J43Q46R93Q39P47M74o7k70K45P98O86M07Q12J489J277J72n62
$$ y = [241019, 242311, 243224, 244014, 245339, 247349, 249534, 251364, 252778, 254053, 255471, 257085, 258693, 260012, 260927, 261493, 261767, 261961, 262662, 264406, 266760, 268328, 268053, 266213, 263803, 261378, 259024, 256963, 255374, 253788, 251544, 248953, 247239, 247022, 247493, 247510, 246964, 246536, 246497, 246349, 245605, 244440, 243510, 243340, 243936, 244877, 245768, 246616, 247629, 248662, 249152, 248814, 248117, 247734, 247695, 247518, 247029, 246572, 246348, 246021, 245294, 244475, 244076, 244097, 244166, 244263, 244731, 245472, 245641, 244533, 242475, 240430, 238877, 237509, 236026, 234795, 234518, 235472, 237260, 239151, 240592, 241471, 242037, 242553, 243094, 243756, 244825, 246445, 248209, 249478, 250076, 250284, 250191, 249622, 248806, 248389, 248395, 247875, 246185, 244050, 242604, 241820, 240842, 239625, 239135, 239791, 240756, 241163, 241163, 241227, 241134, 240350, 238983, 237711, 237060, 237196, 238082, 239296, 240027, 239868, 239413, 239556, 240402, 241395, 242234, 242981, 243455, 243388, 243118, 243363, 244161, 244847, 245254, 246066, 247555, 248832, 249004, 248442]
52997B48442l08J22Oj12N09J481J843J399P38K73K9J05O06J142J113N70K41N56
52979B58755J116J319J147J069J339J701J747J450J242J464J821J649Q62K33M30
52964B77344R91Q83p1q84p48p4J31m59j314j885k096k051j758j291r36r37j211
52947B63634j480j567j493j325j088p81l73J36N96O49Mj130k012j980j099o5N15
52930B51141N59K79k03p50j035q54n14n17q28q94n18k09m28q65r18n65j93K05
52912B42893R38J721J647M48r17j433j268j148j069n06K68K77n44r35r4J027J074
52895B42379K16k32K38R17J263J526J817J637P65k14p71j093j393j307o61j67
52879B44920m75j014o74N51J592J829J741J938K315K423K075J410Q00P62J460
$$ y = [248442, 248134, 248256, 248262, 248150, 248659, 250140, 251983, 253382, 254120, 254393, 254422, 254527, 255133, 256275, 257388, 257958, 258199, 258755, 259871, 261190, 262337, 263406, 264745, 266446, 268193, 269643, 270885, 272349, 274170, 275819, 276681, 276914, 277344, 278335, 279218, 279147, 278263, 277515, 277441, 277572, 277113, 275799, 273914, 271818, 269767, 268009, 266718, 265782, 264845, 263634, 262154, 260587, 259094, 257769, 256681, 255900, 255527, 255663, 256259, 256908, 256912, 255782, 253770, 251790, 250691, 250626, 251141, 251700, 251979, 251776, 251026, 249991, 249137, 248623, 248106, 247278, 246384, 245866, 245657, 245229, 244364, 243446, 242881, 242688, 242893, 243831, 245552, 247199, 247647, 246730, 245297, 244029, 242881, 241812, 241306, 241574, 241851, 241307, 240372, 240278, 241305, 242379, 242595, 242363, 242601, 243518, 244781, 246307, 248124, 249761, 250526, 250312, 249541, 248448, 247055, 245748, 245087, 244920, 244445, 243431, 242757, 243308, 244900, 246729, 248470, 250408, 252723, 255146, 257221, 258631, 259431, 260193, 261653]
52864B61653K220K101J045n4n42o28o87o61m77m67r43j752k600l405m036m146
52848B46621l705l197k912k515j773j213j362j766j486m59L93M11m2k09J34N53
52832B27473M60k94j136j180j58J111J522Q25k47q69p76j70N62J002Q87L35k20
52815B29127l54J46J143K071K296J793J181Q10K84p56j797k084j722j385j139
52800B29614m87M49O99k50j611k192j655n98J59J78l28n81KR87J363Q92M46P03
52782B27790J243J343J121J182J575J752J429Q79M53K28J40N2k72r19j586j848
52766B34562j557r15k62J6l30j051j475j223o57k87m7L92R17J160J188J386J702
52749B33519J652J143O86O54Q80J176J663K248K354J694R00P85J225J362Q59L09
$$ y = [261653, 263873, 265974, 267019, 266965, 266423, 265795, 265108, 264447, 263970, 263503, 262560, 260808, 258208, 254803, 250767, 246621, 242916, 239719, 236807, 234292, 232519, 231306, 229944, 228178, 226692, 226233, 226626, 227037, 226995, 226786, 226920, 227473, 227933, 227639, 226503, 225323, 225165, 226276, 227798, 228623, 228376, 227507, 226731, 226561, 227123, 228125, 229012, 229347, 229127, 228773, 228919, 230062, 232133, 234429, 236222, 237403, 238213, 238497, 237741, 235944, 233860, 232138, 230753, 229614, 229127, 229576, 230275, 230025, 228414, 226222, 224567, 223969, 224128, 224306, 223978, 223397, 223399, 224386, 225749, 226641, 227087, 227790, 229033, 230376, 231497, 232679, 234254, 236006, 237435, 238314, 238767, 238995, 239135, 239187, 238915, 237996, 236410, 234562, 233005, 232090, 231828, 231844, 231514, 230463, 228988, 227765, 227108, 226821, 226774, 227166, 228083, 229243, 230431, 231817, 233519, 235171, 236314, 237000, 237654, 238534, 239710, 241373, 243621, 245975, 247669, 248569, 249354, 250579, 251941, 252800, 253109]
52733B53109L04O60Q92R43J061J187J012N41J12j56n32j085j432j276r07p55p65
52716B52913o61o19j059j811k083j519o92l07k91j25K84N60N28L95K66p7p20j312
52698B43670j364p93K8O52Q95Q12M97O3k30q6L95O19J94l61r5J040J902J466O8
52679B49372j056j208p54m09n06r48j419j514j016j19O99J098J036O82L69M07
52663B44714P20P87L66K3M51J391J851J518J229J741K604K766J955R17L71K47
52647B63651l1p86j727k212j840r38l21n16j275j939k086j643o36Q15K226L023
52631B53765L202L434M222N146N219L997J994L3j518k698l425l442k846k251k194
52616B62638k573k825k594k016j420r71o28k84N4K54K54K78O43J241J484J014
$$ y = [253109, 253413, 254073, 254965, 255908, 256969, 258156, 259168, 259709, 259821, 259665, 259133, 258048, 256616, 255340, 254433, 253678, 252913, 252252, 251633, 250574, 248763, 246680, 245161, 244469, 244162, 243871, 243746, 244030, 244590, 245118, 245513, 245779, 245702, 244982, 243670, 242306, 241513, 241541, 242193, 243088, 243900, 244397, 244460, 244230, 244144, 244539, 245158, 245352, 244991, 244896, 245936, 247838, 249304, 249372, 248316, 247108, 246354, 245945, 245439, 244491, 243072, 241558, 240542, 240423, 241122, 242220, 243256, 243938, 244307, 244714, 245434, 246221, 246587, 246610, 247061, 248452, 250303, 251821, 253050, 254791, 257395, 260161, 262116, 263033, 263404, 263651, 263620, 262834, 261107, 258895, 257055, 256117, 255796, 255280, 254005, 252066, 249980, 248337, 247701, 248516, 250742, 253765, 256967, 260401, 264623, 269769, 274988, 278985, 280979, 281012, 279494, 276796, 273371, 269929, 267083, 264832, 262638, 260065, 257240, 254646, 252630, 251210, 250239, 249611, 249327, 249381, 249635, 249889, 250167, 250810, 252051, 253535, 254549]
52600B54549K57r0K0N8j79k38J94P03P41M01K83O69J284J738J915J873J660J263
52582B67101O50j66r97j479j418j031p11n14j46N36J222J457J137N29q6o40j128
52565B64316j414j321r13m88k90k82k63j40J3N3j24m65o75m77m0R3k39m32J04
52546B57016J060J578J330O51k39j331k154j899o34N16Q36R35J463J851J216l5
52530B62160o87m74j90k20j82K8J0o9N21J629K032J370R68J898L183L234K219
52513B77430J631J944K209J923J830K496L243L081J946M92p78j768k524l190l847
52498B86118m263m095l475k956k696k221j209p3N43M74k5n41o15lQ19J005M62
52481B67249O3L96R64J137J157J496J782J360N81M23R80J337J108J009J593K282
$$ y = [254549, 254806, 254716, 254736, 254794, 254615, 254377, 254571, 255274, 256015, 256416, 256699, 257368, 258652, 260390, 262305, 264178, 265838, 267101, 267751, 267585, 266588, 265109, 263691, 262660, 261949, 261435, 261289, 261825, 263047, 264504, 265641, 266170, 266084, 265444, 264316, 262902, 261581, 260668, 260180, 259890, 259608, 259345, 259205, 259218, 259271, 259147, 258682, 258007, 257530, 257490, 257583, 257344, 256912, 257016, 258076, 259654, 260984, 261635, 261396, 260065, 257911, 256012, 255378, 255894, 256730, 257665, 259128, 260979, 262195, 262160, 261473, 260999, 260809, 260589, 260407, 260435, 260445, 260376, 260897, 262526, 264558, 265928, 266896, 268794, 271977, 275211, 277430, 279061, 281005, 283214, 285137, 286967, 289463, 292706, 295787, 297733, 298225, 297447, 295679, 293155, 289965, 286118, 281855, 277760, 274285, 271329, 268633, 266412, 265203, 265130, 265673, 266147, 266122, 265581, 264966, 264963, 265782, 266787, 267249, 267312, 267708, 268672, 269809, 270966, 272462, 274244, 275604, 276185, 276608, 277588, 278925, 280033, 281042, 282635, 284917]
52465B84917K281J839J884K698L486L296K026M96m22p55j413k998m859n768n408
52450B81300m563l867l096j956q30k19oJ56J83j84p34j013r40p03k47M47Q38K75
52432B64841r73j845j761j150n47J41J054J692J437M80l36n35l25K4N92J368J944
52415B66101J995J872K313L559N071O145O606O799P177Q015R288J0499J0727R214
52401C55381O088K337j022l647n742p417q342q120o870n330m230l644l113k393
52387C03936j780j532j417j092o49k70K91J297K238K297J669J545K458L463L531
52372C15985L120L448M679N675N533M538L442K517J625P56M1n71j279k026k349
52357C45134j842p34J65L52K70O87J487J679Q35j11lJ034J920K060J856J831K053
$$ y = [284917, 287198, 289037, 290921, 293619, 297105, 300401, 302427, 302923, 302501, 301746, 300333, 297335, 292476, 286708, 281300, 276737, 272870, 269774, 267818, 266988, 266769, 266763, 266919, 267102, 266918, 266184, 265171, 264231, 263528, 263281, 263728, 264566, 264841, 263868, 262023, 260262, 259112, 258565, 258706, 259760, 261452, 262889, 263369, 263033, 262498, 262173, 262197, 262789, 264157, 266101, 268096, 269968, 272281, 275840, 280911, 287056, 293662, 300461, 307638, 315653, 324941, 335440, 346167, 355381, 361469, 363806, 362784, 359137, 353395, 345978, 337636, 329516, 322646, 317316, 313086, 309442, 306329, 303936, 302156, 300624, 299207, 298115, 297466, 297196, 297487, 298784, 301022, 303319, 304988, 306533, 308991, 312454, 315985, 319105, 322553, 327232, 332907, 338440, 342978, 346420, 348937, 350562, 351318, 351359, 350788, 349509, 347483, 345134, 343292, 342558, 342723, 343075, 343345, 344032, 345519, 347198, 348033, 347922, 347919, 348953, 350873, 352933, 354789, 356620, 358673]
52340C58673K428L007L734M336M603M577M475M645N513P050Q508R140R186R530
52326D39405J0429J1286J1764J2314J3289J4213J4434J4023J3506J3098J2710
52315E80471J2426J2480J2919J3641J4606J5711J6668J7300J7780J8231J8307
52304G50540J7658J6656J6193J6659J7459J7643J6859J5521J4184J2859J1028
52293I23259Q392N393K801Q73p22k197l393m300n232o179o578o173n601n468n293
52278H89582m128k017m8J038J456J604J574J633K396L889N125N322N037N372O377
52263I24212P136P366P935R539J1632J3234J4175J4959J5786J6462J6964J7344
52251A076744J7135J5707J3285J0841Q723O300L383J036J71Or18k601l658l512
$$ y = [358673, 361101, 364108, 367842, 372178, 376781, 381358, 385833, 390478, 395991, 403041, 411549, 420689, 429875, 439405, 449834, 461120, 472884, 485198, 498487, 512700, 527134, 541157, 554663, 567761, 580471, 592897, 605377, 618296, 631937, 646543, 662254, 678922, 696222, 714002, 732233, 750540, 768198, 784854, 801047, 817706, 835165, 852808, 869667, 885188, 899372, 912231, 923259, 931651, 937044, 939845, 940718, 939996, 937799, 934406, 930106, 924874, 918695, 912117, 905944, 900343, 894875, 889582, 885454, 883437, 883389, 884427, 885883, 887487, 889061, 890694, 893090, 896979, 902104, 907426, 912463, 917835, 924212, 931348, 938714, 946649, 956188, 967820, 981054, 995229, 1010188, 1025974, 1042436, 1059400, 1076744, 1093879, 1109586, 1122871, 1133712, 1142435, 1148735, 1152118, 1153154, 1153325, 1153331, 1152413, 1149812, 1146154, 1142642]
52237A142642l297m192n861p132p557p615p768p977p956p570p005o720o982p366
52223A047644p143o202n150m356l526k450j538j149r49l97N28J533K479L195L323
52208A025842K877K468K492K581K459K708L869N337O091O199O522P150P320O895
52194A090810O721P250P809P598O596N151L416J635K08j014k771n198p197p713
52180A113301p136o707o860o905o301n508n326n837o311o070n210m375l917l523
52166A033315k745j569k42J103K300K966K984K908L167L200K209N72n22q63j397
52151A047386k353k554j317J80N00j8k5O28Q54K55l10j86J16j73r96j670j674
52134A038643r91M3J034J948L175M980P048Q980J0884J2985J4912J6100J6748
$$ y = [1142642, 1139345, 1135153, 1129292, 1122160, 1114603, 1106988, 1099220, 1091243, 1083287, 1075717, 1068712, 1061992, 1055010, 1047644, 1040501, 1034299, 1029149, 1024793, 1021267, 1018817, 1017279, 1016130, 1015181, 1014784, 1015312, 1016845, 1019324, 1022519, 1025842, 1028719, 1031187, 1033679, 1036260, 1038719, 1041427, 1045296, 1050633, 1056724, 1062923, 1069445, 1076595, 1083915, 1090810, 1097531, 1104781, 1112590, 1120188, 1126784, 1131935, 1135351, 1136986, 1137194, 1136180, 1133409, 1128211, 1121014, 1113301, 1106165, 1099458, 1092598, 1085693, 1079392, 1073884, 1068558, 1062721, 1056410, 1050340, 1045130, 1040755, 1036838, 1033315, 1030570, 1029001, 1028759, 1029862, 1032162, 1035128, 1038112, 1041020, 1044187, 1047387, 1049596, 1050168, 1049646, 1048783, 1047386, 1045033, 1042479, 1041162, 1041342, 1041842, 1041824, 1041799, 1042427, 1043281, 1043536, 1043226, 1043040, 1043156, 1042983, 1041987, 1040317, 1038643, 1037652, 1037695, 1038729, 1040677, 1043852, 1048832, 1055880, 1064860, 1075744, 1088729, 1103641, 1119741, 1136489]
52121A136489J7619J8919K0076K0716K1085K1469K1845K2238K2646K2598K1518
52110A367218J9773J8451J7852J7139J5894J5001J5214J5802J5585J4566J3468
52099A545963J2154R783O413L125M30k310n608q899j1347j2868j3856j4507j4893
52086A493580j5208j5379j4853j3295j1231r515q404p632p063o669o057m738k891
52073A370645j317m35J85J121K419L812N245O787Q300R596J0779J2104J3510J4596
52059A457347J5072J5084J4918J4569J3707J2089J0000Q040O394M444J546j879
52047A571331m582n963o854q335j0245j1471j1505j1009j0821j1086j1505j1848
52035A456107j1936j1639j1253j1455j2480j3685j4328j4503j4837j5478j5889
$$ y = [1136489, 1154108, 1173027, 1193103, 1213819, 1234904, 1256373, 1278218, 1300456, 1323102, 1345700, 1367218, 1386991, 1405442, 1423294, 1440433, 1456327, 1471328, 1486542, 1502344, 1517929, 1532495, 1545963, 1558117, 1567900, 1574313, 1577438, 1577868, 1575558, 1569950, 1561051, 1549704, 1536836, 1522980, 1508473, 1493580, 1478372, 1462993, 1448140, 1434845, 1423614, 1414099, 1405695, 1398063, 1391000, 1384331, 1378274, 1373536, 1370645, 1369328, 1368893, 1369078, 1370199, 1372618, 1376430, 1381675, 1388462, 1396762, 1406358, 1417137, 1429241, 1442751, 1457347, 1472419, 1487503, 1502421, 1516990, 1530697, 1542786, 1552786, 1560826, 1567220, 1571664, 1573210, 1571331, 1566749, 1560786, 1553932, 1545597, 1535352, 1523881, 1512376, 1501367, 1490546, 1479460, 1467955, 1456107, 1444171, 1432532, 1421279, 1409824, 1397344, 1383659, 1369331, 1354828, 1339991, 1324513, 1308624]
52024A308624j5571j4611j3445j2400j1516j0606r533q540q089q209q249p751
52012A180104p223p526q627r655j0230j1027j2721j4911j6550j7122j6969j6673
52000A030870j6511j6400j6082j5371j4355j3381j2732j2485j2735j3616j4973
51989H72229j6280j7145j7658j8043j8204j8001j7693j7670j7796j7544j6763
51978F79432j5852j5087j4168j2680j0652q436o199l925j706K16J728K940L978
51965E99589M756N053M746L950K867J547j45k182m130n478o202o754p389p758
51951E82470p321o042m409k843j297O06L078N827Q159R537J0149J0688J1524J2328
51937F32454J2721J2900J3089J2742J0930P687M227J614k19j805l170m101m925
$$ y = [1308624, 1293053, 1278442, 1264997, 1252597, 1241081, 1230475, 1220942, 1212402, 1204313, 1196104, 1187855, 1180104, 1172881, 1165355, 1156728, 1147073, 1136843, 1125816, 1113095, 1098184, 1081634, 1064512, 1047543, 1030870, 1014359, 997959, 981877, 966506, 952151, 938770, 926038, 913553, 900818, 887202, 872229, 855949, 838804, 821146, 803103, 784899, 766898, 749205, 731535, 713739, 696195, 679432, 663580, 648493, 634325, 621645, 610993, 602557, 596358, 592433, 590727, 590943, 592671, 595611, 599589, 604345, 609398, 614144, 618094, 620961, 622508, 622363, 620181, 616051, 610573, 604371, 597617, 590228, 582470, 575149, 569107, 564698, 561855, 560558, 561164, 564242, 570069, 578228, 587765, 597914, 608602, 620126, 632454, 645175, 658075, 671164, 683906, 694836, 702523, 706750, 708364, 708145, 706340, 703170, 699069, 694144]
51924F94144o120p324p551o479m984m170m446n617p330r142j0620j1655j2326
51911E96380j2335j1149q890o460m406k331K7J824K098J190J88q05k689n602q310
51896E38730r763j0351j1007j1788j1999j1235r705p782n827m154k754j187Q18
51883D41996K911M548N706O708P689Q599R508J0349J0598R705P772N348K745Q1
51869E34263k235l647m211m534m906m992m448l392k101q01J69M74L17L52Q27J202
51853E02337Q07m57k237m043n313n717n647n925o693p162o802o121n725n240m010
51838D32052k379j304r18l70Q34K209L143L524L306K214L54j441k403k581k467
51823D33773k261j932j660j654j623r52M64J905K469J969J051M49J98k32j089
$$ y = [694144, 688024, 680700, 673149, 666670, 661686, 657516, 653070, 647453, 640123, 630981, 620361, 608706, 596380, 584045, 572896, 564006, 557546, 553140, 550809, 550836, 552660, 554758, 555948, 556136, 555331, 552642, 547040, 538730, 528967, 518616, 507609, 495821, 483822, 472587, 462882, 455100, 449273, 445119, 442365, 441178, 441996, 444907, 449455, 455161, 461869, 469558, 478157, 487665, 498014, 508612, 518317, 526089, 531437, 534182, 534263, 532028, 528381, 524170, 519636, 514730, 509738, 505290, 501898, 499797, 498996, 499165, 499639, 499956, 500308, 501135, 502337, 503144, 502687, 500450, 496407, 491094, 485377, 479730, 473805, 467112, 459950, 453148, 447027, 441302, 436062, 432052, 429673, 428369, 427451, 427081, 427915, 430124, 433267, 436791, 440097, 442311, 442665, 441224, 438821, 436240, 433773, 431512, 429580, 427920, 426266, 424643, 423691, 424155, 426060, 428529, 430498, 431549, 431998, 432196, 431964, 430875]
51808D30875j881k055j758j551j486j134m73m7r8j76K1J49j02l38j69N2k26q13
51790D18790j141j270j644k007j571l44O03N41oj63J17K93K23L42J087K596M721
51773D21167P004Q814R877J0491J0939J0938J0063Q440O583M631K312l84l019
51760E07856n249p124q704r721r858r159q029p011o521o519o396n533m087k819
51746D11126k035j207R0J403K146K649L703N218O187O087N540N282N153M580L552
51731D59474K470J457M31l14k49O82J994L239M083L917K130r18l820n371n517
51716D63688m829l589j910l53K79k19j258k085k265j729o88L47R07R77Q44N59
51700D48676j95j552l001l604k680l37K451M310M305K483k32k645l872l743k877
$$ y = [430875, 428994, 426939, 425181, 423630, 422144, 421010, 420537, 420490, 420392, 420216, 420237, 420386, 420284, 419946, 419777, 419829, 419603, 418790, 417649, 416379, 414735, 412728, 411157, 410813, 411416, 411957, 411951, 411788, 411905, 412198, 412421, 412763, 413850, 416446, 421167, 428171, 436985, 446862, 457353, 468292, 479230, 489293, 497733, 504316, 508947, 511259, 510875, 507856, 502607, 495483, 486779, 477058, 467200, 458041, 450012, 443001, 436480, 429961, 423565, 418032, 413945, 411126, 409091, 407884, 407974, 409377, 411523, 414172, 417875, 423093, 429280, 435367, 440907, 446189, 451342, 455922, 459474, 461944, 463401, 463832, 463518, 463269, 463951, 465945, 469184, 473267, 477184, 479314, 478396, 474576, 469205, 463688, 458859, 455270, 453360, 453007, 453286, 453067, 451809, 449724, 447459, 445730, 445042, 445389, 446296, 447273, 448117, 448676, 448481, 446929, 443928, 440324, 437644, 437307, 439758, 444068, 448373, 450856, 450624, 447979, 444107, 440364, 437487]
51685D37487k213k157k352k341k167k014j669q98q2J35j78k74K70J151K043L092
51669D27833M437N823P013Q142R311J0079R809Q238N636K610j9j599k182k362
51655D92769k383j794k36J870L857N527O714O576M166k41n063q825j1224j2754
51641D78959j3769j4136j3572j1987r642p065m715k708r72M14J191J319J163J250
51627D05730J796K444K548J873R67N89O68L08r70k463l211l247l342l728l797
51612C96165l085j954j117r21j242j696j779j188j55P55J369K064L119M242N005
51597C99582N577O651Q544J0517J1107R344N691J680j405l338m471n000m995m650
51583D34834l910k196Q49M484P396R052R916J0516J0989J1564J2560J3664J4061
$$ y = [437487, 435274, 433117, 430765, 428424, 426257, 424243, 422574, 421676, 421594, 421729, 421551, 421277, 421547, 422698, 424741, 427833, 432270, 438093, 445106, 453248, 462559, 472638, 482447, 490685, 496321, 498931, 498912, 497313, 495131, 492769, 490386, 488592, 488356, 490226, 494083, 499610, 506324, 512900, 517066, 516825, 511762, 502937, 491713, 478959, 465190, 451054, 437482, 425495, 415853, 408788, 404073, 401365, 400393, 400807, 401998, 403317, 404480, 405730, 407526, 409970, 412518, 414391, 415358, 415947, 416615, 416923, 415953, 413490, 410279, 407032, 403690, 399962, 396165, 393080, 391126, 390009, 389088, 387846, 386150, 384371, 383183, 383028, 383783, 385152, 387216, 390335, 394577, 399582, 405159, 411810, 420354, 430871, 441978, 451322, 457013, 458693, 457288, 453950, 449479, 444479, 439484, 434834, 430924, 428728, 429577, 434061, 441457, 450509, 460425, 470941, 481930, 493494, 506054, 519718, 533779]
51570E33779J3592J3080J3092J3176J2811J2456J3079J5181J8870K4192L0619
51559G13927L6659M0849M2926M3291M1717L7596L1255K4007J6684R007O84p660
51547A030942j5120k1524k7286l2606l7175m0437m1843m1077l8404l4670l0783
51536F70017k7216k4045k1235j8746j6531j4587j2918j1381r707p791n789l969
51524D96102k528j570j082r39j097j723k875m159n010n288n277n075m493l600
51510D51386k940k835k965k917k830l049l420l453l129k962l154l182k473j321
51496D10756p13j249k420l099k697j683r91r44j007n51K92P09P2j335k462k418
51480C90260j351l31k71r88j552j463j116j057j251j399j604k209l069l512l104
$$ y = [533779, 547371, 560451, 573543, 586719, 599530, 611986, 625065, 640246, 659116, 683308, 713927, 750586, 791435, 834361, 877652, 919369, 956965, 988220, 1012227, 1028911, 1037918, 1038602, 1030942, 1015822, 994298, 967012, 934406, 897231, 856794, 814951, 773874, 735470, 700800, 670017, 642801, 618756, 597521, 578775, 562244, 547657, 534739, 523358, 513651, 505860, 500071, 496102, 493574, 492004, 490922, 489983, 488886, 487163, 484288, 480129, 475119, 469831, 464554, 459479, 454986, 451386, 448446, 445611, 442646, 439729, 436899, 433850, 430430, 426977, 423848, 420886, 417732, 414550, 412077, 410756, 410043, 408794, 406374, 403275, 400578, 398895, 397904, 396960, 395953, 395402, 395694, 396403, 396475, 395140, 392678, 390260, 388909, 388578, 388307, 387319, 385767, 384304, 383188, 382131, 380880, 379481, 377877, 375668, 372599, 369087, 365983]
51465C65983k103j016o3P53J315J411J039N18K88O23J415K165K358K016J758K144
51449C80604L091M085M938O023P702R691J1217J1687J1070R634P585N178L011
51436D75516J829J740J892J188o62l057n350p332q836r386q732p402o190n161
51422D20057l721j700J39R52P20O7n10q74r40o39j01L86O33O02K84j95n16m86
51404D14158l78n54p88m16P70K115K877L066L289L902M674N201N416N669O439
51389D55440P943R946J2013J4047J6517K0022K4623K9729L4684L9379M4275M9763
51377G58381N5445O0086O2311O1470N7671N1204M2238L1220J9205P392l622j3934
51365A189067k3690l2666m0423m6566n0749n2741n2705n1294m9231m6727m3485
$$ y = [365983, 363880, 362864, 362801, 363554, 364869, 366280, 367319, 367837, 368125, 368748, 370163, 372328, 374686, 376702, 378460, 380604, 383695, 387780, 392718, 398741, 406443, 416134, 427351, 439038, 450108, 459742, 467327, 472505, 475516, 477345, 479085, 480977, 482165, 481503, 478446, 473096, 465764, 456928, 447542, 438810, 431408, 425218, 420057, 416336, 414636, 414775, 415727, 416447, 416514, 416004, 415130, 414190, 413551, 413450, 413836, 414469, 415071, 415355, 415160, 414644, 414158, 413780, 413226, 412438, 412022, 412792, 414907, 417784, 420850, 424139, 428041, 432715, 437916, 443332, 449001, 455440, 463383, 473329, 485342, 499389, 515906, 535928, 560551, 590280, 624964, 664343, 708618, 758381, 813826, 873912, 936223, 997693, 1055364, 1106568, 1148806, 1180026, 1199231, 1206623, 1203001, 1189067, 1165377, 1132711, 1092288, 1045722, 994973, 942232, 889527, 838233, 789002, 742275, 698790]
51354F98790l9260l4386k9667k5835k3003k0680j8304j5888j4024j3117j2689
51343D51937j1736r837p611n950n066m612m343m182l791k822j621j078j439j911
51329C85938j755j202q39o14j45M56Q42J179J817K373K166J457J364K244L155
51314C98436L182K509J733R22q8j106j915k676l449l826l587l199l139l104k642
51299C78051j999j693j679j694k037l009l898l564k013m76K15M25Q38J587K565
51284C61619L738M760M984M294L484L347L808M219M153L527K362Q80l89r22n64
51269D03300M10J437J899J643J317J655K427K624J833P62J45k69j052k046k554
51254D13531k397k159k458l323m264m663m220l252k433k139k229k513k973l415
$$ y = [698790, 659530, 625144, 595477, 569642, 546639, 525959, 507655, 491767, 477743, 464626, 451937, 440201, 430364, 422753, 416803, 411737, 407125, 402782, 398600, 394809, 391987, 390366, 389288, 387849, 385938, 384183, 382981, 382142, 381528, 381383, 381839, 382681, 383860, 385677, 388050, 390216, 391673, 393037, 395281, 398436, 401618, 404127, 405860, 406782, 406694, 405588, 403673, 400997, 397548, 393722, 390135, 386936, 383797, 380693, 378051, 376052, 374359, 372680, 370986, 368949, 365940, 362042, 358478, 356465, 355989, 356204, 356629, 357467, 359054, 361619, 365357, 370117, 375101, 379395, 382879, 386226, 390034, 394253, 398406, 401933, 404295, 405175, 404786, 403864, 403300, 403710, 405147, 407046, 408689, 410006, 411661, 414088, 416712, 418545, 419307, 419452, 419183, 418131, 416085, 413531, 411134, 408975, 406517, 403194, 398930, 394267, 390047, 386795, 384362, 382223, 379994, 377481, 374508, 371093]
51240C71093l353k622j747j277j047n23M32J460K152K226J584N49j82k67p0m2
51224C68366p3P3K33K91P35J980L369L800L256K763K788K611J592K46m79l88Q0
51207C91243O63J373K077K483K509K251J735R75J53n30j153j865k494k634k180
51192C94606j543j200j158r95m03M14R62J017P87N75M36L82O43J395K278K560
51176D00756J859M73r34j760j655p77O7K0q09j282m96J201K719L470L643L537
51160D10032L206K762K460K261J717N88p42j705k230k633l032l262l326l495l827
51145C98774l984l727l334l135k957k412j647j234j286j169m08N69R47O28L78
51130C76003R34K166L218L351K690K156K539L594M350M324M058M163M360L919
$$ y = [371093, 367740, 365118, 363371, 362094, 361047, 360524, 360956, 362416, 364568, 366794, 368378, 368927, 368745, 368478, 368408, 368366, 368293, 368366, 368599, 368890, 369625, 371605, 374974, 378774, 382030, 384793, 387581, 390192, 391784, 392030, 391551, 391163, 391243, 391906, 393279, 395356, 397839, 400348, 402599, 404334, 405309, 405462, 404932, 403779, 401914, 399420, 396786, 394606, 393063, 391863, 390705, 389710, 389307, 389721, 390683, 391700, 392487, 393062, 393498, 393880, 394523, 395918, 398196, 400756, 402615, 403088, 402154, 400394, 398739, 397962, 398029, 398049, 397240, 395958, 395462, 396663, 399382, 402852, 406495, 410032, 413238, 416000, 418460, 420721, 422438, 423026, 422284, 420579, 418349, 415716, 412684, 409422, 406096, 402601, 398774, 394790, 391063, 387729, 384594, 381637, 379225, 377578, 376344, 375058, 373889, 373481, 374050, 374997, 375625, 376003, 376937, 379103, 382321, 385672, 388362, 390518, 393057, 396651, 401001, 405325, 409383, 413546, 417906, 421825]
51116D21825K813J763J251J062R04Q49R95J166J211J226J222R25K21m72o26k07
51100D36128L50O49N81J99l35p66r74j126j405j646j479q81k91j45l47l97L0O66
51082D28811R04M62k58n21rR12J584J631J165O41N71J222K419L667M554N061N502
51065D58318O264P577R406J1511J3649J5688J7450J8522J8471J7314J5653J4217
51053F24040J3454J3500J4338J5737J7156J7869J7260J5112J1728P770L723m98
51041G71189n157r884j3523j5088j4681j3290j1781j0465r475r191r929j1388
51029F37337j2701j3155j2720j1711j0204q036n435l147j615m72P80J829K000
51016E62750J488J407K406L934N145N958O704P350P727Q189R280J0855J2150J2697
$$ y = [421825, 424638, 426401, 427652, 428714, 429618, 430467, 431462, 432628, 433839, 435065, 436287, 437212, 437433, 436961, 436335, 436128, 436478, 437127, 437708, 437907, 437572, 436806, 435832, 434706, 433301, 431655, 430176, 429295, 429004, 428859, 428512, 428115, 428145, 428811, 429715, 430177, 429919, 429398, 429389, 430301, 431885, 433516, 434681, 435322, 435893, 437115, 439534, 443201, 447755, 452816, 458318, 464582, 472159, 481565, 493076, 506725, 522413, 539863, 558385, 576856, 594170, 609823, 624040, 637494, 650994, 665332, 681069, 698225, 716094, 733354, 748466, 760194, 767964, 771687, 771189, 766032, 756148, 742625, 727537, 712856, 699566, 687785, 677320, 667845, 658654, 648725, 637337, 624636, 611481, 598761, 587050, 576846, 568810, 563375, 560228, 558613, 558141, 558921, 560750, 562750, 564238, 565645, 568051, 571985, 577130, 583088, 589792, 597142, 604869, 613058, 622338, 633193, 645343, 658040]
51002F58040J2653J2263J1549J0603R658Q758P746O659N696M701L162R55j269
50989G51174k656k848k034p35M32J262K421M815Q211J1052J2146J2003J1950J2387
50975H19580J2840J3348J4792J7726K1733K6173L0857L5663M0142M3995M7417
50964A124266N0581N3209N5124N6741N8438N9730N9726N8221N5752N2697M8889
50953A733374M4222L9046L3856K8906K4282K0034J6252J3321J1992J2636J4292
50942A992213J5094J3884J1078P761M416R15k791o517j0160j3675j6836j9457
50930A975925k1845k4693k8469l3076l8057m2973m7586n1783n5338n7750n8554
50919A515801n7831n6131n3824n0829m7139m3172l9321l5534l1750k8360k5797
$$ y = [658040, 670693, 682956, 694505, 705108, 714766, 723524, 731270, 737929, 743625, 748326, 751488, 752443, 751174, 748518, 745670, 743636, 742901, 743333, 744595, 747016, 751831, 760042, 771094, 783240, 795243, 807193, 819580, 832420, 845768, 860560, 878286, 900019, 926192, 957049, 992712, 1032854, 1076849, 1124266, 1174847, 1228056, 1283180, 1339921, 1398359, 1458089, 1517815, 1576036, 1631788, 1684485, 1733374, 1777596, 1816642, 1850498, 1879404, 1903686, 1923720, 1939972, 1953293, 1965285, 1977921, 1992213, 2007307, 2021191, 2032269, 2040030, 2044446, 2045361, 2042570, 2036053, 2025893, 2012218, 1995382, 1975925, 1954080, 1929387, 1900918, 1867842, 1829785, 1786812, 1739226, 1687443, 1632105, 1574355, 1515801, 1457970, 1401839, 1348015, 1297186, 1250047, 1206875, 1167554, 1132020, 1100270, 1071910, 1046113]
50908A046113k3882k2100k0316j8766j7518j6386j5299j4245j3044j1595j0178
50897H62784r016p762o056m348l437l210k735j682q09o94q45m72M59J463K345
50882H25985L202M040M853N827P057Q257R069R429R452R271R249R905J1297J2840
50868I39733J4101J5403J7272J9646K2103K4565K7273L0288L3531L7146M1325
50857A222386M5906N0589N5522O1231O7987P5549Q3468R1350R8904J06039J12811
50846B071742J19091J24396J28370J31207J33163J33711J31633J25956J16635
50837C215904J04358R0022P4451N8334M2391K7485J4412L494n299j1701j5054
50826C598797j5085j2417p954k170M466J0798J5370J7359J6539J2530M785o609
$$ y = [1046113, 1022231, 1000131, 979815, 961049, 943531, 927145, 911846, 897601, 884557, 872962, 862784, 853768, 846006, 839950, 835602, 832165, 828955, 826220, 824538, 823729, 823035, 822190, 821718, 822177, 823640, 825985, 829187, 833227, 838080, 843907, 850964, 859221, 868290, 877719, 887171, 896442, 905691, 915596, 926893, 939733, 953834, 969237, 986509, 1006155, 1028258, 1052823, 1080096, 1110384, 1143915, 1181061, 1222386, 1268292, 1318881, 1374403, 1435634, 1503621, 1579170, 1662638, 1753988, 1852892, 1958931, 2071742, 2190833, 2315229, 2443599, 2574806, 2707969, 2841680, 2973313, 3099269, 3215904, 3320262, 3410284, 3484735, 3543069, 3585460, 3612945, 3627357, 3630851, 3625552, 3613851, 3598797, 3583712, 3571295, 3563341, 3561171, 3565637, 3576435, 3591805, 3609164, 3625703, 3638233, 3643018, 3636409]
50814C636409k0682l6205n2242o8164q3633r8530j12407j24117j32477j37220
50804B770732j38843j37627j33482j26698j18110j08321r7470q5955p4729o4516
50794A684981n5198m6374l8100l0720k4279j8484j3203q704n434l524k439j390
50782A437132l12j01j430l610n370o501p796r407j0444j0548j0764j2148j4291
50769A344410j6080j7291j8509j9892k0963k1483k1764k1954k1699k0593j8637
50758A125545j6143j3518j1167r290p786o457n136l536j292J553M412O932R632
50745A073749J3288J7868K2534K6673L0420L4230L8344M2726M7179N1424N5298
50734A453733N8874O2150O4763O6313O6933O7213O7577O7942O7899O6917O4436
$$ y = [3636409, 3615727, 3579522, 3527280, 3459116, 3375483, 3276953, 3164546, 3040429, 2907952, 2770732, 2631889, 2494262, 2360780, 2234082, 2115972, 2007651, 1910181, 1824226, 1749497, 1684981, 1629783, 1583409, 1545309, 1514589, 1490310, 1471826, 1458623, 1449919, 1444485, 1440961, 1438522, 1437132, 1436820, 1436719, 1435289, 1431679, 1426309, 1419808, 1412012, 1402605, 1392161, 1381613, 1370849, 1358701, 1344410, 1328330, 1311039, 1292530, 1272638, 1251675, 1230192, 1208428, 1186474, 1164775, 1144182, 1125545, 1109402, 1095884, 1084717, 1075427, 1067641, 1061184, 1056048, 1052512, 1051220, 1052773, 1057185, 1064117, 1073749, 1087037, 1104905, 1127439, 1154112, 1184532, 1218762, 1257106, 1299832, 1347011, 1398435, 1453733, 1512607, 1574757, 1639520, 1705833, 1772766, 1839979, 1907556, 1975498, 2043397, 2110314, 2174750]
50723B174750O0301N5024M9247M2840L4949K5103J3844K141r304j9770k7957l2421
50711B368747l2762k9987k5502j9992j3526o463K29N667R621J2198J3178J1999
50699B293407Q323K201o170j6501k8105l9936n1071o0938o9022p4722p7642p7791
50687A802033p5350p0602o4201n7078m9782m2212l4272k6402j9176j2587o144
50676A344227N17P359J4084K0195K5136K8737L1314L3031L3434L2027K9176K5918
50664A625155K2951K0224J7468J4752J2482J1076J0617J0586J0098Q789P272O436
50652A777906O429O739P132P986R707J2262J5380J8807K2318K5802K9434L3344
50640A973246L7075L9679M0563M0085L9214L8741L8746L8715L8234L7636L7774
$$ y = [2174750, 2235051, 2290075, 2339322, 2382162, 2417111, 2442214, 2456058, 2458199, 2448895, 2429125, 2401168, 2368747, 2335985, 2305998, 2280496, 2260504, 2246978, 2240515, 2240744, 2246411, 2256032, 2268230, 2281408, 2293407, 2301730, 2303931, 2297761, 2281260, 2253155, 2213219, 2162148, 2101210, 2032188, 1957466, 1879824, 1802033, 1726683, 1656081, 1591880, 1534802, 1485020, 1442808, 1408536, 1382134, 1362958, 1350371, 1344227, 1344744, 1352103, 1366187, 1386382, 1411518, 1440255, 1471569, 1504600, 1538034, 1570061, 1599237, 1625155, 1648106, 1668330, 1685798, 1700550, 1713032, 1724108, 1734725, 1745311, 1755409, 1764198, 1771470, 1777906, 1784335, 1791074, 1798206, 1806192, 1815899, 1828161, 1843541, 1862348, 1884666, 1910468, 1939902, 1973246, 2010321, 2050000, 2090563, 2130648, 2169862, 2208603, 2247349, 2286064, 2324298, 2361934, 2399708]
50629B399708L8982M0572M1461M0584L6310K6307R525j1703l2399m8259n7695
50618B483393o1063n9253n3547m5733l7226k8425j9488j1293m952p34J830K961
50606B166470K294m82n245j1616j9120k7187l5340m3283n0542n6211n9564o0844
50594A799330o0974o0453n9004n6386n3156n0184m7689m5081m1802l8099l4767
50583A251735l2271l0369k8563k6613k4368k1414j7443j2941q986o159m024j828
50571A036756O61L287N963Q581J0735J2075J2955J4225J6325J8879K1256K3319
50559A185017K5425K7827L0199L1895L2633L2854L3211L3761L3884L3041L1301
50548A531048K9129K6925K4978K3567K2922K3245K4812K7783L1692L5607L9098
$$ y = [2399708, 2438690, 2479262, 2520723, 2561307, 2597617, 2623924, 2633449, 2621746, 2589347, 2541088, 2483393, 2422330, 2363077, 2309530, 2263797, 2226571, 2198146, 2178658, 2167365, 2162413, 2161679, 2163509, 2166470, 2168764, 2168282, 2163037, 2151421, 2132301, 2105114, 2069774, 2026491, 1975949, 1919738, 1860174, 1799330, 1738356, 1677903, 1618899, 1562513, 1509357, 1459173, 1411484, 1366403, 1324601, 1286502, 1251735, 1219464, 1189095, 1160532, 1133919, 1109551, 1088137, 1070694, 1057753, 1048767, 1042608, 1038584, 1036756, 1037417, 1040704, 1046667, 1055248, 1065983, 1078058, 1091013, 1105238, 1121563, 1140442, 1161698, 1185017, 1210442, 1238269, 1268468, 1300363, 1332996, 1365850, 1399061, 1432822, 1466706, 1499747, 1531048, 1560177, 1587102, 1612080, 1635647, 1658569, 1681814, 1706626, 1734409, 1766101, 1801708, 1840806]
50537A840806M2717M7171N2241N7012O1005O4677O8851P4025Q0185Q6879R3362
50526B568931R8908J03115J05855J07044J06557J04233R9827R3147Q4380P3914
50516C545911O1612M6771K9291J0543p611k4531m0804n6599p0875q2439r1065
50505C320204r7052j00153r9567r4855q6449p5270o2195m7842l2644j7047j638
50494B605492J2900K5949L6980M5320N0064N0271M5237L4771J9390K36k1354m4037
50482B861219o6135q5505j00398j10531j16732j19503j18585j14094j07328r9834
50472A822574r2143q3997p5446o7009n9016n1534m4899l9576l5396l1599k7866
50461A214093k4614k2063j9662j6947j4335j2381j0652q185m918j809N85K836
$$ y = [1840806, 1883523, 1930694, 1982935, 2039947, 2100952, 2165629, 2234480, 2308505, 2388690, 2475569, 2568931, 2667839, 2770954, 2876809, 2983853, 3090410, 3194643, 3294470, 3387617, 3471997, 3545911, 3607523, 3654294, 3683585, 3694128, 3686517, 3661986, 3621182, 3564583, 3493708, 3411269, 3320204, 3223152, 3122999, 3023432, 2928577, 2842128, 2766858, 2704663, 2656821, 2624177, 2607130, 2605492, 2618392, 2644341, 2681321, 2726641, 2776705, 2826976, 2872213, 2906984, 2926374, 2926610, 2905256, 2861219, 2795084, 2709579, 2609181, 2498650, 2381918, 2262415, 2143830, 2029736, 1922408, 1822574, 1730431, 1646434, 1570988, 1503979, 1444963, 1393429, 1348530, 1308954, 1273558, 1241959, 1214093, 1189479, 1167416, 1147754, 1130807, 1116472, 1104091, 1093439, 1085254, 1080336, 1078527, 1079112, 1081948]
50449A081948N591Q473J0592J1760J2572J3518J4547J5483J6272J6727J6456J5323
50437A239262J3676J2009J0603R597R064Q855Q551P904P185O922P279P864Q129
50424A356900P927P710Q160R544J1519J3687J6285J9944K4726K9858L4578L8875
50412A579713M3112M7257N0892N3771N5922N7233N7356N6030N3285M9387M4731
50401B148689L9657L4048K7270J8882R220j052j1759k3016l4247m4175n1988n7989
50389B053540o2757o6101o7236o5655o1456n5124m7372l9043l0668k2215j3492
50378A522421m774L280J0203J5860K0080K2460K2514J9858J4301O185l357j2954
50366A636077k1928l0430l8480m5255m9694n1561n1548n0417m8471m5821m2731
$$ y = [1081948, 1087539, 1096012, 1106604, 1118364, 1130936, 1144454, 1159001, 1174484, 1190756, 1207483, 1223939, 1239262, 1252938, 1264947, 1275550, 1285147, 1294211, 1303066, 1311617, 1319521, 1326706, 1333628, 1340907, 1348771, 1356900, 1364827, 1372537, 1380697, 1390241, 1401760, 1415447, 1431732, 1451676, 1476402, 1506260, 1540838, 1579713, 1622825, 1670082, 1720974, 1774745, 1830667, 1887900, 1945256, 2001286, 2054571, 2103958, 2148689, 2188346, 2222394, 2249664, 2268546, 2277766, 2276714, 2264955, 2241939, 2207692, 2163517, 2111529, 2053540, 1990783, 1924682, 1857446, 1791791, 1730335, 1675211, 1627839, 1588796, 1558128, 1535913, 1522421, 1517647, 1520927, 1531130, 1546990, 1567070, 1589530, 1612044, 1631902, 1646203, 1652388, 1649031, 1636077, 1614149, 1583719, 1545239, 1499984, 1450290, 1398729, 1347181, 1296764, 1248293, 1202472, 1159741]
50355A159741l9426l5938l2364k9020k5986k2733j8673j3976r386n284j442K142
50343I27655M741N625M792K598q56n371r913j3048j4193j3885j2790j1037q684
50330H55634o180m006k209o80N41J487K501L783N009N750O081O410O894P372P667
50315H96054P601O896N555M220L667L930M394M763N409O560P695Q088P722P200
50301I79754O916O700O295N950O273P524R156J0263J0531J0679J1765J4194J7531
50288A103531K1081K4162K5717K4217J8496Q900k470j2699j9482k2086k1381j8956
50276A129030j6061j3131j0066o721l243j66J765K213J737J386J655K104K174
50263A092676K060K535M051O316Q618J0320J1344J2344J4261J7278K0472K2842
$$ y = [1159741, 1120315, 1084377, 1052013, 1022993, 997007, 974274, 955601, 941625, 932239, 926955, 925513, 927655, 932396, 938021, 942813, 945411, 944555, 939184, 929271, 916223, 902030, 888145, 875355, 864318, 855634, 849454, 845448, 843239, 842559, 843100, 844587, 847088, 850871, 855880, 861630, 867711, 874121, 881015, 888387, 896054, 903655, 910551, 916106, 920326, 923993, 927923, 932317, 937080, 942489, 949049, 956744, 964832, 972554, 979754, 986670, 993370, 999665, 1005615, 1011888, 1019412, 1028568, 1038831, 1049362, 1060041, 1071806, 1086000, 1103531, 1124612, 1148774, 1174491, 1198708, 1217204, 1226104, 1223634, 1210935, 1191453, 1169367, 1147986, 1129030, 1112969, 1099838, 1089772, 1083051, 1079808, 1079642, 1081407, 1083620, 1085357, 1086743, 1088398, 1090502, 1092676, 1094736, 1097271, 1101322, 1107638, 1116256, 1126576, 1137920, 1150264, 1164525, 1181803, 1202275, 1225117]
50251A225117K4516K6382K8578L0046K9781K8015K5866K4178K3056K2230K1438
50240A509203K0525J9432J8005J5760J2019O531k52p629j5097k2112k7768l1268
50228A497349l2695l2825l2158l0483k7534k3786k0399j8571j8989k1630k5772
50217A212507l0236l3815l5704l5727l4272l1918k9076k6001k3110k0950j9585
50206H92113j8322j6406j3905j1572r948r016q588q481q248p335n885m884n098
50193G64425o081o671o319n546n095n069m969m393l451k553j959j621j402j298
50179G07998j283j144o71l4L51L29K01L43Q05J360J720J741J598J718K285K916
50163G20233L156L233L780M848N734O028O192O831P915R022R848J0133R662Q860
$$ y = [1225117, 1249633, 1276015, 1304593, 1334639, 1364420, 1392435, 1418301, 1442479, 1465535, 1487765, 1509203, 1529728, 1549160, 1567165, 1582925, 1594944, 1601475, 1601223, 1593594, 1578497, 1556385, 1528617, 1497349, 1464654, 1431829, 1399671, 1369188, 1341654, 1317868, 1297469, 1278898, 1259909, 1238279, 1212507, 1182271, 1148456, 1112752, 1077025, 1042753, 1010835, 981759, 955758, 932648, 911698, 892113, 873791, 857385, 843480, 831908, 821960, 812944, 804356, 795875, 787627, 780292, 774407, 769523, 764425, 758344, 751673, 745354, 739808, 734713, 729644, 724675, 720282, 716831, 714278, 712319, 710698, 709296, 707998, 706715, 705571, 704900, 704866, 705217, 705546, 705747, 706090, 706895, 708255, 709975, 711716, 713314, 715032, 717317, 720233, 723389, 726622, 730402, 735250, 740984, 747012, 753204, 760035, 767950, 776972, 786820, 796953, 806615, 815475]
50149H15475Q728R568J0269R743Q660Q805J0943J4245J7861K1967K7048L2998
50137I96310L9436M6189N2982N9072O3697O6550O7543O6529O3703N9946N6349
50126A638306N3503N1497N0227M9289M7666M4073L7735K8697J7402M247j0210
50115B012432k4811l7911m8254n5743o1118o4802o6449o5814o3605o0884n7866
50104A405175n3942m8923m3676l9339l6326l4322l2821l1439k9961k8310k6389
50093I99727k3996k1095j8053j5237j2580r916p578n964m698l006j061O1J6j24
50079H76496O66K053L127L742M299M769M874M908N423O262O649O167N014L469
50065I37918J804O58O48J400J669O43j294l260m829o048o917p229o788n672m313
$$ y = [815475, 824203, 833771, 844040, 853783, 862443, 871248, 882191, 896436, 914297, 936264, 963312, 996310, 1035746, 1081935, 1134917, 1193989, 1257686, 1324236, 1391779, 1458308, 1522011, 1581957, 1638306, 1691809, 1743306, 1793533, 1842822, 1890488, 1934561, 1972296, 2000993, 2018395, 2022642, 2012432, 1987621, 1949710, 1901456, 1845713, 1784595, 1719793, 1653344, 1587530, 1523925, 1463041, 1405175, 1351233, 1302310, 1258634, 1219295, 1182969, 1148647, 1115826, 1084387, 1054426, 1026116, 999727, 975731, 954636, 936583, 921346, 908766, 898850, 891272, 885308, 880610, 877604, 876543, 876604, 876620, 876496, 877162, 879215, 882342, 886084, 890383, 895152, 900026, 904934, 910357, 916619, 923268, 929435, 934449, 937918, 939722, 940380, 941028, 942428, 944097, 944740, 943446, 940186, 935357, 929309, 922392, 915163, 908375, 902703, 898390]
50050H98390l266k692k194j360k37R87K481M392O196P180P557Q377J0099J1930
50036I47840J3010J3630J4703J6360J7787J8309J8078J7517J6660J5376J3985
50025A123255J3171J3234J3706J3969J4075J4734J6438J8792K0810K1795K1961
50014A305940K2285K3584K5549K6781K6174K4140K2012K0442J9081J7850J7507
50003A551345J8375J9319J8819J6407J2280O047k888j3838k4907l4681m2935m9530
49991A473813n3742n5259n5002n4232n3234n1419m8419m4528m0300l6143l2252
49980I49283k8670k5395k2497j9985j7650j5328j3339j2158j1591j0775r208p321
49968G55366n784m699l862l315l144k958k098l45J859L824N059N545N794O515
$$ y = [898390, 895124, 892432, 890238, 888878, 888641, 889628, 892109, 896501, 902697, 909877, 917434, 925811, 935910, 947840, 960850, 974480, 989183, 1005543, 1023330, 1041639, 1059717, 1077234, 1093894, 1109270, 1123255, 1136426, 1149660, 1163366, 1177335, 1191410, 1206144, 1222582, 1241374, 1262184, 1283979, 1305940, 1328225, 1351809, 1377358, 1404139, 1430313, 1454453, 1476465, 1496907, 1515988, 1533838, 1551345, 1569720, 1589039, 1607858, 1624265, 1636545, 1642592, 1639704, 1625866, 1600959, 1566278, 1523343, 1473813, 1420071, 1364812, 1309810, 1255578, 1202344, 1150925, 1102506, 1057978, 1017678, 981535, 949283, 920613, 895218, 872721, 852736, 835086, 819758, 806419, 794261, 782670, 771895, 762687, 755366, 749582, 744883, 741021, 737706, 734562, 731604, 729506, 729161, 731020, 734844, 739903, 745448, 751242, 757757]
49954G57757P927R459J0281R976Q570O289L611J325R9j09j1m04j680l667n804
49939H03619p540q803r995j1413j2914j4232j5341j6177j6239j4894j2174r023
49927F54874o606n450n141m799l838k391r79Q1Q96J667K426L129L757M250M558
49912F46434M797N190N785O465P302Q564J0238J1826J2787J3047J2933J2828J2832
49899G71028J2511J1053Q067M324J210p01k134m094o793r774j2434j4171j4599
49886G43493j4101j3613j3501j3163j2181j1177j0790j0458r220p321o007n733
49874F16228n686n144m322l563k640j328PR86J890L218M929O625Q215R936J1795
49859F41146J3493J4743J5380J5264J4422J3241J2113J0900R086O575M026K165
$$ y = [757757, 765684, 775143, 785424, 795400, 803970, 810259, 813870, 815195, 815294, 815185, 815174, 814770, 813090, 809423, 803619, 796079, 787276, 777281, 765868, 752954, 738722, 723381, 707204, 690965, 676071, 663897, 654874, 648268, 642818, 637677, 632878, 629040, 626649, 625670, 625751, 626647, 628314, 630740, 633869, 637626, 641876, 646434, 651231, 656421, 662206, 668671, 675973, 684537, 694775, 706601, 719388, 732435, 745368, 758196, 771028, 783539, 794592, 802659, 806983, 808193, 807492, 805358, 801264, 794471, 784697, 772263, 758092, 743493, 729392, 715779, 702278, 689115, 676934, 665757, 654967, 644509, 635289, 627968, 621961, 616228, 610542, 605398, 601076, 597513, 594873, 593545, 593552, 594538, 596428, 599646, 604575, 611200, 619415, 629351, 641146, 654639, 669382, 684762, 700026, 714448, 727689, 739802, 750702, 759788, 766363, 770389, 772554]
49847G72554R50l22k192m629p320r977j2150j3218j2961j1936j0819r529p570
$$ y = [772554, 773504, 773182, 770990, 766361, 759041, 749064, 736914, 723696, 710735, 698799, 687980, 678451, 670881]
$$ [...]
##END NTUPLES=NMR SPECTRUM
##END=
