##TITLE=AC1748_SEN00021_9280779_F6sPPhdgcC
##JCAMPDX= 6.0         $$ Bruker NMR JCAMP-DX V2.0
##DATA TYPE= NMR SPECTRUM
##DATA CLASS= NTUPLES
##ORIGIN= BRUKER
##OWNER= Administrator
$$ 1.72 TOPSPIN		Version 2.1
$$ 2015-07-17 20:53:25.010 -0700  Administrator@X
$$ Compression mode = diff/dup
##.OBSERVE FREQUENCY= 400.02188249412
##.OBSERVE NUCLEUS= ^1H
##.ACQUISITION MODE= SIMULTANEOUS (DQD)
##.ACQUISITION SCHEME= undefined
##.AVERAGES= 8
##.DIGITISER RES= 22
##SPECTROMETER/DATA SYSTEM= spect
##.PULSE SEQUENCE= zg30
##.SOLVENT NAME= COFFEE_meoh
##.SHIFT REFERENCE= INTERNAL, COFFEE_meoh, 1, 14.98509
##AUDIT TRAIL= $$ (NUMBER, WHEN, WHO, WHERE, PROCESS, VERSION, WHAT)
$$ ##TITLE= Audit trail, TOPSPIN		Version 2.1
$$ ##JCAMPDX= 5.01
$$ ##ORIGIN= Bruker BioSpin GmbH
$$ ##OWNER= Administrator
$$ $$ E:\/data/COFFEE/nmr/AC1748_SEN00021_9280779_F6sPPhdgcC/10/pdata/1/auditp.txt
$$ ##AUDIT TRAIL=  $$ (NUMBER, WHEN, WHO, WHERE, PROCESS, VERSION, WHAT)
(   1,<2015-07-17 20:53:18.057 -0700>,<Administrator>,<X>,<go>,<TOPSPIN 2.1>,
      <created by zg
	started at 2015-07-17 20:52:11.322 -0700,
	POWCHK enabled, PULCHK disabled,
       configuration hash MD5:
       21 0F 79 D6 B3 7B B4 F6 88 20 88 DB 03 48 BD 9F
       data hash MD5: 64K
       9B CB 4C FE A3 30 A3 42 2B 4C 0D 4F D7 C5 E5 BB>)
(   2,<2015-07-17 20:53:21.432 -0700>,<Administrator>,<X>,<proc1d>,<TOPSPIN 2.1>,
      <Start of raw data processing
       efp LB = 0 FT_mod = 6 PKNL = 1 PHC0 = 0 PHC1 = 0 SI = 32K 
       data hash MD5: 32K
       1D 87 54 6A EE 11 43 20 B7 C0 87 96 5A 82 AC 1C>)
(   3,<2015-07-17 20:53:21.760 -0700>,<Administrator>,<X>,<proc1d>,<TOPSPIN 2.1>,
      <pk PHC0 = 87.81372 PHC1 = 0 
       data hash MD5: 32K
       C1 74 43 80 EE 58 99 72 40 80 E6 96 1D 47 92 14>)
(   4,<2015-07-17 20:53:21.854 -0700>,<Administrator>,<X>,<proc1d>,<TOPSPIN 2.1>,
      <abs ABSG = 1 
       data hash MD5: 32K
       A4 89 2F E1 25 2A CE C7 4C 16 24 B0 3D B4 F8 FA>)
(   5,<2015-07-17 20:53:21.900 -0700>,<Administrator>,<X>,<proc1d>,<TOPSPIN 2.1>,
      <abs ABSG = 2 
       data hash MD5: 32K
       C5 82 C4 0F 7B 2C 75 A1 31 E4 26 29 03 38 F4 A2>)
(   6,<2015-07-17 20:53:21.963 -0700>,<Administrator>,<X>,<proc1d>,<TOPSPIN 2.1>,
      <abs ABSG = 3 
       data hash MD5: 32K
       B3 7A 58 68 4F BD EE EB A0 72 3C 30 89 13 51 EF>)
(   7,<2015-07-17 20:53:22.010 -0700>,<Administrator>,<X>,<proc1d>,<TOPSPIN 2.1>,
      <abs ABSG = 4 
       data hash MD5: 32K
       90 DC BE 0A E5 0A 58 45 71 99 C2 7E 63 1F 56 9D>)
(   8,<2015-07-17 20:53:22.057 -0700>,<Administrator>,<X>,<proc1d>,<TOPSPIN 2.1>,
      <abs ABSG = 5 
       data hash MD5: 32K
       38 65 B8 39 8C C1 7C 7E CE 0B 6E 36 38 A3 38 AD>)
$$ ##END=
$$ 
$$ $$ hash MD5
$$ $$ CE 45 89 54 E9 6C 5D C5 CC 29 F8 76 3E 82 DE 0B
##$RELAX= 
##$RELAX= 
##$RELAX= 
##$RELAX= 
##$RELAX= 
##$RELAX= 
##$RELAX= 
$$ Bruker specific parameters
$$ --------------------------
##$DU= <E:\>
##$EXPNO= 10
##$NAME= <AC1748_SEN00021_9280779_F6sPPhdgcC>
$$ [...]
150 150 150 150 150 150 150 150
##$TP07= 0
##$TPNAME0= <>
##$TPNAME1= <>
##$TPNAME2= <>
##$TPNAME3= <>
##$TPNAME4= <>
##$TPNAME5= <>
##$TPNAME6= <>
##$TPNAME7= <>
##$TPOAL= (0..7)
0.5 0.5 0.5 0.5 0.5 0.5 0.5 0.5
##$TPOFFS= (0..7)
0 0 0 0 0 0 0 0
##$TUNHIN= 0
##$TUNHOUT= 0
##$TUNXOUT= 0
##$USERA1= <user>
##$USERA2= <user>
##$USERA3= <user>
##$USERA4= <user>
##$USERA5= <user>
##$V9= 5
##$VALIST= <valist>
##$VCLIST= <CCCCCCCCCCCCCCC>
##$VD= 0
##$VDLIST= <DDDDDDDDDDDDDDD>
##$VPLIST= <PPPPPPPPPPPPPPP>
##$VTLIST= <TTTTTTTTTTTTTTT>
##$WBST= 2048
##$WBSW= 25
##$XGAIN= (0..3)
0 0 0 0
##$XL= 0
##$YL= 0
##$YMAX_a= 605069
##$YMIN_a= -529683
##$ZGOPTNS= <>
##$ZL1= 120
##$ZL2= 120
##$ZL3= 120
##$ZL4= 120
##$ABSF1= 14.98509
##$ABSF2= -5.573092
##$ABSG= 5
##$ABSL= 3
##$ALPHA= 0
##$AQORDER= 0
##$ASSFAC= 0
##$ASSFACI= 0
##$ASSFACX= 0
##$ASSWID= 0
##$AUNMP= <proc_prof1d_extract_pilot.lims>
##$AXLEFT= 0
##$AXNAME= <>
##$AXNUC= <1H>
##$AXRIGHT= 0
##$AXTYPE= 0
##$AXUNIT= <>
##$AZFE= 0.1
##$AZFW= 0.1
##$BCFW= 0
##$BC_mod= 0
##$BYTORDP= 0
##$COROFFS= 0
##$CY= 15
##$DATMOD= 1
##$DC= 0
##$DFILT= <>
##$DTYPP= 0
##$F1P= 0
##$F2P= 0
##$FCOR= 0.5
##$FTSIZE= 32768
##$FT_mod= 6
##$GAMMA= 0
##$GB= 0
##$INTBC= 1
##$INTSCL= 1
##$ISEN= 128
##$LB= 0
##$LEV0= 0
##$LPBIN= 0
##$MAXI= 10000
##$MC2= 0
##$MEAN= 0
##$ME_mod= 0
##$MI= 0
##$NCOEF= 0
##$NC_proc= -8
##$NLEV= 6
##$NOISF1= 0
##$NOISF2= 0
##$NSP= 0
##$NTH_PI= 0
##$NZP= 0
##$OFFSET= 14.98509
##$PC= 1
##$PHC0= 87.81372
##$PHC1= 0
##$PH_mod= 1
##$PKNL= yes
##$PPARMOD= 0
##$PPDIAG= 0
##$PPIPTYP= 0
##$PPMPNUM= 2147483647
##$PPRESOL= 1
##$PSCAL= 4
##$PSIGN= 0
##$PYNMP= <proc.py>
##$REVERSE= no
##$SF= 400.02
##$SI= 32768
##$SIGF1= 0
##$SIGF2= 0
##$SINO= 400
##$SIOLD= 32768
##$SPECTYP= <>
##$SREGLST= <1H.CDCl3>
##$SSB= 0
##$STSI= 32768
##$STSR= 0
##$SW_p= 8223.68421052631
##$SYMM= 0
##$S_DEV= 0
##$TDeff= 65536
##$TDoff= 0
##$TI= <>
##$TILT= no
##$TM1= 0
##$TM2= 0
##$TOPLEV= 0
##$USERP1= <user>
##$USERP2= <user>
##$USERP3= <user>
##$USERP4= <user>
##$USERP5= <user>
##$WDW= 1
##$XDIM= 32768
##$YMAX_p= 449231266
##$YMIN_p= -685620
##$CURPLOT= <Network HP LaserJet P1505>
##$CURPRIN= <$Network HP LaserJet P1505>
##$DFORMAT= <normdp>
##$LAYOUT= <+/1D_H.xwp>
##$LFORMAT= <normlp>
##$PFORMAT= <normpl>
##$SURQMSG= 1
$$ End of Bruker specific parameters
$$ ---------------------------------
##NTUPLES= NMR SPECTRUM
##VAR_NAME=  FREQUENCY,     SPECTRUM/REAL,   SPECTRUM/IMAG
##SYMBOL=    X,             R,               I
##VAR_TYPE=  INDEPENDENT,   DEPENDENT,       DEPENDENT
##VAR_FORM=  AFFN,          ASDF,            ASDF
##VAR_DIM=   32768,         32768,           32768
##UNITS=     HZ,            ARBITRARY UNITS, ARBITRARY UNITS
##FACTOR=    0.250966925370066, 1,           1
##FIRST=     8223.43324360094, 114677,       -82442
##LAST=      0,             -100954,         -21001
##MIN=       0,             -685620,         0
##MAX=       8223.43324360094, 449231266,    0
$$ Real data points
##PAGE= N=1
##DATA TABLE= (X++(R..R)), XYDATA
$$ [...]
19553c8047l22925a31589F7177b76608a29733B0852J36714d02100a1685k93399
19543c05084A78061a94183g8006B1075e41265A6408J36308o9145e19638a33267
19532a9594A13370a04837d9328k5802A00349g4206A35044b5273r0824G524d5357
19520d0773A62615J08843b16817g0499A81605h48k89314h0860l43386a3417j29047
19509a42464j92842D7377J47493j1255c70060J71241a0610p7143P408k55005G2213
19497a79363j74429A77653d3186k28158R1892A68683b01356d3714D3503e2321
19486F4775k4945M908Q8023f8955A6262L3908b49248a0727j71410B75807h1898
19474b70735E4064a4601j31463J8067j32050Q5571p5611C28752a31190D1440c6219
$$ y = [-38047, -360972, -131589, 67177, -276608, -129733, 20852, 157566, -402100, -11685, -305084, 178061, -194183, -78006, 21075, -541265, 16408, 152716, 83571, -519638, -133267, -19594, 113370, -104837, -49328, -75130, 100349, -74206, 135044, -25273, -116097, 7524, -45357, -40773, 162615, 271458, -216817, -70499, 181605, -848, -290162, -80860, -424246, -13417, -142464, -335306, 47377, 194870, 183615, -370060, -198819, -10610, -87753, -80345, -335350, 72213, -179363, -353792, 177653, -43186, -271344, -179452, 168683, -201356, -43714, 43503, -52321, 64775, 39830, 44738, 132761, -68955, 16262, 50170, -249248, -10727, -182137, 275807, -81898, -270735, 54064, -14601, -146064, -127997, -260047, -174476, -250087, 328752, -131190, 41440, -36219]
19462i1383j45987m3466O4489G187g4268j2230j43263G9803A2759N5413d18918
19450c3181A13660K07973b07249K0763N6088B6169a60687L0170G7321H851J42014
19439A50865b24091N1287n0287A11193h1698B1494L585E281e9785H775a62069
19427b05598A2680K09300c44164p8803D9663J13527a58579c5093n7667m5346n6527
19416a94633c646C8241P4051J37397A04903b01191P9159B24396c19817a28694
19405b57645A28853b98904L1863C90122e3302j60813a01750A6370K24253h7937
19394a57014M5597N4032n1784M4891A14621a3311n0466j77522c7056l72757B40547
19382e48134b06344c0587k29264a5701H145a34843A3673d2373j05069A65796C5728
$$ y = [-91383, -237370, -280836, -216347, 7187, -74268, -86498, -229761, 79803, 12759, 68172, -418918, -33181, 113660, 321633, -207249, -186486, -130398, 26169, -160687, -130517, 77321, 8851, 150865, -224091, -172804, -223091, 111193, -81698, 21494, 25079, 5281, -59785, 8775, -162069, -205598, 12680, 221980, -344164, -422967, 49663, 163190, -158579, -35093, -92760, -138106, -194633, -3646, 38241, 112292, 249689, 104903, -201191, -122032, 224396, -319817, -128694, -257645, 128853, -298904, -267041, 390122, -53302, -214115, -101750, 16370, 240623, -87937, -157014, -111417, -57385, -109169, -64278, 114621, -13311, -63777, -241299, -37056, -409813, 240547, -548134, -206344, -30587, -259851, -15701, 8145, -134843, 13673, -42373, -147442, 165796, 35728]
19370E9472O1391k4661a30139j47734B68782a01226A19913D9069a6273l2366j92741
19359b41380g5910D0107a3390A23789j4179i3413c679k02527c943j66407j11806
19348b82156H7335a35065n532c6682C5204a11052k6226b4833f662j93401A20572
19336E6014N6755J18118A04716k800Q6581c07929A88962n8725c2537A06567B9060
19324b65249A08557e2702b3475o0907j68926B7073b81738i8687j611B06975d4138
19312e7261B7607J34843e3084A96868M9707E4217a24378q8535q9485B34704a92174
19300A04764d02806B122M0267b76576o5822C6462K66224a69261j34348C5833g7469
19288d9194p6158J2034j65070l30964f7265j44448J04684M9855l83204B8529J898
$$ y = [59472, 120863, 96202, -130139, -277873, 268782, -101226, 119913, 49069, -16273, -48639, -241380, -75910, 40107, -13390, 123789, 109610, -93413, -3679, -206206, -3943, -170350, -282156, 87335, -135065, -140597, -36682, 35204, -111052, -137278, -24833, -6662, -200063, 120572, 56014, 112769, 230887, 104716, 101916, 188497, -307929, 188962, 130237, -32537, 106567, 29060, -265249, 108557, -52702, -23475, -84382, -253308, 27073, -281738, -98687, -100298, 206975, -44138, -57261, 27607, 162450, -53084, 196868, 246575, 54217, -124378, -212913, -302398, 234704, -192174, 104764, -402806, 2122, 42389, -276576, -342398, 36462, 302686, -169261, -303609, 35833, -77469, -49194, -125352, -113318, -278388, -609352, -67265, -211713, -107029, -57174, -440378, 28529, 30427]
19277C0427K01848a54458j04536f4095k26418A9202a5924C1133c6125F3823c6138
19265a53949e5037j20525j3965e9629a5804j22793A2798g1250m6189j95107K3502
19254b89044E5791b24519K4089C6286a17504j32040m6539e7411A19689a12355
19243C3427b57416A84454a88792j1769R0225B28384J12546c7376D5291J9839R262
19232G4392l4129b6645A23285h2829l15607a67608A78156a17153l745C3732J18378
19221A52110g3740G2517i7477a6775C43154a79583G3417a602A84403f9939A34945
19209b57818I9049a08665A4115f0890A0317K1754a47849B32574F4929c68009C19673
19197b77714F1143a66232J2326I3919g1053L2212l25890h4552K4982k82922f000
$$ y = [30427, 232275, -154458, -258994, -64095, -290513, 19202, -15924, 31133, -36125, 63823, -36138, -153949, -55037, -175562, -189527, -59629, -15804, -138597, 12798, -71250, -117439, -312546, -289044, 55791, -224519, -200430, 36286, -117504, -249544, -296083, -57411, 119689, -112355, 33427, -257416, 184454, -188792, -200561, -110336, 228384, 340930, -37376, 45291, 65130, 74392, 40263, -26645, 123285, -82829, -398436, -167608, 178156, -117153, -120898, 33732, 152110, -73740, 72517, -97477, -16775, 343154, -179583, 73417, -1602, 184403, -69939, 134945, -257818, 99049, -108665, 14115, -60890, 10317, 32071, -147849, 232574, 64929, -368009, 319673, -277714, 61143, -166232, -153906, 93919, -71053, -38841, -364731, -84552, -59570, -342492, -6000]
19185b57505A02711g3725A7023a30696j12162A17822a99206j6112h1237j49972
19175b31209Q4555A99678a02171B33871b39752J04345f4126k14166B55979a56027
19164b28695J13055r8708N6126N176A20641A0615a07997c6513j61050H1310j2670
19153F8640J30648a27810J5A33017a54116L2115D5669L0658J43989a90210Q148
19142a82062Q9076L2825A00740B4467d0129n3808q2161F9837a41140D0663h0557
19130f9864K4897A54788c29730A31847D1374K5742a68303r6295L4423p6531A19513
19118d1830k68619A10909K81138I3883g1198j87223M7562f3894n7948B09791a06095
19106A41999K8525b5710r2348k09871A7987g0579P467I5523a070k53287b5864
$$ y = [-257505, 102711, -73725, 17023, -130696, -242858, 117822, -199206, -215318, -81237, -231209, -146654, 199678, -102171, 233871, -239752, -135407, -64126, -278292, 255979, -156027, -228695, -115640, -214348, -158222, -153046, 120641, 10615, -107997, -36513, -197563, 81310, 68640, 199288, -127810, -127795, 133017, -154116, -122001, 45669, 76327, 220316, -190210, -182062, -92986, -60161, 100740, 24467, -40129, -93937, -176098, 69837, -141140, 40663, -80557, -69864, -44967, 154788, -329730, 131847, 41374, 67116, -168303, -264598, -230175, -306706, 119513, -41830, -310449, 110909, 392047, 93883, -71198, -258421, -210859, -63894, -121842, 209791, -106095, 141999, 170524, -25710, -118058, -327929, 17987, -70579, -63112, 95523, -1070, -254357, -25864]
19094A84341a92401D0054N8790Q4617c79878E605a14273K1107b3296j03841l40079
19083d67216j47846f273B0229J35778J00102B150K97316g974p7831G6210b54404
19071C8494b71729C15456C8380J84251b08675h2173F1228a72571r8418N8608e0722
19059a7290C6704J8615P8963a9850j11683A41896a05870k40501J10601A38589
19048B09911d07447a70828A05777A8805h7329N48D184b87836J21075e4515a7516
19036A01119a02150J2313B8273R2035b25491C36086a35550b2425q6937c1194j27756
19025a58950N4258D4351O9626f5485J6513B7012a7537G6094a61715c3194A26861
19013A89104m626n8543d7260B6406A1311P9733a52025I270d2258a1280C9393d19231
$$ y = [184341, -192401, 40054, 98844, 183461, -379878, 5605, -114273, -93166, -23296, -127137, -467216, -615062, -6273, 20229, 156007, 256109, 2150, 299466, -7974, -85805, 76210, -254404, 38494, -271729, 315456, 38380, 222631, -208675, -82173, 61228, -172571, -270989, -212381, -50722, -17290, 36704, 55319, 134282, -19850, -131533, 141896, -105870, -346371, -235770, 138589, 209911, -407447, -170828, 105777, 18805, -87329, -86781, 4184, -287836, -166761, -54515, -17516, 101119, -102150, -89837, 28273, 120308, -225491, 336086, -135550, -22425, -109362, -31194, -158950, -104692, 44351, 113977, -65485, -48972, 27012, -17537, 76094, -161715, -33194, 126861, 189104, 184478, 125935, -47260, 26406, 11311, 91044, -152025, 9270, -42258, -11280, 39393, -419231]
19000G5301a44223J4577e5740p1220k31352h0958q0892D6266g5975a6864j54813
18989a71677k6135q3172i1016c9563a6282k52834a28221O3703b0334B3269L9904
18978F3173J46884d1678k41863R4978j65539d2118a9279B06149i1594B6950b57419
18966e6419k02695O1360n923B4112K08366a58544j38702H1497l0463b12841f3186
18954C6027b86157Q6374d6082l1270r3125m5772A2790h2559a7535A06706L5827
18943A42533a91223j49090a66646r1082L1134E4254h6721c2598k95686A22937
18932A64392d9319B9052a12158j19496J00917m6638A75239m0496a62277j5105
18922a77382K6757N772e2872I895R682K01320A01486K2925E7541J02155h2901
$$ y = [75301, -144223, -129646, -55740, -126960, -358312, -80958, -161850, 46266, -75975, -16864, -171677, -197812, -280984, -91016, -39563, -16282, -269116, -128221, -64518, -20334, 23269, 63173, 210057, -41678, -283541, -188563, -354102, -42118, -19279, 206149, -91594, 26950, -257419, -56419, -259114, -197754, -203677, 24112, 232478, -158544, -297246, 81497, 51034, -212841, -63186, 36027, -286157, -199783, -46082, -77352, -170477, -216249, 12790, -82559, -17535, 106706, 142533, -191223, -340313, -166646, -257728, -226594, 54254, -86721, -32598, -328284, 122937, 164392, -49319, 29052, -112158, -231654, -130737, -177375, 175239, 134743, -162277, -177382, -150625, -144853, -52872, 9895, 19577, 220897, 101486, 124411, 57541, 159696, -82901]
18910a30837H7612l5199a98426A31266a40244c0428D2555K3668a78683n842A69840
18898a93543P2945A24610e8006K5008l91675D3536n280a02736B60858K0597M3341
18887C24796B0324a57346A4899d30672J04512a22554j01285a6338H8440R2633
18877A81073d69569g6776j4398A02918c66245i313l12262O2507J3860C12375A52782
18865c8294k07963A07461k1301b12087K9978a8227A8432e8278B2069R7528a89281
18853H1596a33642D11651I650K19175b08821J0269b1083A86036b42167g6606j8133
18842i4739k07878a0827A10728e8781p5797q6369q2112A63677d7979k40052h8980
18830G7673a68754E0666M9763b7772A45369o5755i3034G4905f1200C0311J78721
$$ y = [-130837, 87612, 52413, -198426, 131266, -140244, -30428, 42555, 66223, -178683, -184525, 169840, -193543, -120598, 124610, -58006, -32998, -424673, 43536, 38256, -102736, 260858, 281455, 324796, 20324, -157346, 14899, -430672, -326160, -122554, -223839, -16338, 88440, 181073, -469569, -76776, -91174, 102918, -366245, -9313, -321575, -259068, -245208, 312375, 152782, -38294, -246257, 107461, 86160, -212087, -182109, -18227, 18432, -58278, 22069, 119597, -189281, 81596, -133642, 411651, 9650, 228825, -208821, -198552, -21083, 186036, -242167, -76606, -94739, -302617, -10827, 110728, -58781, -134578, -220947, -303059, 163677, -47979, -288031, -88980, 77673, -168754, 50666, 100429, -27772, 145369, 79614, -93034, 74905, -61200, 30311, 209032]
18819B09032f2640l6420A49634b11559B63582r7802L887L63651F7265R2548n4242
18808A05571e1641j69167h5109q0373D2334L15900e9523m5025r864B46056a99090
18796H9521d4183c505m24963B2339P9067N4309d0843F146b91182B76222c66812
18784a72476L8395A18918e080k04097C4455c42150I3962M5572b29520P9382j32319
18773b82457G0322L690E540K8749a52662B06768P5052f6144j76657g8878H4922
18761B56255a915l6608m2707C21025c03309a31987A14755a12267c1331D9522c59290
18749B19835o4409K6038g420r9344p8424A12365j5227c17366A08592a27849A06484
18737e0103p0602k58017A479c41953a38384A9678R474h8779A98284a31000A35186
$$ y = [209032, -62640, -99060, 149634, -211559, 263582, 165780, 169667, 533318, 67265, 159813, 105571, -51641, -220808, -85109, -165482, 42334, 358234, -59523, -104548, -114412, 246056, -199090, 89521, -44183, -3505, -428468, 22339, 101406, 155715, -40843, 6146, -291182, 276222, -366812, -172476, -134081, 118918, -5080, -209177, 34455, -342150, 93962, 139534, -229520, -150138, -282457, 70322, 74012, 5540, 34289, -152662, 206768, 281820, -66144, -242801, -78878, 84922, 256255, -1915, -38523, -81230, 321025, -303309, -131987, 114755, -112267, -31331, 49522, -359290, 219835, 155426, 181464, -7420, -106764, -185188, 112365, 97138, -317366, 108592, -127849, 106484, -50103, -120705, -378722, 1479, -341953, -138384, 19678, 29152, -88779, 198284, -131000, 135186]
18725E469R9386b96275B30197A1763J60403E9797a36708A55854a21155j02740
18715b23895q0305b6257A07552a03894m3960J269H9201a7225j39711B5J93168
18704A93193r0026O747P9858a01199b3363A05361b07680A86008K6176j6956p8267
18693A16961j0320a04852b6784r3498l188B22653b27115B06905C3815i6011A42330
18681b15623Q7083D05200b03245B59769a04051d5711n242o5878j32207J01695
18671a47343H9675c82754J73286e4826j57775f234j42453I1431b00428B2683J45902
18660A68585b1961j16813A21905h3576j9992k15240f348l4713j37020A9741a01896
18648A44438a07555p1598e5049A48261Q6059p1385D1007b08862N5292G9829b12446
$$ y = [5469, 104855, -296275, 230197, 11763, 172166, 59797, -136708, 155854, -121155, -223895, -304200, -26257, 107552, -103894, -147854, -146585, 89201, -17225, -156936, 25, 193193, 103167, 109914, 189772, -101199, -23363, 105361, -207680, 186008, 212184, 195228, 116961, 106641, -104852, -26784, -120282, -123470, 222653, -227115, 206905, 33815, -96011, 142330, -215623, -128540, 405200, -203245, 259769, -104051, -45711, -50953, -116831, -249038, -147343, 89675, -382754, -209468, -54826, -212601, -6234, -148687, 91431, -200428, 22683, 168585, -21961, -138774, 121905, -83576, -103568, -318808, -6348, -41061, -178081, 19741, -101896, 144438, -107555, -179153, -55049, 148261, 234320, 162935, 41007, -208862, -153570, 79829, -212446]
18636B34164g6538p8510K0087k02730J27977a7269r8739G0531b09533R360B17236
18624d9577j14686r7195h8990B68899d19370e5691K5000l75025a38606q3667G4316
18612a87306d3314n0109j89723A05408c30997p7173H5989a18045j5098A00305
18601a25809H1753c18973J38497A00020E739K53559j26856b78242J35677p7228
18591b19793D7803R2344a89825j71018a47619e8105A8620L16234a75290j2671
18581a87961A07153l1912h5914A39001a70687K2648q0547B5241a99440g8368A19495
18569A25251a05675L537F401a48472n7548A53873a91402a8141o9064A87408N008
18558A92416B9420a03139j2733G3974d8259p0687k33092A15208E6743i5844c577
$$ y = [234164, -76538, -155048, -134961, -337691, -209714, -17269, -116008, 70531, -209533, -200173, 217236, -49577, -164263, -261458, -88990, 268899, -419370, -55691, -30691, -405716, -138606, -222273, 74316, -187306, -43314, -93423, -283146, 105408, -330997, -408170, 85989, -118045, -133143, 100305, -125809, 81753, -318973, -180476, 100020, 5739, 259298, 132442, -278242, -142565, -219793, 47803, 140147, -189825, -360843, -147619, -58105, 18620, 334854, -175290, -187961, 107153, 75241, -85914, 139001, -170687, -148039, -228586, 25241, -199440, -78368, 119495, 125251, -105675, -102138, 6401, -148472, -206020, 153873, -191402, -18141, -87205, 187408, 192416, 29420, -103139, -115872, 73974, -48259, -118946, -352038, 115208, 56743, -95844, -3577]
18546B12483a90618E1178K6357L7691J03959F1694Q7432c08189A11897L6686o1146
18535H7437a88864M2150n9545A47002b10220j7466O124e0501a6638N909k99895
18524c10624G1540a73554l09264b40950l542a07679j51884J11946k00766a28698
18513a42095D5179a62659k4913r645M4132A09008c639A47260a50641k71956A63708
18501b50206B17509J3624a22901j75451a7457m505k16113f260A39521a92770N1977
18490a40793k24212J34874I362L3891O0023c1934A3594D235b03412A46196d23818
18478C9762K4332K122g1288B5873b78901E6645g3637j85404g4096A04759i4810
18466c98657a5985n8103q4416j01847Q3583B42431f0507F309J66800b2741B7900
$$ y = [212483, -190618, 51178, 77535, 115226, 219185, 61694, 149126, -308189, 111897, 148583, 87437, -188864, -146714, -206259, 147002, -210220, -227686, -221562, -50501, -16638, -10729, -310624, 71540, -173554, -482818, -240950, -244492, -107679, -259563, -147617, -348383, -128698, -142095, 45179, -162659, -187572, -197217, -153085, 109008, -3639, 147260, -150641, -422597, 163708, -250206, 217509, 231133, -122901, -298352, -17457, -21962, -238075, -6260, 139521, -192770, -140793, -365005, -230131, 9362, 43253, 103276, -31934, 13594, 4235, -203412, 146196, -423818, 39762, 64094, 66216, -71288, 25873, -278901, 56645, -73637, -259041, -74096, 104759, -94810, -398657, -15985, -74088, -158504, -260351, -176768, 242431, -60507, 6309, 173109, -22741, 27900]
18454C28732A50672C2703i1931l4264k8041k581A25785B7052h1368A79730a72747
18442c38179e2611g411A79255a36453c4591B6877R4301e2682A52065b37912j35141
18431c73053A90109K544b9176k64570e8480B7643J71950b53882j8492A19796a53821
18419a34704j4274I6502K25434d00093H2444b73394A39495a32588B560a85566
18408d7150m2606D04559d1040a9516A31673B8830K00792b7323k106j71199b1694
18396b02973g8780j51000a13636A39903l491a49651I5535a58864C8003n649g5083
18384a0309p0665j78562I3089a07849j8899O1058k38514h7295C8987J98756A11637
18372g6028j05530n5541i5699L516A92006h3813H1596f8558C37763A48310O8974
$$ y = [328732, 150672, 32703, -91931, -126195, -154236, -156817, 125785, 27052, -81368, 179730, -172747, -338179, -52611, -7411, 179255, -136453, -34591, 26877, 121178, -52682, 152065, -237912, -373053, 190109, 192653, -29176, -293746, -58480, 27643, 199593, -253882, -272374, 119796, -153821, -134704, -148978, 96502, 321936, -400093, 82444, -273394, 139495, -132588, 2560, -185566, -47150, -89756, 404559, -41040, -19516, 131673, 28830, 229622, -27323, -29429, -200628, -21694, -202973, -78780, -229780, -113636, 139903, 136412, -149651, 95535, -158864, 38003, 32354, -75083, -10309, -80974, -259536, 93089, -107849, -126748, -65690, -304204, -87295, 38987, 237743, 111637, -76028, -181558, -237099, -95699, -92183, 192006, -83813, 81596, -68558, 337763, 148310, 217284]
18361B17284a58912p0439f4450k35928H4529b47329a04093E8408K07532a5119
18350F69N2521b41359k24480F5464J67013L2819j21171c83051G6181d9006C29417
18338c58736f6509j33920E6807e9448j5795I757a15867j19930A2410a14832k71725
18327c86557a49383J5141k634A53669n0038J50292g5335D3795r524a49597A96942
18315c00094F3283d8135q1699A63355a09055I8465a18084A95338a60237L8862
18305a21375k19402F1426Q3788b62209A08894P1253p5307a93737A13158a13303
18294H6999c73401a40898a5660k64575B3272a36352G153b55994Q0587q1159j90567
18283d47133I117a90071h2902I2550d1133G4705C0445P3208d0704A18357N7870
$$ y = [217284, -158912, -229351, -64450, -300378, 84529, -247329, -104093, 58408, 265940, -15119, 669, 53190, -241359, -465839, 65464, 232477, 265296, 144125, -383051, 76181, -49006, 329417, -358736, -66509, -200429, 56807, -59448, -75243, 9757, -115867, -235797, 12410, -114832, -386557, -149383, -134242, -136876, 153669, 103631, 253923, -75335, 43795, 34271, -149597, 196942, -300094, 63283, -48135, -129834, 163355, -109055, 98465, -118084, 195338, -160237, -121375, -340777, 61426, 145214, -262209, 108894, 180147, 104840, -193737, 113158, -113303, 86999, -373401, -140898, -15660, -280235, 23272, -136352, 7153, -255994, -175407, -256566, -447133, 9117, -190071, -82902, 92550, -41133, 74705, 30445, 103653, -40704, 118357, 176227]
18272A76227b02489Q0968B4893a39773A87105a32024d2973o6151A40678F2962
18261B96428b17161G5290J02120b94003C59578a03542d3524j60969B7315a06619
18250a77845C1653a86964b5882j75743j38365b1517A84257h0722A25899f1968
18239B81408a76822j5617F2163q207b32596B5103O8770J04865a05528n5551C372
18227A51257J40253a07219C0372b34148B32603a95942j93407e8484B67217A2509
18216B12586a30981e1840H4634e4737F5837e4293r8462B050Q4647M3981E7582
18204h2839q2059A62275m0802O7853a27086H8531a12763K5789b0605F1231c8866
18192g9730j34229o0164F0376a74656D8900j5869J13227B8683N8901a62131p0040
$$ y = [176227, -202489, -121521, 24893, -139773, 187105, -132024, -42973, -109124, 140678, 62962, 296428, -217161, 75290, 177410, -294003, 359578, -103542, -43524, -204493, 27315, -106619, -177845, 31653, -186964, -25882, -201625, -339990, -21517, 184257, -80722, 125899, -61968, 281408, -176822, -192439, 62163, 53956, -232596, 25103, 93873, 198738, -105528, -161079, 3372, 151257, 291510, -107219, 30372, -234148, 232603, -195942, -389349, -58484, 267217, 12509, 212586, -130981, -51840, 84634, -54737, 65837, -54293, -152755, 2050, 86697, 130678, 57582, -82839, -164898, 162275, 121473, 189326, -127086, 88531, -112763, -86974, -20605, 61231, -38866, -79730, -213959, -274123, 60376, -174656, 48900, 33031, 146258, 28683, 87584, -162131, -232171]
18181b32171H9881a68351c9497q6894A11404a89585A17778a19908L8335k07068
18171b88641a33154L4949l6400A2412b5502l2862j15248A82170m0327j2697a85162
18159a72546b5628j6011B68674d3534J5683j79765g6138H6118k8497j9238L674
18148D2057f1257l59443A69211F3742g4603k12609A12705a73519a2753b037m4200
18137d6237k51268J24588P9509p3465e8863K4755C7385d4433h57l1858k17704
18126b50419a1448F7257d72546C42353a2800A51653a95712B11184f6769R995r1848
18115a48622c2431G8832f9113j03656g6277n5265j23123P7097F1045b68549A70537
18103b21049a02052J46B2703H49K10689J8829a10407D9637J94543o2401l6442
$$ y = [-232171, 89881, -168351, -39497, -126391, 111404, -189585, 117778, -119908, -81573, -288641, -133154, -98205, -134605, 12412, -25502, -58364, -173612, 182170, 141843, 129146, -185162, -172546, -25628, -41639, 268674, -43534, -27851, -207616, -76138, 86118, 57621, 38383, 42057, -61257, -420700, 169211, 63742, -74603, -287212, 112705, -173519, -12753, -2037, -46237, -297505, -172917, -93408, -166873, -58863, -34108, 37385, -44433, -857, -32715, -250419, -11448, 67257, -472546, 342353, -12800, 151653, -195712, 211184, -66769, -56774, -148622, -32431, 78832, -69113, -172769, -76277, -131542, -254665, -177568, 61045, -268549, 170537, -221049, -102052, -101906, 22703, 849, 211538, 230367, -110407, 49637, 244180, 181779, 145337]
18092A45337a95904Q3640G6196c26988J30923P9877E9112a46778P1910j34140
18082b09008a6155l56069J68510B1523J49081o0904C3174K47418j06005F2771
18071a97023A4432J08374b13790j02959a49881O5737j33539h8434A83009a87348
18060g3835m3083K8369q9544o6095D4363b42911h7133k22521A80829e17059b00011
18048A1278m755d4512C3507q900P0728B6445h8231j6453A92049E5739h3757A9678
18035d24B04833A4165J73930n9623a88532A92986J77488A23497J63664E4121b285
18023c1537D3449A7151h4566A44032J1458B3068b00618d8242q0236k25363C573
18011a52409P0248j3404c0381F2983O7973a14883A93275n4877f6616q198C05273
$$ y = [145337, -195904, -112264, 76196, -326988, -196065, -116188, 59112, -146778, -74868, -209008, -16155, -372224, -203714, 21523, 170604, 109700, 33174, 280592, 174587, 62771, -197023, 14432, 122806, -213790, -316749, -149881, -84144, -217683, -88434, 183009, -187348, -73835, -116918, -88549, -178093, -244188, 44363, -242911, -87133, -309654, 180829, -517059, -200011, 11278, 6523, -44512, 33507, 24607, 95335, 26445, -88231, -104684, 192049, 55739, -83757, 19678, -424, 204833, 14165, 188095, 128472, -188532, 192986, 370474, 123497, 287161, 54121, -2285, -31537, 43449, 17151, -84566, 144032, 155490, 23068, -200618, -48242, -128478, -353841, 3573, -152409, -82161, -95565, -30381, 62983, 130956, -114883, 193275, 138398, -66616, -74814, 305273]
17999a09693B3252J2007e098p8428A18548K3897f8405F2287b69800C4484J42916
17988A77400b7249E2409a02963j7762M4366I5511R098a46227l55898H3085a50332
17976E3519J8909a77604n2950C30863F3381a56476b9849C56577a97918A42969
17965a41314K8143b518D3579J80837B6734Q5926C1738a33697K7630A58017b55208
17953A60704o023a69458g9725G3975e754j99516E4596K4860c18469b9189A75399
17941b71983j32361a42370L8053H1459L6836a50688k6169A17401a10765d4209
17930c16947g0407O975A90624j8261J90938q1875b62708G5922K42210j02992f5998
17918B24730a01297J0043a1399j2595B02376P4764a4326A63094N5090G5978c2603
$$ y = [-109693, 23252, 35259, -5098, -83526, 118548, 142445, -68405, 62287, -269800, 34484, 177400, -27249, 52409, -102963, -120725, -76359, 95511, 104609, -146227, -502125, 83085, -150332, 53519, 72428, -177604, -230554, 330863, 63381, -156476, -29849, 356577, -197918, 142969, -141314, -113171, -2518, 43579, 224416, 26734, 112660, 31738, -133697, -106067, 158017, -255208, 160704, 154681, -169458, -79725, 73975, -5754, -205270, 54596, 79456, -318469, -29189, 175399, -271983, -404344, -142370, -104317, 81459, 118295, -150688, -176857, 117401, -110765, -44209, -316947, -70407, -63432, 190624, 172363, 363301, 281426, -262708, 75922, 318132, 215140, -65998, 224730, -101297, -91254, -11399, -23994, 202376, 277140, -14326, 163094, 218184, 75978, -32603]
17906e4343l955q3514q5919e931r885E8113K55768b33298A30694a3538A66322
17894E1145a33986E7890k7287a56899q9722B42235h7699B88039f1490k8937L027
17883h7400j16880f1411E922O7820b47806e3379l3292R925B31740o8714a55529
17871E1554c2631j30076b7294j84738J03668E124K9431b33547g343k98129c0955
17859a0628m50l5828j52723k83090A1219g8755J2503F4891i25l80469A5289J2385
17847B7674a24297c1409r1898j42676a01169A9841K46119a54045o4650B2705b6354
17835a29436j9685P955l75970i4383j39452B80448a17085c2903E2390c35330B06175
17823H122c2434C24268a66053B50880i5458j67727c2466r1160j35311c2394G5429
$$ y = [-54343, -58298, -141812, -227731, -5931, -15816, 58113, 313881, -233298, 130694, -13538, 166322, 51145, -133986, 57890, 30603, -156899, -246621, 242235, -87699, 288039, -61490, -90427, -87400, -204280, -61411, 5922, 73742, -247806, -53379, -86671, -76746, 231740, 163026, -155529, 51554, -32631, -162707, -27294, -212032, -108364, 5124, 34555, -233547, -7343, -305472, -30955, -10628, -11078, -46906, -199629, -482719, 11219, -78755, -66252, 64891, -925, -381394, 15289, 27674, -124297, -31409, -123307, -265983, -101169, 19841, 265960, -154045, -218695, 22705, -26354, -129436, -149121, -141166, -517136, -94383, -233835, 280448, -117085, -32903, 52390, -335330, 206175, 8122, -32434, 324268, -166053, 250880, -95458, -263185, -32466, -123626, -258937, -32394, 75429]
17811b214j67066j72815A93689a63508A48554b08813a7659j25078K0085H5200
17800B71901a10467j6658A18875K10444A30694h4802D2510Q610J5309B7766O9999
17789I7765b71592O0045A19232J14028A12515b21259f2409A54648O9202C6475
17778c12225c9168D7705N3113i3635A5634M6368g8587o7101o8565B25197A02012
17766h6462j6001B0403J02705c61986f0278B38553e370G7752b4890l2332G5430
17754A59724a4437l1798k75679a31414B00978b0927j52780B02420g9689D7066
17743A53414B0218c1092B3958O7805c27711G7082R197e6148n5692E767K35958
17732B41725p1561A360d91084f6672o4279i023k71963a24105B56117C4077J97057
$$ y = [-2214, -169280, -342095, 193689, -163508, 148554, -208813, -17659, -142737, -122652, 85200, 271901, -110467, -127125, 118875, 329319, 130694, -84802, 42510, 51120, 66429, 27766, 97765, -271592, -211547, 119232, 233260, 112515, -221259, -62409, 154648, 223850, 36475, -312225, -39168, 47705, 100818, -93635, 15634, 62002, -78587, -145688, -214253, 225197, 102012, -86462, -102463, 20403, 123108, -361986, -60278, 238553, -5370, 77752, -24890, -57222, 75430, 159724, -14437, -46235, -321914, -131414, 200978, -20927, -173707, 202420, -79689, 47066, 153414, 20218, -31092, 23958, 91763, -327711, 77082, 86279, -56148, -111840, 5767, 241725, 170164, 1360, -491084, -66672, -130951, -9023, -280986, -124105, 256117, 34077, 231134]
17721B31134f9707K9318G6804h8235G1795e7319j71876f2861C7735P4008c29100
17709a03964r277B62344a70566A39737b16639G5872a6902k02191C20698B3178
17698A28896D77J38825J05015B0875A499c6666j45240j86487B24161H042e0952
17686F0598e8681h408E5608g0554j18997A17725K06812a18643A74845a2469m3813
17675e6282G8188a14060p7b3537j93517e8245l2355D7257a79056j00549F3214
17663c6912C7703N8014L4230a30647j94093f5480D93163j33301a75654C6432g8734
17651A91a23856b0491A46877C4839P6203l0586b9392l9388A03246O5294J63820
17640C32360a58899F747K12095K7919a3606j07075B9665a3335G4481i2875c6544
$$ y = [231134, -69707, -40389, 76804, -88235, 71795, -57319, -229195, -62861, 37735, 111743, -329100, -103964, -113241, 262344, -170566, 139737, -216639, 75872, -16902, -219093, 320698, 23178, 128896, 477, 139302, 244317, 20875, 1499, -36666, -181906, -368393, 224161, 8042, -50952, 60598, -58681, -8408, 55608, -70554, -189551, 117725, 324537, -118643, 174845, -12469, -56282, 78188, -114060, -114137, -23537, -217054, -58245, -90600, 47257, -179056, -279605, 63214, -36912, 37703, 95717, 129947, -130647, -324740, -65480, 493163, 359862, -175654, 36432, -78734, 191, -123856, -20491, 146877, 34839, 111042, 80456, -29392, -68780, 103246, 168540, 332360, -158899, 6747, 218842, 246761, -13606, -120681, 29665, -13335, 74481, -92875, -36544]
17628D67753a37268m0546b6014m8181C6092N4431J49806k5091M8257A7309a21127
17616D6852a75130M7863E1801J4507g6436A26228a99364A38149m2549B1488J27486
17605A48974a21940M1364C23676j42288e2274E8405a44689b7564k09477j06837
17595c43878B57020D8726h2495C0132c8585A45529c1650D241a6033A06528J64364
17584B70892a96012M2193j24358A70437a17963A0465L7823c00986i8856K7736
17574g1120A42965a43002N0700A48451c6993m086B51167b6934j60626A52449d5368
17562C10794b2356A67148K43911A53517A6183b49370a12406F0429d8185j14183
17552a62368A38115J19793D9609b8308G8008a64418b7465A39646e2594a3255B54565
$$ y = [467753, -137268, -177814, -26014, -74195, 36092, 90523, 240329, 215238, 263495, 17309, -121127, 46852, -175130, -127267, 51801, 66308, -76436, 126228, -199364, 138149, 95600, 21488, 148974, -121940, -80576, 323676, 181388, -52274, 58405, -144689, -27564, -237041, -343878, 257020, 48726, -82495, 30132, -38585, 145529, -31650, 4241, -16033, 106528, 270892, -196012, -153819, -278177, 170437, -117963, 10465, 48288, -300986, -98856, -71120, 142965, -143002, -92302, 148451, -36993, -41079, 251167, -26934, -187560, 152449, -45368, 310794, -22356, 167148, 411059, 153517, 16183, -249370, -112406, 60429, -48185, -162368, 138115, 257908, 49609, -28308, 78008, -164418, -27465, 139646, -52594, -13255, 254565]
17540G1740J53028A9181a11249G8262j3630L4074l0590N2455D1045d41145B77410
17528A49407e8950I2303j7916a5812C19456A01113K2756O610O4398G6072b88214
17516B39051p8036g2164k3024l2156C64082b51829e7196F5020A2879J7660c7366
17504a12454A56374e1916A62478a71316e3714D28052r1226f7477E2578L71555
17494D24133F0473a15323D6943b0172C36024c74831A76068J33252H511a15115
17483D9253Q4636L7180d3499F1768b03159e4132G7574a74787A36021a61788A39229
17471A98219F4040f1445b2632G9027K01425j15292A5568d7940N032C65657H1646
17459C41763j2888j41235k2905a88770L7558e7567C5336e5986B63771J09580A80045
$$ y = [71740, 224768, 19181, -111249, 78262, 64632, 98706, 68116, 120571, 41045, -441145, 277410, 149407, -58950, 92303, 74387, -15812, 319456, 101113, 123869, 130479, 194877, 76072, -288214, 239051, 161015, -72164, -95188, -127344, 364082, -251829, -57196, 65020, 12879, 30539, -37366, -112454, 156374, -51916, 162478, -171316, -53714, 428052, 336826, -67477, 52578, 424133, 60473, -115323, 46943, -20172, 336024, -374831, 176068, 309320, 8511, -115115, 49253, 133889, 171069, -43499, 61768, -203159, -54132, 77574, -174787, 136021, -161788, 139229, 198219, 64040, -61445, -22632, 79027, 280452, 165160, 15568, -47940, -42908, 365657, 81646, 341763, 328875, 187640, 164735, -188770, -151212, -57567, 35336, -55986, 263771, 373351, 180045]
17447E60757k65453r3437L46847j97725d117A01183P1146K54877A07826Q7908
17437A95734J82802A66475e03443f5361A21225K12004K9222c494A17554A2750
17426E5887O908J90342f7629C89271j83941m1880j9426M8981J15824Q5805A49558
17414C24428L918A1962M45793j66891H0782K5326k4662a89435B94489A11691L2748
17403A44439N0431D5261e6001A38548Q2728m9393D9773a47276F6154C3072K9113
17392F2185J28253D1536K96413L1437Q7773d9948E7029a02305A36466L6910p6031
17381I7345L09998H5759J69987J78230G8075J86371A01025J46703j17777b5738
17370I672J04606J31459j20070O3639J28613l5778m8132m6891P3670j13626K7576
$$ y = [560757, 295304, 201867, 548714, 350989, -4117, 101183, 172329, 427206, 107826, 195734, 378536, 166475, -503443, -65361, 121225, 333229, 362451, -3494, 117554, 12750, 55887, 62795, 253137, -67629, 389271, 205330, 163450, 144024, 193005, 308829, 394634, 149558, 324428, 328346, 11962, 457755, 290864, 80782, 106108, 81446, -189435, 294489, 111691, 144439, 194870, 45261, -56001, 138548, 221276, 171883, 49773, -147276, 66154, 33072, 62185, 190438, 41536, 337949, 369386, 457159, -49948, 57029, -102305, 136466, 173376, 97345, 407343, 85759, 255746, 433976, 78075, 264446, 101025, 247728, 129951, -25738, 9672, 114278, 245737, 125667, 189306, 317919, 282141, 234009, 187118, 260788, 147162, 174738]
17359A74738a67531A46072d6861A17088f2841C09309r1781d3372B47370Q3684
17349C31054A11968l4087b40184D1204M22606A62183b1996A64621Q9710a57895
17338a77979A66953a49567f853k45322C12514A6808K0363R4060O0558J05477C0329
17326I1078J8651B9189a18936C02665i84B16597l8210G0430L17520F724b46334
17314B64109J84264C6583g8150j12333k3856F5683L9265c7927O34B85837A16954
17302a533B21045K00009A87465O9260D4717L44338A18659J44073o7262N8609n4354
17291A99725E3349k2003a54634f802C96375G3620b9049D11590A26302J91446A15049
17279A44071o5291L12252a28254A44544J13585F3067J3271J60929a73594B27645
$$ y = [174738, -167531, 146072, -46861, 117088, -62841, 309309, 217528, -43372, 247370, 331054, 111968, 77881, -240184, 41204, 463810, 162183, -21996, 164621, 254331, -157895, -177979, 166953, -149567, -6853, -252175, 312514, 16808, 37171, 131231, 191789, 297266, 30329, 91078, 109729, 29189, -118936, 302665, -984, 216597, 178387, 70430, 387950, 6724, -246334, 264109, 448373, 36583, -78150, -190483, -214339, 65683, 104948, -37927, -37293, 285837, 116954, -1533, 221045, 421054, 187465, 256725, 44717, 389055, 118659, 262732, 195470, 254079, 199725, 53349, 31346, -154634, -6802, 396375, 73620, -29049, 411590, 126302, 317748, 115049, 144071, 78780, 391032, -128254, 144544, 258129, 63067, 76338, 237267, -173594, 227645]
17268B73963j30992M5230C293J44700M3963D1006K92581P4664h9806A92635K2660
17257B15295R9420f949C07272d1360G076K85609E5354h522A12128K56668a51601
17245F9685J42509a66484B60883L6171B2039P86396A81371K3012J31115n1094
17235B84404G437b8969C01424G4980a18069E0334M93771r3091j93345J58737J3071
17224D29477D8038N2838J11845K14854r7835H4736M535j6944M15900B31326E2624
17212B69727K3713j44700L2406l1514R3363j04009L8757J84215J6931A18749J23830
17201B42579O3761A2267K35728q6023K68677j91518j9583K50349A23128E8579
17190A76117N8945a01757D07079A9004b2058D7046K15299M5094J16202E2400J08350
$$ y = [273963, 142971, 188201, 3293, 147993, 191956, 41006, 333587, 408251, -89806, 192635, 215295, 314715, -6949, 307272, -41360, 7076, 292685, 55354, -8522, 112128, 368796, -151601, 69685, 212194, -166484, 260883, 297054, 22039, 808435, 181371, 204383, 335498, 284404, 7437, -28969, 301424, 74980, -118069, 50334, 544105, 451014, 257669, 416406, 429477, 48038, 100876, 212721, 427575, 329740, 84736, 89271, 72327, 488227, 231326, 52624, 269727, 293440, 148740, 181146, 149632, 242995, 138986, 177743, 361958, 378889, 118749, 242579, 306340, 12267, 247995, 161972, 430649, 239131, 219548, 469897, 123128, 58579, 176117, 235062, -101757, 407079, 19004, -22058, 47046, 262345, 307439, 423641, 52400, 160750]
17179A60750J57140I1942Q3105J98932m9116a56249B23524J3786Q7640P368A24402
17167B48675b87234A58143h0172C90593A70336G6629K56938J20835j0603N8354
17157E02153k12306K37249m9377K9339a97133A18683k1145K52653j17754J27036
17147C59473c8505D37372A50474J79532A55106K50256n8093a68184D17667r6892
17137C20775J67862j36080q4007F4291M88353j56574K63060k05581H4200M21746
17127E05946B02654M9260A17824J65341d2778l6927E65686k06319j09138K93526
17117E43755q4252D0834f3427F18444k13713j92046K6958L1511l3014A06925J81666
17106B88591M32086B93516j30035M04811j07745j03895l0574R4302j17220J37638
$$ y = [160750, 317890, 91942, 175047, 373979, 324863, -156249, 223524, 237310, 324950, 332318, 124402, 248675, -287234, 158143, -80172, 390593, 170336, 76629, 333567, 454402, 443799, 502153, 289847, 527096, 477719, 507058, -197133, 118683, 97538, 350191, 232437, 359473, -38505, 437372, 150474, 330006, 155106, 405362, 347269, -168184, 417667, 320775, 488637, 352557, 268550, 64291, 552644, 396070, 659130, 453549, 84200, 505946, 202654, 251914, 117824, 283165, -42778, -79705, 565686, 359367, 250229, 543755, 459503, 40834, -63427, 618444, 404731, 212685, 239643, 271154, 238140, 106925, 288591, 720677, 293516, 163481, 568292, 460547, 356652, 326078, 420380, 303160, 440798]
17096D40798B16521L09222P3155A26071L87973j73955q917j43038n5156K93101
17086D26079J883H6115M03336B25388K09536j15232L57189B19051J72006r2805
17076B98252K65553m3866K53121H9156K14038K04078k11174M9149K42084R117
17066E96448p7103k53725J82353R0733j62528n2028N15983k11673l06093Q0186
17056D02553R4028J00613k91865K5982M10859j18997j8559j59889O9701M6772
17046E61198J28847O973C33740L63668l03608K2972J92081j37223n0442J20945
17036E42133k32283K97983k70729M24113l51352A44639L86846J25079M8176B26969
17025G59580B94844K85068M7963K83924B10220Q18002m86490J60352r285M5542
$$ y = [440798, 216521, 525743, 598898, 126071, 514044, 340089, 331172, 188134, 132978, 426079, 427962, 86115, 489451, 225388, 434924, 319692, 676881, 219051, 391057, 298252, 563805, 519939, 773060, 89156, 303194, 507272, 296098, 345247, 587331, 596448, 519345, 265620, 447973, 538706, 376178, 324150, 840133, 628460, 322367, 402553, 496581, 597194, 305329, 331311, 742170, 623173, 604614, 444725, 514426, 561198, 690045, 697018, 333740, 697408, 393800, 416772, 608853, 471630, 421188, 542133, 309850, 607833, 337104, 761217, 409865, 144639, 531485, 656564, 704740, 226969, 759580, 294844, 579912, 627875, 911799, 210220, 1028222, 541732, 702084, 692799, 738341]
17015G38341j07953K96070p4606l32138L02949j25375J83535l67991J89097k30893
17005D71036K7273q5732L20678k0313J89020m42234K48307Q2661l41857N46377
16995I95216k08830j92212j91972Q9607K09948J0347J80956K91626l93294J55072
16985I46464l76142Q5765K40164j33980j79431L78648j47702j26755M60601j37278
16975A010354J0725l46253L48228j14834j52231n5838K64992J08947k30260K72970
16965A116800j18743J37803o4593O5527l89339J61967o1370M52844n24822M41070
16955A217144m37300J65215J71368k03532J16360J5578R8279p5267P9171J17153
16945A264169k83769Q3295J09939j49226L93343l09846L83648n6589j96721r7714
$$ y = [738341, 630388, 926458, 851852, 519714, 822663, 697288, 880823, 512832, 701929, 471036, 498309, 412577, 733255, 712942, 901962, 459728, 708035, 790696, 448839, 995216, 786386, 594174, 402202, 491809, 701757, 712104, 893060, 1184686, 791392, 946464, 570322, 656087, 896251, 762271, 582840, 961488, 813786, 687031, 1147632, 1010354, 1021079, 674826, 1023054, 908220, 755989, 700151, 965143, 1074090, 843830, 1116800, 998057, 1135860, 1071267, 1136794, 747455, 909422, 848052, 1300896, 776074, 1217144, 779844, 945059, 1116427, 912895, 1029255, 1044833, 1143112, 1067845, 1147016, 1264169, 980400, 1063695, 1173634, 1024408, 1417751, 1107905, 1491553, 1434964, 1238243, 1140529]
16935A140529J6865j83884K43959O6189k0001J04077l86373J03283K48540O3579
16925A396763j88914P4191M21963r1870m26324j6777L02315Q2619L38834k02060
16915A690740R5096j17325l1565K97300l44388J24569j58397J43247l46216M99366
16905A852427m11935J10472K05550m7696r3029J46399m0529K39073J05279l50957
16895A715054L15545m01007K59218l29020L31873J36027P8691n7034n8997K26045
16885B216395j89412K58736j51872K59794j94477O2372N2520P2667L7700j09650
16875B314773J15575r6539n9660L83976p2769L9720Q3366M203k8500J33215j96844
16864B620516M55051R1037k90161M09228l35214L6169K5Q6140K71449p8512P1568
$$ y = [1140529, 1157394, 973510, 1217469, 1283658, 1263657, 1367734, 981361, 1084644, 1333184, 1396763, 1207849, 1282040, 1704003, 1612133, 1185809, 1169032, 1471347, 1553966, 1892800, 1690740, 1785836, 1668511, 1636946, 1934246, 1589858, 1714427, 1556030, 1699277, 1353061, 1852427, 1440492, 1550964, 1756514, 1708818, 1615789, 1762188, 1721659, 1960732, 2066011, 1715054, 2030599, 1629592, 1888810, 1559790, 1891663, 2027690, 2106381, 2049347, 1990350, 2216395, 2026983, 2285719, 2133847, 2393641, 2199164, 2261536, 2314056, 2386723, 2424423, 2314773, 2430348, 2333809, 2274149, 2658125, 2585356, 2625076, 2708442, 2712645, 2684145, 2817360, 2620516, 3075567, 3166604, 2876443, 3285671, 2950457, 2986626, 2986651, 3072791, 3344240, 3265728, 3337296]
16853C337296j25000L22014k80197n8676O70590m08549k49596O6143O15114M8893
16843C938032k06304K89239M00445n67793K04142J09919k31363N05764j69482
16834D272599L58613k82575J94722Q1761J62253R8944J67619M37323m68901K12398
16824E234756l1429K78654P9115K18688K74776k38880J12936N02240l85959K34732
16814F279629K14838K19708r9773J31635Q5578M08505L65581j4479o7503J36402
16804G660121K91210L26244k4560J91982J26035K57338N26116k42K26952L44282
16794I925478L63176J37478M3740L75641P96221J65750K7147M77411M52361O68855
16784A3433258j03582M04648N07245L41369K62547O97344K50377P06248O25757
$$ y = [3337296, 3212296, 3534310, 3254113, 3195437, 3866027, 3457478, 3207882, 3274025, 3889139, 3938032, 3731728, 4020967, 4421412, 3853619, 4057761, 4167680, 3936317, 4442081, 4272599, 4631212, 4348637, 4543359, 4625120, 4787373, 4886317, 5053936, 5491259, 5022358, 5234756, 5203327, 5481981, 5561096, 5779784, 6054560, 5815680, 5928616, 6430856, 6044897, 6279629, 6494467, 6714175, 6614402, 6746037, 6831615, 7240120, 7605701, 7591222, 7523719, 7660121, 7951331, 8277575, 8253015, 8444997, 8571032, 8828370, 9354486, 9354244, 9581196, 9925478, 10288654, 10426132, 10469872, 10845513, 11641734, 11807484, 11834631, 12312042, 12764403, 13433258, 13329676, 13734324, 14241569, 14582938, 14845485, 15542829, 15793206, 16499454, 17125211]
16775A7125211N83496N05473N50461R93645Q8380J150362P16302O64691R34446
16766B3312467J122208P07096R52877O76082J166234J224088J177635J026558
16758C1365245J541585J479980J530611J468759J792425J726273J850468J738770
16750D4494116K537734K048119K321369K593138K817403K775852L295169K952887
16742F5835787L763738L177854M114568M164097L950330M425861M579854N075074
16734I9087163N202319M964184N871853N456240N390685N785597N301474N376470
16726A42435985N234497M085087M402925L365191L136415K241920J115251O77849
16718A66695120p90500r01741k298210k621491l864525m040662m573758n020289
$$ y = [17125211, 17708707, 18214180, 18764641, 19758286, 19846666, 20997028, 21713330, 22378021, 23312467, 24434675, 25141771, 26094648, 26770730, 27936964, 29161052, 30338687, 31365245, 32906830, 34386810, 35917421, 37386180, 39178605, 40904878, 42755346, 44494116, 47031850, 49079969, 51401338, 53994476, 56811879, 59587731, 62882900, 65835787, 69599525, 72777379, 76891947, 81056044, 85006374, 89432235, 94012089, 99087163, 104289482, 109253666, 115125519, 120581759, 125972444, 131758041, 137059515, 142435985, 147670482, 151755569, 156158494, 159523685, 162660100, 164902020, 166017271, 166695120, 165904620, 165002879, 162704669, 160083178, 156218653, 152177991, 147604233, 142583944]
16710A42583944m973295n803858n651333n342437n459744n856766n723736m649245
16702I9123530n265915m886769m627704m491107m002607l864713l700676l366819
16694F4917220l373252k993644k627526k935730k547206k311525k170416k382602
16686D3575319j845687j501738k107080j703339j443985j692350j309547j402928
16678C0568665r43837j169362j003098j526203q54682m65486j118480j256135
16670B2231382o21300n45942j003926n65649q83811k3567j020452j01337p83125
16661A6682273o48217k41802q26856N2320n60654l07216o08962o35007j31308
16652A2774571n73535j6373m44078r9863m48029p05487M09236n85415l91678k46450
$$ y = [142583944, 137610649, 131806791, 126155458, 120813021, 115353277, 109496511, 103772775, 99123530, 93857615, 88970846, 84343142, 79852035, 75849428, 71984715, 68284039, 64917220, 61543968, 58550324, 55922798, 52987068, 50439862, 48128337, 45957921, 43575319, 41729632, 40227894, 38120814, 36417475, 34973490, 33281140, 31971593, 30568665, 29624828, 28455466, 27452368, 25926165, 25071483, 24605997, 23487517, 22231382, 21610082, 21064140, 20060214, 19494565, 18610754, 18587187, 17566735, 17465398, 16682273, 16034056, 15792254, 14965398, 15017718, 14457064, 14149848, 13540886, 12905879, 12774571, 12201036, 12184663, 11740585, 11640722, 11192693, 10487206, 10896442, 10311027, 9919349, 9672899]
16642I672899J5098o16644O5491k92025k34753j25941l11931j96811j7691j35653
16632G822039m93601n3215k7933j14061p2951m84036j66600j68331Q4451J7563
16622F343325n1080l34345n35959J76316K9377q9863r1227j60525K7419k64710
16612E048728k97723J04748M6348o06648M04105k92113R5095j88885l6378m1482
16602D235795j87882k70474M12183l42060j42145K21393O5134n0539j13522k40487
16592C587396J45518j98422l05306J37513m43418L88187p0080k28829K55821p39228
16582B529152N82166R2494j62571m1068j88322M03985k99995q4845j99154K73996
16572B905838q5830l72597L18005k46192j94228M5668N3481r178k55103O3706
$$ y = [9672899, 9687997, 9071353, 9136844, 8844819, 8610066, 8484125, 8172194, 7975383, 7957692, 7822039, 7328438, 7275223, 7247290, 7133229, 7060278, 6576242, 6409642, 6241311, 6325762, 6343325, 6292245, 5957900, 5421941, 5598257, 5627634, 5537771, 5446544, 5286019, 5313438, 5048728, 4751005, 4855753, 4902101, 4295453, 4699558, 4407445, 4502540, 4313655, 4277277, 4235795, 4047913, 3777439, 4189622, 3847562, 3705417, 3926810, 3991944, 3941405, 3827883, 3587396, 3732914, 3534492, 3229186, 3366699, 2923281, 3311468, 3241388, 3012559, 3268380, 2529152, 3111318, 3203812, 3041241, 3000173, 2811851, 3215836, 2915841, 2830996, 2631842, 2905838, 2820008, 2447411, 2765416, 2519224, 2324996, 2370664, 2424145, 2414967, 2159864, 2223570]
16562B223570K8190L2372k11822K39314k20743K31588j1846l14673K49302k34030
16552B011222M58854o44716M40822l42038K38599j86521j16151R6164K65976n23052
16542A699159Q5753J39528k14191q9170J53351j94779M62917n06667m50618L39625
16532A424908O6554k3431J46684k95441M48909K7557l53952J71119j20919q9423
16522A402565K35516k55186J08194O09304n38759l57604j00432J00969L83411
16513A587978n57943N08025j48684K55765k20896m9859K64042o29446K29581L31655
16503A570218R287k71285j83580m21422L08600N54090l92049j74036K70640j43922
16493A126541j95156j08490L79983j23950l1709l3212k08469q9999L36062M4185
$$ y = [2223570, 2251760, 2284132, 2072310, 2311624, 2090881, 2322469, 2310623, 1995950, 2245252, 2011222, 2470076, 1825360, 2266182, 1924144, 2162743, 1976222, 1860071, 1956235, 2222211, 1699159, 1784912, 1924440, 1710249, 1621079, 1774430, 1579651, 2042568, 1535901, 1085283, 1424908, 1491462, 1468031, 1614715, 1319274, 1768183, 1795740, 1441788, 1612907, 1491988, 1402565, 1638081, 1382895, 1491089, 2100393, 1561634, 1204030, 1103598, 1204567, 1587978, 1030035, 1538060, 1389376, 1645141, 1424245, 1374386, 1638428, 1008982, 1238563, 1570218, 1579505, 1308220, 1124640, 703218, 1011818, 1565908, 1173859, 999823, 1270463, 1126541, 931385, 822895, 1202878, 1078928, 1047219, 1014007, 805538, 715539, 1051601, 1095786]
16483A095786k0177k02167k1084K11403r2689k9304R7437k7851j01539K03487
16473A113302D87974K21916J49128q1007j22196J28525l290K05815j55290J45885
16463I77460j07011J46468k02463k08207K6749o1586J18311K52737j56128M7114
16453H33444j46040K31173j21169k44712K90213J44760l79618J53612j14527J06515
16443G53651J09231n4255J1407K37032E27525l0839L29332k1264m0853j55731
16433F08170L9522p0102K9129j9930K53893J07617l04285l6151k95662K50576
16423E62777J01414j95806Q399m9071J59178K06303j92962j23498K04234k68212
16413D12756L7761J13867K9177j61295K42284R9572l86918N7750n3378L40216
$$ y = [1095786, 1075609, 873442, 852358, 1063761, 971072, 941768, 1039205, 1011354, 909815, 1113302, 487974, 709890, 859018, 778011, 655815, 784340, 781050, 986865, 831575, 977460, 870449, 1016917, 814454, 606247, 632996, 571410, 689721, 942458, 786330, 833444, 687404, 918577, 797408, 552696, 842909, 987669, 608051, 761663, 647136, 753651, 862882, 808627, 820034, 1057066, 527525, 496686, 826018, 804754, 763901, 608170, 647692, 577590, 606719, 586789, 840682, 948299, 644014, 607863, 312201, 562777, 664191, 468385, 476784, 427713, 586891, 793194, 600232, 476734, 680968, 412756, 450517, 564384, 593561, 432266, 674550, 774122, 387204, 444954, 391576, 731792]
16403G31792l26337K32516J43412C68773J65608k49626K11350K12792k56300J27403
16393E80000J82248l59801h5844F29161J87046j64223P5284k28423J53456A82478
16382A71994M23715B52044N18973l51570K3819p5096j02040K42593j50853P7900
16372D35770K23141B50168O2786N0959K74437A56914K99872j82856L01874j24916
16362D50888O593k5501k00935M15305k96035J32717j98288K28402k33769N9749
16352C39126j24165K03950o1723j52406m8082M05238A99285L93032B76983L71792
16342F48775A51163K94488j63817L49810B86160A5137M812K42921J7045P5232
16332C55147l109K55596A93707P1585K05984Q6402k26633m382o8530Q3079j46939
$$ y = [731792, 405455, 637971, 781383, 368773, 534381, 284755, 496105, 708897, 452597, 580000, 762248, 402447, -85844, 629161, 816207, 651984, 727268, 498845, 652301, 182478, 171994, 595709, 252044, 771017, 419447, 443266, 368170, 266130, 508723, 357870, 435770, 658911, 250168, 312954, 363913, 638350, 156914, 456786, 273930, 575804, 450888, 457481, 431980, 231045, 646350, 350315, 483032, 284744, 513146, 279377, 339126, 214961, 418911, 357188, 204782, 156700, 561938, 199285, 592317, 276983, 648775, 151163, 445651, 281834, 631644, 286160, 15137, 19949, 262870, 279915, 355147, 352038, 607634, 193707, 265292, 471276, 557678, 331045, 326663, 258133, 341212, 194273]
16321A94273m0759K83960q6246J057j24673O4579n3841O0155K5200K61089A81732
16309B37992L3015R5739E8382L19825j76734C989P6175J21347J00536A31657D9876
16297B79570J69988j31807J25301j31408m8622j2038J15712A49383J2203K59321
16287D20907M0486A83659a18840B31496Q2901Q1621g3377A16102K13039A01556
16276D50350p5815C8985J18401K87569j81462R6518j9721L9623q1327c4050C69502
16264D96594r4067D0735L40585A14833P7992r758N8864J39084j37761m8343l7947
16253A56964L1147Q301K413F2924K45935r1142A01482m4137K94973J07745A91351
16241A30885N0408h8413A54288K8299q2250L61057d1452B36305M0097l9814K39724
$$ y = [194273, 153514, 437474, 351228, 352285, 227612, 292191, 238350, 298505, 323705, 584794, 181732, 237992, 271007, 366746, 58382, 378207, 201473, 3989, 80164, 201511, 302047, 131657, 49876, 279570, 449558, 317751, 443052, 311644, 263022, 250984, 366696, 149383, 161586, 420907, 461393, 183659, -118840, 231496, 314397, 396018, -73377, 116102, 329141, 101556, 450350, 374535, 38985, 157386, 444955, 263493, 360011, 340290, 379913, 298586, -34050, 369502, 496594, 402527, 40735, 381320, 114833, 192825, 183067, 241931, 381015, 243254, 194911, 156964, 188111, 196412, 198825, 62924, 308859, 217717, 101482, 57345, 352318, 460063, 191351, 130885, 181293, -88413, 154288, 182587, 100337, 461394, -41452, 236305, 276402, 236588, 476312]
16230D76312B01861a26145M7594C97376j7806j52378n2161J13498j14701c0279
16219A56453h552B01775g6485A24771i5288A97497j4767J13688K0357k9871j24819
16208A62085P0440f7288A31747J18866B6172a38280B67744c2652k54839B02574
16197F2543r604K22458m1200a64573f4517r409E4003J19954D7575J21541Q0393
16186B49509o3768d0721B22676M6288p0521A8695O9244l4841J19176c10737b8561
16174c9825J9002B77204A33371c32538B72829L6917e5418B38639j04209A4972
16163b58429A07475m6449a30919L2287A45371J51792h2222q596A1906D363O31
16152D994K25250q1739f0935A66656K0933c4265A00960J41350R7364e1772B22387
$$ y = [476312, 201861, -126145, -78551, 397376, 379570, 227192, 175031, 288529, 173828, -30279, 156453, -8552, 201775, -76485, 124771, -95288, 197497, 182730, 296418, 316775, 286904, 162085, 232525, -67288, 131747, 250613, 26172, -138280, 267744, -32652, -287491, 202574, 62543, 52939, 275397, 234197, -164573, -64517, -73926, 54003, 173957, 47575, 169116, 249509, 185741, -40721, 222676, 268964, 198443, 18695, 87939, 53098, 172274, -310737, -28561, -39825, -20823, 277204, 133371, -332538, 272829, 309746, -55418, 238639, 134430, 14972, -258429, 107475, 61026, -130919, -98632, 145371, 297163, -82222, -90818, 11906, 4363, 4994, 230244, 148505, -60935, 166656, 187589, -34265, 100960, 242310, 339674, -51772, 222387]
16140B34926a17778j3152b1304B87325N0037h7681j15622P0619B19920I4205J33324
16129B27529o3502b58469B31920M8733O2781m4909C7179K22019a14873B69896
16118c25121a3851n0880j3134j43145B06353J17592j38151h4405d939j0957q8684
16107a04580B56028A1878M5756J50329a26434B87573J62535A14169L46626k14310
16097B46485r4947J16439A03373J33422j12808f4740K8778A87967b5233I2568
16086B00837a95658h364E10347H1343a56980e3938b1440A01669a73091E65333
16075f7740g959A27429b45258h2561n9002b6383C13735h4622B71138d1554A96025
16063c15259h2545C27567a53763A44509h8239A01379j8047c09232N1335Q7683
$$ y = [234926, -117778, -130930, -21304, 287325, 337362, -87681, -203303, -132684, 219920, 94205, 227529, 164027, -258469, 231920, 280653, 343434, 298525, 37179, 259198, -114873, 269896, -325121, -13851, -64731, -77865, -221010, 206353, 323945, 185794, -84405, -4939, -15896, -104580, 256028, 11878, 57634, 207963, -126434, 287573, 450108, 114169, 460795, 246485, 151538, 267977, 103373, 236795, 123987, -64740, -35962, 187967, -25233, 92568, 200837, -195658, -8364, 510347, 81343, -156980, -53938, -21440, 101669, -173091, 565333, -67740, -7959, 127429, -245258, -82561, -141563, -26383, 313735, -84622, 271138, -41554, 196025, -315259, -82545, 327567, -153763, 144509, -88239, 101379, 83332, -309232, -257897, -170214]
16053a70214Q0144C05229E3427b8042k13692D4308a28640c5547A82544c3429l0533
16042f3962B4310a82139a8596k443E0407L72283j69767l2528C0224J60294b45300
16030F625f0205k52850I1513c30033K2315p541J11897A00292a28548C0017J47068
16019A77085h3687A97171f3990j85644B69843l237b9571A01348N5319P1470A7613
16007a93120a9204j55188B70687a33402B22191c8904A9235d18381C58520h6643
15996F2198J34928c08229d9015C26357a28810A81525q0668g2225c4768B61504
15985A65470G5388l3141L9564q189J71088I0776L22173A68475A2821e6515L721
15974e2794A24968a5329j30648B77752H7852P9844i9911B68998B1084c674A02679
$$ y = [-170214, -90070, 305229, 53427, -28042, -241734, 44308, -128640, -35547, 182544, -33429, -63962, 24310, -182139, -18596, -21039, 50407, 422690, 252923, 220395, 30224, 190518, -245300, 6625, -60205, -313055, 91513, -330033, -307718, -315259, -203362, 100292, -128548, 30017, 177085, -83687, 197171, -63990, -249634, 269843, 266606, -29571, 101348, 156667, 228137, 17613, -193120, -19204, -174392, 270687, -133402, 222191, -38904, 19235, -418381, 358520, -86643, 62198, 197126, -308229, -49015, 326357, -128810, 181525, 100857, -72225, -34768, 261504, 165470, 75388, 42247, 81811, 73622, 244710, 90776, 412949, 168475, 12821, -56515, -52794, 124968, -15329, -145977, 277752, 87852, 167696, -99911, 268998, 21084, -3674, 102679]
15962A87077l6338D9240A2765K6923a6844j43133A64892i7041a4537o2137B169
15950I4441e33387a42397J5218N5891G6160M5131j8260N1653i3668j4101A56233
15938a40652J2824A48270c5673j57266A16373b59974h5351A70012b1161C2267
15927C95512a46038D235P7151a43081G9481M4229A3693B205b5073A11383f5957
15915E9826a56150K1660I6102B2297O9394j4484A3399b57597f6022B2419M9880
15904G2299F183b60648a25036A42005F6664c92657a6925n5288n8255j48340C5438
15892A56184a28570b1990j49475G7792a49713L1090J3886n8423a3902A66515O6784
15881B33299e6080G5159a83915Q2616b3361p3730j60773L8809B20347g5527r4912
$$ y = [187077, 150739, 49240, 12765, 39688, -16844, -159977, 164892, -97041, -14537, -76674, 2169, 94441, -533387, -142397, -127179, -71288, 76160, 121291, 103031, 154684, -93668, -107769, 156233, -140652, -127828, 148270, -35673, -192939, 116373, -259974, -85351, 170012, -21161, 32267, 395512, -146038, 4235, 81386, -143081, 79481, 123710, 13693, 2205, -25073, 111383, -65957, 59826, -156150, -134490, 96102, 22297, 91691, 77207, 13399, -257597, -66022, 22419, 72299, 6183, -260648, -125036, 142005, 66664, -392657, -16925, -72213, -130468, -278808, 35438, 156184, -128570, -21990, -171465, 77792, -149713, -118623, -104737, -163160, -13902, 166515, 233299, -56080, 75159, -183915, -101299, -23361, -97091, -257864, -219055, 220347, -75527, -170439]
15870a70439A23545K02761D5623a70990g3757A90077g68j99336b8543k19979D5480
15858b33852A761f9350A81627a46929j53456O2838B5539J0903h6220N607j5899
15847i6512A28559b27507L1375h7534j8320H89i1923j8467A82688d8662B48540
15835H0756i5170n9940l0046g0157j23815L5082a081r2002k14575B7134b50299
15823d06965b00533A21076e0257k65578a15298G5384c89767h8932A84427H424
15812e0739B82864b32056b189C70085G5695e0134p9964j0136A6076d7934B18507
15800D0987e5572A67950a77105b4444B07940a36322L1960j5842o1093j26351C6131
15788b0376C24543j34155b29874E5339c40621f3321a1617k14543A26590c87988
$$ y = [-170439, 123545, 326306, 45623, -170990, -73757, 190077, -768, -200104, -28543, -248522, 45480, -233852, 1761, -69350, 181627, -146929, -300385, -237547, 25539, 36442, -86220, -80613, -96512, 128559, -227507, -196132, -87534, -105854, 889, -91923, -110390, 182688, -48662, 248540, 80756, -95170, -155110, -185156, -70157, -193972, -158890, -1081, -93083, -307658, 27134, -250299, -406965, -200533, 121076, -50257, -315835, -115298, 75384, -389767, -88932, 184427, 8424, -50739, 282864, -232056, -2189, 370085, 75695, -50134, -130098, -140234, 16076, -47934, 218507, 40987, -55572, 167950, -177105, -24444, 207940, -136322, -104362, -120204, -181297, -307648, 36131, -20376, 324543, 190388, -229874, 55339, -340621, -63321, -11617, -226160, 126590, -387988]
15777a84798A81355l7278N0232F3479b7991D4607c4083j93040A34141b1362o7081
15766h8443j2706A8685L4502a64411A30270a94049D0786a43058B43912a29322
15755C81144j34693e7194a0557B30897c6718r7003P801N1405l7326l3152A42059
15743A79888n1008A3383a36474l8868c2386A42677c22094A69886C9289b07416
15732a42449K2934F166d44453B39065E7777a82782B90319b87848A78008B0503
15721H061b72158n2835B1066h7287p0997B72555A7650a62211E4459a39426A53707
15709a58385b3645j16326C0983Q455R4419a10984m8219K7339d3936k6152r7889
15698a67977K831A62811b3882B17930a63732I2408b8473n9263F3900J19260a25428
$$ y = [-184798, 181355, 144077, 194309, 63479, -27991, 44607, -34083, -227123, 134141, -21362, -88443, -101149, 18685, 53187, -164411, 130270, -194049, 40786, -143058, 243912, -129322, 381144, 246451, -57194, -10557, 230897, -36718, -133721, -125920, -74515, -111841, -144993, 142059, 179888, 128880, 13383, -136474, -175342, -32386, 142677, -322094, 169886, 39289, -207416, -142449, -119515, 6166, -444453, 239065, 57777, -182782, 290319, -287848, 178008, 20503, 8061, -272158, -324993, 21066, -87287, -158284, 272555, 17650, -162211, 54459, -139426, 153707, -158385, -23645, -139971, 30983, 39438, 133857, -110984, -159203, -131864, -43936, -70088, -167977, -165146, 162811, -23882, 217930, -163732, 92408, -28473, -87736, 63900, 183160, -125428]
15686A30558H519J24310b21887k9058N3604d8847B24795e4815K0941r3293r9146
15675b26313B47210J06513E9952d1250B95846a9180k9243D6772a6104B20904a58881
15663c58327a00401K197N88a9497k6458j33119e4888k39293B27861o8711e8267
15651i6866c1392D5311h2647j4818B4651J84664m8255e1299A44144o8582a66538
15639b48231k1656a4198j00556k00796J48526g1607B79658C7938g7375c2426A53430
15627c835j28255j31568C4224b06105B60768c46367F7021b055E1010Q3193F0227
15615A50850G626J38303a24524A05365M295a90540m3933B455b68848C40830D0566
15603A05479F470d6434r6640f6954E3999M0757L5352j3396b35257e3570B57666
$$ y = [130558, 8519, 132829, -221887, -250945, -197341, -48847, 224795, -54815, -33874, -127167, -226313, 247210, 353723, 59952, -41250, 295846, -19180, -48423, 46772, -16104, 220904, -158881, -358327, -100401, -98204, -97616, -19497, -45955, -179074, -54888, -294181, 227861, 159150, -58267, -96866, -31392, 45311, -82647, -97465, 24651, 209315, 161060, -51299, 144144, 75562, -166538, -248231, -269887, -14198, -114754, -315550, -167024, -71607, 279658, 37938, -77375, -32426, 153430, -3835, -132090, -263658, 34224, -206105, 260768, -346367, 67021, -2055, 51010, 134203, 60227, 150850, 7626, 145929, -124524, 105365, 109660, -190540, -234473, 2455, -268848, 340830, 40566, 105479, 6470, -46434, -143074, -66954, 53999, 94756, 130108, 116712, -235257, -53570, 257666]
15591G362N1606J85146a72261g9422A62367a9360A69597c11050a47281A58262
15580G8907M9065e0866B16610e6593i976j04500J1833j02A36302l4799a00458
15568b35642P9030a6782j75377H4092e6107p2500A25847D8209a06908R227B6804
15556A19055m4733c37700p6723A15494O9850B653b46370a13165J1903A2718e3014
15544A53293a6533j70057A42128a09727B13923H76N5231N1845g2897A28698J02089
15533B30787j13417B7080J02625h2681E5998a5498j01509H0542b00113B23464
15522A21630K182P5659E8698a52048C742a89553B38410E3161K9824l3508d45F008
15509f0722j3030l7711j36524c2869j2269k31164i0555D89335c59257G1258b03215
$$ y = [7362, 58968, 244114, -172261, -79422, 162367, -19360, 169597, -311050, -147281, 158262, 78907, 127972, -50866, 216610, -56593, -9976, -114476, -102643, -102745, 136302, 101503, -100458, -235642, -156612, -16782, -192159, 84092, -56107, -128607, 125847, 48209, -106908, -97681, 26804, 119055, 74322, -337700, -414423, 115494, 185344, 2653, -246370, -113165, -101262, 12718, -53014, 153293, -16533, -186590, 142128, -109727, 213923, 876, 56107, 107952, -72897, 128698, 230787, 117370, 27080, 129705, -82681, 55998, -15498, -117007, 80542, -200113, 223464, 121630, 123812, 199471, 58698, -152048, 3742, -189553, 238410, 53161, 82985, 49477, -445, 6008, -60722, -73752, -111463, -247987, -32869, -45138, -276302, -90555, 489335, -359257, 71258, -203215]
15497b37948R9750a8200j3215a0240E2336e115I9296f9088A14866K9723b13530
15485a17020k61499a2829l7731j66013A6061a70154j67314a19298a2430A11386
15474A25085c2151r3493B41273d2232j08604E7052J10763g1939k35156C15616
15463d5629j33954h3352I6725f7702r5689C6908J47706c036B82818E3472A1350
15451c9046C3033d4574C02718D7355a09551E1209c91526J51249B26685A10834
15440C3441J7100a25411P962e029B43724p0704a14323J4348A21566c3438m7250
15429h0688o9349A46825b60850e137r0745j06938A41101l7909B0234J3094f0626
15417H0462R6591b30422i0051l8185A97809i8814e419A52656K64368A27429p93
$$ y = [-237948, -138198, -18200, -31415, -10240, 52336, -5115, 99296, -69088, 114866, 144589, -213530, -117020, -378519, -12829, -50560, -216573, 16061, -170154, -337468, -119298, -12430, 111386, 125085, -32151, -125644, 241273, -42232, -150836, 57052, 167815, -71939, -307095, 315616, -45629, -179583, -83352, 96725, -67702, -163391, 36908, 184614, -3036, 282818, 53472, 11350, -39046, 33033, -44574, 302718, 47355, -109551, 51209, -391526, -240277, 226685, 110834, 33441, 50541, -125411, -117449, -5029, 243724, 173020, -114323, -99975, 121566, -33438, -80688, -150037, 146825, -260850, -5137, -95882, -202820, 141101, 103192, 20234, 33328, -60626, 80462, 177053, -230422, -90051, -128236, 197809, -98814, -5419, 152656, 417024, 127429, 126636]
15406A26636L1493d2798D0813b11426i7596a0368A176b4716B99923a463C76175
15394A32669a62537A75430b91851I3067i2849d6336k76106A827a09840D9658a83902
15382C09885j52567m6160b2965C1534c2491f358j22134j55072Q3009O918A77750
15370b36151A53516a32232d6212A3029j188a12877j85518O1511i9228A44178h9625
15358a18916A21988b1852A77714b91973J05718j76964A16750A7690L4830O9412
15348A21932a2654H9048J93908c743r2127q5772L9870A6313R9387d4355A44184
15336A70142d2161G3231R1732E2389r532a632p0423c4283k49710A45743b9812
15324a55250o889A31323A0560K40597J75118a73536j17757N885B49093F7193J04219
$$ y = [126636, 158129, -42798, 40813, -211426, -97596, -10368, 1176, -24716, 299923, -1463, 376175, 132669, -162537, 175430, -291851, 93067, -92849, -46336, -322442, 1827, -109840, 49658, -183902, 309885, 157318, 111158, -22965, 31534, -32491, -6358, -128492, -283564, -200555, -193637, 177750, -236151, 153516, -132232, -46212, 13029, 11841, -112877, -298395, -236884, -99228, 144178, -89625, -118916, 121988, -21852, 177714, -291973, -186255, -363219, 116750, 17690, 52520, 121932, -12654, 89048, 282956, -3743, -95870, -181642, -141772, 16313, 115700, -44355, 144184, 170142, -42161, 73231, 164963, 52389, 42857, -1632, -72055, -34283, -283993, 145743, -29812, -155250, -162139, 131323, 10560, 251157, 426275, -173536, -291293, -285408, 249093, 67193, 171412]
15313A71412B5714J9377c02516E8115g5093A86255n2723a26095j3311G6079a93474
15301c6704C4602f6567j04371l5762A31604P7995B2300K45868a07438d5650A64010
15289A56276c83601B15741J79681j35973d4841A04959J4394J15611A14038J59070
15279B73108b17607D7009L6116a72112b9426B07973g2736k47137A9797J59500
15269A79297E6185d73218a79882L4101m883I2947N1345b42293c9091r2306A45404
15257F8003a527A08133J70612I1687O9463J3610b3421F00598P5920N37101k42782
15246I70837J02892j75056B76566e6836p5830C56970g331A25041A4525K24394
15236B38919a9400k98682i2772B46280H7974a88061C01024B9563b0089j33136
$$ y = [171412, 25714, 45091, -302516, 58115, -75093, 186255, 133532, -126095, -139406, 76079, -193474, -36704, 34602, -66567, -170938, -206700, 131604, 209599, 22300, 268168, -107438, -45650, 164010, 156276, -383601, 215741, 395422, 259449, -44841, 104959, 119353, 234964, 114038, 273108, -217607, 47009, 83125, -172112, -29426, 207973, -72736, -319873, 19797, 179297, 56185, -473218, -179882, -145781, -150664, 92947, 144292, -242293, -39091, -131397, 145404, 68003, -1527, 108133, 278745, 91687, 161150, 174760, -23421, 600598, 676518, 1213619, 970837, 1073729, 898673, 276566, -56836, -132666, 356970, -7331, 125041, 14525, 238919, -19400, -318082, -92772, 246280, 87974, -188061, 301024, 29563, -20089, -153225]
15226a53225I3740a05110P270B26456I6337J24553E3558M8570L1339M5656R778
15215A88901J0476r1950a06584A01526J80559B5512N0723l329K0406J21509n5061
15204A59760n155J73026A50010C9289J54677A9538J25936K37619j79790J1277
15194B14580b0187A92382a29157N8172c3481B4086J51926A2911e9744h240D0000
15182A36688E7681g4812A39100g0014G2229L2558J84450c2673I4178a91833A1742
15170f8610A40561K7339K2246a34019d1289A21982k446D7209N0828J78260b547
15158A4344b3466m0696A24700C9324J48244I1599L7734L2930p1692i0468B36282
15146b67302G3754j956J86425i6096H3163r235J08664C8310J92967b9426A09320
$$ y = [-153225, 93740, -105110, -97840, 226456, 96337, 220890, 53558, 102128, 133467, 179123, 188901, 199377, 107427, -106584, 101526, 282085, 25512, 76235, 72906, 93312, 214821, 159760, 154605, 327631, 150010, 39289, 193966, 19538, 145474, 383093, 203303, 214580, -20187, 192382, -129157, -70985, -33481, 24086, 176012, 12911, -59744, -8240, 40000, 136688, 57681, -74812, 139100, -70014, 72229, 104787, 289237, -32673, 94178, -191833, 11742, -68610, 140561, 167900, 190146, -134019, -41289, 121982, 119536, 47209, 98037, 276297, -2547, 14344, -23466, -64162, 124700, 39324, 187568, 91599, 129333, 162263, 90571, -90468, 236282, -267302, 73754, 71798, 258223, -96096, 83163, 73928, 182592, 38310, 231277, -29426, 109320]
15134a861A3364J23814a42651d4399j05466E8550c1742c369j9764C17230r0503
15123B26727B358J77723G1252a43772F5593K25878A09702i5530A38342R1118j3937
15112B15523b7090E8601i264n4948H5168b07110E9024a1837B16017g0690D08134
15100b4807n0816A43067h4649B47433A13055a43714B66742q858e0711k7301A22992
15088A89509c24314A39646n0944J11354R3488D2600J46435l392L42188A19882
15077B74356e2886B53430a15235J613A87492i5999a521E4966O2131D4589f0191
15065a23780A14697i7386r8155O9813B37375D8904c01435D3076h5631A91180Q6973
15054B78153I6236q898L73152A97254M2349N244l4320I7496J14000N3188a56378
$$ y = [-1861, 13364, 137178, -142651, -44399, -149865, 58550, -31742, -3369, -23133, 317230, 226727, 2358, 180081, 71252, -143772, 65593, 291471, 109702, -95530, 138342, 229460, 215523, -27090, 58601, -9264, -64212, 85168, -207110, 59024, -11837, 216017, -70690, 408134, -24807, -75623, 143067, -84649, 247433, 113055, -143714, 266742, 257884, -50711, -78012, 122992, 189509, -324314, 139646, 88702, 200056, 293544, 42600, 189035, 185643, 527831, 119882, 274356, -52886, 253430, -115235, -113622, 187492, -95999, -1521, 54966, 117097, 44589, -60191, -123780, 114697, -97386, -195541, -125728, 237375, 48904, -301435, 43076, -85631, 191180, 278153, 96236, 87338, 460490, 197254, 239603, 244847, 210527, 97496, 211496, 264684, -156378]
15042A9495M7388M2105d1542B26416c2272A35596d6410E4707N7336h0215A72198
15030D9438A6629K4532J20103c6581A35004j6500D2152K70698I0192J040h6111
15018A23411a33A78957F3140J03868a45651B65381I2971J14665M0570r7763m0314
15007A10129J42350A02571f9540B46087J62760G5749J06631m9821a65804b7349
14996F4195Q9165N2533A00950J49984N6347E4636J47490J7279O3521r5236J58134
14985C45824C3320J50622J99226r4233A451L50162j68410O7908I8918J98416J85530
14974D82864H6122K00508f7317m9690A98183O1088B567N8049Q993L41986Q1598
14963D93193k0982G0445a4316C7128J76055K63720j87815K02097A76338H3109
$$ y = [19495, 66883, 108988, -41542, 226416, -32272, 135596, -46410, 54707, 112043, -80215, 172198, 49438, 16629, 41161, 161264, -36581, 135004, 118504, 42152, 312850, 90192, 91232, -86111, 123411, -133, 178957, 63140, 167008, -145651, 265381, 92971, 207636, 248206, 150443, 110129, 252479, 102571, -69540, 246087, 408847, 75749, 182380, 132559, -165804, -27349, 64195, 153360, 205893, 100950, 250934, 307281, 54636, 202126, 219405, 282926, 187690, 345824, 33320, 183942, 383168, 288935, 1451, 351613, 183203, 251111, 98918, 297334, 482864, 86122, 286630, -67317, -117007, 198183, 259271, 2567, 60616, 69609, 411595, 493193, 472211, 70445, -14316, 37128, 213183, 476903, 289088, 491185, 176338, 83109]
14952A42431L46611A34375K20989j62235m3368K94865A13062J5007n0145M31713
14942E09637B54245J36366f6693B5004L07332a04966C76443A55066J2684J5331
14932A83081N7183m7512j9617L7288j7073K54763g3528a5956B26512L50304l7514
14921E39302H4686J59867o4918K12606J6884j88952m4509C7529K5688L23806n3114
14910C33909k9511r7702l6734K80111A29402K57149j18548O9166j26179K28686
14900D39676L1981o2932K28789B89468l983r1737J68458a61374B83007J2496J30
14889B95633p6041O521J30505M7494O4355o2141A48345J62847A45993L76968B01409
14877B58359k2990k6616L01106A76171P3423K92109n8883j97071j03096M7481
$$ y = [142431, 489042, 134375, 355364, 193129, 149761, 444626, 113062, 128069, 77924, 509637, 254245, 390611, -66693, 25004, 332336, -104966, 376443, 155066, 167750, 183081, 240264, 192752, 173135, 210423, 193350, 448113, -73528, -15956, 226512, 576816, 539302, 84686, 244553, 179635, 392241, 409125, 220173, 175664, 37529, 63217, 387023, 333909, 304398, 206696, 169962, 450073, 129402, 386551, 268003, 337169, 210990, 439676, 471657, 408725, 637514, 289468, 285485, 193748, 362206, -161374, 283007, 295503, 295633, 219592, 226113, 356618, 404112, 468467, 406326, 148345, 311192, 145993, 522961, 201409, 258359, 235369, 208753, 509859, 176171, 249594, 541703, 482820, 285749, 182653, 230134]
14867B30134O0704n7700K01326j2595j14509e8797C01055L37660j52819B12607
14856D27617R1380r595L74875B84478p1808K63918L55618B31906M6977m9189J03402
14845C33096j05278J14754j01570J73924A82105J59674A14557K59440k7386K58630
14835F05241K3404K24299B44654m9523R1159L39531B34091M35186G1865L77982
14825D49847l9082j12595J55795A96409L93435A7662L17155J00540j2798J98650
14815F21209q9686R2220n8669K7216o2131j46791l1969N01200m25235J17546k24517
14804C20393J57577k17113J75999N2913j05376A63690M81188l16935J13632A53835
14793D25782q435D260O51031B87367k5103K18529K36806j9743l04893J04450P462
$$ y = [230134, 290838, 233138, 434464, 421869, 307360, -58797, 301055, 638715, 485896, 212607, 427617, 518997, 509402, 884277, 284478, 212670, 476588, 832206, 231906, 278883, 229694, 333096, 227818, 342572, 241002, 414926, 182105, 341779, 114557, 373997, 346611, 605241, 628645, 852944, 244654, 195131, 286290, 625821, 234091, 669277, 71865, 449847, 410765, 298170, 453965, 196409, 589844, 17662, 334817, 435357, 422559, 621209, 531523, 623743, 565074, 592290, 530159, 383368, 351399, 852599, 427364, 544910, 320393, 477970, 260857, 436856, 489769, 384393, 163690, 644878, 327943, 441575, 153835, 425782, 417347, 4260, 655291, 287367, 262264, 480793, 717599, 697856, 392963, 497413, 504875]
14782E04875L42987l63985K70263j60323B35690M04428o9315j00253j39163J03908
14772D35295J73573r214K07376l45509L29823k11084l5857P9519n1097L6899J78768
14761G88492j84036k16270L55288j42417p0185L64796k87398j64582B12260K82314
14751D94574J85244L8772N8988k31274k8217J42734J94302l94614j13130L78485
14741G25864J04639k14010P6496C36910K35373J5974j71979K8511J40508B56415
14730F69760M55002l13422k92771J98075N2156p9832j49492P2149l2973K63357
14720H42009J23561j84507J77036j57976j44292j94715L67512j47344j76591L45050
14710H49743j72659P8928J53474k11970K6777m7222M1739q8528L11984p3335j5151
$$ y = [504875, 847862, 483877, 754140, 593817, 235690, 640118, 570803, 470550, 331387, 435295, 608868, 599654, 807030, 461521, 791344, 580260, 544403, 623922, 572825, 609724, 788492, 604456, 388186, 743474, 601057, 530872, 895668, 608270, 443688, 212260, 494574, 679818, 718590, 777578, 546304, 518087, 660821, 855123, 460509, 347379, 725864, 830503, 616493, 692989, 336910, 572283, 588257, 416278, 444789, 585297, 256415, 669760, 1124762, 811340, 518569, 716644, 768800, 688968, 539476, 611625, 578652, 842009, 965570, 781063, 958099, 800123, 655831, 461116, 828628, 681284, 504693, 849743, 677084, 756012, 909486, 697516, 724293, 677071, 718810, 630282, 942266, 868931, 853780]
14699H53780j58360k27687L18087k1010K55157M1572k95417J40854L7025l27505
14689F16496P4970J57651j2516N4484j37237K63915J11766O7365l89837K79793
14679A086850J25612l49778J8625L57870q4784j55441j2480r6895J23056j53646
14669H58989p4793K86953j41563j8286k22793K81811r9052J79659j28007L49229
14659A272147k18024l74326O6913L8056J28495J22183j68525O3798L20784j35555
14649A115946k46490J56418J2673L27967P1477j77052l70254K09303Q5735r5908
14639A089815N1860k15510N64070k89458m1179P0273Q5775l01662k39175L57890
14629A132699P11J89096J62840j18514k07794j7220m7962J52354L85973n82669
$$ y = [853780, 695420, 467733, 785820, 764810, 1019967, 1061539, 766122, 906976, 944001, 616496, 691466, 849117, 836601, 891085, 753848, 1017763, 1129529, 1196894, 807057, 1086850, 1212462, 862684, 881309, 1239179, 1154395, 998954, 986474, 889579, 1012635, 858989, 784196, 1071149, 929586, 911300, 688507, 970318, 871266, 1050925, 922918, 1272147, 1054123, 679797, 746710, 784766, 913261, 1035444, 866919, 930717, 1251501, 1115946, 869456, 1025874, 1038547, 1366514, 1437991, 1260939, 890685, 1099988, 1185723, 1089815, 1141675, 926165, 1490235, 1200777, 1159598, 1229871, 1315646, 1013984, 774809, 1132699, 1133410, 1322506, 1485346, 1366832, 1159038, 1141818, 1093856, 1246210, 1632183, 1049514]
14619A049514L45531j35844J61265j2336k21536J9023K41727j6088Q2530k81969
14609A231817K28816j27702l4193J11234m4175P6241J11528j52321p091J00450
14599A494604j29450L95377k49187N1334K80820j88785j30201K5963k9138K12444
14589A733781m2139m3479K28065k93722J47651j44262R7097K64698N2216j62050
14579A837856J75265k46690L11927j08362Q8689j38552J90113l18735L72462l81269
14569A782704M42754j00549N91584l93640m4770J32625k02023K84023O223j11412
14559B387519M8636K85984J77533J92667l06804R88939k41431J91074Q44176J125078
14549E693371K664302M504855Q551359J6731680P93403A9029865H892145l858039
$$ y = [1049514, 1395045, 1259201, 1420466, 1408130, 1186594, 1205617, 1447344, 1431256, 1513786, 1231817, 1460633, 1332931, 1298738, 1409972, 1365797, 1442038, 1553566, 1401245, 1394154, 1494604, 1365154, 1760531, 1511344, 1562678, 1843498, 1654713, 1524512, 1550475, 1521337, 1733781, 1691642, 1648163, 1876228, 1582506, 1730157, 1585895, 1682992, 1947690, 1999906, 1837856, 2013121, 1766431, 2078358, 1969996, 2058685, 1920133, 2110246, 1791511, 2163973, 1782704, 2225458, 2124909, 2716493, 2322853, 2278083, 2410708, 2208685, 2492708, 2498931, 2387519, 2436155, 2722139, 2899672, 3092339, 2785535, 3774474, 3533043, 3724117, 4568293, 5693371, 8357673, 12862528, 21413887, 38145567, 38938970, 19029865, 8892145, 5034106]
14541E034106j483406o00609k84450m41061l12275J71258l47051K05425k43199
14532A698738M54303l35221K48308o4876m1196K48743j45816j13542K84559k35882
14522A998118K27121j51592L53175m25709N45704k24204M7559r1989O6883R6992
14512B442058M02519l83856J23584J62645k3055L0789n9072J21071N8825K18512
14502C094020l10415q0206K20089k7884K80361j9627J08350l20259q1597N6714
14492B919546M41951k03609L08303j27254o9452J63765k31847L79603m7519l9861
14482C493626j37862K82817o6601K5879K30336k76678K38385R6677j00240J66161
14472C952500k3513K31088l76163K70854j71145K98455N7191l1389Q1204L4629
$$ y = [5034106, 3550700, 2950091, 2665641, 2224580, 1912305, 2083563, 1736512, 1941937, 1698738, 2153041, 1817820, 2066128, 2001252, 1960056, 2208799, 2062983, 1949441, 2234000, 1998118, 2225239, 2073647, 2426822, 2001113, 2546817, 2322613, 2370172, 2278183, 2345066, 2442058, 2844577, 2460721, 2584305, 2746950, 2723895, 2754684, 2695612, 2816683, 2875508, 3094020, 2783605, 2703399, 2923488, 2895604, 3175965, 3156338, 3264688, 2944429, 2862832, 2919546, 3361497, 3157888, 3466191, 3338937, 3269485, 3433250, 3201403, 3581006, 3533487, 3493626, 3355764, 3638581, 3571980, 3597859, 3828195, 3551517, 3789902, 3886579, 3786339, 3952500, 3928987, 4160075, 3783912, 4054766, 3883621, 4182076, 4239267, 4207878, 4289082, 4323711]
14462D323711K18928j47410R3636L09776l14693L37351j23161j96150J43497L77216
14452E022701j86628J07788L28995n57550O31080M9089o813j3359K58699R6423
14442E730425j01740L6068J40970j39897r196L17798M59828l07030L50844J82000
14432F660070k37214P6583J92718j35914M29594N6608M074m3890N2535J705N01894
14421G558763J04076O8043k5527r1002O03946l80203K51344M81425j08565J13872
14411H576172L75176p29641P48476r5l4654L10967N45483k38575K82226o3955
14401I771580R8411K14225L29151j25318J37612M3677M79487L92561j30639K87600
14391A1498347J85453j59491M41239J81571N24951P2894L2660K13928N36198N0321
$$ y = [4323711, 4542639, 4395229, 4488865, 4798641, 4483948, 4821299, 4698138, 4501988, 4645485, 5022701, 4836073, 4943861, 5272856, 4715306, 5346386, 5395475, 5388662, 5375303, 5634002, 5730425, 5628685, 5664753, 5805723, 5665826, 5656630, 5974428, 6434256, 6127226, 6478070, 6660070, 6422856, 6499439, 6692157, 6556243, 6985837, 7042445, 7046519, 7002629, 7055164, 7056869, 7558763, 7662839, 7730882, 7705355, 7614353, 8218299, 7838096, 8089440, 8570865, 8462300, 8576172, 8951348, 8221707, 8970183, 8970088, 8935434, 9246401, 9791884, 9553309, 9835535, 9771580, 9869991, 10084216, 10413367, 10288049, 10425661, 10469338, 10948825, 11341386, 11210747, 11498347, 11683800, 11524309, 11965548, 12147119, 12672070, 12744964, 12777624, 12991552, 13527750, 13578071]
14381A3578071K87925M96010L04836L6980J84723L88239K05014M75116K76001
14372A6232915j02534N38615O44562J54780M43535L88405M81980N75699K83372
14363A9641329O96060O5106K15640O96960K98271N62369N04039P29287K80669
14354B3689730P70133P21660J89683P83932P21026R29795O40404O37858R33997
14345C0018218J85131J249804R78419Q43509O85342J032867R86734J190521J210322
14336C8380867Q26563J205609J176995J417859Q08516K034531J387723J428466
14328D8667129J507862J494544J724132K028827J558913K257165K080879K014640
14320F3334091K489841K386373K997721K214243K888001K920294L406637L215286
$$ y = [13578071, 13865996, 14362006, 14666842, 14703822, 14888545, 15276784, 15481798, 15956914, 16232915, 16130381, 16668996, 17313558, 17468338, 17911873, 18300278, 18782258, 19357957, 19641329, 20337389, 20402495, 20618135, 21315095, 21613366, 22175735, 22679774, 23409061, 23689730, 24459863, 25181523, 25371206, 26155138, 26876164, 27805959, 28446363, 29084221, 30018218, 30203349, 31453153, 32431572, 33275081, 33960423, 34993290, 35980024, 37170545, 38380867, 39207430, 40413039, 41590034, 43007893, 43816409, 45850940, 47238663, 48667129, 50174991, 51669535, 53393667, 55422494, 56981407, 59238572, 61319451, 63334091, 65823932, 68210305, 71208026, 73422269, 76310270, 79230564, 82637201, 85852487]
14312H5852487L380469L720608L918201M531119L870062M614029M925107N366591
14304A20178673N280654O022131O031826O246933P096383O993093P957218P979470
14296A73786381Q796908R189535R886371J0119616J0663374J1121967J2029694
14289B45593846J1850580J3258414J3234849J3750596J4109263J4663092J4738462
14282C41199102J4469007J4500170J4488563J3728246J3065604J1900075J0901900
14275D34252667Q740220N582475O55904j781648j518997j207567j110604o674523
14267D36937927o016391r188745j0074190j0293866j1859288j3288987j4356964
14260C61859496j4313737j4927912j5215520j5653584j4594481j3597714j4134744
$$ y = [85852487, 89232956, 92953564, 96871765, 101402884, 105272946, 109886975, 114812082, 120178673, 125459327, 131481458, 137513284, 143760217, 150856600, 157849693, 165806911, 173786381, 182583289, 191772824, 201659195, 211778811, 222442185, 233564152, 245593846, 257444426, 270702840, 283937689, 297688285, 311797548, 326460640, 341199102, 355668109, 370168279, 384656842, 398385088, 411450692, 423350767, 434252667, 442992887, 448575362, 449231266, 447449618, 445930621, 444723054, 443612450, 436937927, 430921536, 421732791, 411658601, 401364735, 389505447, 376216460, 361859496, 347545759, 332617847, 317402327, 301748743, 287154262, 273556548, 259421804]
14253B59421804j2661164j2720337j1651714j1147529j0485714j0073738r305162
14246A81376446r038260q078979p987124p150771p089016o111158o450117n793530
14238A23677491n316928n249933m645656m662062m657592l712780l589317l572645
14230H8270578l272622l690211l038156k989132k348605l217215k246279k485094
14222F4983264j892458k105484j871876k308895j632991j899570k041558j595247
14214D9635185j180527j197886j594996j533527r61994j623390q57498q91539
14206C9793828j389188j099391p04741j157219p46105j115467o55348q87866j077828
14197C0960675n37152q66254p05405n82494p63576p39414o51734l54188q12327
$$ y = [259421804, 246760640, 234040303, 222388589, 211241060, 200755346, 190681608, 181376446, 172338186, 164259207, 156272083, 149121312, 142032296, 135921138, 129471021, 123677491, 118360563, 113110630, 108464974, 103802912, 99145320, 95432540, 91843223, 88270578, 84997956, 81307745, 78269589, 75280457, 72931852, 69714637, 67468358, 64983264, 63090806, 60985322, 59113446, 56804551, 55171560, 53271990, 51230432, 49635185, 48454658, 47256772, 45661776, 44128249, 43166255, 41542865, 40685367, 39793828, 38404640, 37305249, 36600508, 35443289, 34697184, 33581717, 32926369, 32038503, 30960675, 30423523, 29557269, 28851864, 28269370, 27505794, 26766380, 26114646, 25760458, 24948131]
14188B4948131m99864m25852o51562l27778o98798m91867m28151n48129n26589
14179B0349541q4600n91846k57408n79566l43496m8182o67691l68384l64965l85457
14169A6657946k78622o8777j58629n48793l27768m53251l67960K80024m17027
14160A4317143l69120o02131J79720j56160m33908p435l93711k19666q1862Q5156
14150A2318026m72077l88882j75775k06100k42049o5977n5375M1865j73154r43205
14140I637297M03388l46995J61661L4785l34038l29906r157p0174k20068j50148
14130H776645K84070l38279o04146L59458j83029J69126m94956K61111l61064
14121G868936j82887L9337n13123K50617j76975k1104l73086j05615N00881m39224
$$ y = [24948131, 24448267, 24022415, 23370853, 23043075, 22344277, 21852410, 21424259, 20876130, 20349541, 20264941, 19673095, 19415687, 18836121, 18492625, 18444443, 17776752, 17408368, 17043403, 16657946, 16379324, 16310547, 16151918, 15603125, 15275357, 14822106, 14454146, 14734170, 14317143, 13948023, 13345892, 13525612, 13369452, 12935544, 12928109, 12534398, 12314732, 12232870, 12318026, 11845949, 11457067, 11281292, 11075192, 10833143, 10767166, 10711791, 10753656, 10580502, 9637297, 10040685, 9693690, 9855351, 9890136, 9556098, 9226192, 9217035, 9146861, 8926793, 8776645, 9060715, 8722436, 8118290, 8477748, 8294719, 8463845, 7968889, 8230000, 7868936, 7686049, 7725386, 7212263, 7462880, 7285905, 7264801, 6891715, 6786100, 7286981, 6847757]
14111F847757j02091m56260L6611K71846k52825j86165R8817M488J9264l33901
14101E947541O4157Q2450k31094k04934K00158k41002J83839l52376l9630N1785
14091E460894k55540J43278J18222r8802j55787J4334k48346J53419j17494j87463
14081D826715K64238l63116k61308M7203J46128m59431L60916o9087k5219J84767
14071D651806l76903j4465J10349J25751k5946R614l96912K645j12042j30053
14061C843844K9462r1668J72941K09691k52570K96801m57658p1574Q772l08701
14051C379340K99677k30603M033R7189k93203J11980P1486q2285n3401n6973j9777
14040C227463l86782J08042L07559j77070J93964j83239j25000L89992n26229
$$ y = [6847757, 6745666, 6289406, 6326017, 6597863, 6345038, 6158873, 6257690, 6262178, 6281442, 5947541, 6011698, 6094148, 5863054, 5658120, 5858278, 5617276, 5801115, 5448739, 5409109, 5460894, 5205354, 5348632, 5466854, 5368052, 5212265, 5226599, 4978253, 5131672, 5014178, 4826715, 5090953, 4727837, 4466529, 4513732, 4659860, 4200429, 4561345, 4492258, 4467039, 4651806, 4274903, 4260438, 4370787, 4496538, 4470592, 4480206, 4083294, 4085939, 3973897, 3843844, 3873306, 3781638, 3954579, 4164270, 3911700, 4208501, 3750843, 3679269, 3688041, 3379340, 3679017, 3448414, 3452447, 3549636, 3256433, 3368413, 3439899, 3357614, 3304213, 3247240, 3227463, 2840681, 2948723, 3256282, 3079212, 3273176, 3089937, 2964937, 3354929, 2828700]
14031B828700k785j2877O16537n47512j72132Q5656j4026q8275k36723N21553
14021B978116k80819j16551j31185L13757K09553l71074l43000K41849r5336J52563
14011B557873R9171l65724J55544j61490N2450L3005K89123k39191n60495K72289
14001B132555q5307K80097l5139l0937j47455J19376j6504m9214J53840k57419
13991B063893M20677K02068K123742K990528P027333J6356830Q559103j6067726
13983B3676448j0643308m408097j841462j912395o40848l50897k91136m36709
13975C151596m08294o6311k13158L532J80123o5211p3282j60967L04711j52328
13965B500411q7438j54117r6310l25583J77656K10290J67140l51027j27423L62656
$$ y = [2828700, 2825915, 2813038, 3429575, 2882063, 2709931, 2795587, 2781561, 2693286, 2456563, 2978116, 2697297, 2580746, 2449561, 2763318, 2972871, 2601797, 2258797, 2500646, 2405310, 2557873, 2657044, 2291320, 2446864, 2285374, 2337824, 2370829, 2659952, 2420761, 1860266, 2132555, 2047248, 2327345, 2292206, 2261269, 2113814, 2233190, 2216686, 2167472, 2321312, 2063893, 2484570, 2686638, 4810380, 7800908, 14828241, 31185071, 39744174, 23676448, 13033140, 8625043, 6783581, 4871186, 4230338, 3879441, 3588305, 3151596, 2743302, 2676991, 2463833, 2467365, 2647488, 2582277, 2508995, 2348028, 2652739, 2500411, 2412973, 2258856, 2162546, 1836963, 2014619, 2224909, 2392049, 2041022, 1913599, 2276255]
13955B276255n22442J13893J51404J4204k033p5766R9321j09756q3123M114M1658
13944A907729q0421m6061J29764n0911m894M556r2952r8640J30551j4795q0941
13933A702985Q4672j8003J6529j31734j59258K10101j24985o161l03530J60798
13923A431414R0439Q3764M4291j23964k19663J34886j9763J65550j76212n0416
13913A360326j1168M57655k78511Q4992R8952R601k87976p7814j78894J69286
13903A346449k5527J52645L1200j43791O9659k59790o5678L80255J61591k01433
13893A445580l12705Q2084p68j15090J13088j69758M66829j88070l0950J29754
13883A419994m31139J74759M4608j29498N5430Q4620J56882l24572K52338L9629
$$ y = [2276255, 1753813, 1867706, 2019110, 2033314, 2031281, 1955515, 2054836, 1945080, 1861957, 1866071, 1907729, 1827308, 1781247, 1911011, 1860100, 1855206, 1859762, 1766810, 1668170, 1798721, 1783926, 1702985, 1787657, 1769654, 1786183, 1654449, 1495191, 1705292, 1580307, 1574146, 1270616, 1431414, 1521853, 1605617, 1649908, 1525944, 1306281, 1441167, 1421404, 1586954, 1410742, 1360326, 1349158, 1806813, 1528302, 1613294, 1712246, 1721847, 1433871, 1356057, 1177163, 1346449, 1320922, 1473567, 1504767, 1360976, 1430635, 1170845, 1105167, 1485422, 1647013, 1445580, 1132875, 1214959, 1214191, 1099101, 1212189, 1042431, 1509260, 1321190, 1290240, 1419994, 988855, 1163614, 1208222, 1078724, 1134154, 1218774, 1375656, 1051084, 1303422, 1343051]
13873A343051j87249L53628n30616R1199J43250j52061Q6344O2281l9774j21841
13863A048212Q8464Q4053k00682M7503J70782L12631F96684q449N19279k80087
13853I27427J68843k0491j6484J26880k1507p399j64689L77345n07881O37926
13843A499970n26061N49383l92782j50486k29515L90527J0603L056k22224L8906
13833I71377J85461k56438K31015k590k11571R1098q1085n5512q9970M55589l77346
13822H60028k68894M21832r0314p5232J6859l54008L76620k61642L05554P0387
13812A001190N1701J24054j67391N7560j54628l21351K29419K0212j40265L0737
13802G31238K48342j88156L39587k20527K4555k01201K9842j2167L98340n43769
$$ y = [1343051, 1155802, 1509430, 978814, 1070013, 1213263, 1061202, 1147546, 1209827, 1170053, 1048212, 1136676, 1220729, 1020047, 1067550, 1238332, 1550963, 696684, 688235, 1207514, 927427, 1096270, 1075779, 1059295, 1186175, 1164668, 1157269, 992580, 1369925, 862044, 1499970, 973909, 1523292, 1130510, 980024, 750509, 1141036, 1151639, 1154695, 932471, 971377, 1156838, 900400, 1131415, 1128825, 917254, 1008352, 927267, 871755, 781785, 1237374, 860028, 591134, 1012966, 922652, 847420, 864279, 510271, 886891, 625249, 930803, 1001190, 1052891, 1176945, 1009554, 1067114, 912486, 591135, 820554, 840766, 700501, 731238, 979580, 791424, 1131011, 910484, 935039, 733838, 763680, 751513, 1149853, 606084]
13792F06084L2154m2186L86747l46891L11146j28221j95678L9884m1820J80547
13782H01766C42121P08388m79996M2387L01235l45176J08480J4703K06261l40010
13772E58393K33577p077k11821k60012L66917K16509J3564k54748J50104j20514
13762F84892k86539K38473j17757P9256o4725J61592k38019K55350J28802j87666
13752F53659k70498J00287K47951J18825J61186j14216D17855K11573K14534p6305
13742G67657k67895Q0551r5420K96531j16379l30545N46084C27825L76883k97487
13732D07221L48349B81320K11126J14781r1199j41953O8057M0905j78851L58216
13722F62402j66058q2728L41780k03141L98576k55761B82741N17150k68980k7609
$$ y = [606084, 638238, 596052, 982799, 635908, 947054, 818833, 623155, 663039, 621219, 801766, 342121, 1050509, 570513, 612900, 914135, 568959, 677439, 692142, 898403, 558393, 791970, 784893, 573072, 313060, 679977, 896486, 910050, 655302, 805406, 684892, 398353, 636826, 519069, 598325, 533600, 695192, 457173, 712523, 841325, 653659, 383161, 483448, 731399, 850224, 1011410, 897194, 417855, 629428, 843962, 767657, 499762, 580313, 484893, 781424, 665045, 334500, 880584, 327825, 704708, 407221, 755570, 281320, 492446, 607227, 516028, 374075, 442132, 483037, 304186, 662402, 496344, 413616, 755396, 552255, 950831, 695070, 282741, 799891, 530911, 503302]
13712E03302K8388L20186m8936l65660J40662l0270N3259k48353P6450O6449j58163
13701C37314L14108j21323N0702J60433C61027J81768p2932J57631m3904k42298
13691C41292J72991j2026o5173M50969l61038q7874M2856j8695M7890q7875Q863
13680D32180A89245O17503k52326k3631j82537L81175j90864j26501j2932P6577
13670D75709l3859N3216o2605J09383L25494k53154B67778M659J76431j5818Q0908
13659E13958j59841J08995k04258M8072m7167O7966A61974J73868P7091L8962
13649D51895Q2935j25372L26995j95760j8373J75268B53563J5843J70671M06521
13639H46598C58016m261L95278C31906J01619K91533C37045J60293B23243J14367
$$ y = [503302, 531690, 851876, 802940, 437280, 577942, 547672, 600931, 352578, 429028, 495477, 337314, 651422, 530099, 580801, 741234, 361027, 542795, 469863, 627494, 583590, 341292, 514283, 502257, 437084, 888053, 527015, 439141, 481997, 463302, 511192, 423317, 432180, 189245, 806748, 554422, 530791, 348254, 729429, 538565, 412064, 399132, 475709, 441850, 495066, 432461, 541844, 867338, 614184, 267778, 272437, 448868, 433050, 513958, 354117, 463112, 258854, 306926, 259759, 327725, 161974, 335842, 412933, 451895, 534830, 409458, 736453, 540693, 522320, 697588, 253563, 269406, 440077, 846598, 358016, 353755, 749033, 331906, 433525, 725058, 337045, 497338, 223243, 337610]
13629C37610K16740j80210O7793k03790K98400j59046M0252j15400J56219J20144
13619E78712j17020K42874j30995k29570O5868N3039E7726M42704j24778n2381
13609C23271M26112j65890j65876P8780o8111Q7394C3488O99460k31478N1331
13599E52801j29301j12919K93463n6613C2860L57290K31037k88563j14522L0735
13589B48837m6622K56105j64199J04528o8857A44650L36660J51298M9460B96337
13578A60389L84186B10204J99360m9016J03522A12698K00817r9027L1171K56941
13568E02600k01475J54285A67829M26397k26146m2607l8822a02676D99463Q3469
13558E82932B49141j6545P1965A00213O44656l67682M7043I9201N0768L20504
$$ y = [337610, 554350, 374140, 441933, 238143, 536543, 377497, 417749, 302349, 458568, 578712, 461692, 704566, 573571, 344001, 409869, 462908, 57726, 500430, 375652, 323271, 749383, 583493, 417617, 496397, 428286, 515680, 33488, 732948, 501470, 552801, 423500, 310581, 604044, 547431, 32860, 390150, 621187, 332624, 218102, 248837, 202215, 458320, 294121, 398649, 329792, 144650, 481310, 632608, 682068, 296337, 160389, 544575, 210204, 409564, 360548, 464070, 112698, 313515, 214488, 245659, 502600, 301125, 455410, 167829, 594226, 368080, 325473, 286651, -102676, 499463, 582932, 249141, 232596, 304561, 100213, 744869, 377187, 424230, 99201, 149969, 470473]
13548D70473D3878K70088A34515m7750K43021G6026K73854j05850Q6495K09607
13538E40132M7017A29252J50500D2324J08328K26723K04746A97850K7187o307
13528B18730M1297K09246j35987L6662f1192C51077K75864l01204B0359M62838
13518D83197B40852L2565k274A7959K37593m0217r481P0279O7681J9357N0194
13507D13365n2736K22655A40218O5662i3738A90185p878L03423q3080r6465l1550
13496B74635J99464A80549M886K1867J86714r7704C9873P8288a15434C73647J34997
13485E08644A45125N2659J66722J68967j45239A25219D8044K27990j25041K3714
13475A74707L17353k17092K08622j14784A66659p4480R6132J82348k4186A14694
$$ y = [470473, 43878, 313966, 134515, 86765, 329786, 76026, 349880, 244030, 330525, 540132, 587149, 129252, 279752, 42324, 150652, 377375, 582121, 197850, 225037, 218730, 260027, 469273, 333286, 369948, -61192, 351077, 626941, 325737, 20359, 483197, 240852, 273417, 271143, 17959, 255552, 215335, 205854, 276133, 343814, 363171, 413365, 360629, 583284, 140218, 205880, -93738, 190185, 182307, 485730, 402650, 306185, 274635, 474099, 180549, 185435, 207302, 394016, 296312, 39873, 118161, -115434, 373647, 508644, 145125, 197784, 364506, 533473, 388234, 125219, 48044, 276034, 150993, 174707, 492060, 274968, 483590, 368806, 166659, 92179, 188311, 370659, 346473, 114694]
13464C2769K00823N73J24647A13705M38870B01669K97320A80391K24839q9188
13454C16042j1580H8714J81400K7317j40537K59079G4574K94518E0640b1464A53389
13442A03843E0772D939M04838r5939A34447k9025J92726J25373G4435J22601c1820
13430d1940H4216c8088A34768M1554l0695K944L19058p2752H0159J01587L744
13419A85490J57463j62930m408J91406L48847B54401N0859E8712K35526A44509
13408B39297A13233N1787K72341j81885E5633a05911B65671A04451J82935K4078
13398C11464J22802g2425J7812I0429C7295K21394D0676K03838k7734A8262K70121
13387B88383J95824j94161q3903f6979B98626j21935K85539e749C15742I9101
$$ y = [32769, 233592, 234165, 358812, 113705, 552575, 201669, 498989, 180391, 405230, 316042, 304462, 88714, 270114, 297431, 156894, 415973, 74574, 369092, 50640, -21464, 153389, 103843, 50772, 4939, 409777, 313838, 134447, 105422, 298148, 423521, 74435, 197036, -31820, -41940, 84216, -38088, 134768, 176322, 145627, 148571, 467629, 394877, 80159, 181746, 185490, 342953, 180023, 175615, 367021, 715868, 254401, 305260, 58712, 294238, 144509, 239297, 113233, 165020, 437361, 255476, 55633, -105911, 265671, 104451, 287386, 311464, 434266, -72425, -54613, 90429, 37295, 258689, 40676, 244514, 216780, 18262, 288383, 484207, 290046, 206143, -66979, 298626, 176691, 462230, -5749, 315742, 99101]
13376B41551P1208B503L43205I9799J25412J18962j28816J25939D7597K79046
13366C26643p3355j11478n5825M0677J5388A3033J87631B7881M31397A3355M0762
13355E4117K52803k5623K05614M9788j30454C6764K32332p1590K3995J13100j16775
13344B17826M06661l11849R7259j4712l0681L71146A14390J11343J97790K82608
13334G06131j92857j97034D867M03323j29540A258J46141J57397M708j32873p7976
13323I8655L03672K2298l8785A87496o4729P5710R697m5136l5759J49752D5207
13311C56952n1064R4843A05406K73175A74202K81311j55040j0882F9513J06118
13301A75631C4790K18990H0321j0091L23338A14270J22341D4344d1176C41038
$$ y = [241551, 312759, 2503, 345708, 99799, 225211, 344173, 215357, 341296, 47597, 326643, 253288, 141810, 85985, 126662, 142050, 13033, 200664, 27881, 459278, 13355, 54117, 306920, 281297, 486911, 536699, 406245, 36764, 269096, 197506, 221501, 334601, 217826, 624487, 312638, 409897, 395185, 364504, 735650, 114390, 225733, 423523, 706131, 513274, 316240, 4867, 408190, 278650, 1258, 147399, 304796, 309504, 176631, 98655, 402327, 424625, 385840, 187496, 122767, 198477, 208174, 163038, 127279, 277031, 45207, 356952, 305888, 400731, 105406, 378581, 174202, 455513, 300473, 289591, 69513, 175631, 34790, 253780, 80321, 70230, 393568, 114270, 236611, 44344, -41176, 341038]
13290B18731J01788L88B0336J30637G2000L0338K14916C1944J58839p0895R7305
13279B17193R3943E0939J42699q3616L8700L05700j27074j58442D9057J82783
13269B31840Q3762D6935J42623E4602J49351d4793G9672d5995B39228H2092a60096
13257A78955a5423l9814H3211c3601A75028n0508J4375g072B16004O9132F8504
13245B07720C762P7396K77174j66923A9824K26397B7152J67084J65758j03741
13235B56253o8114l6849n5069M4877M9417J29458j16909c16412a22459D13060
13224B64015G3751K40651a0807j00535A97154D7154J11571J37294r711I7835J15208
13213B13043K9508g3524F508a87286B29532M1M2242E0298a0522C57269c9205A58676
$$ y = [218731, 320519, 320907, 20336, 150973, 72000, 102338, 317254, 31944, 190783, 119888, 217193, 311136, 50939, 193638, 110022, 148722, 454422, 327348, 168906, 49057, 231840, 315602, 46935, 189558, 54602, 203953, -44793, 79672, -45995, 239228, 82092, -160096, 178955, -15423, -55237, 83211, -33601, 175028, 124520, 138895, -7072, 216004, 285136, 68504, 207720, 3762, 81158, 358332, 191409, 19824, 246221, 27152, 194236, 359994, 256253, 188139, 151290, 96221, 141098, 190515, 319973, 203064, -316412, -122459, 413060, 264015, 73751, 314402, -10807, -111342, 197154, 47154, 158725, 296019, 286308, 97835, 213043, 242551, -73524, 6508, -187286, 229532, 229573, 271815, 50298, -10522, 357269, -39205, 158676]
13200B2234a78721d4960A39390A9838L72827a37804N849B70311r8696c6289C0299
13188a43597A5404J19503B0307b1096B54688a7094A71462J7641E75Q1017J65166
13177B46758a47523M1602A56997E2824J33435g8697E61020I4438K1008L6444b77145
13165B27341D6763a89275A15442J98580A0331e2355I6117K42886A03627C2396
13154B84874K02460f5663A99019b01220b8036j20133A40362K0477k6791b33697
13143a0701B14465m4942J71476j48139a12374j8407B40475c04997C91674n5812
13133C35862G2611J84193I0059M6999P2094a17486B37822M2485p6803G1461K34874
13122C06335p0793E2659J62308J2231j08722J518B268a08337M9394J599a1039
$$ y = [22234, -178721, -44960, 139390, 19838, 392665, -137804, -131955, 270311, 171615, -36289, 30299, -143597, 15404, 134907, 20307, -21096, 254688, -17094, 171462, 189103, 575, 81592, 246758, -147523, -105921, 156997, 52824, 186259, -78697, 561020, 94438, 115446, 151890, -277145, 227341, 46763, -189275, 115442, 314022, 10331, -52355, 96117, 339003, 103627, 32396, 284874, 487334, -65663, 199019, -201220, -28036, -148169, 140362, 160839, 134048, -233697, -10701, 214465, 169523, 340999, 192860, -112374, -130781, 240475, -304997, 391674, 335862, 72611, 256804, 90059, 137058, 209152, -117486, 237822, 280307, 203504, 71461, 306335, 235542, 52659, 214967, 227198, 118476, 119994, 2268, -108337, -58943, -57344, -11039]
13110C2434K79405G3067L08273G6896P4156n669E5982f4444A39826K45538A69836
13098b43989J14411E34113B54227n2678G356k765M3287K91305d426A6421O4980
13087H1401J7820J34330e5512I7266m1757a60242A39785K3776M0600J04178A41692
13075d8647A83070p0510A4105J37655b6898k8226A03999K0312O9626a87077A21608
13063A92479J84672A35984J3088m4330f8403E72569f3987A63308G4341g0488B34022
13051b2381j5824j80580D9013a6865B84875p6778a09941C38241m730a20205H0416
13039G9602N1429a85283C43679C6355M8926K06814A18841O7757G0931R6468K07354
13028C74753A78109p834C8765K22243p8530G0723J22754K97899A29295l7714C9684
$$ y = [32434, 311839, 73067, 381340, 76896, 151052, 145383, 55982, -64444, 139826, 385364, 169836, -243989, -129578, 534113, 254227, 201549, 7356, 4591, 47878, 339183, -4426, 16421, 81401, 99221, 233551, -55512, 97266, 55509, -160242, 139785, 163561, 204161, 308339, 141692, -48647, 183070, 112560, 14105, 151760, -26898, -55124, 103999, 124311, 193937, -187077, 121608, 192479, 377151, 135984, 149072, 104742, -68403, 572569, -63987, 163308, 74341, -70488, 234022, -22381, -38205, -218785, 49013, -16865, 284875, 208097, -109941, 338241, 333511, -120205, 80416, 79602, 131031, -185283, 343679, 36355, 85281, 292095, 118841, 186598, 70931, 167399, 374753, 178109, 170275, 38765, 261008, 182478, 70723, 193477, 491376, 129295, 91581, 39684]
13016D61615A20796K91781G7437c3011B43663A08738R9845J47399I6041R9506
13006A95547k8657m8294Q8126K33669j65510c4528A08337J79143j5963D1593h8077
12994a76428C2551R1550J96366G603a22255F9676b7532B80541a61457E3874Q1598
12983A35472g467j18675A11836f1695A39888m3317c21624c7073F1982d4359a4644
12971H8446J63734b71991F1893a832A24350j9509J42009O1823G1359M78816F9981
12959E2766M1418c3914j2812J073j1333J4189C5412a40544I5823A3002b10916
12947A58110R9686a21485a2579A32792l2351a94082A82317l9130b4668M612B20583
12935b91281A13441a8792j90834H566m219b17826D7612Q2879a83776b9791n0586
$$ y = [461615, 120796, 412577, 77437, -33011, 243663, 108738, 208583, 355982, 96041, 195547, 166890, 118596, 206722, 440391, 274881, -34528, 108337, 287480, 271517, 41593, -88077, -176428, 32551, 124101, 320467, 7603, -122255, 69676, -27532, 280541, -161457, 53874, 135472, -7467, -126142, 111836, -61695, 139888, 96571, -321624, -37073, 61982, -44359, -14644, 88446, 252180, -271991, 61893, -1832, 124350, 104841, 246850, 308673, 71359, 550175, 69981, 52766, 94184, -33914, -46726, -45653, -56986, -42797, 35412, -140544, 95823, 13002, -210916, 158110, 257796, -121485, -12579, 132792, 100441, -194082, 182317, 143187, -24668, -20056, 220583, -291281, 113441, -18792, -209626, 8566, 4347, -217826, 47612, 130491, -183776, -29791, -80377]
12924h0377k18364F7816J39304f2334q2484D8200b84425A58411p2230m1754a34808
12912A91887r2860g7029k0294c5571G0282d4451j64460j30114B01322J46987g6481
12900c6252B86779j35911C3679M6364R2020i8980b3422A03116a19190H6088g256
12888C95841F1486B9014J64776m3704B0426J52486b8822C60828j20769F1281d0704
12876C17470a33025A95152b40114G7676M7668d5440k04134b4439k8029K6009p1495
12865i7954a5214A3710O2425A1762K47213l9294N0377J60942A04856J4954K44570
12854C64380A13161A4624c96955E3396O3104p83J04603a90712N3613C8306O5278
12843A03584K8601Q3875a8112A57822i0580H444a32476K5316B0388O7113C5524
$$ y = [-80377, -298741, 67816, 207120, -62334, -144818, 48200, -284425, 158411, 86181, 44427, -134808, 191887, 99027, -77029, -97323, -35571, 70282, -44451, -208911, -339025, 201322, 348309, -76481, -36252, 286779, 150868, 33679, 80043, 172063, -98980, -23422, 103116, -119190, 86088, -7256, 395841, 61486, 29014, 193790, 150086, 20426, 172912, -28822, 360828, 240059, 61281, -40704, 317470, -133025, 195152, -240114, 77676, 125344, -45440, -249574, -24439, -52468, -26459, -97954, -15214, 13710, 76135, 11762, 258975, 219681, 270058, 431000, 104856, 119810, 364380, 113161, 14624, -396955, 53396, 116500, 115717, 220320, -190712, -137099, 38306, 103584, 132185, 216060, -18112, 157822, -90580, 8444, -132476, -107160, 20388, 87501, 35524]
12831A31042b33487B62935a00309C4695h7671A64187b6803B05680g3350D5749
12820A15308K39564B6274a63095N3460H8488i4207j1607B11461e6455B11173f0229
12808B09192G8600a66023C97348a5632l71705C12881F2566R9118a59163k31253
12798c90416c3735A61205k2017b2391j09723d8212l604I9674b6669H0383l7401
12787D2982d9627j0847H045K51152r6409h0779A58752c6034l1854o14C69566F616
12774c507p4978B86242a89867D4869L78321B9464a05128b2867A02180D4154c9884
12762B22325i3330A01604f0098A30341b12628I5189A7161b72756G1587a7530m3020
12751f0550j49324M3362d7391A23688i987A59126D5300J90885a11480j31401a1500
$$ y = [131042, -233487, 262935, -100309, 34695, -87671, 164187, -26803, 205680, -73350, 45749, 115308, 354872, 26274, -163095, -109635, 88488, -94207, -105814, 211461, -56455, 211173, -60229, 209192, 78600, -166023, 397348, -15632, -387337, 312881, 62566, 161684, -159163, -390416, -33735, 161205, 139188, -22391, -132114, -48212, -51816, 99674, -26669, 80383, 42982, -49627, -60474, 8045, 259197, 162788, -80779, 158752, -36034, -67888, -68502, 369566, 6616, -3507, -78485, 286242, -189867, 44869, 423190, 29464, -105128, -22867, 102180, 44154, -39884, 222325, -93330, 101604, -60098, 130341, -212628, 95189, 17161, -272756, 71587, -17530, -60550, -209874, -166512, -47391, 123688, -9987, 159126, 45300, 236185, -111480, -242881, -11500]
12739c55613h1067D85634A6852J00168P978O3870e5110A9694d8211B71857A06207
12727g1842J8703A44699a98192A77829J90303I0790b44235A87281c45508F536
12716A58689D88K475Q0844a27851A19147P8069B8840K92754j13518J77878A17389
12704C15409A38768K58216J7515k05670N4952D0904A9999J6344b0329E8989J24269
12693A83258B5894b33919F331J30335a76378A69766a3557q4213E567a54704j3282
12682a67986E8587L2943i0100G1358J49150N8905O585a89475A20752a2943A13837
12670C22486c42613F4027d9827E6681L641h0789H2775j9164K36856r536j33649
12659A57282N5299M3749A17136J62941H4346J62568A16762J51197j24858m8172
$$ y = [-355613, -81067, 485634, 16852, 117020, 124998, 188868, -55110, 19694, -48211, 271857, 106207, -71842, -53139, 144699, -198192, 177829, 368132, 90790, -244235, 187281, -345508, 6536, 158689, 488, 2963, 83807, -127851, 119147, 197216, 28840, 321594, 208076, 385954, 117389, 315409, 138768, 396984, 414499, 208829, 263781, 40904, 19999, 36343, -20329, 58989, 183258, 25894, -233919, 6331, 136666, -176378, 169766, -13557, -97770, 5567, -154704, -167986, 58587, 91530, -90100, 71358, 220508, 279413, 285998, -189475, 120752, -12943, 113837, 322486, -342613, 64027, -49827, 56681, 60322, -80789, 82775, 63611, 300467, 290931, 157282, 212581, 256330, 117136, 280077, 84346, 246914, 116762, 267959, 143101, 94929]
12649I4929L70799G8437B4593a73543R566d2813F4555B5243Q0788M2887a96964
12637A96203j8552l0535M1297N737p8421L57373B07588C1367b25058b6952k3832
12626e0784B16460o3851n9983a9118D01153a96115f5550A61958K56274A96947
12615h3424r0908A33021o3225L0443c51208G5525R573a90936P5298B70040k9596
12604B40444A0833K31773B93K9738a0110l8246j70880D5507b56141a7239A10884
12592B67500N2008F7403B8522a35351d7244E8462c7479B76546C6466M7258R4243
12581A77967a81694I8297K2243a9511B2222L6435J90916j04554b22735A38811
12570A36298P4075l9963P3391l8718b4811E6577a1630n9767A98422q8172b6510
$$ y = [94929, 465728, 78437, 24593, -173543, -163977, -42813, 64555, 25243, 106031, 148918, -196964, 196203, 177651, 147116, 188413, 194150, 115729, 473102, 207588, 31367, -225058, -26952, -50784, 216460, 152609, 92626, -19118, 401153, -196115, -65550, 161958, 418232, 196947, -83424, -174332, 133021, 69796, 100239, -351208, 75525, 85098, -190936, -115638, 270040, 240444, 10833, 242606, 293, 30031, -10110, -48356, -219236, 45507, -256141, -17239, 110884, 267500, 319508, 67403, 28522, -135351, -47244, 58462, -37479, 276546, 36466, 83724, 177967, -181694, 98297, 120540, -19511, 22222, 58657, 249573, 145019, -222735, 138811, 136298, 210373, 170410, 243801, 205083, -24811, 56577, -11630, -71397, 198422, 110250, -26510]
12558B16236o9613b34609a02550j35734j7037P5269C93896D2783J52424G6820
12547a5168C04075m879n5625f2444C9612b45002D3259K3897D734b09030k64d5685
12534f9888d278n764B52556C9956L07517D4787K13676l7357G4788j2911K37822
12523B99699C2651b5337B24174A1197K9215L49445o7907A51772a05274l19639
12513d24913a1789C5219K9919g1968j26180e8719F4740K13846A7393e442A3149
12501a30952b3573j37123c8359k74843K2355J174a01225A62064a8169r9028r763
12490a26960A94759j8287a48062b8476H5449l3628f6864B5798e4263I0770A5548
12478F9589L8741h1429C64163a48646A71878J9467G763a52235A52262c9901C5197
$$ y = [216236, 146623, -234609, -102550, -238284, -255321, -180052, 393896, 42783, 195207, 76820, -15168, 304075, 299196, 243571, -62444, 39612, -245002, 43259, 67156, 4734, -209030, -209294, -45685, -69888, -4278, -10042, 252556, 39956, 347473, 44787, 258463, 221106, 74788, 61877, 299699, 32651, -25337, 224174, 11197, 40412, 389857, 321950, 151772, -105274, -424913, -11789, 35219, 65138, -71968, -198148, -58719, 64740, 278586, 17393, -5442, 13149, -130952, -23573, -160696, -38359, -313202, -290847, -289673, -101225, 162064, -18169, -117197, -126960, 194759, 176472, -148062, -28476, 85449, 51821, -66864, 25798, -54263, 90770, 15548, 69589, 108330, -81429, 364163, -148646, 171878, 191345, 7763, -152235, 152262, -39901, 35197]
12466A26503b12503j2972g9982L0626k43255P8810A35232J79891B6291c04353
12455c8299D2323a03144B2939P5723A8923b43559q1274A29813m7531a19938M2825
12444g7113l8210G0721J46244a93992e308B54721a06515F707K00334a4925j01495
12433a16420M8387A14345c08269A35974L7670D0654Q9685K95168A95987b65866
12422C55492a66417c5776n8245A23721a40725K7343I0304a31560j31290C599c15712
12410h3417A63453J57169a24291B9130g6607C11973b2424k01322A8959b44516
12399B8922r330a74700D3857e8274G2352b42766D16745a29319E9119N1039i4482
12387c64615a65484G7781o873J91484K6080b05664A53578j6588j0550B0301J39657
$$ y = [126503, -212503, -225475, -79982, -49356, -292611, -213801, 135232, 315123, 26291, -304353, -38299, 42323, -103144, 22939, 98662, 18923, -243559, -324833, 129813, 82282, -119938, -77113, -115323, 70721, 216965, -193992, -5308, 254721, -106515, 6707, 207041, -14925, -116420, -68033, 114345, -308269, 135974, 173644, 40654, 130339, 425507, 195987, -265866, 355492, -166417, -35776, -94021, 123721, -140725, -113382, 90304, -131560, -262850, 3599, -315712, -83417, 163453, 320622, -124291, 29130, -76607, 311973, -22424, -223746, 18959, -244516, 28922, 19592, -174700, 43857, -58274, 72352, -242766, 416745, -129319, 59119, 110158, -94482, -364615, -165484, 77781, 70908, 262392, 288472, -205664, 153578, 136990, 126440, 20301, 159958]
12376A59958A6954K6824h496j61032G4385K5801d9874B10886C6653K19898A23063
12364D3724d8968A14138c03722a2860B26831i1130o2347A87016l2445F8513M6348
12353A14861l800i8841m239N1537j24840B9503f7196k39496B15808F9846Q0822
12342A50668A5581e567j12779E4561c1489P50A41935A7738O0975J50197b62027
12330F6924N6714l7308d5544k1094j7745C11967j13644O4080a63011L9063k07824
12319c31772D4351J29183J9041a64938F5114K80333h5524A2228K18378l9985r0577
12308A00044k8705a78722l7407F827M3252a18640d9848m0534j65378F6053K3506
12297H9559C0409J69113r4921R1075j7267E8819B2603a59299J816D79209b66544
$$ y = [159958, 16954, 43778, -8496, -169528, 74385, 100186, -49874, 210886, 36653, 256551, 123063, 43724, -48968, 114138, -303722, -12860, 226831, -91130, -153477, 187016, 154571, 68513, 114861, 111061, -98841, -103080, -51543, -176383, 29503, -67196, -306692, 215808, 69846, 150668, 15581, -5567, -118346, 54561, -31489, -30739, 141935, 17738, 78713, 228910, -262027, 66924, 123638, 86330, -45544, -66638, -84383, 311967, 198323, 262403, -163011, -123948, -331772, 44351, 173534, 192575, -164938, 65114, 345447, -85524, 12228, 230606, 190621, 100044, 71339, -178722, -216129, 6827, 50079, -118640, -49848, -90382, -255760, 66053, 89559, 30409, 199522, 104601, 195676, 178409, 58819, 22603, -159299, -157483, 479209, -266544]
12285A00699O3767J38445C5243b17401B962L01411b49069A05793a65428A02624
12274A28620K60406e3756B20223a8355F0391f8510C68040a43272D542b34191J01617
12263a32574B12996j1054h3022B37131e1615C5912J65103p9189J71218a87658
12252b0507C44356a57097B61489A23177f0438r8236A29999b1959j68134G2469
12241D168K77102A7203K84731R251a15379A60570b4697B13757B7385K69854A08950
12229A15775B3794J7553J78660k0133h568B46879p8817a2542p4141F9916K97166
12218C67082A41908E4953Q5522F0636L56718j54471j04060m9864M30641B05a82375
12206B25536K25848A25655J11516f4134F02562F0699K11295O2033a36419q3938
$$ y = [100699, 164466, 302911, 35243, -217401, 2962, 304373, -249069, 105793, -165428, 102624, 128620, 389026, -53756, 220223, -18355, 60391, -68510, 368040, -143272, 4542, -234191, -132574, 212996, 201942, -83022, 237131, -51615, 35912, 201015, 121826, 293044, -187658, -20507, 344356, -157097, 261489, 123177, -60438, -158674, 129999, -21959, -190093, 72469, 4168, 281270, 17203, 301934, 311185, -115379, 160570, -24697, 213757, 27385, 297239, 108950, 115775, 23794, 41347, 220007, 199874, -8568, 246879, 168062, -12542, -86683, 69916, 367082, 141908, 54953, 140475, 60636, 417354, 262883, 158823, 108959, 539600, 205, -182375, 225536, 451384, 125655, 237171, -64134, 602562, 60699, 271994, 334027, -136419, -220357]
12196b20357A23284n3535J61187A1867J44859J77593A30290K30948A77003b29789
12185A33122l925a66245F4099J33823a30252P863A08442K9922K58004j12741f1228
12173a82179C07386j17329M2604A7902a78383H5925K21104M539i0570E0172j0914
12162C9258d19152a9749B05925A1663Q357O6894k4379J03607J3186m7580l440
12151A28308Q255P2988D0640J42739J97679A33087J09947a17220B24849f8374
12140B52975i0251A0960a22827B35129L85394b32942A17893G403J96372F1111
12129a72585p4350e3667G5113P1327a80342M0255C79077A70499a8787A15864a81276
12117d4747k80259k8603A99032j8642c40222A45331e6626C4466J48458l0897D9252
$$ y = [-220357, 123284, 69749, 230936, 11867, 156726, 334319, 130290, 361238, 177003, -229789, 133122, 129197, -166245, 64099, 197922, -130252, -122389, 108442, 138364, 396368, 283627, -61228, -182179, 307386, 190057, 232661, 17902, -178383, 85925, 307029, 311568, -90570, 50172, 39258, -419152, -19749, 205925, 11663, 20020, 86914, 62535, 166142, 179328, 131748, 128308, 136563, 209551, 40640, 183379, 381058, 133087, 243034, -117220, 224849, -68374, 252975, -90251, 10960, -122827, 235129, 620523, -232942, 117893, 7403, 203775, 61111, -172585, -246935, -53667, 75113, 146440, -180342, -140087, 379077, 170499, -18787, 115864, -181276, -44747, -325006, -353609, 199032, 180390, -340222, 145331, -56626, 34466, 182924, 152027, 49252]
12105A47379B1715r18J07410e9072A43800L61784H2287J42297b62242Q7938E3843
12093a11075F6981M0522R8052A4153a67271I9407a80289N9729g060q1699C7680
12081A24664c59714I9472J2773j2910a20511A82132a05842A44228p0856J21106
12071A94478O3494P91751O69503E07458b2698H6949b54862d9853A89736q7132
12061A02604b50524J8445A64068k4271N9237f3174A67157M0974p0894D7135a49403
12049b71447B14153d4138l06545e6735B530J82778b9314A99668O3301b76592j57440
12038d34032A96275a98092C870K12795n9145A9914a16620k1305f3697i892E9790
12026e4006j14944B28933D0798a09741C21118a20489I847P0818i2793C55660A35570
$$ y = [147379, 21715, 20797, 128207, -59072, 143800, 505584, 82287, 224584, -262242, -174304, 53843, -111075, 66981, 107503, 205555, 14153, -167271, 99407, -180289, -120560, -7060, -88759, 37680, 124664, -359714, 99472, 112245, 99335, -120511, 182132, -105842, 144228, 73372, 194478, 257972, 1049723, 1719226, 507458, -22698, 86949, -254862, -49853, 189736, 102604, -250524, -232079, 164068, 139797, 199034, -63174, 167157, 208131, 137237, 47135, -149403, -271447, 214153, -44138, -350683, -56735, 2530, 185308, -29314, 199668, 262969, -276592, -434032, 196275, -198092, 3870, 216665, 157520, 19914, -116620, -137925, -63697, -9892, 59790, -54006, -168950, 228933, 40798, -109741, 321118, -120489, 9847, 80665, -92793, 355660, 135570]
12014a60466H9919l9413O4366J52403G4270c09932D5513N695g5638A51835b49964
12002a57974M4366A90910I3759a33317A93671C1389Q3259a82963C6820J64407
11992B01227m5443a30536j41085N8710B10461i5544j20677C48219c63678f6263
11981h4896p4385B35410a60855I1241J24549a42878g1066k2569C9328a84557F0511
11969A625b49232a02372B13640m2986b65736D0758g4440k09128i0181O979A94575
11957b45147A15165J56112e4885B4472J07659N0354L3908K622a11529B19658A4040
11945i427A68285h8314M2962j99120A36769E5124j8163J69018J85863b30029A73086
11933a12732A51135g8523A27313a6714j18168m2238B31322k8137H7418M0729L2913
$$ y = [-160466, 89919, 50506, 114872, 267275, 74270, -309932, 45513, 51208, -75638, 151835, -249964, -157974, -113608, 190910, 93759, -133317, 193671, 31389, 114648, -182963, 36820, 201227, 155784, -130536, -271621, -212911, 210461, -95544, -216221, 348219, -363678, -66263, -84896, -159281, 235410, -160855, 91241, 215790, -142878, -71066, -93635, 39328, -184557, 60511, 1625, -249232, -102372, 213640, 170654, -265736, 40758, -74440, -283568, -90181, -83202, 194575, -245147, 115165, 271277, -54885, 24472, 132131, 182485, 216393, 219015, -111529, 219658, 14040, -9427, 168285, -88314, -45352, -244472, 136769, 55124, 36961, 205979, 391842, -230029, 173086, -112732, 151135, -78523, 127313, -16714, -134882, -177120, 231322, 203185, 87418, 128147, 161060]
11922A61060p1749k2899c4732j7734K3714k36656a16340B18897p5973n8079J2725
11911I7570b17137j10545A19984J909b57479p3321A70579F4220g6023A19058h1619
11899A23290J00411b78890f0655A80159E6436b12269A81502b59356H490h5483
11888f8913j82310H5725Q4596k98D6995a64670j9019g5243c6145A79867M5754
11877B25621a35924f0338D48226d8088j6295j28363B53579a95094B60163H4132
11866H2509j0401K6706K5605O8045D3804K0422e779r0389j78932K8977D7657f0514
11853E9896b34787a14930M8837j49653B25762A12804b00148f929A07524M3143
11843A50667h7605c1322j0181b468j01840l83832J99344e9093j24235A42083o1896
$$ y = [161060, 89311, 66412, -34732, -52466, -28752, -265408, -116340, 218897, 142924, 84845, 97570, -217137, -327682, 119984, 121893, -257479, -330800, 170579, 64220, -76023, 119058, -81619, 123290, 223701, -278890, -60655, 180159, 56436, -212269, 181502, -259356, 8490, -85483, -68913, -251223, 85725, 170321, 170023, 46995, -164670, -183689, -75243, -36145, 179867, 225621, -135924, -60338, 448226, -48088, -64383, -192746, 253579, -195094, 260163, 84132, 82509, 72108, 98814, 124419, 192464, 43804, 64226, -5779, -96168, -275100, -246123, 47657, -60514, 59896, -234787, -114930, -66093, -215746, 225762, 112804, -200148, -6929, 107524, 150667, -87605, -31322, -41503, -2468, -104308, -488140, -288796, -59093, -183328, 142083, 80187]
11832H0187g5250L102k11983h5402a5086G271c84129A5004c5090j40973C4955
11820A71602b44574J20176j00125h7618e653j00744a297j47669M6674k83479a87284
11808b5185C08702i4496j2157A01932i3586G0966i5097B95256A10982A4489h2600
11796d669p0073J6189j59333i2399k26042J25270I6717a79916J5073O9586q5288
11785a80545A79123c1610A43052i5583c5088B4586b4073p7832B0998Q0759b72452
11773e7159F5698d3466h57D62710A8406J7670b20370B99931A5961K90790b89255
11761a25908b4988N757q7492B69025d4270B76d8882B73692a3634j59077n7039
11750b29750B97293i8139A00843c85033h7495C9119g0573B60825Q6669I9523h4284
$$ y = [80187, -75250, -72148, -284131, -85402, -15086, 7271, -384129, 15004, -35090, -176063, 34955, 171602, -244574, -124398, -224523, -87618, -5653, -106397, -1297, -148966, -102292, -385771, -187284, -25185, 308702, -94496, -106653, 101932, -93586, 70966, -95097, 295256, 110982, 14489, -82600, -4669, -74742, -58553, -217886, -92399, -318441, -193171, 96717, -179916, -164843, -95257, -180545, 179123, -31610, 143052, -95583, -35088, 24586, -24073, -101905, 20998, 101757, -272452, -57159, 65698, -43466, -857, 462710, 18406, 36076, -220370, 299931, 15961, 306751, -289255, -125908, -24988, -19231, -106723, 269025, -44270, 276, -48882, 273692, -13634, -172711, -229750, 297293, -98139, 100843, -385033, -87495, 39119, -70573, 260825, 347494, 99523, -84284]
11738B20047a0319B26041j5537B6168k126K53566c6696j34341c4254l2294A67958
11726A5748K22232k7889O6126I6980h3541A42386o1432h9286k41272f4977l9682
11715a04659p8270P2114D3560a09880B48622P7787A822J59051E8994J70699r5362
11704A34331a51793E8548J89978C0199O4422c34622k0756B01433n5405h3350k25503
11693c08853A54157e8010I0247J47316P1894I610P7465H306J00467c3576P269
11682b6307B05305j4772d7291l15093H9727c7465p7144n972A939b4900q9311G5498
11669a81026A51833a74687A84356b58091C2463a88260A72997p2909J53437a87904
11658a91713B48905H8878J97213F83K63112B0992M3280L3290a14641C05228a03358
$$ y = [220047, -10319, 226041, 210504, 26168, 24042, 277608, -36696, -171037, -34254, -66548, 167958, 15748, 237980, 210091, 276217, 96980, -83541, 142386, 80954, -89286, -330558, -64977, -104659, -182929, -110815, 43560, -109880, 248622, 326409, 1822, 160873, 58994, 229693, 134331, -151793, 58548, 248526, 30199, 94621, -334622, -355378, 201433, 146028, -83350, -308853, 154157, -58010, 90247, 237563, 309457, 9610, 87075, 8306, 108773, -33576, -26307, 205305, 190533, -47291, -362384, 89727, -37465, -114609, -120581, 1939, -24900, -114211, 75498, -181026, 151833, -174687, 184356, -258091, 32463, -188260, 172997, 100088, 253525, -187904, -191713, 248905, 88878, 286091, 683, 263795, 20992, 64272, 97562, -114641, 305228, -103358]
11646a46138A43927a70895G4529L4472a20777n6055R919C25675A9697L94708B2390
11634c4956a633j36583A47024A3384e840A37553L1749C2249a47288B01179G6583
11622C1712J07617N6698B6836h7824c1648A18840k0347M866B1656b17181J00730
11611a16451b497A40104a7668p8866l5530f3980A55246o9734O6545g1048A09741
11599A89104J08424q7823H0474L01580j62270F3597J5942n692K76818m9776E561
11587G6274J05560q6551a07443I2175P3625m7800F814L38571q9618C8872L2337
11576G1209f3588B1087A818K36832D1106J54912a05047B79657F993J7892J11529
11565A36414a57101A6137G963J77930a5659B06658J16142o5113f1731B4255a58689
$$ y = [-146138, 143927, -170895, 74529, 109001, -120777, -176832, -166913, 325675, 19697, 414405, 22390, -34956, -1633, -138216, 147024, 13384, -5840, 137553, 169302, 32249, -147288, 201179, 76583, 31712, 139329, 196027, 26836, -87824, -31648, 118840, 98493, 103359, 21656, -217181, -116451, -2497, 140104, -17668, -96534, -132064, -63980, 155246, 85512, 152057, -71048, 109741, 189104, 297528, 209705, 80474, 382054, 219784, 63597, 79539, 73847, 350665, 300889, 5561, 76274, 181834, 95283, -107443, 92175, 165800, 118000, 6814, 345385, 255767, 38872, 71209, -63588, 21087, 1818, 238650, 41106, 196018, -105047, 279657, 6993, 24885, 136414, -157101, 16137, 7963, 185893, -15659, 206658, 322800, 257687, -61731, 24255, -158689]
11553H3281A1845c5756k44302A69163L7987a47522E2393a2074B21159a21734A72331
11541F31863F0889a3666G2259l1001L25784J16377E1250K24066a27192j37947
11531b65139C77489j30700o7979p5528c7436D91761A77543a69834A92773D315
11520i4859o0862o2649B09984B6342M41150k05722a06492H7513I364c6211o541
11509d2752C45056j06149a79091C57828a04359N589c0813A77250J1813J3942K27534
11498D30539h6556C06333i5923d2507j56060H0472K23087G5793K18897A26879
11487A35190J18824a06801A2190J36760R9292h813C13210p0370K4640a27629C04240
11475a0775A64492L0857K21608j94931K0289f2330F5620K57168h602A78211J5842
$$ y = [83281, 11845, -35756, -280058, 169163, 207150, -147522, 52393, -12074, 221159, -121734, 172331, 631863, 60889, -13666, 72259, 41258, 367042, 483419, 51250, 275316, -127192, -265139, 377489, 246789, 178810, 103282, -37436, 491761, 177543, -169834, 192773, 4315, -94859, -155721, -218370, 209984, 26342, 467492, 261770, -106492, 87513, 9364, -36211, -42752, 345056, 238907, -179091, 357828, -104359, -98770, -30813, 177250, 189063, 203005, 430539, -86556, 306333, -95923, -42507, -198567, 80472, 303559, 75793, 294690, 126879, 135190, 254014, -106801, 12190, 148950, 248242, -8813, 313210, 242840, 267480, -127629, 304240, -10775, 164492, 195349, 416957, 222026, 242315, -62330, 65620, 322788, -8602, 178211, 194053]
11464A94053E7828g6316A48767N2827Q1981k4979b8180G4182L5025L4405J24461
11453B68073m2906P800j01706e508q5183E22723B10724l2480a11799B2604f2335
11441a24404k3285b2851A28693a8233r9621A45692b27495n9748A20077P2215Q8872
11430B81164E7537e0342a3135m9790k43994A04295J36723a54143D2233N3968b74289
11418c03352A13803L08114D1335h0670l7055J6969H6097a56773B71807a22949
11407H4986A2215P2567K5540a55005B01700r7357e5194A89662J90284G5325h8578
11395a736o4835p1541e617l06497K1198b2626H9179b12047j44491F2506R1215
11384A53721a58325F0657M8991K52425h6010C2200b61779P8570P4823l9539A76479
$$ y = [194053, 57828, -76316, 148767, 201594, 283575, 258596, -28180, 74182, 109207, 143612, 268073, 225167, 232967, 131261, -5508, -90691, 522723, 210724, 178244, -111799, 22604, -62335, -124404, -147689, -22851, 128693, -18233, -117854, 145692, -227495, -287243, 120077, 192292, 281164, 57537, -50342, -13135, -62925, -306919, 104295, 241018, -154143, 42233, 96201, -274289, -303352, 113803, 421917, 41335, -80670, -117725, -100756, 86097, -156773, 271807, -122949, 84986, 12215, 84782, 110322, -155005, 201700, 104343, -55194, 189662, 379946, 75325, -88578, -1736, -66571, -138112, -5617, -312114, -290916, -22626, 89179, -212047, -356538, 62506, 153721, -158325, 60657, 109648, 362073, -86010, 32200, -261779, -183209, -108386, -147925, 176479]
11372c05352E2483J23245A9911L4110d32009a20855k84308a32825l1363a0408
11361a23843l80628A12049b6640A52060B3520J954j0699g8632d082j00154E1420
11349b36922A68713L50119H8106H967a88092e4037A33702a84802b064l01719K9910
11338b73873I9338h6061b5979D0989f1574n7248N4743k28846b453m9495a4448
11326B77211A24087e9469o9460k20187a09399B5142g9872q3651D5557N4224J5126
11315A14907A1131c0274A4120P690J37758b29837h2758c8301B01760D7756a65054
11303a83973n8253a9848A5040i685A804c4272A1235a92408A12605j2165b7775
11291B46587a25364j7535J8791j34600f7170q5449H177b76426H2282a89633E0567
$$ y = [-305352, 52483, 175728, 19911, 54021, -432009, -120855, -405163, -132825, -164188, -10408, -123843, -504471, 112049, -26640, 152060, 23520, 25474, 14775, -78632, -4082, -104236, 51420, -236922, 168713, 518832, 88106, 8967, -188092, -54037, 133702, -184802, -2064, -303783, -273873, 99338, -86061, -25979, 40989, -61574, -118822, -64079, -292925, -2453, -51948, -14448, 277211, 124087, -59469, -128929, -349116, -109399, 25142, -79872, -163523, 45557, 99781, 114907, 11131, -30274, 14120, 21810, 159568, -229837, -82758, -38301, 201760, 47756, -165054, -183973, -242226, -19848, 15040, -9685, 1804, -34272, 11235, -192408, 112605, 100440, -27775, 246587, -125364, -142899, -124108, -258708, -67170, -152619, 8177, -276426, 82282, -189633, 50567]
11279A54381a25325H8793b2034j91073A0673J19458q658n0422a40479N8686b0466
11267c34683g1204B46376a78664G648R2949b3489k9646A13914i840m1064l189
11256e4093l4081k04184C72306b80262A092a16083B8630a713j02612A35706b77984
11244a59204C19357a32390l2217O90D7398L1490B8624J21063j0084a749l57319
11233c59068a09244B35094E5363P1444m211h7099a3660j83636f5498k68480H4224
11221a8661q3529B10678J31830B8895J6277O8456B2861d3401J5058n1998H1204
11209A60154L8033c03027a17247A89409o8560a59743d8632o9969e4385k0538j80453
11198b55376J04474c0174j4496B66444r5200a19357j47643a10722o4623B4757
$$ y = [154381, -125325, 88793, -22034, -213107, 10673, 130131, 121473, 71051, -140479, -81793, -20466, -334683, -71204, 246376, -178664, 7648, 100597, -23489, -53135, 113914, -9840, -50904, -54093, -88174, -292358, 372306, -280262, 1092, -116083, 28630, -1713, -104325, 135706, -277984, -159204, 319357, -132390, -164607, -163917, 47398, 78888, 28624, 149687, 139603, -1749, -359068, -109244, 235094, 55363, 126807, 122596, -87099, -13660, -197296, -65498, -333978, 84224, -18661, -102190, 210678, 342508, 28895, 45172, 113628, 22861, -43401, -28343, -80341, 81204, 160154, 198187, -303027, -117247, 189409, 120849, -159743, -48632, -118601, -54385, -74923, -255376, -150902, -30174, -44670, 266444, 171244, -119357, -267000, -110722, -175345, 24757]
11187F5526K0576a94555d4649B06127a11647j27356F4206a04592O261o3481O9244
11176i2568q5747B09672h6364q3419B21031a39504A12660J08515D8748P6939c64004
11164d2621A87631h8431A16171g3849A48898d49091a3127j7180q9650B40450c28038
11152B40955c07037e5026A41601n8023J14156C3871J6019a10230L1130F8625B3615
11140B42240f3251J6147C3527g9784g550A8488O2325J68226d8005B29589a27747
11128A83821p1275D6849A646J13981M3567a40835M9838B38292g8860D88882E3061
11116a49964a3115D6645b45527I9419h9310D26178j62275B3688K148J59543p0173
11105A15206f6222C3133a50675a2722C9764L45761j74498C7576K29166J0911f4688
$$ y = [65526, 86102, -194555, -44649, 206127, -111647, -239003, 64206, -104592, -98331, -161812, -92568, -178315, 209672, -86364, -169783, 221031, -139504, 112660, 221175, 48748, 125687, -364004, -42621, 187631, -88431, 116171, -73849, 148898, -449091, -13127, -30307, -119957, 240450, -328038, 240955, -307037, -55026, 141601, 83578, 197734, 33871, 49890, -110230, -79100, 68625, 23615, 242240, -63251, -47104, 33527, -79784, -7550, 18488, 80813, 249039, -48005, 229589, -127747, 183821, 112546, 46849, 1646, 115627, 159194, -140835, -90997, 238292, -78860, 488882, 53061, -149964, -13115, 46645, -245527, 99419, -89310, 426178, 263903, 23688, 25836, 185379, 115206, -66222, 33133, -150675, -12722, 39764, 385525, 211027, 37576, 266742, 277653, -64688]
11093E63813B43303K24246H8265K84961j32718j9923a2872D52210p8200j01149
11083B72861i008j3756A49504n7367C2726J57246Q7335r9342k3199D4907L91205
11072D36112j86167J01663J4009P7540j48307K77360Q957A54631K59281q8740
11062C25172N8467j68270N22114C20736J1496J47007R4417J56718K8420k8336
11052G30458C16268K84529J21430J17468k05073j100p4297o5906K92543j73364
11042F12498p7742J01232L43762j81082k06802q8989J15001p0194L1109J04463
11032F83256k54395J47992J12837j56118P0006N1038k51636L27398J21991j90035
11022F62334j87655R8299j40922J46394m4166p9665P9424L27047n3143m3657k89110
$$ y = [563813, 243303, 467549, 88265, 373226, 240508, 220585, -12872, 452210, 374010, 272861, -9008, -22764, 149504, 92137, 32726, 189972, 277307, 177965, 154766, 44907, 436112, 249945, 351608, 365617, 443157, 294850, 572210, 581167, 154631, 413912, 325172, 383639, 215369, 737483, 320736, 332232, 479239, 573656, 730374, 758794, 730458, 316268, 600797, 722227, 839695, 634622, 633522, 559225, 493319, 785862, 612498, 534756, 635988, 979750, 798668, 591866, 502877, 617878, 547684, 578793, 683256, 428861, 576853, 689690, 533572, 603578, 654616, 402980, 730378, 852369, 662334, 474679, 572978, 432056, 578450, 534284, 454619, 534043, 861090, 807947, 764290, 475180]
11011D75180r4358M71209j00135j94569m6848j1837q0261P1483J5911K10175j43593
11000E72357B23466K30929m0408J30617M14906D05753K61549k38846J72604J67878
10990G68938k48544L04380o0964J61825M1300j72466L70269k02574J19046k09692
10980H71518L53319j89520K51990O6210L41447J71251L9273K16701L72745R2744
10970B587678j34057q9126j07626J09735k34467k51246j97035r8248M2665k31466
10960A396807q244L74148M4488k60599K27862k8903k84999Q1781l11614R1080
10950A321807k81408j52160J37783l82506k3910l5927B40779R0314J79607A41342
10939A16167e7974A17206K4878a01977B50908K01366A24455J00357m5758k9812
$$ y = [475180, 380822, 852031, 751896, 557327, 510479, 498642, 418381, 489864, 505775, 715950, 572357, 223466, 454395, 413987, 544604, 959510, 405753, 667302, 428456, 601060, 768938, 520394, 824774, 763810, 925635, 966935, 794469, 1164738, 962164, 1081210, 871518, 1224837, 1035317, 1287307, 1353517, 1694964, 1866215, 1905488, 2122189, 2494934, 2587678, 2453621, 2364495, 2256869, 2366604, 2132137, 1880891, 1683856, 1585608, 1628273, 1396807, 1388563, 1762711, 1807199, 1546600, 1774462, 1745559, 1460560, 1542341, 1230727, 1321807, 1040399, 888239, 1026022, 643516, 619606, 583679, 240779, 331093, 510700, 141342, 116167, -57974, 117206, 142084, -101977, 250908, 452274, 124455, 224812, 179054, 149242]
10929A49242J11102j18117K3736A4246K6639b17982d5162A28914J61233p1472
10919B18675F5988a49840e5541B9424g7200E209d6457H5910l1612b09168C40365
10907B36546j0982k0301H5039K02549h6933I06b35484g5361G8422Q0773c60507
10895A30450e0325F183L00714c00248b7562I7429a07677j76728e6493l5414C7941
10883b39080b7403k49656B34364k3124b6905B7282b5265k63222D8946a3172p0033
10872h3205o2257f2539D4126a00498A06535a02942d1407C44284a36333k00275
10862c36608A46654a95310m3013O4829A48394a03181j84141C7368J52860M4560
10852B34788a15751L1641A9048J35290C5842b39641C06447a61321l8578b2042
$$ y = [149242, 260344, 142227, 165963, 14246, 40885, -217982, -45162, 128914, 290147, 218675, 65988, -149840, -55541, 29424, -77200, 5209, -46457, 85910, 54298, -209168, 340365, 236546, 225564, 205263, 85039, 287588, -86933, 906, -235484, -75361, 78422, 159195, -360507, 130450, -50325, 6183, 306897, -300248, -27562, 97429, -107677, -284405, -56493, -91907, 37941, -239080, -27403, -277059, 234364, 211240, -26905, 27282, -25265, -288487, 48946, -13172, -83205, -145462, -62539, 44126, -100498, 106535, -102942, -41407, 344284, -136333, -336608, 146654, -195310, -238323, -173494, 148394, -103181, -287322, 37368, 190228, 234788, -115751, -84110, 19048, 154338, 35842, -239641, 306447, -161321, -199899, -22042]
10841e8101L24k217A96144a85941r9368E7904A4657h9285c1439j47908Q2331A0854
10828F9441f449C7386g4907D3799a78504b4472j18054b1776B59645m2605c94j43275
10816a43669j28482B09593p9140J04032a3182A45131b45389Q7982A13697a90540
10805i3657A78190C4941a43167C4667J20076m1375k8114e9915A43777a13627B3797
10793c35421j60933d2495m0590k9489l466m0856C6790h1q4752C12g8275H2078
10780E3831b75149a28759c1652B82821A5700d4758B21597H0391B9111P4084a27022
10768F565R6534a06756M0992A5821J40488E5641M5773a92482B14419H6656j5947
10757G0709b60945A99228a86353r0094P6506P1980j02467R5890k57204B18416
$$ y = [-58101, -57777, -59994, 196144, -185941, -285309, 57904, 14657, -89285, -31439, -179347, -97016, 10854, 69441, -6449, 37386, -74907, 43799, -178504, -24472, -142526, -21776, 259645, 217040, -394, -143669, -272151, 209593, 130453, 234485, -13182, 145131, -245389, -157407, 113697, -190540, -93657, 178190, 34941, -143167, 34667, 154743, 113368, 85254, -59915, 143777, -113627, 23797, -335421, -496354, -42495, -83085, -112574, -116040, -156896, 36790, -81, -84833, 312, -78275, 82078, 53831, -275149, -128759, -31652, 282821, 15700, -44758, 221597, 80391, 29111, 103195, -127022, 6565, 103099, -106756, -65764, 15821, 156309, 55641, 101414, -192482, 214419, 86656, 70709, -260945, 199228, -186353, -276447, -199941, -127961, -230428, -134538, -391742, 218416]
10746a43649K0988k8759j37352p1047D1553j2908c8501E3750K37025b77438k5426
10735c02864J42673h548k30550c1016m7208q4765g3304j09328A32630g1435A9246
10723a04371C09716b12125B3626K41585G8534c19999d468F3058K94289b3081j07096
10712a30177j18219g404I9059g5515E2228B0318a23976j7890L7919B35652o1992
10701A73660a77460k0639b2366G7400J33310a60953j73637A56667a59270A78470
10690a17590c5218G2504P1442a20293k6749F9721B5454c7734o4790H1144R8483
10679A79627e8440a5963G6021J92010F8474j9918b63588k4487a3763B98414B1946
10667I9557B4263a45650k41080J14012j53217i5219j6639k91974a51671F2043
$$ y = [-143649, -122661, -151420, -288772, -359819, 41553, 28645, -38501, 53750, 290775, -277438, -302864, -160191, -8548, -239098, -31016, -78224, -162989, -73304, -182632, 132630, -71435, 19246, -104371, 309716, -212125, 23626, 265211, 78534, -319999, -4468, 63058, 357347, -23081, -130177, -248396, -7404, 99059, -75515, 52228, 20318, -123976, -141866, -103947, 235652, 173660, -177460, -198099, -22366, 77400, 210710, -160953, -334590, 156667, -159270, 178470, -117590, -35218, 72504, 143946, -120293, -147042, 69721, 25454, -37734, -102524, 81144, 179627, -58440, -15963, 76021, 268031, 68474, 48556, -263588, -288075, -13763, 298414, 21946, 99557, 24263, -145650, -386730, -272718, -425935, -95219, -111858, -403832, -151671, 62043]
10656f7879A63478k3018P6627A0419L6125N2030l6141R72J7374b05777F7640K2276
10644H9916J93265A28780e9092j84410D0507J78940q480Q6815e2648q2289p6720
10633b11657d3854q9879k9891E0843J470j4765c62063j41354L0329A87030e19746
10621b29107A35879c09738a02824j75794a09858q9041n9424e195A18516b96315
10610a07028B02251a46132O3671k8429F3848b89952N3570b9242I2773q577B8699
10598b21007a9083G9766a45062k4738b3178A61459N4443h6281H356a66373A6429
10586A01395O2440b3944k41882J01733G1726b47083L378A10232c42942J01756
10576b41186c5954J2058C18589b23387a5726k44768R8901E6537j6682K89208g5122
$$ y = [-67879, 163478, 140460, 217087, 10419, 46544, 98574, 62433, 63405, 80779, -205777, 67640, 89916, 283181, 128780, -59092, -243502, 40507, 219447, 210967, 297782, -52648, -134937, -211657, -43854, -133733, -163624, 50843, 52313, 37548, -362063, -503417, -473088, 187030, -519746, -229107, 135879, -309738, -102824, -278618, -109858, -198899, -258323, -5195, 118516, -296315, -107028, 202251, -146132, -82461, -110890, 63848, -289952, -236382, -29242, 92773, 84196, 28699, -221007, -19083, 79766, -145062, -169800, -23178, 161459, 215902, -86281, 8356, -166373, 16429, 101395, 163835, -23944, -265826, -164093, 71726, -247083, -243705, 110232, -342942, -241186, -35954, -23896, 318589, -223387, -15726, -260494, -161593, 56537, 39855, 329063, -75122]
10564A58716o3359a08559B3053c37071b9144o1308o9695f5321o3410I7308c4787
10552i2523j20095A73205c34841c5586I6261b20943A15811b49809P7594C7935
10541i8819A3521O1053a4675E2371L55650a52383H3295I587b99895A2389a58584
10529e3787A17318j6670l9563b14587N9738B53454g4200p8328j19350f7448j32961
10518b00409A50323e1587A00395m3564a8872j76545B8879d19098A679L7112b50847
10506b79053D4812J93927h6261B85187g6409G031A221N9359a01741n5693p2020
10495b29454b7959A70786j3751p0981J80724c11036B49640g9133A35875D0286
10484D8484a77408D08954b05951C44525j04845K34529j52500E7235K69260a92972
$$ y = [158716, 95357, -108559, 23053, -337071, -29144, -90452, -160147, -65321, -128731, 97308, -34787, -92523, -212618, 173205, -334841, -35586, 96261, -220943, 115811, -249809, -172215, 37935, -98819, 13521, 74574, -14675, 52371, 408021, -152383, 83295, 9587, -299895, 12389, -158584, -53787, 117318, 100648, 61085, -214587, -154849, 253454, -74200, -152528, -271878, -67448, -200409, 150323, -51587, 100395, 56831, -18872, -195417, 28879, -419098, 1679, 38791, -250847, -279053, 44812, 238739, -86261, 285187, -76409, 7031, 1221, 60580, -101741, -157434, -229454, -27959, 170786, 157035, 86054, 266778, -311036, 249640, -79133, 135875, 40286, 48484, -177408, 408954, -205951, 344525, 239680, 474209, 321709, 57235, 326495, -192972]
10473c8041j71253K9392C84819b01879A79369a69555D273K25745b24237b6736
10462b28980I2194k0617a47294R90k04899i703j96227e5035k44912A45770a21759
10450c2704j76948a217l9886P385j2325j72392j305e0883Q572j79778a982A12204
10437a1039C25452a67539c4348B11495q5106a72697A3966b8694l62158D6942C93
10425A47501F6347J55042a54171A470e6952A35036f9564k560l0693H8471a86714
10413f4944j75596A90031a38827l0956B18243a67119j40612e6473j63068I9412
10402A20467j7499a58967k38472P9589g636A98591C657a59643D1048g7215G0019
10390B11556I2453J47831A06396d5713D60187A7172L3528J77577a97183B99835
$$ y = [-38041, -209294, -179902, 384819, -201879, 179369, -169555, 4273, 230018, -224237, -26736, -228980, 92194, 71577, -147294, -146304, -351203, -9703, -205930, -55035, -299947, 145770, -121759, -32704, -209652, -1217, -41103, -33718, -46043, -218435, -219740, -50883, -42311, -222089, -1982, 112204, -11039, 325452, -167539, -34348, 211495, 126389, -172697, 13966, -28694, -390852, 46942, 393, 147501, 66347, 221389, -154171, 1470, -56952, 135036, -69564, -72124, -102817, 88471, -186714, -64944, -240540, 190031, -138827, -169783, 218243, -167119, -307731, -56473, -219541, 99412, 120467, 102968, -158967, -397439, -317850, -7636, 198591, 3657, -159643, 41048, -77215, 70019, 211556, 92453, 240284, 106396, -45713, 460187, 17172, 50700, 228277, -197183, 299835]
10379G7832K4964i480D29199q7709A24771J99308P5587F4089N35290k79286j34850
10368A85243m6040L68720k51706M02974k150C16353K10486d5832A13672R6747
10358B10419A0694L30144A55078a29410D03761j52341P6604K30596j30152r1617
10348C36851j30161p3294L91557k32411J10079r0914H2518J21531l6408j9693
10338A47948j7792o3035Q1105N043K98950A63162A7869K19701J24181j51102K63456
10327D74105b17097I9079C5191p487N60079A17259b53761A29559A5622L6035K0860
10316G2517l2505J70107A2222e9741b7752A8920L59477A88461C5729N8189m022
10305H9896R5250e9017A64386a35276A12725B7322J89660a43248B08330a14866
$$ y = [77832, 102796, -9480, 429199, 341490, 124771, 324079, 399666, 64089, 599379, 320093, 185243, 139203, 507923, 256217, 659191, 657041, 316353, 526839, -45832, 113672, 210419, 10694, 340838, 155078, -129410, 403761, 251420, 328024, 558620, 428468, 336851, 206690, 133396, 524953, 292542, 402621, 311707, 82518, 204049, 167641, 147948, 130156, 67121, 148226, 153269, 452219, 163162, 17869, 237570, 361751, 210649, 474105, -217097, 99079, 35191, 27704, 587783, 117259, -253761, 129559, 15622, 51657, 72517, 40012, 210119, 12222, -59741, -27752, 18920, 378397, 188461, 35729, 93918, 89896, 185146, -59017, 164386, -135276, 112725, 27322, 216982, -143248, 208330, -114866]
10294D6448b27995o4837E2270i4233b8883I7577j171H385d7970o0483p3972P8061
10282a04364j10136f9826l620a7015k1596F765a49531m5214A22243N572g3287
10270g8277I5126a8140F3131g1203r1989H5373b61374i8079B80356M6038J93181
10259E19575j23484A80573K5980k0627K42176r2088d6753H889k809i2442A6175
10247b72136g3583G035L49824c48234F1563a6301A27194b57819f2314D7844e2941
10235b7238F7432c53007a19357A35718h7475M3580n5392q1630n5466K8585j20844
10224c28642M230F8177K04750a77414Q2076d2673D292P7357e5036D614a61678
10212G2678d66738a99567G1013j9899R4220c29847e1582l3524g365B89754a67107
$$ y = [46448, -227995, -292832, 52270, -94233, -28883, 97577, 96406, 8385, -47970, -108453, -182425, -104364, -214500, -69826, -73446, -17015, -38611, 6765, -149531, -194745, 122243, 127815, -73287, -78277, 95126, -18140, 63131, -71203, -163192, 85373, -261374, -98079, 280356, 326394, 519575, 396091, 180573, 206553, 185926, 428102, 336014, -46753, 8889, 6080, -92442, 16175, -272136, -73583, 7035, 356859, -348234, 61563, -16301, 127194, -257819, -62314, 47844, -52941, -27238, 67432, -353007, -119357, 135718, -87475, -43895, -99287, -180917, -236383, -207798, -328642, -324412, 68177, 272927, -177414, -95338, -42673, 4292, 81649, -55036, 4614, -161678, 72678, -466738, -199567, 71013, 51114, 145334, -329847, -51582, -85106, -7365, 289754, -167107]
10200A03281N1523i4082j07022a8641j22573B69676i6959A40270c01070c422B6597
10188A93456a33745A41024a78432B8933J6066e9476j003A43525f8991k53409F5273
10176b20473O6865J1529b7730A85605b41701h8888j4062j33518F9083a44505M9165
10165i5340q3664E3421a07743D1553L64483A60066g3098K990H3960J97323B941
10153H8938K40690r7164c40956b8930A45789i0871n9515j96573B32093a00042
10142B22903a6008o117n4335l6453C3085c5730q8317A26783c51991J71299A53008
10130A4630c62043F5001K2701a88791l5921a08769q6740L2941H4114e500k26266
10119b31766a10977g473F3662h7152l1248j46456A15126d316j8664m8199D5839
$$ y = [103281, 154804, -94082, -201104, -18641, -141214, 269676, -96959, 140270, -301070, -3422, 26597, 193456, -133745, 141024, -178432, 28933, 44999, -59476, -60479, 143525, -68991, -322400, 65273, -220473, -153608, -142079, -27730, 185605, -241701, -88888, -102950, -236468, 69083, -144505, -95340, -179004, 53421, -107743, 41553, 406036, 160066, -73098, -70108, 83960, 281283, 2941, 88938, 329628, 232464, -340956, -28930, 145789, -90871, -150386, -346959, 232093, -100042, 222903, -16008, -22125, -76460, -112913, 33085, -35730, -124047, 126783, -351991, -180692, 153008, 14630, -362043, 65001, 87702, -188791, -224712, -108769, -195509, -162568, 84114, -5500, -231766, -110977, -7473, 63662, -87152, -118400, -264856, 115126, -4316, -22980, -71179, 45839]
10107F6131K9025a33842A03236a55017k3153H5891b10815j6274B90205a25562
10096a96740O5942j56199B1102h7522A75282a0432q2983A94002A2972L947h0064
10084A31334a19782I1954b71364H117f8030A1847c8346A68661a28197j56646g4998
10072a56289b338k99211a05580A24590b43442B02143a50560K0870D3378A7862
10061a78101A96278i3373G7135a36362e3818A4523a71076A56321P1093b7528j67424
10050a94952k53436J10254J54668A74904a39120d7325k65816A15804J75792f1485
10039c38424a36165N8122K7588A15115a25953e9549J4608r2528H7486j082L5907
10028A22311a75249h1141E2920b06264A4983J71593c07150a2733C9110J25493
$$ y = [66131, 95156, -133842, 103236, -155017, -178170, 85891, -210815, -227089, 290205, -125562, -196740, -130798, -286997, 21102, -87522, 175282, -10432, -93415, 194002, 12972, 16919, -80064, 131334, -119782, 91954, -271364, 8117, -68030, 11847, -38346, 168661, -128197, -284843, -74998, -156289, -2338, -301549, -105580, 124590, -243442, 202143, -150560, -129690, 43378, 17862, -178101, 196278, -93373, 77135, -136362, -53818, 14523, -171076, 156321, 227414, -27528, -194952, -448388, -338134, -183466, 174904, -139120, -47325, -313141, 115804, 291596, -61485, -338424, -136165, -78043, -50455, 115115, -125953, -59549, -44941, -137469, 87486, 86404, 122311, -175249, -81141, 52920, -206264, 14983, 186576, -307150, -12733, 39110, 164603]
10018A64603k1475j4154a16715l5287d6491K255C866J72376d2902A00895b10117
10006f960k24579f902o4968K5248G2410K4891a52619J4557B46558b98308E0594
9994c17966A36538l1561b14282j54940j31375b02324H969M1263B1571b54864J23634
9983a31230k29047a27646G5827b29081K4257E5556g3569B97098A687K02586c838
9971c47208k85i0040a8521j42653I066d6864F5466c12361B38909J43125a37666
9959B00790e0406k58909a17782A18831b58750B51259a36369n3319j8191A44676
9948d0779J2693l1227o9281e815j52359A41197d26017A4108g8069l22992a20122
9936b83058A10228a37135m5371b3151E1488a16322K0658j1958L4253j95866O4219
$$ y = [164603, 143128, 128974, -116715, -152002, -46491, -44236, 3866, 176242, -42902, 100895, -210117, -6960, -231539, -6902, -71870, -46622, 72410, 97301, -152619, -138062, 246558, -298308, 50594, -317966, 136538, 104977, -214282, -369222, -500597, -202324, 8969, 50232, 21571, -254864, -131230, -360277, -127646, 75827, -229081, -204824, 55556, -73569, 297098, 1687, 204273, -3838, -347208, -347493, -90040, -18521, -161174, 9066, -46864, 65466, -312361, 238909, 382034, -137666, 200790, -50406, -309315, -117782, 118831, -258750, 251259, -136369, -189688, -207879, 144676, -40779, -28086, -59313, -128594, -5815, -158174, 141197, -426017, 14108, -78069, -401061, -120122, -283058, 110228, -137135, -182506, -23151, 51488, -116322, -95664, -107622, -73369, -269235, -205016]
9925b05016q625A59820a18407j26924A8401a1773A79392A4462P8213b67234B4977
9913H1326e8657A0000b39671J14912c0722A08598b41975l49H869R6974J14966
9902B20809f4160j31971R7423B46982h9309A53053N9579b03408P7569D5809a84279
9890C8132a25082j20591R8827c7863H5992Q4684E2090K22412c06722Q8517B7293
9878B52549f8691A78395c3855j59964A02390g4598G7154a93601p3903d275k91456
9867b95731a02145I8477a44387F9190M3260f0883o3852E1125b96064a03452K9469
9856g3983p2895k01708H4400l6231g579I0927a48741c3985j7891j44747L6452
9845a60171C4784b79543h6326A16688J05672q669b07280D6684a69198a9631p7432
$$ y = [-205016, -213641, 159820, -118407, -245331, 18401, -11773, 179392, 14462, 92675, -267234, 24977, 81326, -58657, 10000, -239671, -124759, -30722, 108598, -241975, -242324, 8869, 105843, 220809, -64160, -196131, -98708, 246982, -89309, 153053, 212632, -203408, -125839, 45809, -184279, 38132, -125082, -245673, -146846, -37863, 85992, 170676, 52090, 274502, -306722, -218205, 27293, 252549, -68691, 178395, -33855, -193819, 102390, -74598, 77154, -193601, -267504, -4275, -295731, -102145, 98477, -144387, 69190, 112450, -60883, -124735, 51125, -296064, -103452, -73983, -146878, -348586, 84400, 48169, -7579, 90927, -148741, -33985, -51876, -196623, -160171, 34784, -279543, -86326, 116688, 222360, 213691, -207280, 46684, -169198, -19631, -97063]
9834i7063l0800N2653K2080I6239B6105a26271j28259a6802o6788C9102b8915
9822a16150A18869r232b51597A72041J92882F212b7616n9915j44195A78650a66620
9810C68427G8432b92109b4668A29327F129a9341I1559a27392d0092q9730N3792
9799g6030k72513c6905l5211B6794J81563C2420a68086r1181h5879c4697A19091
9787E0822a62506l0562A01414a68399O0057r5012c6975C0381c1355l00097B444
9775A32632j1606b24091H9538a30561c9994F6980i2583A53036N1968d98014b15824
9763E1942a22717d101j57552D4220R8825a04936B55138c9341j6997b4851D8405
9751B15981a79515A20805b58899c4220E3774K2999b71859P626j23418a385A55764
$$ y = [-97063, -127863, -75210, -53130, 96239, 26105, -126271, -254530, -16802, -83590, 39102, -28915, -116150, 118869, 109637, -251597, 172041, 364923, 6212, -27616, -87531, -231726, 178650, -166620, 368427, 78432, -292109, -24668, 129327, 6129, -19341, 91559, -127392, -40092, -129822, -76030, -348543, -36905, -72116, 26794, 208357, 32420, -168086, -259267, -85879, -34697, 119091, 50822, -162506, -193068, 101414, -168399, -108342, -203354, -36975, 30381, -31355, -331452, 2444, 132632, 121026, -224091, 89538, -130561, -39994, 66980, -92583, 153036, 205004, -498014, -215824, 51942, -122717, -4101, -161653, 44220, 143045, -104936, 255138, -39341, -56338, -24851, 48405, 215981, -179515, 120805, -258899, -34220, 53774, 76773, -271859, -264233, -387651, -1385, 155764]
9739c56842M2671e9581r9156B91021a25675j25569A3924a72145p8808A09575d28386
9727B14583m4739b36234k73488a13337F1402b62573j31183A05917J16583F316
9716a98509H6375J88399d644k44606O9543l8247K2541A9981J2088h7096p9978
9705a67074B69769l491i47k80132k36184I0228D1902K34250b06528j28646M5120
9694b90054A11122a94696A74168a8099k35876A2392d17397J81617G3737J60619
9684B34356c21152A7570b62126k81249a80457B6727J12021g4980j54612e8624
9673a6000m63835a99756r2438O1735j06033C2543e156j56791O8135j84331Q0449
9662a97694N9958D9855A87a68927A3821N3870B2855p343c9610k95882p2723a71760
$$ y = [-356842, -314171, -59581, -158737, 291021, -125675, -251244, 13924, -172145, -250953, 109575, -428386, 214583, 169844, -236234, -509722, -113337, 61402, -262573, -393756, 105917, 222500, 6316, -198509, 86375, 274774, -4644, -249250, -179707, -217954, -195413, 19981, 32069, -87096, -167074, 269769, 266278, -947, -281079, -517263, 90228, 41902, 276152, -206528, -335174, -290054, 111122, -194696, 174168, -18099, -253975, 12392, -417397, -235780, 73737, 234356, -321152, 17570, -262126, -543375, -180457, 26727, 138748, -74980, -229592, -58624, -16000, -479835, -199756, -292194, -230459, -336492, 32543, -5156, -161947, -93812, -278143, -197694, -137736, 49855, 187, -168927, 13821, 67691, 22855, 15512, -39610, -335492, -408215, -171760]
9649d9649K897I9686l1677a07717e2005l46162j0070b6037B6608R6015a86475
9637d4345A21999a95345H4664b34515k33972F3172i2065M763m49507A18386d67582
9625b6915j96362k258j84175A83003G4923K17899a61859M7939M6414A36853e7905
9613A67768l0903g3812j4690k04378R6693P6025e1057k76307E7004a64692A01022
9601a67436C6771A4832N3942b31491B6788A1034b28407F5795a08428j14789C1072
9589a01123r810l0381B3227N3217K06199c11610G6367K0213Q7135L6735e1841
9577a00205k89770A40819a9000A84859b13016N9881F0590b26855A00714a95719
9566F0232A2055e8358C11871d0533b401j71692k49555c5878G5269l1403a70785
$$ y = [-49649, -46752, 99686, 68009, -107717, -52005, -398167, -408237, -26037, 26608, 122623, -186475, -44345, 121999, -195345, 84664, -234515, -468487, 63172, -92065, -87302, -536809, 118386, -467582, -26915, -223277, -225535, -409710, 183003, 74923, 292822, -161859, -113920, -67506, 136853, -57905, 167768, 136865, -73812, -88502, -292880, -196187, -120162, -51057, -327364, 57004, -164692, 101022, -167436, 36771, 14832, 68774, -231491, 26788, 11034, -228407, 65795, -108428, -223217, 31072, -101123, -110933, -141314, 23227, 76444, 282643, -311610, 76367, 96580, 183715, 220450, -51841, -100205, -389975, 140819, -19000, 184859, -213016, -153135, 60590, -226855, 100714, -195719, 60232, 12055, -58358, 311871, -40533, -2401, -174093, -423648, -35878, 75269, 43866, -170785]
9554a73145d6549k84148J09728O8891G1739k4726L54002i0704j36101j04055J51513
9543a79347B17325a91412A21398f8185D8895K2786c2094I4050C1631a11288n0191
9532a61479j59492i9062J221b4158B04484b25677n8266A43403B5808J42676h2069
9520H6296b01265E8382a52821A43557f3005j51686M3538e8572A393a05578q3207
9509a88785G2144B097a16342K9757H7333b79404q2280c7263j2559k76052J48815
9498a77059I006e0378k21873J05434J3065k2893C15439j48079C1178J35348c6571
9486a13065A29032m8547A9322J9310J70003i5356B36092f1664j9716b2431n4896
9475g7327m8477m8963A98079b5185L476j36021g2172r6489c1292n8370l8164m5439
$$ y = [-173145, -46549, -330697, -220969, -152078, 71739, 47013, 401015, -90704, -226805, -330860, -179347, 217325, -191412, 121398, -68185, 48895, 71681, -32094, 94050, 31631, -111288, -161479, -320971, -99062, -97841, -24158, 204484, -225677, -283943, 143403, 25808, 168484, -82069, 86296, -201265, 58382, -152821, 143557, -63005, -214691, -171153, -58572, 1393, -105578, -188785, 72144, 2097, -116342, -86585, 87333, -279404, -361684, -37263, -49822, -325874, -177059, 9006, -50378, -272251, -166817, -153752, -176645, 315439, 167360, 31178, 166526, -36571, -113065, 129032, 80485, 19322, 38632, 208635, -95356, 236092, -61664, -81380, -22431, -77327, -125804, -174767, 198079, -25185, -21709, -157730, -72172, -168661, -31292, -89662, -127826, -173265]
9463a73265A071e4941n0152k4135B33558e5471A56594b9519J68A89121P8647b93993
9450b8954j93762d5559k46982A12951a35560k0638L4825c6187l61843a39190E5422
9438a68714F4539b0079j54619j73369G6310b09816c9586A09367a53918A11687
9427A59428g9088I7154a59840j25356q2535e4605B58295H3416K5766a31870Q641
9416a23229a4064j17733a965j20891M7149j10243B40360e34055A42480b67523
9405D9399c072B00009m0061a10019J7363B48449c8088p8583A26095e0770r7218
9394a47988g1684E0906g5428B1006F125a85886D13a09867j39621i7331a6101I6475
9381b29433J11257d056A46308A7066J02817J8014a02140i959B60954a7518A30869
$$ y = [-173265, 1071, -54941, -105093, -129228, 233558, -55471, 156594, -29519, -29351, 189121, 267768, -293993, -28954, -222716, -45559, -292541, 112951, -135560, -156198, -121373, -36187, -398030, -139190, 55422, -168714, 64539, -20079, -174698, -348067, 76310, -209816, -39586, 109367, -153918, 111687, 159428, -79088, 97154, -159840, -285196, -367731, -54605, 258295, 83416, 109182, -131870, -123229, -14064, -131797, -1965, -122856, -75707, -185950, 240360, -534055, 142480, -267523, 49399, -3072, 200009, 159948, -110019, -92656, 248449, -38088, -116671, 126095, -50770, -147988, -71684, 50906, -75428, 21006, 6125, -185886, 413, -109867, -249488, -97331, -16101, 96475, -229433, -118176, -4056, 146308, 17066, 119883, 137897, -102140, -9959, 260954, -17518, 130869]
9369a44061N0009l0638L3897m6064N4778m1571J6805l25831c4452k55001M2070
9358b47383a08950l36185h5533l4596J1237A01203N4498b58826A46540B2487J02769
9347A25256A0612c71939a5534A608R2629b20404l0179G8493a75655E8402J34258
9336A92660A9171L2267c7955q545a9688k54360B2143b71732B28704e0760L243
9325d7517j63260h4753A22283C2320b12213f3134n944J27l168j2512r3411B2998
9312B3651i9909F2987c24371d8295n2518A67170b02119A05837a37891j05655A1965
9300a17382d578k2172A11435a69836B68614a50964A17331a2347k03549A88069
9289a80532j14717g8898D5865K3471h2314O356B13640j754c6811k55218Q1215
$$ y = [-144061, -94052, -124690, -90793, -136857, -82079, -123650, -106845, -432676, -34452, -289453, -247383, -108950, -445135, -85533, -120129, -108892, 101203, 155701, -258826, 146540, 22487, 125256, 10612, -371939, -15534, 1608, 94237, -220404, -250583, 78493, -175655, 58402, 192660, 19171, 51438, -37955, -46500, -19688, -274048, 22143, -271732, 228704, -50760, -47517, -210777, -84753, 122283, 32320, -212213, -63134, -69078, -68951, -72119, -84631, -178042, 22998, 23651, -99909, 62987, -324371, -48295, -100813, 167170, -202119, 105837, -137891, -243546, 11965, -117382, -4578, -26750, 111435, -169836, 268614, -150964, 117331, -12347, -215896, 188069, -180532, -295249, -78898, 45865, 69336, -82314, -75958, 213640, 211886, -36811, -292029, -210814]
9278b10814g7161C4639a18304m5648A09210m2219K66012A4503b0015k57341k4874
9267c02230A35246E8282d1452j23246J511p1726L9539c2506c230q1995c6099J5979
9255b0120j37748j51701L0414F4559O1649B302a35411a2067A78147Q8127c15392
9243A27244m9349D476b12463A45095a02400k4213j77955a9628A14206b94469f0269
9231c9795D16297a0692B08495b48156e5340G4170c7306r4643C588b7210A99779
9219b03747c2057A63502a99913P7165A12657a63117a173j21747n3251j04471a20471
9207e9860e041j66647L4058j33072i512C02259g5097A47644H568e6310A66458
9195I4375c37773j58042I914j595e5717B62491d3257j89578O0270A03895a91850
$$ y = [-210814, -77161, 34639, -118304, -163952, 109210, 66991, 333003, 14503, -20015, -277356, -302230, 135246, 58282, -41452, -164698, -163187, -234913, -195374, -32506, -3230, -85225, -36099, -20120, -157868, -309569, -279155, 64559, 126208, 2302, -135411, -12067, 178147, 266274, -315392, 127244, 77895, 4476, -212463, 145095, -102400, -126613, -304568, -19628, 114206, -294469, -60269, -39795, 416297, -10692, 208495, -248156, -55340, 74170, -37306, -131949, 3588, -27210, 199779, -203747, -32057, 163502, -199913, -122748, 112657, -163117, -1173, -122920, -176171, -280642, -120471, -59860, -5041, -171688, -137630, -270702, -9512, 302259, -75097, 147644, 8568, -56310, 166458, 94375, -337773, -495815, 9914, 8319, -55717, 262491, -43257, -232835, -172565, 103895, -191850]
9183B06011A8331c3056j82320A35777b158l23154h0393j77473d2544J018A09198
9171C2392J15278b27363N4549j77054J30406k42368A43034g3709C51504b86399
9160C28018j57654D7040M5348a10568p4668H8358b70218a22610n8358I999b39775
9148a66788l2836f6104J2669j69054n5242g8352A27970l4215b14322i1493j66235
9137b57728L6688i1036F5608h4110b5260G9721b88271J24770e0908A99082B8213
9125d49155C48209I3263c91809m8534a14723J1182a8934j51772L9000A32345b91947
9113G0606O027a57589k39264A95146b17634B64831a98938A96914c73460f2002
9102a9531G4928Q279i8012M3767D67454f6892k35107e830j08555b1095C13760
$$ y = [206011, 18331, -33056, -215376, 135777, -2158, -325312, -80393, -257866, -42544, -41526, 109198, 32392, 147670, -227363, -172814, -349868, -219462, -461830, 143034, -73709, 351504, -286399, 328018, 170364, 47040, 92388, -110568, -185236, 88358, -270218, -122610, -180968, 9999, -239775, -166788, -199624, -66104, -53435, -222489, -277731, -78352, 127970, 93755, -214322, -91493, -257728, -221040, -91036, 65608, -84110, -25260, 79721, -288271, -163501, -50908, 199082, 28213, -449155, 348209, 93263, -391809, -440343, -114723, -103541, -18934, -170706, -131706, 132345, -291947, 70606, 76633, -157589, -396853, 195146, -217634, 264831, -198938, 196914, -373460, -62002, -19531, 74928, 83207, -98012, -54245, 467454, -66892, -301999, -5830, -114385, -21095, 313760]
9090f8026D6786d2115A17815a74953A30402a88118C1817i2514H6045J08847h7659
9078e0463j52142B15803e1596k06825j55932B03614C3154a10456n1452j31204
9068b93112b3102j04632a6965A08761b70562R5083M8319A1255J49887o6283d46084
9056a14688j15284c0549F8751R7617a05938I1019B3860L66645d18341A13125a4445
9044B69701D2169c50371a59098K89B52363a87107d1364l649k1801n4124R968A13248
9031D9129a38180A72868d7031j28983O5492k33563G0447K11187I1882c1942j84081
9020b16023N9822B46081D7853e1423A01503h8510A66689e3367A63774d8315A3509
9008B31651a77362F8357j1641a8150j75072j99042a2780j56826n562f0806l10049
$$ y = [-68026, 46786, -42115, 117815, -174953, 130402, -188118, 31817, -92514, 86045, 194892, -87659, -50463, -202605, 215803, -51596, -258421, -414353, 203614, 33154, -110456, -161908, -293112, -23102, -127734, -16965, 108761, -270562, -175479, -127160, 11255, 161142, 94859, -446084, -114688, -229972, -30549, 68751, 166368, -105938, 91019, 23860, 390505, -418341, 113125, -14445, 269701, 42169, -350371, -159098, -158809, 252363, -187107, -41364, -45013, -66814, -120938, -110970, 113248, 49129, -138180, 172868, -47031, -176014, -110522, -344085, 70447, 281634, 91882, -31942, -216023, -156201, 246081, 47853, -51423, 101503, -88510, 166689, -53367, 163774, -48315, 13509, 231651, -177362, 68357, 56716, -18150, -193222, -392264, -12780, -169606, -175168, -60806, -370855]
8997c70855h335j72216A55155p3376b19470B4441J11265a88459j14164a35627
8986B1696J4985J24862C4410Q14b82352a11966q6863a4964r5685A41738E1419
8974c12660A45336b65479o8031J65736A5817c980j92314k9332O713f0145j59666
8963b19811N2202b0798k25223B82918b30452A8913a19677b6337E2053J44401B6240
8951e7386a6139l08970b8210A35212H513c78535A17910c53310a09341p1529A21817
8939i2996j09328p7789j4608F4534a96554A57429G329R7488a20325B8182R6577
8928A24759d121m6014D3771J69838E8828K54992q2887k2353l9682C0085c53908
8916A06382a20738d5246q3805k87336g0212b3383p5204M7923m03971h39o4211
$$ y = [-370855, -8335, -180551, 155155, 81779, -219470, 24441, 135706, -188459, -302623, -135627, 21696, 36681, 161543, 34410, 35224, -282352, -111966, -198829, -14964, -110649, 141738, 51419, -312660, 145336, -265479, -333510, -167774, 15817, -3980, -196294, -225626, -218913, -60145, -219811, -167609, -20798, -246021, 282918, -230452, 18913, -119677, -26337, 52053, 196454, 26240, -57386, -16139, -325109, -28210, 135212, 8513, -378535, 117910, -353310, -109341, -180870, 121817, -92996, -202324, -280113, -294721, 64534, -196554, 157429, 7329, 104817, -120325, 28182, 124759, -4121, -50135, 43771, 213609, 58828, 313820, 230933, 208580, 168898, 30085, -353908, 106382, -120738, -45246, -129051, -416387, -70212, -23383, -98587, -50664, -454635, -839, -65050]
8905f5050j05785j55976d2056j25396B74808H8722a51952H0695K22675j41122
8895A62248a02794p3654d5875k76575a8718l6890j6263A58326a94405j00249a12825
8883I9294A736J65982c44933J20626I9156k4847d7285B14203C763a40281C08217
8871D10712D3662P7608c84830I3068c0125k48131A53691c71843A08834g9728j53897
8860b33625R2949l0550P8207A17482g2711j32256D05280A66987b58492D9550N8212
8849A07762C6874J93072A04369a60616I258a78636J8736j38658e323C1749d9348
$$ y = [-65050, -170835, -326811, -42056, -167452, 274808, 88722, -151952, 80695, 303370, 162248, -102794, -176448, -45875, -322450, -18718, -55608, -71871, 158326, -194405, -294654, -112825, 99294, 1736, 167718, -344933, -224307, 99156, 74309, -47285, 214203, 3763, -140281, 308217, 410712, 43662, 121270, -384830, 93068, -30125, -278256, 153691, -371843, 108834, -79728, -233625, -140676, -171226, -93019, 117482, -72711, -204967, 405280, 166987, -258492, 49550, 107762, 36874, 229946, 104369, -160616, 9258, -178636, -159900, -298558, -5323, 31749, -49348]
$$ [...]
##END NTUPLES=NMR SPECTRUM
##END=
