##TITLE=AC1748_SEN00021_9280779_F6sPPhdgcC
##JCAMPDX= 6.0         $$ Bruker NMR JCAMP-DX V2.0
##DATA TYPE= NMR SPECTRUM
##DATA CLASS= NTUPLES
##ORIGIN= BRUKER
##OWNER= Administrator
$$ 1.72 TOPSPIN		Version 2.1
$$ 2015-07-17 21:06:30.494 -0700  Administrator@X
$$ Compression mode = diff/dup
##.OBSERVE FREQUENCY= 400.02188249412
##.OBSERVE NUCLEUS= ^1H
##.ACQUISITION MODE= SIMULTANEOUS (DQD)
##.ACQUISITION SCHEME= undefined
##.AVERAGES= 64
##.DIGITISER RES= 22
##SPECTROMETER/DATA SYSTEM= spect
##.PULSE SEQUENCE= noesygpps1d.comp
##.SOLVENT NAME= COFFEE_meoh
##.SHIFT REFERENCE= INTERNAL, COFFEE_meoh, 1, 14.96108
##AUDIT TRAIL= $$ (NUMBER, WHEN, WHO, WHERE, PROCESS, VERSION, WHAT)
$$ ##TITLE= Audit trail, TOPSPIN		Version 2.1
$$ ##JCAMPDX= 5.01
$$ ##ORIGIN= Bruker BioSpin GmbH
$$ ##OWNER= Administrator
$$ $$ E:\/data/COFFEE/nmr/AC1748_SEN00021_9280779_F6sPPhdgcC/12/pdata/1/auditp.txt
$$ ##AUDIT TRAIL=  $$ (NUMBER, WHEN, WHO, WHERE, PROCESS, VERSION, WHAT)
(   1,<2015-07-17 21:06:25.260 -0700>,<Administrator>,<X>,<go>,<TOPSPIN 2.1>,
      <created by zg
	started at 2015-07-17 20:54:55.510 -0700,
	POWCHK enabled, PULCHK disabled,
       configuration hash MD5:
       21 0F 79 D6 B3 7B B4 F6 88 20 88 DB 03 48 BD 9F
       data hash MD5: 64K
       48 5C 2D 07 F0 26 4C 3A B4 B4 FC 53 92 4C 50 52>)
(   2,<2015-07-17 21:06:28.604 -0700>,<Administrator>,<X>,<proc1d>,<TOPSPIN 2.1>,
      <Start of raw data processing
       efp LB = 0.3 FT_mod = 6 PKNL = 1 PHC0 = 0 PHC1 = 0 SI = 128K 
       data hash MD5: 128K
       BA 3C 10 DE 8E 88 21 9F 55 8B CF 28 82 53 7D 91>)
(   3,<2015-07-17 21:06:29.572 -0700>,<Administrator>,<X>,<proc1d>,<TOPSPIN 2.1>,
      <pk PHC0 = 269.6375 PHC1 = 0 
       data hash MD5: 128K
       C0 F8 5A 9D 0E F1 2C 78 65 55 CE E8 5C 7A 2F B2>)
(   4,<2015-07-17 21:06:29.979 -0700>,<Administrator>,<X>,<proc1d>,<TOPSPIN 2.1>,
      <abs ABSG = 1 
       data hash MD5: 128K
       32 C2 5E 3D 26 2D E4 9F EC 21 CB 95 ED 2A FC 05>)
(   5,<2015-07-17 21:06:30.072 -0700>,<Administrator>,<X>,<proc1d>,<TOPSPIN 2.1>,
      <abs ABSG = 2 
       data hash MD5: 128K
       83 3E A9 FA 42 D8 FB 54 FE AC 3D D4 57 19 36 03>)
(   6,<2015-07-17 21:06:30.166 -0700>,<Administrator>,<X>,<proc1d>,<TOPSPIN 2.1>,
      <abs ABSG = 3 
       data hash MD5: 128K
       77 4D 2F D4 69 67 1A F8 8C EF 72 B4 F4 B8 CA 1C>)
(   7,<2015-07-17 21:06:30.244 -0700>,<Administrator>,<X>,<proc1d>,<TOPSPIN 2.1>,
      <abs ABSG = 4 
       data hash MD5: 128K
       D7 8C A2 FF CE 4A 2A A1 85 A9 FC 8E 07 5A 38 EE>)
(   8,<2015-07-17 21:06:30.322 -0700>,<Administrator>,<X>,<proc1d>,<TOPSPIN 2.1>,
      <abs ABSG = 5 
       data hash MD5: 128K
       67 F8 2F 93 36 E3 1D 92 E8 74 60 17 F7 03 45 C2>)
$$ ##END=
$$ 
$$ $$ hash MD5
$$ $$ F2 CC 46 EB F4 C8 BE 9A 6E 53 2A 7F 47 FF 43 2A
##$RELAX= 
##$RELAX= 
##$RELAX= 
##$RELAX= 
##$RELAX= 
##$RELAX= 
##$RELAX= 
##$RELAX= 
$$ Bruker specific parameters
$$ --------------------------
##$DU= <E:\>
##$EXPNO= 12
$$ [...]
##$TP07= 0
##$TPNAME0= <>
##$TPNAME1= <>
##$TPNAME2= <>
##$TPNAME3= <>
##$TPNAME4= <>
##$TPNAME5= <>
##$TPNAME6= <>
##$TPNAME7= <>
##$TPOAL= (0..7)
0.5 0.5 0.5 0.5 0.5 0.5 0.5 0.5
##$TPOFFS= (0..7)
0 0 0 0 0 0 0 0
##$TUNHIN= 0
##$TUNHOUT= 0
##$TUNXOUT= 0
##$USERA1= <user>
##$USERA2= <user>
##$USERA3= <user>
##$USERA4= <user>
##$USERA5= <user>
##$V9= 5
##$VALIST= <valist>
##$VCLIST= <CCCCCCCCCCCCCCC>
##$VD= 0
##$VDLIST= <DDDDDDDDDDDDDDD>
##$VPLIST= <PPPPPPPPPPPPPPP>
##$VTLIST= <TTTTTTTTTTTTTTT>
##$WBST= 2048
##$WBSW= 25
##$XGAIN= (0..3)
0 0 0 0
##$XL= 0
##$YL= 0
##$YMAX_a= 6014744
##$YMIN_a= -11030449
##$ZGOPTNS= <>
##$ZL1= 120
##$ZL2= 120
##$ZL3= 120
##$ZL4= 120
##$ABSF1= 14.96108
##$ABSF2= -5.597102
##$ABSG= 5
##$ABSL= 3
##$ALPHA= 0
##$AQORDER= 0
##$ASSFAC= 0
##$ASSFACI= 0
##$ASSFACX= 0
##$ASSWID= 0
##$AUNMP= <proc_prof1d_extract.lims>
##$AXLEFT= 0
##$AXNAME= <>
##$AXNUC= <1H>
##$AXRIGHT= 0
##$AXTYPE= 0
##$AXUNIT= <>
##$AZFE= 0.1
##$AZFW= 0.1
##$BCFW= 0
##$BC_mod= 0
##$BYTORDP= 0
##$COROFFS= 0
##$CY= 15
##$DATMOD= 1
##$DC= 0
##$DFILT= <>
##$DTYPP= 0
##$F1P= 0
##$F2P= 0
##$FCOR= 0.5
##$FTSIZE= 131072
##$FT_mod= 6
##$GAMMA= 0
##$GB= 0
##$INTBC= 1
##$INTSCL= 1
##$ISEN= 128
##$LB= 0.3
##$LEV0= 0
##$LPBIN= 0
##$MAXI= 10000
##$MC2= 0
##$MEAN= 0
##$ME_mod= 0
##$MI= 0
##$NCOEF= 0
##$NC_proc= -2
##$NLEV= 6
##$NOISF1= 0
##$NOISF2= 0
##$NSP= 0
##$NTH_PI= 0
##$NZP= 0
##$OFFSET= 14.96108
##$PC= 1
##$PHC0= 269.6375
##$PHC1= 0
##$PH_mod= 1
##$PKNL= yes
##$PPARMOD= 0
##$PPDIAG= 0
##$PPIPTYP= 0
##$PPMPNUM= 2147483647
##$PPRESOL= 1
##$PSCAL= 4
##$PSIGN= 0
##$PYNMP= <proc.py>
##$REVERSE= no
##$SF= 400.020009603893
##$SI= 131072
##$SIGF1= 0
##$SIGF2= 0
##$SINO= 400
##$SIOLD= 131072
##$SPECTYP= <>
##$SREGLST= <1H.CDCl3>
##$SSB= 0
##$STSI= 131072
##$STSR= 0
##$SW_p= 8223.68421052631
##$SYMM= 0
##$S_DEV= 0
##$TDeff= 65536
##$TDoff= 0
##$TI= <>
##$TILT= no
##$TM1= 0
##$TM2= 0
##$TOPLEV= 0
##$USERP1= <user>
##$USERP2= <user>
##$USERP3= <user>
##$USERP4= <user>
##$USERP5= <user>
##$WDW= 1
##$XDIM= 131072
##$YMAX_p= 385407467
##$YMIN_p= -11787
##$CURPLOT= <Network HP LaserJet P1505>
##$CURPRIN= <$Network HP LaserJet P1505>
##$DFORMAT= <normdp>
##$LAYOUT= <+/1D_H.xwp>
##$LFORMAT= <normlp>
##$PFORMAT= <normpl>
##$SURQMSG= 1
$$ End of Bruker specific parameters
$$ ---------------------------------
##NTUPLES= NMR SPECTRUM
##VAR_NAME=  FREQUENCY,     SPECTRUM/REAL,   SPECTRUM/IMAG
##SYMBOL=    X,             R,               I
##VAR_TYPE=  INDEPENDENT,   DEPENDENT,       DEPENDENT
##VAR_FORM=  AFFN,          ASDF,            ASDF
##VAR_DIM=   131072,        131072,          131072
##UNITS=     HZ,            ARBITRARY UNITS, ARBITRARY UNITS
##FACTOR=    0.0627417313425164, 1,          1
##FIRST=     8223.62146879497, -1404,        -53647
##LAST=      0,             299,             -54001
##MIN=       0,             -11787,          0
##MAX=       8223.62146879497, 385407467,    0
$$ Real data points
##PAGE= N=1
##DATA TABLE= (X++(R..R)), XYDATA
$$ [...]
$$ plain form
61710 481320 484868 487723 489453 489564 487997 485421 482692 480050 477067 473382 469316 465678 462940 460730
61696 460730 458265 455253 452136 449405 447010 444603 442071 439501 436871 434181 431776 430134 429323 428934 428553
61681 428553 427988 427101 425771 424127 422538 421268 420297 419500 418792 418067 417233 416340 415475 414533 413333 412033 411140
61664 411140 410980 411283 411487 411325 410997 410762 410467 409554 407622 405006 402670 401414 401165 401104 400470 399227 398075
61647 398075 397825 398672 400004 401115 402051 403514 405909 408844 411765 414608 417482 419972 421266 420858 418854
61632 418854 415730 412162 408951 406619 405040 403671 402090 400083 397488 394448 391697 390062 389593 389552 389256
61617 389256 388602 387806 387119 386834 387057 387279 386579 384536 381607 378434 375100 371307 367015 362591 358445 354713
61601 354713 351241 347709 343878 339783 335690 331824 328175 324508 320458 315766 310612 305641 301469 298169
$$ packed form
61710D81320L548K855J730J11j567k576k729k642k983l685m066l638k738k210
61696D60730k465l012l117k731k395k407k532k570k630k690k405j642q11l89l81
61681D28553n65q87j330j644j589j270r71p97p08p25q34q93q65r42j200j300q93
61664D11140j60L03K04j62l28k35k95r13j932k616k336j256k49o1o34j243j152
61647C98075k50Q47J332J111R36J463K395K935K921K843K874K490J294m08k004
61632D18854l124l568l211k332j579j369j581k007k595l040k751j635m69m1k96
61617C89256o54p96o87k85K23K22p00k043k929l173l334l793m292m424m146l732
61601C54713l472l532l831m095m093l866l649l667m050m692n154m971m172l300
$$ plain form
61587 298169 295346 292541 289444 285967 282439 279496 277471 276063 274903 274089 273680 273083 271692 269904 268589
61572 268589 267633 266013 263482 261143 259928 259456 259031 258882 259558 260694 261375 261442 261564 262099 262739 263254 263884
61555 263884 264815 265842 266698 267288 267456 267041 266356 266182 266941 268187 269211 270000 271225 273325 275856 277892
61539 277892 278959 279391 279810 280428 281039 281543 282192 283226 284450 285379 285701 285537 285297 285296 285402 285062 283843 281930
61521 281930 279879 277968 276053 274024 271996 269997 267980 266317 265761 266507 267700 268332 268337 268311 268442 268330 267792
61504 267792 267175 266761 266401 265950 265663 265843 266364 266797 266831 266379 265365 263755 261821 260179 259410 259654 260615 261903
61486 261903 263260 264464 265271 265640 265889 266362 267034 267763 268835 270741 273282 275414 276366 276539 276892 277728 278591
61469 278591 279140 279493 279661 279285 278278 277319 277252 278076 278863 278805 278169 277983 278834 280247 281418 282246 283224 284501
$$ packed form
61587B98169k823k805l097l477l528k943k025j408j160q14m09n97j391j788j315
61572B68589r56j620k531k339j215m72m25j49O76J136O81O7J22N35O40N15O30
61555B63884R31J027Q56N90J68m15o85j74P59J246J024P89J225K100K531K036
61539B77892J067M32M19O18O11N04O49J034J224R29L22j64k40jJ06l40j219j913
61521B81930k051j911j915k029k028j999k017j663n56P46J193O32Nk6J31j12n38
61504B67792o17m14l60m51k87J80N21M33L4m52j014j610j934j642p69K44R61J288
61486B61903J357J204Q07L69K49M73O72P29J072J906K541K132R52J73L53Q36Q63
61469B78591N49L53J68l76j007r59o7Q24P87n8o36j86Q51J413J171Q28R78J277
$$ plain form
61451 284501 285644 286452 287286 288266 288767 288350 287769 288282 290130 292390 294191 295407 296176 296565 296997 298306 300871
61434 300871 304052 306833 308835 310466 312376 314943 317987 320772 322567 323372 323862 324554 325452 326594 328335
61419 328335 330732 333151 335008 336423 337656 338378 338272 338019 338705 340192 341036 340321 338820 337851 337576 337027
61403 337027 335511 333378 331484 330316 329657 328909 327708 326353 325448 325026 324390 323088 321732 321315 321866 322366
61387 322366 322059 321320 321043 321574 322534 323360 323682 323378 322612 321847 321621 322251 323754 325875 328088 329772 330657
61370 330657 331067 331592 332540 333806 335129 336325 337382 338497 339973 341927 344164 346517 349145 352319 355996
61355 355996 359921 364087 368787 374176 380093 386411 393255 400696 408482 416253 423813 430980 437317 442358
61341 442358 446130 449198 452137 455093 457932 460621 463284 465851 467819 468541 467815 466104 464102 462091 459839
$$ packed form
61451B84501J143Q08Q34R80N01m17n81N13J848K260J801J216P69L89M32J309K565
61434C00871L181K781K002J631J910K567L044K785J795Q05M90O92Q98J142J741
61419C28335K397K419J857J415J233P22j06k53O86J487Q44p15j501r69k75n49
61403C37027j516k133j894j168o59p48j201j355r05m22o36j302j356m17N51N00
61387C22366l07p39k77N31R60Q26L22l04p66p65k26O30J503K121K213J684Q85
61370C30657M10N25R48J266J323J196J057J115J476J954K237K353K628L174L677
61355C55996L925M166M700N389N917O318O844P441P786P771P560P167O337N041
61341D42358L772L068K939K956K839K689K663K567J968P22p26j711k002k011k252
$$ plain form
61326 459839 457141 454357 452252 451276 451048 450665 449584 448161 447290 447582 449056 451488 454704 458438 462286
61311 462286 466160 470557 476028 482446 489205 496155 503946 513259 524015 535494 546986 558039 568231
61298 568231 577028 583925 588640 591152 591653 590401 587621 583609 578886 573979 568906 563099 556105 548332
61284 548332 540795 534114 527993 521750 515140 508498 502271 496709 491935 488067 485156 483232 482483 483167 485169
61269 485169 487855 490606 493330 496188 499015 501497 503865 506887 511059 516289 522459 529682 537673 545448
61255 545448 552201 558072 563488 568068 570907 571791 571431 570552 569375 568036 566784 565496 563536 560466 556581
61240 556581 552561 548892 545794 543346 541469 540048 539187 539111 539787 540971 542673 545101 548073 551087 554227
61225 554227 558393 564135 570671 576676 581804 586877 592652 599009 605407 611651 617903 624190 630247 635890
$$ packed form
61326D59839k698k784k105r76k28l83j081j423q71K92J474K432L216L734L848
61311D62286L874M397N471O418O759O950P791R313J0756J1479J1492J1053J0192
61298E68231Q797O897M715K512N01j252k780m012m723m907n073n807o994p773
61284E48332p537o681o121o243o610o642o227n562m774l868k911j924p49O84K002
61269D85169K686K751K724K858K827K482K368L022M172N230O170P223P991P775
61255E45448O753N871N416M580K839Q84l60q79j177j339j252j288j960l070l885
61240E56581m020l669l098k448j877j421q61p6O76J184J702K428K972L014L140
61225E54227M166N742O536O005N128N073N775O357O398O244O252O287O057N643
$$ plain form
61211 635890 641368 647108 653047 658399 662362 665019 667277 669975 673357 677381 682082 687482 693604 700849
61197 700849 710008 721525 734944 749357 764198 779356 794736 809975 824412 837023 846654 852841
61185 852841 856388 858790 860940 862580 862920 861480 858233 853297 846811 839028 830261 820602 809874 798041
61171 798041 785556 773031 760546 747642 734135 720518 707186 693622 678927 663062 647062
61160 647062 632091 618688 606815 596028 585669 575537 566476 559711 555483 552916 551298 550755 551411
61147 551411 552650 553683 554262 554351 553606 551665 548600 544721 540321 535883 532048 529020 526564 524931 525147
61132 525147 527853 532474 538138 544835 553009 562556 573063 584639 597697 612197 627894 645062 664123
61119 664123 684732 706052 727869 750689 774714 799436 824242 848791 872795 896057 918705
$$ packed form
61211F35890N478N740N939N352L963K657K258K698L382M024M701N400O122P245
61197G00849R159J1517J3419J4413J4841J5158J5380J5239J4437J2611R631O187
61185H52841L547K402K150J640L40j440l247m936o486p783q767r659j0728j1833
61171G98041j2485j2525j2485j2904j3507j3617j3332j3564j4695j5865j6000
61160F47062j4971j3403j1873j0787j0359j0132r061o765m228k567j618n43O56
61147E51411J239J033N79Q9p45j941l065l879m400m438l835l028k456j633K16
61132E25147K706M621N664O697Q174R547J0507J1576J3058J4500J5697J7168J9061
61119F64123K0609K1320K1817K2820K4025K4722K4806K4549K4004K3262K2648
$$ plain form
61108 918705 940757 961446 979549 994439 1006275 1015259 1021338 1024625 1025410 1023636 1018931 1011266 1000994
61095 1000994 988190 972566 954190 933687 911592 888063 863464 838597 814031 789675 765376
61084 765376 741632 719362 699117 680725 663587 647197 631580 617252 604729 594105 585199 577800
61072 577800 571567 566029 561125 557486 555673 555326 555562 556004 556896 558487 560941 564674 569975 576318 582784
61057 582784 589267 596537 605038 614282 623667 633336 644014 656438 671068 687916 706492 726225 746920
61044 746920 768557 790927 813963 838125 863824 890693 918161 946496 976420 1007821 1039865
61033 1039865 1072352 1105962 1141064 1177304 1214557 1253240 1293296 1333809 1374119 1414688 1456644
61022 1456644 1501232 1549955 1604476 1666126 1736191 1816712 1910114 2018073 2142064 2285335 2453174
$$ packed form
61108I18705K2052K0689J8103J4890J1836Q984O079L287P85j774m705p665j0272
61095A000994j2804j5624j8376k0503k2095k3529k4599k4867k4566k4356k4299
61084G65376k3744k2270k0245j8392j7138j6390j5617j4328j2523j0624q906p399
61072E77800o233n538m904l639j813l47K36M42Q92J591K454L733N301O343O466
61057E82784O483P270Q501R244R385R669J0678J2424J4630J6848J8576J9733K0695
61044G46920K1637K2370K3036K4162K5699K6869K7468K8335K9924L1401L2044
61033A039865L2487L3610L5102L6240L7253L8683M0056M0513M0310M0569M1956
61022A456644M4588M8723N4521O1650P0065Q0521R3402J07959J23991J43271J67839
$$ plain form
61011 2453174 2650889 2882797 3153527 3468993 3835854 4262097 4759409 5343966 6034887
61002 6034887 6854292 7828647 8983438 10328267 11842995 13474573 15137534 16708419
60994 16708419 18028665 18945092 19384940 19410865 19199597 18952642 18808753 18814137 18938346 19089128
60984 19089128 19115979 18838890 18121867 16948018 15430800 13750442 12071550 10500812 9091282
60975 9091282 7861731 6809282 5917715 5166756 4538001 4014246 3577653 3211623 2903355
60966 2903355 2642961 2421215 2229648 2062078 1914639 1784501 1669252 1567021 1476341 1395998
60956 1395998 1325317 1264048 1211502 1166126 1126239 1090723 1058639 1028756 999992 972018 945023
60945 945023 919173 894588 871553 850381 831236 814136 798801 784416 770007 755330 741059
$$ packed form
61011B453174J97715K31908K70730L15466L66861M26243M97312N84557O90921
61002F034887Q19405R74355J154791J344829J514728J631578J662961J570885
60994A6708419J320246R16427M39848K5925k11268k46955j43889N384J24209J50782
60984A9089128K6851k77089p17023j173849j517218j680358j678892j570738j409530
60975I091282j229551j052449q91567p50959o28755n23755m36593l66030l08268
60966B903355k60394k21746j91567j67570j47439j30138j15249j02231r0680q0343
60956A395998p0681o1269n2546m5376l9887l5516l2084k9883k8764k7974k6995
60945I45023k5850k4585k3035k1172j9145j7100j5335j4385j4409j4677j4271
$$ plain form
60934 741059 727907 715844 704366 693134 682168 671690 661998 653253 645294 637861 630981 624831 619274
60921 619274 613951 608852 604334 600568 597436 595038 593711 593393 593523 593848 594823 596941 600126 604172 609374
60906 609374 616258 624865 634582 644589 654319 663750 673432 684052 695835 708454 721517 734874 748527
60893 748527 762671 777839 794563 812755 831838 851549 872108 893357 914310 933930 951996
60882 951996 968893 984861 999812 1013586 1025951 1036467 1044640 1050114 1052633 1052037 1048509 1042564 1034562
60869 1034562 1024471 1012303 998592 984133 969396 954352 938728 922249 904790 886493 867686
60858 867686 848605 829414 810482 792298 774903 757664 739886 721576 703473 686460 671038
60847 671038 657152 644304 631916 619679 607494 595215 582714 570204 558107 546481 534938
$$ packed form
60934G41059j3152j2063j1478j1232j0966j0478r692q745p959p433o880o150n557
60921F19274n323n099m518l766l132k398j327l18J30L25R75K118L185M046N202
60906F09374O884Q607R717J0007R730R431R682J0620J1783J2619J3063J3357J3653
60893G48527J4144J5168J6724J8192J9083J9711K0559K1249K0953J9620J8066
60882I51996J6897J5968J4951J3774J2365J0516Q173N474K519n96l528n945q002
60869A034562j0091j2168j3711j4459j4737j5044j5624j6479j7459j8297j8807
60858H67686j9081j9191j8932j8184j7395j7239j7778j8310j8103j7013j5422
60847F71038j3886j2848j2388j2237j2185j2279j2501j2510j2097j1626j1543
$$ plain form
60836 534938 523264 511819 501138 491386 482360 473776 465389 457138 449365 442652 437249 432895 429364
60823 429364 426804 425263 424160 422655 420513 418340 417010 416936 417769 418645 418839 418295 417440 416602 415911 415724 416617
60806 416617 418680 421157 423139 424383 425225 425951 426584 427107 427555 427973 428499 429305 430231 430668 430104 428709 427150
60789 427150 425959 425226 424714 423934 422221 419122 414827 410091 405684 401922 398572 395086 391043 386496 381839
60774 381839 377346 373074 369224 366219 364176 362646 361176 359883 359113 358776 358486 358254 358545 359529 360681 361373
60758 361373 361655 362191 363449 365132 366538 367349 367809 368107 367953 367212 366690 367634 370309 373713 376923 380097
60742 380097 383591 386687 388038 387253 385276 383143 381019 378635 376050 373585 371322 369047 366525 363640
60728 363640 360413 357054 353835 350773 347567 344014 340285 336616 332902 328922 324867 321312 318639 316683
$$ packed form
60836E34938j1674j1445j0681r752r026q584q387q251p773o713n403m354l531
60823D29364k560j541j103j505k142k173j330p4Q33Q76J94n44q55q38o91j87Q93
60806D16617K063K477J982J244Q42P26O33N23M48M18N26Q06R26M37n64j395j559
60789D27150j191p33n12p80j713l099m295m736m407l762l350l486m043m547m657
60774C81839m493m272l850l005k043j530j470j293p70l37k90k32K91R84J152O92
60758C61373K82N36J258J683J406Q11M60K98j54p41n22R44K675L404L210L174
60742C80097L494L096J351p85j977k133k124k384k585k465k263k275k522k885
60728C63640l227l359l219l062l206l553l729l669l714l980m055l555k673j956
$$ plain form
60714 316683 315034 313409 311654 309682 307657 305981 304727 303238 300771 297615 295016 293756 293246 292444 291298
60699 291298 290740 291422 293047 294945 296718 298174 299137 299655 300100 300786 301649 302483 303292 304257 305538 307191 309100
60682 309100 310934 312483 314155 316826 320965 326127 331459 336455 341055 345352 349545 353992 358928 364136
60668 364136 369050 373117 375977 377530 378062 378173 378353 378628 378694 378274 377325 376116 375162 374865 375064 375149 374748 374059
60650 374059 373538 373557 374437 376286 378556 380197 380539 379708 377960 375144 371185 366542 361643 356338 350575 345169
60634 345169 341048 337974 334871 331362 328115 325625 323586 321739 320530 320388 320927 321381 321459 321399 321502 322016
60618 322016 323145 324705 325976 326302 325744 324814 323782 322555 321157 319883 318962 318344 317942 317869 318317 319248 320260
60601 320260 320831 320852 320934 321925 323982 326321 328080 329222 330323 331714 333260 334825 336439 337900 338751 338984
$$ packed form
60714C16683j649j625j755j972k025j676j254j489k467l156k599j260n10q02j146
60699B91298n58O82J625J898J773J456R63N18M45O86Q63Q34Q09R65J281J653J909
60682C09100J834J549J672K671M139N162N332M996M600M297M193M447M936N208
60668C64136M914M067K860J553N32J11J80K75O6m20r49j209r54k97J99Q5m01o89
60650C74059n21J9Q80J849K270J641L42q31j748k816l959m643m899n305n763n406
60634C45169m121l074l103l509l247k490k039j847j209j42N39M54P8o0J03N14
60618C22016J129J560J271L26n58r30j032j227j398j274r21o18m02p3M48R31J012
60601C20260N71K1Q2R91K057K339J759J142J101J391J546J565J614J461Q51K33
$$ plain form
60585 338984 339420 340910 343314 345617 347033 347702 348276 349202 350455 351690 352550 353143 354321 357117 361681 367070
60569 367070 372425 378066 385016 393688 403582 414124 425079 435987 445856 453869 460012 464612 467507
60556 467507 468120 466254 462484 457803 453100 448937 445573 443081 441525 440980 441463 443038 446019 450792 457330
60541 457330 465146 473872 483599 494398 505842 517327 528613 539631 549879 558428 564503 567804 568381
60528 568381 566565 563009 558437 553333 548061 543178 539256 536351 533939 531452 528670 525689 522839 520675
60514 520675 519671 519785 520531 521553 522962 525125 528366 532911 538846 546063 554453 564243 576012 590475
60500 590475 608464 630862 657997 689033 722516 757729 795091 834957 876510 918092 958065
60489 958065 994745 1025871 1048922 1062048 1064280 1055022 1034079 1002465 962647 917564 869611 820715
$$ packed form
60585C38984M36J490K404K303J416O69N74R26J253J235Q60N93J178K796M564N389
60569C67070N355N641O950Q672R894J0542J0955J0908R869Q013O143M600K895
60556D67507O13j866l770m681m703m163l364k492j556n45M83J575K981M773O538
60541D57330P816Q726R727J0799J1444J1485J1286J1018J0248Q549O075L301N77
60528E68381j816l556m572n104n272m883l922k905k412k487k782k981k850k164
60514E20675j004J14P46J022J409K163L241M545N935P217Q390R790J1769J4463
60500E90475J7989K2398K7135L1036L3483L5213L7362L9866M1553M1582L9973
60489I58065L6680L1126K3051J3126K232r258k0943l1614l9818m5083m7953m8896
$$ plain form
60477 820715 772883 727988 687013 649916 616354 586317 560007 537346 517798 500588 485032
60466 485032 470779 457868 446501 436709 428246 420838 414383 408839 404005 399490 394885 389970 384869
60453 384869 380049 376008 372851 370284 367989 365786 363392 360433 357050 354194 352828 352906 353493 353786 353579
60438 353579 352840 351467 349627 347806 346250 344728 343137 341891 341414 341573 341960 342426 342983 343439 343597 343646 343936
60421 343936 344419 344733 344785 344920 345482 346482 347693 348839 349737 350445 351232 352173 352906 353053 352779 352622 352814 353099
60403 353099 353228 353308 353575 354090 354744 355401 356043 356894 358378 360681 363394 365804 367598 369028 370394 371681
60387 371681 372825 374128 376117 378954 382123 384826 386737 388314 390213 392483 394575 396132 397381 398588
60373 398588 399521 399862 399883 400240 401181 402285 402944 402802 401879 400722 400399 401843 404953 408561 411452 413270 414453
$$ packed form
60477H20715m7832m4895m0975l7097l3562l0037k6310k2661j9548j7210j5556
60466D85032j4253j2911j1367r792q463p408o455n544m834m515m605m915n101
60453C84869m820m041l157k567k295k203k394k959l383k856j366P8N87K93k07
60438C53579p39j373j840j821j556j522j591j246m77J59L87M66N57M56J58M9K90
60421C43936M83L14N2J35N62J000J211J146Q98P08P87R41P33J47k74j57J92K85
60403C53099J29Q0K67N15O54O57O42Q51J484K303K713K410J794J430J366J287
60387C71681J144J303J989K837L169K703J911J577J899K270K092J557J249J207
60373C98588R33L41K1L57R41J104O59j42r23j157l23J444L110L608K891J818J183
$$ plain form
60356 414453 415532 416673 417833 419213 421374 424656 428563 432164 435294 438869 443580 448770 453123 456164
60342 456164 458342 459849 460179 458989 456742 454285 452238 450796 449577 447634 444278 440038 436221 433335
60328 433335 430595 427174 423262 419548 416408 414123 413218 413795 414909 415312 414739 413991 413951 415020 417254 420462
60312 420462 424177 428021 432158 437073 443035 450091 458452 468462 480191 493419 507973 523721 540134
60299 540134 556110 570173 580763 586600 587214 583139 575319 564487 551351 537052 522832 509301
60287 509301 496605 485242 476039 469152 463731 458871 454403 450368 446315 441720 436790 432164 427904 423427
60273 423427 418549 414020 410698 408501 406526 404069 401253 398694 396803 395452 394163 392529 390564 388712
60259 388712 387542 387373 388129 389442 390812 391746 391966 391585 391011 390595 390430 390473 390703 390990 391008 390581 390114 390375
$$ packed form
60356D14453J079J141J160J380K161L282L907L601L130L575M711N190M353L041
60342D56164K178J507L30j190k247k457k047j442j219j943l356m240l817k886
60328D33335k740l421l912l714l140k285r05N77J114M03n73p48m0J069K234L208
60312D20462L715L844M137M915N962P056Q361J0010J1729J3228J4554J5748J6413
60299E40134J5976J4063J0590N837O14m075p820j0832j3136j4299j4220j3531
60287E09301j2696j1363r203o887n421m860m468m035m053m595m930m626m260m477
60273D23427m878m529l322k197j975k457k816k559j891j351j289j634j965j852
60259C88712j170j69P56J313J370R34K20l81n74m16j65M3K30K87J8m27m67K61
$$ plain form
60241 390375 391616 393124 393883 393616 392929 392465 392259 392126 392350 393547 395816 398428 400608 402412 404570 407613
60225 407613 411406 415475 419416 422923 425756 427905 429703 431691 434449 438485 443968 450460 457167 463615
60211 463615 469926 476339 482822 489293 495820 502250 507963 512484 516136 519629 523130 526271 529002 531834
60197 531834 535053 538160 540369 541428 541682 541517 540902 539447 536822 533186 529143 525158 521145 516782 512066
60182 512066 507195 502161 496937 492029 488227 485689 483751 481808 479878 478094 476228 474177 472471 471685
60168 471685 471558 471258 470405 469358 468486 467711 466935 466473 466694 467404 467938 467894 467530 467366 467590 468056 468744 469901
60150 469901 471628 473631 475612 477653 479917 482189 484166 486102 488700 492291 496537 501087 506072 511699
60136 511699 517719 523649 529298 534720 539800 544148 547444 549762 551597 553592 556060 558646 560626 561642
$$ packed form
60241C90375J241J508P59k67o87m64k06j33K24J197K269K612K180J804K158L043
60225D07613L793M069L941L507K833K149J798J988K758M036N483O492O707O448
60211D63615O311O413O483O471O527O430N713M521L652L493L501L141K731K832
60197E31834L219L107K209J059K54j65o15j455k625l636m043l985m013m363m716
60182E12066m871n034n224m908l802k538j938j943j930j784j866k051j706p86
60168D71685j27l00q53j047q72p75p76m62K21P10N34m4l64j64K24M66O88J157
60150D69901J727K003J981K041K264K272J977J936K598L591M246M550M985N627
60136E11699O020N930N649N422N080M348L296K318J835J995K468K586J980J016
$$ plain form
60122 561642 562050 562481 563286 564469 565911 567420 568702 569470 569558 568896 567447 565222 562273 558695 554743 550777
60106 550777 546834 542414 537180 531820 527653 525207 523661 521853 519354 516368 513235 510536 509147 509509
60092 509509 511047 512847 514671 516861 519461 522119 524740 527589 530652 533448 535643 537362 538741 539581
60078 539581 539687 539179 538190 536501 533769 529949 525285 520008 514309 508484 502810 497243 491453 485231 478744
60063 478744 472344 466324 460954 456564 453262 450639 448093 445565 443633 442698 442401 442168 442055 442523 443588
60048 443588 444817 446216 448475 452060 456546 461236 466076 471526 477710 484082 489848 494483 497901 500309
60034 500309 501833 502237 501177 498751 495479 491596 486743 480641 473703 466599 459479 452067 444396 437016
60020 437016 430427 424700 419703 415418 411899 409028 406478 403953 401483 399422 398047 397190 396396 395321 393771
$$ packed form
60122E61642M08M31Q05J183J442J509J282P68Q8o62j449k225k949l578l952l966
60106E50777l943m420n234n360m167k446j546j808k499k986l133k699j389L62
60092E09509J538J800J824K190K600K658K621K849L063K796K195J719J379Q40
60078E39581J06n08r89j689k732l820m664n277n699n825n674n567n790o222o487
60063D78744o400o020n370m390l302k623k546k528j932r35k97k33j13M68J065
60048D43588J229J399K259L585M486M690M840N450O184O372N766M635L418K408
60034E00309J524M04j060k426l272l883m853o102o938p104p120p412p671p380
60020D37016o589n727m997m285l519k871k550k525k470k061j375q57p94j075j550
$$ plain form
60005 393771 391578 388948 386809 386142 386794 387548 387644 387614 388298 389705 391402 393413 395909 398395 400093 401112
59989 401112 402507 405065 408536 412069 414946 416860 417982 418869 419950 420977 421207 420106 417697 414385 410742
59974 410742 407327 404355 401592 398886 396589 395123 394347 393808 393451 393553 394083 394679 395269 396160 397449 398813
59958 398813 400047 401387 403136 405254 407382 409097 410190 410941 411984 413590 415258 416363 416971 417544 418130
59943 418130 418447 418601 418966 419390 419234 418317 417169 416247 415553 415099 415104 415560 416267 417399 419278 421426 422726 422928
59925 422928 423176 424568 426926 429556 432362 435399 437991 439396 440024 441084 443144 445872 449065 452968 457472
59910 457472 461859 465665 469141 472496 475217 476575 476459 475332 473652 471690 469761 468233 467303 466940 467029
59895 467029 467392 467838 468464 469890 472831 477249 482187 486682 490701 494843 499247 503339 506772 510101 514062
$$ packed form
60005C93771k193k630k139o67O52P54R6l0O84J407J697K011K496K486J698J019
59989D01112J395K558L471L533K877J914J122Q87J081J027K30j101k409l312l643
59974D10742l415k972k763k706k297j466p76n39l57J02N30N96N90Q91J289J364
59958C98813J234J340J749K118K128J715J093P51J043J606J668J105O08N73N86
59943D18130L17J54L65M24j56r17j148r22o94m54NM56P07J132J879K148J300K02
59925D22928K48J392K358K630K806L037K592J405O28J060K060K728L193L903M504
59910D57472M387L806L476L355K721J358j16j127j680j962j929j528r30l63Q9
59895D67029L63M46O26J426K941M418M938M495M019M142M404M092L433L329L961
$$ plain form
59880 514062 518597 523131 527519 532008 536297 539459 541073 541731 541962 541191 538420 533631 527859 521976 515983
59865 515983 509630 503207 497439 492828 489304 486447 483883 481525 479561 478303 478070 479106 481407 484677
59851 484677 488679 493709 500404 508844 518031 526558 533682 539473 543986 546734 547233 545894 544143 543559 544853
59836 544853 547547 550491 552582 553110 551732 548486 543911 538968 534537 530879 527522 523673 518828 513153
59822 513153 507281 501671 496195 490498 484672 479301 474829 471185 468145 465777 464243 463303 462373 461126 459841
59807 459841 459066 458993 459214 459047 458084 456414 454369 452165 449857 447539 445369 443365 441361 439265 437275 435720
59791 435720 434753 434255 433997 433850 433798 433755 433473 432747 431772 431077 430962 431176 431321 431400 431668 432055 432151 431784 431251 430891
59771 430891 430710 430616 430754 431399 432613 434155 435650 436836 437763 438794 440263 442134 444108 446031 447940 449793
$$ packed form
59880E14062M535M534M388M489M289L162J614O58K31p71k771m789n772n883n993
59865E15983o353o423n768m611l524k857k564k358j964j258k33J036K301L270
59851D84677M002N030O695Q440R187Q527P124N791M513K748M99j339j751n84J294
59836E44853K694K944K091N28j378l246m575m943m431l658l357l849m845n675
59822E13153n872n610n476n697n826n371m472l644l040k368j534r40r30j247j285
59807D59841p75p3K21j67r63j670k045k204k308k318k170k004k004k096j990j555
59791D35720r67m98k58j47n2m3k82p26r75o95j15K14J45P9K68L87R6l67n33l60
59771D30891j81r4J38O45J214J542J495J186R27J031J469J871J974J923J909J853
$$ plain form
59755 449793 451467 453054 454791 456627 458216 459526 461070 463251 465760 467974 469761 471562 473819 476591
59741 476591 479666 482754 485589 488066 490269 492217 493695 494575 495210 496229 497922 500055 502266 504338 506001
59726 506001 506852 506815 506541 506974 508443 510349 511832 512575 512886 513249 514042 515499 517511 519389 520197 519596 518238
59709 518238 517145 516796 516911 516962 516718 516433 516648 517708 519378 521036 522330 523366 524180 524493 524349 524584 526078
59692 526078 528705 531531 533937 535895 537247 537483 536575 535426 535007 535290 535434 534874 533874 532991 532240 530952
59676 530952 528475 524968 521222 517658 513790 508974 503374 497817 492927 488919 486005 484338 483468 482518 481094
59661 481094 479601 478537 477952 477742 477920 478383 478917 479719 481456 484439 488040 491217 493351 494436 494872 495203
59645 495203 495628 495538 494049 491207 488108 485444 482624 478938 474955 471948 470226 468963 467585 466415 465759
$$ packed form
59755D49793J674J587J737J836J589J310J544K181K509K214J787J801K257K772
59741D76591L075L088K835K477K203J948J478Q80O35J019J693K133K211K072J663
59726E06001Q51l7k74M33J469J906J483P43L11L63P93J457K012J878Q08o01j358
59709E18238j093l49J15N1k44k85K15J060J670J658J294J036Q14L13j44K35J494
59692E26078K627K826K406J958J352K36r08j149m19K83J44n60j000q83p51j288
59676E30952k477l507l746l564l868m816n600n557m890m008k914j667q70r50j424
59661D81094j493j064n85k10J78M63N34Q02J737K983L601L177K134J085M36L31
59645D95203M25r0j489k842l099k664k820l686l983l007j722j263j378j170o56
$$ plain form
59630 465759 465116 463838 462084 460604 459665 458627 456702 453921 451192 449437 448750 448442 447738 446303 444233
59615 444233 441802 439245 436677 434229 432306 431454 431718 432405 432901 433454 434618 436173 437290 437750 438155 438882
59599 438882 439668 440451 441633 443093 443853 443406 442604 442447 442677 442445 441808 441564 441889 442100 441591 440146 437523
59582 437523 433677 429452 426131 424122 422796 421643 420799 420230 419288 417572 415665 414519 414394 414742 414883 414534
59566 414534 413949 413718 414202 415024 415382 414961 414228 413760 413667 413838 414327 415221 416428 417911 419889 422505 425493
59549 425493 428457 431357 434458 437886 441566 445565 450245 456039 463321 472556 484293 498733 515278
59536 515278 532640 549264 563400 572971 576143 572688 564648 555190 546702 540161 535865 533901 533774 534451
59522 534451 535327 536640 538532 540233 540739 539902 538149 535454 531341 525757 519240 512185 504611 496736 489142
$$ packed form
59630D65759o43j278j754j480r39j038j925k781k729j755o87l08p04j435k070
59615D44233k431k557k568k448j923q52K64O87M96N53J164J555J117M60M05P27
59599D38882P86P83J182J460P60m47q02j57K30k32o37k44L25K11n09j445k623
59582D37523l846m225l321k009j326j153q44n69r42j716j907j146j25L48J41l49
59566D14534n85k31M84Q22L58m21p33m68r3J71M89Q94J207J483J978K616K988
59549D25493K964K900L101L428L680L999M680N794P282R235J1737J4440J6545
59536E15278J7362J6624J4136R571L172l455q040r458q488o541m296j964j27O77
59522E34451Q76J313J892J701N06q37j753k695m113n584o517p055p574p875p594
$$ plain form
59507 489142 482155 475619 469508 464284 460326 457365 454828 452429 450079 447498 444355 440806 437558 435331
59493 435331 434415 434706 435886 437456 438815 439638 440228 441256 442968 444830 446146 446971 448085 450113 452983
59478 452983 456289 459864 463806 468197 473025 478203 483465 488367 492478 495527 497411 498340 498906 499680 500785
59463 500785 502220 504518 508380 513495 518462 522343 525750 529937 535378 541788 549007 556999 565214 572792
59449 572792 579465 585615 591372 596155 599242 600334 599385 596238 590719 583005 573835 564291 555261 547060
59435 547060 539685 533292 528008 523325 518439 513532 510097 509429 511235 514236 517697 521772 526782 532981
59421 532981 540859 550900 562929 576229 590362 605489 621906 639584 658112 676805 694836 711174
59409 711174 724032 730608 728455 717748 701622 683824 666868 652703 643559 640469 641751 644531 647301
$$ packed form
59507D89142o987o536o111n224l958k961k537k399k350k581l143l549l248k227
59493D35331r16K91J180J570J359Q23N90J028J712J862J316Q25J114K028K870
59478D52983L306L575L942M391M828N178N262M902M111L049J884R29N66P74J105
59463E00785J435K298L862N115M967L881L407M187N441O410P219P992Q215P578
59449E72792O673O150N757M783L087J092r49l147n519p714r170r544r030q201
59435E47060p375o393n284m683m886m907l435o68J806L001L461M075N010O199
59421E32981P878J0041J2029J3300J4133J5127J6417J7678J8528J8693J8031J6338
59409G11174J2858O576k153j0707j6126j7798j6956j4165r144l090J282K780K770
$$ plain form
59396 647301 649439 648783 641962 627672 608112 586771 566085 547518 532097 519821 509680 501177
59384 501177 494926 491066 488214 485011 481843 479978 479665 480100 480794 481898 483506 485555 488225 491650 495397
59369 495397 498955 502625 507234 512964 519046 524664 529717 534738 540481 547566 556122 565669 575554 585500
59355 585500 595675 606401 617967 630540 644019 658135 672837 688402 704992 722250 739449
59344 739449 755815 770612 783231 793446 801436 807394 811281 812941 812155 808558 801846 792256 780607
59331 780607 767726 754044 739679 724612 708844 692733 677103 662641 649348 637080 626349
59320 626349 617796 610961 604581 598247 592819 588919 586008 583475 581645 580964 580990 581164 582001 584560 589030
59305 589030 594744 601444 609733 620200 632680 646367 660083 672286 681198 685193 683264 675532 663570
$$ packed form
59396F47301K138o56o821j4290j9560k1341k0686j8567j5421j2276j0141q503
59384E01177o251l860k852l203l168j865l13M35O94J104J608K049K670L425L747
59369D95397L558L670M609N730O082N618N053N021N743P085Q556R547R885R946
59355E85500J0175J0726J1566J2573J3479J4116J4702J5565J6590J7258J7199
59344G39449J6366J4797J2619J0215P990N958L887J660p86l597o712r590j1649
59331G80607j2881j3682j4365j5067j5768j6111j5630j4462j3293j2268j0731
59320F26349q553o835o380o334n428l900k911k533j830o81K6J74Q37K559M470
59305E89030N714O700Q289J0467J2480J3687J3716J2203Q912L995j929p732j1962
$$ plain form
59292 663570 649928 636843 625344 615420 606599 598202 589718 581450 574514 569811 567233 566120 566033 566710
59278 566710 567803 569226 571476 575076 579930 585662 592270 599955 608456 617109 625371 632882 639204 643931
59264 643931 646940 648161 647323 644330 639690 634131 627890 620788 612795 604223 595516 587181 579688 573067
59250 573067 566851 560798 555448 551507 548953 547260 546312 546502 547952 550196 552788 555863 559933 565284 571565
59235 571565 577817 582947 586331 587983 588232 587497 586307 585006 583192 579965 575018 569077 562943 556663 550064
59220 550064 543596 537956 533203 528937 525131 522166 520193 519077 518887 519788 521410 522918 523845 524447 525075
59205 525075 525575 525488 524675 523636 523250 524116 526089 528535 531054 533674 536314 538555 540160 541435 542793 544325
59189 544325 546067 548205 550605 552565 553566 553890 554138 554570 555421 557329 560633 564557 567851 570076 571619
$$ packed form
59292F63570j3642j3085j1499r924q821q397q484q268o936m703k578j113q7O77
59278E66710J093J423K250L600M854N732O608P685Q501Q653Q262P511O322M727
59264F43931L009J221q38k993m640n559o241p102p993q572q707q335p493o621
59250E73067o216o053n350l941k554j693r48J90J450K244K592L075M070N351O281
59235E71565O252N130L384J652K49p35j190j301j814l227m947n941o134o280o599
59220E50064o468n640m753m266l806k965j973j116j90R01J622J508R27O02O28
59205E25075N00q7q13j039l86Q66J973K446K519K620K640K241J605J275J358J532
59189E44325J742K138K400J960J001L24K48M32Q51J908L304L924L294K225J543
$$ plain form
59174 571619 572760 573611 574889 577709 582378 588106 594181 600777 608277 616395 624412 631857 638530 644081
59160 644081 648063 650365 651330 651346 650399 648081 644029 638366 631684 624659 617815 611540 606072 601337 596977
59145 596977 592570 587737 582236 576319 570825 566385 562594 558563 554220 550277 546857 543146 538760 534446
59131 534446 530861 527596 524205 521321 519771 519160 518423 517355 516676 516901 518093 520384 523768 527633 531462
59116 531462 535850 541824 549326 557287 565066 572771 580310 587300 594045 601473 609788 618164 626046 633703
59102 633703 641090 647152 650966 652900 653950 654475 654168 652806 650473 647381 644043 641359 639966 639590 639397
59087 639397 638863 637957 636608 634397 630919 626222 620708 614571 607512 599150 589733 580201 571477 563862 557194
59072 557194 551233 545770 540669 536080 532241 528912 525395 521408 517412 513758 510105 506241 502881 500832
$$ packed form
59174E71619J141Q51J278K820M669N728O075O596P500Q118Q017P445O673N551
59160F44081L982K302R65J6r47k318m052n663o682p025o844o275n468m735m360
59145E96977m407m833n501n917n494m440l791m031m343l943l420l711m386m314
59131E34446l585l265l391k884j550o11p37j068o79K25J192K291L384L865L829
59116E31462M388N974P502P961P779P705P539O990O745P428Q315Q376P882P657
59102F33703P387O062L814J934J050N25l07j362k333l092l338k684j393l76j93
59087F39397n34r06j349k211l478m697n514o137p059q362r417r532q724p615o668
59072E57194n961n463n101m589l839l329l517l987l996l654l653l864l360k049
$$ plain form
59058 500832 499794 498798 497532 496365 495312 493872 491957 490181 489118 488808 488977 489168 488732 487345 485525
59043 485525 484184 483744 484102 485126 486515 487528 487718 487767 488773 490794 492967 494945 497285 500376 503895
59028 503895 507536 511551 516402 522484 530194 539569 549852 560084 570052 579995 589578 598038 605196 611305
59014 611305 616002 618548 619212 619232 619177 618479 616898 615358 614864 615557 617317 620306 624351 628702 633028 637924
58998 637924 643847 650230 656155 661249 665450 668579 670749 672554 674227 675110 674417 672109 668655 664482 660012
58983 660012 655694 651601 647537 643802 641230 640169 640162 640971 643104 646865 651686 657043 663369 671376 680955
58968 680955 691393 702148 712863 723049 732418 741225 749832 758200 766076 773198 779063 782999 784819
58955 784819 784906 783378 779801 773994 766413 757384 746702 734502 721763 709390 697384 685393 673463
$$ packed form
59058E00832j038r96j266j167j053j440j915j776j063l10J69J91m36j387j820
59043D85525j341m40L58J024J389J013J90M9J006K021K173J978K340L091L519
59028E03895L641M015M851O082P710R375J0283J0232R968R943R583Q460P158O109
59014F11305M697K546O64K0n5o98j581j540m94O93J760K989M045M351M326M896
58998F37924N923O383N925N094M201L129K170J805J673Q83o93k308l454m173m470
58983F60012m318m093m064l735k572j061pQ09K133L761M821N357O326Q007R579
58968F80955J0438J0755J0715J0186R369Q807Q607Q368P876P122N865L936J820
58955G84819Q7j528l577n807p581r029j0682j2200j2739j2373j2006j1991j1930
$$ plain form
58942 673463 661778 650400 639791 630797 623517 616968 610510 604828 600710 597708 594918 592319 590295
58929 590295 588465 586196 583881 582570 582529 583095 583717 584209 584250 583688 583231 583866 585523 587140 588089 588815 590082
58912 590082 592316 595655 599919 604491 608879 613430 618933 625552 632823 640578 649172 658675 668610 678671
58898 678671 689093 700068 711243 722060 732301 742180 752223 763114 775379 789123 804244 820762
58886 820762 838595 857067 875067 891743 906810 920127 931240 939433 944130 945252 943161 938107
58874 938107 929852 918233 904160 889428 875235 861340 847091 832781 819422 807536 796761 786508
58862 786508 776488 766734 757553 749338 741955 734447 725760 715722 705051 694574 684703 675479 666630
58849 666630 657708 648569 639621 631330 623588 615962 608472 601700 596049 591111 585951 579955 573355 566843
$$ packed form
58942F73463j1685j1378j0609q994p280o549o458n682m118l002k790k599k024
58929E90295j830k269k315j311m1N66O22M92M1n62m57O35J657J617R49P26J267
58912E90082K234L339M264M572M388M551N503O619P271P755Q594R503R935J0061
58898F78671J0422J0975J1175J0817J0241R879J0043J0891J2265J3744J5121J6518
58886H20762J7833J8472J8000J6676J5067J3317J1113Q193M697J122k091n054
58874I38107q255j1619j4073j4732j4193j3895j4249j4310j3359j1886j0775j0253
58862G86508j0020r754r181q215p383p508q687j0038j0671j0477r871r224q849
58849F66630q922r139q948q291p742p626p490o772n651m938n160n996o600o512
$$ plain form
58835 566843 560732 554804 549124 544522 541671 540011 538329 536304 534642 533741 533256 533149 534106 536415 539343
58820 539343 542208 545292 549103 553453 557889 562365 566836 570838 574175 577379 580780 583680 585235 585730
58806 585730 586166 586965 587770 588125 587645 585859 582604 578421 574046 569737 565450 561240 557044 552581 547917
58791 547917 543621 539961 536654 533812 532232 532089 532279 531999 532115 533877 537025 540361 543588 547292 551539
58776 551539 555826 560136 564734 569001 571616 571912 570089 566231 560252 552789 545048 537615 530244 522840
58762 522840 515750 509068 502577 496493 491483 487865 485529 484592 485320 487304 489493 491136 492175 492835 493467
58747 493467 494671 496873 499843 503218 507163 511835 516595 520729 524664 529413 534950 540229 544712 548805
58733 548805 552754 556255 559428 563170 568148 574124 580477 586711 592327 596877 600373 603163 605503 607777
$$ packed form
58835E66843o111n928n680m602k851j660j682k025j662r01m85j07R57K309K928
58820E39343K865L084L811M350M436M476M471M002L337L204L401K900J555M95
58806E85730M36P99Q05L55m80j786l255m183m375m309m287m210m196m463m664
58791E47917m296l660l307k842j580j43J90k80J16J762L148L336L227L704M247
58776E51539M287M310M598M267K615K96j823l858n979p463p741p433p371p404
58762E22840p090o682o491o084n010l618k336r37P28J984K189J643J039O60O32
58747D93467J204K202K970L375L945M672M760M134L935M749N537N279M483M093
58733E48805L949L501L173L742M978N976O353O234N616M550L496K790K340K274
$$ plain form
58719 607777 610868 615494 621339 627563 633936 640614 647159 652906 658075 663257 667852 670373 670432 669132 667185
58704 667185 663972 658873 652289 644613 635240 623428 609444 594218 578524 563095 548956 536885
58692 536885 526817 518105 510104 502326 494588 487352 481487 477358 474406 471670 468454 464544 460284 456379
58678 456379 453189 450330 447507 445403 444964 446002 447491 449146 451778 455980 461490 467995 475649 484463
58664 484463 493995 503904 514074 523917 532251 538125 541198 541318 538512 533529 527639 521615 515410 508807
58650 508807 501743 494164 486396 479535 474479 470707 467041 463568 461552 461407 462119 462931 464246 466377 468669
58635 468669 470525 472246 474176 475996 477436 478733 479793 479817 478519 476889 476067 476147 476716 477827 479779 482611
58619 482611 486428 491547 497706 503810 509144 514276 520145 526739 533231 538883 543269 546149 547710 548605
$$ packed form
58719F07777L091M626N845O224O373O678O545N747N169N182M595K521N9j300j947
58704F67185l213n099o584p676r373j1812j3984j5226j5694j5429j4139j2071
58692E36885j0068q712q001p778p738p236n865m129k952k736l216l910m260l905
58678D56379l190k859k823k104m39J038J489J655K632M202N510O505P654Q814
58664D84463R532R909J0170R843Q334N874L073J20k806m983n890o024o205o603
58650E08807p064p579p768o861n056l772l666l473k016j45P12Q12J315K131K292
58635D68669J856J721J930J820J440J297J060K4j298j630q22Q0N69J111J952K832
58619D82611L817N119O159O104N334N132N869O594O492N652M386K880J561Q95
$$ plain form
58605 548605 549264 549532 549205 548407 547112 544949 541923 538735 535917 533206 530238 527355 525249 524202 524092
58590 524092 524751 525995 527721 530310 534568 540916 548963 558001 567570 577417 587339 597192 606733 615523
58576 615523 623394 630860 638444 645863 652611 659121 666484 675198 685137 696632 710380 726298 743639
58563 743639 762368 783258 806401 830746 855261 879283 901480 919812 933151 941929 946864 948183
58551 948183 946475 943018 938639 933314 927306 921550 916381 910976 904550 896931 887575 875358 860070 842911
58537 842911 824845 805694 785542 765679 747278 730327 714757 701439 691045 683028 676636 671877
58525 671877 668590 665772 662857 660585 659539 658948 658104 657765 658786 660345 661013 660827 660776 660847 660071 658177 655871
58508 655871 653579 651042 648091 644987 642072 639671 638003 636703 634944 632538 630296 628807 627620 626222
$$ packed form
58605E48605O59K68l27p98j295k163l026l188k818k711k968k883k106j047j10
58590E24092O59J244J726K589M258O348Q047R038R569R847R922R853R541Q790
58576F15523P871P466P584P419O748O510P363Q714R939J1495J3748J5918J7341
58563G43639J8729K0890K3143K4345K4515K4022K2197J8332J3339Q778M935J319
58551I48183j708l457m379n325o008n756n169n405o426p619r356j2217j5288j7159
58537H42911j8066j9151k0152j9863j8401j6951j5570j3318j0394q017o392m759
58525F71877l287k818k915k272j046n91q44l39J021J559O68j86n1P1p76j894k306
58508F55871k292k537k951l104k915k401j668j300j759k406k242j489j187j398
$$ plain form
58494 626222 624938 624129 623441 622740 623015 625346 629599 634932 640927 647482 654370 661802 670714 681662 694033
58479 694033 707016 720534 734490 747975 760101 770781 779873 786474 789977 790932 789909 786443 780160
58466 780160 772138 764041 756625 750006 744565 740536 737508 735375 735109 737679 742955 750476 760222 771602
58452 771602 782758 792101 799715 806090 810417 811330 808515 802425 793299 781768 769607 758588 749205
58439 749205 741435 735733 732158 729662 727642 727136 729027 732156 734862 737508 741777 748216 756163 765333
58425 765333 775704 786356 796182 805425 814927 824121 831260 835324 836470 834967 831065 825579 819389 812652
58411 812652 805437 798489 792265 785985 778817 771342 764714 759176 754527 751108 749039 747560 746463 747189
58397 747189 750994 757048 763748 770820 778605 786538 794040 801681 809647 816352 820568 823614 827131 829927
$$ packed form
58494F26222j284q09o88p01K75K331M253N333N995O555O888P432Q912J0948J2371
58479F94033J2983J3518J3956J3485J2126J0680R092O601L503R55j023l466o283
58466G80160q022q097p416o619n441m029l028k133k66K570N276P521R746J1380
58452G71602J1156R343P614O375M327R13k815o090r126j1531j2161j1019r383
58439G49205p770n702l575k496k020n06J891L129K706K646M269O439P947R170
58425G65333J0371J0652R826R243R502R194P139M064J146j503l902n486o190o737
58411H12652p215o948o224o280p168p475o628n538m649l419k069j479j097P26
58397G47189L805O054O700P072P785P933P502P641P966O705M216L046L517K796
$$ plain form
58383 829927 829546 825920 820754 814221 805353 795311 787244 782716 780737 780447 782314 786457 792013 798503
58369 798503 806051 814252 822652 832137 843833 856776 868797 879664 891278 904720 919020 932847
58357 932847 945474 956184 964616 971699 978450 984056 986955 987499 987639 988337 989342 991082 994499 999201
58343 999201 1003946 1008860 1015152 1022983 1031790 1042296 1055731 1071278 1086764 1101780 1117685 1134571
58331 1134571 1150777 1165553 1179783 1193845 1206938 1218691 1229305 1238075 1243953 1247637 1251050 1254902
58319 1254902 1258755 1263093 1268975 1275916 1282566 1289250 1297477 1307297 1317587 1328509 1341095 1354900 1368791
58306 1368791 1383522 1400589 1419021 1436445 1452897 1470361 1488878 1506582 1523412 1541208 1560073
58295 1560073 1578206 1595568 1614185 1634539 1655124 1675924 1698808 1724076 1750079 1776681 1805696
$$ packed form
58383H29927l81l626n166o533q868j0042q067m528j979k90J867M143N556O490
58369G98503P548Q201Q400R485J1696J2943J2021J0867J1614J3442J4300J3827
58357I32847J2627J0710Q432P083O751N606K899N44J40O98J005J740L417M702
58343I99201M745M914O292P831Q807J0506J3435J5547J5486J5016J5905J6886
58331A134571J6206J4776J4230J4062J3093J1753J0614Q770N878L684L413L852
58319A254902L853M338N882O941O650O684Q227R820J0290J0922J2586J3805J3891
58306A368791J4731J7067J8432J7424J6452J7464J8517J7704J6830J7796J8865
58295A560073J8133J7362J8617K0354K0585K0800K2884K5268K6003K6602K9015
$$ plain form
58284 1805696 1837502 1870580 1904651 1940761 1978082 2014376 2049927 2087306 2126991 2167099 2207534
58273 2207534 2250157 2294474 2337629 2379349 2422582 2468501 2515304 2562791 2613553 2668600 2726142
58262 2726142 2785682 2848906 2915576 2983082 3051022 3121659 3194945 3267934 3340099 3414314 3491646
58251 3491646 3570353 3651080 3737512 3830520 3927189 4027079 4133771 4248676 4369152 4494450
58241 4494450 4627593 4769568 4917763 5072033 5236107 5411029 5593698 5783960 5986346
58232 5986346 6202631 6429794 6667905 6922760 7197932 7491592 7804062 8140851 8505246
58223 8505246 8895815 9314414 9768533 10262592 10795646 11371041 11999200 12687568 13437910
58214 13437910 14257685 15163782 16171134 17289258 18535131 19938098 21528071 23333275
$$ packed form
58284A805696L1806L3078L4071L6110L7321L6294L5551L7379L9685M0108M0435
58273B207534M2623M4317M3155M1720M3233M5919M6803M7487N0762N5047N7542
58262B726142N9540O3224O6670O7506O7940P0637P3286P2989P2165P4215P7332
58251C491646P8707Q0727Q6432R3008R6669R9890J06692J14905J20476J25298
58241D494450J33143J41975J48195J54270J64074J74922J82669J90262K02386
58232E986346K16285K27163K38111K54855K75172K93660L12470L36789L64395
58223H505246L90569M18599M54119M94059N33054N75395O28159O88368P50342
58214A3437910Q19775R06097J007352J118124J245873J402967J589973J805204
$$ plain form
58206 23333275 25396746 27782634 30562000 33809500 37620626 42111627 47389613 53539437
58198 53539437 60651798 68849453 78284245 89144969 101695742 116290777 133338759
58191 133338759 153270203 176508036 203323323 233536860 266246995 299755887 331613310
58184 331613310 358668231 377354328 384544010 378758400 360906626 333933010 301644653
58177 301644653 267553390 234276817 203449917 175877701 151775722 131023647 113344287
58170 113344287 98380445 85736986 75036710 65957648 58226423 51605593 45903544
58163 45903544 40978736 36717906 33017785 29791535 26974459 24510308 22341596 20420289
58155 20420289 18715609 17202093 15849447 14631182 13533044 12544803 11651845 10841431
$$ packed form
58206B3333275K063471K385888K779366L247500L811126M491001N277986O149824
58198E3539437P112361Q197655R434792J0860724J2550773J4595035J7047982
58191A33338759J9931444K3237833K6815287L0213537L2710135L3508892L1857423
58184C31613310K7054921J8686097P189682n785610j7851774k6973616l2288357
58177C01644653l4091263l3276573l0826900k7572216k4101979k0752075j7679360
58170A13344287j4963842j2643459j0700276r079062p731225o620830n702049
58163D5903544m924808m260830l700121l226250k817076k464151k168712j921307
58155B0420289j704680j513516j352646j218265j098138r88241q92958q10414
$$ plain form
58147 10841431 10108815 9449982 8855114 8314965 7826571 7386770 6986547 6617167 6275705
58138 6275705 5959597 5662158 5378926 5112620 4866558 4638200 4423739 4223789 4039651
58129 4039651 3868667 3707831 3557730 3418857 3288326 3164061 3047997 2941483 2841722 2746233
58119 2746233 2656465 2573526 2494649 2417566 2344107 2275839 2210341 2145673 2084428 2029184 1977510
58108 1977510 1925592 1873623 1823702 1775413 1727407 1680715 1636711 1594030 1550798 1507733 1466179
58097 1466179 1425458 1384999 1346627 1311918 1279664 1248598 1220094 1195528 1173521 1152550 1133721
58086 1133721 1118078 1103576 1087619 1070405 1053123 1035143 1015752 996436 978551 960765 941512
58075 941512 921982 904004 886995 869697 853034 838438 825097 811510 798127 785923 774044
$$ packed form
58147A0841431p32616o58833n94868n40149m88394m39801m00223l69380l41462
58138F275705l16108k97439k83232k66306k46062k28358k14461j99950j84138
58129D039651j70984j60836j50101j38873j30531j24265j16064j06514r9761r5489
58119B746233q9768q2939p8877p7083p3459o8268o5498o4668o1245n5244n1674
58108A977510n1918n1969m9921m8289m8006m6692m4004m2681m3232m3065m1554
58097A466179m0721m0459l8372l4709l2254l1066k8504k4566k2007k0971j8829
58086A133721j5643j4502j5957j7214j7282j7980j9391j9316j7885j7786j9253
58075I41512j9530j7978j7009j7298j6663j4596j3341j3587j3383j2204j1879
$$ plain form
58064 774044 761453 749319 739208 730428 721569 713189 706410 700250 692802 683916 674548 664757 654462
58051 654462 644850 636924 629886 622806 616376 611162 605889 599517 593229 588093 582606 575088 566895 560479
58037 560479 555616 550257 543992 537990 532431 526589 520716 515444 510005 503271 495850 489072 482671 475551
58023 475551 468024 461174 454824 448236 442108 437718 434627 431191 426828 422034 416926 411609 407231 404776
58009 404776 403459 401964 400466 399731 399299 398463 397929 398417 398650 396994 394216 392215 390812 388268 384458 380911
57993 380911 377913 374038 368663 362742 356951 351057 345295 340507 336677 332911 328984 325478 322501 319742
57979 319742 317652 317015 317438 317679 317349 316944 316504 315724 315116 315498 316542 317265 317690 318577 319842 320726 321264 321987
57961 321987 322469 321812 320405 319576 319589 319478 318832 318233 317927 317490 316840 316330 315891 315267 314928 315581 317091 319023
$$ packed form
58064G74044j2591j2134j0111q780q859q380o779o160p448q886r368r791j0295
58051F54462r612p926p038p080o430n214n273o372o288n136n487p518q193o416
58037E60479m863n359o265o002n559n842n873n272n439o734p421o778o401p120
58023D75551p527o850o350o588o128m390l091l436m363m794n108n317m378k455
58009D04776j317j495j498p35m32q36n34M88K33j656k778k001j403k544l810l547
57993C80911k998l875n375n921n791n894n762m788l830l766l927l506k977k759
57979C19742k090o37M23K41l30m05m40p80o08L82J044P23M25Q87J265Q84N38P23
57961C21987M82o57j407q29J3j11o46n99l06m37o50n10m39o24l39O53J510J932
$$ plain form
57943 319023 321812 326012 330939 335488 339857 344950 350653 356372 362760 370944 380327 389134 396994 404987
57929 404987 413187 420210 425423 429557 432728 433758 432083 428704 424610 419696 413747 407166 400224 392853
57915 392853 385546 379151 373442 367279 360544 354544 349997 345926 341110 335454 329425 323285 317455 312559
57901 312559 308592 304852 301078 297723 294934 292299 289834 288145 287365 287024 287204 288636 291311 294151 296498
57886 296498 298879 301862 305120 308090 310658 312839 314572 316052 317494 318470 318344 317303 315918 313857 310369
57871 310369 306068 302721 300966 299735 298296 297311 297217 297102 296087 294605 293380 292195 290619 289059 288171
57856 288171 287907 287895 288096 288525 289005 289722 291195 293140 294241 293750 292586 292157 292705 293441 293665 293141 291929
57839 291929 290468 289355 288604 287617 286177 284823 283893 282988 281801 280711 280060 279613 279307 279741 281233 283013
$$ packed form
57943C19023K789M200M927M549M369N093N703N719O388Q184R383Q807P860P993
57929D04987Q200P023N213M134L171J030j675l379m094m914n949o581o942p371
57915C92853p307o395n709o163o735o000m547m071m816n656o029o140n830m896
57901C12559l967l740l774l355k789k635k465j689p80l41J80J432K675K840K347
57886B96498K381K983L258K970K568K181J733J480J442R76j26j041j385k061l488
57871C10369m301l347j755j231j439r85r4j15j015j482j225j185j576j560q88
57856B88171k64j2K01M29M80P17J473J945J101m91j164m29N48P36K24n24j212
57839B91929j461j113p51r87j440j354r30r05j187j090o51m47l06M34J492J780
$$ plain form
57823 283013 284146 284787 285890 288033 291084 294600 298013 300745 302615 303926 304862 305164 304566 303061 300529
57808 300529 296803 292431 288706 286367 284722 282576 279680 276894 275220 275021 275828 276649 276756 276343 276107 276181
57792 276181 275999 275251 274316 273548 272704 271319 269252 266809 264821 264391 265766 267508 267744 266433 265436 266155
57776 266155 268137 270321 272548 275196 278256 281495 284862 288059 290335 291307 291444 291211 290336 288446 285870
57761 285870 283280 281033 279290 278213 277597 276839 275749 274885 274728 275101 275797 277036 278822 280447 281201 281063
57745 281063 280343 279263 278298 278133 278706 279003 278380 277351 276464 275230 273056 270538 268793 267898 266941 265350
57729 265350 263356 261321 259411 257854 256896 256469 256371 256595 257139 257678 257832 257494 256618 255083 253128 251514 250747
57712 250747 250474 249999 249027 247528 245426 242889 240502 238540 236475 233753 230735 228326 227027 226778 227314
$$ packed form
57823B83013J133O41J103K143L051L516L413K732J870J311R36L02n98j505k532
57808C00529l726m372l725k339j645k146k896k786j674j99Q07Q21J07m13k36P4
57792B76181j82p48r35p68q44j385k067k443j988m30J375J742K36j311r97P19
57776B66155J982K184K227K648L060L239L367L197K276R72J37k33q75j890k576
57761B85870k590k247j743j077o16p58j090q64j57L73O96J239J786J625P54j38
57745B81063p20j080r65j65N73K97o23j029q87j234k174k518j745q95r57j591
57729B65350j994k035j910j557r58m27r8K24N44N39J54l38q76j535j955j614p67
57712B50747k73m75r72j499k102k537k387j962k065k722l018k409j299k49N36
$$ plain form
57697 227314 228102 228334 227706 226942 226982 227798 228479 228256 226995 224976 222688 220636 218930 217308 215849 215275 216148
57680 216148 218196 220959 224662 229916 236898 245438 255636 267867 282426 299680 320292 344796 373212
57667 373212 405476 441699 481113 520724 555486 579906 589692 583022 561413 529316 491983 453366
57655 453366 415984 381949 353014 329572 310497 294329 280323 268354 258302 249810 242464 236116
57643 236116 230970 227201 224528 222470 221021 220565 220986 221486 221574 221618 221988 222289 222021 221478 221298 221474 221525 221355
57625 221355 221307 221510 221699 221557 220774 219022 216356 213484 211225 209837 209086 208646 208143 207309 206468 206389 207159 207768
57607 207768 207371 206482 206162 206506 206745 206580 206498 206802 207074 206724 205600 203974 202247 200628 198944 196921 194737
57590 194737 192893 191367 189511 187055 184527 182320 180122 177838 176178 175537 175054 173753 172015 170843 170189
$$ packed form
57697B27314P88K32o28p64M0Q16O81k23j261k019k288k052j706j622j459n74Q73
57680B16148K048K763L703N254O982Q540J0198J2231J4559J7254K0612K4504K8416
57667C73212L2264L6223L9414L9611L4762K4420R786o670k1609l2097l7333l8617
57655D53366l7382l4035k8935k3442j9075j6168j4006j1969j0052q492p346o348
57643B36116n146l769k673k058j449m56M21N00Q8M4L70L01k68n43j80J76N1j70
57625B21355m8K03J89j42p83j752k666k872k259j388p51m40n03q34q41p9P70O09
57607B07768l97q89l20L44K39j65q2L04K72l50j124j626j727j619j684k023k184
57590A94737j844j526j856k456k528k207k198k284j660o41m83j301j738j172o54
$$ plain form
57575 170189 169131 167357 165326 163165 160586 157896 156006 155297 155296 155504 155775 155876 155539 155053 155069 155713 156451
57558 156451 156854 156946 156915 157069 157907 159648 161893 164335 167407 171389 175284 177634 178352 178748 179775 181217
57542 181217 182582 183749 184530 184535 183797 182865 182089 181413 180870 180615 180437 179916 179055 178186 177420 176895 177235 178819
57524 178819 180847 182235 183317 185437 188755 191752 193270 193903 194878 196480 198126 199240 199605 199465 199534 200323
57508 200323 201391 202000 202505 204028 206671 209168 210602 211326 211764 211470 210066 208094 206156 204058 201530
57493 201530 199053 197190 195757 194391 193368 193071 193105 192660 191427 189708 188040 187135 187596 189099 190385 190662
57477 190662 190597 191344 193022 194782 195978 196596 196774 196549 196009 195236 194176 192864 191595 190639 189978 189547 189503
57460 189503 190086 191433 193579 196286 198900 200899 202579 204585 206751 208187 208700 209206 210376 211730 212654
$$ packed form
57575A70189j058j774k031k161k579k690j890p09jK08K71J01l37m86J6O44P38
57558A56451M03R2l1J54Q38J741K245K442L072L982L895K350P18L96J027J442
57542A81217J365J167P81Np38r32p76o76n43k55j78n21q61q69p66n25L40J584
57524A78819K028J388J082K120L318K997J518O33R75J602J646J114L65j40O9P89
57508B00323J068O09N05J523K643K497J434P24M38k94j404j972j938k098k528
57493B01530k477j863j433j366j023k97L4m45j233j719j668r05M61J503J286K77
57477A90662o5P47J678J760J196O18J78k25n40p73j060j312j269r56o61m31m4
57460A89503N83J347K146K707K614J999J680K006K166J436N13N06J170J354R24
$$ plain form
57445 212654 213511 215087 217502 220330 223298 226222 228730 230670 232372 234047 235383 236297 237473 239458 241658
57430 241658 243066 243716 244598 246265 248248 249864 251035 252203 253766 255749 257816 259613 261100 262388 263407
57415 263407 264153 265184 267227 270200 273265 275972 278593 281102 282787 283398 283813 284946 286711 288716 291157
57400 291157 294133 296819 298390 299407 301222 304183 307369 309992 312246 314731 317784 321464 325606 329802
57386 329802 333718 337488 341614 346564 352602 359573 366614 372543 376964 380534 383871 386819 389251 391791
57372 391791 394979 398415 401626 405162 409777 414995 419740 424185 429715 436965 445014 452729 459942 467012
57358 467012 474108 481373 489120 497401 505749 513560 520390 525836 529761 532868 536526 541644 547910 554276
57344 554276 559975 564984 569785 574787 579855 584416 588187 591664 595686 600666 606415 612483 618366 623736
$$ packed form
57445B12654Q57J576K415K828K968K924K508J940J702J675J336R14J176J985K200
57430B41658J408O50Q82J667J983J616J171J168J563J983K067J797J487J288J019
57415B63407P46J031K043K973L065K707K621K509J685O11M15J133J765K005K441
57400B91157K976K686J571J017J815K961L186K623K254K485L053L680M142M196
57386C29802L916L770M126M950O038O971P041N929M421L570L337K948K432K540
57372C91791L188L436L211L536M615N218M745M445N530P250Q049P715P213P070
57358D67012P096P265P747Q281Q348P811O830N446L925L107L658N118O266O366
57344E54276N699N009M801N002N068M561L771L477M022M980N749O068N883N370
$$ plain form
57330 623736 628842 634460 641054 648258 655534 662938 670713 678555 685972 693185 700921 709425 718339 727446
57316 727446 736850 746441 755861 765105 774589 784538 794812 805375 816463 828188 840416 853014 865844
57303 865844 878492 890500 901939 913458 925739 939095 953450 968419 983601 999095 1015426
57292 1015426 1032614 1049802 1066351 1082889 1100522 1119325 1138393 1157176 1175855 1194542 1213063
57281 1213063 1231668 1251068 1271500 1292392 1313110 1333464 1353428 1373086 1393068 1414327 1437094
57270 1437094 1460488 1483430 1505588 1527340 1549283 1571989 1595803 1620607 1645984 1671739 1698061
57259 1698061 1725174 1753073 1781487 1809875 1837694 1865030 1892670 1921091 1949748 1977965 2006174
57248 2006174 2035452 2065957 2096690 2126831 2156559 2186512 2217126 2248605 2280947 2313940 2347649
$$ packed form
57330F23736N106N618O594P204P276P404P775P842P417P213P736Q504Q914R107
57316G27446R404R591R420R244R484R949J0274J0563J1088J1725J2228J2598J2830
57303H65844J2648J2008J1439J1519J2281J3356J4355J4969J5182J5494J6331
57292A015426J7188J7188J6549J6538J7633J8803J9068J8783J8679J8687J8521
57281A213063J8605J9400K0432K0892K0718K0354J9964J9658J9982K1259K2767
57270A437094K3394K2942K2158K1752K1943K2706K3814K4804K5377K5755K6322
57259A698061K7113K7899K8414K8388K7819K7336K7640K8421K8657K8217K8209
57248B006174K9278L0505L0733L0141K9728K9953L0614L1479L2342L2993L3709
$$ plain form
57237 2347649 2382708 2419453 2456924 2493592 2529075 2564267 2599805 2635343 2670477 2705425 2740417
57226 2740417 2775160 2809234 2842401 2874436 2905350 2935882 2967020 2998896 3030968 3063392 3097262
57215 3097262 3133266 3171044 3210115 3250416 3291535 3332454 3372690 3412909 3453790 3495015 3535888
57204 3535888 3576235 3616126 3655395 3693920 3731711 3768209 3802242 3833295 3862115 3889525 3915367
57193 3915367 3939277 3961669 3982973 4002556 4019442 4033773 4046654 4058737 4069814 4079693 4088724 4097404
57181 4097404 4105975 4114467 4122811 4130965 4139084 4147353 4155496 4162868 4169329 4175642 4182732 4191017 4200750 4212412
57167 4212412 4226229 4241702 4258008 4274550 4290750 4305842 4319355 4331443 4342361 4352084 4360692 4368531
57155 4368531 4375553 4381127 4385098 4388379 4391776 4394645 4395401 4393012 4387385 4378728 4367201 4352985 4336113
$$ packed form
57237B347649L5059L6745L7471L6668L5483L5192L5538L5538L5134L4948L4992
57226B740417L4743L4074L3167L2035L0914L0532L1138L1876L2072L2424L3870
57215C097262L6004L7778L9071M0301M1119M0919M0236M0219M0881M1225M0873
57204C535888M0347L9891L9269L8525L7791L6498L4033L1053K8820K7410K5842
57193C915367K3910K2392K1304J9583J6886J4331J2881J2083J1077R879R031Q680
57181D097404Q571Q492Q344Q154Q119Q269Q143P372O461O313P090Q285R733J1662
57167D212412J3817J5473J6306J6542J6200J5092J3513J2088J0918R723Q608P839
57155D368531P022N574L971L281L397K869P56k389n627q657j1527j4216j6872
$$ plain form
57142 4336113 4316514 4294601 4271363 4247459 4222721 4197136 4171723 4147789 4125856 4106083 4089237
57131 4089237 4076321 4067422 4061548 4057225 4052612 4045482 4034107 4018098 3997961 3974375 3948701 3923735
57119 3923735 3902826 3888241 3880840 3880866 3888085 3901439 3919592 3941934 3968658 4000552 4039761 4090491
57107 4090491 4157870 4246167 4358835 4499879 4674174 4887075 5145597 5460466 5846093 6318420
57097 6318420 6893592 7588308 8419623 9403560 10554069 11881906 13390825 15071470 16896706
57088 16896706 18820697 20782660 22719746 24592488 26411815 28242484 30167946 32233421
57080 32233421 34404401 36565027 38550729 40192835 41356985 41967055 42010752 41526692 40580292
57071 40580292 39241651 37575273 35641565 33502911 31227229 28886268 26549741 24278232
$$ packed form
57142D336113j9599k1913k3238k3904k4738k5585k5413k3934k1933j9773j6846
57131D089237j2916q899n874m323m613p130j1375j6009k0137k3586k5674k4966
57119C923735k0909j4585p401K6P219J3354J8153K2342K6724L1894L9209N0730
57107D090491O7379Q8297J12668J41044J74295K12901K58522L14869L85627M72327
57097F318420N75172O94716Q31315R83937J150509J327837J508919J680645J825236
57088A6896706J923991J961963J937086J872742J819327J830669J925462K065475
57080C2233421K170980K160626J985702J642106J164150O10070M3697m84060r46400
57071D0580292j338641j666378j933708k138654k275682k340961k336527k271509
$$ plain form
57063 24278232 22118143 20100520 18242886 16551646 15023912 13649700 12415207 11306084
57055 11306084 10309245 9413356 8608751 7886520 7236751 6647693 6107805 5609468 5150665
57046 5150665 4732763 4356437 4018999 3714484 3435639 3176331 2933109 2705263 2493823
57037 2493823 2300588 2127555 1976480 1848429 1743722 1662282 1603747 1567139 1550496 1550785 1563577
57026 1563577 1582161 1596793 1595762 1569123 1513442 1433847 1341114 1245894 1154865 1070978 995493
57015 995493 928867 870623 819710 775193 736221 701674 670562 642643 618027 596321 576811
57004 576811 559320 544101 530857 518597 506635 495188 484816 475794 468182 462037 457326 453910
56992 453910 451680 450463 449897 449827 450793 453686 458935 466338 475503 485843 496206 505013 510826 512411 508623
$$ packed form
57063B4278232k160089k017623j857634j691240j527734j374212j234493j109123
57055A1306084r96839q95889q04605p22231o49769n89058n39888m98337m58803
57046E150665m17902l76326l37438l04515k78845k59308k43222k27846k11440
57037B493823j93235j73033j51075j28051j04707q1440n8535l6608j6643K89J2792
57026A563577J8584J4632j031k6639n5681p9595r2733r5220r1029q3887p5485
57015I95493o6626n8244n0913m4517l8972l4547l1112k7919k4616k1706j9510
57004E76811j7491j5219j3244j2260j1962j1447j0372r022p612o145m711l416
56992D53910k230j217n66p0R66K893N249P403R165J0340J0363Q807N813J585l788
$$ plain form
56977 508623 499097 485062 468710 451604 434379 417895 403578 392138 382814 374561 367521 362783
56965 362783 361079 362233 365687 371165 378982 389930 404540 422240 441383 460133 476918 489943
56953 489943 496943 496027 486770 470381 449124 425674 402497 381278 362799 347380 335211 326299
56941 326299 320438 317319 316543 317731 321066 327635 338615 354051 372987 394739 419202 445568 471424
56928 471424 493507 508858 515072 510483 495181 471711 443948 415035 386460 358758 332542 308812
56916 308812 288509 271790 257714 244890 232669 221550 212372 205326 199832 195111 190747 186933 184245
56903 184245 182914 182328 181605 180665 180329 181283 183485 186634 190623 195347 200614 206624 214025 223224 234111
56888 234111 246706 261419 278200 295900 312947 328148 340317 347705 348794 343741 334499 323467
$$ packed form
56977E08623r526j4035j6352j7106j7225j6484j4317j1440r324q253p040m738
56965C62783j704J154L454N478P817J0948J4610J7700J9143J8750J6785J3025
56953D89943P000r16r257j6389k1257k3450k3177k1219j8479j5419j2169q912
56941C26299n861l119p76J188L335O569J0980J5436J8936K1752K4463K6366K5856
56928D71424K2083J5351O214m589j5302k3470k7763k8913k8575k7702k6216k3730
56916C08812k0303j6719j4076j2824j2221j1119r178p046n494m721m364l814k688
56903A84245j331n86p23r40l36R54K202L149L989M724N267O010P401R199J0887
56888B34111J2595J4713J6781J7700J7047J5201J2169P388J089n053r242j1032
$$ plain form
56876 323467 312290 301798 292536 285115 280253 278515 279950 284173 290933 300443 313070 329017 348562
56863 348562 372366 401144 435029 473218 513940 554479 591350 620735 639025 643555 633764 612093
56851 612093 583390 552860 524241 499404 478896 462604 450498 443213 441753 446552 457260 473672
56839 473672 496352 526104 563325 608226 660975 720826 785151 849614 908895 956864 986828
56828 986828 993299 974663 934462 879981 819223 758342 700890 648761 603463 566303 537614 516516
56816 516516 501872 493395 491664 497293 510257 529925 555723 587763 626484 671096 718343 763064
56804 763064 799709 823081 828692 814450 782713 739563 691179 641346 592414 547005 507467 474467
56792 474467 447409 425905 409870 398708 391623 388658 390405 396757 406900 420517 437948 458886
$$ packed form
56876C23467j1177j0492r262p421m862j738J435M223O760R510J2627J5947J9545
56863C48562K3804K8778L3885L8189M0722M0539L6871K9385J8290M530r791k1671
56851F12093k8703l0530k8619k4837k0508j6292j2106p285j460M799J0708J6412
56839D73672K2680K9752L7221M4901N2749N9851O4325O4463N9281M7969K9964
56828I86828O471j8636m0201n4481o0758o0881n7452n2129m5298l7160k8689k1098
56816E16516j4644q477j731N629J2964J9668K5798L2040L8721M4612M7247M4721
56804G63064L6645K3372N611j4242l1737m3150m8384m9833m8932m5409l9538l3000
56792D74467k7058k1504j6035j1162p085k965J747O352J0143J3617J7431K0938
$$ plain form
56780 458886 481580 503464 521826 533695 536113 527481 508652 482486 452393 421215 390818 362160
56768 362160 335612 311372 289701 270830 254776 241244 229744 219847 211315 203871 196973 190130
56756 190130 183382 177155 171712 167179 163947 162299 161475 159894 156737 152704 148915 145756 143247 141654
56742 141654 140934 140228 138834 137333 136849 137482 138276 138549 138403 138020 137288 136222 135159 134450 134382 135296 137239
56725 137239 139552 141351 142399 143158 144106 145419 147065 148742 149943 150557 151182 152282 153389 153799 153736 154087
56709 154087 155168 156536 157868 159114 159854 159523 158556 158447 160236 163413 166574 168667 169467 169443 169539 170582
56693 170582 172517 174424 175506 175859 176141 176755 177516 177953 177794 177210 176489 175492 173729 171174 168585 166604
56677 166604 164990 163258 161711 161059 161190 161117 160186 158645 156982 155402 154094 153330 153057 152948 153121 154274
$$ packed form
56780D58886K2694K1884J8362J1869K418q632j8829k6166l0093l1178l0397k8658
56768C62160k6548k4240k1671j8871j6054j3532j1500r897q532p444o898o843
56756A90130o748o227n443m533l232j648q24j581l157m033l789l159k509j593
56742A41654p20p06j394j501m84O33P94K73j46l83p32j066j063p09o8R14J943
56725A37239K313J799J048P59R48J313J646J677J201O14O25J100J107M10o3L51
56709A54087J081J368J332J246P40l31r67j09J789L177L161K093Q00k4R6J043
56693A70582J935J907J082L53K82O14P61M37j59n84p21r97j763k555k589j981
56677A66604j614j732j547o52J31p3r31j541j663j580j308p64k73j09J73J153
$$ plain form
56661 154274 156729 159728 162084 163380 164260 165609 167607 169631 171041 171965 173089 174706 176365 177602 178525
56646 178525 179337 179767 179512 178886 178497 178497 178717 179293 180542 182379 184354 186071 187151 187096 185871 184367 183590
56629 183590 183507 183245 182235 180549 178411 176190 174669 174413 174841 174703 173487 171661 169630 167323 164864 162756
56613 162756 161201 159917 158805 158037 157360 156102 154141 152215 150971 150326 150021 150211 151175 152858 154966 157106
56597 157106 158731 159431 159451 159525 160052 160836 161589 162243 162721 162960 163210 163863 164907 165988 166930 167755 168321 168517
56579 168517 168694 169302 170253 171252 172453 174006 175237 175374 175042 175861 178407 181670 184776 188133 192351 197081
56563 197081 201687 206388 212011 219033 227331 236455 245761 254600 262614 269498 274524 276951 277037 275942 274522
56548 274522 272895 271273 270250 269870 269251 267728 265790 264429 264048 264281 264371 263467 261196 258220 255652 253703
$$ packed form
56661A54274K455K999K356J296Q80J349J998K024J410R24J124J617J659J237R23
56646A78525Q12M30k55o26l89%K20N76J249J837J975J717J080n5j225j504p77
56629A83590q3k62j010j686k138k221j521k56M28j38j216j826k031k307k459k108
56613A62756j555j284j112p68o77j258j961j926j244o45l05J90R64J683K108K140
56597A57106J625P00K0P4N27P84P53O54M78K39K50O53J044J081R42Q25N66J96
56579A68517J77O08R51R99J201J553J231J37l32Q19K546L263L106L357M218M730
56563A97081M606M701N623P022Q298R124R306Q839Q014O884N026K427Q6j095j420
56548B74522j627j622j023l80o19j523j938j361l81K33R0r04k271k976k568j949
$$ plain form
56532 253703 251594 248968 246481 244570 242495 239263 234921 230440 226758 224328 223022 222051 220510 218345
56518 218345 216276 214554 212544 209868 207158 205131 203653 202290 201149 200507 200127 199589 198888 198190 197355 196235
56502 196235 195072 194162 193433 192724 192172 192023 192364 193184 194309 195233 195544 195575 195924 196282 195625 193789 191910 190966
56484 190966 190826 191155 192198 193984 195704 196725 197504 198691 199967 200611 200673 200772 201154 201696 202441 203441 204444
56467 204444 205326 206440 207956 209267 209683 209385 209141 209368 209931 210491 210702 210427 210124 210523 211622 212555 212752
56450 212752 212541 212314 211912 211353 211251 211887 212618 212947 213396 214481 215592 215808 215238 214632 214134 213411 212597 212188
56432 212188 212243 212524 213158 214315 215483 215819 215195 214246 213519 213054 212674 212261 211959 212280 213626 215505 216862
56415 216862 217447 218100 219282 220314 220700 221192 222573 224244 225199 225784 227235 229756 232139 233200 232760 231390
$$ packed form
56532B53703k109k626k487j911k075l232m342m481l682k430j306r71j541k165
56518B18345k069j722k010k676k710k027j478j363j141o42l80n38p01o98q35j120
56502A96235j163r10p29p09n52j49L41Q20J125R24L11L1L49L58o57j836j879r44
56484A90966j40L29J043J786J720J021P79J187J276O44O2R9L82N42P45J000J003
56467B04444Q82J114J516J311M16k98k44K27N63N60K11k75l03L99J099R33J97
56450B12752k11k27m02n59j02O36P31L29M49J085J111K16n70o06m98p23q14m09
56432B12188N5K81O34J157J168L36o24r49p27m65l80m13l02L21J346J879J357
56415B16862N85O53J182J032L86M92J381J671R55N85J451K521K383J061m40j370
$$ plain form
56399 231390 229956 229252 229390 229713 229802 230146 231264 232726 233819 234746 236261 238469 240749 242604 243892 244526
56383 244526 244641 244751 245095 245233 244862 244545 244913 245693 246274 246705 247337 248074 248815 250058 252060 253929 254650 254640
56365 254640 255171 256556 258029 259125 260043 260734 260786 260284 259890 259949 260297 260959 262292 264380 266864 269354 271524
56348 271524 272994 273667 273973 274354 274801 275300 276196 277555 278757 279410 280129 281724 284144 286898 289878 292990
56332 292990 295729 298025 300780 304557 308445 311360 313726 316595 319795 322421 324601 327120 329537 330408
56318 330408 329473 328136 327514 327285 326781 326085 325643 325659 326185 327141 328138 328917 329918 331748 334267 336894 339598
56301 339598 342803 346548 350592 355084 360244 365608 370457 374815 379234 383906 388768 394080 399906 405412
56287 405412 409722 413212 416983 421409 426211 431570 438012 445421 453241 461395 470033 478719 487036 495670
$$ packed form
56399B31390j434p04J38L23Q9L44J118J462J093R27J515K208K280J855J288O34
56383B44526J15J10L44J38l71l17L68P80N81M31O32P37P41J243K002J869P21j0
56365B54640N31J385J473J096R18O91N2n02l94N9L48O62J333K088K484K490K170
56348B71524J470O73L06L81M47M99Q96J359J202O53P19J595K420K754K980L112
56332B92990K739K296K755L777L888K915K366K869L200K626K180K519K417Q71
56318C30408r35j337o22k29n04o96m42J6N26R56R97P79J001J830K519K627K704
56301C39598L205L745M044M492N160N364M849M358M419M672M862N312N826N506
56287D05412M310L490L771M426M802N359O442P409P820Q154Q638Q686Q317Q634
$$ plain form
56273 495670 505758 517397 529860 542908 556679 570694 584415 598674 615160 634482 655909
56262 655909 678985 704258 732447 763994 799424 839213 883397 932125 986274 1046720 1113547
56251 1113547 1187052 1268825 1360444 1461529 1570379 1686073 1808536 1937010 2069890 2205700
56241 2205700 2342757 2478243 2608969 2732568 2846525 2946805 3029218 3091729 3133759 3153937
56231 3153937 3150660 3124450 3077609 3011832 2928412 2830573 2723042 2608906 2489012 2364739 2239229
56220 2239229 2115431 1994910 1879066 1769556 1666951 1570621 1480475 1397241 1320843 1250233
56210 1250233 1185010 1125467 1070926 1020044 972888 930699 893284 858877 826889 798485 773859
56199 773859 751316 729908 710763 694786 681048 668507 657399 647854 638891 629976 621957 615458
$$ packed form
56273D95670J0088J1639J2463J3048J3771J4015J3721J4259J6486J9322K1427
56262F55909K3076K5273K8189L1547L5430L9789M4184M8728N4149O0446O6827
56251A113547P3505Q1773R1619J01085J08850J15694J22463J28474J32880J35810
56241B205700J37057J35486J30726J23599J13957J00280Q2413O2511M2030K0178
56231C153937l277k6210m6841o5777q3420r7839j07531j14136j19894j24273j25510
56220B239229j23798j20521j15844j09510j02605r6330r0146q3234p6398p0610
56210A250233o5223n9543n4541n0882m7156m2189l7415l4407l1988k8404k4626
56199G73859k2543k1408j9145j5977j3738j2541j1108r545q963q915q019o499
$$ plain form
56187 615458 609824 604512 599980 596348 592766 588978 585956 584151 582706 581206 580546 581209 582284 583134 584452
56172 584452 586766 589465 592224 595855 600731 605825 610269 614511 619062 623549 627914 633189 640188 648629
56158 648629 658201 669169 681357 694003 707216 722176 739311 757770 777145 798157 821214 845933
56146 845933 872426 901306 932151 963983 997618 1035414 1078296 1125402 1177188 1236131 1303234
56135 1303234 1376153 1451748 1527981 1602216 1670452 1730202 1782303 1828550 1869636 1906610 1941747
56124 1941747 1975751 2005754 2027844 2040215 2042729 2035479 2019592 1997811 1972433 1943557 1910074 1870791
56112 1870791 1823854 1767269 1701521 1630142 1556840 1483816 1413475 1349170 1292833 1243867 1201468
56101 1201468 1165991 1137103 1113078 1093079 1077691 1066185 1056077 1046715 1040395 1038307 1038264 1038167 1038774
$$ packed form
56187F15458n634n312m532l632l582l788l022j805j445j500o60O63J075Q50J318
56172E84452K314K699K759L631M876N094M444M242M551M487M365N275O999Q441
56158F48629R572J0968J2188J2646J3213J4960J7135J8459J9375K1012K3057K4719
56146H45933K6493K8880L0845L1832L3635L7796M2882M7106N1786N8943O7103
56135A303234P2919P5595P6233P4235O8236N9750N2101M6247M1086L6974L5137
56124A941747L4004L0003K2090J2371K514p250j5887k1781k5378k8876l3483l9283
56112A870791m6937n6585o5748p1379p3302p3024p0341o4305n6337m8966m2399
56101A201468l5477k8888k4025j9999j5388j1506j0108r362o320k088m3r7O07
$$ plain form
56088 1038774 1041029 1043601 1045424 1048030 1053003 1059446 1066177 1073966 1083388 1092901 1101395 1110343 1121165 1132817
56074 1132817 1144136 1156161 1169809 1183684 1196549 1209680 1224457 1239970 1255237 1271340 1289111
56063 1289111 1307239 1324881 1343508 1363902 1384134 1402918 1421993 1442590 1462612 1480212 1497228
56052 1497228 1516103 1536214 1556250 1577311 1600504 1624323 1647632 1672475 1700745 1730858 1760891
56041 1760891 1792146 1826328 1862164 1898102 1935311 1974658 2013882 2051338 2089279 2129776 2170764
56030 2170764 2210003 2249494 2291836 2335600 2378735 2423221 2471781 2523140 2575097 2629188 2687714
56019 2687714 2749303 2812024 2877666 2948273 3021850 3096343 3174378 3259045 3348558 3440199 3535822
56008 3535822 3638064 3744935 3853835 3967107 4087761 4213653 4342005 4475752 4619065
$$ packed form
56088A038774K255K572J823K606M973O443O731P789R422R513Q494Q948J0822J1652
56074A132817J1319J2025J3648J3875J2865J3131J4777J5513J5267J6103J7771
56063A289111J8128J7642J8627K0394K0232J8784J9075K0597K0022J7600J7016
56052A497228J8875K0111K0036K1061K3193K3819K3309K4843K8270L0113L0033
56041A760891L1255L4182L5836L5938L7209L9347L9224L7456L7941M0497M0988
56030B170764L9239L9491M2342M3764M3135M4486M8560N1359N1957N4091N8526
56019B687714O1589O2721O5642P0607P3577P4493P8035Q4667Q9513R1641R5623
56008C535822J02242J06871J08900J13272J20654J25892J28352J33747J43313
$$ plain form
55999 4619065 4770607 4927672 5092800 5269401 5455087 5646524 5846671 6060046 6285362
55990 6285362 6520520 6770104 7039820 7328407 7633613 7961094 8318243 8704292 9116165
55981 9116165 9559019 10040997 10562992 11124387 11733612 12402017 13133046 13929272 14804346
55972 14804346 15775913 16853710 18048645 19387542 20905506 22632267 24603088 26877147
55964 26877147 29530348 32640265 36296510 40613327 45706261 51663161 58562259 66513113
55956 66513113 75662603 86184989 98309529 112356253 128718305 147823450 170121556
55949 170121556 195998219 225493773 257952756 291864372 324902937 353969781 375343923
55942 375343923 385407467 382003566 365578647 339098942 306737072 272357067 238727800
$$ packed form
55999D619065J51542J57065J65128J76601J85686J91437K00147K13375K25316
55990F285362K35158K49584K69716K88587L05206L27481L57149L86049M11873
55981I116165M42854M81978N21995N61395O09225O68405P31029P96226Q75074
55972A4804346R71567J077797J194935J338897J517964J726761J970821K274059
55964B6877147K653201L109917L656245M316817N092934N956900O899098P950854
55956F6513113R149490J0522386J2124540J4046724J6362052J9105145K2298106
55949A70121556K5876663K9495554L2458983L3911616L3038565K9066844K1374142
55942C75343923J0063544l403901j6424919k6479705l2361870l4380005l3629267
$$ plain form
55935 238727800 207507544 179516921 154996600 133835729 115763054 100440499 87487005
55928 87487005 76518206 67201368 59265538 52475957 46630907 41578146 37205002 33409742
55920 33409742 30098295 27200315 24664655 22439630 20473886 18732017 17191180 15824172
55912 15824172 14600669 13501640 12517293 11632928 10830383 10100651 9441448 8844192 8295875
55903 8295875 7791731 7333729 6917910 6534636 6179957 5855608 5558702 5281934 5023246
55894 5023246 4785477 4566989 4361978 4169445 3992946 3831887 3681513 3541007 3413344
55885 3413344 3297393 3187929 3083166 2984860 2891358 2797912 2703884 2612858 2525805 2440647 2358152
55874 2358152 2281640 2210743 2141512 2072643 2006009 1941585 1877631 1815432 1758166 1705375 1653960
$$ packed form
55935B38727800l1220256k7990623k4520321k1160871j8072675j5322555j2953494
55928H7487005j0968799r316838p935830o789581n845050n052761m373144l795260
55920C3409742l311447k897980k535660k225025j965744j741869j540837j367008
55912A5824172j223503j099029r84347q84365q02545p29732o59203n97256n48317
55903H295875n04144m58002m15819l83274l54679l24349k96906k76768k58688
55894E023246k37769k18488k05011j92533j76499j61059j50374j40506j27663
55885C413344j15951j09464j04763r8306r3502r3446r4028r1026q7053q5158q2495
55874B358152p6512p0897o9231o8869o6634o4424o3954o2199n7266n2791n1415
$$ plain form
55863 1653960 1603987 1558061 1515616 1473502 1431698 1392894 1356817 1320579 1284329 1251066 1220963
55852 1220963 1191300 1161967 1135712 1112760 1090277 1067379 1045705 1024924 1002611 978906 956584
55841 956584 936175 915654 895076 876800 860718 843936 825797 808790 793885 779339 764740
55830 764740 751995 741489 731256 720751 711672 704369 697042 689061 681452 673661 663508 650982 638539
55817 638539 627136 615444 603364 592727 583930 575387 566855 559889 554547 549115 543708 540670 540702 541912
55803 541912 543342 546138 550555 555089 559300 564316 569833 573743 575374 575989 575476 571859 564929 557148 550014
55788 550014 542606 534601 527639 522521 517854 512477 506491 499053 488091 473387 457406 442103 427444
55775 427444 413773 402721 394678 388009 381933 377613 375361 373364 370353 367180 364617 361932 358750 355930
$$ packed form
55863A653960m9973m5926m2445m2114m1804l8804l6077l6238l6250l3263l0103
55852A220963k9663k9333k6255k2952k2483k2898k1674k0781k2313k3705k2322
55841I56584k0409k0521k0578j8276j6082j6782j8139j7007j4905j4546j4599
55830G64740j2745j0506j0233j0505r079p303p327p981p609p791j0153j2526j2443
55817F38539j1403j1692j2080j0637q797q543q532o966n342n432n407l038L2J210
55803E41912J430K796M417M534M211N016N517L910J631O15n13l617o930p781p134
55788E50014p408q005o962n118m667n377n986p438j0962j4704j5981j5303j4659
55775D27444j3671j1052q043o669o076m320k252j997l011l173k563k685l182k820
$$ plain form
55761 355930 353507 350010 344954 339824 335542 331128 325874 320588 315544 309361 301164 291950 282736 273244
55747 273244 263404 254271 246390 239055 232003 226057 221413 217215 213495 211454 211099 210767 209730 209060 209085
55732 209085 208366 206301 204431 203885 203742 203140 202874 203418 203438 201856 199608 197884 196285 194242 192584 192183
55716 192183 192374 192146 191590 190954 189684 187697 186249 186267 186964 187278 187467 188182 189186 190158 191575 193632 195297
55699 195297 195499 194333 192277 189278 185547 182135 179822 178261 176903 175843 175165 174513 173876 173809 174474 175506
55683 175506 177019 179456 182299 184440 186062 188476 191788 194620 196548 198776 201682 203806 204269 204262 204957
55668 204957 205649 205129 203327 200488 196381 191460 187328 184852 183247 181983 181949 183586 185553 186586 187242
55653 187242 188475 189931 191031 192337 194346 196098 196384 195276 193320 190387 186499 182542 178889 174579
$$ packed form
55761C55930k423l497n056n130m282m414n254n286n044o183q197r214r214r492
55747B73244r840r133p881p335p052n946m644m198l720k041l55l32j037o70K5
55732B09085p19k065j870n46j43o02k66N44K0j582k248j724j599k043j658m01
55716A92183J91k28n56o36j270j987j448J8O97L14J89P15J004R72J417K057J665
55699A95297K02j166k056k999l731l412k313j561j358j060o78o52o37o7O65J032
55683A75506J513K437K843K141J622K414L312K832J928K228K906K124M63pO95
55668B04957O92n20j802k839m107m921m132k476j605j264l4J637J967J033O56
55653A87242J233J456J100J306K009J752K86j108j956k933l888l957l653m310
$$ plain form
55639 174579 169101 163745 159769 156431 152329 147607 143410 140094 137413 135553 134651 134106 133539 133547 134430 135283
55623 135283 135522 136081 137671 139062 138681 136950 135389 134278 132848 131055 129463 127888 125773 123471 121700
55608 121700 120166 118169 116162 115234 115281 115038 113811 112036 110281 108802 107940 107923 108379 108734 108880 108815 108132
55591 108132 106687 105234 104541 104339 103964 103552 103755 104735 106298 108554 111530 114579 116970 118805 120708 123038
55575 123038 125979 129798 134348 138892 143093 147580 152923 158655 163879 168125 171008 171921 170801 168518
55561 168518 165844 162761 159248 155721 152098 147596 142337 137890 135219 133195 130364 127077 124587 122955
55547 122955 121330 119597 118334 117614 117159 117210 118097 119352 120281 120962 121680 122018 121553 120870 120787 121112 121173 120972
55529 120972 120827 120494 119730 119100 119127 119238 118606 117429 116251 114700 112094 108761 105532 102490 99372 96683
$$ packed form
55639A74579n478n356l976l338m102m722m197l316k681j860r02n45n67QQ83Q53
55623A35283K39N59J590J391l81j731j561j111j430j793j592j575k115k302j771
55608A21700j534j997k007r28M7k43j227j775j755j479q62j7M56L55J46o5o83
55591A08132j445j453o93k02l75m12K03R80J563K256K976L049K391J835J903K330
55575A23038K941L819M550M544M201M487N343N732N224M246K883R13j120k283
55561A68518k674l083l513l527l623m502n259m447k671k024k831l287k490j632
55547A22955j625j733j263p20m55N1Q87J255R29O81P18L38m65o83q3L25O1k01
55529A20972j45l33p64o30K7J11o32j177j178j551k606l333l229l042l118k689
$$ plain form
55513 96683 95154 94521 93993 93449 93070 92354 90711 88576 86859 85802 85345 85845 87186 87986 87171 85699 85232
55496 85232 85721 85884 85492 85394 85620 85310 84470 84083 84410 84726 84825 85270 86043 86393 86221 86284 86828 87329 87761 88770
55476 88770 90281 91165 90758 89680 88826 88470 88576 89068 89517 89421 88957 88731 88758 88526 87985 87524 87014 85890 84206
55457 84206 82649 81472 80417 79740 80235 82008 84167 85913 87097 87597 87112 85872 84733 84272 84311 84443
55441 84443 84435 84129 83555 83159 83317 83728 83878 83895 84242 84822 85137 85165 85312 85709 86233 86933 87745 88197 88214 88600 89801
55420 89801 90741 90128 88424 87167 86721 86176 85250 84687 84733 84754 84620 85018 86076 86940 87156 87265 87637 87810 87468
55401 87468 87129 87337 87971 88692 89383 89867 89837 89287 88487 87592 86871 87011 88342 90043 91083 91689 92745 94027
55383 94027 94350 93398 92026 90747 89323 87957 87420 87739 88062 88111 88462 89087 89026 87962 86760 85974 85133 84003
$$ packed form
55513I6683j529o33n28n44l79p16j643k135j717j057m57N00J341Q00q15j472m67
55496H5232M89J63l92r8K26l10q40l87L27L16R9M45P73L50j72O3N44N01M32J009
55476H8770J511Q84m07j078q54l56J06M92M49r6m64k26K7k32n41m61n10j124j684
55457H4206j557j177j055o77M95J773K159J746J184N00m85j240j139m61L9J32
55441H4443ql06n74l96J58M11J50J7L47N80L15K8J47L97N24P00Q12M52J7L86J201
55420H9801R40o13j704j257m46n45r26n63M6K1j34L98J058Q64K16J09L72J73l42
55401H7468l39K08O34P21O91M84l0n50q00q95p21J40J331J701J040O06J056J282
55383I4027L23r52j372j279j424j366n37L19L23M9L51O25o1j064j202p86q41j130
$$ plain form
55365 84003 83261 83281 83518 83681 84271 85292 85708 85091 84605 85341 86646 87128 86524 85628 85029 84827 85016 85373 85434
55346 85434 85193 85306 86116 87075 87629 87929 88148 87837 86675 85179 84056 83390 82948 82673 82358 81593 80572 80257
55328 80257 81070 82121 82394 82045 81866 82132 82686 83566 84726 85653 86001 86187 86664 87057 86749 85953 85448 85529 85846
55309 85846 86058 86030 85562 84516 83151 81973 81294 81144 81373 81683 81894 82318 83461 85226 86890 88026 88913
55292 88913 89921 91093 92483 94109 95316 95071 93355 91479 90550 90324 90134 90054 90355 90530 89835 88465 87345
55275 87345 86968 87093 87354 87537 87472 87192 87109 87572 88449 89452 90583 91855 92942 93559 94000 94829 96148 97444
55257 97444 98047 97621 96473 95437 95084 94968 94137 92491 90993 90344 90162 89837 89465 89401 89423 88998 88097 87231
55239 87231 86880 87138 87684 87880 87266 86121 85130 84471 83753 82948 82673 83353 84777 86616 88580 89897 89640
$$ packed form
55365H4003p42K0K37J63N90J021M16o17m86P36J305M82o04q96n99k02J89L57O1
55346H5434k41J13Q10R59N54L00K19l11j162j496j123o66m42k75l15p65j021l15
55328H0257Q13J051K73l49j79K66N54Q80J160R27L48J86M77L93l08p96n05Q1L17
55309H5846K12k8m68j046j365j178o79j50K29L10K11M24J143J765J664J136Q87
55292H8913J008J172J390J626J207k45j716j876r29k26j90q0L01J75o95j370j120
55275H7345l77J25K61J83o5k80q3M63Q77J003J131J272J087O17M41Q29J319J296
55257I7444O03m26j148j036l53j16q31j646j498o49j82l25l72o4K2m25r01q66
55239H7231l51K58N46J96o14j145r91o59p18q05k75O80J424J839J964J317k57
$$ plain form
55222 89640 88013 86411 85746 85585 85405 85546 86219 86653 86275 85848 86271 86978 86798 85866 85360 85591 85680 85133 84542
55203 84542 84498 84734 84734 84527 84494 84760 85035 84941 84470 84161 84557 85427 85940 85820 85734 86192 86741 86815 86744 87164 87934 88454
55181 88454 88640 88752 88555 87552 85924 84472 83696 83565 84003 84841 85510 85589 85650 86681 88630 90270 90702 90280
55163 90280 89861 89763 89805 89853 89927 90019 90078 90105 90168 90471 91290 92631 93983 94693 94608 94151 93809 93722 93701 93453 92813 91955
55141 91955 91340 91386 92234 93725 95335 96222 95798 94387 92912 91850 90971 90230 90108 90705 91144 90565 89299
55124 89299 88409 88377 88841 89369 89883 90415 90960 91538 92040 92174 91885 91632 91870 92424 92760 92707 92593 92750 93247 93993
55104 93993 94876 95822 96772 97508 97594 96878 95973 95745 96293 97016 97618 98262 98660 98100 96831 96374 97747 100170
55086 100170 102269 103783 105181 106304 106480 105670 104548 103602 102909 102547 102569 102801 103217 104158 105601 106659 106565
$$ packed form
55222H9640j627j602o65j61j80J41O73M34l78m27M23P07j80r32n06K31Q9n47n91
55203H4542m4K36%k07l3K66K75r4m71l09L96Q70N13j20q6M58N49P4p1M20P70N20
55181H8454J86J12j97j003j628j452p76j31M38Q38O69P9O1J031J949J640M32m22
55163I0280m19r8M2M8P4R2N9K7O3L03Q19J341J352P10q5m57l42q7k1k48o40q58
55141I1955o15M6Q48J491J610Q87m24j411j475j062q79p41j22N97M39n79j266
55124H9299q90l2M64N28N14N32N45N78N02J34k89k53K38N54L36n3j14J57M97P46
55104I3993Q83R46R50P36Q6p16r05k28N48P23O02O44L98n60j269m57J373K423
55086A00170K099J514J398J123J76q10j122r46o93l62K2K32M16R41J443J058r4
$$ plain form
55069 106565 105700 104960 104518 104019 103569 103565 103848 103941 103954 104431 105393 106295 106768 106771 106301 105632 105454 105958 106206 105267 103592
55048 103592 102305 101602 100936 100385 100453 100727 100152 98731 97595 97222 96910 96321 96221 97104 98245 98774 98786 98780 98804
55029 98804 98786 99003 99632 100442 101321 102466 103600 103769 102504 100542 98891 97789 97164 97381 98692 100325 101000
55012 101000 100289 98923 97914 97839 98759 100282 101693 102509 102947 103595 104612 105523 105809 105493 105091 105066 105431 105896
54994 105896 106364 107072 108146 109247 109935 110191 110279 110244 109970 109575 109335 109280 109273 109398 109829 110388 110748 111039 111684 112653
54974 112653 113444 113852 114172 114483 114408 113853 113442 113805 114757 115538 115688 115434 115348 115737 116264 116244 115454 114470 113921 113646
54954 113646 113136 112562 112662 113621 114724 115309 115346 114870 113534 111187 108462 106333 105294 105196 105608 106096 106433
54937 106433 106728 107271 108179 109420 111049 113023 114896 116209 117183 118461 120143 121780 123355 125504 128491
$$ packed form
55069A06565q65p40m42m99m50mK83R3J3M77R62R02M73Lm70o69j78N04K48r39j675
55048A03592j287p03o66n51O8K74n75j421j136l73l12n89j00Q83J141N29J2oK4
55029I8804j8K17O29Q10Q79J145J134J69j265j962j651j102o25K17J311J633O75
55012A01000p11j366j009p5R20J523J411Q16M38O48J017R11K86l16m02k5L65M65
54994A05896M68P08J074J101O88K56Q8l5k74l95k40n5pJ25M31N59L60K91O45R69
54974A12653P91M08L20L11p5n55m11L63R52P81J50k54q6L89N27k0p90r84n49k75
54954A13646n10n74J00R59J103N85L7m76j336k347k725k129j039r8M12M88L37
54937A06433K95N43R08J241J629J974J873J313R74J278J682J637J575K149K987
$$ plain form
54922 128491 131770 134971 138570 142901 147179 150358 152522 154547 156575 157742 157464 156101 154027 150811
54908 150811 146034 140577 136305 134233 133467 132230 129709 126518 123592 121218 119269 117793 116881 116296 115782
54893 115782 115596 116219 117547 118868 119720 120404 121455 122944 124459 125634 126540 127632 129317 131587 134145
54878 134145 136898 140033 143506 146834 149706 152403 155213 157685 158991 158824 157477 155230 152234 148891
54864 148891 145802 143237 141028 138914 136628 133832 130432 126838 123525 120561 118030 116525 116447 117012 116851
54849 116851 115641 114345 113757 113559 112995 111790 110176 108588 107532 107233 107265 107011 106508 106304 106517 106738 106838
54832 106838 107027 107081 106475 105525 105435 106749 108610 110034 111019 111804 111897 110798 109134 108144 108260 108923 109578 110128
54814 110128 110584 110922 111342 112093 112991 113483 113238 112378 111166 109787 108541 107930 108299 109369 110275 110259 109407 108584
$$ packed form
54922A28491L279L201L599M331M278L179K164K025K028J167k78j363k074l216
54908A50811m777n457m272k072p66j237k521l191k926k374j949j476r12n85n14
54893A15782j86O23J328J321Q52O84J051J489J515J175R06J092J685K270K558
54878A34145K753L135L473L328K872K697K810K472J306j67j347k247k996l343
54864A48891l089k565k209k114k286k796l400l594l313k964k531j505p8N65j61
54849A16851j210j296n88j98n64j205j614j588j056k99L2k54n03k04K13K21J00
54832A06838J89N4o06r50r0J314J861J424R85P85R3j099j664r90J16O63O55N50
54814A10128M56L38M20P51Q98M92k45q60j212j379j246o11L69J070R06j6q52q23
$$ plain form
54796 108584 108529 109242 110360 111751 113362 114816 115795 116634 117903 119454 120509 120700 120413 120123 120050 120480 121689
54779 121689 123377 124868 126079 127647 129934 132538 134933 136951 138473 139422 140341 142234 145444 149345 153421
54764 153421 157858 162702 167263 170914 173729 175734 176214 174524 171079 166872 162467 158035 153887 150224
54750 150224 146726 143048 139488 136594 134372 132464 130830 129716 129168 129034 129203 129420 129141 128033 126412
54735 126412 124829 123565 122836 123035 124251 125920 127429 128767 130174 131640 133255 135578 138978 142990 146968
54720 146968 151052 155667 160279 163490 164419 163441 161536 159371 157034 154232 150760 146984 143718 141343 139386
54705 139386 137295 135280 133890 133129 132584 132103 131702 131005 129477 127184 124761 122676 121060 120096 119918 120172
54689 120172 120340 120520 121272 122572 123529 123397 122415 121340 120546 119837 118898 117565 115809 113749 111767 110424
$$ packed form
54796A08584n5P13J118J391J611J454R79Q39J269J551J055J91k87k90p3M30J209
54779A21689J688J491J211J568K287K604K395K018J522R49R19J893L210L901M076
54764A53421M437M844M561L651K815K005M80j690l445m207m405m432m148l663
54750A50224l498l678l560k894k222j908j634j114n48j34J69K17k79j108j621
54735A26412j583j264p29J99J216J669J509J338J407J466J615K323L400M012L978
54720A46968M084M615M612L211R29r78j905k165k337k802l472l776l266k375j957
54705A39386k091k015j390p61n45m81m01o97j528k293k423k085j616r64j78K54
54689A20172J68J80P52J300R57j32r82j075p94p09r39j333j756k060j982j343
$$ plain form
54673 110424 110112 110710 111684 112620 113486 114260 114585 114212 113582 113348 113359 112833 111657 110764 110818 111253 111129 110391 109676
54654 109676 109372 109530 110302 111715 113184 113890 113655 112969 112298 111747 111311 111066 111210 112090 113922 116288 118249
54637 118249 119269 119644 119759 119515 118883 118399 118428 118438 117745 116595 115766 115410 115104 114835 115101 116066 117314 118435
54619 118435 119246 119467 118812 117510 116279 115742 116103 117179 118390 118972 118673 117977 117287 116352 115087 114402 115304
54602 115304 117426 119313 120021 119730 118971 118224 118159 119267 121030 122288 122583 122445 122329 122111 121855 122169 123264
54585 123264 124320 124293 123060 121401 120196 119874 120385 121434 122792 124373 125856 126542 126017 124839 124020 123842
54569 123842 123714 123156 122428 122100 122414 123131 123651 123373 122316 121300 121094 121514 121796 121658 121482 121667 122384 123749
54551 123749 125519 126843 127091 126800 127065 128075 129108 129826 130566 131308 131469 131012 130782 131302 132018 132184 131782
$$ packed form
54673A10424l12N98R74R36Q66P74L25l73o30k34J1n26j176q93N4M35j24p38p15
54654A09676l04J58P72J413J469P06k35o86o71n51m36k45J44Q80J832K366J961
54637A18249J020L75J15k44o32m84K9J0o93j150q29l56l06k69K66R65J248J121
54619A18435Q11K21o55j302j231n37L61J076J211N82k99o96o90r35j265o85R02
54602A15304K122J887P08k91p59p47o5J108J763J258K95j38j16k18k56L14J095
54585A23264J056k7j233j659j205l22N11J049J358J581J483O86n25j178q19j78
54569A23842j28n58p28l28L14P17N20k78j057j016k06M20K82j38j76J85P17J365
54551A23749J770J324K48k91K65J010J033P18P40P42J61m57k30N20P16J66m02
$$ plain form
54534 131782 131185 130641 130437 130857 131493 131304 129897 128173 127189 126964 126885 126671 126298 125529 124343 123460 123719 125019
54516 125019 126449 127382 127860 127967 127385 125788 123435 121237 120241 120997 123256 126160 128640 129802 129406 128289
54500 128289 127868 128630 129407 128847 127334 126561 127202 128111 128079 127352 126832 126622 126186 125393 124656 124339 124624 125691
54482 125691 127431 129203 130384 131019 131527 131969 132067 131807 131575 131709 132196 132802 133296 133631 133985 134540 135163 135627
54464 135627 136102 137037 138400 139504 139798 139456 138979 138611 138394 138305 138048 137158 135668 134305 133626 133393 133159 133023
54446 133023 133303 133881 134404 134837 135257 135359 134786 133806 133104 132948 133035 133062 132918 132412 131394 130269 129864 130560 131891
54427 131891 133092 133745 133753 133115 132114 131490 131989 133588 135389 136454 136694 136757 137159 137830 138559 139418 140357 140760
54409 140760 140080 138867 138485 139600 141456 142944 143864 144761 145929 147125 148101 148893 149532 149832 149620 149061 148611
$$ packed form
54534A31782n97n44k04M20O36j89j407j724r84k25p9k14l73p69j186q83K59J300
54516A25019J430R33M78J07n82j597k353k198r96P56K259K904K480J162l96j117
54500A28289m21P62P77n60j513p73O41R09l2p27n20k10m36p93p37l17K85J067
54482A25691J740J772J181O35N08M42R8k60k32J34M87O06M94L35L54N55O23M64
54464A35627M75R35J363J104K94l42m77l68k17q9k57q90j490j363o79k33k34j36
54446A33023K80N78N23M33M20J02n73r80p02j56Q7K7j44n06j018j125m05O96J331
54427A31891J201O53Qo38j001o24M99J599J801J065K40O3M02O71P29Q59R39M03
54409A40760o80j213l82J115J856J488R20Q97J168J196R76P92O39L00k12n59m50
$$ plain form
54392 148611 148591 148793 148668 148025 147372 147306 147743 148139 148267 148259 147940 146839 145007 143222 142104 141545 141283 141448 142146
54373 142146 143036 143829 144781 146193 147743 148849 149411 149662 149583 149066 148484 148454 149059 149842 150647 151883 153810 156033
54355 156033 157941 159371 160539 161608 162621 163748 165228 166974 168476 169298 169625 170113 171193 172669 174019
54340 174019 174824 174821 173922 172485 171286 170763 170387 169208 166931 164120 161414 159056 157073 155449 154030 152715
54324 152715 151822 151771 152377 152918 152978 152698 152195 151358 150394 149928 150206 150672 150628 149889 148600 146960 145377 144306
54306 144306 143573 142392 140455 138495 137351 136936 136618 136169 135840 135843 136263 137188 138474 139622 140253 140513 140715
54289 140715 140968 141427 142419 143870 145045 145356 145089 144888 144907 144967 145142 145548 145859 145638 145023 144610 144865 146054
54271 146054 148375 151537 154434 155940 155980 155317 154511 153598 152665 151984 151569 151121 150520 149975 149719 149892 150686 152228
$$ packed form
54392A48611k0K02j25o43o53o6M37L96J28ql19j101j832j785j118n59k62J65O98
54373A42146Q90P93R52J412J550J106N62K51p9n17n82l0O05P83Q05J236J927K223
54355A56033J908J430J168J069J013J127J480J746J502Q22L27M88J080J476J350
54340A74019Q05lq99j437j199n23l76j179k277k811k706k358j983j624j419j315
54324A52715q93n1O06N41O0k80n03q37r64m66K78M66m4p39j289j640j583j071
54306A44306p33j181j937j960j144m15l18m49l29LM20R25J286J148O31K60K02
54289A40715K53M59R92J451J175L11k67k01J9O0J75M06L11k21o15m13K55J189
54271A46054K321L162K897J506M0o63q06r13r33o81m15m48o01n45k56J73P94J542
$$ plain form
54253 152228 154293 156461 158450 160018 160823 160796 160456 160357 160346 159874 158898 157913 157156 156329 155150 153690 152051
54236 152051 150181 148150 146265 144792 143800 143324 143355 143659 143881 143926 144032 144488 145410 146748 148301 149778 150974
54219 150974 151828 152259 152211 151955 151988 152400 152705 152595 152506 152994 153944 154866 155652 156462 157114 157243 156946 156670 156451 155838
54199 155838 154600 153071 151719 150751 150149 149738 149210 148438 147762 147645 148047 148410 148174 147157 145653 144397 144175
54182 144175 145068 146267 146957 147059 146774 145929 144456 143107 142815 143410 143780 143354 142686 142504 142881 143581 144562 145759
54164 145759 146746 147027 146551 145802 145439 145745 146282 146261 145556 145040 145500 146537 147039 146537 145506 144524 143873 143868 144804
54145 144804 146418 148044 149391 150622 151606 151818 151218 150605 150723 151431 152053 152238 152170 152210 152466 152589 152041 150827
54127 150827 149804 149821 150685 151456 151681 151718 151850 151842 151599 151649 152534 154074 155510 156152 155809 154932 154432 154959 156189
$$ packed form
54253A52228K065K168J989J568Q05k7l40r9j1m72r76r85p57q27j179j460j639
54236A52051j870k031j885j473r92m76L1L04K22M5J06M56R22J338J553J477J196
54219A50974Q54M31m8k56L3M12L05j10q9M88R50R22P86Q10O52J29k97k76k19o13
54199A55838j238j529j352r68o02m11n28p72o76j17M02L63k36j017j504j256k22
54182A44175Q93J199O90J02k85q45j473j349k92N95L70m26o68j82L77P00R81J197
54164A45759R87K81m76p49l63L06N37k1p05n16M60J037N02n02j031r82o51nR36
54145A44804J614J626J347J231R84K12o00o13J18P08O22J85o8M0K56J23n48j214
54127A50827j023J7Q64P71K25L7J32qk43N0Q85J540J436O42l43q77n00N27J230
$$ plain form
54108 156189 157109 157060 156286 155504 155309 155905 156970 157798 158012 158034 158393 158755 158352 157305 156707 157198 158201 158876
54090 158876 159193 159638 160379 161128 161546 161462 160892 160013 158939 157638 156374 156001 157160 159296 161231 162759 164856
54073 164856 168117 171779 174679 176462 177510 178297 179198 180385 181530 182154 182585 184010 187218 191941 197680
54058 197680 204434 212027 219403 225302 229247 231380 231817 230762 228803 226480 223874 221082 218695 217268
54044 217268 216709 216745 217543 219230 221250 223056 225198 228872 234400 240804 246899 252163 256583 260327 263777
54029 263777 267395 271299 275221 278976 282622 286104 289052 291114 292322 293018 293529 293948 294168 294081 293701 292957
54013 292957 291407 288471 284052 278740 273287 268083 263156 258427 253826 249434 245566 242377 239363 235700
53999 235700 231266 226912 223558 221462 220473 220359 220570 220269 219132 217699 216540 215504 214198 212695 211229
$$ packed form
54108A56189R20m9p74p82j95N96J065Q28K14K2L59L62m03j047n98M91J003O75
54090A58876L17M45P41P49M18q4n70q79j074j301j264l73J159K136J935J528K097
54073A64856L261L662K900J783J048P87R01J187J145O24M31J425L208M723N739
54058A97680O754P593P376N899L945K133M37j055j959k323k606k792k387j427
54044B17268n59L6P98J687K020J806K142L674N528O404O095N264M420L744L450
54029B63777L618L904L922L755L646L482K948K062J208O96N11M19K20q7l80p44
54013B92957j550k936m419n312n453n204m927m729m601m392l868l189l014l663
53999B35700m434m354l354k096r89j14K11l01j137j433j159j036j306j503j466
$$ plain form
53984 211229 209653 207856 206361 205855 206291 207026 207608 207982 208226 208673 210017 212618 215938 219234 222550 226241
53968 226241 229730 231731 231869 231282 231301 232077 232789 232685 231598 229786 227594 225220 222755 220517 219104 218725
53952 218725 218685 218053 216820 215905 216031 217105 218747 220796 223147 225571 228039 230841 234138 237698 241260
53937 241260 244843 248541 252372 256544 261471 267170 272959 278091 282523 286767 291180 295852 301050 307223
53923 307223 314327 321509 327823 333232 338599 344711 351682 359487 368634 379709 392347 405349 418022
53910 418022 430852 444441 458244 470820 480915 487631 489864 486627 478293 466911 454934 443875
53898 443875 434214 425925 418635 411669 404576 397568 391029 384679 377635 369384 360356 351455 343226 335652
53884 335652 328506 321649 315095 309027 303753 299396 295583 291703 287549 283436 279521 275305 270204 264433
$$ packed form
53984B11229j576j797j495n06M36P35N82L74K44M47J344K601L320L296L316L691
53968B26241L489K001J38n87J9P76P12j04j087j812k192k374k465k238j413l79
53952B18725m0o32j233r15J26J074J642K049K351K424K468K802L297L560L562
53937B41260L583L698L831M172M927N699N789N132M432M244M413M672N198O173
53923C07223P104P182O314N409N367O112O971P805R147J1075J2638J3002J2673
53910D18022J2830J3589J3803J2576J0095O716K233l237q334j1382j1977j1059
53898D43875r661q289p290o966p093p008o539o350p044q251r028q901q229p574
53884C35652p146o857o554o068n274m357l813l880m154m113l915m216n101n771
$$ plain form
53870 264433 258882 254130 250000 246168 242738 240001 237932 236180 234350 232142 229512 226839 224674 223066
53856 223066 221465 219487 217462 215836 214352 212354 209816 207559 206283 205747 205085 203802 202350 201729 202517
53841 202517 204214 205638 206023 205638 205305 205455 205790 205764 205220 204596 204530 205201 206092 206584 206700 206989 207693 208463 209011
53822 209011 209546 210293 210977 211184 211047 211165 212002 213544 215415 217084 218220 219097 220489 222927 226254 230038
53806 230038 234093 238332 242543 246735 251430 257145 263691 270347 276538 282029 286717 290692 294368 298130
53792 298130 301909 305364 308253 310350 311307 311092 310358 309821 309373 308300 306185 303160 299407 295061 290552
53777 290552 286407 282577 278444 273636 268486 263648 259625 256610 254298 251860 248549 244461 240296 236440
53763 236440 232743 229208 226251 224067 222300 220587 218975 217514 215888 213856 211721 209931 208386 206548
$$ packed form
53870B64433n551m752m130l832l430k737k069j752j830k208k630k673k165j608
53856B23066j601j978k025j626j484j998k538k257j276n36o62j283j452o21P88
53841B02517J697J424L85l85l33J50L35k6n44o24o6O71Q91M92J16K89P04P70N48
53822B09011N35P47O84K07j37J18Q37J542J871J669J136Q77J392K438L327L784
53806B30038M055M239M211M192M695N715O546O656O191N491M688L975L676L762
53792B98130L779L455K889K097R57k15p34n37m48j073k115l025l753m346m509
53777B90552m145l830m133m808n150m838m023l015k312k438l311m088m165l856
53763B36440l697l535k957k184j767j713j612j461j626k032k135j790j545j838
$$ plain form
53749 206548 204177 201660 199570 198155 197310 196903 196962 197472 198095 198367 198257 198268 198751 199354 199494 199214 199142 199616
53731 199616 200291 200722 200971 201503 202692 204510 206539 208292 209705 211254 213334 215614 217396 218494 219312
53716 219312 220004 220172 219655 219161 219691 221578 224386 227584 230924 234220 237152 239471 241300 243096 245246
53701 245246 247738 250250 252553 254729 257021 259603 262540 265819 269269 272580 275444 277600 278818 279119
53687 279119 279044 279241 279626 279365 277943 275855 273951 272580 271789 271754 272356 272719 272045 270726 269878 269851 269978 269705
53669 269705 269130 268342 267134 265647 264527 264081 263896 263635 263527 263643 263332 261983 259957 258142 256887 255925
53653 255925 255147 254864 255299 256274 257441 258497 259184 259410 259450 259807 260721 261900 262855 263444 264050 265190 267030
53636 267030 269306 271645 273810 275669 277204 278575 279992 281423 282737 284181 286241 288821 291137 292878
$$ packed form
53749B06548k371k517k090j415q45m07N9N10O23K72j10J1M83O03J40k80p2M74
53731A99616O75M31K49N32J189J818K029J753J413J549K080K280J782J098Q18
53716B19312O92J68n17m94N30J887K808L198L340L296K932K319J829J796K150
53701B45246K492K512K303K176K292K582K937L279L450L311K864K156J218L01
53687B79119p5J97L85k61j422k088j904j371p91l5O02L63o74j319q48k7J27k73
53669B69705n75p88j208j487j120m46j85k61j08J16l11j349k026j815j255r62
53653B55925p78k83M35R75J167J056O87K26M0L57R14J179R55N89O06J140J840
53636B67030K276K339K165J859J535J371J417J431J314J444K060K580K316J741
$$ plain form
53622 292878 294885 298041 301929 305403 308170 310878 313806 316559 319157 322376 326558 330904 334513 337503
53608 337503 340606 344148 347894 351540 354915 358001 361056 364505 368477 372736 377128 381655 385990 389522
53594 389522 392218 394878 398096 401388 403754 404740 404541 403463 401731 399554 396959 393772 390105 386556 383543
53579 383543 380663 377149 372809 368206 364038 360656 357998 355694 353349 350976 348997 347720 347029 346726 346850
53564 346850 347381 347949 348113 347732 346897 345833 345068 345220 346255 347312 347682 347640 347817 348135 348041 347683 348107 350028
53546 350028 352802 354969 355728 355742 356500 358921 362587 366317 369371 371984 374899 378730 383731 389757 396375
53531 396375 403260 410576 418646 427231 435643 443645 451848 460998 471241 482215 493463 504697 516094
53518 516094 528454 542473 557717 572889 587364 601869 617400 634194 652158 671462 692038
$$ packed form
53622B92878K007L156L888L474K767K708K928K753K598L219M182M346L609K990
53608C37503L103L542L746L646L375L086L055L449L972M259M392M527M335L532
53594C89522K696K660L218L292K366R86j99j078j732k177k595l187l667l549l013
53579C83543k880l514m340m603m168l382k658k304k345k373j979j277o91l03J24
53564C46850N31N68J64l81q35j064p65J52J035J057L70m2J77L18r4l58M24J921
53546C50028K774K167P59J4P58K421L666L730L054K613K915L831N001O026O618
53531C96375O885P316Q070Q585Q412Q002Q203R150J0243J0974J1248J1234J1397
53518E16094J2360J4019J5244J5172J4475J4505J5531J6794J7964J9304K0576
$$ plain form
53507 692038 713065 733724 754120 774895 796277 818043 839945 861570 882210 901547 920121
53496 920121 938476 956288 972979 988796 1004501 1020367 1036344 1052831 1070235 1087911 1104626
53485 1104626 1120132 1135311 1150636 1165491 1179416 1193133 1207759 1223534 1239777 1255660 1270518
53474 1270518 1283706 1294665 1303229 1309683 1314449 1317623 1318816 1317586 1314090 1308958 1302368 1293817 1283185
53461 1283185 1271414 1259411 1246795 1232681 1217389 1202262 1187768 1172892 1156630 1139167 1121238
53450 1121238 1103208 1085210 1067422 1049758 1031927 1014214 997447 981810 966443 950836 935913
53439 935913 922958 912090 902637 894530 888339 884149 881398 879784 879392 879847 880317 880765 882384 886184 891701
53424 891701 897735 904014 911360 920345 930562 941385 952863 965508 979624 995275 1012617 1031688
$$ packed form
53507F92038K1027K0659K0396K0775K1382K1766K1902K1625K0640J9337J8574
53496I20121J8355J7812J6691J5817J5705J5866J5977J6487J7404J7676J6715
53485A104626J5506J5179J5325J4855J3925J3717J4626J5775J6243J5883J4858
53474A270518J3188J0959Q564O454M766L174J193j230l496n132o590q551j0632
53461A283185j1771j2003j2616j4114j5292j5127j4494j4876j6262j7463j7929
53450A121238j8030j7998j7788j7664j7831j7713j6767j5637j5367j5607j4923
53439I35913j2955j0868r453q107o191m190k751j614l92M55M70M48J619L800N517
53424H91701O034O279P346Q985J0217J0823J1478J2645J4116J5651J7342J9071
$$ plain form
53412 1031688 1051976 1072716 1093761 1115771 1139406 1164683 1191209 1218665 1246830 1275572 1305185
53401 1305185 1336533 1370528 1407532 1447356 1489496 1533166 1577568 1622585 1668937 1717154 1766686
53390 1766686 1816464 1866047 1915603 1964959 2013468 2060795 2107134 2152491 2196345 2238225 2278031
53379 2278031 2315538 2350182 2381703 2410553 2437187 2461147 2481247 2496576 2507068 2513220 2515447 2513638
53367 2513638 2507134 2495186 2477515 2454405 2426354 2393845 2357403 2317590 2274869 2229757 2183162
53356 2183162 2136206 2089545 2043047 1996377 1949698 1903639 1858745 1815230 1773311 1733508 1696324
53345 1696324 1661465 1627522 1592824 1556774 1520188 1484239 1449440 1415869 1383900 1354179 1327048
53334 1327048 1302494 1280413 1260461 1241886 1224188 1207907 1194035 1182597 1172410 1162354 1152196
$$ packed form
53412A031688K0288K0740K1045K2010K3635K5277K6526K7456K8165K8742K9613
53401A305185L1348L3995L7004L9824M2140M3670M4402M5017M6352M8217M9532
53390A766686M9778M9583M9556M9356M8509M7327M6339M5357M3854M1880L9806
53379B278031L7507L4644L1521K8850K6634K3960K0100J5329J0492O152K227j809
53367B513638o504j1948j7671k3110k8051l2509l6442l9813m2721m5112m6595
53356B183162m6956m6661m6498m6670m6679m6059m4894m3515m1919l9803l7184
53345A696324l4859l3943l4698l6050l6586l5949l4799l3571l1969k9721k7131
53334A327048k4554k2081j9952j8575j7698j6281j3872j1438j0187j0056j0158
$$ plain form
53323 1152196 1141979 1131336 1119820 1107484 1094767 1082207 1070569 1060707 1052830 1046156 1039709 1033281
53311 1033281 1027428 1022826 1019908 1018748 1018928 1019795 1021140 1023417 1027026 1031780 1037463 1044498 1053519 1064463
53297 1064463 1076654 1089745 1104101 1120244 1138344 1158312 1180007 1203115 1227054 1251177 1275030
53286 1275030 1298400 1321157 1343096 1363897 1383243 1400938 1416842 1430770 1442660 1452759 1461320
53275 1461320 1468020 1472025 1472821 1470723 1466380 1460064 1451649 1441010 1428105 1412862 1395384 1376220 1356098
53262 1356098 1335330 1313667 1290755 1266539 1241259 1215274 1188960 1162665 1136645 1111029 1085852
53251 1085852 1061171 1037181 1014131 992000 970321 948511 926412 904334 882639 861464 840818
53240 840818 820672 800893 781369 762198 743568 725548 708273 692207 677728 664500 651872
$$ packed form
53323A152196j0217j0643j1516j2336j2717j2560j1638r862p877o674o447o428
53311A033281n853m602k918j160J80Q67J345K277L609M754N683P035R021J0944
53297A064463J2191J3091J4356J6143J8100J9968K1695K3108K3939K4123K3853
53286A275030K3370K2757K1939K0801J9346J7695J5904J3928J1890J0099Q561
53275A461320O700M005P96k098m343o316q415j0639j2905j5243j7478j9164k0122
53262A356098k0768k1663k2912k4216k5280k5985k6314k6295k6020k5616k5177
53251A085852k4681k3990k3050k2131k1679k1810k2099k2078k1695k1175k0646
53240H40818k0146j9779j9524j9171j8630j8020j7275j6066j4479j3228j2628
$$ plain form
53229 651872 639973 629755 621625 614634 607481 599830 592128 584554 576739 568252 558785 548106 536381
53216 536381 524440 513125 502376 491393 479676 467524 455610 444544 434801 426557 419411 412642
53204 412642 405815 398900 391885 384738 377773 371558 366221 361174 355705 349581 342943 335970 328892 322123
53190 322123 316048 310733 305969 301553 297427 293648 290332 287537 285149 282968 280906 278979 277102 275111
53176 275111 273047 271204 269753 268459 266964 265246 263628 262349 261279 260099 258686 257237 256025 255040
53162 255040 253993 252735 251641 251337 251907 252502 251984 250023 247405 245158 243571 242237 240893 239774 239104
53147 239104 238657 238154 237821 238109 238943 239673 239793 239372 238697 237851 236844 235844 235107 234787 235002 235840 237142 238445
53129 238445 239304 239540 239127 238143 236996 236395 236773 237881 239222 240659 242317 244026 245309 245974 246374 246977
$$ packed form
53229F51872j1899j0218q130o991p153p651p702p574p815q487r467j0679j1725
53216E36381j1941j1315j0749j0983j1717j2152j1914j1066r743q244p146o769
53204D12642o827o915p015p147o965o215n337n047n469o124o638o973p078o769
53190C22123o075n315m764m416m126l779l316k795k388k181k062j927j877j991
53176B75111k064j843j451j294j495j718j618j279j070j180j413j449j212r85
53162B55040j047j258j094l04N70N95n18j961k618k247j587j334j344j119o70
53147B39104m47n03l33K88Q34P30J20m21o75q46j007j000p37l20K15Q38J302J303
53129B38445Q59K36m13r84j147o01L78J108J341J437J658J709J283O65M00O03
$$ plain form
53113 246977 247832 248569 248793 248417 247704 247037 246631 246413 246130 245483 244278 242669 241248 240573 240506 240255 239229 237626
53095 237626 236015 234635 233386 232256 231374 230810 230632 231031 232031 233188 233931 234184 234354 234691 235032 235168 235126
53078 235126 234974 234730 234662 235371 237229 239774 241922 242907 242950 242873 243068 242968 241758 239473 237092 235434 234358
53061 234358 233283 232107 231139 230358 229334 227959 226815 226624 227595 229376 231409 233203 234500 235350 235884 236029
53045 236029 235612 234721 233682 232675 231642 230657 230025 229836 229747 229407 228914 228576 228458 228447 228577 228920 229205 228928
53027 228928 227922 226575 225457 224975 225420 226894 228966 230683 231363 231289 231225 231352 231138 230358 229687 229916 230924
53010 230924 231909 232484 233047 234161 235941 238039 239802 240488 239837 238555 237771 237865 238245 238361 238319 238256 237841 236931
52992 236931 236197 236376 237242 238026 238596 239399 240362 240800 240592 240632 241661 243252 244431 244904 245201 245912 247208 248972
$$ packed form
53113B46977Q55P37K24l76p13o67m06k18k83o47j205j609j421o75o7k51j026j603
53095B37626j611j380j249j130q82n64j78L99J000J157P43K53J70L37L41J36m2
53078B35126j52k44o8P09J858K545K148R85M3p7J95j00j210k285k381j658j076
53061B34358j075j176r68p81j024j375j144j91R71J781K033J794J297Q50N34J45
53045B36029m17q91j039j007j033r85o32j89q9l40m93l38j18j1J30L43K85k77
53027B28928j006j347j118m82M45J474K072J717O80p4o4J27k14p80o71K29J008
53010B30924R85N75N63J114J780K098J763O86o51j282p84R4L80J16m2o3m15r10
52992B36931p34J79Q66P84N70Q03R63M38k08M0J029J591J179M73K97P11J296J764
$$ plain form
52974 248972 250989 253047 255087 257198 259365 261445 263531 266078 269295 272607 275088 276369 276839 276974 276861
52959 276861 276396 275553 274277 272375 269838 267158 265017 263574 262228 260238 257512 254655 252195 249975 247424
52944 247424 244369 241353 239080 237725 236934 236386 236181 236612 237706 239097 240319 241160 241704 242062 242140 241729 240854
52927 240854 239936 239493 239652 240012 240065 239678 239105 238596 238130 237569 236877 236087 235191 234278 233759 234154 235514 237118
52909 237118 237873 237084 234922 232334 230471 230004 230746 231870 232536 232408 231726 231049 230920 231588 232927 234630 236416
52892 236416 238009 239055 239336 239119 239031 239441 240051 240251 239796 239120 238987 239755 240916 241431 240772 239552 238845 238955
52874 238955 239283 239448 239978 241555 243962 246276 247956 249325 250970 252979 254870 256136 256773 257284 258067 258863
52858 258863 259036 258431 257590 256974 256309 255047 253186 251247 249585 248118 246602 244782 242345 239145 235572
$$ packed form
52974B48972K017K058K040K111K167K080K086K547L217L312K481J281M70J35j13
52959B76861m65q43j276j902k537k680k141j443j346j990k726k857k460k220k551
52944B47424l055l016k273j355p91n48k05M31J094J391J222Q41N44L58P8m11q75
52927B40854r18m43J59L60N3l87n73n09m66n61o92p90q96r13n19L95J360J604
52909B37118P55p89k162k588j863m67P42J124O66j28o82o77j29O68J339J703J786
52892B36416J593J046K81k17q8M10O10K00m55o76j33P68J161N15o59j220p07J10
52874B38955L28J65N30J577K407K314J680J369J645K009J891J266O37N11P83P96
52858B58863J73o05q41o16o65j262j861j939j662j467j516j820k437l200l573
$$ plain form
52843 235572 232376 229965 228087 226284 224504 223198 222862 223495 224481 225064 225012 224686 224456 224322 224218 224330 224811
52826 224811 225433 225854 225982 225725 224697 222709 220491 219311 219732 221101 222296 222649 222124 221138 220430 220718 222139
52809 222139 224114 225891 227096 227708 227750 227184 225995 224257 222209 220269 218843 218014 217463 216778 215831 214895
52793 214895 214362 214242 213970 212950 211326 209931 209399 209604 210090 210574 210803 210525 210076 210458 212108 213965 214617
52776 214617 214173 214105 215269 216991 218266 218963 219427 219674 219568 219294 219123 218997 218737 218443 218314 218334 218417 218640 219047
52757 219047 219422 219488 219183 218631 218021 217584 217448 217455 217395 217470 218124 219468 221292 223630 226635 229761 231815 232299
52739 232299 232083 232252 232822 233183 233341 233950 235341 237186 239024 240555 241501 241738 241652 241909 242711 243501 243470 242204
52721 242204 239961 237509 235523 233950 232173 229941 227822 226448 225758 225386 225388 225897 226344 225850 224451 223243
$$ packed form
52843B35572l196k411j878j803j780j306l36O33R86N83n2l26k30j34j04J12M81
52826B24811O22M21J28k57j028j988k218j180M21J369J195L53n25r86p08K88J421
52809B22139J975J777J205O12M2n66j189j738k048j940j426q29n51o85r47r36
52793B14895n33j20k72j020j624j395n32K05M86M84K29k78m49L82J650J857O52
52776B14617m44o8J164J722J275O97M64K47j06k74j71j26k60k94j29K0Q3K23M07
52757B19047L75O6l05n52o10m37j36Po0P5O54J344J824K338L005L126K054M84
52739B32299k16J69N70L61J58O09J391J845J838J531R46K37q6K57Q02P90l1j266
52721B42204k243k452j986j573j777k232k119j374o90l72KN09M47m94j399j208
$$ plain form
52705 223243 223121 223935 225008 225956 226711 227209 227481 227743 228090 228272 228095 227909 228405 229892 231926 233703 234797
52688 234797 235507 236429 237708 238847 239351 239356 239377 239592 239767 239816 240031 240659 241556 242412 243014 243154 242568 241281 239845
52669 239845 238980 238939 239389 239805 239847 239423 238630 237719 236968 236459 236057 235726 235815 236806 238678 240737 242281 243358
52651 243358 244560 246069 247257 247366 246321 244668 242928 241319 239982 239123 238878 239190 239874 240704 241452 241942
52635 241942 242102 242014 242011 242631 244159 246116 247578 248162 248466 249278 250615 251837 252386 252063 250826 248868 246818
52618 246818 245320 244392 243579 242772 242409 242757 243434 243888 243998 243960 243787 243199 241949 240199 238656 238228 239194 240662
52600 240662 241259 240570 239580 239551 240734 242470 244193 245910 247830 249939 252007 253780 255095 255938 256373 256390
52584 256390 255962 255337 255073 255481 256205 256608 256544 256434 256643 257137 257797 258653 259636 260413 260733 260743 260690 260516 260051 259480
$$ packed form
52705B23243j22Q14J073R48P55M98K72K62L47J82j77j86M96J487K034J777J094
52688B34797P10R22J279J139N04NK1K15J75M9K15O28Q97Q56O02J40n86j287j436
52669B39845q65m1M50M16M2m24p93r11p51n09m02l31Q9R91J872K059J544J077
52651B43358J202J509J188J09j045j653j740j609j337q59k45L12O84Q30P48M90
52635B41942J60q8lO20J528J957J462N84L04Q12J337J222N49l23j237j958k050
52618B46818j498r28q13q07l63L48O77M54J10l8j73n88j250j750j543m28R66J468
52600B40662N97o89r90k9J183J736J723J717J920K109K068J773J315Q43M35J7
52584B56390m28o25k64M08P24M03o4j10K09M94O60Q56R83P77L20J0n3j74m65n71
$$ plain form
52564 259480 259195 259200 259034 258410 257532 256589 255286 253296 250977 249189 248359 248102 247852 247517 247308 247275 247303 247395 247601
52545 247601 247732 247518 247102 247054 247676 248475 248599 247783 246716 246399 247255 248867 250431 251306 251309 250743 250294 250642 251909
52526 251909 253498 254619 254979 254840 254512 254052 253555 253463 254299 256127 258465 260797 263031 265394 267991 270647
52510 270647 273191 275710 278350 280966 283189 284827 285985 286734 286913 286350 285026 282904 279978 276717 274048
52495 274048 272407 271043 268862 265776 262630 259921 257412 255141 253923 254287 255459 256123 255935 255781 256673
52480 256673 258800 261534 263939 265335 265761 265902 266411 267333 268342 269297 270352 271674 273315 275202 277086
52465 277086 278722 280322 282446 285156 287649 289227 290242 291431 292531 292363 290337 287195 284051 281309
52451 281309 278759 276250 273825 271503 269254 267087 265026 263182 261874 261358 261360 261247 260871 260808 261485 262397 262646
$$ packed form
52564B59480k85Nj66o24q78r43j303j990k319j788q30k57k50l35k09l3K8R2K06
52545B47601J31k14m16m8O22P99J24q16j067l17Q56J612J564Q75Ln66m49L48J267
52526B51909J589J121L60j39l28m60m97r2Q36J828K338K332K234K363K597K656
52510B70647K544K519K640K616K223J638J158P49J79n63j324k122k926l261k669
52495B74048j641j364k181l086l146k709k509k271j218L64J172O64j88j54Q92
52480B56673K127K734K405J396M26J41N09R22J009R55J055J322J641J887J884
52465B77086J636J600K124K710K493J578J015J189J100j68k026l142l144k742
52451B81309k550k509k425k322k249k167k061j844j308n16Kj13l76o3O77R12K49
$$ plain form
52434 262646 262076 261416 261316 261592 261596 261041 260206 259435 258708 257935 257403 257550 258222 258656 258531 258686 260235 263164 266380
52415 266380 269080 271436 273836 276309 279047 282871 288485 295645 303659 312486 322597 333693 344170
52402 344170 352094 356422 357149 354703 349614 342613 334648 326589 318957 311987 305872 300836 296936 293950
52388 293950 291641 290060 289381 289395 289469 289137 288551 288178 288252 288765 289812 291622 294228 297349 300644 303891 306972
52371 306972 309902 312957 316516 320612 324775 328404 331249 333463 335286 336798 337904 338439 338326 337727 337046
52356 337046 336672 336698 336874 336878 336654 336524 336988 338318 340304 342456 344534 346803 349634 352922 356153 359110 362280
52339 362280 366352 371424 377004 382720 388747 395454 402925 411048 419902 429701 440410 451648 463138
52326 463138 475114 488206 502917 519231 536713 554931 573713 592951 612246 630967 648755
$$ packed form
52434B62646n70o60j00K76Mn55q35p71p27p73n32J47O72M34j25J55J549K929L216
52415B66380K700K356K400K473K738L824N614P160Q014Q827J0111J1096J0477
52402C44170P924M328P27k446n089p001p965q059p632o970o115n036l900k986
52388B93950k309j581o79J4P4l32n86l73P4N13J047J810K606L121L295L247L081
52371C06972K930L055L559M096M163L629K845K214J823J512J106N35j13n99o81
52356C37046l74K6J76Mk24j30M64J330J986K152K078K269K831L288L231K957L170
52339C62280M072N072N580N716O027O707P471Q123Q854R799J0709J1238J1490
52326D63138J1976J3092J4711J6314J7482J8218J8782J9238J9295J8721J7788
$$ plain form
52315 648755 665858 682842 700058 717521 735221 753282 771755 790357 808530 825833 842284
52304 842284 858332 874413 890562 906469 921873 936638 950416 962537 972500 980446 986807 991508
52292 991508 993821 993128 989670 984367 977996 970640 961974 952087 941974 933060 926104 920686 915888 911387
52278 911387 907689 905387 904505 904682 905712 907757 911182 916348 923447 932291 942240 952552 962914 973591
52264 973591 984983 997096 1009610 1022393 1035722 1049822 1064426 1079002 1093286 1107249 1120657
52253 1120657 1133139 1144785 1156082 1166966 1176368 1183222 1187576 1190090 1190643 1188213 1182313 1173870 1164330
52240 1164330 1154321 1143653 1132318 1120863 1109720 1098627 1087062 1075135 1063791 1053958 1045587 1037704
52228 1037704 1029404 1020596 1011685 1002831 993930 985238 977530 971445 966983 963808 961757 960758 960481 960597 961409
$$ packed form
52315F48755J7103J6984J7216J7463J7700J8061J8473J8602J8173J7303J6451
52304H42284J6048J6081J6149J5907J5404J4765J3778J2121R963P946O361M701
52292I91508K313o93l458n303o371p356q666r887j0113q914o956n418m798m501
52278I11387l698k302q82J77J030K045L425N166P099Q844R949J0312J0362J0677
52264I73591J1392J2113J2514J2783J3329J4100J4604J4576J4284J3963J3408
52253A120657J2482J1646J1297J0884R402O854M354K514N53k430n900q443r540
52240A164330j0009j0668j1335j1455j1143j1093j1565j1927j1344r833q371p883
52228A037704q300q808q911q854q901q692p708o085m462l175k051r99k77J16Q12
$$ plain form
52213 961409 963743 967893 972978 977756 982025 986700 992382 998350 1003385 1007268 1010878 1014881 1018963 1022572
52199 1022572 1025870 1029531 1033947 1039029 1044614 1050631 1056921 1063187 1069065 1074070 1077628 1079520 1080207 1080393
52185 1080393 1080208 1079008 1076025 1071100 1064847 1058214 1051697 1044927 1037239 1028751 1020456 1013028 1006042 998894
52171 998894 992034 986563 982835 980283 978610 978267 979503 981620 983622 985210 986825 989038 992103 995767
52157 995767 999336 1002188 1004323 1006025 1007060 1006861 1005657 1004687 1004791 1005445 1005790 1006091 1007322 1009549 1011608 1012512
52141 1012512 1012469 1012296 1012381 1012597 1012862 1013338 1014166 1015355 1017054 1019793 1024334 1031223 1040417 1051441 1064019 1078572
52125 1078572 1095950 1116532 1139637 1163980 1188728 1214010 1240306 1267544 1295089 1322523 1349981
52114 1349981 1377471 1404244 1429238 1451995 1472776 1491897 1509390 1525279 1539703 1552611 1563685
$$ packed form
52213I61409K334M150N085M778M269M675N682N968N035L883L610M003M082L609
52199A022572L298L661M416N082N585O017O290O266N878N005L558J892O87J86
52185A080393j85j200k983m925o253o633o517o770p688q488q295p428o986p148
52171I98894o860n471l728k552j673l43J236K117K002J588J615K213L065L664
52157I95767L569K852K135J702J035j99j204r70J04O54L45L01J231K227K059R04
52141A012512m3j73Q5K16K65M76Q28J189J699K739M541O889R194J1024J2578J4553
52125A078572J7378K0582K3105K4343K4748K5282K6296K7238K7545K7434K7458
52114A349981K7490K6773K4994K2757K0781J9121J7493J5889J4424J2908J1074
$$ plain form
52103 1563685 1572797 1580299 1586690 1592085 1596118 1598264 1598228 1596095 1592051 1585831 1576638 1563928 1548206 1530757
52089 1530757 1512656 1494354 1476092 1458182 1440847 1424250 1408872 1395438 1384312 1375256 1367903 1362155
52077 1362155 1357988 1355268 1353923 1353980 1355375 1358143 1362880 1370476 1381064 1393624 1406954 1420664 1434895
52064 1434895 1449510 1464079 1478487 1493114 1508365 1524193 1540027 1555036 1568635 1580798 1591672
52053 1591672 1600906 1607661 1611349 1611958 1609567 1604070 1595652 1585032 1572831 1559051 1543560 1526748 1509263
52040 1509263 1491345 1472795 1453485 1433601 1413619 1394264 1376286 1359908 1344691 1330043 1315601
52029 1315601 1300982 1285707 1269753 1253775 1238407 1223662 1209388 1195847 1183316 1171512 1159975
52018 1159975 1148742 1138106 1128039 1118424 1109559 1101733 1094516 1087144 1079442 1071658 1063400 1053529 1041210
$$ packed form
52103A563685R112P502O391N395M033K146l6k133m044o220r193j2710j5722j7449
52089A530757j8101j8302j8262j7910j7335j6597j5378j3434j1126r056p353n748
52077A362155m167k720j345N7J395K768M737P596J0588J2560J3330J3710J4231
52064A434895J4615J4569J4408J4627J5251J5828J5834J5009J3599J2163J0874
52053A591672R234O755L688O09k391n497q418j0620j2201j3780j5491j6812j7485
52040A509263j7918j8550j9310j9884j9982j9355j7978j6378j5217j4648j4442
52029A315601j4619j5275j5954j5978j5368j4745j4274j3541j2531j1804j1537
52018A159975j1233j0636j0067r615q865p826p217p372p702p784q258r871j2319
$$ plain form
52005 1041210 1026517 1009959 992029 973386 954853 936879 919417 902565 886994 873377 861551
51994 861551 850443 838871 826423 813605 801010 788354 774617 759305 743159 727366 712458
51983 712458 698361 684976 672004 658591 644059 628982 614792 602338 591538 582357 575173 569895
51971 569895 565601 561576 558278 556831 557936 561447 566582 572245 577568 582468 587332 591923 595055 595637
51957 595637 593686 589963 584982 578799 571535 563705 556108 549661 545148 542757 541929 541886 542329 543589 546300
51942 546300 551093 558369 568057 579509 591734 603795 615119 625635 635556 644766 652354 657012 658008
51929 658008 655627 650631 643599 634878 624886 614074 602589 590175 576574 562113 547890 535179
51917 535179 524534 515602 507863 501251 495881 491632 488478 486970 487779 490842 495581 501980 510811 522570
$$ packed form
52005A041210j4693j6558j7930j8643j8533j7974j7462j6852j5571j3617j1826
51994H61551j1108j1572j2448j2818j2595j2656j3737j5312j6146j5793j4908
51983G12458j4097j3385j2972j3413j4532j5077j4190j2454j0800r181p184n278
51971E69895m294m025l298j447J105L511N135N663N323M900M864M591L132N82
51957E95637j951l723m981o183p264p830p597o447m513k391q28m3M43J260K711
51942E46300M793P276R688J1452J2225J2061J1324J0516R921R210P588M658R96
51929F58008k381m996p032q721r992j0812j1485j2414j3601j4461j4223j2711
51917E35179j0645q932p739o612n370m249l154j508Q09L063M739O399Q831J1759
$$ plain form
51903 522570 536580 551298 565195 577269 587080 594351 598240 597074 589408 575547 557631 538176
51891 538176 518907 500867 484808 471040 459464 450138 443428 439340 437212 436439 437092 439481 443538
51878 443538 448987 455639 463057 470358 476899 482885 488745 494130 498047 499855 499625 497647 494110 489379
51864 489379 484206 479470 475739 473027 470899 468988 467464 466772 466899 467348 467920 468949 470374 471149 470133
51849 470133 467207 462995 457887 452066 446175 441051 436742 432521 428007 423681 420140 417428 415282 413503
51835 413503 411810 409883 407925 406825 407347 409340 411988 414528 416377 416962 415995 413935 411659 409590 407514
51820 407514 405361 403717 403163 403389 403509 403248 403307 404320 405895 407053 407300 406767 405548 403589 401254 399268
51804 399268 397807 396268 394376 392988 393090 394282 394977 394124 392174 390290 389120 388566 388275 387973 387492 386838
$$ packed form
51903E22570J4010J4718J3897J2074R811P271L889j166p666j3861j7916j9455
51891E38176j9269j8040j6059j3768j1576r326o710m088k128p73O53K389M057
51878D43538N449O652P418P301O541N986N860N385L917J808k30j978l537m731
51864D89379n173m736l731k712k128j911j524o92J27M49N72J029J425P75j016
51849D70133k926m212n108n821n891n124m309m221m514m326l541k712k146j779
51835D13503j693j927j958j100N22J993K648K540J849N85r67k060k276k069k076
51820D07514k153j644n54K26J20k61N9J013J575J158K47n33j219j959k335j986
51804C99268j461j539j892j388J02J192O95q53j950j884j170n54k91l02m81o54
$$ plain form
51788 386838 386234 385933 385937 385967 385724 385194 384654 384315 383983 383277 382284 381802 382683 385025 388180 391528 394994 398921
51770 398921 403707 409689 417051 425608 434618 442954 449579 453981 456202 456458 454792 451203 446075 440128
51756 440128 433811 427011 419709 412710 407194 403447 400467 397125 393498 390734 389715 390192 391286 392476
51742 392476 393848 395627 397937 401101 405704 411920 418930 425431 430744 435123 438973 442166 444332 445537
51728 445537 446324 447215 448377 449748 451289 453015 454753 455825 455173 452155 447326 442164 437874 434667 432233
51713 432233 430486 429462 428731 427442 425038 421802 418715 416901 417056 419111 422333 425753 428465 429667 428887
51698 428887 426454 423466 420935 419120 417894 417464 418194 419858 421586 422610 422677 421671 419359 415750 411333
51683 411333 406679 402076 397803 394472 392695 392451 393123 394121 395219 396293 397077 397431 397676 398445 400235 403216
$$ packed form
51788C86838o04l01ML0k43n30n40l39l32p06r93m82Q81K342L155L348L466L927
51770C98921M786N982P362Q557R010Q336O625M402K221K56j666l589n128n947
51756D40128o317o800p302o999n516l747k980l342l627k764j019M77J094J190
51742C92476J372J779K310L164M603O216P010O501N313M379L850L193K166J205
51728D45537P87Q91J162J371J541J726J738J072o52l018m829n162m290l207k434
51713D32233j747j024p31j289k404l236l087j814J55K055L222L420K712J202p80
51698D28887k433k988k531j815j226m30P30J664J728J024O7j006k312l609m417
51683D11333m654m603m273l331j777k44O72R98J098J074P84L54K45P69J790K981
$$ plain form
51667 403216 407431 412911 419474 426517 433162 438646 442625 445141 446369 446349 444992 442462 439573 437647 437830
51652 437830 440556 445669 452724 460906 468771 474438 476246 473343 465988 455558 444032 432997 423032
51639 423032 414197 406863 401570 398172 395733 393479 391437 389906 388748 387532 386068 384480 382955 381684
51625 381684 380855 380380 379784 378607 376904 375174 373839 372891 371907 370377 368196 365866 364020 362726 361618
51610 361618 360707 360553 361428 362814 364163 365761 368303 371883 375983 380409 385663 392233 399885 407950 416169
51595 416169 424982 434750 444638 452556 456585 456488 453500 448751 442551 435317 428412 423384 420747 420062 420933
51580 420933 423431 427787 434274 443248 454752 468049 482037 496100 510240 524515 538844 553288
51568 553288 567916 582280 595532 607370 618719 631326 646822 666154 689633 717327 749242
$$ packed form
51667D03216M215N480O563P043O645N484L979K516J228k0j357k530k889j926J83
51652D37830K726N113P055Q182P865N667J808k903p355j0430j1526j1035r965
51639D23032q835p334n293l398k439k254k042j531j158j216j464j588j525j271
51625C81684q29m75n96j177j703j730j335r48r84j530k181k330j846j294j108
51610C61618r11j54Q75J386J349J598K542L580M100M426N254O570P652Q065Q219
51595D16169Q813R768R888P918M029r7k988m749o200p234o905n028k637o85Q71
51580D20933K498M356O487Q974J1504J3297J3988J4063J4140J4275J4329J4444
51568E53288J4628J4364J3252J1838J1349J2607J5496J9332K3479K7694L1915
$$ plain form
51557 749242 784921 822832 860538 895752 926969 952865 971685 981951 983617 977828 965475 946557
51545 946557 921068 890014 855314 818955 782276 745795 709660 674442 641414 611790 585876
51534 585876 563299 543786 527187 512867 499849 487724 476891 467685 459735 452350 445130 438029
51522 438029 431239 425224 420504 417082 414330 411584 408683 405850 403355 401389 399960 398854 397935 397473 397815
51507 397815 398756 399688 400432 401443 403068 405165 407555 410239 412820 414345 414261 413168 412025 410929 409207
51492 409207 406554 403482 400663 398320 396390 394869 393749 392828 391745 390146 387795 384643 380896 376976
51478 376976 373282 369933 366736 363435 360022 356708 353563 350299 346567 342378 338119 334236 331050 328753
51464 328753 327336 326522 325984 325679 325900 327032 329266 332349 335560 338232 340457 342941 345946 348866 351299
$$ packed form
51557G49242L5679L7911L7706L5214L1217K5896J8820J0266J666n789j2353j8918
51545I46557k5489l1054l4700l6359l6679l6481l6135l5218l3028k9624k5914
51534E85876k2577j9513j6599j4320j3018j2125j0833r206p950p385p220p101
51522D38029o790o015m720l422k752k746k901k833k495j966j429j106r19m62L42
51507C97815R41R32P44J011J625K097K390K684K581J525q4j093j143j096j722
51492D09207k653l072k819k343j930j521j120r21j083j599k351l152l747l920
51478C76976l694l349l197l301l413l314l145l264l732m189m259l883l186k297
51464C28753j417q14n38l05K21J132K234L083L211K672K225K484L005K920K433
$$ plain form
51449 351299 354102 358670 365497 374241 384867 397681 412055 426222 438789 449702 459294 467109 472303
51436 472303 474727 475002 473821 471659 468740 464710 458573 449612 438400 426524 415363 405371 396430 388533
51422 388533 382071 377572 375072 373755 372459 370697 368956 367964 368044 369248 371499 374239 376477 377769 378865
51407 378865 380824 383741 386865 389831 393166 397498 402720 408109 413011 417328 421483 425896 430458 434644
51393 434644 438278 441984 446717 453109 461439 471866 484285 498250 513608 531164 552248 577602
51381 577602 607106 640593 678490 721328 768844 819775 872453 925317 976708 1024250 1064878
51370 1064878 1095932 1116299 1126209 1126026 1115693 1095455 1066459 1030242 988070 941228 891528 840882
51358 840882 790584 741534 694885 651776 612581 577182 545991 519922 499041 481947 466948
$$ packed form
51449C51299K803M568O827Q744J0626J2814J4374J4167J2567J0913R592P815N194
51436D72303K424K75j181k162k919m030o137q961j1212j1876j1161r992q941p897
51422C88533o462m499k500j317j296j762j741r92Q0J204K251K740K238J292J096
51407C78865J959K917L124K966L335M332N222N389M902M317M155M413M562M186
51393D34644L634L706M733O392Q330J0427J2419J3965J5358J7556K1084K5354
51381E77602K9504L3487L7897M2838M7516N0931N2678N2864N1391M7542M0628
51370A064878L1054K0367R910j83j0333k0238k8996l6217m2172m6842m9700n0646
51358H40882n0298m9050m6649m3109l9195l5399l1191k6069k0881j7094j4999
$$ plain form
51347 466948 453442 441765 432112 424109 417214 410975 404974 399031 393547 389204 386118 383600 380953 378226
51333 378226 375865 373854 371681 369112 366508 364171 361863 359304 356762 354711 353146 351750 350544 349765
51319 349765 349189 348228 346756 345213 343778 342171 340561 339934 341014 343320 345841 348166 350399 352390 353834
51304 353834 354936 356280 358001 359652 360938 362087 363399 364796 365903 366274 365569 363821 361569 359471 357811
51289 357811 356550 355684 355206 354879 354456 354155 354569 356080 358534 361424 364167 366367 368101 369742 371198 371702
51273 371702 370839 369482 368983 369557 370252 370508 370933 372216 374063 375732 377039 378280 379469 380208 380184 379382 377886
51256 377886 375791 373311 370749 368396 366515 365237 364288 363044 361097 358680 356336 354345 352702 351504
51242 351504 350973 351045 351247 351179 350978 351105 351748 352613 353358 353968 354512 354669 353862 351961 349577 347491 346000 344962
$$ packed form
51347D66948j3506j1677r653q003o895o239o001n943n484m343l086k518k647k727
51333C78226k361k011k173k569k604k337k308k559k542k051j565j396j206p79
51319C49765n76r61j472j543j435j607j610o27J080K306K521K325K233J991J444
51304C53834J102J344J721J651J286J149J312J397J107L71p05j748k252k098j660
51289C57811j261q66m78l27m23l01M14J511K454K890K743K200J734J641J456N04
51273C71702q63j357m99N74O95K56M25J283J847J669J307J241J189P39k4q02j496
51256C77886k095k480k562k353j881j278r49j244j947k417k344j991j643j198
51242C51504n31P2K02o8k01J27O43Q65P45O10N44J57q07j901k384k086j491j038
$$ plain form
51224 344962 344222 343701 343263 342829 342620 342993 344031 345442 346850 348047 349037 350023 351222 352540 353639 354534
51208 354534 355905 358422 361919 365588 368907 371941 374802 377341 379482 381376 383027 384062 384088 383079 381295
51193 381295 379060 376685 374417 372324 370398 368729 367390 366220 365075 364237 364165 364745 365218 365023 364445 364254
51177 364254 364969 366550 368422 369675 369662 368712 367956 368146 368873 369199 368852 368493 368966 370570 372960 375539 377984
51160 377984 380485 383346 386286 388386 388979 388365 387412 386573 385571 383960 381686 379124 376770 374975 373854
51145 373854 373375 373531 374316 375455 376303 376235 375231 374017 373553 374217 375419 376034 375372 373655 371563 369503 367567
51128 367567 365969 365058 364961 365643 367311 370170 373620 376328 377544 378006 379099 381336 384041 386290 387721
51113 387721 388561 389348 390662 392788 395528 398462 401324 404036 406577 409052 411684 414458 416922 418679 419994
$$ packed form
51224C44962p40n21m38m34k09L73J038J411J408J197R90R86J199J318J099Q95
51208C54534J371K517L497L669L319L034K861K539K141J894J651J035K6j009j784
51193C81295k235k375k268k093j926j669j339j170j145q38p2N80M73j95n78j91
51177C64254P15J581J872J253j3r50p56J90P27L26l47l59M73J604K390K579K445
51160C77984K501K861K940K100N93o14r53q39j002j611k274k562k354j795j121
51145C73854m79J56P85J139Q48o8j004j214m64O64J202O15o62j717k092k060j936
51128C67567j598r11r7O82J668K859L450K708J216M62J093K237K705K249J431
51113C87721Q40P87J314K126K740K934K862K712K541K475K632K774K464J757J315
$$ plain form
51098 419994 421556 423654 425834 427340 427670 426851 425476 424339 423708 423066 421918 420637 419936 419650 418794 416937
51082 416937 414782 413038 411448 409514 407668 406936 407625 409025 410376 411590 412966 414750 417127 420189 423690
51067 423690 427189 430625 434562 439674 446212 454083 463192 473506 485018 497803 511815 526289 539590
51054 539590 550158 557809 564047 571084 580609 593166 608228 624561 640668 655149 667010 675929
51042 675929 682209 686119 687143 684283 677423 668056 658201 648844 639834 630875 621727 611476 598717 583059
51028 583059 565916 549356 534578 521906 511642 504135 499245 496442 495454 496254 498429 501195 504230
51015 504230 508101 513578 520736 528835 536884 544228 550839 557229 564067 571788 580503 590131 600456 611158
51001 611158 621957 632731 643407 653835 663891 673635 683319 693378 704366 716516 729217 741281
$$ packed form
51098D19994J562K098K180J506L30q19j375j137o31o42j148j281p01k86q56j857
51082D16937k155j744j590j934j846p32O89J400J351J214J376J784K377L062L501
51067D23690L499L436L937N112O538P871R109J0314J1512J2785J4012J4474J3301
51054E39590J0568P651O238P037R525J2557J5062J6333J6107J4481J1861Q919
51042F75929O280L910J024k860o860r367r855r357r010q959r148j0251j2759j5658
51028E83059j7143j6560j4778j2672j0264p507m890k803r88Q00K175K766L035
51015E04230L871N477P158Q099Q049P344O611O390O838P721Q715R628J0325J0702
51001F11158J0799J0774J0676J0428J0056R744R684J0059J0988J2150J2701J2064
$$ plain form
50989 741281 752041 761855 771267 780168 788340 796370 805254 815205 825557 835786 845889 855711 864797
50976 864797 873281 882365 893514 907587 925052 946514 972560 1003359 1038887 1079336 1124937 1175448
50964 1175448 1230081 1287892 1348184 1410735 1475708 1542996 1611419 1678812 1743125 1803244 1858610
50953 1858610 1908458 1951817 1988106 2017400 2040228 2057324 2069470 2077354 2081657 2083339 2083584 2083211 2082234
50940 2082234 2080084 2076032 2069250 2058888 2044587 2026916 2007016 1985756 1963291 1939244 1913087 1884448
50928 1884448 1853210 1819294 1782321 1741678 1697077 1648878 1597760 1544381 1489533 1434303 1379728
50917 1379728 1326481 1275118 1226421 1181174 1139736 1102132 1068369 1038332 1011556 987506 966001
50906 966001 946985 929987 914222 899189 884823 871095 857970 845828 835428 827193 820838 815887
$$ packed form
50989G41281J0760R814R412Q901Q172Q030Q884R951J0352J0229J0103R822R086
50976H64797Q484R084J1149J4073J7465K1462K6046L0799L5528M0449M5601N0511
50964A175448N4633N7811O0292O2551O4973O7288O8423O7393O4313O0119N5366
50953A858610M9848M3359L6289K9294K2828J7096J2146P884M303J682K45l73r77
50940B082234k150m052o782j0362j4301j7671j9900k1260k2465k4047k6157k8639
50928A884448l1238l3916l6973m0643m4601m8199n1118n3379n4848n5230n4575
50917A379728n3247n1363m8697m5247m1438l7604l3763l0037k6776k4050k1505
50906I66001j9016j6998j5765j5033j4366j3728j3125j2142j0400q235o355m951
$$ plain form
50894 815887 812262 810058 808982 808370 807740 807106 806713 806652 806845 807399 808879 812047 817160 823559 830133 836269
50878 836269 842264 848815 856320 864771 874090 884263 895209 906795 919111 932595 947809 965158
50866 965158 984868 1007052 1031654 1058465 1087468 1119167 1154367 1193711 1237708 1287177 1343201
50855 1343201 1406351 1476330 1552764 1636126 1727485 1827516 1936158 2053081 2177914 2309989
50845 2309989 2448328 2591930 2739647 2889717 3039894 3188061 3332078 3468866 3594369
50836 3594369 3704869 3797922 3871779 3924846 3956610 3968649 3963813 3944597 3913171 3872695 3827393
50825 3827393 3781023 3736116 3694978 3660290 3633831 3615151 3602248 3593100 3585591 3576327 3560776 3535132
50813 3535132 3497561 3447446 3384173 3307194 3216787 3114104 3000672 2878419 2750071 2618881
$$ packed form
50894H15887l625k204j076o12o30o34l93o1J93N54J480L168N113O399O574O136
50878H36269N995O551P505Q451R319J0173J0946J1586J2316J3484J5214J7349
50866I65158J9710K2184K4602K6811K9003L1699L5200L9344M3997M9469N6024
50855A343201O3150O9979P6434Q3362R1359J00031J08642J16923J24833J32075
50845B309989J38339J43602J47717J50070J50177J48167J44017J36788J25503
50836C594369J10500R3053P3857N3067L1764J2039m836j9216l1426m0476m5302
50825C827393m6370m4907m1138l4688k6459j8680j2903r148p509r264j5551k5644
50813C535132l7571n0115o3273p6979r0407j02683j13432j22253j28348j31190
$$ plain form
50803 2618881 2487759 2358931 2234361 2115956 2005170 1902847 1809706 1726545 1653682 1590557
50793 1590557 1536288 1490361 1452441 1421808 1397482 1378769 1365219 1356098 1350313 1346820 1344755 1343311
50781 1343311 1341920 1340510 1339054 1336927 1333208 1327664 1320864 1313210 1304440 1294278 1282950 1270679 1257090
50768 1257090 1241562 1223918 1204517 1183949 1162852 1141706 1120532 1099190 1078231 1059046 1042764
50757 1042764 1029339 1018098 1008857 1001970 997584 995451 995415 997571 1001914 1008240 1016466 1026834 1039881
50744 1039881 1056461 1077612 1103902 1134869 1169553 1207714 1250272 1298411 1352517 1412125 1476601
50733 1476601 1545576 1618738 1695453 1774756 1855665 1937300 2018652 2098490 2175887 2250673 2322923
50722 2322923 2391806 2455283 2511046 2557415 2593152 2616866 2627123 2623130 2605203 2574949 2535288
$$ packed form
50803B618881j31122j28828j24570j18405j10786j02323r3141q3161p2863o3125
50793A590557n4269m5927l7920l0633k4326j8713j3550r121n785l493k065j444
50781A343311j391j410j456k127l719n544o800p654q770j0162j1328j2271j3589
50768A257090j5528j7644j9401k0568k1097k1146k1174k1342k0959j9185j6282
50757A042764j3425j1241r241o887m386k133l6K156M343O326Q226J0368J3047
50744A039881J6580K1151K6290L0967L4684L8161M2558M8139N4106N9608O4476
50733A476601O8975P3162P6715P9303Q0909Q1635Q1352P9838P7397P4786P2250
50722B322923O8883O3477N5763M6369L5737K3714J0257l993j7927l0254l9661
$$ plain form
50711 2535288 2489993 2442680 2396146 2352681 2314533 2283495 2260115 2243672 2232942 2226749 2223917 2223107
50699 2223107 2222748 2220855 2214860 2201911 2179571 2146479 2102564 2048841 1986924 1918719 1846529 1773207
50687 1773207 1701623 1633758 1570461 1512075 1459024 1411880 1371424 1338753 1314698 1298866 1289827
50676 1289827 1286504 1288860 1296938 1310022 1327324 1348741 1374176 1402535 1432141 1461771 1490567 1517400
50664 1517400 1541258 1562076 1580420 1596590 1610862 1624278 1638134 1652588 1666626 1679443 1691057
50653 1691057 1701571 1710838 1719133 1727360 1736331 1746499 1758571 1773531 1791747 1812798 1836571 1863828
50641 1863828 1895248 1930518 1968849 2009831 2053231 2098405 2144398 2190357 2235474 2278922 2320348
50630 2320348 2360219 2399370 2438326 2477144 2515303 2551037 2580615 2598516 2598763 2577279 2534432 2475880
$$ packed form
50711B535288m5295m7313m6534m3465l8148l1038k3380j6443j0730o193k832q10
50699B223107l59j893n995j2949k2340l3092m3915n3723o1917o8205p2190p3322
50687A773207p1584o7865o3297n8386n3051m7144m0456l2671k4055j5832r039
50676A289827l323K356Q078J3084J7302K1417K5435K8359K9606K9630K8796K6833
50664A517400K3858K0818J8344J6170J4272J3416J3856J4454J4038J2817J1614
50653A691057J0514R267Q295Q227Q971J0168J2072J4960J8216K1051K3773K7257
50641A863828L1420L5270L8331M0982M3400M5174M5993M5959M5117M3448M1426
50630B320348L9871L9151L8956L8818L8159L5734K9578J7901K47k1484m2847n8552
$$ plain form
50618 2475880 2410234 2345103 2285012 2232387 2188971 2155551 2131280 2114454 2103817 2098429 2096654 2096222
50606 2096222 2095385 2093306 2089172 2081430 2068131 2047720 2019390 1983024 1939051 1888347 1832238 1772544
50594 1772544 1711276 1649960 1589285 1529662 1472023 1417863 1368481 1324310 1284893 1249383 1217163
50583 1217163 1188200 1162775 1140829 1121690 1104521 1088879 1074747 1062216 1051340 1042226 1035074 1030163
50571 1030163 1027785 1028080 1030919 1036055 1043385 1052866 1064269 1077293 1092002 1108790 1127887 1149191 1172588
50558 1172588 1198032 1225210 1253642 1283306 1314698 1347934 1382178 1416303 1449718 1482137 1512928
50547 1512928 1541372 1567457 1591924 1615555 1638916 1662858 1688727 1717770 1750550 1787138 1827730
50536 1827730 1872799 1922675 1977207 2036044 2099251 2167476 2241403 2321218 2406817 2498331 2595996
$$ packed form
50618B475880o5646o5131o0091n2625m3416l3420k4271j6826j0637n388j775m32
50606B096222q37k079m134p742j3299k0411k8330l6366m3973n0704n6109n9694
50594A772544o1268o1316o0675n9623n7639n4160m9382m4171l9417l5510l2220
50583A217163k8963k5425k1946j9139j7169j5642j4132j2531j0876r114p152m911
50571A030163k378K95K839N136P330R481J1403J3024J4709J6788J9097K1304K3397
50558A172588K5444K7178K8432K9664L1392L3236L4244L4125L3415L2419L0791
50547A512928K8444K6085K4467K3631K3361K3942K5869K9043L2780L6588M0592
50536A827730M5069M9876N4532N8837O3207O8225P3927P9815Q5599R1514R7665
$$ plain form
50525 2595996 2699379 2806958 2916519 3025824 3132931 3236191 3333986 3424252 3504294 3571421
50515 3571421 3623779 3660242 3679655 3680831 3663479 3628613 3577751 3512168 3433331 3343694 3246639
50504 3246639 3145790 3044572 2946152 2853414 2769088 2695885 2636155 2591187 2561155 2545811 2544746
50493 2544746 2556807 2579896 2611765 2650427 2693161 2735583 2772395 2798985 2811916 2808321 2785814
50482 2785814 2743311 2681677 2603514 2512481 2412519 2307187 2199490 2092186 1987776 1887883
50472 1887883 1793013 1703354 1619502 1542115 1471330 1407116 1349758 1299324 1254954 1215468 1180502
50461 1180502 1150347 1124840 1103313 1085618 1072251 1063240 1057747 1055115 1055570 1059413 1066127 1074772 1084798
50448 1084798 1095942 1107701 1119485 1131100 1142596 1153820 1164579 1175111 1185819 1196447 1205927
$$ packed form
50525B595996J03383J07579J09561J09305J07107J03260R7795R0266Q0042O7127
50515C571421N2358L6463J9413J176j7352l4866n0862o5583p8837q9637r7055
50504C246639j00849j01218r8420r2738q4326p3203n9730m4968l0032j5344j065
50493B544746J2061K3089L1869L8662M2734M2422L6812K6590J2931l595k2507
50482B785814m2503o1634p8163r1033r9962j05332j07697j07304j04410r9893
50472A887883r4870q9659q3852p7387p0785o4214n7358n0434m4370l9486l4966
50461A180502l0155k5507k1527j7695j3367r011n493k632M55L843O714Q645J0026
50448A084798J1144J1759J1784J1615J1496J1224J0759J0532J0708J0628R480
$$ plain form
50437 1205927 1213301 1218616 1222763 1226616 1230540 1234624 1239088 1244255 1250262 1257096 1264894 1273996 1284573 1296420
50423 1296420 1309314 1323461 1339465 1357994 1379636 1404815 1433580 1465589 1500592 1538830 1580690
50412 1580690 1626089 1674472 1725324 1778251 1832541 1887060 1940727 1992859 2042923 2090206 2133800
50401 2133800 2172677 2205646 2231441 2249036 2257702 2256715 2245242 2222809 2189779 2147205 2096282 2038181
50389 2038181 1974497 1907608 1840245 1774563 1711767 1652818 1599310 1553237 1515848 1487140 1466659
50378 1466659 1454355 1450218 1453375 1462188 1475279 1491933 1511248 1531241 1549100 1562221 1568773 1567451
50366 1567451 1557221 1537681 1509646 1475018 1435818 1393463 1349009 1303679 1258562 1213956 1169689
50355 1169689 1126243 1084884 1046328 1009942 974843 941351 910706 883650 860029 839612 822559
$$ packed form
50437A205927P374N315M147L853L924M084M464N167O007O834P798R102J0577J1847
50423A296420J2894J4147J6004J8529K1642K5179K8765L2009L5003L8238M1860
50412A580690M5399M8383N0852N2927N4290N4519N3667N2132N0064M7283M3594
50401B133800L8877L2969K5795J7595Q666r87j1473k2433l3030m2574n0923n8101
50389B038181o3684o6889o7363o5682o2796n8949n3508m6073l7389k8708k0481
50378A466659j2304m137L157Q813J3091J6654J9315J9993J7859J3121O552j322
50366A567451j0230j9540k8035l4628l9200m2355m4454m5330m5117m4606m4267
50355A169689m3446m1359l8556l6386l5099l3492l0645k7056k3621k0417j7053
$$ plain form
50344 822559 808970 798589 791122 786314 783627 782336 782223 783760 787387 792959 800099 808775 819229 831561
50330 831561 845679 861505 878928 897431 915698 931649 943170 949219 950339 947990 943546 938097
50318 938097 932807 928667 925769 923348 920793 918220 915971 914038 912340 911147 910785 911139 911809 912610 913610
50303 913610 914881 916565 919092 922945 928098 933943 939832 945570 951413 957700 964503 971546 978469 985299
50289 985299 992661 1001498 1012655 1026762 1044330 1065593 1090174 1116928 1143942 1168312 1185959 1192532
50277 1192532 1185633 1166676 1140377 1112036 1085151 1061282 1041304 1025963 1015269 1008079 1002747 998035
50265 998035 993401 988747 984153 979684 975307 971019 967041 963630 960724 958075 955687 953727 952015 950197
50251 950197 948604 948334 950099 953516 957995 963808 971648 981551 993018 1006036 1021275 1039289 1060115
$$ packed form
50344H22559j3589j0381p467m808k687j291j13J537L627N572P140Q676J0454J2332
50330H31561J4118J5826J7423J8503J8267J5951J1521O049J120k349m444n449
50318I38097n290m140k898k421k555k573k249j933j698j193l62L54O70Q01J000
50303I13610J271J684K527L853N153N845N889N738N843O287O803P043O923O830
50289I85299P362Q837J1157J4107J7568K1263K4581K6754K7014K4370J7647O573
50277A192532o899j8957k6299k8341k6885k3869j9978j5341j0694p190n332m712
50265I98035m634m654m594m469m377m288l978l411k906k649k388j960j712j818
50251I50197j593k70J765L417M479N813P840R903J1467J3018J5239J8014K0826
$$ plain form
50238 1060115 1083595 1109433 1136857 1164765 1192340 1219015 1243831 1265520 1283598 1299000 1313252
50227 1313252 1327163 1340427 1352181 1361588 1367934 1370335 1367558 1358395 1342401 1320132 1292543 1260500
50215 1260500 1225194 1188623 1153026 1119840 1089677 1063190 1041278 1024308 1011576 1001615 992548 982154
50203 982154 968350 950127 927920 903046 877106 851863 828904 808885 791268 775061 759679
50192 759679 745047 731305 718663 707310 697252 688345 680492 673563 667203 661076 655361 650515 646483
50179 646483 642612 638499 634432 630716 627054 623017 618778 615017 612246 610548 609757 609634 610001 610874 612275
50164 612275 613798 614705 614734 614604 615406 617609 620888 624806 629377 634958 641741 649417 657350 665149 672934
50149 672934 680818 688165 693702 696479 696611 695080 693033 691207 689773 688667 688208 689203 692250 697181 703647
$$ packed form
50238A060115K3480K5838K7424K7908K7575K6675K4816K1689J8078J5402J4252
50227A313252J3911J3264J1754R407O346K401k777r163j5994k2269k7589l2043
50215A260500l5306l6571l5597l3186l0163k6487k1912j6970j2732r961r067j0394
50203I82154j3804j8223k2207k4874k5940k5243k2959k0019j7617j6207j5382
50192G59679j4632j3742j2642j1353j0058q907p853o929o360o127n715m846m032
50179F46483l871m113m067l716l662m037m239l761k771j698p91j23L67Q73J401
50164F12275J523R07K9j30Q02K203L279L918M571N581O783P676P933P799P785
50149F72934P884P347N537K777J32j531k047j826j434j106m59R95L047M931O466
$$ plain form
50134 703647 712001 722943 736365 751246 766874 783533 801826 821999 844247 869155 897456 929722
50122 929722 966447 1007850 1053285 1101322 1150812 1201385 1252642 1303460 1352676 1400055 1446049
50111 1446049 1490950 1534812 1577812 1619912 1660002 1695733 1724244 1742989 1750221 1745198 1728045 1699469
50099 1699469 1660805 1614284 1562625 1507975 1451546 1394483 1338568 1285668 1236885 1192747 1153784
50088 1153784 1120378 1092190 1068329 1047973 1030520 1015376 1002028 990273 980037 971099 963240 956461
50076 956461 950804 946190 942598 940036 938091 935978 933411 930905 928747 926151 922128 916807 911123 905480
50062 905480 899502 892957 886126 879155 871772 863853 855804 848202 841400 835474 830253 825434 821055 817749
50048 817749 816161 816229 817516 820042 824243 830200 837509 845912 855411 865693 876020 885956 895791 906114
$$ packed form
50134G03647Q354J0942J3422J4881J5628J6659J8293K0173K2248K4908K8301L2266
50122I29722L6725M1403M5435M8037M9490N0573N1257N0818M9216M7379M5994
50111A446049M4901M3862M3000M2100M0090L5731K8511J8745P232n023j7153k8576
50099A699469l8664m6521n1659n4650n6429n7063n5915n2900m8783m4138l8963
50088A153784l3406k8188k3861k0356j7453j5144j3348j1755j0236q938p859o779
50076I56461n657m614l592k562j945k113k567k506k158k596m023n321n684n643
50062I05480n978o545o831o971p383p919q049p602o802n926n221m819m379l306
50048H17749j588O8J287K526M201N957P309Q403R499J0282J0327R936R835J0323
$$ plain form
50034 906114 917231 928982 940720 951500 960805 969070 976994 984289 989679 992264 992397 991075 988984
50021 988984 986325 983021 978792 973470 967519 961840 956760 951614 945638 938935 932350 926801 923080 921867
50007 921867 923452 927680 934596 945003 959942 979778 1004158 1032685 1065065 1100470 1137200 1173258
49995 1173258 1207097 1237793 1264825 1288038 1307839 1325169 1341052 1355870 1368769 1377671 1380126 1374504
49983 1374504 1360515 1338541 1308640 1270656 1225519 1176010 1125648 1076725 1029773 984893 942952
49972 942952 905204 872189 843574 818817 797546 779348 763659 749944 737786 726921 717491 710169
49960 710169 705598 703640 703493 704622 707286 712015 718853 727274 736634 746399 755960 764475 771064 775260
49946 775260 777252 777622 776855 775126 772482 768984 764586 759056 752133 743641 733449 721508 708030 693476
$$ packed form
50034I06114J1117J1751J1738J0780R305Q265P924P295N390K585J33j322k091
50021I88984k659l304m229n322n951n679n080n146n976o703o585n549l721j213
50007I21867J585M228O916J0407J4939J9836K4380K8527L2380L5405L6730L6058
49995A173258L3839L0696K7032K3213J9801J7330J5883J4818J2899Q902K455n622
49983A374504j3989k1974k9901l7984m5137m9509n0362m8923m6952m4880m1941
49972I42952l7748l3015k8615k4757k1271j8198j5689j3715j2158j0865r430p322
49960G10169m571j958j47J129K664M729O838Q421R360R765R561Q515O589M196
49946G75260J992L70p67j729k644l498m398n530o923q492j0192j1941j3478j4554
$$ plain form
49932 693476 678322 663049 648343 634932 623094 612646 603579 596213 590575 586121 582491 580147 579734
49919 579734 581137 583639 586748 590366 594332 598374 602471 606815 611429 616237 621413 627373 634498 643174
49905 643174 653827 666438 680109 693566 706078 717632 728434 738549 747756 755358 760447 762827
49893 762827 763300 762436 759445 753050 743206 731103 717686 703222 688294 674088 661261 649380 637848
49880 637848 626643 615851 605237 594785 585005 576243 568302 561194 555710 552629 551752 552225 553419 555078
49866 555078 557041 559446 562918 567944 574231 581137 588642 597480 608398 621598 636671 652677 668407
49853 668407 682904 695738 706607 714957 720362 723094 723972 723687 722483 720240 716447 710275 701185 689644
$$ packed form
49932F93476j5154j5273j4706j3411j1838j0448r067p366n638m454l630k344m13
49919E79734J403K502L109L618L966M042M097M344M614M808N176N960P125Q676
49905F43174J0653J2611J3671J3457J2512J1554J0802J0115R207P602N089K380
49893G62827M73q64k991o395r844j2103j3417j4464j4928j4206j2827j1881j1532
49880F37848j1205j0792j0614j0452r780q762p941p108n484l081q77M73J194J659
49866E55078J963K405L472N026O287O906P505Q838J0918J3200J5073J6006J5730
49853F68407J4497J2834J0869Q350N405K732Q78k85j204k243l793o172r090j1541
$$ [...]
##END NTUPLES=NMR SPECTRUM
##END=
