##TITLE=AC1749_SEN00022_9280973_mEKdDWcYx0
##JCAMPDX= 6.0         $$ Bruker NMR JCAMP-DX V2.0
##DATA TYPE= NMR SPECTRUM
##DATA CLASS= NTUPLES
##ORIGIN= BRUKER
##OWNER= Administrator
$$ 1.72 TOPSPIN		Version 2.1
$$ 2015-07-18 00:31:26.760 -0700  Administrator@X
$$ Compression mode = diff/dup
##.OBSERVE FREQUENCY= 400.02188249412
##.OBSERVE NUCLEUS= ^1H
##.ACQUISITION MODE= SIMULTANEOUS (DQD)
##.ACQUISITION SCHEME= undefined
##.AVERAGES= 8
##.DIGITISER RES= 22
##SPECTROMETER/DATA SYSTEM= spect
##.PULSE SEQUENCE= zg30
##.SOLVENT NAME= COFFEE_meoh
##.SHIFT REFERENCE= INTERNAL, COFFEE_meoh, 1, 14.98509
##AUDIT TRAIL= $$ (NUMBER, WHEN, WHO, WHERE, PROCESS, VERSION, WHAT)
$$ ##TITLE= Audit trail, TOPSPIN		Version 2.1
$$ ##JCAMPDX= 5.01
$$ ##ORIGIN= Bruker BioSpin GmbH
$$ ##OWNER= Administrator
$$ $$ E:\/data/COFFEE/nmr/AC1749_SEN00022_9280973_mEKdDWcYx0/10/pdata/1/auditp.txt
$$ ##AUDIT TRAIL=  $$ (NUMBER, WHEN, WHO, WHERE, PROCESS, VERSION, WHAT)
(   1,<2015-07-18 00:31:19.979 -0700>,<Administrator>,<X>,<go>,<TOPSPIN 2.1>,
      <created by zg
	started at 2015-07-18 00:30:13.994 -0700,
	POWCHK enabled, PULCHK disabled,
       configuration hash MD5:
       21 0F 79 D6 B3 7B B4 F6 88 20 88 DB 03 48 BD 9F
       data hash MD5: 64K
       76 9F DD 12 01 C6 ED CC 94 7B 4F 7A AE F2 98 38>)
(   2,<2015-07-18 00:31:23.150 -0700>,<Administrator>,<X>,<proc1d>,<TOPSPIN 2.1>,
      <Start of raw data processing
       efp LB = 0 FT_mod = 6 PKNL = 1 PHC0 = 0 PHC1 = 0 SI = 32K 
       data hash MD5: 32K
       14 55 EA 36 43 E4 60 E2 65 B3 05 4E 15 E8 CE 2E>)
(   3,<2015-07-18 00:31:23.479 -0700>,<Administrator>,<X>,<proc1d>,<TOPSPIN 2.1>,
      <pk PHC0 = 85.70435 PHC1 = 0 
       data hash MD5: 32K
       C6 89 F9 F0 BC 6D 75 0E 6D 3C 3E C5 0F D0 6C CC>)
(   4,<2015-07-18 00:31:23.572 -0700>,<Administrator>,<X>,<proc1d>,<TOPSPIN 2.1>,
      <abs ABSG = 1 
       data hash MD5: 32K
       F8 C3 7C 8C 2C 00 2E BB B2 EF DE 08 14 66 5B 02>)
(   5,<2015-07-18 00:31:23.635 -0700>,<Administrator>,<X>,<proc1d>,<TOPSPIN 2.1>,
      <abs ABSG = 2 
       data hash MD5: 32K
       61 B3 26 20 44 AC A2 7A E0 07 F5 49 AD DD 99 3A>)
(   6,<2015-07-18 00:31:23.682 -0700>,<Administrator>,<X>,<proc1d>,<TOPSPIN 2.1>,
      <abs ABSG = 3 
       data hash MD5: 32K
       65 D1 96 2B A5 6F 97 3E C8 C9 6A 5C 83 9B CC F9>)
(   7,<2015-07-18 00:31:23.729 -0700>,<Administrator>,<X>,<proc1d>,<TOPSPIN 2.1>,
      <abs ABSG = 4 
       data hash MD5: 32K
       6B C2 B4 7F 55 2A 7A 69 56 8A 1A 3A 05 7B CC C2>)
(   8,<2015-07-18 00:31:23.775 -0700>,<Administrator>,<X>,<proc1d>,<TOPSPIN 2.1>,
      <abs ABSG = 5 
       data hash MD5: 32K
       76 60 2A C9 90 08 49 41 21 27 6F 7F 69 51 41 6A>)
$$ ##END=
$$ 
$$ $$ hash MD5
$$ $$ 9B 2C 9A DC 0F E3 7A A1 1A 13 0C E5 EF A3 DA 38
##$RELAX= 
##$RELAX= 
##$RELAX= 
##$RELAX= 
##$RELAX= 
##$RELAX= 
##$RELAX= 
$$ Bruker specific parameters
$$ --------------------------
##$DU= <E:\>
##$EXPNO= 10
##$NAME= <AC1749_SEN00022_9280973_mEKdDWcYx0>
$$ [...]
150 150 150 150 150 150 150 150
##$TP07= 0
##$TPNAME0= <>
##$TPNAME1= <>
##$TPNAME2= <>
##$TPNAME3= <>
##$TPNAME4= <>
##$TPNAME5= <>
##$TPNAME6= <>
##$TPNAME7= <>
##$TPOAL= (0..7)
0.5 0.5 0.5 0.5 0.5 0.5 0.5 0.5
##$TPOFFS= (0..7)
0 0 0 0 0 0 0 0
##$TUNHIN= 0
##$TUNHOUT= 0
##$TUNXOUT= 0
##$USERA1= <user>
##$USERA2= <user>
##$USERA3= <user>
##$USERA4= <user>
##$USERA5= <user>
##$V9= 5
##$VALIST= <valist>
##$VCLIST= <CCCCCCCCCCCCCCC>
##$VD= 0
##$VDLIST= <DDDDDDDDDDDDDDD>
##$VPLIST= <PPPPPPPPPPPPPPP>
##$VTLIST= <TTTTTTTTTTTTTTT>
##$WBST= 2048
##$WBSW= 25
##$XGAIN= (0..3)
0 0 0 0
##$XL= 0
##$YL= 0
##$YMAX_a= 606176
##$YMIN_a= -536177
##$ZGOPTNS= <>
##$ZL1= 120
##$ZL2= 120
##$ZL3= 120
##$ZL4= 120
##$ABSF1= 14.98509
##$ABSF2= -5.573092
##$ABSG= 5
##$ABSL= 3
##$ALPHA= 0
##$AQORDER= 0
##$ASSFAC= 0
##$ASSFACI= 0
##$ASSFACX= 0
##$ASSWID= 0
##$AUNMP= <proc_prof1d_extract_pilot.lims>
##$AXLEFT= 0
##$AXNAME= <>
##$AXNUC= <1H>
##$AXRIGHT= 0
##$AXTYPE= 0
##$AXUNIT= <>
##$AZFE= 0.1
##$AZFW= 0.1
##$BCFW= 0
##$BC_mod= 0
##$BYTORDP= 0
##$COROFFS= 0
##$CY= 15
##$DATMOD= 1
##$DC= 0
##$DFILT= <>
##$DTYPP= 0
##$F1P= 0
##$F2P= 0
##$FCOR= 0.5
##$FTSIZE= 32768
##$FT_mod= 6
##$GAMMA= 0
##$GB= 0
##$INTBC= 1
##$INTSCL= 1
##$ISEN= 128
##$LB= 0
##$LEV0= 0
##$LPBIN= 0
##$MAXI= 10000
##$MC2= 0
##$MEAN= 0
##$ME_mod= 0
##$MI= 0
##$NCOEF= 0
##$NC_proc= -8
##$NLEV= 6
##$NOISF1= 0
##$NOISF2= 0
##$NSP= 0
##$NTH_PI= 0
##$NZP= 0
##$OFFSET= 14.98509
##$PC= 1
##$PHC0= 85.70435
##$PHC1= 0
##$PH_mod= 1
##$PKNL= yes
##$PPARMOD= 0
##$PPDIAG= 0
##$PPIPTYP= 0
##$PPMPNUM= 2147483647
##$PPRESOL= 1
##$PSCAL= 4
##$PSIGN= 0
##$PYNMP= <proc.py>
##$REVERSE= no
##$SF= 400.02
##$SI= 32768
##$SIGF1= 0
##$SIGF2= 0
##$SINO= 400
##$SIOLD= 32768
##$SPECTYP= <>
##$SREGLST= <1H.CDCl3>
##$SSB= 0
##$STSI= 32768
##$STSR= 0
##$SW_p= 8223.68421052631
##$SYMM= 0
##$S_DEV= 0
##$TDeff= 65536
##$TDoff= 0
##$TI= <>
##$TILT= no
##$TM1= 0
##$TM2= 0
##$TOPLEV= 0
##$USERP1= <user>
##$USERP2= <user>
##$USERP3= <user>
##$USERP4= <user>
##$USERP5= <user>
##$WDW= 1
##$XDIM= 32768
##$YMAX_p= 449943628
##$YMIN_p= -685800
##$CURPLOT= <Network HP LaserJet P1505>
##$CURPRIN= <$Network HP LaserJet P1505>
##$DFORMAT= <normdp>
##$LAYOUT= <+/1D_H.xwp>
##$LFORMAT= <normlp>
##$PFORMAT= <normpl>
##$SURQMSG= 1
$$ End of Bruker specific parameters
$$ ---------------------------------
##NTUPLES= NMR SPECTRUM
##VAR_NAME=  FREQUENCY,     SPECTRUM/REAL,   SPECTRUM/IMAG
##SYMBOL=    X,             R,               I
##VAR_TYPE=  INDEPENDENT,   DEPENDENT,       DEPENDENT
##VAR_FORM=  AFFN,          ASDF,            ASDF
##VAR_DIM=   32768,         32768,           32768
##UNITS=     HZ,            ARBITRARY UNITS, ARBITRARY UNITS
##FACTOR=    0.250966925370066, 1,           1
##FIRST=     8223.43324360094, -32842,       -130216
##LAST=      0,             13094,           -207789
##MIN=       0,             -685800,         0
##MAX=       8223.43324360094, 449943628,    0
$$ Real data points
##PAGE= N=1
##DATA TABLE= (X++(R..R)), XYDATA
$$ [...]
19543c73191J30207A83301f1465B2027M6259J0566N4800b82594P3092E3678a45891
$$ -373191 -242984 183301 -61465 22027 68286 78852 133652 -282594 -209502 53678 -145891
19531C06608A2283L38948A38659o5782g2709H2788i0793q280p1228k2061m8142
$$ 306608 12283 351231 138659 72877 -72709 82788 -90793 -99073 -170301 -192362 -240504
19520b40504m7760a18868k0877l2358Q2050D3720a66399P1922c1893j21037e5017
$$ -240504 -288264 -118868 -139745 -172103 -90053 43720 -166399 -94477 -31893 -152930 -55017
19508c2683j4100n18523a60396f7172k18493C2576D142f4508A03795P4446G0012
$$ -32683 -46783 -565306 -160396 -67172 -285665 32576 4142 -64508 103795 178241 70012
19496c02632L8757B09995h1985j29197e6617A26944f3533H1761b88723h0587l5824
$$ -302632 -263875 209995 -81985 -211182 -56617 126944 -63533 81761 -288723 -80587 -116411
19485a16411j65078R332J24250C491a63592j60852a31744C0095b02176A80506
$$ -116411 -281489 -272157 -147907 3491 -163592 -324444 -131744 30095 -202176 180506
19474b98718J08410A69821c92847b7451k19820g1704I4674a5510j12590j52101
$$ -298718 -190308 169821 -392847 -27451 -247271 -71704 94674 -15510 -128100 -280201
19464b80201b6153j86072D7376J35739a26785H5910b50036j80757a22039A68164
$$ -280201 -26153 -212225 47376 183115 -126785 85910 -250036 -430793 -122039 168164
19453c0199j29585b1677o0347j33920O0501N6538l6966K3503j92133B05795b74240
$$ -30199 -159784 -21677 -82024 -215944 -155443 -98905 -135871 -112368 -304501 205795 -274240
19441b48590K6478B7607b30140j75512C6392b01498p1220e9879k60214E9961J56740
$$ -248590 -222112 27607 -230140 -405652 36392 -201498 -272718 -59879 -320093 59961 216701
19430B16701O7809c06130g9776K5027C5780a7849A46711d38163J40635E4967d01400
$$ 216701 284510 -306130 -79776 -54749 35780 -17849 146711 -438163 -297528 54967 -401400
19418c9381d125D175P7347R3138R589K52228i414A37371a12700c116j88150g3492
$$ -39381 -4125 4175 81522 174660 184249 436477 -9414 137371 -112700 -3116 -191266 -73492
19405a56176j0219a6474m11936D0961J7318a8596k6672l4414D3294J85126b96840
$$ -156176 -166395 -16474 -428410 40961 58279 -18596 -45268 -79682 43294 228420 -296840
19393H5136j9651b87416B14456r4274b37638N7592G0692g8375B00725I2654C9691
$$ 85136 65485 -287416 214456 120182 -237638 -180046 70692 -78375 200725 92654 39691
19381b30925i8956e786A57000b48161A31608b35131G0259J03122c37110A84717
$$ -230925 -98956 -5786 157000 -248161 131608 -235131 70259 173381 -337110 184717
19370C96884b5362o9058H3952e9299q3886j35263a128G4046l0062R0294D9213
$$ 396884 -25362 -94420 83952 -59299 -143185 -278448 -1128 74046 43984 134278 49213
19358f1144b9701n9444A28894a1780j5028j33947q0137r8693J43852n287M3738
$$ -61144 -29701 -89145 128894 -11780 -26808 -160755 -240892 -339585 -195733 -201020 -157282
19347a57282A15360a83260b5154r0857b3753j65274a468A0447f14845A35157N3735
$$ -157282 115360 -183260 -25154 -116011 -23753 -189027 -1468 10447 -614845 135157 188892
19336A88892a42124B5800a58323e1629m4676r79j1286j39331A21641a00823A09556
$$ 188892 -142124 25800 -158323 -51629 -96305 -97284 -108570 -247901 121641 -100823 109556
19324h8778A50851f5174A83484d70360I9601c17422J41232d4095j36103B43101
$$ -88778 150851 -65174 183484 -470360 99601 -317422 -176190 -44095 -180198 243101
19313a41626G7157c56797A38064J510a03834A07706I926P9554k5947c28140g0451
$$ -141626 77157 -356797 138064 139574 -103834 107706 9926 89480 63533 -328140 -70451
19301C56873D6082K3212f8546A55134b14432A28647P6321J32890c2820k03566
$$ 356873 46082 69294 -68546 155134 -214432 128647 204968 337858 -32820 -236386
19291b36386A06027d2582A25839c9217P297F9806b53845N7901Q2885q0626C8858
$$ -236386 106027 -42582 125839 -39217 -31920 69806 -253845 -195944 -113059 -193685 38858
19279h7551k2950E0092a8828a808A64359j6022b28520D4001c24140F5926K18539
$$ -87551 -110501 50092 -18828 -1808 164359 148337 -228520 44001 -324140 65926 284465
19268B84465D7591a25870k5748B36506a23422c3304A94572a34935N3122C5078
$$ 284465 47591 -125870 -151618 236506 -123422 -33304 194572 -134935 -81813 35078
19257a23635n9520q2896c7102B78430b28753q1235j39790a67642d4121k01898
$$ -123635 -183155 -266051 -37102 278430 -228753 -309988 -449778 -167642 -44121 -246019
19247b46019d1464k8906A91159n8077b61321B2456a00794j2733l20974a3008B00719
$$ -246019 -41464 -70370 191159 133082 -261321 22456 -100794 -113527 -434501 -13008 200719
19235A0436c55128F4154k1107a81845B7104b2487G6313b6638K525A10274a50072
$$ 10436 -355128 64154 43047 -181845 27104 -22487 76313 -26638 -24113 110274 -150072
19223i8322A25917J91619A02417B5426i8575M6365j71273C8499F525b34163m6728
$$ -98322 125917 317536 102417 25426 -98575 -52210 -223483 38499 6525 -234163 -280891
19212b80891A83679c471B18291a11525K2838j66538a20734b0698l37317J14571
$$ -280891 183679 -3471 218291 -111525 -88687 -255225 -120734 -20698 -358015 -243444
19202b43444a20818m3179m710f6858a1419D0695a11150o7816r1150a33925b1657
$$ -243444 -120818 -163997 -168707 -66858 -11419 40695 -111150 -178966 -270116 -133925 -21657
19190b13449A87587b8604l2789A5968c4351j27132f7581j86793B52929f6197B7431
$$ -213449 187587 -28604 -61393 15968 -34351 -161483 -67581 -254374 252929 -66197 27431
19178A04312a69800j35775I7084a24837N0369b006A39370n0367l7452j8758a89510
$$ 104312 -169800 -305575 97084 -124837 -74468 -2006 139370 89003 51551 32793 -189510
19166b15729A16573C3688b8655A20173a91947p0557N3862J02143k89504f7718
$$ -215729 116573 33688 -28655 120173 -191947 -262504 -208642 -106499 -396003 -67718
19155b04170g1416k3668c8982i102n8519J6179j88870A55241J15068n2553a98666
$$ -204170 -71416 -95084 -38982 -9102 -67621 -51442 -240312 155241 270309 217756 -198666
19143B12284a82639E6409B5868b19577I2657h4642D5544I663a84923M084e6595
$$ 212284 -182639 56409 25868 -219577 92657 -84642 45544 9663 -184923 -180839 -56595
19131e1708M550B19621c29709E0703K9950a99073K1487A69493L6555a95233j8947
$$ -51708 -47158 219621 -329709 50703 80653 -199073 -177586 169493 206048 -195233 -214180
19120b14180J060D7387h7710A44857c3544p8769j07442L0966K6337j62029M5483
$$ -214180 -213120 47387 -87710 144857 -33544 -112313 -219755 -188789 -162452 -324481 -278998
19109b78998B61602b63584J02195A77532e5543G0857f5070A11432a26024K7398
$$ -278998 261602 -263584 -161389 177532 -55543 70857 -65070 111432 -126024 -98626
19099i8626A44885F3025a2525l24127F3300d3719a9011j27131G0175b75348i5947
$$ -98626 144885 63025 -12525 -336652 63300 -43719 -19011 -146142 70175 -275348 -95947
19087A05142K33005j578k8743H7242N3535a7383k1085D70295B01548o873c72956
$$ 105142 338147 336569 307826 87242 140777 -17383 -38468 470295 201548 194675 -372956
19075a08145k94254A25093n4360J05548K8424Q7095c79556A01529a86460k37409
$$ -108145 -402399 125093 70733 176281 204705 291800 -379556 101529 -186460 -423869
19065d23869a75679G4570a22186b78m9237q5436m7864Q2946l8944l5700K0762
$$ -423869 -175679 74570 -122186 -278 -49515 -134951 -182815 -99869 -138813 -174513 -153751
19054a53751j25303A56083f3071j90453o0464A1879b17047A48023a3815n3940
$$ -153751 -279054 156083 -63071 -253524 -313988 11879 -217047 148023 -13815 -67755
19044f7755k74312H8232L3344a17701A44685f7468B89182K6551b25848d2152j65919
$$ -67755 -342067 88232 121576 -117701 144685 -67468 289182 315733 -225848 -42152 -208071
19033b08071B94671a67414A52050J08021E8430j8828O6971J69555G0199J25423
$$ -208071 294671 -167414 152050 260071 58430 39602 106573 276128 70199 195622
19023A95622a09236N2598j1638j3598A08611O0823l3045i3813A595e14160E9961
$$ 195622 -109236 -56638 -68276 -81874 108611 169434 136389 -93813 1595 -514160 59961
19011a11287G7874c9744B29609o3951G2870b62042F7806f7791A97240a6324k48037
$$ -111287 77874 -39744 229609 165658 72870 -262042 67806 -67791 197240 -16324 -264361
19000b64361A91416B9853M4787m216a10430r0824C3197b09017H5006a98322h2627
$$ -264361 191416 29853 74640 70424 -110430 -201254 33197 -209017 85006 -198322 -82627
18988A63981G6606C7908b74981a955k39587B56188A01224a85589A86621f6245
$$ 163981 76606 37908 -274981 -1955 -241542 256188 101224 -185589 186621 -66245
18977B26890f7004D0410P6733L19843c02931h9759l7377A63507g3433C3448Q4831
$$ 226890 -67004 40410 117143 436986 -302931 -89759 -127136 163507 -73433 33448 118279
18966A18279a81426f4180j79996g8789m2603j75819C87373e8457k24120B69665
$$ 118279 -181426 -64180 -244176 -78789 -121392 -297211 387373 -58457 -282577 269665
18955b23129g8458B256a26038B52010b19100a07280j1487K9330a1981k02452A65550
$$ -223129 -78458 2256 -126038 252010 -219100 -107280 -118767 -89437 -11981 -214433 165550
18943A84579b45924e4300N231A82562a18525F3681i3246j29582q5594A79101b25127
$$ 184579 -245924 -54300 -49069 182562 -118525 63681 -93246 -222828 -308422 179101 -225127
18931A8491g1063k4863m7040K3963A05427a54007B12350a76457Q4180k8729F4235
$$ 18491 -71063 -95926 -142966 -119003 105427 -154007 212350 -176457 -92277 -121006 64235
18919d80198a11312B57772g7031k3471C86942b28458J13226c4067m45855A16798
$$ -480198 -111312 257772 -77031 -100502 386942 -228458 -115232 -34067 -479922 116798
18908E9420a44548I0340d03426J70050A77218E1945a91283k1770i8061L3842A04658
$$ 59420 -144548 90340 -403426 -233376 177218 51945 -191283 -213053 -98061 -64219 104658
18896a13986j1685b7155p6572a6176j70601g1542C7186a75760a4835B11982r6537
$$ -113986 -125671 -27155 -103727 -16176 -186777 -71542 37186 -175760 -14835 211982 115445
18885A15445d53664J00567K5922H5049d08767B20454b52556N5216h2693C8812
$$ 115445 -453664 -353097 -327175 85049 -408767 220454 -252556 -197340 -82693 38812
18874a81604i0197K5175r6583N7243o1953C1268M751Q6545k0463d5004j4426o294
$$ -181604 -90197 -65022 -161605 -104362 -166315 31268 36019 122564 102101 -45004 -59430 -65724
18862f5724q3415k01O7978E2547b88388J28627G9273B9811J76146b77131C41638
$$ -65724 -149139 -149340 -81362 52547 -288388 -159761 79273 29811 205957 -277131 341638
18850g6448l473A08768M8223a04516A28304m1286h7957H3096a3030B53152B8029
$$ -76448 -79921 108768 156991 -104516 128304 87018 -87957 83096 -13030 253152 28029
18838a64339N492g369j10843j16386k9798A14222d81257a03917J6710p776A5098
$$ -164339 -158847 -7369 -118212 -234598 -264396 114222 -481257 -103917 -87207 -94983 15098
18826e3107B3075J17587c2374C0583a73089a0812C27717A4790L2800f8199A76165
$$ -53107 23075 140662 -32374 30583 -173089 -10812 327717 14790 47590 -68199 176165
18814c64374d6908n3805b7141O584B97410N8669q9806K20593d1553j24837N7891
$$ -364374 -46908 -100713 -27141 -20557 297410 356079 266273 486866 -41553 -166390 -108499
18803a08499K097l1730G7167a54354a6304j23490a4387F7471a52459k9147h8622
$$ -108499 -106402 -138132 77167 -154354 -16304 -139794 -14387 67471 -152459 -181606 -88622
18791A50205N1030l8598a09454a4475L193l0319A18686A8909J92036f4795m05974
$$ 150205 201235 162637 -109454 -14475 -11282 -41601 118686 18909 210945 -64795 -470769
18780d70769A25514a12426C15970e5939k38162a05521o1314A36768d2569A74018
$$ -470769 125514 -112426 315970 -55939 -294101 -105521 -166835 136768 -42569 174018
18769D3541b8946j0933l1848A2678d5540k60496R9464g8881H6986c387j02927
$$ 43541 -28946 -39879 -71727 12678 -45540 -306036 -206572 -78881 86986 -3387 -106314
18758a06314j60389A21113a25967O1336A31717D2692b9351G278J25046E7151j5843
$$ -106314 -266703 121113 -125967 -64631 131717 42692 -29351 7278 132324 57151 41308
18747D1308J06560c33418a05352B30544c4074j74814k53280a57105a274q7673
$$ 41308 147868 -333418 -105352 230544 -34074 -208888 -462168 -157105 -1274 -88947
18737h8947K4337k05431k700I4836a6275o058j81711p0563A64618f0656j73852
$$ -88947 -64610 -270041 -272741 94836 -16275 -22333 -204044 -274607 164618 -60656 -234508
18726b34508I6844D600a7806A39424b8241G9524J48217b61450C51289i9889D8285
$$ -234508 96844 4600 -17806 139424 -28241 79524 227741 -261450 351289 -99889 48285
18714a32149J5557G7133g8383A67088J6230a21191Q001k59631J68903O5195k9737
$$ -132149 -116592 77133 -78383 167088 183318 -121191 -113190 -372821 -203918 -138723 -168460
18703a68460b2216m1731r0352j72756a59394O9742B45999B0449c05554A59513
$$ -168460 -22216 -63947 -154299 -327055 -159394 -89652 245999 20449 -305554 159513
18692d47786b7150B56632b41964J12766I5677b21776A92745c47978B70696a10897
$$ -447786 -27150 256632 -241964 -129198 95677 -221776 192745 -347978 270696 -110897
18681g104A57715m1823a82466C18875a80731A7901a25647B48585c05940A27580
$$ -7104 157715 115892 -182466 318875 -180731 17901 -125647 248585 -305940 127580
18670e7130j39966k75312a09997E6496a51961j24285k8701a14706c9427A37228
$$ -57130 -197096 -472408 -109997 56496 -151961 -276246 -304947 -114706 -39427 137228
18659a6672j96027A6562L52241h3209k85247a63539d8930j25706F589b70125h7365
$$ -16672 -212699 16562 368803 -83209 -368456 -163539 -48930 -174636 6589 -270125 -87365
18647b40509Q4052A9745i8134A77283O5791O304g0671H5850c07188A88774b9870
$$ -240509 -156457 19745 -98134 177283 243074 249378 -70671 85850 -307188 188774 -29870
18635A23473f4950b1633o5177A38835J9352c64106g0557K8688O724k98553I1668
$$ 123473 -64950 -21633 -86810 138835 158187 -364106 -70557 -41869 -35145 -333698 91668
18623B24768b463k10562j3223K5743q033F7561a64412e8654o0988q8235B50571
$$ 224768 -2463 -213025 -226248 -200505 -208538 67561 -164412 -58654 -119642 -207877 250571
18611A36184o1759b08671e5818j00248A75159d4228k6776j0918A3246g7286B02471
$$ 136184 74425 -208671 -55818 -156066 175159 -44228 -71004 -81922 13246 -77286 202471
18599A42331a15437K3196B05232a16619A40791o6570a74089Q2839j9116l7292
$$ 142331 -115437 -92241 205232 -116619 140791 74221 -174089 -91250 -110366 -147658
18589a47658A84663h8293D1530a9409m9316Q171J2322l353A9905b72443B82783
$$ -147658 184663 -88293 41530 -19409 -68725 -60554 -48232 -51585 19905 -272443 282783
18577D31810g4791k91628A6129c476G3731a07025B07271E2043d9653j56520O4409
$$ 431810 -74791 -366419 16129 -3476 73731 -107025 207271 52043 -49653 -206173 -141764
18566a41764B4238b21053A20266a50k99295J29688k35684k7845c0672D6360c3039
$$ -141764 24238 -221053 120266 -150 -299445 -169757 -405441 -433286 -30672 46360 -33039
18554H96a32018A60135a77108c6601J4257A17710a49685A57659l1857b88971G0040
$$ 896 -132018 160135 -177108 -36601 -22344 117710 -149685 157659 125802 -288971 70040
18542h1022A87450B1711g2614G8757B8934b12354b911r4096D5440J47079c4976
$$ -81022 187450 21711 -72614 78757 28934 -212354 -2911 -97007 45440 192519 -34976
18530a05954A6727L0548a97423G9386a04578A12526P142B0455a33939A68272i1112
$$ -105954 16727 47275 -197423 79386 -104578 112526 119668 20455 -133939 168272 -91112
18518g1431J3855A5105b39834a11681B35028C3097b90865B2212c4050j56977A91428
$$ -71431 -57576 15105 -239834 -111681 235028 33097 -290865 22212 -34050 -191027 191428
18506b70921J32387A57522p6997b13402p8861H9251b57883I7784K7886D0b16195
$$ -270921 -138534 157522 80525 -213402 -292263 89251 -257883 97784 125670 40 -216195
18494d5105j52663o3102J16010O7297B3673c52915f1887k4715E2246b91796A88876
$$ -45105 -197768 -260870 -144860 -77563 23673 -352915 -61887 -86602 52246 -291796 188876
18482C6521a22317l12765a4479k10604J6088A31023J47329b7238D1623I789J15280
$$ 36521 -122317 -435082 -14479 -225083 -208995 131023 278352 -27238 41623 9789 125069
18471A25069a12700j95553C40968b54345a10143B26820G5098b745B93328j25466
$$ 125069 -112700 -308253 340968 -254345 -110143 226820 75098 -2745 293328 167862
18461A67862d31722a21802j3542e8369F0084Q829a81264a1894k27867F6228A3686
$$ 167862 -431722 -121802 -135344 -58369 60084 68913 -181264 -11894 -239761 66228 13686
18449a73548A46829a0383k19797h8422j26482O8072E6350a77135p6082B37982
$$ -173548 146829 -10383 -230180 -88422 -214904 -146832 56350 -177135 -253217 237982
18438A05873d8656b0808j80907N6748k5449D7356a00618a6342I4736b10680C4512
$$ 105873 -48656 -20808 -201715 -144967 -170416 47356 -100618 -16342 94736 -210680 34512
18426a22825F6915a5722l27988a40067N92L7448c0056A23310C2662a70789K2868
$$ -122825 66915 -15722 -343710 -140067 -139475 -102027 -30056 123310 32662 -170789 -147921
18415a47921K767o7313R7504B26793G3999A7356a91732M3002A66314J36050b04262
$$ -147921 -145154 -212467 -114963 226793 73999 17356 -191732 -148730 166314 302364 -204262
18403B6371b63467A56563C723a80984H8376L8331b7655I4454J50616i837k66990
$$ 26371 -263467 156563 3723 -180984 88376 126707 -27655 94454 245070 -9837 -276827
18392b76827g699k9250B85881b01355H2551d0914k49352R6089D2062a11946H7583
$$ -276827 -7699 -36949 285881 -201355 82551 -40914 -290266 -194177 42062 -111946 87583
18380b59500h5664b9448a3769k79015M8364B46905b19469A85123C9946d7031e002
$$ -259500 -85664 -29448 -13769 -292784 -244420 246905 -219469 185123 39946 -47031 -5002
18368B88229m9067a99623i6212j0722l335F415J58424c1514k68421B7994b75668
$$ 288229 239162 -199623 -96212 -106934 -110269 6415 164839 -31514 -299935 27994 -275668
18356b79557B18918E8468h9237B42675c1724n95704A94317i7256q478j84812J40145
$$ -279557 218918 58468 -89237 242675 -31724 -627428 194317 -97256 -105734 -290546 -150401
18345a50401d2987A37042n5757J14102a14065A95120L51441A01170b57630O6240
$$ -150401 -42987 137042 81285 195387 -114065 195120 546561 101170 -257630 -191390
18335a91390B638d3719G0075J56622n7392b0019l51867a79496q0497M0477a00309
$$ -191390 2638 -43719 70075 226697 169305 -20019 -371886 -179496 -259993 -219516 -100309
18323b61388H3109B8584j2527d6326n3792K09I7997b6982B21455i4037E0801b97231
$$ -261388 83109 28584 16057 -46326 -100118 -99909 97997 -26982 221455 -94037 50801 -297231
18310b00607D9731d2460o792A11388a40599a1740k12039B65427E9716a35113j24550
$$ -200607 49731 -42460 -49252 111388 -140599 -11740 -223779 265427 59716 -135113 -259663
18299b59663b5383A20320R9689g7252e919C17096d233j57918j4695A39344g3509
$$ -259663 -25383 120320 220009 -77252 -5919 317096 -4233 -162151 -176846 139344 -73509
18287F8331a25654A72004J5701b1159I7455Q4028h4687B36492C4375N4017b9888
$$ 68331 -125654 172004 187705 -21159 97455 181483 -84687 236492 34375 88392 -29888
18275a99076I3041C489J37444E1390c28508a29662c2029l8152G9000M0051j4567
$$ -199076 93041 3489 140933 51390 -328508 -129662 -32029 -70181 79000 119051 104484
18264A04484M5528F2019J11381h1516o6254j13035a22956E03502b44611A21745
$$ 104484 150012 62019 173400 -81516 -147770 -260805 -122956 503502 -244611 121745
18253c31229a9727k91173a3501D5322K80364G6104a7006B45978b03386i8996I9349
$$ -331229 -19727 -310900 -13501 45322 325686 76104 -17006 245978 -203386 -98996 99349
18241H8846c16332J51943P4873j3547G3148b06073R4327n3981r284F9385O1142
$$ 88846 -316332 -164389 -89516 -103063 73148 -206073 -111746 -165727 -175011 69385 130527
18230A30527a17274e322j33978K5513F1495Q8161i8366F6231J99733b41046A3709
$$ 130527 -117274 -5322 -139300 -113787 61495 149656 -98366 66231 265964 -241046 13709
18218C2674K8068e7745k34162a21207H3858c73910B0752e36769b30555n4554D1658
$$ 32674 60742 -57745 -291907 -121207 83858 -373910 20752 -536769 -230555 -285109 41658
18206A6769p932K5855A3670i6886m3132B33422i4253m149D0951f9933a9860k46040
$$ 16769 8837 34692 13670 -96886 -140018 233422 -94253 -98402 40951 -69933 -19860 -265900
18194b65900Q8719c4810E4799L94428j30953b28681A05345m0461a45449B04582
$$ -265900 -177181 -34810 54799 449227 318274 -228681 105345 64884 -145449 204582
18183h1172l04328a6507H1474i171A66553d20951A77013L8492a64847E8549J84798
$$ -81172 -385500 -16507 81474 -9171 166553 -420951 177013 215505 -164847 58549 243347
18172B43347D5599b5865j44457A16347D8635K22146j24525b29802f8358j11396
$$ 243347 45599 -25865 -170322 116347 48635 270781 146256 -229802 -68358 -179754
18162a79754G9230k4744g9196P547k79203P8026k975J18766A65730c07831J12696
$$ -179754 79230 54486 -79196 -71649 -350852 -272826 -275801 -157035 165730 -307831 -195135
18151a95135E7148e8236k07569A5211i9186K3380C60759A14435c21443J14990
$$ -195135 57148 -58236 -265805 15211 -99186 -75806 360759 114435 -321443 -206453
18141b06453A17569a18987J0467j16657C2584g0311J518G5783O1177L82651a39176
$$ -206453 117569 -118987 -108520 -225177 32584 -70311 -68793 75783 136960 519611 -139176
18129f0041G7651L3336L8153b59048A02653B9604B95L6978J73951c4915n269p2900
$$ -60041 77651 110987 149140 -259048 102653 29604 295 37273 211224 -34915 -40184 -113084
18117a13084C35055K65178f5636C54942H9965M8422a54776b0554j03364k33284
$$ -113084 335055 600233 -65636 354942 89965 138387 -154776 -20554 -123918 -357202
18107c57202b8417e586D1077K9444Q3312f6888j88107B0674J84950D3553A1109
$$ -357202 -28417 -5586 41077 70521 153833 -66888 -254995 20674 205624 43553 11109
18095f5626l23722a01587j00565E8637K35890F296K63457C4999a14732r6488e9563
$$ -65626 -389348 -101587 -202152 58637 294527 6296 269753 34999 -114732 -211220 -59563
18083B31514J392F8486b05394p8484g3703l27528J26524A66036J13902a80078
$$ 231514 232906 68486 -205394 -283878 -73703 -401231 -274707 166036 279938 -180078
18072h0243M0114A93627a97114F113a59446c7771r1448q5922A56449b47400a08474
$$ -80243 -40129 193627 -197114 6113 -159446 -37771 -129219 -215141 156449 -247400 -108474
18060C29717F3758M31564f3651B19342I6254f4904D2469c39290g2165L0677F0420
$$ 329717 63758 495322 -63651 219342 96254 -64904 42469 -339290 -72165 -41488 60420
18048D1912i9545A05736b13712o0442B24610b10077A41399a22196L5197p1723
$$ 41912 -99545 105736 -213712 -274154 224610 -210077 141399 -122196 -86999 -158722
18038a58722M9635H9944l4493a00023B3525a09743m0888C08139A5209N5663j4922
$$ -158722 -109087 89944 55451 -100023 23525 -109743 -150631 308139 15209 70872 55950
18027E5950a07223e056D7312N5445d24526B27675A7945K38240n0824b4402j22740
$$ 55950 -107223 -5056 47312 102757 -424526 227675 17945 256185 205361 -24402 -147142
18016a47142f4539l51762a71417k64163R6261H1424a3795B8790K29507B3559g5881
$$ -147142 -64539 -416301 -171417 -435580 -339319 81424 -13795 28790 258297 23559 -75881
18004a5031B932a19824k1587L5323A41357g0556A20979a33346A21523C782d7863
$$ -15031 2932 -119824 -141411 -106088 141357 -70556 120979 -133346 121523 3782 -47863
17992B19666a32886j53119A11848l1046a49702I2476b28093G1361J90985A8628
$$ 219666 -132886 -286005 111848 80802 -149702 92476 -228093 71361 262346 18628
17981b93747a17929a5886I1146j5370A9081Q3809c89719J79118c6563B75182A535
$$ -293747 -117929 -15886 91146 75776 19081 102890 -389719 -210601 -36563 275182 1535
17969a95605k42843H2584C0845j3128a39836N1368l5571n4764A59552M9516e613
$$ -195605 -438448 82584 30845 17717 -139836 -88468 -124039 -178803 159552 209068 -5613
17957A23922d35805C43039A47169L9287A3098O9817a6415m6999j1632n9186d9283
$$ 123922 -435805 343039 147169 186456 13098 82915 -16415 -63414 -75046 -134232 -49283
17945a31710K1270K0751A27694b71723C85318A73041a62472A49869o1776K5814
$$ -131710 -110440 -89689 127694 -271723 385318 173041 -162472 149869 88093 113907
17935A13907c4575B64727a81712K4875J7796a1855k9861B00836E3573a9818B7463
$$ 113907 -34575 264727 -181712 -156837 -139041 -11855 -41716 200836 53573 -19818 27463
17923a22719e7548A93765F4274J25206H6105Q4136h7559A97835J58155j22491
$$ -122719 -57548 193765 64274 189480 86105 170241 -87559 197835 355990 233499
17913B33499A00784a74226B58438a3648B35748D2284i1373I7462K0390f1315j04151
$$ 233499 100784 -174226 258438 -13648 235748 42284 -91373 97462 117852 -61315 -165466
17902a65466J1741l2283A02615a10889F5266k3128J49598J0906i5684F6069J29528
$$ -165466 -153725 -186008 102615 -110889 65266 42138 191736 202642 -95684 66069 195597
17891A95597p8557n6615a39923A58728M8093A9905L5675F458a58048A05492e9730
$$ 195597 117040 60425 -139923 158728 206821 19905 55580 6458 -158048 105492 -59730
17879B24038E781a38229A23948J00628c391l61153A827J19581g7999B38616F2186
$$ 224038 5781 -138229 123948 224576 -3391 -364544 1827 121408 -77999 238616 62186
17867b61197d6152I5391a523B63681c5995A06953d95981h6042A18975a05832k20765
$$ -261197 -46152 95391 -1523 263681 -35995 106953 -495981 -86042 118975 -105832 -326597
17856c26597b6517A53462a24406N63A57503a95417f657j76613E5066b19966D50581
$$ -326597 -26517 153462 -124406 -123843 157503 -195417 -6657 -183270 55066 -219966 450581
17844A67557k6827C0766J09893N4064H8504a83618B56282b34188O5978J7415A35639
$$ 167557 140730 30766 140659 194723 88504 -183618 256282 -234188 -168210 -150795 135639
17832A9921J87844e6707B97815b01248a3966k37029f455B1608J56717g0599j2059
$$ 19921 207765 -56707 297815 -201248 -13966 -250995 -6455 21608 178325 -70599 -82658
17821h2658d0017A91419J6788c944B04637h8340c8969E510c99240a79770L7576
$$ -82658 -40017 191419 208207 -3944 204637 -88340 -38969 5510 -399240 -179770 -142194
17810a42194I2385M11598b6132C3813h3211j252c6530E3798J49079C40b14146
$$ -142194 92385 503983 -26132 33813 -83211 -84463 -36530 53798 202877 340 -214146
17798c0837n3272j76419a00561a4103C7610L666d0145r3890a4625N719D0238j9121
$$ -30837 -84109 -260528 -100561 -14103 37610 41276 -40145 -134035 -14625 -8906 40238 21117
17786B1117J05182C0244b289k90444A6914a10553j14803f9464A78440P7437i1242
$$ 21117 126299 30244 -2289 -292733 16914 -110553 -225356 -69464 178440 255877 -91242
17774f6592j56417C798J26L76798b8638k4020l0745B73173E776a91923A29316
$$ -66592 -223009 3798 3924 380722 -28638 -52658 -83403 273173 5776 -191923 129316
17762B39549J58096c48183g3761A37701a45772o0332Q3951n5810o8146I0772M2080
$$ 239549 397645 -348183 -73761 137701 -145772 -206104 -122153 -177963 -246109 90772 132852
17751A32852n9166M4388k4561j3227J5083a53260A23946o280j9487k7391L2607
$$ 132852 73686 118074 93513 80286 95369 -153260 123946 117666 98179 70788 103395
17740A03395K1238l2143J43728b88644J15982D1520K69463e7764A80784b43677
$$ 103395 124633 92490 236218 -288644 -172662 41520 310983 -57764 180784 -243677
17729A51097l2722P1930E587J50039A9882i9240B69173p1932h119C9949j6569
$$ 151097 118375 190305 5587 155626 19882 -99240 269173 197241 -8119 39949 23380
17718B3380a79275B14237H2845a55351j49949a18720A29310j2776a4873k11982
$$ 23380 -179275 214237 82845 -155351 -305300 -118720 129310 116534 -14873 -226855
17708b26855C50647a74666g7019B4424Q5024d84153a65235e1312k47715a6773
$$ -226855 350647 -174666 -77019 24424 109448 -484153 -165235 -51312 -299027 -16773
17697A21543l2413J557g3984A85953C3408J04868m8519d5608A71274b1096n1771
$$ 121543 89130 90687 -73984 185953 33408 138276 89757 -45608 171274 -21096 -72867
17686g2867M247o1320B00271O231d10124B46163a48044j34182f6258j03832L253
$$ -72867 -68620 -129940 200271 206502 -410124 246163 -148044 -282226 -66258 -170090 -166837
17675a66837A07310a6353k5893l3325k274F00990d116j50642B7777J66850D6970
$$ -166837 107310 -16353 -42246 -75571 -77845 600990 -4116 -154758 27777 194627 46970
17663F6874f9457j97491A24746c99172a72547A71842i7573C08734C9756J96479
$$ 66874 -69457 -266948 124746 -399172 -172547 171842 -97573 308734 39756 236235
17653B36235A04227k884C7990K00341H5928A9739J87524a73835b4566A65008N7917
$$ 236235 104227 101343 37990 238331 85928 19739 207263 -173835 -24566 165008 222925
17642B22925r4490g2637j64269c913m709A45698M5082A8986J09877g1308h97E1707
$$ 222925 128435 -72637 -236906 -3913 -8622 145698 190780 18986 128863 -71308 -897 51707
17629A47995a89080m6165C2734c0212p488k26058I7007m841i697A78510b4351
$$ 147995 -189080 -235245 32734 -30212 -37700 -263758 97007 92166 -9697 178510 -24351
17617a0135G3983a67186A46525b43988G2203K35310g8194J0248A53011b5609j14233
$$ -10135 73983 -167186 146525 -243988 72203 307513 -78194 -67946 153011 -25609 -139842
17606a39842B46498G6208j4843L71609B6016d6404A02217J30395b12456a8796
$$ -139842 246498 76208 61365 432974 26016 -46404 102217 232612 -212456 -18796
17595A72361d7281j35247f286n40A94477C3431P9689J5297a63090D26889A74487
$$ 172361 -47281 -182528 -6286 -6826 194477 33431 113120 128417 -163090 426889 174487
17583g0964A32452K29516a55430B81474p9842D532K86029b85161e2933A0992L30864
$$ -70964 132452 361968 -155430 281474 201632 4532 290561 -285161 -52933 10992 341856
17572C41856A04335K62081C6368J36928b23020a7742A30491B5735d490B11151
$$ 341856 104335 366416 36368 173296 -223020 -17742 130491 25735 -4490 211151
17561A72697d3924B49616m3434a33204A54804I160J55692n4901d9966B49052a15948
$$ 172697 -43924 249616 206182 -133204 154804 9160 164852 109951 -49966 249052 -115948
17549A11980J35014A3047a12571B7884c63993F7187h497B10294I4689J21938b46238
$$ 111980 246994 13047 -112571 27884 -363993 67187 -8497 210294 94689 216627 -246238
17537A66076A6958a78593B80245e9576j49554B84306A25596D8678b45012h4132
$$ 166076 16958 -178593 280245 -59576 -209130 284306 125596 48678 -245012 -84132
17526B21762a8212F3108K6168b46211I7534J03922J00521L8973q6473G1980j5478
$$ 221762 -18212 63108 89276 -246211 97534 201456 301977 340950 254477 71980 56502
17515E6502C845K32332o9453J40716G054O6382a00624B01418M1448G2132O406
$$ 56502 3845 236177 166724 307440 7054 73436 -100624 201418 242866 72132 78538
17504G8538J47046G5763R9031J23435A41168j7839a45355A46052i1914I9998l3161
$$ 78538 225584 75763 174794 298229 141168 123329 -145355 146052 -91914 99998 66837
17493F6837A9624e2391B23667h1098B43546K9282G4627g191C07806c2865B86615
$$ 66837 19624 -52391 223667 -81098 243546 272828 74627 -7191 307806 -32865 286615
17481B14660q9223d029D17076A59198b9168C33492j53286R4525j04132J3921a5105
$$ 214660 125437 -4029 417076 159198 -29168 333492 180206 274731 170599 184520 -15105
17469A55478p5281M7826B1035R0269K10316c00814B64812J06530H1915j961N2376
$$ 155478 80197 128023 21035 111304 321620 -300814 264812 371342 81915 79954 132330
17458A32330a65906A45612J36779B7936a04192A09518N5269K6340K23697J54553
$$ 132330 -165906 145612 282391 27936 -104192 109518 164787 191127 414824 569377
17448E69377B61898J21859J24571I8099J59908O325A15513J70997k1548M7943
$$ 569377 261898 383757 508328 98099 258007 264332 115513 286510 264962 312905
17438C12905j8136B155f0673A28337L43669f2057A85467q6073h3457D03082i5584
$$ 312905 294769 2155 -60673 128337 472006 -62057 185467 99394 -83457 403082 -95584
17426C29715Q7405b10638C56594j10387r4258L1044J63370f4736B36868L5205
$$ 329715 417120 -210638 356594 246207 151949 182993 346363 -64736 236868 272073
17416B72073K26586A80194J09917N1038A30120K34754I2705J38471J80853A26472
$$ 272073 498659 180194 290111 341149 130120 364874 92705 231176 412029 126472
17405A05618k1697m0493J85141a00435C01549A45413e5140D0842g5032b27k0471
$$ 105618 83921 43428 228569 -100435 301549 145413 -55140 40842 -75032 -227 -20698
17394b0698G8594K9073Q566K35103A44314a3877A83107F344N2811J71263j00278
$$ -20698 78594 107667 116233 351336 144314 -13877 183107 6344 59155 230418 130140
17383A30140a10062B44883g7106D66045c2424A28990J07574O1311f0301C1233
$$ 130140 -110062 244883 -77106 466045 -32424 128990 236564 297875 -60301 31233
17372E8108K67222a00412B54487d3721A99503G5595J15096m3493h680A48167L1254
$$ 58108 325330 -100412 254487 -43721 199503 75595 190691 147198 -8680 148167 179421
17361A79421j1381L5986e760A23143p169Q9574J95198a1218B92789L40688B29285
$$ 179421 168040 204026 -5760 123143 115974 205548 400746 -11218 292789 633477 229285
17349C23550E8541J69M756J20724p7487L7004N1167b9635B50302J1910J69242
$$ 323550 58541 58710 63466 184190 106703 143707 194874 -29635 250302 262212 431454
17338D31454J9528I4293m4945J33804L6763D0622J22657i531D52482o523b7760
$$ 431454 450982 94293 49348 183152 219915 40622 163279 -9531 452482 445959 -27760
17326C47677A40234a11239B03111K05717A03516K82670j3833b20280B12566p5747
$$ 347677 140234 -111239 203111 408828 103516 386186 372353 -220280 212566 136819
17316A36819J12345A7758K07665a055B1154L04320J8908O286K919A55307C5662
$$ 136819 249164 17758 225423 -1055 21154 325474 344382 350668 353587 155307 35662
17304B55466h6C18269k8594l6354F5322J23505M0726K57569M3596H821L94443
$$ 255466 -86 318269 289675 253321 65322 188827 229553 487122 530718 8821 403264
17293D03264A48272F8800J21111J7486E9280J10001R0646K7288j43090M6202I5141
$$ 403264 148272 68800 189911 207397 59280 169281 259927 287215 144125 190327 95141
17281B70361J0879k5771G1174Q2239G2274J20921F6747K0451a30723A20711J57423
$$ 270361 281240 255469 71174 153413 72274 193195 66747 87198 -130723 120711 278134
17270B78134L3139I9628M7280j2921l1556A8861a91835D13022q8549A35254l0770
$$ 278134 311273 99628 146908 133987 102431 18861 -191835 413022 324473 135254 104484
17259A04484K82250n3131A44046d2292E14556G3680J94103J37928B1387L54637
$$ 104484 386734 333603 144046 -42292 514556 73680 267783 405711 21387 376024
17249C76024A19424J14765n3296c965r528B04314J48299A04141J99721J67736
$$ 376024 119424 234189 180893 -3965 -13493 204314 352613 104141 303862 471598
17239D71598k21007H4401L39476j94961O7973b10544a04315E30131k64282D6751
$$ 471598 250591 84401 423877 228916 296889 -210544 -104315 530131 265849 46751
17228f9278H169J04250K26283K6052I4361L68218j35188a0794C35952j03385M5981
$$ -69278 8169 112419 338702 364754 94361 462579 327391 -10794 335952 232567 278548
17217B78548F9256k6928K46578q0633D3457P14828E9001L39935b8924E63583k49180
$$ 278548 69256 42328 288906 208273 43457 758285 59001 398936 -28924 563583 314403
17206C14403o3645J10936l5870b29382C95625A79748K86694H4658M8650J87449
$$ 314403 250758 361694 325824 -229382 395625 179748 466442 84658 133308 320757
17196C20757o9983o3202R6604p4464k3462a2667E14350A38023J26477K5392m9011
$$ 320757 250774 187572 284176 209712 186250 -12667 514350 138023 264500 289892 240881
17185B40881o0371J10576N8258q5732c0849B28957N2669n4400J3508K13887B883
$$ 240881 180510 291086 349344 263612 -30849 228957 281626 227226 240734 454621 2883
17173B64609M35701k48310n6985L05677C49158J64940j32491p9119K55479B09817
$$ 264609 700310 452000 395015 700692 349158 514098 381607 302488 557967 209817
17162B14584J94524B2158J60734n1951R1302K79759b97770A32073M68130j82229
$$ 214584 409108 22158 182892 130941 222243 502002 -297770 132073 600203 417974
17152D17974j93522Q04n1958K00414J98840k08230O8544J65307B20101j9932J17225
$$ 417974 224452 225256 173298 373712 572552 364322 432866 598173 220101 200169 317394
17141C17394L0609N6507F1237J12119J94328j01352M0939G3315M59530A31908
$$ 317394 348003 404510 61237 173356 367684 266332 307271 73315 532845 131908
17130D31474A99933o456J24095J28817n1563p0629N1441o2032J30102j26227K9762
$$ 431474 199933 193477 317572 446389 394826 324197 375638 313606 443708 317481 347243
17119C47243A19822N00629k84244L04046k7083j80897j15482P6751j48381M0379
$$ 347243 119822 620451 336207 640253 613170 432273 316791 393542 245161 285540
17109B85540K30581M28242l70116k33620R203J57870k31671A07427N22316B12361
$$ 285540 516121 944363 574247 340627 349830 507700 276029 107427 629743 212361
17098D54651M75122C88916A33620L18884O066j13467K41428B89701K85079k56542
$$ 454651 929773 388916 133620 452504 458570 345103 586531 289701 574780 318238
17088C18238j08798L56203p3211o1698L42882k83188k40561K0147L23956B16950
$$ 318238 209440 565643 492432 430734 773616 490428 249867 270014 593970 216950
17077E98544j61371p1691L09490A06097N78864m9994k00830A96148N59951k22169
$$ 598544 437173 365482 674972 106097 684961 634967 434137 196148 756099 533930
17067E33930j60664j84707K38928J88196k59085k0174K15521o9507j41505K14089
$$ 533930 373266 188559 427487 615683 356598 336424 551945 482438 340933 555022
17057E55022o4098j24251L69484j34428J44569C69154J19465O5778j02798K84888
$$ 555022 490924 366673 736157 601729 746298 369154 488619 554397 451599 736487
17047G36487J46522l06114o8576K08728j10431j32169K17303J53194l09911J67465
$$ 736487 883009 576895 508319 717047 606616 474447 691750 844944 535033 702498
17037G02498J35090l45777L14529q9884J0407J52467k95945J32089N1304k01038
$$ 702498 837588 491811 806340 716456 726863 879330 583385 715474 766778 565740
17027E65740K98728n5686k73493J87399j41136R507J58104j07032M9532L97412
$$ 565740 864468 808782 535289 722688 581552 591059 749163 642131 691663 1089075
17017A089075D08518J72048J42955J25358j73548K26838o8465j61943q5726P47468
$$ 1089075 408518 580566 723521 848879 675331 902169 833704 671761 586035 1333503
17007A333503n11850j4952J61726L6677m676k69203J38100n5678m9362m7159k71802
$$ 1333503 821653 806701 968427 1005104 1000428 731225 869325 813647 764285 717126 445324
16996D45324O8851M17251j30278j36622j837K43627j94995L30033l09581K09833
$$ 445324 514175 931426 801148 664526 662689 906316 711321 1041354 731773 941606
16986I41606p6797J38779k70127M10012l51636L97400k41525k93635L38649J14417
$$ 941606 864809 1003588 733461 1143473 791837 1189237 947712 654077 992726 1107143
16976A107143m24998N01955j98348J02959j14557K07967J45519k23980j98524
$$ 1107143 682145 1184100 985752 1088711 974154 1182121 1327640 1103660 905136
16967I05136J78149l8556j43798L62368l80098K32918l7250j24827R9172J2128
$$ 905136 1083285 1044729 900931 1263299 883201 1116119 1078869 954042 1053214 1065342
16957A065342J5122l25012L58997k58741L66116l3779k56160M06688J05189j47145
$$ 1065342 1080464 755452 1114449 855708 1221824 1188045 931885 1338573 1443762 1296617
16947A296617l85565L96229L06621m07266K68329O2763k41197L02710l02177R9987
$$ 1296617 911052 1307281 1613902 1206636 1474965 1537728 1296531 1599241 1297064 1397051
16937A397051K44337o765j83841j10771O806k34495M78205l74205J64027K545
$$ 1397051 1641388 1634623 1450782 1340011 1346817 1112322 1590527 1216322 1380349 1382894
16927A382894K87542o234p8601q3320L71187k71217l1755q4207J62206J091n503
$$ 1382894 1670436 1664202 1585601 1502281 1873468 1602251 1570496 1486289 1648495 1649586 1644083
16916A644083j29560J71987j20250L55444k4697l79187P3493J47912L5617J31613
$$ 1644083 1514523 1686510 1566260 1921704 1897007 1517820 1591313 1739225 1774842 1906455
16906A906455n8041l62958K59489n2097L89039j65594j97249L57542k90120K08916
$$ 1906455 1848414 1485456 1744945 1692848 2081887 1916293 1719044 2076586 1786466 1995382
16896A995382k28785N81723m47542J9987j1127K89464k89989K65889k28976K57515
$$ 1995382 1766597 2348320 1900778 1920765 1909638 2199102 1909113 2175002 1946026 2203541
16886B203541O102j24249L30339k96837J63247K94518j20722j61176K98470M3295
$$ 2203541 2209643 2085394 2415733 2118896 2282143 2576661 2455939 2294763 2593233 2636528
16876B636528L44224m09477Q1041K0058K78461k65422Q3915K3277k21895L6936
$$ 2636528 2980752 2571275 2652316 2672374 2950835 2685413 2769328 2792605 2570710 2607646
16866B607646M29856K20438r9517p6744J298J54373J5770p9698K30979K11019
$$ 2607646 3037502 3257940 3158423 3081679 3082977 3237350 3253120 3173422 3404401 3615420
16856C615420j34765J28246l27597M09042o5761L32558n60400J77426K26250J1885
$$ 3615420 3480655 3608901 3281304 3690346 3624585 3957143 3396743 3574169 3800419 3812304
16846C812304J42745L90420r0720j45651L86971l61497K7450J83114L64064l15240
$$ 3812304 3955049 4345469 4254749 4109098 4496069 4134572 4162022 4345136 4709200 4393960
16836D393960k1312N29364p4947N0356J33674n459J37611j1289M20976j42258
$$ 4393960 4372648 4902012 4827065 4877421 5011095 5005636 5143247 5131958 5552934 5410676
16826E410676J39082J51133J82466j13135K37765O6086K10116J84616j23266J98960
$$ 5410676 5549758 5700891 5883357 5770222 6007987 6074073 6284189 6468805 6345539 6544499
16816F544499K87928j48126N26216j73281L12053K31834j72932L43704L52332
$$ 6544499 6832427 6684301 7210517 7037236 7349289 7581123 7408191 7751895 8104227
16807H104227j79915K22181k1068L72375K60244L60209k03411P72778r3504L42876
$$ 8104227 7924312 8146493 8125425 8497800 8758044 9118253 8914842 9687620 9594116 9936992
16797I936992K97246J91387L15581j3929K11060L62902M43071K42891K85359L02088
$$ 9936992 10234238 10425625 10741206 10727277 10938337 11301239 11744310 11987201 12272560 12574648
16787A2574648N98221K60756N49975m0846L14277P45361K14062P37316K43719
$$ 12574648 13172869 13433625 13983600 13942754 14257031 15002392 15216454 15953770 16197489
16778A6197489N17851O83917M64752N96713N59165J040048N92342K11237J132345
$$ 16197489 16715340 17399257 17864009 18460722 19019887 20059935 20652277 20863514 21995859
16769B1995859M44329P11098R17629J218569O49195P24085J163015J387007P75995
$$ 21995859 22440188 23151286 24068915 25287484 25936679 26660764 27823779 29210786 29986781
16760B9986781J309691J614317R48926J576730J495876J602608J607843J828564
$$ 29986781 31296472 32910789 33859715 35436445 36932321 38534929 40142772 41971336
16752D1971336K118070J884033K104694K432436K407500K406120K818173K787792
$$ 41971336 44089406 45973439 48078133 50510569 52918069 55324189 58142362 60930154
16744F0930154L005429K892328M002116L751535L814575M423161L808268M907514
$$ 60930154 63935583 66827911 70830027 74581562 78396137 82819298 86627566 91535080
16736I1535080M499796N294533N141872N106478N724155N263593O211902N155614
$$ 91535080 96034876 101329409 106471281 111577759 117301914 122565507 128777409 133933023
16728A33933023N609461N456831N121906M628555M244453L880422K893755K211185
$$ 133933023 139542484 144999315 150121221 154749776 158994229 162874651 165768406 167979591
16720A67979591J427813N79477m96355j263683k208532k970841l880299m024787
$$ 167979591 169407404 169986881 169490526 168226843 166018311 163047470 159167171 155142384
16712A55142384n362662m961039n424040n806777n668974n623322o278726n542556
$$ 155142384 149779722 144818683 139394643 133587866 127918892 122295570 116016844 110474288
16704A10474288n535136n424173n083716m766906m762690m823611m009032m107012
$$ 110474288 104939152 99514979 94431263 89664357 84901667 80078056 76069024 71962012
16696G1962012l551823l299518l440054k885555l250918k471895k728436k641859
$$ 71962012 68410189 65110671 61670617 58785062 55534144 53062249 50333813 47691954
16688D7691954j833378k582361j935452j755970j492010j932977j665059j043669
$$ 47691954 45858576 43276215 41340763 39584793 38092783 36159806 34494747 33451078
16680C3451078j954181r37355j422782j201306q22386j444679q31351n40275j344623
$$ 33451078 31496897 30559542 29136760 27935454 27113068 25668389 24837038 24296763 22952140
16671B2952140o16694q81192o95909r84874n00394r15447o28711j98684p36382
$$ 22952140 22335446 21454254 20758345 19773471 19273077 18357630 17728919 17530235 16793853
16662A6793853o11770n84820l14255p29525k36076m96565m84344m12189l53241
$$ 16793853 16182083 15597263 15283008 14553483 14317407 13820842 13336498 12924309 12571068
16653A2571068m36129j94128m49429l48464j69432m14226p4874l16858m75801
$$ 12571068 12134939 11940811 11491382 11142918 10973486 10559260 10484386 10167528 9691727
16644I691727k67936l7043l12420m08015q0068K3155m86321O3878m70038N3060
$$ 9691727 9423791 9386748 9074328 8666313 8586245 8609400 8123079 8186957 7716919 7769979
16634G769979k58609j28550l10715N5830l70824L990j02135p18386M00167k40466
$$ 7769979 7511370 7382820 7072105 7127935 6757111 6761101 6658966 5940580 6340747 6100281
16624F100281J45994l38991P0266l40260j60244L4493l36270K4420m7248k93303
$$ 6100281 6246275 5907284 5977550 5637290 5477046 5511539 5175269 5199689 5152441 4859138
16614D859138J47773Q0624l60999j75151L86262l17583m21666J40214J20751m11634
$$ 4859138 5006911 5087535 4726536 4551385 4937647 4620064 4198398 4338612 4459363 4047729
16604D047729J02510m04054K99508k41197J67094j07036l13099j69018p8295J99205
$$ 4047729 4150239 3746185 4045693 3804496 3971590 3864554 3551455 3382437 3304142 3503347
16594C503347j76687o1245P7917L28580n22666J69722o0618m56851K28299n7731
$$ 3503347 3326660 3265415 3343332 3671912 3149246 3318968 3258350 2801499 3029798 2972067
16584B972067j38380L03665j05686l64690M11978l95907p4339J19035k74147n384
$$ 2972067 2833687 3137352 3031666 2666976 3078954 2683047 2608708 2727743 2453596 2448212
16574B448212K62934p41450P07858l43028J48958l31853K40209j09157K8650j03324
$$ 2448212 2711146 1969696 2677554 2334526 2483484 2151631 2391840 2282683 2311333 2208009
16564B208009J42320j83602k49219J04234j80924L04924m31912J83044k3924K52182
$$ 2208009 2350329 2166727 1917508 2021742 1840818 2145742 1713830 1896874 1872950 2125132
16554B125132p725k93230P1744M37290r26907L65138N6747k12714J54980j28927
$$ 2125132 2117407 1824177 1895921 2333211 1406304 1771442 1828189 1615475 1770455 1641528
16544A641528k44486L79996j65841r3679K03967j60361J28795p3576O468n6205
$$ 1641528 1397042 1777038 1611197 1517518 1721485 1561124 1689919 1616343 1622811 1566606
16534A566606L3911m2089J75021p6444O9126m49663K95865q4789l36634O15649
$$ 1566606 1600517 1558428 1733449 1657005 1726131 1276468 1572333 1487544 1150910 1766559
16524A766559l07157j5327j20413j43467M6388J42520J18215k84610K68774J88791
$$ 1766559 1459402 1444075 1323662 1180195 1226583 1369103 1487318 1202708 1471482 1660273
16514A660273l95402n9176L6193j03227J83106k19671J41763p1882J00057m78567
$$ 1660273 1264871 1205695 1241888 1138661 1321767 1102096 1243859 1171977 1272034 793467
16504G93467O31781m18511k38217J88491o7661K45929k66241K50864l26024J71929
$$ 793467 1425248 1006737 768520 957011 889350 1135279 869038 1119902 793878 965807
16494I65807j0739j02870K54040k28132K5532m2673K42007k22721m2238J52223
$$ 965807 955068 852198 1106238 878106 903638 860965 1102972 880251 838013 990236
16484I90236k3582r1087Q5886J43423l09635K90835l06031l9446M17813l83066
$$ 990236 966654 875567 961453 1104876 795241 1086076 780045 740599 1158412 775346
16474G75346r40J61492l10137N4088L56735k03914j15177m5171J93466C84050
$$ 775346 774406 935898 625761 679849 1036584 832670 717493 672322 865788 384050
16463F65331J57137l5013k00378L06884K0558k99441N5825j42634K78794l18605
$$ 665331 822468 787455 587077 893961 914519 615078 670903 528269 807063 488458
16453D88458K60355j27720k79893K58933K298o824N214M47517k13766C20796K45672
$$ 488458 748813 621093 341200 600133 602431 595607 600821 1048338 834572 320796 566468
16442E66468p2380j13044K45676k35578j2741L19569R3765k71497J0893o1529
$$ 566468 494088 381044 626720 391142 378401 697970 791735 520238 531131 469602
16432D69602L04717p8268j740B37874K61117J72115j78109j8606K97076k72654
$$ 469602 774319 696051 694311 237874 498991 671106 492997 474391 771467 498813
16422D98813L28404j69988k69517Q6549O1933o0442J51070p2711k15306j2737
$$ 498813 827217 657229 387712 474261 536194 475752 626822 554111 338805 326068
16412C26068J71750Q7408j07402o4905R4711j90519Q4885J4228J65825A72904
$$ 326068 497818 585226 477824 412919 507630 317111 401996 416224 582049 172904
16401F16932k24644A77234L06037p9819J2039J69635A85424K85601p2409L36K22161
$$ 616932 392288 177234 483271 403452 415491 585126 185424 471025 398616 398952 621113
16390F21113l04212J0091L79344k36294N241k7956j69381J73907B08414k3376
$$ 621113 316901 326992 706336 470042 475283 447327 277946 451853 208414 185038
16380A85038O06820C90624N5734N8539R2011B96700P486A03858K48782l6852R7427
$$ 185038 791858 390624 446358 504897 596908 296700 304186 103858 352640 315788 413215
16369D13215j53026J04129m5345P4621r4090N1999J99915O3581j98963J01856
$$ 413215 260189 364318 318973 393594 299504 351503 551418 614999 416036 517892
16359E17892B32515J07187J04058J62155k63679f9128D28324B08263I9912J74771
$$ 517892 232515 339702 443760 605915 342236 -69128 428324 208263 99912 274683
16349B74683J26395r1648j13357R2805n7020Q0133a58456B78957L821J56114A93161
$$ 274683 401078 309430 196073 288878 231858 311991 -158456 278957 282778 438892 193161
16337A20118J32189K07932j19268N1164j77475F0770L17822A78817M9893N7134
$$ 120118 252307 460239 340971 392135 214660 60770 378592 178817 228710 285844
16327B85844B6152N2070R9216J51233L5421A71070p0730b6928A02337c0088B30991
$$ 285844 26152 78222 177438 328671 364092 171070 100340 -26928 102337 -30088 230991
16315B82504A13152P29786H0025L09819j91578J26490a22990E0612J22153L15759
$$ 282504 113152 842938 80025 389844 198266 324756 -122990 50612 172765 488524
16305D88524F9119M19328j90257A02351a7775D35661B14072Q3996p7354K40065
$$ 488524 69119 488447 298190 102351 -17775 435661 214072 298068 220714 460779
16295D60779k00836b58257C10525q3765K26072j93103l1465A02565N1206J02293
$$ 460779 259943 -258257 310525 226760 452832 259729 228264 102565 153771 256064
16285B56064a13237e5858E9557M70074r3162j16916j35912g639D23509j49729
$$ 256064 -113237 -55858 59557 529631 436469 319553 183641 -7639 423509 273780
16275B73780C7771K18390a68811A83013q6511N8399K13871j45035O0339K6750
$$ 273780 37771 256161 -168811 183013 96502 154901 368772 223737 284076 310826
16265C10826C813P4388k9913J2725L51955G6096K32725o2084j07257j6980C1704
$$ 310826 3813 78201 48288 61013 412968 76096 308821 246737 139480 122500 31704
16253B38709l9211m9675J07194A09717J13501c3291A64241E2021J48123a6960
$$ 238709 199498 149823 257017 109717 223218 -33291 164241 52021 200144 -16960
16242A58398d3172B17093a26702B3331K3359J90168c0224B89952D1048a98868
$$ 158398 -43172 217093 -126702 23331 46690 236858 -30224 289952 41048 -198868
16231C15241J82858I7498a86654B84547A38627m7960J00902b166D1797K9199J51676
$$ 315241 498099 97498 -186654 284547 138627 90667 191569 -2166 41797 70996 222672
16220B22672a09316K1639A64592d7053D295L9556J18463P1268k3115j0287R659
$$ 222672 -109316 -87677 164592 -47053 4295 43851 162314 233582 210467 200180 209839
16209B09839J76805C1620f5054j0670J632p91A75236a82479B61023H1780K95196
$$ 209839 386644 31620 -65054 -75724 -74092 -74883 175236 -182479 261023 81780 376976
16198C76976d5647C98622I206J26695k3553J92267I1108N8151k3239C0698M679
$$ 376976 -45647 398622 9206 135901 112348 304615 91108 149259 126020 30698 35377
16187C5377J01268B871J29593K93769j1862A37133J21971E7509A7133d4523m380
$$ 35377 136645 2871 132464 426233 414371 137133 259104 57509 17133 -44523 -48903
16176d8903Q980C33301E1144B4746i9301m9685E5646A2073K80385F7822M993a83514
$$ -48903 -39923 333301 51144 24746 -99301 -148986 55646 12073 292458 67822 72815 -183514
16163A24026b02317A18151l7654B7476K22184r1280N5770p4055a6003C25130j46946
$$ 124026 -202317 118151 80497 27476 249660 158380 214150 140095 -16003 325130 178184
16152A78184C700J55891O5705i2862B01802l6605b02451C89915c89589A38134
$$ 178184 3700 159591 225296 -92862 201802 165197 -202451 389915 -389589 138134
16141E6147M311J66797o4675k6674b91490f4806f862j28218B76259A28700B2308
$$ 56147 60458 227255 162580 135906 -291490 -64806 -6862 -135080 276259 128700 22308
16129A07477N9652b17107C37472i9454m8782G4328b93008A00449F633c72A53361
$$ 107477 167129 -217107 337472 -99454 -148236 74328 -293008 100449 6633 -372 153361
16117A81527j2659D4128L97591j42967c2410j43590A12454a93886F2768h335A75496
$$ 181527 168868 44128 441719 298752 -32410 -176000 112454 -193886 62768 -8335 175496
16105c19021B84371G8820C3377J91734N0513D3193J55077a9565m0215n778A82248
$$ -319021 284371 78820 33377 225111 275624 43193 198270 -19565 -59780 -65558 182248
16093B30311h1933E6103c5854o4825B9928J41424h0189k6545k0317e0317A42454
$$ 230311 -81933 56103 -35854 -100679 29928 171352 -80189 -106734 -127051 -50317 142454
16081B1226e4420p1470A0688l557b73261a23616D5223L29451a17630k20912a16734
$$ 21226 -54420 -125890 10688 7131 -273261 -123616 45223 374674 -117630 -338542 -116734
16069c25644c5387C1238N5458a6255j24030B04139a54008O0460A23149g9398k38360
$$ -325644 -35387 31238 86696 -16255 -140285 204139 -154008 -93548 123149 -79398 -317758
16058c17758B11102i2587B86172A05215f838A52319C1169a92398O8651q5834i8645
$$ -317758 211102 -92587 286172 105215 -6838 152319 31169 -192398 -123747 -209581 -98645
16046E3676b1979A21204c37464A34530R498M5890J6958H0502J62119g5695G3324
$$ 53676 -21979 121204 -337464 134530 144028 189918 206876 80502 242621 -75695 73324
16034i3470C1883J70400L5523D0466R7805F1734g7314A16546a12741d3427B0682
$$ -93470 31883 202283 237806 40466 138271 61734 -77314 116546 -112741 -43427 20682
16022D541d6560B78529A02210b53566h2540B64707e3056j57800j90448A31722
$$ 4541 -46560 278529 102210 -253566 -82540 264707 -53056 -210856 -401304 131722
16011c14048p560J47654N6443A01722b6797n5818A88021F4300h8592L8548B24531
$$ -314048 -321608 -173954 -117511 101722 -26797 -82615 188021 64300 -88592 -50044 224531
15999b0615A91367k7462J79365g5306B12946b99136c8823j71329A04324e5859
$$ -20615 191367 163905 343270 -75306 212946 -299136 -38823 -210152 104324 -55859
15988b43079A99091J11671j39518a90767C28643A21267K664K54221j29486j12820
$$ -243079 199091 310762 171244 -190767 328643 121267 123931 378152 248666 135846
15978A35846F2605K60566r5834f2091p8580C41206l8297a83723j88492A16398
$$ 135846 62605 323171 227337 -62091 -140671 341206 302909 -183723 -372215 116398
15967a33497j18480E1444L35528j37527p1828A462b44240d5333E7228N2194a72887
$$ -133497 -251977 51444 386972 249445 177617 1462 -244240 -45333 57228 109422 -172887
15955a46979D8547e5005m18778E8263a8090B21787b5731r3566H9977Q1812L1319
$$ -146979 48547 -55005 -473783 58263 -18090 221787 -25731 -119297 89977 171789 203108
15944B03108p7895a14535d989j83018B27882J38649a94358g6250a7794j89722
$$ 203108 125213 -114535 -4989 -188007 227882 366531 -194358 -76250 -17794 -207516
15934b07516B58003a10819k54438J08170R1895A94053b6792A00558b31470A07777
$$ -207516 258003 -110819 -365257 -257087 -165192 194053 -26792 100558 -231470 107777
15923a64018M7505K6698k11434J24824I3219a95489c8291j15496j43466B01154
$$ -164018 -116513 -89815 -301249 -176425 93219 -195489 -38291 -153787 -297253 201154
15912A4086c85871B7491a35763C37233a40552e0668a8856A68310J38458q9575
$$ 14086 -385871 27491 -135763 337233 -140552 -50668 -18856 168310 306768 217193
15902B17193f4548B4865a16715I9347c14467a9285l84003c96B2075P520J63873
$$ 217193 -64548 24865 -116715 99347 -314467 -19285 -403288 -396 22075 29595 193468
15891A93468c2236A07423L7752a07410A61976b2379B40548I680J84090C0915K37164
$$ 193468 -32236 107423 145175 -107410 161976 -22379 240548 9680 193770 30915 268079
15880B68079a74401e7869B51893b06342c0872j07253F168K4758d3896o541I5281
$$ 268079 -174401 -57869 251893 -206342 -30872 -138125 6168 30926 -43896 -50437 95281
15868a10963k44788c3835k8344K6376j71185A40900a15891B4637c10116E7461
$$ -110963 -355751 -33835 -62179 -35803 -206988 140900 -115891 24637 -310116 57461
15857A04245f5392l4618M3187A6835c008B14584a12671c6495A0543N6197J47060
$$ 104245 -65392 -100010 -56823 16835 -3008 214584 -112671 -36495 10543 66740 213800
15846B13800H7052A7223M6271f0701j05814K9227D4097e430Q39A79438d923j30867
$$ 213800 87052 17223 63494 -60701 -166515 -137288 44097 -5430 -4591 179438 -4923 -135790
15834a35790d8506B70645g4677j60177a08573c0852m4012o3282C36365j34067
$$ -135790 -48506 270645 -74677 -234854 -108573 -30852 -74864 -138146 336365 202298
15824B02298g0724A330a08133G4614a42497M5452k04905a15636P144B45682o7792
$$ 202298 -70724 1330 -108133 74614 -142497 -97045 -301950 -115636 -108492 245682 177890
15813A77890b01557b6491j40686o6732a585m41226A76770a11990j55655g3834
$$ 177890 -201557 -26491 -167177 -233909 -1585 -442811 176770 -111990 -267645 -73834
15802A3904J36792a79708g9015j6424C82241f0566K3975l91700E0450J30736c6039
$$ 13904 150696 -179708 -79015 -95439 382241 -60566 -36591 -428291 50450 181186 -36039
15790d8296L951F3120f8415a3705k8758j4964B28316e9592q4813D5391J28895
$$ -48296 -44345 63120 -68415 -13705 -42463 -57427 228316 -59592 -144405 45391 174286
15779A74286J6663l6628E5595N741d2545m6296F9477k1788a77681A94885d03327
$$ 174286 190949 154321 55595 61336 -42545 -88841 69477 47689 -177681 194885 -403327
15767a67744D9419b32129p5083A26376a23131F3199J65672d7243A21597a05945
$$ -167744 49419 -232129 -307212 126376 -123131 63199 228871 -47243 121597 -105945
15756A21807b10748B89074j7176b7988C9033L23342a27706k4555B91013a35959
$$ 121807 -210748 289074 271898 -27988 39033 362375 -127706 -152261 291013 -135959
15745B35403o1493M228b7139B39108J2099A05923N6101b02884A09686a03749P621
$$ 235403 173910 178138 -27139 239108 251207 105923 162024 -202884 109686 -103749 -96128
15734i6128a1560C0293J97238o6197A6845J1849f0006k9101q3378a498A13623
$$ -96128 -11560 30293 227531 161334 16845 28694 -60006 -89107 -172485 -1498 113623
15722A81431b09555A3026a03098B07263F9922k398K68477a04081K4520n8989F0346
$$ 181431 -209555 13026 -103098 207263 69922 67524 336001 -104081 -79561 -138550 60346
15710g5864j4360o7503C3243d9096j4598j47266A34725c0046D2934h7120J7570
$$ -75864 -90224 -157727 33243 -49096 -63694 -210960 134725 -30046 42934 -87120 -69550
15699f9550b365A1268c45826D4230c24848K1772C07997I0646c751k62626b194
$$ -69550 -2365 11268 -345826 44230 -324848 -303076 307997 90646 -3751 -266377 -2194
15687G5964a48514A84153P192A1946e8024k3093G6944b25608e2233n8155A29800
$$ 75964 -148514 184153 191345 11946 -58024 -81117 76944 -225608 -52233 -110388 129800
15675A97165r5184B5244b64962b5237A16035d35897i1218d330A98011g7255j5337
$$ 197165 101981 25244 -264962 -25237 116035 -435897 -91218 -4330 198011 -77255 -92592
15664i2592k7372k23313E2586g2979j02164j45213a18103Q947A36650d3007j60104
$$ -92592 -119964 -343277 52586 -72979 -175143 -320356 -118103 -109156 136650 -43007 -203111
15653b03111d3483M170B18880b62257B55645b18526F0855B4558D876R0438g5697
$$ -203111 -43483 -39313 218880 -262257 255645 -218526 60855 24558 4876 95314 -75697
15641B14458b20411K9688F7691N5433P0263K7547C1551J27937D31d51282m2404
$$ 214458 -220411 -190723 67691 123124 193387 220934 31551 159488 431 -451282 -493686
15630d93686F3069e4545b4637h408D0277K70135q0369G8996j2396h6918H6090
$$ -493686 63069 -54545 -24637 -8408 40277 310412 230043 78996 66600 -86918 86090
15618E0817K88003F8660J42687b69359F6672J44697a31645M6039b9419r5137j9576
$$ 50817 338820 68660 211347 -269359 66672 211369 -131645 -85606 -29419 -124556 -144132
15607a44132B45369a03462k27062i7797L8985K4914l6148G6277a60515A21903
$$ -144132 245369 -103462 -330524 -97797 -58812 -33898 -70046 76277 -160515 121903
15596B54718q6467O4238h5182k09967A34964a56027B65764b17543F1537b29439
$$ 254718 168251 232489 -85182 -295149 134964 -156027 265764 -217543 61537 -229439
15585a80637K8247a9400k8883r678q5904l34920J64079J24627g5241A19280B8048
$$ -180637 -152390 -19400 -48283 -57961 -143865 -478785 -314706 -190079 -75241 119280 28048
15573A18320a78480j3842D3025a9700o844j9333A68857B0189J09739a29528n5152
$$ 118320 -178480 -192322 43025 -19700 -26544 -45877 168857 20189 129928 -129528 -184680
15562a84680h1333A16985b83920B52717F7378N5397n4458e13352E269K05914g1118
$$ -184680 -81333 116985 -283920 252717 67378 122775 68317 -513352 5269 211183 -71118
15550B10974h0007C06753a02679c4817A56351N0364h3791I1827l6586c01944P6782
$$ 210974 -80007 306753 -102679 -34817 156351 206715 -83791 91827 55241 -301944 -225162
15539b25162A768b04946C5381b02554k1584B40811f945B08074o8842i7814A11446
$$ -225162 1768 -204946 35381 -202554 -224138 240811 -6945 208074 139232 -97814 111446
15527h7417l8337d4487A35393k3369Q7401D8522a24265A0704K33583i532n9304
$$ -87417 -125754 -44487 135393 112024 199425 48522 -124265 10704 244287 -9532 -68836
15516f8836J269D9319a34733A87e7377I0564R2123D3202M9805B0346e3719H1447
$$ -68836 -67567 49319 -134733 187 -57377 90564 182687 43202 93007 20346 -53719 81447
15503H01a15397l03072a86736O7326j8983B38259K39692b07189a6018k34238A15825
$$ 801 -115397 -418469 -186736 -119410 -138393 238259 477951 -207189 -16018 -250256 115825
15491A5067d1058A89043P3947D8559d2573B85215c47578D17197A18119P8203G7060
$$ 15067 -41058 189043 262990 48559 -42573 285215 -347578 417197 118119 196322 77060
15479A72435P8244a98470d0126j15473j15237A85187i4711A82181L891b56596
$$ 172435 250679 -198470 -40126 -155599 -270836 185187 -94711 182181 186072 -256596
15468a29146G4386a03122R11B35112A6998f9782B01241g1411j58466h4276j28980
$$ -129146 74386 -103122 -102211 235112 16998 -69782 201241 -71411 -229877 -84276 -213256
15457b13256E8810e946E8704a89522A22241J71985d0575l5514F100a00089j73211
$$ -213256 58810 -5946 58704 -189522 122241 294226 -40575 -76089 6100 -100089 -273300
15446b73300i2071k63201A00025a22310B96530B9618a38549j49433a15755G138
$$ -273300 -92071 -355272 100025 -122310 296530 29618 -138549 -287982 -115755 7138
15435A19020n5335a65821j57542c8093F9800R5071k522J81565a9338j65993A5019
$$ 119020 63685 -165821 -323363 -38093 69800 164871 162349 343914 -19338 -185331 15019
15423b08615A22440a02091A01717j0737b95440A19996J08632N062a35909F9204
$$ -208615 122440 -102091 101717 90980 -295440 119996 228628 233690 -135909 69204
15412B36717K38141a61669D21327A93749a26884j18125C18200a3280o3267l59541
$$ 236717 474858 -161669 421327 193749 -126884 -245009 318200 -13280 -76547 -436088
15402d36088J65310B4037f4519C7883g0567j29538B32450a01160B5011J34403
$$ -436088 -270778 24037 -64519 37883 -70567 -200105 232450 -101160 25011 159414
15392A59414b70570e7241a0002k9959j51858e8659A83386Q1706l7346e5030A249
$$ 159414 -270570 -57241 -10002 -39961 -191819 -58659 183386 265092 227746 -55030 1249
15380B02077k9816G3514K41915d6678B05304N697D4795J89236n2236a87322B75468
$$ 202077 172261 73514 315429 -46678 205304 211001 44795 234031 181795 -187322 275468
15368C6840a83596h7029L7283A07375B5105j0012i4404j1026N2353H1031a16626
$$ 36840 -183596 -87029 -49746 107375 25105 15093 -94404 -105430 -53077 81031 -116626
15356i2739H1565a33872A1129Q2332C3703j631a0643c044H6380A8943h3635B08158
$$ -92739 81565 -133872 11129 93461 33703 32072 -10643 -3044 86380 18943 -83635 208158
15343A32092a8402C7738R8778k4467L577B3710N3715i2660j344c4574A39852f718
$$ 132092 -18402 37738 136516 112049 115626 23710 77425 -92660 -94004 -34574 139852 -6718
15330H4569a1019k54721E036h6516A7134J31996g2338A24861B0109K85065C4501
$$ 84569 -11019 -265740 5036 -86516 17134 149130 -72338 124861 20109 305174 34501
15318E3719K78928b7118A94059g1658A10192l1242d2453G1367P116f9444m7026
$$ 53719 332647 -27118 194059 -71658 110192 78950 -42453 71367 78483 -69444 -116470
15307a16470C2280Q7372C4266a52144k57180B01997a39656C25389A06749E976
$$ -116470 32280 119652 34266 -152144 -409324 201997 -139656 325389 106749 5976
15296f7870n5029N6313j18168A95220A4887a57805D31036a04049A77374I600J07318
$$ -67870 -122899 -66586 -184754 195220 14887 -157805 431036 -104049 177374 9600 116918
15285A16918a11410A19658b0182A28544Q9337h6038p359B41866c3083k0932B3017
$$ 116918 -111410 119658 -20182 128544 217881 -86038 -93397 241866 -33083 -54015 23017
15273i8979k2507G6228c3561j57981a9208O967A39220i7893B64505E0253j7585
$$ -98979 -121486 76228 -33561 -191542 -19208 -12241 139220 -97893 264505 50253 32668
15262C2668K77979d59738b1483B92216a50776O0525o1453A45281p1376M7966a89630
$$ 32668 310647 -459738 -21483 292216 -150776 -90251 -151704 145281 73905 121871 -189630
15250B25585J85673j28146M93497J041147G92878L83979K43902F19783A61192
$$ 225585 411258 283112 776609 1817756 792878 1176857 1420759 619783 161192
15240i2983B57058a00069M9401E9311b23008A21570K55571o6783M9278j37143
$$ -92983 257058 -100069 -50668 59311 -223008 121570 377141 310358 359636 222493
15230B22493I2733m801b1043H5519J17459a86l50948d7719j1817K8623a1848C20699
$$ 222493 92733 87932 -21043 85519 202978 -186 -351134 -47719 -59536 -30913 -11848 320699
15217G759K22475L008E1455J43450D9851J63999c8469I4163J48555l7524q5970
$$ 7759 230234 233242 51455 194905 49851 213850 -38469 94163 242718 205194 119224
15206A19224M24841A0187a16247F8366A926K41223a24376H1089b14186C76120
$$ 119224 544065 10187 -116247 68366 1926 243149 -124376 81089 -214186 376120
15195a96074b019B2348L19138J0752k1287G5763g2512B16022a30476B0566N6997
$$ -196074 -2019 22348 341486 352238 330951 75763 -72512 216022 -130476 20566 77563
15184G7563Q9550h1846j18534c9700G6803L32488D4885f5158r7534K6202B11766
$$ 77563 167113 -81846 -200380 -39700 76803 409291 44885 -65158 -162692 -136490 211766
15172B7809J47827C4865N93461F1073L76981A65463b2657C44939j48905b63813
$$ 27809 175636 34865 628326 61073 438054 165463 -22657 344939 196034 -263813
15161E1393c669B62181b29909G7825L608B3320K96918e8602j5880B73084n8404
$$ 51393 -3669 262181 -229909 77825 81433 23320 320238 -58602 -74482 273084 214680
15150B14680b79115f5784A33633d3786B67389L1457r537B4511J69476J15743j32732
$$ 214680 -279115 -65784 133633 -43786 267389 298846 289309 24511 193987 309730 176998
15139A76998K29813A29953m0848B4637K68185A33913O2513J47464a39159A05384
$$ 176998 406811 129953 89105 24637 292822 133913 196426 343890 -139159 105384
15128a00365C51049j14054F6184B3225h9082B53720M066A17408L1174N8145E3803
$$ -100365 351049 236995 66184 23225 -89082 253720 257786 117408 148582 206727 53803
15116H3250H387a18797C8759C642a00283l5638G5831i8098B14153l7869P0687
$$ 83250 8387 -118797 38759 3642 -100283 -135921 75831 -98098 214153 176284 246971
15105B46971F8191P8118l9634j1616J27411A01766K75633A47532N1716M2215a25192
$$ 246971 68191 146309 106675 95059 222470 101766 377399 147532 199248 241463 -125192
15093B5441L29753J39001A27813d8653C86738A03623M91030g1469J8221B3165
$$ 25441 355194 494195 127813 -48653 386738 103623 594653 -71469 -53248 23165
15082a7044k02699A41461J10965P1513q3693A3673K54127L45672k28761H8362
$$ -17044 -219743 141461 252426 323939 240246 13673 267800 613472 384711 88362
15071a86726F5318K72143k4910J98703b3331G3667a24895A13988f1501A15044
$$ -186726 65318 337461 312551 511254 -23331 73667 -124895 113988 -61501 115044
15060A80453Q7034L177m948q6383J55902j59033N5577A13246M5222P2177a28520
$$ 180453 267487 270664 265716 179333 335235 176202 231779 113246 158468 230645 -128520
15048A94386M7676J89977q2606P197D8883k0641J33731c8854B73577L2856m3994
$$ 194386 242062 432039 349433 356630 48883 28242 161973 -38854 273577 306433 262439
15037B62439A12485K91604P0593A96836l4924Q4372J56959F4717J14672d837B96930
$$ 262439 112485 404089 474682 196836 161912 246284 403243 64717 179389 -4837 296930
15025C76138j55689c84197B65370d9287B68800E4959K16596m4986m2375B9432
$$ 376138 220449 -384197 265370 -49287 268800 54959 271555 226569 184194 29432
15014A04602J83218j20953E9691L02094q4877f6005B62493A27772l7791R8806
$$ 104602 287820 166867 59691 361785 276908 -66005 262493 127772 89981 188787
15004A88787K22220j45755L89733G2406a30375F08590k01334E1881J44683J94801
$$ 188787 411007 265252 654985 72406 -130375 608590 407256 51881 196564 391365
14994C91365j57654H8684J68076J55714C2391L70826A25858b8263C36014J92216
$$ 391365 233711 88684 256760 412474 32391 403217 125858 -28263 336014 528230
14984E28230f3752A7298P8475B7445J57441Q7596j32150J74482l7092K3620b3883
$$ 528230 -63752 17298 95773 27445 184886 272482 140332 314814 277722 301342 -23883
14972A76974A0806N57296A78790Q1316k0045O3851J76535j91108M34438b1799
$$ 176974 10806 568102 178790 260106 240061 303912 480447 289339 723777 -21799
14961B54638J68827Q561j25059j13416C7216M75590B12697k7640q8826N26491
$$ 254638 423465 432026 306967 193551 37216 512806 212697 185057 96231 622722
14951F22722B74915L7857J96611j41304A23586E9756j0970K46161Q065m0500H1443
$$ 622722 274915 312772 509383 368079 123586 59756 48786 294947 303012 262512 81443
14939A80646d6207B49860L40895B34465C9524L53083q3005K985j03136L4281L6226
$$ 180646 -46207 249860 590755 234465 39524 392607 309602 312587 209451 243732 279958
14928B79958p0004J79344j68387R9737Q7245A02972J92510j21824R2311O515p3381
$$ 279958 209954 389298 220911 320648 407893 102972 295482 173658 265969 272484 199103
14917A99103K60109B15161K20607k01448J15236O0528A18186K87834A18308M24127
$$ 199103 459212 215161 435768 234320 349556 410084 118186 406020 118308 542435
14907E42435k48597O1115j8451F540K73573l6408m129J05283k7751q7662N4952
$$ 542435 293838 354953 336502 6540 280113 243705 239576 344859 317108 229446 284398
14896B84398K65284j177j73781R2850n0556j43170J52813L0463k7443J19371B01725
$$ 284398 549682 548505 374724 467574 417018 273848 426661 457124 429681 549052 201725
14884D48963j89866I5410L65181j62839j22550K40560R0784D4753K72502A45167
$$ 448963 259097 95410 460591 297752 175202 415762 506546 44753 317255 145167
14873D58505E4086L83905J66946k52089m8355K53582k62735K46565r8239R2257
$$ 458505 54086 437991 604937 352848 304493 558075 295340 541905 443666 535923
14863E35923n5807j82249O631L8357G8747N8224R1107K68427A68636L10607C9337
$$ 535923 480116 297867 304498 342855 78747 136971 228078 496505 168636 479243 39337
14851F88433A22587L17775N5858J69107m5663q3903k18863L64308C03488K8398
$$ 688433 122587 440362 496220 665327 619664 535761 316898 681206 303488 331886
14841C31886J41698A69813d4288F53919J36043l28655J14706B85229K12662j40487
$$ 331886 473584 169813 -44288 653919 789962 461307 576013 285229 497891 357404
14831C57404P3326B01328M34808j56572J75103m5212k25438K96917j16707M6122
$$ 357404 430730 201328 636136 479564 654667 609455 384017 680934 564227 610349
14821F10349N5475j46878k50786I8913N77324J33492K0572o5783l12531K92414
$$ 610349 665824 518946 268160 98913 676237 809729 830301 764518 451987 744401
14811G44401C06470L8697L26020J28607l94393J65971k00009L89157r3060l04926
$$ 744401 306470 345167 671187 799794 405401 571372 371363 760520 667460 362534
14801C62534N34426r0414r5961k08564L7686p0487B03885K82194O5069J97632
$$ 362534 896960 806546 710585 502021 539707 469220 203885 486079 551148 748780
14791G48780q3666B29783M16473R433J00020C45602J73010J71451l01189J14453
$$ 748780 665114 229783 646256 655689 755709 345602 518612 690063 388874 503327
14781E03327K12315j58205J43181r4466n8049N3045K36220P4783k30023B71660
$$ 503327 715642 557437 700618 606152 548103 601148 837368 912151 682128 271660
14770F57927J65683k41437j77968J79644j38730K94072j47115J78490R4266o5372
$$ 657927 823610 582173 404205 583849 445119 739191 592076 770566 864832 799460
14760G99460l1399C75381J73143J74297p200j46976J19946m3585L13386q8542
$$ 799460 768061 375381 548524 722821 715621 568645 688591 645006 958392 869850
14750H69850J68863j41028k26901J19988j87057j0674j30810J24293J50075j24105
$$ 869850 1038713 897685 670784 790772 603715 593041 462231 586524 736599 612494
14740F12494J94634k36979j00429K60451q6081L56968q4631l51284J7563k09220
$$ 612494 807128 570149 469720 730171 644090 1001058 916427 565143 582706 373486
14730C73486J59179M26309j71185k41839J74483m8441K23249Q3948j44069K52794
$$ 373486 532665 958974 787789 545950 720433 671992 895241 979189 835120 1087914
14720A087914m25273M18507k91283j6329J22079j58861j65601J71420L56216j15585
$$ 1087914 662641 1081148 789865 773536 895615 736754 571153 742573 1098789 983204
14710I83204k88477K12753p3812j35242O5590J01895P4111K02161j75658o6363
$$ 983204 694727 907480 833668 698426 764016 865911 940022 1142183 966525 900162
14700I00162M33365n96201R8974R9658k49854K71444J11385j85903k1953j03051
$$ 900162 1333527 737326 836300 935958 686104 957548 1068933 883030 861077 758026
14690G58026O6604L6232K00592P0405n6560m38429M67590l44539M24912l99298
$$ 758026 824630 860862 1061454 1131859 1075299 636870 1104460 759921 1184833 785535
14680G85535j7921O21400n06294O6933k47034L61880R5610L5352k52635Q5589
$$ 785535 767614 1389014 882720 949653 702619 1064499 1160109 1195461 942826 1028415
14670A028415k6293o6780K24709K55689k98191l64477L04897p5809j05704J54201
$$ 1028415 1002122 935342 1160051 1415740 1117549 753072 1057969 982160 876456 1030657
14660A030657m8129p2018O9269K3628n0821K20537k43932K44349J1525m9546J25528
$$ 1030657 982528 910510 979779 1003407 952586 1173123 929191 1173540 1185065 1135519 1261047
14649A261047k23839j62315N6677L96052J95687k22825R8324n5721k86351K14708
$$ 1261047 1037208 874893 931570 1327622 1523309 1300484 1398808 1343087 1056736 1271444
14639A271444J42207j43613q0175M42019n76026K85167k57251N7346K82616k75916
$$ 1271444 1413651 1270038 1189863 1631882 1055856 1341023 1083772 1141118 1423734 1147818
14629A147818O7635K15858j33031K58236j71288n4125K4118p8819j6675N2246
$$ 1147818 1215453 1431311 1298280 1556516 1385228 1331103 1355221 1276402 1259727 1311973
14619A311973P9720p9825K48194J24705k58329K22992n12127K49926Q3119L3474
$$ 1311973 1391693 1311868 1560062 1684767 1426438 1649430 1137303 1387229 1470348 1503822
14609A503822M16771j86149j39289k3501k35507N09184J2618n5358j39053k11522
$$ 1503822 1920593 1734444 1595155 1571654 1336147 1845331 1857949 1802591 1663538 1452016
14599A452016J97704r9790N003J58953L28024m23054K5332K25372j08608K57859
$$ 1452016 1649720 1549930 1554933 1713886 2041910 1618856 1644188 1869560 1760952 2018811
14589B018811m653Q0773j87075M19650l70083J5005l19416L83493K24622r3528
$$ 2018811 2014158 2094931 1907856 2327506 1957423 1972428 1653012 2036505 2261127 2167599
14579B167599q1391J67552j259j23536k35072L23435n826k24512K54448J74650
$$ 2167599 2086208 2253760 2252501 2128965 1893893 2217328 2211502 1986990 2241438 2416088
14569B416088j11951K29420j27125J93589k78137J68829K03976n5331J13L46253
$$ 2416088 2304137 2533557 2406432 2600021 2321884 2490713 2694689 2639358 2639471 2985724
14559B985724P5364J00052j53455J22912J60613M81920K38458M07668N50265Q37630
$$ 2985724 3061088 3161140 3007685 3130597 3291210 3773130 4011588 4419256 4969521 5807151
14549E807151K094136M129215R034678K1254426n10668A9765811I619659D659213
$$ 5807151 7901287 12030502 21065180 42319606 41808938 19765811 9619659 4659213
14540C004998p22596N2490o5839k74006J73894N9293q1704J44586j51055J04682
$$ 3004998 2282402 2334892 2269053 1995047 2168941 2228234 2146530 2291116 2140061 2244743
14530B244743K48274o1662j32815r6050J76844Q0565J63837k50927J17081l48550
$$ 2244743 2493017 2431355 2298540 2202490 2379334 2459899 2623736 2372809 2489890 2141340
14520B141340P03549m02922L08689R9768n81986O63461J66509m75643J7374j37263
$$ 2141340 2844889 2441967 2750656 2850424 2268438 2931899 3098408 2622765 2640139 2502876
14510B502876J32988J19909L83977r3060j60645J06867L16755l88966J31484O5663
$$ 2502876 2635864 2755773 3139750 3046690 2886045 2992912 3309667 2920701 3052185 3117848
14500C117848P8232j55332J92721j110l9127J0602J54617J73550j73418N0375
$$ 3117848 3196080 3040748 3233469 3232359 3193232 3203834 3358451 3532001 3358583 3408958
14490C408958J60671R3137J14055k59690J49416j43510l2125K96586Q8509L108
$$ 3408958 3569629 3662766 3776821 3517131 3666547 3523037 3490912 3787498 3876007 3879115
14480C879115k8504K15757j40417J47298k23735O9047j15946M51153q7864K97652
$$ 3879115 3850611 4066368 3925951 4073249 3849514 3918561 3802615 4253768 4165904 4463556
14470D463556j97253l0831j7081J14458K49014j30739J9604K78450J89682j99102
$$ 4463556 4266303 4235472 4218391 4332849 4581863 4451124 4470728 4749178 4938860 4739758
14460D739758J16191j14044O5285n0546K37191K7998K82949j09450L2310j0835
$$ 4739758 4855949 4741905 4807190 4756644 4993835 5021833 5304782 5195332 5227642 5216807
14450E216807K75049J02867K2324m3176k76239M54180J26897j87475M83513l7033
$$ 5216807 5491856 5594723 5617047 5573871 5297632 5751812 5878709 5691234 6174747 6137714
14440F137714k35384M44029M77230n44931L55247K03774j75935L11004k29023
$$ 6137714 5902330 6346359 6823589 6278658 6633905 6837679 6661744 6972748 6743725
14431F743725L72605l47973K83944R2954J80173M25056j0152p7984P8379O5574
$$ 6743725 7116330 6768357 7052301 7145255 7325428 7750484 7740332 7662348 7740727 7806301
14421G806301n0302L38492L43235J46239p2698n3236M40226j60350K38236O3420
$$ 7806301 7755999 8094491 8437726 8583965 8511267 8458031 8898257 8737907 8976143 9039563
14411I039563L4850L62194K7750J16101M77096j50499N61026l19570J09518M15795
$$ 9039563 9074413 9436607 9464357 9580458 10057554 9907055 10468081 10148511 10258029 10673824
14401A0673824M2000K19127J40567J81135J63822L18765k10504L92913K53933
$$ 10673824 10715824 10934951 11075518 11256653 11420475 11739240 11528736 11921649 12175582
14392A2175582M77407o8787L18533J07731j63300N94547K84254L41524K2817J75937
$$ 12175582 12652989 12584202 12902735 13010466 12847166 13441713 13725967 14067491 14090308 14266245
14382A4266245L88135K27905N49731L52441K49157M97529J01073M70848p423M03842
$$ 14266245 14654380 14882285 15432016 15784457 16033614 16531143 16632216 17103064 17095641 17499483
14372A7499483K57677N44110R623O93028M13810P46273j70611N43436N53973M65020
$$ 17499483 17757160 18301270 18310893 19003921 19417731 20164004 19993393 20536829 21090802 21555822
14362B1555822K94332O12410M70006O08742L17101P90583L90593O10315P49455
$$ 21555822 21850154 22462564 22932570 23541312 23858413 24648996 25039589 25649904 26399359
14353B6399359M97416N77063O34169J016400O01763P26189N33514O78581R52136
$$ 26399359 26896775 27473838 28108007 29124407 29726170 30452359 30985873 31664454 32616590
14344C2616590Q19817O45227J490038O87773J228614J132629N31892J446044J232066
$$ 32616590 33436407 34081634 35571672 36259445 37488059 38620688 39152580 40598624 41830690
14335D1830690Q42050J211091J325291J587513J810518J593396R01691K144773
$$ 41830690 42672740 43883831 45209122 46796635 48607153 50200549 51102240 53247013
14327E3247013J123347K070302J815469K167349K041287K164772K267135K255265
$$ 53247013 54370360 56440662 58256131 60423480 62464767 64629539 66896674 69151939
14319F9151939K843020K104687K871195K917116L065530L435381L237086L840355
$$ 69151939 71994959 74099646 76970841 79887957 82953487 86388868 89625954 93466309
14311I3466309L859086M078143L866128M466400N177959M684133N122215O220010
$$ 93466309 97325395 101403538 105269666 109736066 114914025 119598158 124720373 130940383
14303A30940383N499776O643517O693967P012464P564419Q310341P834523R181001
$$ 130940383 136440159 143083676 149777643 156790107 164354526 172664867 180499390 189680391
14295A89680391R008889J0252172J0161463J0914792J1392204J1707335J2400016
$$ 189680391 198689280 208941452 219102915 230017707 241409911 253117246 265517262
14288B65517262J2909517J3254360J2867348J3894316J3702674J3877976J4159109
$$ 265517262 278426779 291681139 304548487 318442803 332145477 346023453 360182562
14281C60182562J4068204J3606384J2864806J2300802J1109377R534944Q006548
$$ 360182562 374250766 387857150 400721956 413022758 424132135 433667079 441673627
14274D41673627N725657K544344q08250j149854k421287l342720p067939n216513
$$ 441673627 447399284 449943628 449135378 447985524 445564237 442221517 435153578 429937065
14266D29937065p733411j0378702j1479776j3550445j4146673j4624130j5146539
$$ 429937065 422203654 411824952 400345176 386794731 372648058 358023928 342877389
14259C42877389j5379236j5216910j4520701j4886163j3696980j2343633j2648060
$$ 342877389 327498153 312281243 297760542 282874379 269177399 256833766 244185706
14252B44185706j2177662j1506024j1217654j0196802r983851r125576q737781
$$ 244185706 232008044 220502020 209284366 199087564 189103713 179978137 171240356
14245A71240356q110642p245529p635350o823511o500723o246210n808254m772055
$$ 171240356 163129714 155884185 148248835 141425324 134924601 128678391 122870137 118098082
14237A18098082n046456n007112m758075m261754m023687l999159l189973l470007
$$ 118098082 113051626 108044514 103286439 99024685 95000998 91001839 87811866 84341859
14229H4341859l156928l228541k881658k951653k376588k681157k534092k351693
$$ 84341859 81184931 77956390 75074732 72123079 69746491 67065334 64531242 62179549
14221F2179549k045960k060797j652030j766005k205937j368463j690007j054416
$$ 62179549 60133589 58072792 56420762 54654757 52448820 51080357 49390350 48335934
14213D8335934j481436j798018j601321r11612j515702q73242q71165j056137
$$ 48335934 46854498 45056480 43455159 42543547 41027845 40154603 39283438 38227301
14205C8227301j412044r80665q37365j146097p91082n24748j084711p45008j003367
$$ 38227301 36815257 35834592 34997227 33851130 33060048 32535300 31450589 30705581 29702214
14196B9702214q24842o05995j66150j121499n33296p54054l79573q04508n79698
$$ 29702214 28877372 28271377 28105227 26983728 26450432 25696378 25316805 24512297 23932599
14187B3932599l42844q16150n18224q09628Q4499q15574m09354n17918j82246
$$ 23932599 23589755 22773605 22255381 21445753 21530252 20714678 20305324 19787406 19605160
14178A9605160k86977o08713m80005m7317n09458l79042m12621j80248n01930
$$ 19605160 19318183 18709470 18229465 18182148 17672690 17293648 16881027 16700779 16198849
14169A6198849m47174k2940m6678p68209J57744l48093k89016n01618Q314k31856
$$ 16198849 15751675 15728735 15682057 14913848 15071592 14723499 14434483 13932865 13941179 13709323
14159A3709323l27344L8922m19813k44061k34722k38379m80994J87073n27797
$$ 13709323 13381979 13420901 13001088 12757027 12522305 12283926 11802932 11990005 11462208
14150A1462208o6652o4897k53581j77023k16983l8201j01355P5122n81969l53235
$$ 11462208 11395556 11330659 11077078 10900055 10683072 10644871 10543516 10618638 10036669 9683434
14140I683434M99645o12152L34408o8736p15307l63558L807N2235p9545K4478
$$ 9683434 10183079 9570927 9905335 9836599 9121292 8757734 8761541 8813776 8734231 8758709
14130H758709k01125j76114j10102k5288j30543j83889j41795j293l65978J78249
$$ 8758709 8557584 8381470 8271368 8246080 8115537 7931648 7789853 7788560 7422582 7600831
14120G600831j12739k72261j3899j42744M3942q8360j26876r9903Q0940m32568
$$ 7600831 7488092 7215831 7201932 7059188 7103130 7014770 6887894 6787991 6868931 6436363
14110F436363R5309J38296J49173k65299m05421J58828l3147k24390J68951k15336
$$ 6436363 6531672 6669968 6819141 6553842 6148421 6307249 6274102 6049712 6218663 6003327
14100F003327j15899k63750M53581R1846p17344J90695K15206l32221l32079K5221
$$ 6003327 5887428 5623678 6077259 6169105 5451761 5642456 5857662 5525441 5193362 5218583
14090E218583N3197j71888J51049k55164K14256j00818Q6349j39284j16176j25239
$$ 5218583 5271780 5099892 5250941 4995777 5210033 5109215 5195564 5056280 4940104 4814865
14080D814865j20771M46988o64317L00285j72960J38664j46410r5849j72738j90087
$$ 4814865 4694094 5141082 4476765 4777050 4604090 4742754 4596344 4500495 4327757 4137670
14070D137670P3729j46485J42247l78188L25564j50886p49l4883J70341K870l60488
$$ 4137670 4211399 4064914 4207161 3828973 4154537 4003651 4002902 3968019 4138360 4141230 3780742
14059C780742L7961L32506l15706L822M9746k25957R5340l67840J04250o6255
$$ 3780742 3818703 4151209 3835503 3839325 3889071 3663114 3758454 3390614 3494864 3428609
14049C428609J48814r4246l17583K17375j68562J518k82680M40433k82032n2370
$$ 3428609 3577423 3483177 3165594 3382969 3214407 3215925 2933245 3373678 3091646 3039276
14039C039276Q0279K6490K03463l65401r0092k79238M50208J05595o4493j91086
$$ 3039276 3119555 3146045 3349508 2984107 2894015 2614777 3064985 3170580 3106087 2915001
14029B915001N2960j28906L0159j08492o0883Q1171k22255m320j33192L08018
$$ 2915001 2967961 2839055 2869214 2760722 2699839 2781010 2558755 2554435 2421243 2729261
14019B729261l40712J44640k58659J38374K92693l30389Q5973m3865j4735N891
$$ 2729261 2388549 2533189 2274530 2412904 2705597 2375208 2461181 2417316 2402581 2408472
14009B408472k15558j40964K31982k38562J41754m5949J19748n0851J83915k35998
$$ 2408472 2192914 2051950 2283932 2045370 2187124 2141175 2260923 2210072 2393987 2157989
13999B157989M064j79179r9241n4706L14073p3598m8091J18508R7104M13402J239235
$$ 2157989 2162053 1982874 1883633 1828927 2143000 2069402 2021311 2139819 2236923 2650325 3889560
13988C889560K548010O872110J9979759J2043768k1085703j1764038m741599k358602
$$ 3889560 6437570 13309680 33289439 45333207 24247504 12483466 7741867 5383265
13980E383265j126972o62596O1656m37808l55717k14138L24432m01152M1234l60577
$$ 5383265 4256293 3593697 3655353 3217545 2861828 2647690 2972122 2570970 2612204 2251627
13970B251627J68784J85712k67606J61204m57388M16400n53680m2337N1169p4297
$$ 2251627 2420411 2606123 2338517 2499721 2042333 2458733 1905053 1862716 1913885 1839588
13960A839588L56266j06754j7599j50703j93872o609N1330j63148P2301L17990
$$ 1839588 2195854 2089100 2071501 1920798 1726926 1720317 1771647 1608499 1680800 1998790
13950A998790n3806j99152k4025K75K3683J39781k450L02013l33105k04437L40613
$$ 1998790 1944984 1745832 1721807 1722082 1745765 1885546 1883096 2185109 1852004 1647567 1988180
13939A988180k19050j97261k37584K43546J77505J07866n33563l2340K48706J94816
$$ 1988180 1769130 1571869 1334285 1577831 1755336 1863202 1329639 1297299 1546005 1740821
13929A740821r8165q4714R1880R3632j15732l74032K39577L7159m5029j51023
$$ 1740821 1642656 1557942 1649822 1743454 1627722 1253690 1493267 1530426 1485397 1334374
13919A334374l5911j40035L76624k7644l28531O2570P4838N9961K8480J00209
$$ 1334374 1298463 1158428 1535052 1507408 1178877 1241447 1316285 1376246 1404726 1504935
13909A504935j57265K43848m97262J83200K05064k33343l9417Q7276r3255N56225
$$ 1504935 1347670 1591518 1094256 1277456 1482520 1249177 1209760 1297036 1203781 1760006
13899A760006k92172k84531o7258K15530j56188K40968j93907k1703M1131J92738
$$ 1760006 1467834 1183303 1116045 1331575 1175387 1416355 1222448 1200745 1241876 1434614
13889A434614J11477k42667K48663m35426l70975L51439R3279k97688J44476j41686
$$ 1434614 1546091 1303424 1552087 1116661 745686 1097125 1190404 892716 1037192 895506
13879H95506R1605J70054j437O5144K0061R3386J727j55033k24644L73200l41540
$$ 895506 987111 1157165 1155728 1220872 1240933 1334319 1336046 1181013 956369 1329569 988029
13868I88029J18449j90940J52433q7810o7726k21273K94642O4391j17888J50827
$$ 988029 1106478 915538 1067971 980161 912435 691162 985804 1050195 932307 1083134
13858A083134j93680P6133n3129K41840j72573r2095J67178j62625Q9546l66377
$$ 1083134 889454 965587 912458 1154298 981725 889630 1056808 894183 983729 617352
13848F17352M08488k40816N840L54183N471L01815n11518M8672l4799K07520j16330
$$ 617352 1025840 785024 790864 1145047 1150518 1452333 940815 989487 954688 1162208 1045878
13837A045878l31917m6673M82950k6553j62301q5658J17810k59000l28174O23919
$$ 1045878 713961 667288 1150238 1123685 961384 875726 993536 734536 406362 1030281
13827A030281J21668E64092M51536l99968Q6769L6048K39955r5144o7545k10012
$$ 1030281 1151949 564092 1015628 615660 702429 738477 978432 883288 815743 605731
13817F05731L95877p4403k9281l08528M46172k37093m0951J07946J37154l74805
$$ 605731 1001608 927205 897924 589396 1035568 798475 757524 865470 1002624 627819
13807F27819q1008J92770L5076o1334K8480J49953o1850j82563M2959k957o4234
$$ 627819 546811 739581 774657 713323 741803 891756 829906 647343 690302 687345 623111
13796F23111K81497j87669J82125k09709K13150j03682Q8346p1182r3889j96151
$$ 623111 904608 716939 899064 689355 902505 798823 887169 815987 722098 525947
13786E25947J66191j80892K99115J65834l86439J0447J17161j85910K19281j40194
$$ 525947 692138 511246 810361 976195 589756 600203 717364 531454 750735 610541
13776F10541L82413D62840L2305K3799K04569r1755j9285m5260K7492J28864n8402
$$ 610541 992954 462840 495145 518944 723513 631758 612473 567213 594705 723569 665167
13765F65167j80375J54015j19075j2675j3056Q6463L9713P4490j62458J14237
$$ 665167 484792 638807 519732 507057 494001 580464 620177 694667 532209 646446
13755F46446J5410J00257l33824J24241j39009N38031l51372B82523L53809k61364
$$ 646446 661856 762113 428289 552530 413521 951552 600180 282523 636332 374968
13745C74968J49780L2394r4966J30561m0742L20830C71868j56056O00770C62103
$$ 374968 524748 557142 462176 592737 551995 872825 371868 215812 816582 362103
13734F20075K6067M8752O3036j10187j93342K73950q8737J53167l01599K1380
$$ 620075 646142 694894 757930 647743 454401 728351 639614 792781 491182 512562
13724E12562P9974k61470J77051P9258j39483m3502J74317l2748B56447K44443
$$ 512562 592536 331066 508117 587375 447892 404390 578707 545959 256447 500890
13714E00890J56893j29465k1096M353k09502J04695K16241K752k47909J22998
$$ 500890 657783 528318 507222 511575 302073 406768 623009 625761 377852 500850
13704E00850j31220K23259N2350K1788j67709j16859L20509A57231L55883j00197
$$ 500850 369630 592889 645239 667027 499318 382459 702968 157231 513114 412917
13694D12917j15095L21357j51530L4371m5715n5115M72898l23834K78989m08107
$$ 412917 297822 619179 467649 502020 456305 401190 874088 550254 829243 421136
13684D21136r4890N8505j55261J15931L60007j05178j86491o1452I3207L87091
$$ 421136 326246 384751 229490 345421 705428 600250 413759 352307 93207 480298
13674D80298O4168J60521k82351K4787J14014m2090m5182l1784P655F5590L29017
$$ 480298 544466 704987 422636 447423 561437 519347 474165 442381 450036 65590 394607
13663C94607A66720J47760J94113P8174j12256P667j75513j24228K15027r2710
$$ 394607 166720 314480 508593 586767 474511 482178 306665 182437 397464 304754
13653C04754p7748R0978m8200O6056J59624j41833L6768D6127K80382M9977r8548
$$ 304754 227006 317984 269784 335840 495464 353631 390399 46127 326509 376486 277938
13642B77938K90562H9248L31654A05866M35631L1918j82555k2969k2792A41386
$$ 277938 568500 89248 420902 105866 541497 573415 390860 367891 345099 141386
13631D24028n6646K99489j73027B29715K06487A10133M74403B06111J90359J84610
$$ 424028 367382 666871 493844 229715 436202 110133 584536 206111 396470 581080
13621E81080N7891B68821J55979r9826J52501j99392J17264Q636J64039A87992
$$ 581080 638971 268821 424800 324974 477475 278083 395347 403983 568022 187992
13610E47392k19423j54166K65012N5289j90992K68172b0891B61247J67514j41136
$$ 547392 327969 173803 438815 494104 303112 571284 -20891 261247 428761 287625
13600B87625L76555k69879j88296m4675K11337R7698n7856p2059j22259K03779
$$ 287625 664180 394301 206005 161330 372667 470365 412509 340450 218191 421970
13590D21970K79188A87550G7100Q3843K69046Q4151l3977A86215q7342J27628
$$ 421970 701158 187550 77100 160943 429989 514140 480163 186215 98873 226501
13580B26501P1405J50398j26519J07223A20465M11654A32070J22675J88549A96936
$$ 226501 297906 448304 321785 429008 120465 532119 132070 254745 443294 196936
13569C47309j24524J96124J19828l6660k39107N9374e2953C10180K16484H3999
$$ 347309 222785 418909 538737 502077 262970 322344 -52953 310180 526664 83999
13558B00139M4935j3255O2679N0037Q9146j73886b8536H6629k4350j1535M2152
$$ 200139 245074 231819 294498 344535 433681 259795 -28536 86629 62279 50744 92896
13547I2896J4824L84047A15725P4507d9926D53030A13384J58936Q9694I0890K61253
$$ 92896 107720 491767 115725 190232 -49926 453030 113384 272320 362014 90890 352143
13536C52143g4061C17019M7759R2492A40540m9119K98184A08946K21502j58943
$$ 352143 -74061 317019 364778 457270 140540 91421 389605 108946 330448 171505
13526A71505J35800K2088G9608L57966J40124A19840J16356A9592K34618J91946
$$ 171505 307305 329393 79608 437574 577698 119840 236196 19592 254210 446156
13516D46156J28967k30771L2796A24228N2552J76597L6553j13312K7978B5596
$$ 446156 575123 344352 377148 124228 176780 353377 389930 276618 304596 25596
13505D07502p0315j1867H075J55873J1475c706B77582L22948B53348K23931j33920
$$ 407502 337187 325320 8075 163948 175423 -3706 277582 600530 253348 477279 343359
13494C43359e3573B16160B9045L11602P7785A53515J0369n2157L23705j09058
$$ 343359 -53573 216160 29045 340647 418432 153515 163884 111727 435432 326374
13484C26374J55639A87969J94374O6122B20311J58848k714B1528J00287b13883
$$ 326374 482013 187969 382343 448465 220311 379159 376445 21528 121815 -213883
13473H9942J40756J92689j34219L1159G5287j919P5945a39654B69130r6903J88481
$$ 89942 230698 423387 289168 320327 75287 73368 149313 -139654 269130 172227 360708
13462C60708A06641j4219O7449j1809L22703a23933B28663n8071L12910j36210
$$ 360708 106641 92422 159871 148062 470765 -123933 228663 170592 483502 347292
13452C47292p5571J19295J52488A65602Q6298o0565K46713I9454Q0012K40653
$$ 347292 271721 391016 543504 165602 251900 191335 438048 99454 179466 420119
13442D20119A61141J32269H6690K99342A68597A0714K51616c9727C6044A2894
$$ 420119 161141 293410 86690 386032 168597 10714 262330 -39727 36044 12894
13431D94311f6830A12483J3199M9551K50299j61368m6648E2167J74421M640b22845
$$ 494311 -66830 112483 125682 175233 425532 264164 217516 52167 226588 231228 -222845
13419a30358A57817i5988A53137J66804A09859k7483J48360O1387G1967j7859
$$ -130358 157817 -95988 153137 319941 109859 82376 230736 292123 71967 54108
13409E4108P5638O8422J44056J4809o0288r8029J48081A11833J0974K14276J45150
$$ 54108 129746 198168 342224 357033 296745 198716 346797 111833 122807 337083 482233
13398D82233A34367m677E3938L32635E9776J08474J27211q8556j8100J08070e1720
$$ 482233 134367 129690 53938 386573 59776 168250 295461 206905 188805 296875 -51720
13386C14807j16908b7528D75931j86006j31327G2306J01222k2880k1715J3923
$$ 314807 197899 -27528 475931 289925 158598 72306 173528 150648 128933 142856
13376A42856G0440f7492j55187B88011h0271A78487P9288J09042j80353p6360
$$ 142856 70440 -67492 -222679 288011 -80271 178487 257775 366817 186464 110104
13366A10104J35667J19732n7103k1657Q8123r2097j33461m678M8898a46956b2256
$$ 110104 245771 365503 308400 286743 374866 282769 149308 144630 193528 -146956 -22256
13354e1385B11581K52930i1567A07485J99568A16769l8937d2885B79917l0467
$$ -51385 211581 464511 -91567 107485 307053 116769 77832 -42885 279917 249450
13344B49450P4555H1058J84586K12113A4650N50580B72702l2262P2055E7774J05730
$$ 249450 324005 81058 265644 477757 14650 565230 272702 240440 312495 57774 163504
13333A63504a4753B81040j27252E8363K62579A23691E7923k0009b5963A52969
$$ 163504 -14753 281040 153788 58363 320942 123691 57923 37914 -25963 152969
13322C05142P3500A09913N2432A1444Q5250L7947E8669K744O9982e7171E35736
$$ 305142 378642 109913 162345 11444 96694 134641 58669 61413 131395 -57171 535736
13310e8199a6854A38903a94775A32856n9905j2629K8650O793L1386l2071O6176
$$ -58199 -16854 138903 -194775 132856 72951 60322 88972 95765 127151 95080 161256
13299A61256M4073A3101K37355B9122J65860g2660B64433k0562d1706A76764G7003
$$ 161256 205329 13101 250456 29122 194982 -72660 264433 243871 -41706 176764 77003
13287I3781D0519J25443a07456B01474q0018E6741g2709C10853J09454c9047B28186
$$ 93781 40519 165962 -107456 201474 121456 56741 -72709 310853 420307 -39047 228186
13275B99020m7518A15544l1597F690N26433A13987b22822i9065A23538M02868
$$ 299020 251502 115544 83947 6690 533123 113987 -222822 -99065 123538 526406
13265E26406e1336I0107J10771a4189m4303A37924b665C03922L287m0049E1115
$$ 526406 -51336 90107 200878 -14189 -58492 137924 -2665 303922 307209 267160 51115
13253A22527D6827J2495c0970M06G9637L85578A26635p552J19112A446d3704A9026
$$ 122527 46827 59322 -30970 -30564 79637 465215 126635 119083 238195 1446 -43704 19026
13240A58957h7520A43775K153c4502A41846M1001o0101m1740c8726I263J46466
$$ 158957 -87520 143775 145928 -34502 141846 182847 122746 81006 -38726 9263 155729
13229A55729F0214a50387D66358I677f1518l40383A84969o8543c3449C96107a38052
$$ 155729 60214 -150387 466358 9677 -61518 -401901 184969 116426 -33449 396107 -138052
13217B49103f8555A77398k2121M496J19972k7154A17072j976G263J87374l3606
$$ 249103 -68555 177398 155277 159773 279745 252591 117072 115096 7263 194637 161031
13206A61031E275J13488l460d1990B29879F8042N0664n5195a987j21291A3315
$$ 161031 5275 118763 115303 -41990 229879 68042 118706 63511 -1987 -123278 13315
13194E126J30749M808R6669D4460K82182L09118A41970C7240a24158n2026F7568
$$ 5126 135875 140683 237352 44460 326642 635760 141970 37240 -124158 -176184 67568
13182a16006N510j31935A92807l8538e3359D4813L42948E9060B3556J27343o6648
$$ -116006 -110496 -242431 192807 154269 -53359 44813 387761 59060 23556 150899 84251
13171H4251a49066F0365O8123m9640J77846i225j33436j40978B25802O8025j28517
$$ 84251 -149066 60365 128488 78848 256694 -9225 -142661 -283639 225802 293827 165310
13160A65310N8219a6786o1309A96615I1329N0765K97344i7556A9754J10620a82533
$$ 165310 223529 -16786 -78095 196615 91329 142094 439438 -97556 19754 130374 -182533
13148a75293G3426Q0362b8177k03392D5361R9229P3669D7967Q354L6880Q529g1594
$$ -175293 73426 153788 -28177 -231569 45361 144590 218259 47967 56321 93201 101730 -71594
13135a29608L8540m4355B3526Q0879H371K5561D640J49416k2727J42150A4234
$$ -129608 -91068 -135423 23526 104405 8371 33932 4640 154056 131329 273479 14234
13123B84197j14801A9843K45967G2946K8275L82770i5764A72810L0870j4063g1227
$$ 284197 169396 19843 265810 72946 101221 483991 -95764 172810 203680 189617 -71227
13111D36428E3864J98500d7974A17398O4055F5620K3771i6344n5903E0045J72942
$$ 436428 53864 252364 -47974 117398 181453 65620 89391 -96344 -152247 50045 222987
13100B22987A7839J592a17690C23763A01257a45890M5904r8436A39448b1081A06607
$$ 222987 17839 19431 -117690 323763 101257 -145890 -99986 -198422 139448 -21081 106607
13088A13065M8531h2887A25063Q6047b94439B56629a7788k5605C9246K15685A7501
$$ 113065 161596 -82887 125063 211110 -294439 256629 -17788 -43393 39246 254931 17501
13076A49626K74869d5823b0387E25718H7003f0240A54098e4615E6392d7100j0643
$$ 149626 424495 -45823 -20387 525718 87003 -60240 154098 -54615 56392 -47100 -57743
13065e7743H1582L8643P0276o8785L9717a57860j141D09325J3148g4941D1579
$$ -57743 81582 120225 190501 121716 161433 -157860 -159001 409325 422473 -74941 41579
13053i5141b050C53578D8238B3378P5453J01509g7578C32274a0142A87819B4653
$$ -95141 -2050 353578 48238 23378 98831 200340 -77578 332274 -10142 187819 24653
13041i7918D01696h4442A04508j5553c0924A12016D9462K13085a8650j45572C35288
$$ -97918 401696 -84442 104508 88955 -30924 112016 49462 262547 -18650 -164222 335288
13029A98470G9589L55949A58548D5191b75797D0356K4438a04343K8581r9737a7179
$$ 198470 79589 435538 158548 45191 -275797 40356 64794 -104343 -75762 -175499 -17179
13017B50717j7836F6297a96600B67440K6387H6410L34911A70036e1392E0981a11516
$$ 250717 232881 66297 -196600 267440 293827 86410 421321 170036 -51392 50981 -111516
13005D7427J74307q3300D8328J06967C0838N6269J33512j7655i9161A2209a99948
$$ 47427 221734 138434 48328 155295 30838 87107 220619 202964 -99161 12209 -199948
12993C91561a07893D8850M1061i4001C6575a20007A73940A9279L36586j58812
$$ 391561 -107893 48850 89911 -94001 36575 -120007 173940 19279 355865 197053
12983A97053j6543B3066O2195j9801K13714I1499B3490a7349A9959g0012A26109
$$ 197053 180510 23066 85261 65460 279174 91499 23490 -17349 19959 -70012 126109
12971G7275B7072a65691r6005A97171a18258B4114O9374g1711q6211P7904k19444
$$ 77275 27072 -165691 -261696 197171 -118258 24114 93488 -71711 -157922 -80018 -299462
12960b99462g6545R935A6134K5287O8686a60595B05860o6833b2330k52893O8207
$$ -299462 -76545 -66610 16134 41421 110107 -160595 205860 139027 -22330 -275223 -207016
12949b07016Q6967r8502J2631B96402e1051A58716P5699l6561g7702A35538c7180
$$ -207016 -120049 -218551 -205920 296402 -51051 158716 234415 197854 -77702 135538 -37180
12937I6231J68632j19459c44990d5932G4443J17897o5730c3832G4802a25497o6997
$$ 96231 264863 145404 -344990 -45932 74443 192340 126610 -33832 74802 -125497 -192494
12926a92494e1087J6214A00673d1473A7436J1696O9920B600J05616c1057j10682
$$ -192494 -51087 -34873 100673 -41473 17436 29132 99052 2600 108216 -31057 -141739
12915a41739B66881a8245M125l8048B3212O8285a24573B23931b33100C2762K0790
$$ -141739 266881 -18245 -14120 -52168 23212 91497 -124573 223931 -233100 32762 53552
12904E3552K3868K33876c2736q3087n8751B2140K66497H3852e1365K5239j84681
$$ 53552 77420 311296 -32736 -115823 -174574 22140 288637 83852 -51365 -26126 -210807
12893b10807J2890B70912G4656P6147i4567C28117j19135i8695L3076a6182B10707
$$ -210807 -197917 270912 74656 150803 -94567 328117 208982 -98695 -65619 -16182 210707
12881a32979H4467J35482k8528E8999d2102j78380A83765c05587j94237a68296
$$ -132979 84467 219949 191421 58999 -42102 -220482 183765 -305587 -499824 -168296
12870a70340A90260b46429a4221B46438d450A2219e7198A02927J48926g9616l6398
$$ -170340 190260 -246429 -14221 246438 -4450 12219 -57198 102927 251853 -79616 -116014
12859a16014k8642C05173E1273j340i5790l4525A77363q1182O785m1591k8448
$$ -116014 -144656 305173 51273 49933 -95790 -130315 177363 96181 102966 61375 32927
12848C2927f4905A64257E075c22432A14094k7250H079j235J88471q0956m7588
$$ 32927 -64905 164257 5075 -322432 114094 86844 8079 6844 195315 114359 66771
12837F6771a29367F6842d1437H6103c07929e0327j54311F4745a35436e0732j30816
$$ 66771 -129367 66842 -41437 86103 -307929 -50327 -204638 64745 -135436 -50732 -181548
12826a81548M6105E7968J53197c5424k74441A9468J79897H5751a5302k00088N3630
$$ -181548 -135443 57968 211165 -35424 -309865 19468 199365 85751 -15302 -215390 -161760
12815a61760g1413G8505a88185L4031K7672b0448k97304h0521A27473l2104J08794
$$ -161760 -71413 78505 -188185 -154154 -126482 -20448 -317752 -80521 127473 95369 204163
12804B04163m2007b1550I5506J45232c0483B41378b0822A14913B6909i9632B17730
$$ 204163 162156 -21550 95506 240738 -30483 241378 -20822 114913 26909 -99632 217730
12792A0072a35566H929a67060d5780R522B9553b2159I0185d51748F9080B6919
$$ 10072 -135566 8929 -167060 -45780 -36258 29553 -22159 90185 -451748 69080 26919
12780e5441E7922d6191a7765A78925c7069m6576A02968h2197A68853A6159f5892
$$ -55441 57922 -46191 -17765 178925 -37069 -83645 102968 -82197 168853 16159 -65892
12768c70038R6005J17729B5696P936J01240a68627A32451B9090d2279n2576k46223
$$ -370038 -274033 -156304 25696 33632 134872 -168627 132451 29090 -42279 -94855 -341078
12757c41078A77099o1226a23101q3316A80729B6483J97226H7436c05249R5765
$$ -341078 177099 115873 -123101 -206417 180729 26483 223709 87436 -305249 -209484
12747b09484G3128J01168E0396f6162B52297F2735c04770B02002J25558l1122
$$ -209484 73128 174296 50396 -66162 252297 62735 -304770 202002 327560 296438
12737B96438J29014B07314d4385A79701E2105L4453K20970p9688l3089F5233j5621
$$ 296438 425452 207314 -44385 179701 52105 86558 307528 227840 194751 65233 49612
12726D9612b73786H5389p088N4813F4272J3859h9344H1284J09369a91073f7025
$$ 49612 -273786 85389 78301 133114 64272 78131 -89344 81284 190653 -191073 -67025
12714A06098n090N9962a26887H2829K5222P2451J76935a48588B06253D0067K25740
$$ 106098 101008 160970 -126887 82829 108051 180502 357437 -148588 206253 40067 265807
12703B65807o010b2904j59433e2402C87508E6409a2071j45644A68614e15153J94089
$$ 265807 259797 -22904 -182337 -52402 387508 56409 -12071 -157715 168614 -515153 -321064
12692c21064A46336J18216e6605a1172j69339D4654g9316e553A22549a62073A60455
$$ -321064 146336 264552 -56605 -11172 -180511 44654 -79316 -5553 122549 -162073 160455
12680D6296J54582b5819n274G033g8164E6151a43671N7424F6701B590K0237d92380
$$ 46296 200878 -25819 -31093 7033 -78164 56151 -143671 -86247 66701 2590 22827 -492380
12667C91790j16948a19938e8504A0020J40409e6281B35434A07133J68494Q0840
$$ 391790 274842 -119938 -58504 10020 150429 -56281 235434 107133 275627 356467
12657C56467a45510L8974B53513n2925e9025B09886o6021o2685a03959P527B99024
$$ 356467 -145510 -106536 253513 200588 -59025 209886 143865 81180 -103959 -96432 299024
12645A36759k3538d564k57813C2592J43464m9865e062k39365D358Q347e8013C31917
$$ 136759 113221 -4564 -262377 32592 176056 126191 -5062 -244427 4358 12705 -58013 331917
12632A76322a6770A42820D4549a00324C01155j40120E6502L66600C7756Q1463
$$ 176322 -16770 142820 44549 -100324 301155 161035 56502 423102 37756 119219
12622A19219Q4799p4499A4082M00969e0811D4257j8981J53896f2423A44616B4159
$$ 119219 204018 129519 14082 415051 -50811 44257 25276 179172 -62423 144616 24159
12610A99295Q5022i786m008k66474G6148c0440A6144J9197J18329a85806B54365
$$ 199295 284317 -9786 -13794 -280268 76148 -30440 16144 35341 153670 -185806 254365
12598G9897C3997h5718M0112j17141c2447j77061K2444b4796j2195j49336A47325
$$ 79897 33997 -85718 -45606 -162747 -32447 -209508 -187064 -24796 -36991 -186327 147325
12586b9197R160m9825K148C73133c6228o5285j11924K3953C03563a67021h3099
$$ -29197 -20037 -69862 -67714 373133 -36228 -101513 -213437 -189484 303563 -167021 -83099
12574A02713L33a12972B5862a28673A84821a55482J4110O0816q1601d2642A44513
$$ 102713 103046 -112972 25862 -128673 184821 -155482 -141372 -80556 -162157 -42642 144513
12562A42940A9954c7928C4138a6283j03405C00457b9168H1500I314L648a99466
$$ 142940 19954 -37928 34138 -16283 -119688 300457 -29168 81500 9314 12962 -199466
12550A94252I361b13792F0347J70604H6617I285a19653j34943a0380k20288k27705
$$ 194252 9361 -213792 60347 230951 86617 9285 -119653 -254596 -10380 -230668 -458373
12539d58373A09350A5775J78567g7604c340j09792A20829b90088A15554a59992
$$ -458373 109350 15775 194342 -77604 -3340 -113132 120829 -290088 115554 -159992
12528i7874A61001i587j07147D2505a76873H5111b55044a23686N4453E9236J69042
$$ -97874 161001 -9587 -116734 42505 -176873 85111 -255044 -123686 -69233 59236 228278
12517B28278j06562g2744k43671L5082A84482a47527l5775g556k78616b4823A80276
$$ 228278 121716 -72744 -316415 -281333 184482 -147527 -183302 -7556 -286172 -24823 180276
12505B4257a54310n2005G7737A6565c9922q1284F5010A0367J9748J47551A5399
$$ 24257 -154310 -206315 77737 16565 -39922 -121206 65010 10367 30115 177666 15399
12493a24571l3769E4996h434I4604j0248a92266e6032k8635A40951b45524e0494
$$ -124571 -158340 54996 -8434 94604 84356 -192266 -56032 -84667 140951 -245524 -50494
12481B41239H7314f7063C76393b30215i3163A9598M03573b02783F4261M679b01148
$$ 241239 87314 -67063 376393 -230215 -93163 19598 423171 -202783 64261 68940 -201148
12469h4073a8615B093O0005b09737H1355c23950a8202q202j83976A63083d5989
$$ -84073 -18615 2093 62098 -209737 81355 -323950 -18202 -26404 -210380 163083 -45989
12457f6459C54114G4916b00565B40938i2167c5861E32439D9327d688j01788B0912
$$ -66459 354114 74916 -200565 240938 -92167 -35861 532439 49327 -4688 -106476 20912
12445f9516n0140A52157B2234J50147J75177G6721a18937B28307A01045J32454
$$ -69516 -119656 152157 22234 172381 347558 76721 -118937 228307 101045 233499
12435B33499A9892b95483J46622K0043A66801a20070j42413G7489G937b49440
$$ 233499 19892 -295483 -148861 -128818 166801 -120070 -262483 77489 7937 -249440
12424b85570A11555R6506e8952k1947G3934G489b16456a03986l4947j47038a14284
$$ -285570 111555 208061 -58952 -80899 73934 7489 -216456 -103986 -138933 -285971 -114284
12412d4926C89212n021c59025a4077A40700f4125k18935D87773b5664j42386G2633
$$ -44926 389212 384191 -359025 -14077 140700 -64125 -283060 487773 -25664 -168050 72633
12400A64711d6239G4965a36870K6906k24081d3752A63236i5436n0195N7794A24451
$$ 164711 -46239 74965 -136870 -109964 -334045 -43752 163236 -95436 -145631 -87837 124451
12388G4447m177a5039l6337b2778A52918b56914b1604A63082m7909a21354J7332
$$ 74447 70270 -15039 -51376 -22778 152918 -256914 -21604 163082 115173 -121354 -104022
12377a04022F5811b29011J6088B30464h076A63749K4496b07728G3974B5745J29119
$$ -104022 65811 -229011 -212923 230464 -8076 163749 188245 -207728 73974 25745 154864
12366A54864c4679G3642b4564k0527l24344B02157B6495a45052j3139b5470A41629
$$ 154864 -34679 73642 -24564 -45091 -369435 202157 26495 -145052 -158191 -25470 141629
12354b4533m4371j65334B2535K40098a49650r3909B90256b33458H8959K43756
$$ -24533 -68904 -234238 22535 262633 -149650 -243559 290256 -233458 88959 332715
12344C32715m510e0071A25170i3815J1698B3407J00106J34099E3758g5911H3530
$$ 332715 328205 -50071 125170 -93815 -82117 23407 123513 257612 53758 -75911 83530
12332B10157a80253N5102A77889e0397A36396f9272h452j16399q1645A29847a08025
$$ 210157 -180253 -125151 177889 -50397 136396 -69272 -8452 -124851 -206496 129847 -108025
12320G1305M3255B0532a64415J8741E7350a6346j28813n2004h7031A27017c46343
$$ 71305 114560 20532 -164415 -145674 57350 -16346 -145159 -197163 -87031 127017 -346343
12308G9774l577j2259K10569l8037j08178b28361B54768n7646b70518a22449b1251
$$ 79774 76197 63938 274507 236470 128292 -228361 254768 197122 -270518 -122449 -21251
12296a15195A83676e9734A27214P65L5645a54055A05540h1280A19799K7832G0339
$$ -115195 183676 -59734 127214 127979 163624 -154055 105540 -81280 119799 147631 70339
12284G2276J93500f8561m6599I4333N8136b45618F4362P2814a88935B78953j21696
$$ 72276 265776 -68561 -115160 94333 152469 -245618 64362 137176 -188935 278953 157257
12273A57257N7503G2130O5957k4594K62252G3890C2944d0370k8923r3510j69956
$$ 157257 214760 72130 138087 113493 375745 73890 32944 -40370 -69293 -162803 -332759
12262c32759A4080L2397J41786b9A50163g1293A57101a83851D24680H3277J84943
$$ -332759 14080 46477 188263 -29 150163 -71293 157101 -183851 424680 83277 268220
12251B68220a41992B47002a80634f2595k8350i959B72532a55060f1572B02897
$$ 268220 -141992 247002 -180634 -62595 -90945 -9959 272532 -155060 -61572 202897
12240c48104d0870A58155p2849L16913F6487J51104n893L1641J3614F3009Q735
$$ -348104 -40870 158155 85306 402219 66487 217591 211698 243339 256953 63009 71744
12229G1744J58255K13140A43563I069i9472C5820K64937l425a45246B50285q4724
$$ 71744 229999 443139 143563 9069 -99472 35820 300757 297332 -145246 250285 165561
12218A65561A1235a62934A78151J05222A38051f0965C55080i8121B96706I1767
$$ 165561 11235 -162934 178151 283373 138051 -60965 355080 -98121 296706 91767
12207I4702l1534A4761e8813H8065J34896K0208a56383B20614d9254F7283A88
$$ 94702 63168 14761 -58813 88065 222961 243169 -156383 220614 -49254 67283 188
12195B25324j3256J61784c752j51859E3077N8884l9223O0938j7722Q3571k2334
$$ 225324 212068 373852 -3752 -155611 53077 111961 72738 133676 115954 199525 177191
12184A77191K17670a60471h0161E8388e8354j86455b5702G1496b6308A21032c217
$$ 177191 394861 -160471 -80161 58388 -58354 -244809 -25702 71496 -26308 121032 -3217
12172B35196m0526H4764j4718A4515b82583F4504M03061E22K22237a96405A40015
$$ 235196 194670 84764 70046 14515 -282583 64504 467565 522 222759 -196405 140015
12160A34357a17210J9741H6266B7022a27168M5886B29143F5479c73614F7939a94534
$$ 134357 -117210 -97469 86266 27022 -127168 -81282 229143 65479 -373614 67939 -194534
12148A81815e6144A96334F4326a670j36043A92331a39690A96492c47358B4231
$$ 181815 -56144 196334 64326 -1670 -137713 192331 -139690 196492 -347358 24231
12137B5348b50339f1058A71748a95820B18145D8049J3448K86079f5574F0707K79861
$$ 25348 -250339 -61058 171748 -195820 218145 48049 61497 347576 -65574 60707 340568
12126C40568a49274A77981J10752A08917O0583d3100q9677L5824C23534g8789
$$ 340568 -149274 177981 288733 108917 169500 -43100 -132777 -96953 323534 -78789
12115E3157J44751G0372J48159o2807N0825H4121a79897B4355a05194c0478A7328
$$ 53157 197908 70372 218531 155724 206549 84121 -179897 24355 -105194 -30478 17328
12103a19938C31760E2752K45505A30553a04230B08929P5667N5005a56062A16853
$$ -119938 331760 52752 298257 130553 -104230 208929 284596 339601 -156062 116853
12092f0079A93458c3111F734B6g6791a873E6221f1886l3758A80129d4276q0487
$$ -60079 193458 -33111 6734 26 -76791 -1873 56221 -61886 -95644 180129 -44276 -124763
12080a24763m1961B9341I690a63278B56M10086j20209G4061J24742J726083n61657
$$ -124763 -166724 29341 9690 -163278 256 410342 290133 74061 198803 1924886 1363229
12069A363229B69130a59819A3884K91119a9132n2177o5504F13384A55641h8672
$$ 1363229 269130 -159819 13884 305003 -19132 -71309 -136813 613384 155641 -88672
12058E8425i0465C38921a02208M0642m3663j0321B2940b61828B9609a24829k13029
$$ 58425 -90465 338921 -102208 -61566 -105229 -115550 22940 -261828 29609 -124829 -337858
12047c37858L6373a6462k7473A85149b27385n819I4760d3697p6942q8669F0728
$$ -337858 -301485 -16462 -43935 185149 -227385 -233204 94760 -43697 -120639 -209308 60728
12035E2158b87915J41213c8052A39986a99032I9838B073K80795F2449a9313l3237
$$ 52158 -287915 -146702 -38052 139986 -199032 99838 2073 282868 62449 -19313 -52550
12024e2550b3749m9005A23018a3223m9334j39886d0385B09970c8945A60114c7067
$$ -52550 -23749 -72754 123018 -13223 -62557 -202443 -40385 209970 -38945 160114 -37067
12012I401J7885a28668d2849C7189K75606B3767b85752g6937k063K2507k28105
$$ 9401 27286 -128668 -42849 37189 312795 23767 -285752 -76937 -79000 -56493 -284598
12001b84598A48533J60214a64575n9710A9671J76471D377b9901A41743d81521
$$ -284598 148533 308747 -164575 -224285 19671 196142 4377 -29901 141743 -481521
11990B1376j0521M9470K961a74449A02800J65664q2964f1016B67146F2895J73776
$$ 21376 10855 60325 63286 -174449 102800 268464 185500 -61016 267146 62895 236671
11979B36671c74684f9457C66592b5256p267G576A250a70656g2927A48362A0026
$$ 236671 -374684 -69457 366592 -25256 -32523 7576 1250 -170656 -72927 148362 10026
11967B83017a79333A82467a77270A46969a1758m30566d1553j82762A26683C3093
$$ 283017 -179333 182467 -177270 146969 -11758 -442324 -41553 -224315 126683 33093
11956A52890e2893E00K30759r8219i5125r485o2938e8232B0853a12348k02294
$$ 152890 -52893 500 231259 133040 -95125 -104610 -167548 -58232 20853 -112348 -314642
11945c14642g4988d600C7117J487a31324C2369J30652h1935j23529F8125a84268
$$ -314642 -74988 -4600 37117 38604 -131324 32369 163021 -81935 -205464 68125 -184268
11933C2650d6130q3598h170A14044a13214j3208d5598C36725g5853K8181r9906
$$ 32650 -46130 -129728 -8170 114044 -113214 -126422 -45598 336725 -75853 -47672 -147578
11922a47578b0921k96220c5652I9707J01049c3513n8130J1876L4256B43956d01056
$$ -147578 -20921 -317141 -35652 99707 200756 -33513 -91643 -79767 -45511 243956 -401056
11910D8035K40313E6400a09977j96048j9430A66229K457C091i6826A30026f919
$$ 48035 288348 56400 -109977 -306025 -325455 166229 168686 3091 -96826 130026 -6919
11898a83724g3275j16930C3960a59078c3687j75393c5701j48961A123g1450k49137
$$ -183724 -73275 -190205 33960 -159078 -33687 -209080 -35701 -184662 1123 -71450 -320587
11887c20587g4626c2282k00603q543f4342A26255d08710a48981B44960o9897Q248
$$ -320587 -74626 -32282 -232885 -241428 -64342 126255 -408710 -148981 244960 175063 183311
11876A83311M0098D235b19571A49084b90680a31992D1746d2308k68814B05263
$$ 183311 223409 4235 -219571 149084 -290680 -131992 41746 -42308 -311122 205263
11865a84775Q3344l3674j10382G1694a03656m514k89047a28942F9538g9395j5227
$$ -184775 -101431 -135105 -245487 71694 -103656 -108170 -397217 -128942 69538 -79395 -94622
11854i4622l0258A64929n3459J75892C3566a19879J1623j83477A29944a88045
$$ -94622 -124880 164929 111470 287362 33566 -119879 -108256 -291733 129944 -188045
11843A48957c68783h7100A79146h8774C50492g0275j6061j56941C6355b03407
$$ 148957 -368783 -87100 179146 -88774 350492 -70275 -86336 -243277 36355 -203407
11832a43046I0874l663a83679C35026a63340L6216j68971r4441I5886c1496H9217
$$ -143046 90874 87211 -183679 335026 -163340 -127124 -296095 -390536 95886 -31496 89217
11820A53200b2295a557F6451d4814k52962H9309m3223J83388E2822a0927F7307
$$ 153200 -22295 -1557 66451 -44814 -297776 89309 46086 229474 52822 -10927 67307
11808a61765a0399B17256n3187G7519c54584d8894B17723a39562H2288a99421
$$ -161765 -10399 217256 164069 77519 -354584 -48894 217723 -139562 82288 -199421
11797a45932E5149k2638J3424J14671d7528k61056g4685C42091f2110p8875B83497
$$ -145932 55149 32511 45935 160606 -47528 -308584 -74685 342091 -62110 -140985 283497
11785a03157r4858j45330A7236b3608l12926i020F2348b03135A5697f5042A24515
$$ -103157 -198015 -343345 17236 -23608 -336534 -9020 62348 -203135 15697 -65042 124515
11773b8384B2234K14703m785D3279f0169A7990b61874a29235p0076f0420B82517
$$ -28384 22234 236937 232152 43279 -60169 17990 -261874 -129235 -199311 -60420 282517
11761G704q82b44168M6303h5665A2633c03860E1344B1371Q6929o731J39607P743
$$ 7704 6822 -244168 -197865 -85665 12633 -303860 51344 21371 108300 101569 241176 248919
11749B48919d5351F2214B2198b02503A27550a2007j50988b5210A19267e3446k32449
$$ 248919 -45351 62214 22198 -202503 127550 -12007 -162995 -25210 119267 -53446 -285895
11738b85895G4132b6705B03688o6181b06999B00548a43752J4351A55112O7476
$$ -285895 74132 -26705 203688 137507 -206999 200548 -143752 -129401 155112 222588
11728B22588l744A9748K12492j0391a53488k895f8154B26807E1894g3162A12872
$$ 222588 218844 19748 232240 221849 -153488 -156383 -68154 226807 51894 -73162 112872
11716c6929k48899A09363c7257D8782a93782C3172M344L11957F6353c8709B49791
$$ -36929 -285828 109363 -37257 48782 -193782 33172 37516 349473 66353 -38709 249791
11704A04756f629A58136n1443m6415L6095A7261J46828a14964B51545r8185J20848
$$ 104756 -6629 158136 106693 60278 96373 17261 164089 -114964 251545 153360 274208
11693B74208l2048E6345M0267J28430a57958m9114D8055i4613H1592K9351a6777
$$ 274208 242160 56345 96612 225042 -157958 -207072 48055 -94613 81592 110943 -16777
11681a41650A59901b18052N0286A52292b29147E7256e7685I3149a44326A71368
$$ -141650 159901 -218052 -167766 152292 -229147 57256 -57685 93149 -144326 171368
11670a28573L4967Q669b4990l7743j17017C6158a69823k311B17711o269I7007
$$ -128573 -93606 -84937 -24990 -62733 -179750 36158 -169823 -172134 217711 211442 97007
11658b37555B27469J9361I1056L9747P2490c07501a6481k8117F4483a24981A64859
$$ -237555 227469 246830 91056 130803 203293 -307501 -16481 -44598 64483 -124981 164859
11646G9778a83688b3765A32432c4840C31343d3546A22890a14564J7799j0552J0771
$$ 79778 -183688 -23765 132432 -34840 331343 -43546 122890 -114564 -96765 -107317 -96546
11635i6546B16042D5414N9377L2703K03278A11334h0552A92841k9107d8550A00112
$$ -96546 216042 45414 104791 137494 340772 111334 -80552 192841 163734 -48550 100112
11623h7414C43029G9991f5155A4288J87789a45016j5223F1106e7001E97925E9755
$$ -87414 343029 79991 -65155 14288 202077 -145016 -160239 61106 -57001 597925 59755
11611A99630a17541I6558h539j32195r7873f753j36582H2039a94805G9287b19798
$$ 199630 -117541 96558 -8539 -140734 -238607 -6753 -143335 82039 -194805 79287 -219798
11599A0969a6323j13984A00189J53583i7630b4258k82446C26314j20805K85644
$$ 10969 -16323 -130307 100189 253772 -97630 -24258 -306704 326314 205509 491153
11589D91153a31821B79658K62794D0830R026N5728e2407F694J88631F3385B7362
$$ 491153 -131821 279658 542452 40830 49856 105584 -52407 6694 195325 63385 27362
11577b8949A04544c4882j47525A94579P2626A09200j9222J19699R028F5624k4820
$$ -28949 104544 -34882 -182407 194579 267205 109200 89978 209677 218705 65624 40804
11566D0804b4157j08046M8381r015E5321a27894J70o2287D10340A06775L6082
$$ 40804 -24157 -132203 -83822 -92837 55321 -127894 -127724 -190011 410340 106775 142857
11555A42857E4676c25025a18586H6207J19628J4922l2660A4103J2135J72365a77797
$$ 142857 54676 -325025 -118586 86207 205835 220757 188097 14103 26238 198603 -177797
11543a0160D4887F107B217O1474b6643n2j57053A39729J16886J39915k0515A34681
$$ -10160 44887 6107 2217 63691 -26643 -26695 -183748 139729 256615 396530 376015 134681
11530c6608J0738A16588J85873j2258j01444J84046H3077C766a60857A55035a6193
$$ -36608 -25870 116588 302461 290203 188759 372805 83077 3766 -160857 155035 -16193
11518C2355Q2599M4130b19284D38211r6814e4108B11426J4011a79055A52289b4612
$$ 32355 114954 159084 -219284 438211 341397 -54108 211426 225437 -179055 152289 -24612
11506H4943P9798l7083D2362K26130j12760R869K6750J16631D1603R4227n0899
$$ 84943 164741 127658 42362 268492 155732 165601 192351 308982 41603 135830 84931
11495H4931N8908K0336e9352A11777B5152J18148P5624c08163B54784G1912L31598
$$ 84931 143839 164175 -59352 111777 25152 143300 218924 -308163 254784 71912 403510
11484D03510A6331a09882D20816I8438J07792J15704E9500K32025A19163j3633
$$ 403510 16331 -109882 420816 98438 206230 321934 59500 291525 119163 105530
11474A05530D1943a34822A48248b3553I0942K59149a4221B0752j857J25673a20562
$$ 105530 41943 -134822 148248 -23553 90942 350091 -14221 20752 18895 144568 -120562
11462b06608C3929k827J42389G0855a44216K1294A74388m9003c9450A63887o0188
$$ -206608 33929 31102 173491 70855 -144216 -122922 174388 125385 -39450 163887 103699
11451A03699b65991A865J36417d0626a1178A78533a01583B0091L29665a11094
$$ 103699 -265991 1865 138282 -40626 -11178 178533 -101583 20091 349756 -111094
11440A98606b185A97610r7461a66377j0412B59683h2976B671J17333a07817A7275
$$ 198606 -2185 197610 100149 -166377 -176789 259683 -82976 2671 120004 -107817 17275
11428b62462O8234A13207d0419A84392J11976b08322Q1629j03692b241A45843
$$ -262462 -194228 113207 -40419 184392 296368 -208322 -126693 -230385 -2241 145843
11417A20312A0829R6450J0747E6684a15320I9041c08596C54523H8858a03416c1192
$$ 120312 10829 107279 118026 56684 -115320 99041 -308596 354523 88858 -103416 -31192
11405B41670K2803a5190A82939a92367c0845F2263K01062a6647B63713i4119A66562
$$ 241670 264473 -15190 182939 -192367 -30845 62263 263325 -16647 263713 -94119 166562
11393H0208C3749a5008P375l4368C1888J15177o9755a05793j15511A56069a83933
$$ 80208 33749 -15008 -7633 -42001 31888 147065 77310 -105793 -221304 156069 -183933
11381B03747f622j79790B1184K50155n5070N2385F0759a68067a1977p8267K2412
$$ 203747 -6622 -186412 21184 271339 216269 268654 60759 -168067 -11977 -90244 -67832
11370f7832k01167a07249A46875i4897j14940j9199d5812k6494a8401I0693d1245
$$ -67832 -268999 -107249 146875 -94897 -209837 -229036 -45812 -72306 -18401 90693 -41245
11358c2534F125a82689A17275h4248F7578K6337C3023b8605B49752c80534a1090
$$ -32534 6125 -182689 117275 -84248 67578 93915 33023 -28605 249752 -380534 -11090
11346A24909h1110A17122c01648a16760B01616b05140E8612a18057e59j1550j1005
$$ 124909 -81110 117122 -301648 -116760 201616 -205140 58612 -118057 -559 -12109 -23114
11335b3114G2730l1053a71755b6673m6764n8965E6967J08265c02747a02871m8337
$$ -23114 72730 41677 -171755 -26673 -73437 -132402 56967 165232 -302747 -102871 -151208
11324a51208G540N2371a92590D0326L72521a53210b4790F7330a41424f1117C965
$$ -151208 7540 59911 -192590 40326 412847 -153210 -24790 67330 -141424 -61117 3965
11312A38409a56494A07749K17246D3909d5534A1510N8171k4483K06139e7207m2065
$$ 138409 -156494 107749 324995 43909 -45534 11510 69681 45198 251337 -57207 -99272
11301i9272j19785A16674m0309B2452j1195J47248d9990q998A46505c9333o1742
$$ -99272 -219057 116674 76365 22452 11257 158505 -49990 -58988 146505 -39333 -101075
11290a01075q0988B48130d58385G4210b99726d6918n0325D6319a95328A28501
$$ -101075 -182063 248130 -458385 74210 -299726 -46918 -97243 46319 -195328 128501
11279G6104R220N8234a76315A48757o9334a40455k16757J58452B21001b9689A1610
$$ 76104 85324 143558 -176315 148757 79423 -140455 -357212 -198760 221001 -29689 11610
11267A27632b08354n537P6867E2709a46083q9608d6185B36052g4619k21851a39452
$$ 127632 -208354 -213891 -137024 52709 -146083 -235691 -46185 236052 -74619 -296470 -139452
11255b59719c7830B72979c35586J34217F5097a97871C09344A20419N1169h3891
$$ -259719 -37830 272979 -335586 -201369 65097 -197871 309344 120419 171588 -83891
11244g1370F0236q375J9814O4643b90910a26396d4166J4405J4429F145J61170
$$ -71370 60236 51861 71675 136318 -290910 -126396 -44166 -29761 -15332 6145 167315
11233A67315a06496k48985A0539M8576N9680R1942a89361R1718k5673b8587m93238
$$ 167315 -106496 -355481 10539 59115 118795 210737 -189361 -97643 -123316 -28587 -521825
11222e21825a26371k0973k72632A37845h2773A71143b88234j06152a22535B33977
$$ -521825 -126371 -147344 -419976 137845 -82773 171143 -288234 -394386 -122535 233977
11211I0386J68837d24000b07199H0067J6013C3082K91276E7932f9827m9251j26620
$$ 90386 259223 -424000 -207199 80067 96080 33082 324358 57932 -69827 -119078 -245698
11200b45698C0660L515a00503b9898n9441a1480E5319a04316m7448H0004i8076
$$ -245698 30660 34175 -100503 -29898 -89339 -11480 55319 -104316 -151764 80004 -98076
11188d8848C916b36600P9900l36990J21635J15642J23718B9185R4442K80510i6845
$$ -48848 3916 -236600 -156700 -493690 -372055 -256413 -132695 29185 123627 404137 -96845
11176b68039h7929J982l3058j43861i7432l6441H5006a17504L0987k33419a4562
$$ -268039 -87929 -85947 -119005 -262866 -97432 -133873 85006 -117504 -86517 -319936 -14562
11164a00004k27077a19933k11465J49860B081d91441c547o0884K2085k58237B8373
$$ -100004 -327081 -119933 -331398 -181538 2081 -491441 -3547 -64431 -42346 -300583 28373
11152B1445a06726k18522C6809O4378i8762p8112D1042J98599i4178A90525c24579
$$ 21445 -106726 -325248 36809 101187 -98762 -176874 41042 239641 -94178 190525 -324579
11140A06359b74461a18051j865A71505L3406b51251b9573m23986B00758J1279
$$ 106359 -274461 -118051 -119916 171505 204911 -251251 -29573 -453559 200758 212037
11130B12037J953a6241k64972B37055b53046d6831n6429B09604f1801C16463G4505
$$ 212037 213990 -16241 -281213 237055 -253046 -46831 -103260 209604 -61801 316463 74505
11118A87410k7366a3743D1730r062K23246m8731r3229a99330Q2611G9270J37838
$$ 187410 160044 -13743 41730 32668 255914 207183 113954 -199330 -116719 79270 217108
11107B17108c4626A59063O5795K79384b78289A42568e1331H0070J84462a06301
$$ 217108 -34626 159063 224858 504242 -278289 142568 -51331 80070 264532 -106301
11096g1924A9229Q5269J89662j38251K91582j88183j4476J87844a18154B19003
$$ -71924 19229 104498 294160 155909 447491 259308 244832 432676 -118154 219003
11085A95593F6226J53610L04909k20276h5648E01737B32641a83466C98333A37503
$$ 195593 66226 219836 524745 304469 -85648 501737 232641 -183466 398333 137503
11074d5463A687N68673A16950J47991j32275K32325A65680K31223j45721J34369
$$ -45463 1687 570360 116950 264941 132666 364991 165680 396903 251182 385551
11064C85551D5805M65998q9806J3315J4850J23473J66646M8645C58021L38763
$$ 385551 45805 511803 421997 435312 450162 573635 740281 788926 358021 696784
11054F96784k74910K20845j47460K65911k30820K59733j41961M3626p6771k07899
$$ 696784 421874 642719 495259 761170 530350 790083 648122 691748 614977 407078
11044D07078K63375J67883l67833L01923P3631l20055J44976B98237N94589k05826
$$ 407078 670453 838336 470503 772426 846057 526002 670978 298237 892826 687000
11034F87000C19761K63268P2032J1411m6666n5933J83713R545k31363J96579O1878
$$ 687000 319761 583029 655061 666472 619806 563873 747586 757131 525768 722347 784225
11023G84225j43803j84537L66285C08587L93620k13463L5127R6382j13848J25846
$$ 784225 640422 455885 822170 308587 702207 488744 523871 620253 506405 632251
11013F32251K29533k26865j60411O3006j1394B59612M0140K30498J03563J26807
$$ 632251 861784 634919 474508 537514 526120 259612 299752 530250 633813 760620
11003G60620J33276l54323k50331R4306L14804j48399q8571l8267O6409j32977
$$ 760620 893896 539573 289242 383548 698352 549953 461382 423115 489524 356547
10993C56547K84684J80220j7332R541m8078m7502j627K39140o8231J26200K73185
$$ 356547 641231 821451 804119 813660 765582 718080 716453 955593 887362 1013562 1286747
10982A286747j19610l09117K75601k87572M54328L53104Q8944k96719L12438J63948
$$ 1286747 1167137 858020 1133621 846049 1300377 1653481 1742425 1445706 1758144 1922092
10972A922092O38353k00667k15651K52396L14633k96539l42716r8509j58861J7934
$$ 1922092 2560445 2359778 2144127 2396523 2711156 2414617 2071901 1973392 1814531 1832465
10962A832465p7619Q4497Q8946k51392l1848q8956J57090L56133l58109m6484
$$ 1832465 1754846 1839343 1928289 1676897 1645049 1556093 1713183 2069316 1711207 1664723
10952A664723j90812j06533j69728l36992l66760K74612l39855j704K9261o4532
$$ 1664723 1473911 1367378 1197650 860658 493898 768510 428655 426951 456212 391680
10942C91680A57452O2990r9606m0061J90840p0589E9882j6519L19470n3228j8350
$$ 391680 157452 220442 120836 80775 271615 201026 59882 43363 362833 309605 291255
10931B91255a25269a1481k349A10049J28817b8639G4961d598A35563k5236L6044
$$ 291255 -125269 -11481 -13830 110049 238866 -28639 74961 -4598 135563 110327 146371
10920A46371a34062B76254p3705a26691j22349K5266b4228E6661a59072A42566
$$ 146371 -134062 276254 202549 -126691 -249040 -223774 -24228 56661 -159072 142566
10909B80522m660j5675r6790d0004k91500a30009A71063q300b59517B0362a24968
$$ 280522 275862 260187 163397 -40004 -331504 -130009 171063 162763 -259517 20362 -124968
10897E8462e8636K2684j21749K4755j7746h997H6757a34212B50053e0310G2717
$$ 58462 -58636 -35952 -157701 -132946 -150692 -8997 86757 -134212 250053 -50310 72717
10885i2286A33250c05161D5200Q9806a96988f3922C16845C0505i0361A8651a81796
$$ -92286 133250 -305161 45200 135006 -196988 -63922 316845 30505 -90361 18651 -181796
10873c32779b6307k40756D708a21415c7183l264I305a34693p5297A29865d1598
$$ -332779 -26307 -267063 4708 -121415 -37183 -40447 9305 -134693 -209990 129865 -41598
10861a80253A75773a14516E1553a27818k16313a20181n0303B5241A1629K0892
$$ -180253 175773 -114516 51553 -127818 -344131 -120181 -170484 25241 11629 32521
10851C2521K18956J29940o4817f2119B29282b21961A32308e4948I8546h4777D2246
$$ 32521 251477 381417 316600 -62119 229282 -221961 132308 -54948 98546 -84777 42246
10839I6936c4662k2078I39f6473b4620E1486K0997O0214b4708n9408k23910a03910
$$ 96936 -34662 -56740 939 -66473 -24620 51486 72483 132697 -24708 -84116 -308026 -103910
10826i8247o3119B9692c45809g0788j8136j41768F163J0838N2335a52250J4482
$$ -98247 -161366 29692 -345809 -70788 -88924 -230692 6163 17001 69336 -152250 -137768
10815a37768J633G6937h5497a210j53816n9110B30353e7235D9401d8362C3108
$$ -137768 -136135 76937 -85497 -1210 -155026 -214136 230353 -57235 49401 -48362 33108
10803e4331A8714a22503j1129G6855c9285A41647f8666p8949g3435A325R3047
$$ -54331 18714 -122503 -133632 76855 -39285 141647 -68666 -147615 -73435 1325 94372
10792I4372M9534a17127Q829B17537a58178G2575c66525I9987c9036I1156d6648
$$ 94372 143906 -117127 -108298 217537 -158178 72575 -366525 99987 -39036 91156 -46648
10780A66784b07264B69846f1499B77840b50548O3669b3098j27401D052J09068
$$ 166784 -207264 269846 -61499 277840 -250548 -186879 -23098 -150499 4052 113120
10770A13120a09679A61343a92452e8994j45100i0739A9490a15345e2387j32210
$$ 113120 -109679 161343 -192452 -58994 -204094 -90739 19490 -115345 -52387 -184597
10760a84597A15170l1300c28134i5585b7194A35987a92304Q4558k34101k7700
$$ -184597 115170 83870 -328134 -95585 -27194 135987 -192304 -107746 -341847 -369547
10750c69547a32080I3993b72431J04952M7001c0117q3360L1878j61724a01924
$$ -369547 -132080 93993 -272431 -167479 -120478 -30117 -113477 -81599 -243323 -101924
10739h5328M1869A7417J104a50346A40979h5323D04806a83982B2980c6420A39938
$$ -85328 -43459 17417 18521 -150346 140979 -85323 404806 -183982 22980 -36420 139938
10727B97913c10780H1994B8479a01529M0753B37488j09265a22279k36698d2533
$$ 297913 -310780 81994 28479 -101529 -60776 237488 128223 -122279 -358977 -42533
10716d52454D6759J91988a5337p645k3069n1359G9601K1984J19433a68348A66744
$$ -452454 46759 238747 -15337 -22982 -46051 -97410 79601 101585 221018 -168348 166744
10704D0897h8470j58159o3347J51359B5768a52344k55704a68502l03687A50306
$$ 40897 -88470 -246629 -309976 -158617 25768 -152344 -408048 -168502 -472189 150306
10693a95428E4470i4119p6795P7847j24008P139N965m5689Q7054N5372E0381a63863
$$ -195428 54470 -94119 -170914 -93067 -217075 -209936 -203971 -249660 -162606 -107234 50381 -163863
10680a5764p2183k7962A47439a09693E0137a49860g3778k02609A69477b776j18524
$$ -15764 -87947 -115909 147439 -109693 50137 -149860 -73778 -276387 169477 -2776 -121300
10669a21300d8296A4769a68395B25173D736L7272b46774A20126a17176A36231
$$ -121300 -48296 14769 -168395 225173 4736 42008 -246774 120126 -117176 136231
10658a91553g5428L1097B73118e7576b1586l22390A27388c44658g9473B7035c1568
$$ -191553 -75428 -44331 273118 -57576 -21586 -343976 127388 -344658 -79473 27035 -31568
10646f2234A8713a55800F2530a23116B06394b45371J21548j28857q8150n0275
$$ -62234 18713 -155800 62530 -123116 206394 -245371 -123823 -252680 -340830 -391105
10636c91105G0076e0032A87872J6899a52436N0665G2984d18432f0544k24320J31178
$$ -391105 70076 -50032 187872 204771 -152436 -101771 72984 -418432 -60544 -284864 -153686
10625a53686p7535e557k98525H2691L8216Q0728G844J6184b43536F4818a85716
$$ -153686 -231221 -5557 -304082 82691 120907 201635 7844 24028 -243536 64818 -185716
10613e9446F2900O1568a69271M6741B6337J22573p3497B756d0947a9950j48080
$$ -59446 62900 124468 -169271 -122530 26337 148910 75413 2756 -40947 -19950 -168030
10602a68030K5193n0605E4117j8142a20841L0683e984F8134N0214e2756A35018
$$ -168030 -142837 -193442 54117 35975 -120841 -90158 -5984 68134 118348 -52756 135018
10590c40856a46584A81885c45854i7137A76998b29285k04576b14687B60985M2936
$$ -340856 -146584 181885 -345854 -97137 176998 -229285 -433861 -214687 260985 303921
10580C03921a44683c3043A568c13518J53680a3365j00693D29582a11217r4667
$$ 303921 -144683 -33043 1568 -313518 -159838 -13365 -114058 429582 -111217 -205884
10570b05884C23058b6564k7328b2540n772D4310a78493j48659f4430I3169c34325
$$ -205884 323058 -26564 -53892 -22540 -28312 44310 -178493 -327152 -64430 93169 -334325
10558A00217k2515b29541A2437M8138O5766a1405A59247B2447a12061D380J41574
$$ 100217 77702 -229541 12437 60575 126341 -11405 159247 22447 -112061 4380 145954
10547A45954a7196j31235b7134B2671e550l5258E9353h1132j58968o5726B24530
$$ 145954 -17196 -148431 -27134 22671 -5550 -40808 59353 -81132 -240100 -305826 224530
10535c653l3338E5552b07011l4939k18911a43868n471N2822Q344j5763B52113
$$ -3653 -36991 55552 -207011 -241950 -460861 -143868 -149339 -96517 -88173 -103936 252113
10523e66950a71950J2796j12029A05194O7394A6152f71654a72248A42119B2147
$$ -566950 -171950 -159154 -271183 105194 172588 16152 -671654 -172248 142119 22147
10512A67963c25826A04960a84187k6047a3066A33659a10294e2690D8939L10205
$$ 167963 -325826 104960 -184187 -210234 -13066 133659 -110294 -52690 48939 359144
10502C59144r2260F0991a17781p1248A18268b00052a6628k90531C67882g2211
$$ 359144 266884 60991 -117781 -189029 118268 -200052 -16628 -307159 367882 -72211
10491b84628A47073K0289h1657R942a6323E1858j3383K17363K24482b23009c3490
$$ -284628 147073 167362 -81657 -71715 -16323 51858 38475 255838 480320 -223009 -33490
10479D36993A44528K87567J22637A00167D86L58987a45037c7306A12090J0238
$$ 436993 144528 432095 554732 100167 486 359473 -145037 -37306 112090 122328
10469A22328m3594B5189O7735f0986n8086d1256j05716I5092k838L8291g6269
$$ 122328 78734 25189 92924 -60986 -119072 -41256 -146972 95092 92254 130545 -76269
10457A77794K2192i8597r008q1750P9348C627J83957a94225B33654r7784c0771
$$ 177794 199986 -98597 -107605 -189355 -110007 3627 187584 -194225 233654 135870 -30771
10445c1164F7166c42389a20776B51929d1014B17438a67614O7155A87269O512H2840
$$ -31164 67166 -342389 -120776 251929 -41014 217438 -167614 -100459 187269 193781 82840
10433b62338a04936A30870B8940O7089J6368k9367k5287P5435b92126d296j28074
$$ -262338 -104936 130870 28940 96029 112397 83030 57743 133178 -292126 -4296 -132370
10422a32370B89377d2760D5653a74321N5846A4237J06931j5742j5679a39756A50050
$$ -132370 289377 -42760 45653 -174321 -118475 14237 121168 105426 89747 -139756 150050
10410b29408e1989B99987b34302d7177C0032a18118f252A7052K5314L4730N8903
$$ -229408 -51989 299987 -234302 -47177 30032 -118118 -6252 17052 42366 77096 135999
10399A35999Q2994f0384a5214l39884F7712k7225R4888a76372I2491a43839B16140
$$ 135999 218993 -60384 -15214 -355098 67712 40487 135375 -176372 92491 -143839 216140
10387b46181c7304A63554J377b1536k49133h1921E2082M767K83932b01525A67652
$$ -246181 -37304 163554 164931 -21536 -270669 -81921 52082 56849 340781 -201525 167652
10375I1713J32926J66394j81265O8889L8333J60857A28635M90704B69782j9551
$$ 91713 224639 391033 209768 278657 316990 477847 128635 619339 269782 250231
10365B50231J75364j49299Q6390p5254F2636J28071J1833O7343L75768A58554
$$ 250231 425595 276296 362686 287432 62636 190707 202540 269883 645651 158554
10354C1489K06748n7291b4468I8796L64416B17272J70891J21865k14840G9011
$$ 31489 238237 180946 -24468 98796 463212 217272 388163 510028 295188 79011
10343A90335J75860r9054A04390J61254A18478C7115M064J74375J00925l3890
$$ 190335 366195 267141 104390 265644 118478 37115 41179 215554 316479 282589
10333B82589C9189h8337E5452J97906q4552a9801A97820k4801b34286B53006n0927
$$ 282589 39189 -88337 55452 253358 168806 -19801 197820 173019 -234286 253006 202079
10322B02079K59987p9007b93462C47180d8557B20742a17023A38784L66693A4560
$$ 202079 462066 383059 -293462 347180 -48557 220742 -117023 138784 505477 14560
10311A86592A2499L6045g9169a492k900l26646B16903j00336N4884C5185R4418
$$ 186592 12499 48544 -79169 -1492 -4392 -331038 216903 116567 171451 35185 129603
10300A29603f1549o1041E5741b14189g284A4679J92983j9504D5801P4647d8048
$$ 129603 -61549 -122590 55741 -214189 -7284 14679 207662 188158 45801 120448 -48048
10288i9884P46K5671k33705a02757p6117R648H1013c45761J28974l1778F9769
$$ -99884 -99138 -73467 -307172 -102757 -178874 -169226 81013 -345761 -216787 -248565 69769
10276i7993C07293j15561q5135N2135d1667o8606C2299a00108G2636a5195r0213
$$ -97993 307293 191732 106597 158732 -41667 -110273 32299 -100108 72636 -15195 -105408
10265a05408A05358a18688G100a70826H0268A1033K99632p1169F473L52660A18588
$$ -105408 105358 -118688 7100 -170826 80268 11033 310665 239496 6473 359133 118588
10253A14575Q0005O7752a8799j70663R3453A93527D7770J00514L0663b56j46244
$$ 114575 194580 262332 -18799 -189462 -96009 193527 47770 148284 178947 -256 -146500
10242a46500a4608m6190A87082c2761j41730e0047k13878c5652j88620B12983
$$ -146500 -14608 -60798 187082 -32761 -174491 -50047 -263925 -35652 -224272 212983
10231d6616m77341a27764c4950J4678D187K6890O1292d036q1019k21412e1084
$$ -46616 -523957 -127764 -34950 -20272 4187 31077 92369 -4036 -85055 -306467 -51084
10219c27518G7231b76997B59453j8270d70096A45754a51018J744A41511A7596
$$ -327518 77231 -276997 259453 241183 -470096 145754 -151018 -149274 141511 17596
10208B12338b53027A02912b93256B35611a11628A07783b04971R0133G7903n485
$$ 212338 -253027 102912 -293256 235611 -111628 107783 -204971 -114838 77903 72418
10198G2418B4128e5579r6757G9810n904B6470a94917j35295D4301f3664k66706
$$ 72418 24128 -55579 -152336 79810 73906 26470 -194917 -330212 44301 -63664 -330370
10187c30370C1968c01548d9130q4379K3995M1467C09157a97036O5021C5979a83924
$$ -330370 31968 -301548 -49130 -133509 -109514 -68047 309157 -197036 -132015 35979 -183924
10175D483f596E6600h6731L9324n8332d0710L45j50181h6837A15003b56915J00612
$$ 4483 -6596 56600 -86731 -47407 -105739 -40710 -40365 -190546 -86837 115003 -256915 -156303
10163a56303b8623f520j34579K2587C2429A037O3354a14554l33115K02419a04850
$$ -156303 -28623 -6520 -141099 -118512 32429 1037 64391 -114554 -447669 -245250 -104850
10151b03389J4206b8845j24913C5164G352b25253J00042l9585c5680k8279j63982
$$ -203389 -189183 -28845 -153758 35164 7352 -225253 -125211 -164796 -35680 -63959 -227941
10140b27941D3464J86347a72246E00723B11036a71583B3282b74664I9409f8970
$$ -227941 43464 229811 -172246 500723 211036 -171583 23282 -274664 99409 -68970
10129a81190C5907A2771a75754A28120e7410G353J26120c7758B60516f3428I8404
$$ -181190 35907 12771 -175754 128120 -57410 7353 133473 -37758 260516 -63428 98404
10117i4196o2714a9974j61433L8673p9366I133i1088j95950A87508f9740K7030
$$ -94196 -156910 -19974 -181407 -142734 -222100 9133 -91088 -287038 187508 -69740 -42710
10106d2710G2711g2596B03725d93921a17335a1897j34222F5803b58119M1878g9673
$$ -42710 72711 -72596 203725 -493921 -117335 -11897 -146119 65803 -258119 -216241 -79673
10094a15936j30864B10632p3403e5420m82342i1559B38245a34724k1579b986k66677
$$ -115936 -246800 210632 137229 -55420 -537762 -91559 238245 -134724 -156303 -2986 -269663
10083b69663I3618d4794d68A70959a67615C5712a7377C4302a31148j93661i5855
$$ -269663 93618 -44794 -468 170959 -167615 35712 -17377 34302 -131148 -324809 -95855
10071D000L0743K85266a78316j56735a66297C16641A24012c6771E7025J42361
$$ 4000 34743 320009 -178316 -335051 -166297 316641 124012 -36771 57025 199386
10061A99386b02035H4305a05504H6590I885P6250b19022N5242n365A31881f5890
$$ 199386 -202035 84305 -105504 86590 9885 86135 -219022 -163780 -169145 131881 -65890
10049a76040J5220N5908b4320F6927P4940a75733g8599j56348d0418l64198F5719
$$ -176040 -160820 -104912 -24320 66927 141867 -175733 -78599 -234947 -40418 -404616 65719
10037i1032j90760C1582N0738a26866m2712B25102a97302b2838l5229n8076j40487
$$ -91032 -281792 31582 82320 -126866 -169578 225102 -197302 -22838 -58067 -116143 -256630
10026b56630C2345c42028J03595C2738J62627c18226M8831F7507a05203F1660
$$ -256630 32345 -342028 -238433 32738 195365 -318226 -269395 67507 -105203 61660
10015a47136E2954A6993b17559P1688g2857l48497E433J41485d0683A4953b38728
$$ -147136 52954 16993 -217559 -145871 -72857 -421354 5433 146918 -40683 14953 -238728
10003b77045N4577h7584C6078K12473l9622a66737d3969a3724D5066a37238p5928
$$ -277045 -222468 -87584 36078 248551 208929 -166737 -43969 -13724 45066 -137238 -213166
9992b13166A43908F7600E634c581k46299N8969M0886B41860d02480i9464c0737
$$ -213166 143908 67600 5634 -3581 -249880 -190911 -150025 241860 -402480 -99464 -30737
9980I8912a23541F8979J84005f5757K4776E2842c4858A51661d478k84295a30297
$$ 98912 -123541 68979 252984 -65757 -40981 52842 -34858 151661 -4478 -288773 -130297
9968A51055F6741d6997j49927C3217a06256k61887D1234g8453k5227o0569P5317
$$ 151055 66741 -46997 -196924 33217 -106256 -368143 41234 -78453 -103680 -164249 -88932
9957h8932B21993a47315I8952b00984n7332r5549h5138B75427f0438m415m6133
$$ -88932 221993 -147315 98952 -200984 -258316 -353865 -85138 275427 -60438 -64853 -110986
9946a10986F4987c01095j18130G3239d07681h5581m3742m8377i169o9127m424
$$ -110986 64987 -301095 -419225 73239 -407681 -85581 -129323 -177700 -9169 -78296 -82720
9935h2720j3895k63096a65735k01767G893J98622C422a70967K8645G4050h5675
$$ -82720 -96615 -359711 -165735 -367502 7893 206515 3422 -170967 -142322 74050 -85675
9923a41729O2183K129A04878M8480J66472c22491J44914k74833B2578P597L04421
$$ -141729 -79546 -77417 104878 153358 319830 -322491 -177577 -452410 22578 30175 334596
9912C34596A15577k9379e4052k316C3735c29631I5873g7041A10768c91973a00100
$$ 334596 115577 86198 -54052 -56368 33735 -329631 95873 -77041 110768 -391973 -100100
9900c4824j01722H5680e5076B10627e6056k43439B33184H2173c48290A34126N3811
$$ -34824 -136546 85680 -55076 210627 -56056 -299495 233184 82173 -348290 134126 187937
9889A87937d11991A17972a98523k9150Q6459M9750F1731b55376J7897l2263J10358
$$ 187937 -411991 117972 -198523 -227673 -141214 -91464 61731 -255376 -237479 -269742 -159384
9878a59384A3503J15367f2239k05819L8349c8682r3739C9149a64811A62219b41328
$$ -159384 13503 128870 -62239 -268058 -229709 -38682 -132421 39149 -164811 162219 -241328
9866A01027M447J1894F340a18015p3644M4726d9786C61428o7011l6653b90573
$$ 101027 105474 117368 6340 -118015 -191659 -146933 -49786 361428 294417 257764 -290573
9854D5594c27720J16909d8113A97571d568A17004C2369a18129r3328j54881K1438
$$ 45594 -327720 -210811 -48113 197571 -4568 117004 32369 -118129 -211457 -366338 -344900
9843c44900a41831k21972B93885e0649C931a57775E5179J97159o7588a58910d7598
$$ -344900 -141831 -363803 293885 -50649 3931 -157775 55179 252338 184750 -158910 -47598
9831h9025A59071d40109a46541J5608A22248a90746B47166c20096A00564b54421
$$ -89025 159071 -440109 -146541 -130933 122248 -190746 247166 -320096 100564 -254421
9820g0839k40783c420k18598M0293A02354d2353a6791j24140B29489a00295q2032
$$ -70839 -311622 -3420 -222018 -181725 102354 -42353 -16791 -140931 229489 -100295 -182327
9809a82327b4659j19290A69291b59313A64982a43859I894J75535r1874l4897R7243
$$ -182327 -24659 -143949 169291 -259313 164982 -143859 9894 185429 93555 58658 155901
9798A55901b28151j21969G3957d1450A16367b34173J06765d4197O884D9358L2948
$$ 155901 -228151 -350120 73957 -41450 116367 -234173 -127408 -44197 -37313 49358 82306
9787H2306g7870C060d7091F7748B7021b68348a5156j32582g0795j73707M0629
$$ 82306 -77870 3060 -47091 67748 27021 -268348 -15156 -147738 -70795 -244502 -203873
9776b03873A65546D3257c252A34274a96955A51121b2314p8155M3763B9380b21052
$$ -203873 165546 43257 -3252 134274 -196955 151121 -22314 -100469 -56706 29380 -221052
9764a50718A3755Q572e0785I7015K2477i9520j29069e2388j16496e9288a9264
$$ -150718 13755 22327 -50785 97015 119492 -99520 -228589 -52388 -168884 -59288 -19264
9752h3408a9750j47251m5994A27214a45614j80518i9369l87495C10696a87870
$$ -83408 -19750 -167001 -212995 127214 -145614 -326132 -99369 -486864 310696 -187870
9741d8496A66002b8062j85825J0443j89233A45538a51109j42977B8980J37949
$$ -48496 166002 -28062 -213887 -203444 -392677 145538 -151109 -294086 28980 166929
9731A66929a33022j63458c5965k07403b9517A94d20694A0904J74752G9852h0835
$$ 166929 -133022 -296480 -35965 -243368 -29517 194 -420694 10904 185656 79852 -80835
9719D3923b55369r7785O7886E0075f5800d702j06121B68098E5663a85760H7864
$$ 43923 -255369 -353154 -285268 50075 -65800 -4702 -110823 268098 55663 -185760 87864
9707G9134b07376Q9388c2080A12132c48003B32263r8206O3325n231e2676l08144
$$ 79134 -207376 -117988 -32080 112132 -348003 232263 134057 197382 192151 -52676 -360820
9696c60820c8185j80632G427R1215c8675o535B32105c57501B12799I0434i8080
$$ -360820 -38185 -218817 7427 98642 -38675 -45210 232105 -357501 212799 90434 -98080
9684c01185g8297O016l5243A15785k8129P3340b54872B32941B8335K02403c21677
$$ -301185 -78297 -72281 -107524 115785 87656 160996 -254872 232941 28335 230738 -321677
9672B07085l1147b75535A49028C8751g3939r9607H320g7182C7079K7072a83772
$$ 207085 175938 -275535 149028 38751 -73939 -173546 8320 -77182 37079 64151 -183772
9660a44519a6860A4112a38351o5008m1176A15931c00916a15823p6323P9439E7959
$$ -144519 -16860 14112 -138351 -203359 -244535 115931 -300916 -115823 -192146 -112707 57959
9648A57260b22245a00672k3520A83770c44903O0546R6836C05623a48608q2183
$$ 157260 -222245 -100672 -124192 183770 -344903 -284357 -187521 305623 -148608 -230791
9638b30791B60251C9713b7409A39049A1520h4897A91542b76078J18666j19486
$$ -230791 260251 39713 -27409 139049 11520 -84897 191542 -276078 -157412 -276898
9628b76898a19083G6504b80859H2722g1372k56310k499a60938e5754B4645b81114
$$ -276898 -119083 76504 -280859 82722 -71372 -327682 -330181 -160938 -55754 24645 -281114
9616b1944D923f7522A42365c14898k11321A99078d36636f2199D7888a42658k35295
$$ -21944 4923 -67522 142365 -314898 -526219 199078 -436636 -62199 47888 -142658 -377953
9605c77953J54853f3496A16209a68612c1596l8197p9327j11220a29765D03613
$$ -377953 -223100 -63496 116209 -168612 -31596 -69793 -149120 -260340 -129765 403613
9594i965r9871c3111m55358F5459b56808a5509A77676n1742c20506O7600k7270
$$ -9965 -109836 -33111 -488469 65459 -256808 -15509 177676 125934 -320506 -252906 -280176
9583b80176a15970B71741p6809c31891J13485k2246j40721A12567c3438j2461
$$ -280176 -115970 271741 194932 -331891 -218406 -240652 -381373 112567 -33438 -45899
9573d5899I4264c83637L8046O0322j77565a07955I8359a93588i4368B8340L05660
$$ -45899 94264 -383637 -345591 -285269 -462834 -107955 98359 -193588 -94368 28340 334000
9562C34000i7646B00246g2377H1918a73957f7741l387A18628R28c86391f7111
$$ 334000 -97646 200246 -72377 81918 -173957 -67741 -71128 118628 119556 -386391 -67111
9550a28531c5511l4890a923A30763c05962D9162n545J51538I3971J3434b69035
$$ -128531 -35511 -70401 -1923 130763 -305962 49162 43617 195155 93971 107405 -269035
9538a16901L9048k7190k2640A04650C5380e2527P173j0117K7405j33277n5771
$$ -116901 -77853 -105043 -127683 104650 35380 -52527 -45354 -55471 -28066 -161343 -217114
9527b17114G4314H633b43376A0944J47633a43492C3656b57806F0587B1969o79
$$ -217114 74314 8633 -243376 10944 158577 -143492 33656 -257806 60587 21969 21290
9516B1290F982P4744b36187j2689A71066f1212j83075h2250j43257p771E7281
$$ 21290 6982 81726 -236187 -248876 171066 -61212 -244287 -82250 -225507 -233278 57281
9504B4322g8089m7873k87224J44167B23831a09404J6822J1523J6213k17143e8944
$$ 24322 -78089 -125962 -413186 -269019 223831 -109404 -92582 -81059 -64846 -281989 -58944
9492b64263a04122j70897D6620d7662A54820i7998k18524a02540L2477k41882
$$ -264263 -104122 -275019 46620 -47662 154820 -97998 -316522 -102540 -70063 -311945
9482c11945i838m59027a96189Q8392j57112E5888b27036K9597A17311J08833b45809
$$ -311945 -9838 -468865 -196189 -107797 -264909 55888 -227036 -197439 117311 226144 -245809
9470B21521h4742k87379A7164d5600e56E1021a54592a3025j53274q6067J4177
$$ 221521 -84742 -372121 17164 -45600 -556 51021 -154592 -13025 -166299 -252366 -238189
9459b38189A0664J57886a96821N2204p5796N8383J090j18580i6075L6883A29094
$$ -238189 10664 168550 -196821 -144617 -220413 -162030 -160940 -279520 -96075 -59192 129094
9447a30022l8910b6783j47309A20833a89350p7246I3024f5865B01266b96719A32453
$$ -130022 -168932 -26783 -174092 120833 -189350 -266596 93024 -65865 201266 -296719 132453
9435c73231J26818B4778J14138C2806h3278k30613J36319j0895L4108j35412J32964
$$ -373231 -246413 24778 138916 32806 -83278 -313891 -177572 -188467 -154359 -289771 -156807
9424a56807A52925o1481b22105M2712c1786j14517c2301j87351F676b08311e5977
$$ -156807 152925 91444 -222105 -179393 -31786 -146303 -32301 -219652 6676 -208311 -55977
9412a91010j33895B3269a68669L7370b8266k1803d886I8798c32576A3643J60205
$$ -191010 -324905 23269 -168669 -131299 -28266 -50069 -4886 98798 -332576 13643 173848
9401A73848b9039k07407N9728C69562I2710a36085m02163a97541p0130B2966K5652
$$ 173848 -29039 -236446 -176718 369562 92710 -136085 -538248 -197541 -267671 22966 48618
9390D8618O6809b35328q7043D55760b23909Q6402O5500k26616f0953K7792p1678
$$ 48618 115427 -235328 -322371 455760 -223909 -137507 -72007 -298623 -60953 -33161 -104839
9379a04839b0365g357H991l09J46505a46937K8438M5355A52592J68901b0757A1208
$$ -104839 -20365 -7357 8991 8682 155187 -146937 -118499 -73144 152592 321493 -20757 11208
9366g6444k50725g7306R799F4692a8807o5642a1802A59014b18739A1041M4322
$$ -76444 -327169 -77306 -67507 64692 -18807 -84449 -11802 159014 -218739 11041 55363
9355E5363K258C434O2801B5378J26288b06078d6085B7168g3363m6866l6218A66318
$$ 55363 57621 3434 66235 25378 151666 -206078 -46085 27168 -73363 -120229 -156447 166318
9342b75518E7248a24481B95966A1956R6765c73256A65766f2100n8091J4862k5922
$$ -275518 57248 -124481 295966 11956 108721 -373256 165766 -62100 -120191 -105329 -131251
9331a31251J8688I5435O5795a00975a6765m3468q6540j20655G0782a7965C4581
$$ -131251 -112563 95435 161230 -100975 -16765 -60233 -146773 -267428 70782 -17965 34581
9319a35318l2594j62162J59399j56222F4899A5503b33768e01A07619a15049A08588
$$ -135318 -167912 -330074 -170675 -326897 64899 15503 -233768 -501 107619 -115049 108588
9307b6844j97281d8112j52107g7216A80229a38103J3510r8502B3801h9045j27673
$$ -26844 -224125 -48112 -200219 -77216 180229 -138103 -124593 -223095 23801 -89045 -216718
9296b16718H2577A2951P326a24862j25734N2374E417R6891D910a96250m1850p7432
$$ -216718 82577 12951 20277 -124862 -250596 -198222 5417 102308 4910 -196250 -238100 -315532
9284c15532B16058a21463C4446a07185A25532K7916e6004A67500a00544n3990
$$ -315532 216058 -121463 34446 -107185 125532 153448 -56004 167500 -100544 -154534
9274a54534B53661e8676l92598c5074H9372b87972E0936a78079f1753j1370I1784
$$ -154534 253661 -58676 -451274 -35074 89372 -287972 50936 -178079 -61753 -73123 91784
9262a11823A44115b42686d7929j78178F2960i9961C0855J24373G5747J7844a04091
$$ -111823 144115 -242686 -47929 -226107 62960 -99961 30855 155228 75747 93591 -104091
9250a89443A8632a63891K600c6095p2152B2215f6892K1l5267l9336F4082o262
$$ -189443 18632 -163891 -161291 -36095 -108247 22215 -66892 -66871 -102138 -141474 64082 57820
9238E7820E361j415g622k38820A80896a02260i164j54339G747a0360B52122e09468
$$ 57820 5361 3946 -7622 -246442 180896 -102260 -9164 -163503 7747 -10360 252122 -509468
9225G2221a79775A63497b6669m9719A64449B5408c064l38269D2099A6564a43184
$$ 72221 -179775 163497 -26669 -76388 164449 25408 -3064 -341333 42099 16564 -143184
9213b4847j24763E3552a03461k51489J265C0852f4002B34617j08890n9065i4955
$$ -24847 -149610 53552 -103461 -354950 -353685 30852 -64002 234617 125727 66662 -94955
9201c48890D8411a35444e5321m2765A9474c7732o2548L723A35778h8088A25959
$$ -348890 48411 -135444 -55321 -98086 19474 -37732 -100280 -96557 135778 -88088 125959
9189a16872F0170Q2429k5287b2144j67475j26772B21722C5145c61298J76040a1087
$$ -116872 60170 142599 117312 -22144 -189619 -316391 221722 35145 -361298 -185258 -11087
9177C23357a42983q0021A74240c9654G7916c48282i218F6990h8896A3437a74129
$$ 323357 -142983 -223004 174240 -39654 77916 -348282 -9218 66990 -88896 13437 -174129
9165b5868j8984q1155d1790J6030C36696a6103j59846Q1320K6227K1218j39650
$$ -25868 -44852 -126007 -41790 -25760 336696 -16103 -175949 -94629 -68402 -47184 -186834
9154a86834C147K86613A07749b41800k1288d2436A63208a11572j11494a06455
$$ -186834 3147 289760 107749 -241800 -263088 -42436 163208 -111572 -223066 -106455
9143A97790p7914f0393R758m7813B1601c68692c958j80709q7000G4749b3254k65871
$$ 197790 119876 -60393 -50635 -98448 21601 -368692 -3958 -184667 -271667 74749 -23254 -289125
9131b89125h4921E4457h0849G7831a5249k46271j07525E8697a58791j31111a15701
$$ -289125 -84921 54457 -80849 77831 -15249 -261520 -369045 58697 -158791 -289902 -115701
9119g7352c7039B31492b68740a20419j60579c8648C16686A00616i2661j58514
$$ -77352 -37039 231492 -268740 -120419 -280998 -38648 316686 100616 -92661 -251175
9109b51175c7872k16837l00683K56456B41875b7791A28046A1618b05544j79230
$$ -251175 -37872 -254709 -555392 -298936 241875 -27791 128046 11618 -205544 -384774
9099c84774a6145j49761C97353G4424C4461b0703D1725a48746e4307n1943d4382
$$ -384774 -16145 -165906 397353 74424 34461 -20703 41725 -148746 -54307 -106250 -44382
9087b24168A29567a02970d7950A6088b20874k3204g0494q3096A10026c56728g155
$$ -224168 129567 -102970 -47950 16088 -220874 -244078 -70494 -153590 110026 -356728 -7155
9075I3431a08846k65781B9931c72914C750J28428e273k4182j55496r7167A04961
$$ 93431 -108846 -374627 29931 -372914 3750 132178 -5273 -29455 -184951 -282118 104961
9063b8532k19479o3806b5567C19989j56199b32032E2861J00382b25516A23658
$$ -28532 -248011 -311817 -25567 319989 163790 -232032 52861 153243 -225516 123658
9052a19854O678j23780E4249j25a18772J2956e794D2727c14176J31625H9690b46997
$$ -119854 -113176 -236956 54249 54124 -118772 -105816 -5794 42727 -314176 -182551 89690 -246997
9039B34877h1814k93554A81969j5451i6110d864j98380D9486a36862k145j82419
$$ 234877 -81814 -375368 181969 166518 -96110 -4864 -203244 49486 -136862 -139007 -321426
9028c21426B66981I2798a63725j21623m7998M5900Q8302i4592B06064N4505b23928
$$ -321426 266981 92798 -163725 -285348 -333346 -287446 -199144 -94592 206064 260569 -223928
9016C06783b07207F7741a02146m3621r1164g3493I8039a06282j36923L317e4476
$$ 306783 -207207 67741 -102146 -145767 -236931 -73493 98039 -106282 -243205 -239888 -54476
9004b30076C6477c05609J21150J4285n2010B9517c4841q7750E8039a31425r1179
$$ -230076 36477 -305609 -184459 -170174 -222184 29517 -34841 -122591 58039 -131425 -222604
8993b22604n5091a06409q6151B54867c74305e5769b6820k21505a02708l1920A72461
$$ -222604 -277695 -106409 -192560 254867 -374305 -55769 -26820 -248325 -102708 -134628 172461
8981a89200Q003d1507H4376J45753h128B01394c47114C44455b37623M6947N1512
$$ -189200 -181197 -41507 84376 230129 -8128 201394 -347114 344455 -237623 -190676 -139164
8970a39164k94144A54523B655P1546L2297L1052a01103c4433D2390c17069J05213
$$ -139164 -433308 154523 2655 74201 106498 137550 -101103 -34433 42390 -317069 -211856
8959b11856k91240I710e9997j65942F1177a68473n490B6094c30630a18604c6785
$$ -211856 -503096 9710 -59997 -225939 61177 -168473 -173963 26094 -330630 -118604 -36785
8947C0253b23086G792N6212a46154c0867i028j24242a1333H0898g5623p7693m3215
$$ 30253 -223086 7792 64004 -146154 -30867 -9028 -133270 -11333 80898 -75623 -153316 -196531
8935a96531l598B00886A1188L21282c3600a1235B43277b5032l34859A407P2004
$$ -196531 -200129 200886 11188 332470 -33600 -11235 243277 -25032 -359891 1407 73411
8924G3411l6016d3464B03929L71830a39661A4611b08513c0760h599B81965A10043
$$ 73411 37395 -43464 203929 575759 -139661 14611 -208513 -30760 -8599 281965 110043
8912a72310C6910c15464a32189j6316H6595k4490d65802a04649r4694B42953c33792
$$ -172310 36910 -315464 -132189 -148505 86595 62105 -465802 -104649 -199343 242953 -333792
8900C3335c39871L3626J10314f3060k3807B20228f0474E9569d83335f2953a2873
$$ 33335 -339871 -306245 -195931 -63060 -86867 220228 -60474 59569 -483335 -62953 -12873
8888b98941M4191k2053n933a9428k469A5833d3699m3156B1091a19798A1861M7070
$$ -298941 -254750 -276803 -282736 -19428 -21897 15833 -43699 -86855 21091 -119798 11861 58931
8876E8931g9399A29756g918j08103k09594E9615K13125j02768i3726G1065J52886
$$ 58931 -79399 129756 -7918 -116021 -325615 59615 272740 169972 -93726 71065 223951
8865B23951c1718E3497J26351g2968j06792P9640a1980A96288b57837G3103l1292
$$ 223951 -31718 53497 179848 -72968 -179760 -100120 -11980 196288 -257837 73103 41811
$$ [...]
##END NTUPLES=NMR SPECTRUM
##END=
