##TITLE=AC1749_SEN00022_9280973_mEKdDWcYx0
##JCAMPDX= 6.0         $$ Bruker NMR JCAMP-DX V2.0
##DATA TYPE= NMR SPECTRUM
##DATA CLASS= NTUPLES
##ORIGIN= BRUKER
##OWNER= Administrator
$$ 1.72 TOPSPIN		Version 2.1
$$ 2015-07-18 00:44:32.979 -0700  Administrator@X
$$ Compression mode = diff/dup
##.OBSERVE FREQUENCY= 400.02188249412
##.OBSERVE NUCLEUS= ^1H
##.ACQUISITION MODE= SIMULTANEOUS (DQD)
##.ACQUISITION SCHEME= undefined
##.AVERAGES= 64
##.DIGITISER RES= 22
##SPECTROMETER/DATA SYSTEM= spect
##.PULSE SEQUENCE= noesygpps1d.comp
##.SOLVENT NAME= COFFEE_meoh
##.SHIFT REFERENCE= INTERNAL, COFFEE_meoh, 1, 14.9613
##AUDIT TRAIL= $$ (NUMBER, WHEN, WHO, WHERE, PROCESS, VERSION, WHAT)
$$ ##TITLE= Audit trail, TOPSPIN		Version 2.1
$$ ##JCAMPDX= 5.01
$$ ##ORIGIN= Bruker BioSpin GmbH
$$ ##OWNER= Administrator
$$ $$ E:\/data/COFFEE/nmr/AC1749_SEN00022_9280973_mEKdDWcYx0/12/pdata/1/auditp.txt
$$ ##AUDIT TRAIL=  $$ (NUMBER, WHEN, WHO, WHERE, PROCESS, VERSION, WHAT)
(   1,<2015-07-18 00:44:27.729 -0700>,<Administrator>,<X>,<go>,<TOPSPIN 2.1>,
      <created by zg
	started at 2015-07-18 00:32:57.354 -0700,
	POWCHK enabled, PULCHK disabled,
       configuration hash MD5:
       21 0F 79 D6 B3 7B B4 F6 88 20 88 DB 03 48 BD 9F
       data hash MD5: 64K
       71 E3 41 BB 38 8D 09 F0 BA D6 02 24 90 2A 84 BC>)
(   2,<2015-07-18 00:44:31.119 -0700>,<Administrator>,<X>,<proc1d>,<TOPSPIN 2.1>,
      <Start of raw data processing
       efp LB = 0.3 FT_mod = 6 PKNL = 1 PHC0 = 0 PHC1 = 0 SI = 128K 
       data hash MD5: 128K
       32 A1 AD A6 5A 96 E8 32 1D 83 05 FC B6 50 F2 2D>)
(   3,<2015-07-18 00:44:32.057 -0700>,<Administrator>,<X>,<proc1d>,<TOPSPIN 2.1>,
      <pk PHC0 = 268.808 PHC1 = 0 
       data hash MD5: 128K
       57 9B 1F 0B F2 8C 48 DF 22 65 D9 15 92 A6 FB 1A>)
(   4,<2015-07-18 00:44:32.447 -0700>,<Administrator>,<X>,<proc1d>,<TOPSPIN 2.1>,
      <abs ABSG = 1 
       data hash MD5: 128K
       87 B1 3F DA C3 9A 84 10 97 C5 2D 38 F4 58 E1 32>)
(   5,<2015-07-18 00:44:32.557 -0700>,<Administrator>,<X>,<proc1d>,<TOPSPIN 2.1>,
      <abs ABSG = 2 
       data hash MD5: 128K
       82 D7 20 13 AB 54 AA 40 2F EF 92 BB 66 C2 CA F7>)
(   6,<2015-07-18 00:44:32.635 -0700>,<Administrator>,<X>,<proc1d>,<TOPSPIN 2.1>,
      <abs ABSG = 3 
       data hash MD5: 128K
       3C 3F EF 72 CB 2E 8F DA 38 8A 4B A2 E3 16 72 DE>)
(   7,<2015-07-18 00:44:32.713 -0700>,<Administrator>,<X>,<proc1d>,<TOPSPIN 2.1>,
      <abs ABSG = 4 
       data hash MD5: 128K
       F1 37 93 D0 85 FC 2A 73 8C EC 14 38 C3 A2 8B 79>)
(   8,<2015-07-18 00:44:32.807 -0700>,<Administrator>,<X>,<proc1d>,<TOPSPIN 2.1>,
      <abs ABSG = 5 
       data hash MD5: 128K
       5D 94 06 4B 73 30 82 D7 97 9D 9C CD 83 4A 1D 37>)
$$ ##END=
$$ 
$$ $$ hash MD5
$$ $$ 08 08 27 97 0E CD 8C 9E BD 51 08 4D 37 25 E0 83
##$RELAX= 
##$RELAX= 
##$RELAX= 
##$RELAX= 
##$RELAX= 
##$RELAX= 
##$RELAX= 
##$RELAX= 
$$ Bruker specific parameters
$$ --------------------------
##$DU= <E:\>
##$EXPNO= 12
$$ [...]
150 150 150 150 150 150 150 150
##$TP07= 0
##$TPNAME0= <>
##$TPNAME1= <>
##$TPNAME2= <>
##$TPNAME3= <>
##$TPNAME4= <>
##$TPNAME5= <>
##$TPNAME6= <>
##$TPNAME7= <>
##$TPOAL= (0..7)
0.5 0.5 0.5 0.5 0.5 0.5 0.5 0.5
##$TPOFFS= (0..7)
0 0 0 0 0 0 0 0
##$TUNHIN= 0
##$TUNHOUT= 0
##$TUNXOUT= 0
##$USERA1= <user>
##$USERA2= <user>
##$USERA3= <user>
##$USERA4= <user>
##$USERA5= <user>
##$V9= 5
##$VALIST= <valist>
##$VCLIST= <CCCCCCCCCCCCCCC>
##$VD= 0
##$VDLIST= <DDDDDDDDDDDDDDD>
##$VPLIST= <PPPPPPPPPPPPPPP>
##$VTLIST= <TTTTTTTTTTTTTTT>
##$WBST= 2048
##$WBSW= 25
##$XGAIN= (0..3)
0 0 0 0
##$XL= 0
##$YL= 0
##$YMAX_a= 6185219
##$YMIN_a= -11497344
##$ZGOPTNS= <>
##$ZL1= 120
##$ZL2= 120
##$ZL3= 120
##$ZL4= 120
##$ABSF1= 14.9613
##$ABSF2= -5.596882
##$ABSG= 5
##$ABSL= 3
##$ALPHA= 0
##$AQORDER= 0
##$ASSFAC= 0
##$ASSFACI= 0
##$ASSFACX= 0
##$ASSWID= 0
##$AUNMP= <proc_prof1d_extract.lims>
##$AXLEFT= 0
##$AXNAME= <>
##$AXNUC= <1H>
##$AXRIGHT= 0
##$AXTYPE= 0
##$AXUNIT= <>
##$AZFE= 0.1
##$AZFW= 0.1
##$BCFW= 0
##$BC_mod= 0
##$BYTORDP= 0
##$COROFFS= 0
##$CY= 15
##$DATMOD= 1
##$DC= 0
##$DFILT= <>
##$DTYPP= 0
##$F1P= 0
##$F2P= 0
##$FCOR= 0.5
##$FTSIZE= 131072
##$FT_mod= 6
##$GAMMA= 0
##$GB= 0
##$INTBC= 1
##$INTSCL= 1
##$ISEN= 128
##$LB= 0.3
##$LEV0= 0
##$LPBIN= 0
##$MAXI= 10000
##$MC2= 0
##$MEAN= 0
##$ME_mod= 0
##$MI= 0
##$NCOEF= 0
##$NC_proc= -2
##$NLEV= 6
##$NOISF1= 0
##$NOISF2= 0
##$NSP= 0
##$NTH_PI= 0
##$NZP= 0
##$OFFSET= 14.9613
##$PC= 1
##$PHC0= 268.808
##$PHC1= 0
##$PH_mod= 1
##$PKNL= yes
##$PPARMOD= 0
##$PPDIAG= 0
##$PPIPTYP= 0
##$PPMPNUM= 2147483647
##$PPRESOL= 1
##$PSCAL= 4
##$PSIGN= 0
##$PYNMP= <proc.py>
##$REVERSE= no
##$SF= 400.020009517623
##$SI= 131072
##$SIGF1= 0
##$SIGF2= 0
##$SINO= 400
##$SIOLD= 131072
##$SPECTYP= <>
##$SREGLST= <1H.CDCl3>
##$SSB= 0
##$STSI= 131072
##$STSR= 0
##$SW_p= 8223.68421052631
##$SYMM= 0
##$S_DEV= 0
##$TDeff= 65536
##$TDoff= 0
##$TI= <>
##$TILT= no
##$TM1= 0
##$TM2= 0
##$TOPLEV= 0
##$USERP1= <user>
##$USERP2= <user>
##$USERP3= <user>
##$USERP4= <user>
##$USERP5= <user>
##$WDW= 1
##$XDIM= 131072
##$YMAX_p= 436529046
##$YMIN_p= -10696
##$CURPLOT= <Network HP LaserJet P1505>
##$CURPRIN= <$Network HP LaserJet P1505>
##$DFORMAT= <normdp>
##$LAYOUT= <+/1D_H.xwp>
##$LFORMAT= <normlp>
##$PFORMAT= <normpl>
##$SURQMSG= 1
$$ End of Bruker specific parameters
$$ ---------------------------------
##NTUPLES= NMR SPECTRUM
##VAR_NAME=  FREQUENCY,     SPECTRUM/REAL,   SPECTRUM/IMAG
##SYMBOL=    X,             R,               I
##VAR_TYPE=  INDEPENDENT,   DEPENDENT,       DEPENDENT
##VAR_FORM=  AFFN,          ASDF,            ASDF
##VAR_DIM=   131072,        131072,          131072
##UNITS=     HZ,            ARBITRARY UNITS, ARBITRARY UNITS
##FACTOR=    0.0627417313425164, 1,          1
##FIRST=     8223.62146879497, -365,         -55337
##LAST=      0,             1745,            -55468
##MIN=       0,             -10696,          0
##MAX=       8223.62146879497, 436529046,    0
$$ Real data points
##PAGE= N=1
##DATA TABLE= (X++(R..R)), XYDATA
$$ [...]
61615D29140n31o39m65l19l00n52j183k033k945m132n684p010p473p341p225o910
61599C74398n769m223l495l817m128l859l697m067m134l090j542o74p52j254j817
61584C28080k338k639k672k701k752k396j511p51p37j231j644j853k004j992j652
61569B99207j156p75n51m34l76j81K70N28L2q97j315j024p91q80n16P12J925K227
61551B96005J902J607J264O18J17K23M99L72J93N26R81Q10L24N38J639K777L314
61534C13709L399L333L166K957K751K314J366P3j142k079k657k686k238j921k141
61519C18204k459k229j636j403j735k185k355k100j258J32J420J836J366O59J64
61504C06421j18j85L9L37L18p7n04o99o65m77j53L03R04J517J640Q30m15q36J03
$$ plain form
61615 429140 428609 427970 427505 427186 426886 426334 425151 423118 420173 416041 410357 403347 395874 388533 381308 374398
61599 374398 368629 364406 360911 357094 352966 349107 345410 341343 337209 334119 332577 331903 331151 329897 328080
61584 328080 325742 323103 320431 317730 314978 312582 311071 310320 309583 308352 306708 304855 302851 300859 299207
61569 299207 298051 297276 296725 296291 295915 295734 296004 296532 296564 295667 294352 293328 292537 291657 291141 291853 293778 296005
61551 296005 297907 299514 300778 301396 301513 301736 302235 302607 302800 303326 304307 305117 305441 305979 307618 310395 313709
61534 313709 317108 320441 323607 326564 329315 331629 332995 333068 331926 329847 327190 324504 322266 320345 318204
61519 318204 315745 313516 311880 310477 308742 306557 304202 302102 300844 300976 302396 304232 305598 306257 306421
61504 306421 306303 306118 306157 306494 306812 306735 306231 305532 304867 304390 304237 304540 305444 306961 308601 309431 309016 308180 308283
61485C08283J356J622R86O02R61J393J203N94K55N18J079J372J112O13M68Q42
61469C23259J327J584J697J767J604J094M41j97q64j300r84j8O51M22j55l44l25
61452C29659n94r09o68j8L14J16j75k54j37K67J054J852K119J936J940K443L048
61435C41993L261L071K919L227L894M234L691K691K203K382K312J491O94P81J381
61420C80225J593J397J430J797K022J965J882J682R72j31q97q31j86L00m0j318
61404C91862k803l492l222k764k601k282j521j014j336j788j398n39l51r00j132
61389C64719n53J59L04nl52n34m59j00K99N08P34J243J761J834J596J509J555
61372C74218J377J088J137J504J714J657J670J870K020K075K233K477K623K766
$$ plain form
61485 308283 309639 311261 312247 312849 313810 315203 316406 317000 317255 317773 318852 320224 321336 321949 322417 323259
61469 323259 324586 326170 327867 329634 331238 332332 332773 332576 331712 330412 329428 329410 330061 330483 330328 329984 329659
61452 329659 329065 328156 327488 327470 327784 327900 327725 327471 327334 327601 328655 330507 332626 334562 336502 338945 341993
61435 341993 345254 348325 351244 354471 358365 362599 366290 368981 371184 373566 375878 377369 378063 378844 380225
61420 380225 381818 383215 384645 386442 388464 390429 392311 393993 394965 394834 393937 393106 392920 393220 393180 391862
61404 391862 389059 385567 382345 379581 376980 374698 373177 372163 370827 369039 367641 367102 366751 365851 364719
61389 364719 364166 364325 364629 364624 364272 363738 363279 363179 363478 363986 364720 365963 367724 369558 371154 372663 374218
61372 374218 375595 376683 377820 379324 381038 382695 384365 386235 388255 390330 392563 395040 397663 400429
61358D00429L155L679M073M501N384O691P941Q824R315R317Q680P554O354N425
61344D91322N017N192N494N156M110L225L117L315L079K380J454J07j655l061
61330E28252l575l809m402m730l880k376j563j710k017k088k072j626k62J442
61316D95584K353K537L088M244N041M977M722M894N408O235P650R393J0691J1349
61302E78166J1734J1618J0192P515M695K366J11k228l912m485m547m828n372o035
61288E94990o900p762q050p641p062o656o287n897n525m743l187j579j029j245
61274E21427q10N64J627J778K041L119M085M010L545L739M429M986N642O848Q101
61259E75131Q666Q971R972J1473J2154J1153Q877O351M367L115K143Q34q13k187
$$ plain form
61358 400429 403584 407263 411336 415837 421221 427912 435853 444677 453992 463309 471989 479543 485897 491322
61344 491322 496339 501531 507025 512181 516291 519516 522633 525948 529027 531407 532861 532968 531313 528252
61330 528252 524677 520868 516466 511736 507856 505480 503917 502207 500190 498102 496030 494404 494142 495584
61316 495584 497937 500474 503562 507806 512847 517824 522546 527440 532848 539083 546733 556126 566817 578166
61302 578166 589900 601518 611710 619225 623920 626286 626397 624169 620257 615772 611225 606397 601025 594990
61288 594990 588090 580328 572278 564637 557575 550919 544632 538735 533210 528467 525280 523701 522672 521427
61274 521427 520617 521181 522808 524586 526627 529746 533831 537841 541386 545125 549554 554540 560182 567030 575131
61259 575131 583797 592768 602740 614213 626367 637520 646397 652748 657115 660230 662373 663207 662394 660207
61245F60207l031l745m473m660m020l184k853k943l153l646m477m988m606l706
61231F06722k960k300j294j44N46P46R97J537K066K292K208K004K067K842M304
61216F21633N750O535O772O932P041O702N725M362K980J822J081R83J693L093
61202F83104M554N297N360N906P980J1056J3620J5044J6078J7395J8571J8844
61190H22809J8019J6260J3630J0375P097M346K398J478J540J706P85j370l729
61177H95344n567p202q999j0598j1613j2284j2871j3154j3095j3202j3686j3980
61165G59093j3759j3714j4518j5667j6093j5516j4389j2956j1128r124p450o271
61153F08508n208l777j815L78K193L260L823M251M170K685l67l959o797q205q088
$$ plain form
61245 660207 657176 653431 648958 644298 640278 637094 634241 631298 628145 624499 620022 615034 610428 606722
61231 606722 603762 601462 600168 600024 600570 601316 602313 603850 605916 608208 610416 612420 614487 617329 621633
61216 621633 627383 633918 640690 647622 654663 661365 667090 671452 674432 676254 677335 678318 680011 683104
61202 683104 687658 692955 698315 704221 712201 723257 736877 751921 767999 785394 803965 822809
61190 822809 840828 857088 870718 881093 888190 892536 894934 896412 897952 899658 900443 899073 895344
61177 895344 889777 882575 873576 862978 851365 839081 826210 813056 799961 786759 773073 759093
61165 759093 745334 731620 717102 701435 685342 669826 655437 642481 631353 622229 614779 608508
61153 608508 603300 599523 597708 598086 600279 603539 607362 611613 615783 618468 618101 614142 607345 599140 591052
61138E91052o732m871l294k117r43L13J395K438L838N390O493P335Q772J0916
61124F19985J2909J4338J5670J7051J7964J8493J9621K1681K3737K5118K6206
61113H32773K7058K6731K4958K3115K2340K1849K0424J8352J6494J4482J1410
61102A059986P634M178Q71l267q038j2003j4488j6364j8578k1016k3022k4220
61090I31673k4619k4549k4573k4977k5294k4763k3239k1283j9515j8160j7042
61079F83659j5769j4128j2463j1300j0544r527p976o293m723l066j357r8N43R33
61065E87891J246J375J742L027M845N914N961O142P146Q260Q978R960J1519J2669
61051F76675J2849J3160J4677J6777J8403J9765K1445K2964K3686K4139K5027
$$ plain form
61138 591052 584320 579449 576155 574038 573095 573408 574803 577241 581079 586469 592962 600297 609069 619985
61124 619985 632894 647232 662902 679953 697917 716410 736031 757712 781449 806567 832773
61113 832773 859831 886562 911520 934635 956975 978824 999248 1017600 1034094 1048576 1059986
61102 1059986 1067620 1071798 1072669 1069402 1061364 1049361 1034873 1018509 999931 978915 955893 931673
61090 931673 907054 882505 857932 832955 807661 782898 759659 738376 718861 700701 683659
61079 683659 667890 653762 641299 629999 619455 609928 601952 595659 590936 587870 586513 586415 586958 587891
61065 587891 589137 590512 592254 595281 600126 606040 612001 618143 625289 633549 642527 652487 664006 676675
61051 676675 689524 702684 717361 734138 752541 772306 793751 816715 840401 864540 889567
61040H89567K5895K6140K6392K7379K8396K8435K7963K8081K8657K8887K8936
61029A194728K9556L0798L2450L4946L8341M1307M2683M3133M3846M4686M5327
61018A621801M7046N1369N7915O5523P4539Q5865R8675J11342J23861J37463J53158
61007B628557J73035K01266K40692K89712L45819M10722M88302N79950O87684
60998F045739Q20245R89023J198815J450403J746278K067335K325897K363431
60990A9007166K044221J384539N84190r0988m69983n33945l51968j1395L71784
60981B1933621O19380N42945P4477o57029j398602j933266k182854k190557k043500
60972A2764615j818699j570604j332816j119463r31995p69766o33551n21733m29410
$$ plain form
61040 889567 915462 941602 967994 995373 1023769 1052204 1080167 1108248 1136905 1165792 1194728
61029 1194728 1224284 1255082 1287532 1322478 1360819 1402126 1444809 1487942 1531788 1576474 1621801
61018 1621801 1668847 1720216 1778131 1843654 1918193 2004058 2102733 2214075 2337936 2475399 2628557
61007 2628557 2801592 3002858 3243550 3533262 3879081 4289803 4778105 5358055 6045739
60998 6045739 6865984 7855007 9053822 10504225 12250503 14317838 16643735 19007166
60990 19007166 21051387 22435926 23020116 22929128 22459145 21925200 21573232 21561837 21933621
60981 21933621 22553001 23095946 23170423 22513394 21114792 19181526 16998672 14808115 12764615
60972 12764615 10945916 9375312 8042496 6923033 5991038 5221272 4587721 4065988 3636578
60963C636578l52712k90826k43002k06409j77766j54889j36035j19587j05059
60954A850293r2951q3070p4052o4805n5418m6574l9020l3590l0783l0091l0371
60943A269568l0756l0730k9831k8083k6270k4944k3591k1568j9348j7773j6589
60932A000085j4835j2469j0386q903p283m880j865J264M097O234P548Q664J0558
60919I77829J3478J6717J9440K1310K2342K2736K2922K3355K4086K4737K4853
60908A213805K4058K2074J8866J4787J0345N883J598k455o420j0473j4494j8185
60896A259389k1522k4697k7597k9747l0894l1127l0456k8898k7047k5780k5142
60885I56482k4257k2667k1016j9981j9307j8441j7481j6856j6561j6248j5753
$$ plain form
60963 3636578 3283866 2993040 2750038 2543629 2365863 2210974 2074939 1955352 1850293
60954 1850293 1757342 1674272 1600220 1535415 1479997 1433423 1394403 1360813 1330030 1299939 1269568
60943 1269568 1238812 1208082 1178251 1150168 1123898 1098954 1075363 1053795 1034447 1016674 1000085
60932 1000085 985250 972781 962395 953492 946209 941329 939464 940728 944825 951059 958607 967271 977829
60919 977829 991307 1008024 1027464 1048774 1071116 1093852 1116774 1140129 1164215 1188952 1213805
60908 1213805 1237863 1259937 1278803 1293590 1303935 1309818 1311416 1308961 1302541 1292068 1277574 1259389
60896 1259389 1237867 1213170 1185573 1155826 1124932 1093805 1063349 1034451 1007404 981624 956482
60885 956482 932225 909558 888542 868561 849254 830813 813332 796476 779915 763667 747914
60874G47914j5061j4170j3285j2727j2389j1784j0888j0253j0022r538q460p441
60862F11896p125p172o962o600o487o401n914n326n340n934o349o084n388m753
60848E26061m383m134l704k921k016j521j768k708m161n836p210p887q090q215
60834D61507p956o695m782l411l029k783k009j186q63n91L43J804L139L963M088
60819D41539L372K285J838K309K747K386J739J536J476R67L70L52O43M94m3l60
60803D63650n04j003j706j860j296o34l81n22r64j652k336k822l325m026m532
60788D36087m413l945l666l519l193l026l636m790n504n298m646m159l960l908
60774C78424l815l403k573j741j413j503j486j107m05O95K160L361L553K914K449
$$ plain form
60874 747914 732853 718683 705398 692671 680282 668498 657610 647357 637335 627797 619337 611896
60862 611896 604771 597599 590637 584037 577550 571149 565235 559909 554569 548635 542286 536202 530814 526061
60848 526061 521678 517544 513840 510919 508903 507382 505614 502906 498745 492909 485699 477812 469722 461507
60834 461507 453551 446856 442074 438663 435634 432851 430842 429656 428793 428202 428545 430349 433488 437451 441539
60819 441539 444911 447196 449034 451343 454090 456476 458215 459751 461227 462194 462564 462916 463559 464053 464010 463650
60803 463650 463146 462143 460437 458577 457281 456647 456266 455744 454780 453128 450792 447970 444645 440619 436087
60788 436087 431674 427729 424063 420544 417351 414325 410689 405899 400395 395097 390451 386292 382332 378424
60774 378424 374609 371206 368633 366892 365479 363976 362490 361383 360978 361673 363833 367194 370747 373661 376110
60759C76110K724L272L417L228L306L902M558M592L888L138L167L963M719M846
60745D28830M580M367M087L273J738l00k498m407n619o152o470o832o976o745
60731D00876o507o565o588o121n312m634m224l949l831l926l990l729l164k453
60717C35883j666r92p96j049j158p60l09l83q32j135j214j355j575j598j302p87
60701C18972k06K33L20K03K83O45J036J471K241L058L108K325J721J934K277K061
60685C41682J868K631M111N321N880O002N662M825M139M329N143N800O166O588
60671D10147O833O274M991L753K925K137J013m64k168l711m399m006l296l125
60657D16904l315l226k970l049l172k578j429p41q72j075o79J07P26P51j50j955
$$ plain form
60759 376110 378834 382106 385523 388751 392057 395959 400517 405109 408997 412135 415302 419265 423984 428830
60745 428830 433410 437777 441864 445137 446875 446575 444077 439670 434051 427899 421429 414597 407621 400876
60731 400876 394369 387804 381216 375095 369783 365149 360925 356976 353145 349219 345229 341500 338336 335883
60717 335883 334217 333225 332429 331380 330222 329462 329153 328770 327938 326803 325589 324234 322659 321061 319759 318972
60701 318972 318766 318999 319319 319522 319805 320450 321486 322957 325198 328256 331364 333689 335410 337344 339621 341682
60685 341682 343550 346181 350292 355613 361493 367495 373157 377982 382121 386450 391593 397393 403559 410147
60671 410147 416980 423254 428245 431998 434923 437060 438073 437609 435441 431730 427331 423325 420029 416904
60657 416904 413589 410363 407393 404344 401172 398594 397165 396424 395552 394477 393798 393905 394631 395382 395232 393277
60641C93277l838m770m623m096l637l211l029l501m325m551l783k594j586p85
60627C44948j02L43O46J148J828K243K208K001J686J004O8n33n96o36j004j260
60611C53992q74p8M13K76j32k63P1N12N23K9m03j90N84J345J684J613J365J272
60593C61739J611K253K738K907L089L318K970J744M69J80P28J108Q38K48l13p17
60577C84910p07r8P09J172J425J977K808L507M135N100O310P287Q106R275J0812
60562D46728J2170J3139J3909J4215J3285J0866P565M067O71k328m528n885o694
60549E17180o984o522n428m116k616o58J560L343M399N162O196P758R903J2364
60535E41541J4437J5593J6153J6645J6773J5723J3328J0050O032J222l582o990
$$ plain form
60641 393277 389439 384669 380046 375950 372313 369102 366073 362572 358247 353696 349913 347319 345733 344948
60627 344948 344846 345189 345835 346983 348811 351054 353262 355263 356949 357953 358021 357488 356892 356256 355252 353992
60611 353992 353118 353040 353453 353729 353597 353334 353405 353917 354440 354469 354066 353876 354460 355805 357489 359102 360467 361739
60593 361739 363350 365603 368341 371248 374337 377655 380625 382369 382838 383018 383746 384854 385692 385940 385627 384910
60577 384910 384203 384105 384814 385986 387411 389388 392196 395703 399838 404938 411248 418535 426641 435916 446728
60562 446728 458898 472037 485946 500161 513446 524312 531877 535944 536615 534287 529759 523874 517180
60549 517180 510196 503674 498246 494130 491514 490856 492416 495759 500158 505320 511516 519274 529177 541541
60535 541541 555978 571571 587724 604369 621142 636865 650193 660243 666275 667497 663915 656925
60523F56925q489q803q647q131p397o770o030m622k883k021k387k817k214q51
60509E84863M32J451K407L191L699M259N170O350P953J0670J4680J8873K2060
60496F86058K4617K8136L3364L9242M4094M7361M9740N1806N2890N1602M7234
60485A156144M0164L0795J8892M524j0920k5474l7992m8111n5265n8811n9069
60474I54877n7233n4124m9896m4912l9946l5328l0812k6452k2765j9808j7090
60463E56511j4634j3152j2788j2584j1691j0354r152q106p048o174n644n133m333
60450D35718l503l040k908k909l024l147k914k234j574j337j294j039o17l75m08
60435D05395n35o76r26j312j582j328n12J64j59j253j782j015K1lo81m88Q78K122
$$ plain form
60523 656925 648436 639633 630986 622855 615458 608688 602658 598036 595153 593132 590745 587928 585714 584863
60509 584863 585295 586746 589153 592344 596043 600302 605472 611822 619775 630445 645125 663998 686058
60496 686058 710675 738811 772175 811417 855511 902872 952612 1004418 1057308 1108910 1156144
60485 1156144 1196308 1227103 1245995 1250519 1239599 1214125 1176133 1128022 1072757 1013946 954877
60474 954877 897644 843520 793624 748712 708766 673438 642626 616174 593409 573601 556511
60463 556511 541877 528725 515937 503353 491662 481308 472156 464050 457002 450828 445184 440051 435718
60450 435718 432215 429175 426267 423358 420334 417187 414273 412039 410465 409128 407834 406795 406178 405803 405395
60435 405395 404860 404184 403258 401946 400364 399036 398524 398688 398529 397276 395494 394479 394500 394497 393816 393328 394206 396328
60417C96328K377K230K350K383J830J034N67L67J46Q4M21Q69R59P27O01Q28J311
60400D15412J731J725J208N97M17P70J436K295L120L325K560J434R17J209J845
60385D40001K515K988K710J594P80J375K662K984K237J861K400K806K425K000
60371D71338K084K152J949K157K877K899J559L8l05K30N49N27P52J301J851K415
60355D94373L013L303L257L506M274M711M188L488L803N116O424P001O654N386
60341E58497L564J939P35o89k669m410n077n009n067n390n567n509n321m879m203
60326E10945l757l717l505k739j971j845k216k684l241l678l256j821m08K15P32
60311D77054K067L724M689N218O379Q213R725J0610J1709J3699J6319J8901K0861
$$ plain form
60417 396328 398705 400935 403285 405668 407498 408532 409099 409466 409612 409696 410117 410986 411945 412672 413273 414101 415412
60400 415412 417143 418868 420076 420673 421090 421860 423296 425591 428711 432036 434596 436030 436947 438156 440001
60385 440001 442516 445504 448214 449808 450588 451963 454625 457609 459846 461707 464107 466913 469338 471338
60371 471338 473422 475574 477523 479680 482557 485456 487015 487053 486748 486978 487527 488054 488806 490107 491958 494373
60355 494373 497386 500689 503946 507452 511726 516437 520625 524113 527916 533032 539456 546457 553111 558497
60341 558497 562061 564000 564735 564046 561377 556967 551890 546881 541814 536424 530857 525348 520027 515148 510945
60326 510945 507188 503471 499966 497227 495256 493411 491195 488511 485270 481592 478336 476515 476107 476322 477054
60311 477054 479121 482845 487534 492752 499131 507344 517069 527679 539388 553087 569406 588307 609168
60298F09168K1556K0471J7704J3883R539M842l32o234j2627j8111k0798k0287
60286F18774j8265j6561j5317j3673j1490r391p746o515n719n266m807m369m557
60273D95098n392n746m849l599l299l753l761l009k250j898j635j207o35J15Q31
60258D55011P75l87j758k226j840j274n11P16J737J629Q31O39J195J390P70J45
60242D56842J03J98nk19k14k86n02l37M44J252J531J557J906K576L071L115K947
60225D73979L038L613M334M633M430M287M627N178N578O018O760P423P404O795
60211E48097O292O327O799P359P566P057O061N398N460N597N046M026L296L066
60197F27447K971K756K281J280k46j716k637l242l944m652n162n640o081n979
$$ plain form
60298 609168 630724 651195 668899 682782 692321 697163 696831 690597 677970 659859 639061 618774
60286 618774 600509 583948 568631 554958 543468 534077 526331 519816 514097 508831 504024 499655 495098
60273 495098 489706 483960 479111 475512 472213 468460 464699 461690 459440 457542 455907 454700 454065 454180 455011
60258 455011 455786 455399 453641 451415 449575 448301 447790 448506 450243 451872 452703 453342 454537 455927 456697 456842
60242 456842 456945 457143 457138 456919 456705 456419 455917 455580 456024 457276 458807 460364 462270 464846 467917 471032 473979
60225 473979 477017 480630 484964 489597 494027 498314 502941 508119 513697 519715 526475 533898 541302 548097
60211 548097 554389 560716 567515 574874 582440 589497 595558 600956 606416 612013 617059 621085 624381 627447
60197 627447 630418 633174 635455 636735 636489 634773 632136 628894 624950 620298 615136 609496 603415 597436
60183E97436n206m613m853n261m825l651k587j942j583j770k716l751l908l091
60169E47679j846m92O87J049M83J9L99P31j53j608j971r62K14Q37J156J191O53
60152E48066R6N61J895K796K744K551K887L454L881M284M619M565M249M216M588
60137E95452N042N461N730N336M278L950N554P956Q695P144M958L378J940J92
60123F65066j151j501j347j160o12L74R97P64K43Jk59q58j458j847k461l499m338
60106F46954m494m376m553m943n250n488n619n329m571l781l204k643j935j058
60092E89710K13J918L229L239K492K502L588M452M297L971M404N092M967L850
60078F37924K277O46p95j853k817m346o481q430r615j0178j0255r664q649p906
$$ plain form
60183 597436 592230 587617 582764 577503 572678 569027 566440 564498 562915 561145 558429 554678 550770 547679
60169 547679 545833 545341 546028 547077 547560 547579 547978 548709 548556 546948 544977 544015 544229 545066 546222 547413 548066
60152 548066 548162 548723 550618 553414 556158 558709 561596 565050 568931 573215 577834 582399 586648 590864 595452
60137 595452 600494 605955 611685 617021 621299 625249 630803 638759 647454 654598 659556 662934 664874 665066
60123 665066 663915 662414 661067 659907 659295 659669 660666 661430 661673 661674 661415 660557 659099 657252 654791 651292 646954
60106 646954 642460 638084 633531 628588 623338 617850 612231 606902 602331 598550 595346 592703 590768 589710
60092 589710 589923 591841 595070 598309 600801 603303 606891 611343 615640 619611 624015 629107 634074 637924
60078 637924 640201 640847 640052 638199 635382 631036 624555 616125 606510 596332 586077 576413 567764 559858
60064E59858p471o590n159m187m291m794m903m725m423l489j763j82M75P78J597
60049E10731K613K996K943L460M770N987O326N888N273M897M702M232L153J770
60035E69741P44J89m34j461k616l691m846o005o660o750p011p911q790q635p375
60020D98489n904n094n067n230m837l692k362j500j194j294j914k929l455k823
60006D51194j761j469j810j680r92p20j015r31l16k24q39p65P43K413K929K849
59990D47606L343M181M462M347M594M914M291K651J015R0m12j036j940k894l528
59975D71684l678l694m028m385l948k636j327n41J91J138J583R88J18K05J495
59960D53165L309M849N435M716L324K602K956L181K152L98p68j052j089j231j282
$$ plain form
60064 559858 552387 545797 540638 536451 532160 527366 522463 517738 513315 509826 508063 507881 508356 509134 510731
60049 510731 513344 516340 519283 522743 527513 533500 539826 545714 550987 555884 560586 564818 567971 569741
60035 569741 570485 570674 570240 568779 566163 562472 557626 551621 544961 538211 531200 523289 514499 505864 498489
60020 498489 492585 487491 482424 477194 472357 468665 466303 464803 463609 462315 460401 457472 454017 451194
60006 451194 449433 447964 446154 444474 443482 442762 441747 440816 440500 440276 439437 438672 439415 441828 444757 447606
59990 447606 450949 455130 459592 463939 468533 473447 477738 480389 481404 481494 481082 480046 478106 475212 471684
59975 471684 468006 464312 460284 455899 451951 449315 447988 447447 447638 448776 450359 451347 451465 451670 453165
59960 453165 456474 461323 466758 471474 474798 477400 480356 483537 485689 486087 485319 484267 483178 481947 480665
59945D80665j171j006p96o66r96j802k474k615k606k767k580j471J45J295J548
59930D62703J219Q79J164K456M221N271N211M980N460O241O420N967N569N726
59916E23487O562P955R265R564Q726P677O953N854L705J110q31j927k672l242
59902E82186l538l691l739l370k580j984j840j538p53k24n10q36j79J212K425
59887E61041L327M250M917M866M534M749N432N874N943N980N838N113M165L828
59873F29857M141M224L424J847n2j798k978l585m090m679m853m320l708l800m508
59858F05122n330o086o538o023m464l097k985l329k435m0K444L903M671N681P373
59843E88867R411J0774J0249P552L927J017o62j533j655m92J996M717O051M955
$$ plain form
59945 480665 479494 478488 477692 477026 476030 474228 471754 469139 466533 463766 461186 459715 459860 461155 462703
59930 462703 463922 464801 465965 468421 472642 477913 483124 488104 493564 499805 506225 512192 517761 523487
59916 523487 530049 538004 547269 556833 565559 573236 580189 586043 589748 590858 590027 588100 585428 582186
59902 582186 578648 574957 571218 567848 565268 563284 561444 559906 559153 558929 558419 557583 557404 558616 561041
59887 561041 564368 568618 573535 578401 582935 587684 593116 598990 604933 610913 616751 621864 626029 629857
59873 629857 633998 638222 641646 643493 643441 641643 638665 635080 630990 626311 621458 617138 613430 609630 605122
59858 605122 599792 593706 587168 581145 576681 573584 570599 567270 564835 564795 567239 571142 575813 581494 588867
59843 588867 598278 609052 619301 626853 630780 631797 631135 629602 627947 627455 629451 634168 640219 645174
59829F45174J780j801m123n086n885p107q032q139q076q376q354p281n708m443
59815E64543l144j212O63J241N20n27j545k832m131m709m517m176l983l863m033
59800E28295m634n029m479l292k360j923j695j755k192k332j545m35q7m00m24
59785D95713j1J40j00j07L29Q28J287J821K014J438P84J143K256K736K079J290
59769E13640J290J847K319K432K185J772J761K508L439L682L318L178L556L977
59755E50904M139M152L996L637L492L927M514M696M785N277N605M903L625L059
59741F10711L331L353K735K249K249K024J095K2n33n86l79l0J61j56p99j270j447
59724F22730j392p88M74J488J267J94n65p72r76j086o12p8n11j550j712p45M4
$$ plain form
59829 645174 646954 645153 641030 635944 630059 622952 614920 606781 598705 590329 581975 574694 568986 564543
59815 564543 561399 560187 560850 562091 562611 562084 560539 557707 553576 548867 544350 540174 536191 532328 528295
59800 528295 523661 518632 514153 510861 508501 506578 504883 503128 500936 498604 497059 496624 496537 496137 495713
59785 495713 495702 495842 495742 495635 495964 496792 498079 499900 501914 503352 504136 505279 507535 510271 512350 513640
59769 513640 514930 516777 519096 521528 523713 525485 527246 529754 533193 536875 540193 543371 546927 550904
59755 550904 555043 559195 563191 566828 570320 574247 578761 583457 588242 593519 599124 604027 607652 610711
59741 610711 614042 617395 620130 622379 624628 626652 627747 627769 627236 626650 626271 626241 626402 626246 625447 624177 622730
59724 622730 621338 620550 621024 622512 623779 623973 623408 622636 621660 620574 619962 619884 619373 617823 616111 615366 615410
59707F15410O7K57J094J606J120N01P09J356J673J767K003K147J992K120L049
59692F36871M247M693L996K481P08o76j157q89n58n66q30j372k307l255l630l684
59676F34072m275n437o181n984n479n358n565n867o271o455n782m348l164k823
59662E61083k807k456j820j123k77O22J107J152J452K434L625M385M566M214L284
59647E79441K031R57N9j165k760m051m633m858n036m951m457l862l362k765k015
59632E38573j385r18m19j62p84k264l704m411m520m360l969l409k872k306j574
59617E01516j103j502k515l168l047k643k325j837r70J16J289K431L023K661J915
59602D93841J685J826J466O46K83N16L93m24j009o15L06R78J173Q87J29o31q08
$$ plain form
59707 615410 615477 615734 616828 618434 619554 620055 620764 622120 623793 625560 627563 629710 631702 633822 636871
59692 636871 641118 645811 649807 652288 652996 652320 651163 650274 649716 649150 648320 646948 644641 641386 637756 634072
59676 634072 629797 624360 618179 612195 606716 601358 595793 589926 583655 577200 571418 567070 563906 561083
59662 561083 558276 555820 554000 552877 552600 553222 554329 555481 556933 559367 562992 567377 571943 576157 579441
59647 579441 581472 582429 582488 581323 578563 574512 569879 565021 559985 555034 550577 546715 543353 540588 538573
59632 538573 537188 536270 535851 535689 534905 532641 528937 524526 520006 515646 511677 508268 505396 503090 501516
59617 501516 500413 498911 496396 493228 490181 487538 485213 483376 482406 482522 483811 486242 489265 491926 493841
59602 493841 495526 497352 498818 499464 499747 500263 500656 500232 499223 498608 498914 499892 501065 501952 502081 501450 500642
59585E00642o92j137k100k614k301j764j396j054j043j908l047l046j799q50j169
59570D74722k019k539k834k938k223p29L73M76M19Q67J221J042J118K017K775
59555D71748K328J172M67L48L01M58J309K609L612M044M159M219M410M873N519
59540E11576O302P651R920J2580J5036J7858K1453K3536K0295J1134L54p053r832
59527F40810r743q327o076l485j086J039K593K684J067j050k525l680n278p036
59513E99907q226q858r171q909q103p658q093q542q067p037o158n194l780k519
59499D99592k022j711q51P0K83K15O57J257J170O09M20O20O62N67P45J145J677
59482E05105K791M510N690N453M686M820N770O462O720P129P494O980N630M287
$$ plain form
59585 500642 499950 498813 496713 494099 491798 490034 488638 487584 486541 484633 481586 478540 476741 475891 474722
59570 474722 472703 470164 467330 464392 462169 461440 461813 462289 462708 463575 464796 465838 466956 468973 471748
59555 471748 474076 475248 475715 476063 476364 476822 478131 480740 484352 488396 492555 496774 501184 506057 511576
59540 511576 517878 525529 535449 548029 563065 580923 602376 625912 646207 657341 657695 650642 640810
59527 640810 631067 622740 616664 613179 612093 613132 615725 618409 619476 618426 615901 612221 606943 599907
59513 599907 591681 582823 573652 564743 556640 548982 540889 532347 524280 517243 511085 505891 502111 499592
59499 499592 497570 495859 495008 495078 495361 495576 496233 497490 498660 499269 499689 500309 500971 501538 502283 503428 505105
59482 505105 507896 512406 518096 523549 528235 533055 538825 545287 552007 559136 566630 573610 579240 583527
59468E83527L193J922O04j01k03m10q58q58K1J482L101M670N946O792P486Q362
59452F24676R248R711R591Q911P672O199N098M400L296J239j336l871o426q968
59438F69440j0760j1225j0799j0144r210p757o107m689l560k863k930l343k892
59425E83161j186Q57K651M844P749J0313J1728J2748J4213J5548J6004J6087J6516
59412G11233J7104J7912J9806K1940K0452J2251o64j2773k0289k2878k1434j6945
59400G25715j1211n823k35O815J3609J5557R935j037j2441k0552k4272k4424k2686
59387F48950k0295j7230j3157q958o173m993m090k601j068j64L45R30J538J944
59373E74978K189K395K653L122L821M442M841N366O184O817O934P055P655Q265
$$ plain form
59468 583527 586720 588642 589246 589145 588942 588532 587674 586816 586837 588319 591420 596090 602036 608828 616314 624676
59452 624676 633924 643635 653226 662137 669809 676008 681106 685506 688802 690041 688705 684834 678408 669440
59438 669440 658680 647455 636656 626512 617302 609545 603438 598749 595189 592326 589396 586053 583161
59425 583161 581975 582832 585483 590327 598076 608389 620117 632865 647078 662626 678630 694717 711233
59412 711233 728337 746249 766055 787995 808447 820698 820034 807261 786972 764094 742660 725715
59400 725715 714504 708681 708446 715261 728870 744427 754362 753325 740884 720332 696060 671636 648950
59387 648950 628655 611425 598268 589310 583137 578144 574054 571453 570385 570221 570566 571496 573034 574978
59373 574978 577167 579562 582215 585337 589158 593600 598441 603807 609991 616808 623742 630797 638452 646717
59359F46717Q353Q460R376J0752J1650J1995J2446J3278J4391J5847J7402J8090
59347G98757J7437J6427J6126J6023J4921J2814J0533Q170N366K462p6k860o643
59334I09457j0621j3283j4610j5884j7540j8748j8875j8004j6242j3856j1826
59323G39968j0932j0600r826q771q096p387n820l852k644k290k098k074k403k191
59309F60984o15J250J800J520K118L478L942L445L763N550P471Q715J0112J2178
59295G25711J4060J4897J4322J1304M644m606j3128j8508k0852k0940j8863j5284
59283F72757j2000j0011q364n926l032n58J336K825L901M916O546Q632J0095J0471
59269F81588J0470J0596J0383R367P748N731L326R91o77k050m029o448q216r103
$$ plain form
59359 646717 655070 663530 672906 683658 695308 707303 719749 733027 747418 763265 780667 798757
59347 798757 816194 832621 848747 864770 879691 892505 903038 911208 916574 919036 918960 916100 909457
59334 909457 898836 885553 870943 855059 837519 818771 799896 781892 765650 751794 739968
59323 739968 729036 718436 708610 699839 691743 684356 678536 674684 672040 669750 667652 665578 663175 660984
59309 660984 660369 661619 663419 664939 667057 670535 674477 677922 681685 687235 694706 703421 713533 725711
59295 725711 739771 754668 768990 780294 784938 780332 767204 748696 727844 706904 688041 672757
59283 672757 660757 650746 642382 636456 633424 632866 634202 637027 640928 645844 652390 661022 671117 681588
59269 681588 692058 702654 713037 722404 730152 735883 739209 740200 739523 737473 733444 726996 718780 709677
59255G09677r930j0781j0699r448q071p281o652n758m764l650k193q99n00m02
59241F28649P50K879M478M995N320N726N256L729K378J869J450P00K62J38q66
59226F67713l130n350o559p320q033p858o391m814m151l760k680j214q2P99J653
59211F08823K018J581Q84M23k3n59o92k77J50L82P72J160Q73J37M4P30J110Q35
59193F18371Q06J256J162K07m91l01j0J3N80J745K048R16m7N56J876K502K534
59176F33723K669K704K455K752M072N419N878O064O827P766Q308Q910R891J0360
59162G17798R577Q232P084N591L183O53j119k581m372n943o695p284q371r225
59148G06528q995q304q155q325q223q205q611q599p514o346o272o691o369n559
$$ plain form
59255 709677 699747 688966 678267 668819 660748 653467 646815 641057 636293 632643 630450 629551 629051 628649
59241 628649 629399 632278 636756 641751 647071 652797 658053 661782 664160 666029 667479 668179 668441 668579 667713
59226 667713 664583 659233 652674 645354 637321 629463 623072 618258 614107 610347 607667 606453 606371 607170 608823
59211 608823 610841 612422 613306 613729 613706 613147 612455 612178 612328 612710 613482 614642 615515 615652 615696 616426 617536 618371
59193 618371 619177 620433 621595 621802 621311 621010 621000 621013 621593 623338 625386 626302 626255 626811 628687 631189 633723
59176 633723 636392 639096 641551 644303 648375 653794 659672 665736 672563 680329 688637 697547 707438 717798
59162 717798 727375 735607 742691 748282 751465 752118 750999 748418 744046 738103 731408 724124 715753 706528
59148 706528 697533 689229 681074 672749 664526 656321 647710 639111 631597 625251 618979 612288 605919 600360
59134F00360n297n435n120m512m395m541m038k864j715p22M15J503K268L135M500
59119E73542N811O509P112Q272R477R967J0141J0761J1506J1703J1657J1919J1849
59106G00226J0591Q826P994Q061P624O004L900K048M52j010k311l474m395m642
59092G39894m095l372l020k763k237j755j642j640j718k621m689o975q478r381
59078F85508j0146j0358r650q789q608q640q032p053o383n724m471l216l082l959
59064E87397m657m502l760k839k044j771k028k220k083k185k752k872j812k65
59050E51607O83J014J123P30l99j461j587j133q96p85l69R9L25Q02J837K591K400
59033E56581K116K825L993M396M215M667O098P794R330J0842J2330J3741J5235
$$ plain form
59134 600360 595063 589628 584508 579996 575601 571060 567022 564158 562443 561721 562136 563639 565907 569042 573542
59119 573542 579353 585862 592974 601246 610723 620690 630831 641592 653098 664801 676458 688377 700226
59106 700226 710817 719643 727637 735698 743322 749326 753226 755274 755726 754716 752405 748931 744536 739894
59092 739894 735799 732427 729407 726644 724407 722652 721010 719370 717652 715031 710342 703367 694889 685508
59078 685508 675362 665004 655354 646565 637957 629317 621285 614232 607849 602125 597654 594438 591356 587397
59064 587397 582740 578238 574478 571639 569595 567824 565796 563576 561493 559308 556556 553684 551872 551607
59050 551607 552290 553304 554427 555157 554758 553297 551710 550577 549681 548896 548527 548626 548951 549753 551590 554181 556581
59033 556581 558697 561522 565515 569911 574126 578793 584891 592685 602015 612857 625187 638928 654163
59020F54163J6393J5937J3400J0240Q045O388L792K07k994m919n736n770n333
59007G03813n034n087m621k755M2K612M505N858O557O551O320O107N406M040K898
58992G37212K602K499J894J148M76j017l774o440p583p612p567p191n885m326
58978F94436l364k326k66K056L361M127N716P971R614J0431J1114J1587J1397
58965G65854J1224J2028J3151J3119J1945J0795R712P618M422J276j246l696o548
58952H49654r696j2923j5726j7138j6944j6437j6689j6908j5844j3908j2256j0711
58940F74474q448n938m343l530k576j669j706k462k951l046l142k835j712p18
58926F29398r61j837k120k042k409k638j782o84p72j434j011K81Q09M38N04J231
$$ plain form
59020 654163 670556 686493 699893 710133 718178 724566 728358 728565 725571 720652 714916 709146 703813
59007 703813 698779 693692 689071 686316 686358 688970 693475 699333 705890 712441 718761 724868 730274 734314 737212
58992 737212 739814 742313 744207 745355 745831 744814 741040 734600 727017 719405 711838 704647 698762 694436
58978 694436 691072 688746 688480 690536 693897 698024 703740 711711 721325 731756 742870 754457 765854
58965 765854 777078 789106 802257 815376 827321 838116 847828 855446 859868 861144 859898 856202 849654
58952 849654 839958 827035 811309 794171 777227 760790 744101 727193 711349 697441 685185 674474
58940 674474 666026 660088 655745 652215 649639 647970 646264 643802 640851 637805 634663 631828 630116 629398
58926 629398 628437 626600 624480 622438 620029 617391 615609 614925 614153 612719 611708 611989 612798 613236 613740 614971
58910F14971J675J963L119M839N799O109P075Q692R747J0384J2015J4626J6473
58897G17487J6726J6219J5468J4188J2913J2890J4075J5258J6312J8224K0838
58886H90598K2660K3033K2461K0814J7354J2701Q493M967R86l488p172r850j2725
58873I90832j6059j8647j9882k0310j9994j8428j6184j4484j3104j0923q518p724
58861H06575q487q749p769o996p165p210o695o777p901q814q740q488q571q316
58847F95897p567p277p708p888p498p433q048q607q823r075q983p806o368o241
58833E86575p013o773n411m702m836l949j656J3J63N11K148L663L913L942M605
58818E71193M781L735K926L680M950N108M260L275K182R88M87R14J231Q45M90
$$ plain form
58910 614971 616646 618609 621728 626567 632366 638475 645550 654242 663989 674373 686388 701014 717487
58897 717487 734213 750432 765900 780088 793001 805891 819966 835224 851536 869760 890598
58886 890598 913258 936291 958752 979566 996920 1009621 1018114 1023081 1024067 1020579 1013407 1003557 990832
58873 990832 974773 956126 936244 915934 895940 877512 861328 846844 833740 822817 814299 806575
58861 806575 798088 789339 781570 774574 767409 760199 753504 746727 738826 730012 721272 712784 704213 695897
58847 695897 688330 681053 673345 665457 657959 650526 642478 633871 625048 615973 606990 599184 592816 586575
58833 586575 579562 572789 567378 562676 557840 553891 552235 552248 552411 552922 555070 558733 562646 566588 571193
58818 571193 575974 579709 582635 586315 591265 596373 600633 603908 606090 607078 607565 608479 609710 610555 611045
58803F11045M66k34j985l471l767l768m412n112n150n016n170m956l911k796k321
58788E59442k057j432n05P61K598M305M707M106M036M740M888M262M373N678O482
58773F06384N489L363Q59k321n771p826p972p798q328q470p226n486m319l402
58759E47176k304j520j060O2J846K736K080J267J288J230L23m95k88M96J416K910
58743E57163M666N292M650M471N502O226N591M792M956N370N352N710O782P243
58729F33766O352N458N660O014N520M822M470L646K156J585K819M377M893N181
58715F96719O182O911O328N246M609L688J791q6j037j950l732n675p183r211j2266
58700F90334j4885j5891j6336j7368j8078j7288j5735j4532j3191j0981q705p312
$$ plain form
58803 611045 611511 611277 609292 605821 602054 598286 593874 588762 583612 578596 573426 568470 564559 561763 559442
58788 559442 557385 555953 555448 556209 558807 563112 567819 571925 575961 580701 585589 589851 594224 599902 606384
58773 606384 611873 615236 616095 613774 608003 600177 592205 584407 576079 567609 560383 554897 550578 547176
58759 547176 544872 543352 542292 542354 544200 546936 549016 550283 551571 552801 553124 552629 552341 552837 554253 557163
58743 557163 561829 567121 571771 576242 581744 587970 593561 598353 603309 608679 614031 619741 626523 633766
58729 633766 640118 645576 651236 657250 662770 667592 672062 675708 677864 679449 682268 686645 691538 696719
58715 696719 702901 709812 716140 721386 725995 729683 731474 731388 730351 728401 724669 718994 711811 702600 690334
58700 690334 675449 659558 643222 625854 607776 590488 574753 560221 547030 536049 527344 520032
58688E20032o319n199m741n379n817m920l450k526k003j626j916k657k439r95
58674D70045J57N07J513L548M678M096L977N954Q518J0001J1361J3657J5408J4954
58660E68374J3008J0456O213r1n821q572r483j0560j1094r706p681p068p265o593
58646E14117n482n122m732l161j578j593k227j678m81p9K02J688L380L433K308
58631D98995J600J117p6j128q28k18q76j825j085R15K294K957M048N264N481N154
58615E21789N507O245O435O490P037P091N642L689K494J400l70j565j047j85n56
58600E70096j226r46r32k538m204l950k884l020l484k340l32O87J417L585O398
58585E56327Q090R424J1976J4489J4699J3459J3168J3447J2287J0283R619R843
$$ plain form
58688 520032 513713 508514 503773 498394 492577 487657 484207 481681 479678 478052 476136 473479 471040 470045
58674 470045 470202 470709 472222 475770 480448 484544 488521 494475 502993 512994 524355 538012 553420 568374
58660 568374 581382 591838 598051 597960 592139 583567 574084 563524 552430 542724 535043 527975 520710 514117
58646 514117 508635 503513 498781 495620 494042 492449 490222 488544 488063 487984 488186 489874 493254 496687 498995
58631 498995 500595 501712 501636 500508 499680 499462 498586 496761 495676 496591 498885 501842 505890 511154 516635 521789
58615 521789 527296 533541 539976 546466 553503 560594 566236 569925 572419 573819 573449 571884 570837 570652 570096
58600 570096 568870 567924 566992 564454 560250 556300 553416 550396 546912 544572 544240 544927 546344 549929 556327
58585 556327 564417 573841 585817 600306 615005 628464 641632 655079 667366 677649 687268 697111
58573F97111Q740O684O116P248Q183Q834J0901J4301J7261J9661K2797K6148K7789
58560H81774K7702K7336K6311K2862J7259J1589O512J282l512o302p199p482p120
58547I91012n583m137m341n251n287n669q686j3644j7844k0620k3032k4758k4747
58534H27413k3893k3532k2430j8846j4301j1594j0309q198n576m348l854k027
58522F78505L44Q92K50R18K472K359P58J35N28k03j903k392j793k219l459l420
58506F71772k414k617l638l111j319p92j585j499o11j056k573k871k046k069k279
58491F41292l26K803L742K583K696M747O134O405P964J1007J3040J3874J5916
58478G31877J8881J9511J7303J5369J4636J2341P358K108k009o337j0928j3483
$$ plain form
58573 697111 705851 712535 718651 725899 734082 742916 753817 768118 785379 805040 827837 853985 881774
58560 881774 909476 936812 963123 985985 1003244 1014833 1021345 1022627 1019115 1012813 1005614 998132 991012
58547 991012 985429 981292 976951 971700 966413 960744 952058 938414 920570 899950 876918 852160 827413
58534 827413 803520 779988 757558 738712 724411 712817 702508 694310 688734 684386 680532 678505
58522 678505 678849 679741 679991 680909 683381 685740 686498 686633 687161 686958 685055 682663 680870 678651 675192 671772
58506 671772 669358 666741 663103 659992 658673 657881 656296 654797 654186 653130 650557 647686 645640 643571 641292
58491 641292 640966 643769 647511 650094 652790 657537 663671 670076 678040 689047 702087 715961 731877
58478 731877 750758 770269 787572 802941 817577 829918 837276 839384 837375 831038 820110 806627
58466H06627j3545j3396j3731j2657r838p317n507k689R70L315M580P242J1089
58453G55143J3163J2976J2877J2822J0051M540l78l554p054j0989j2769j2208
58441G74620j1948j2000r476m759k098k755l147j249P93J837L722O514P418O272
58427G53744O601R438J1530J1424J1621J2910J2344Q955N818M199J277l937p980
58414H37944q735q568r313r346q030p797r315r646p606n948o091n734l822k610
58400G35383k743j623J227K682J959K351M858N968M230L153M772O183N351M757
58386G78508O298P991Q612J0186J3035J3743J0896P563N569K793j348l522k346
58373H57978r34j013j74K561M364M364N670R071J0897R878R670J1971J3519J2732
$$ plain form
58466 806627 793082 779686 765955 753298 743460 736143 730636 727947 728917 732232 736812 744054 755143
58453 755143 768306 781282 794159 806981 817032 821572 821194 817640 810586 799597 786828 774620
58441 774620 762672 750672 741196 736437 734339 731584 728437 727188 727981 729818 733540 740054 747472 753744
58427 753744 760345 769783 781313 792737 804358 817268 829612 838567 844385 848584 849861 845924 837944
58414 837944 829209 820641 811328 801982 793952 786155 776840 767194 759588 753640 747549 741815 737993 735383
58400 735383 732640 731017 732244 734926 736885 739236 744094 750062 754292 757445 762217 768400 773751 778508
58386 778508 784806 792797 801409 811595 824630 838373 849269 856832 862401 865194 863846 860324 857978
58373 857978 857044 856031 855857 858418 862782 867146 872816 881887 892784 902662 912332 924303 937822 950554
58359I50554J2536J3768J2781Q699N917O098N006P85k089r66K67j189k069N5K068
58344A012221J895K664N992Q226P698Q485J2567J5678J5383J5671J8852K0698
58332A146030J8584J6605J7490J7274J3307R660R114P720K983o00ON75j819k652
58318A254277J336N435N468M957P307R055P575P255J1103J4472J3972J4167J8236
58305A374615K0838J7885J4734J6547J9185J7892J6427J8930K1204J8955J6566
58294A573778J8737K1464K0206J8953K2184K5805K5149K3911K6330K8676K7305
58283A832498K6654L0310L3028L0702K9015L2859L6817L5745L4768L8678M1743
58272B202817L8830L6205M0019M4629M3920M3490M9411N5774N6090N6247O2874
$$ plain form
58359 950554 963090 976858 989639 998338 1004255 1010353 1015359 1016144 1014055 1013089 1013356 1012167 1010098 1010153 1012221
58344 1012221 1014116 1016780 1022772 1030998 1038696 1047181 1059748 1075426 1090809 1106480 1125332 1146030
58332 1146030 1164614 1181219 1198709 1215983 1229290 1238950 1248064 1255784 1258767 1258167 1258173 1258748 1256929 1254277
58318 1254277 1255613 1261048 1266516 1271473 1278780 1287835 1295410 1302665 1313768 1328240 1342212 1356379 1374615
58305 1374615 1395453 1413338 1428072 1444619 1463804 1481696 1498123 1517053 1538257 1557212 1573778
58294 1573778 1592515 1613979 1634185 1653138 1675322 1701127 1726276 1750187 1776517 1805193 1832498
58283 1832498 1859152 1889462 1922490 1953192 1982207 2015066 2051883 2087628 2122396 2161074 2202817
58272 2202817 2241647 2277852 2317871 2362500 2406420 2449910 2499321 2555095 2611185 2667432 2730306
58261B730306O9791O9633O7966P1795P5207P1085O6053O8587P3289P2388P1601
58250C507701P8645Q7314Q9365R0776R9474J08744J10230J11271J21243J33015
58240D537778J36656J38971J49987J62977J68113J72765J87250K03849K11836
58231F070182K19411K38027K59302K71265K82756L06697L34482L53136L72119
58222H707377M05691M44845M75594N08080N57269O12635O59199P09833P82604
58213A3863127Q65977R43018J029040J146105J282589J420526J579529J788011
58205B3917922K036561K310146K639496L066162L586327M189166M916950N818765
58197E2481495O881911Q088808R505909J1235282J3331456J5866471J9006209
$$ plain form
58261 2730306 2800097 2869730 2937696 3009491 3084698 3155783 3221836 3290423 3363712 3436100 3507701
58250 3507701 3586346 3673660 3763025 3853801 3953275 4062019 4172249 4283520 4404763 4537778
58240 4537778 4674434 4813405 4963392 5126369 5294482 5467247 5654497 5858346 6070182
58231 6070182 6289593 6527620 6786922 7058187 7340943 7647640 7982122 8335258 8707377
58222 8707377 9113068 9557913 10033507 10541587 11098856 11711491 12370690 13080523 13863127
58213 13863127 14729104 15672122 16701162 17847267 19129856 20550382 22129911 23917922
58205 23917922 25954483 28264629 30904125 33970287 37556614 41745780 46662730 52481495
58197 52481495 59363406 67452214 76958123 88193405 101524861 117391332 136397541
58190A36397541K2884067K7462259L2621755L8099197M2804157M4204819L9210520
58183C83684315K6548507Q463955j0217654k4926329l3526797l6437390l5468654
58176B78119953l2681421k9654232k7075128k4808554k2455203j9882935j7255369
58169A04307111j4756188j2470162j0456962q764970p367310o188219n193931
58162C9109369m388697l742409l197122k732342k358566k057986j791196j552281
58154A7288770j362227j215847j084522r63398q69366p98798p29972o61410o08397
58145H994833n67232n19757m67603m27249l96767l60388l20199k91504k72156
58136E371978k47309k19639k05098k02748j97059j86177j80804j78935j68408
$$ plain form
58190 136397541 159281608 186743867 219365622 257464819 300268976 344473795 383684315
58183 383684315 410232822 418696777 408479123 383552794 350025997 313588607 278119953
58176 278119953 245438532 215784300 188709172 163900618 141445415 121562480 104307111
58169 104307111 89550923 77080761 66623799 57858829 50491519 44303300 39109369
58162 39109369 34720672 30978263 27781141 25048799 22690233 20632247 18841051 17288770
58154 17288770 15926543 14710696 13626174 12662776 11793410 10994612 10264640 9603230 8994833
58145 8994833 8427601 7907844 7440241 7012992 6616225 6255837 5935638 5644134 5371978
58136 5371978 5124669 4905030 4699932 4497184 4300125 4113948 3933144 3754209 3585801
58127C585801j51522j41618j37927j28114j12997j04879j03665r7820q7127q2114
58117B438018q2495p7874o8548o4684o6089o2885n5276n2810n5059n2377m5110
58106A754811m3038m6205m4894l8518l6394l9499l9093l4108l2846l6501l7303
58095A326412l4021l3589l6325l4812k8613k5368k6290k4738k0073j8828k1280
58084A022475k0685j6723j6207j9539j9782j6212j5596j8906j9720j6970j6591
58073H25544j9187j8649j4449j3047j5409j5212j1132r131j0697j0359o871n606
58061F75795p728p933n014m209o857q057o571p011j0223j1366r417q956j0703
58048E71750r995o327m827o485o440l753l307o102p109m860l966n957o687m917
$$ plain form
58127 3585801 3434279 3292661 3154734 3026620 2913623 2808744 2705079 2607259 2520132 2438018
58117 2438018 2355523 2277649 2209101 2144417 2078328 2015443 1960167 1907357 1852298 1799921 1754811
58106 1754811 1711773 1665568 1620674 1582156 1545762 1506263 1467170 1433062 1400216 1363715 1326412
58095 1326412 1292391 1258802 1222477 1187665 1159052 1133684 1107394 1082656 1062583 1043755 1022475
58084 1022475 1001790 985067 968860 949321 929539 913327 897731 878825 859105 842135 825544
58073 825544 806357 787708 773259 760212 744803 729591 718459 709328 698631 688272 681401 675795
58061 675795 668067 660134 655120 650911 644054 635997 629426 622415 612192 600826 591409 582453 571750
58048 571750 561755 555428 550601 544116 537676 533923 530616 524514 517405 512545 508579 502622 495935 491018
58034D91018m546o258n915l285l418p123q978p140o218q000q265n598m508o711
58020D05055p735n522m148n727o525m576l450m910n265k657q72k248l553k428
58006C45439j471k466k864j297n36j819k157k38P94p31k033j521j595l301l960
57991C20244k714k624m721n684l920k251k123r65K150M000L021K038K662K486
57977C11599L89q80QM57q29j436l74j80j595j666M86J562J61o66O66J392M4o78
57959C08460O04J142m24j266R1P79q85k242j511r22j743j510P29J758k2j356P0
57942C01752J755J633K016M645O842O408N723P229R149R336R118R845R774P895
57928C93120O658P489P715N355K818K456K498R07q01j029j414l252m503l795l499
$$ plain form
58034 491018 486472 480214 474299 471014 467596 460473 451495 444355 438137 430137 421872 416274 411766 405055
58020 405055 397320 391798 387650 381923 375398 370822 367372 362462 357197 354540 353668 351420 347867 345439
58006 345439 343968 341502 338638 337341 336805 334986 332829 332591 333385 332654 330621 329100 327505 324204 320244
57991 320244 317530 314906 310185 304501 300581 298330 296207 295242 297392 301392 304413 306451 309113 311599
57977 311599 311988 311108 311116 311573 310744 309308 308934 308754 307159 305493 305979 307541 307702 307036 307702 309094 309138 308460
57959 308460 309064 310206 309782 308516 308607 309386 308501 306259 304748 303826 302083 300573 301302 303060 303038 301682 301752
57942 301752 303507 305140 307156 311801 318643 325051 330774 338003 347152 356488 365606 375451 385225 393120
57928 393120 399778 407267 414982 420337 423155 425611 428109 429016 428215 427186 425772 422520 418017 414222 410723
57913D10723n391p183o801o164p141p788o284m792n488o542n905n432p149q904
57899C19759p975n877n447n980n321m067l769l447j668L25R30J264K689L883L475
57884B88774K865L351L297J404j78O02J924J348NOM11n30j685j215j42k19o02
57867B99416O3O39j16o30N96J732O96r70q65P9k12q72j0J462J598J145J840K852
57849C08443K426J323J170J170j78j852k135j886k687l539k797j608k089l609
57835B92152m217m097m437m507l150j506j156j138M6J273Q77o9K16P85L9p35L93
57818B70769J975J405l49k72J544K313J338M92M41k6j198k154l038m685o382o671
57802B55502n840n110m184k118K70J485J877K626L306K984K517L058L563K628
$$ plain form
57913 410723 405332 398149 391348 385184 378043 370255 363971 359179 353691 347149 341244 335812 328663 319759
57899 319759 311784 305907 300460 294480 289159 285092 281323 277876 276208 276533 277463 278727 281416 285299 288774
57884 288774 291639 294990 298287 299691 299513 300115 302039 303387 303392 303398 303809 303279 301594 300379 300237 300018 299416
57867 299416 299479 300118 300002 299372 299968 301700 302396 301426 300561 300640 300428 299556 299546 301008 302606 303751 305591 308443
57849 308443 310869 312192 313362 314532 314354 312502 310367 308481 305794 302255 299458 297850 295761 292152
57835 292152 287935 283838 279401 274894 271744 270238 269082 267944 267990 269263 270140 270071 270287 271072 271111 270376 270769
57818 270769 272744 274149 273800 273528 275072 277385 278723 279215 279656 279630 278432 276278 273240 268555 262173 255502
57802 255502 249662 244552 240368 238250 238520 240005 241882 244508 247814 250798 253315 256373 259936 262564
57788B62564J397J744K788K378R35O48J623K044J479J135J355J573K067L221L881
57773B90832K914J446J068J001k84j941k179j636k225l662m238m110m728n738
57759B66520n600m607m264m270l145j259l83o11n12K29Q80J662L104M195L827
57744B55766L128L718M717M294L030K624K449P48j646k304j279p77j341j707j909
57729B69511l019m165l387j303n36j475j975j211n64n98l93on12j432j202k58
57713B47475o04k119k502j158n8l43j064j658k725l865l636k206j396j623j463
57698B21055n73k86p75m82J011K054J574L43r44k467l791l903l152k932l171k432
57682B01129o89M42N60J128K866M829O424Q091R806J1121J2875J6527K1783K7110
$$ plain form
57788 262564 263961 265705 268493 270871 271806 272454 274077 276121 277600 278735 280090 281663 283730 286951 290832
57773 290832 293746 295192 296260 297261 296977 295036 292857 291221 288996 285334 281096 276986 272258 266520
57759 266520 260920 256313 252049 247779 244634 243375 242992 242381 241869 242098 242978 244640 247744 251939 255766
57744 255766 258894 262612 267329 271623 274653 277277 279726 280474 278828 276524 275245 274468 273127 271420 269511
57729 269511 266492 262327 258940 257637 257101 255626 253651 252440 251876 251278 250885 250879 250367 248935 247733 247475
57713 247475 246871 244752 242250 241092 241034 240691 239627 237969 235244 231379 227743 225537 224141 222518 221055
57698 221055 220482 220196 219421 218939 219950 222004 223578 223921 222977 220510 216719 212816 209664 206732 203561 201129
57682 201129 200440 200882 201442 202570 205436 210265 216689 224780 234586 245707 258582 275109 296892 324002
57668C24002L2591L9676M8278N6657O3701O8012O4972M9119K1045j0923l7395
57657G19735n4147o1548o1466n6597n0193m4100l8074l1828k6182k1635j7636
57646B56329j3980j1146q922o524m355l640m072l969k970k260k004j052M69R52
57632A92856J84j63M37N06o01j583j736j963k417j776J2Q82j88j517j498q61q18
57615A79756j101j095j171j585j739j513j661k218k193j443r75q84j11J215J512
57600A64794M92k15J00J58o31r74k23K99k73r40j064j651l133m064l551k796k841
57583A43487k825j959j194j376j635j159p68j222j718j541j486k174k625j996
57569A19809j166j180j573j526j305j253q97j54L3o24j003m96m9k51k18N18R21
$$ plain form
57668 324002 356593 396269 444547 501204 564905 632917 697889 747008 768053 757130 719735
57657 719735 665588 604040 542574 485977 435784 391684 353610 321782 295600 273965 256329
57646 256329 242349 231203 222281 215757 211402 207762 203690 199721 196751 194491 192487 191435 191904 192856
57632 192856 193040 192877 193314 193820 193219 191636 189900 187937 185520 183744 183756 184638 184450 182933 181435 180574 179756
57615 179756 178655 177560 176389 174804 173065 171552 169891 167673 165480 164037 163062 162178 162067 163282 164794
57600 164794 165286 165071 165171 165329 164698 163724 163501 163800 163527 162587 161523 159872 156739 152675 149124 146328 143487
57583 143487 140662 138703 137509 136133 134498 133339 132571 131349 129631 128090 126604 124430 121805 119809
57569 119809 118643 117463 115890 114364 113059 111806 110909 110755 110788 110164 109161 108665 108616 108365 108147 108665 109586
57552A09586M07R0P10J257R97J040K270L536L484K651K151J744Q26p7k91j79m4
57535A30158P00K011K381J007p01j145o80l81k39m3m52j651k278j332J42P09O20
57518A28826Q38J299J525J758K152K103J646J990L401M113K845R31K91P45R94
57503A55457R03J058J208Q15J96l18j216k504k881j708m67o90j709j951j309o32
57487A44252j28K05j93j221j441k13Q02L4j428j502j67J086J754K267K294J152
57471A47553o44j955k585k905k672j706r13j077j409p75L93R01O55L35Jm80m86
57454A32231M78J676K200K269K325J993J214J146K416L642L352K212J678J663
57440A60495J412J444K525L618L121J554R01J649K416K304J838J675J860K304
$$ plain form
57552 109586 109993 110083 110793 112050 113047 114087 116357 119893 123377 126028 128179 129923 130749 130672 130381 130202 130158
57535 130158 130858 132869 135250 136257 135556 134411 133731 133350 133111 133068 132616 130965 128687 127355 127497 128206 128826
57518 128826 129664 130963 132488 134246 136398 138501 140147 142137 145538 149651 152496 153427 153718 154463 155457
57503 155457 156360 157418 158626 159441 159637 159319 158103 155599 152718 151010 150543 149853 148144 146193 144884 144252
57487 144252 144124 144329 144136 142915 141474 141261 142063 142097 140669 139167 139000 140086 141840 144107 146401 147553
57471 147553 146909 144954 142369 139464 136792 135086 134173 133096 131687 130912 131305 132206 132861 133196 133197 132717 132231
57454 132231 132709 134385 136585 138854 141179 143172 144386 145532 147948 151590 154942 157154 158832 160495
57440 160495 161907 163351 165876 169494 172615 174169 175070 176719 179135 181439 183277 184952 186812 189116
57426A89116K815K861K299J853K020K206J841J441J555J705J440J303J663J831
57412B15949J508J666K700L244K356J317J535K212K016J477J698K085J703J455
57398B42921K512L778L491K329K247L100L177K392K212K843L150L149L912N110
57384B86323N206M228L953N071O291O547O130N432M366L262K710K453J886J470
57370C45328K074L199L537K985K486K232J756J367J732K381K395K214K903M126
57356C80715M742M905N537O227N820M773M710N781O642O840P087P301O645N550
57342D63275N475O541P420P638P963Q485Q399P793P685Q158Q379Q384Q898R519
57328E74012R225Q527Q885J0036J0319R641R584J0339J0283R047Q441R399J0476
$$ plain form
57426 189116 191931 194792 197091 198944 200964 203170 205011 206452 208007 209712 211152 212455 214118 215949
57412 215949 217457 219123 221823 225067 227423 228740 230275 232487 234503 235980 237678 239763 241466 242921
57398 242921 245433 249211 252702 255031 257278 260378 263555 265947 268159 271002 274152 277301 281213 286323
57384 286323 291529 295757 299710 304781 311072 317619 323749 329181 333547 336809 339519 341972 343858 345328
57370 345328 347402 350601 354138 357123 359609 361841 363597 364964 366696 369077 371472 373686 376589 380715
57356 380715 385457 390362 395899 402126 407946 412719 417429 423210 429852 436692 443779 451080 457725 463275
57342 463275 468750 475291 482711 490349 498312 506797 515196 522989 530674 538832 547211 555595 564493 574012
57328 574012 583237 591764 600649 610685 621004 630645 640229 650568 660851 669898 678339 687738 698214
57315F98214J0375R839J0004J0694J1364J2056J2616J2498J2052J2385J3456J3930
57303H39483J3430J3129J3613J3995J3800J3835J4450J4712J4119J3531J3630
57292I91727J4031J4572J5858J7737J8876J8671J8126J8129J8273J8068J7902
57281A181970J8017J8010J7974J8758K0425K1760K2009K1870K2180K2828K3492
57270A409293K4131K4414K3859K2957K2849K3631K4298K4479K4800K5382K5627
57259A675720K5709K6500K7805K8377K7984K7729K8077K8371K8528K9185K9910
57248A983895K9429K8137K8102K9878L1539L1776L1720L2632L3832L4309L4542
57237B329791L5394L6605L7619L8565L9572M0331M1018M2163M3040M2059L9333
$$ plain form
57315 698214 708589 718428 728432 739126 750490 762546 775162 787660 799712 812097 825553 839483
57303 839483 852913 866042 879655 893650 907450 921285 935735 950447 964566 978097 991727
57292 991727 1005758 1020330 1036188 1053925 1072801 1091472 1109598 1127727 1146000 1164068 1181970
57281 1181970 1199987 1217997 1235971 1254729 1275154 1296914 1318923 1340793 1362973 1385801 1409293
57270 1409293 1433424 1457838 1481697 1504654 1527503 1551134 1575432 1599911 1624711 1650093 1675720
57259 1675720 1701429 1727929 1755734 1784111 1812095 1839824 1867901 1896272 1924800 1953985 1983895
57248 1983895 2013324 2041461 2069563 2099441 2130980 2162756 2194476 2227108 2260940 2295249 2329791
57237 2329791 2365185 2401790 2439409 2477974 2517546 2557877 2598895 2641058 2684098 2726157 2765490
57226B765490L6987L6085L5278L3418L1483L0666L0519L0358L0669L1808L2885
57215C125646L3399L4388L6685L9468M1820M4160M6813M8735M9108M8776M8713
57204C597711M8409M7227M5981M5667M5814M5467M4778M4278M3640M2434M1118
57193D092524M0133L8902L6820L4302L2033L0212K9202K9558L0643L0704K9246
57182D454279K7875K7844K8380K8447K8480K9138K9950L0412L0965L1600L1117
57171D778487K9103K7110K6441K6234K5250K4036K3731K4046K4136K4368K5860
57160E058802K9212L4832M3056N2545N9903O2436O0302N4969M7123L7399K7435
57149E568014J8480J0094J759n692j1602j6901k2269k6379k7746k6981k5585k3858
$$ plain form
57226 2765490 2802477 2838562 2873840 2907258 2938741 2969407 2999926 3030284 3060953 3092761 3125646
57215 3125646 3159045 3193433 3230118 3269586 3311406 3355566 3402379 3451114 3500222 3548998 3597711
57204 3597711 3646120 3693347 3739328 3784995 3830809 3876276 3921054 3965332 4008972 4051406 4092524
57193 4092524 4132657 4171559 4208379 4242681 4274714 4304926 4334128 4363686 4394329 4425033 4454279
57182 4454279 4482154 4509998 4538378 4566825 4595305 4624443 4654393 4684805 4715770 4747370 4778487
57171 4778487 4807590 4834700 4861141 4887375 4912625 4936661 4960392 4984438 5008574 5032942 5058802
57160 5058802 5088014 5122846 5165902 5218447 5278350 5340786 5401088 5456057 5503180 5540579 5568014
57149 5568014 5586494 5596588 5598347 5592655 5581053 5564152 5541883 5515504 5487758 5460777 5435192 5411334
57137E411334k1722k0232k0372k1542k2952k5240k9125l3853l8801m4946n2717
57126E079832n9889o3833o4565o3442o0239n4128m6439l9760l4864l0850k7710
57115D534113k6267k5887k4431k0513j4312o610J518Q792J5171K2748L3872M9327
57103D547521O9460R5807J30083J73160K26930K95936L85416M98995O39695Q11028
57093G874031J014725J248855J509782J793308K091245K388703K665897K897928
57085B3484474L051047L090357L007338K841803K662948K514968K377383K178716
57077D5209034J849152J366388P65210J14142n19540j094746j599524k036274
57069D4053842k405217k698426k903872l012608l024552k950405k808292k617738
$$ plain form
57137 5411334 5389612 5369380 5349008 5327466 5304514 5279274 5250149 5216296 5177495 5132549 5079832
57126 5079832 5019943 4956110 4891545 4828103 4767864 4713736 4667297 4627537 4592673 4561823 4534113
57115 4534113 4507846 4481959 4457528 4437015 4422703 4416093 4417611 4426403 4441574 4464322 4498194 4547521
57103 4547521 4616981 4712788 4842871 5016031 5242961 5538897 5924313 6423308 7063003 7874031
57093 7874031 8888756 10137611 11647393 13440701 15531946 17920649 20586546 23484474
57085 23484474 26535521 29625878 32633216 35475019 38137967 40652935 43030318 45209034
57077 45209034 47058186 48424574 49189784 49303926 48784386 47689640 46090116 44053842
57069 44053842 41648625 38950199 36046327 33033719 30009167 27058762 24250470 21632732
57061B1632732k396407k160481j924289j697927j486748j293940j122112r72089
57053H578739q42411p31229o37269n58426m91312m33193l83026l39875l01985
57044C860013k68204k38734k13572j91593j71885j54587j39655j26166j13551
57035B242066j02191r2069q2168p1912o1929n2610m3102l2425k0568p847O184
57024A681429K2869M3660O7679Q7970R1639O8108J9603l8181q7102j17584j29798
57013A710292j28313j18297j04623r0831p8149o6394n5640m6401l8921l3134k8811
57002I20778k5289k1797j8452j6061j4712j3535j2145j1040j0261r035p204n689
56990G55558m863l808j852M03K372M574P619J0946J3199J3002R166J457q219j6606
$$ plain form
57061 21632732 19236325 17075844 15151555 13453628 11966880 10672940 9550828 8578739
57053 8578739 7736328 7005099 6367830 5809404 5318092 4884899 4501873 4161998 3860013
57044 3860013 3591809 3353075 3139503 2947910 2776025 2621438 2481783 2355617 2242066
57035 2242066 2139875 2047806 1965638 1893726 1831797 1779187 1736085 1703660 1683092 1675245 1681429
57024 1681429 1704298 1747958 1815637 1903607 1995246 2063354 2082957 2044776 1957674 1840090 1710292
57013 1710292 1581979 1463682 1359059 1268228 1190079 1123685 1068045 1021644 982723 949589 920778
57002 920778 895489 873692 855240 839179 824467 810932 798787 787747 777486 768451 761247 755558
56990 755558 750695 746887 745035 745438 747810 752384 760003 770949 784148 797150 806316 807773 799554 782948
56976G82948k1854k4520k5598k5033k2777j9817j7121j4556j1692q756n993l025
56964E82206L98L791O722R489J2603J6314K0866K6062L0133L0141K4206J2905
56952G75836j337j5312k5783l0983l1930l1099k9581k6736k2504j8147j4311j0277
56940E17836n776j759J396M745Q962J3258J7083K1407K7118L3321L8001L9089
56928G14681L4393K2447M921j3088k6690l4470l7671l7611l5224l1840k8786k6463
56916E04599k4602k2836k0565j7237j3383j0439q970q097p009n913m995l893k765
56903C53895k405k717k553j678j259j607j270N83K652L664M379N987Q008R344
56889C75023J0211J1452J3068J4773J6849J8856J8651J4364O801j416q291j2970
$$ plain form
56976 782948 761094 736574 710976 685943 663166 643349 626228 611672 599980 591224 585231 582206
56964 582206 582604 586395 593117 602606 615209 631523 652389 678451 708584 738725 762931 775836
56952 775836 774499 759187 733404 702421 670491 639392 609811 583075 560571 542424 528113 517836
56940 517836 512060 510301 511697 516442 525404 538662 555745 577152 604270 637591 675592 714681
56928 714681 749074 771521 776442 763354 736664 702194 664523 626912 591688 559848 531062 504599
56916 504599 479997 457161 436596 419359 405976 395537 386567 378470 371461 365548 360553 356660 353895
56903 353895 351490 348773 346220 344542 343283 341676 340406 340989 343641 347305 351684 357671 365679 375023
56889 375023 385234 396686 409754 424527 441376 460232 478883 493247 500048 498632 490341 477371
56877D77371j5017j4701j3369j2059j0380p721m703k171L32L683P564J1116J4557
56864D34502J8727K3638K8701L4059M0222M6345M9793M7461L7525K0821J160j6568
56852G66386k9369l6966l9836l8120l2860k6502k0755j5202r089l114J896O731
56840E23200J2684J9711K7088L5009M4112N4290O4980P5368Q2673Q1398O6665
56829A087178L8798L849k9927n5762p0362p4481p1685o5451n7368m8056l8434
56818F18299k9252k0557j2587o064p21N169J2605K0568K8044L5928M5309N4949
56806G51690O1611O1872N2798L3038N421k2824m4655n7709o3424o3483n9147n2467
56794F02721m5552l8896l2083k5409j9345j3486p649k886L55L804R116J5365K0784
$$ plain form
56877 477371 462354 447653 434284 422225 411845 404124 399421 397250 397582 401265 408829 419945 434502
56864 434502 453229 476867 505568 539627 579849 626194 675987 723448 760973 781794 782954 766386
56852 766386 737017 700051 660215 622095 589235 562733 541978 526776 517687 514573 516469 523200
56840 523200 535884 555595 582683 617692 661804 716094 781074 856442 939115 1020513 1087178
56829 1087178 1125976 1129825 1099898 1044136 973774 899293 827608 762157 704789 656733 618299
56818 618299 589047 568490 555903 549839 549118 554287 566892 587460 615504 651432 696741 751690
56806 751690 813301 875173 927971 961009 966430 943606 898951 841242 777818 714335 655188 602721
56794 602721 557169 518273 486190 460781 441436 427950 420301 417415 417770 421574 430690 446055 466839
56781D66839K5550L0173L2414K8862J9191O292p261k0164l0394l5503l5466l2847
56769D47686k9715k6340k2912k0228j8326j6383j4275j2533j0815q326n689m429
56757B57715m545m518l781l178k992k576k072k432l415l570k510j355o78K5O55
56742B20773L47o17p75J29O73J80l17j28j2n03q96p20o02q93r18l69l0l45o27
56723B14350l40Q4L81J014J989K417J971J586J929K363K152J594J250R90N91M32
56707B34753Q44J461J796J872J843J562R16R0o42j040q71k28L09L52K22K62J79
56690B43680j53m4Q89J695J411O35M60N69J3q29q85m41o41j251j016j8K96m75
56672B43895j172j156j048j182j085p19o04m96M15J847K559K333K165K427K452
$$ plain form
56781 466839 492389 522562 554976 583838 603029 609321 602060 581896 551502 515999 480533 447686
56769 447686 417971 391631 368719 348491 330165 313782 299507 286974 276159 267833 262144 257715
56757 257715 253170 248652 244871 241693 238701 236125 234053 231621 228206 224636 222126 220771 220093 220118 220773
56742 220773 221120 220503 219728 219857 220530 220710 220393 220265 220253 219750 218854 218134 217532 216639 215721 215352 215322 214977 214350
56723 214350 214010 214094 214475 215489 217478 219895 221866 223452 225381 227744 229896 231490 232740 233730 234321 234753
56707 234753 235597 237058 238854 240726 242569 244131 245047 245137 244495 243455 242584 242356 242665 243017 243239 243501 243680
56690 243680 243527 243483 244372 246067 247478 248113 248573 249142 249155 248326 247441 247000 246359 245108 244092 244074 244370 243895
56672 243895 242723 241567 240519 239337 238252 237533 236929 236433 236848 238695 241254 243587 245752 248179 250631
56657B50631K056J771J505P26l9K66J193J190K20j81M42Q01K33l40k89r2J84J200
56639B61477K593K895J804O35L7p23j760k063j613j784k803l074j973j090j533
56624B51025k205j996j664k064k416j938j527k148k974k736j685p97j47N27P54
56609B28009Q9q29j125q43m62j10P3k05n69j97O67P86l2m56J18N21n6o01m5R88
56589B25721J431J475J779K144K064J659J137L70l10o5R62J427Q29L47Q73J586
56573B43429J559J319J683K274K382K228K362K653K857L262M047M853N590O663
56559B87161P999R084J0168J1906J3443J2636Q927M311P53j591k992l062k139
56546C56604j813k724l509l137k542k726k971k410j735j828k163k044k051k781
$$ plain form
56657 250631 252687 254458 255963 256689 256650 256916 258109 259299 259519 259338 259780 260581 260814 260474 260185 260093 260277 261477
56639 261477 264070 266965 268769 269404 269441 268718 266958 264895 263282 261498 258695 255621 253648 252558 251025
56624 251025 248820 246824 245160 243096 240680 238742 237215 235067 232093 229357 227672 226875 226728 227255 228009
56609 228009 228098 227269 226144 225301 224839 224729 224802 224597 224028 223831 224498 225284 225252 224796 224914 225435 225379 224778 224733 225721
56589 225721 227152 228627 230406 232550 234614 236273 237410 237780 237470 237405 238367 239794 240623 240970 241843 243429
56573 243429 244988 246307 247990 250264 252646 254874 257236 259889 262746 266008 270055 274908 280498 287161
56559 287161 295160 304244 314412 326318 339761 352397 361324 365635 366388 364797 361805 358743 356604
56546 356604 354791 352067 348558 345421 342879 340153 337182 334772 333037 331209 329046 327002 324951 322170
56532C22170l484l382l117l482l955l834l559l646l499k604j673j328r36JN91
56517B84263K0r91j460j726k394l007k991k784k780k438j551j091j564j947j469
56502B56090r68j187j310o39j63p81j424p07P37J330Q99L53Qk83k63J32K31j51
56484B51904o4R09J631J242N87O23P66K10n36p41o94o01K35J821K688K070J249
56467B63299J329J439O45k15k58l27j153j587o71L18n8r26p92j81l01o38r5P74
56449B60602R35R19J555K012J277K99M20R77O71pOP6p83j647j193l01n09j109
56431B64200m37R14R44m26j446j401r94m34N57J346J148O22P62J014L99m41l50
56414B65977K02J78R5Q82J712J316M06M55J066R13K73K38M08j99q81l85O24O93
$$ plain form
56532 322170 318686 315304 312187 308705 304750 300916 297357 293711 290212 287608 285935 284607 283671 283672 284263
56517 284263 284283 283292 281832 280106 277712 274705 271714 268930 266150 263712 262161 261070 259506 257559 256090
56502 256090 255122 253935 252625 251986 251823 251042 249618 248911 249648 250978 251877 252230 252238 251955 251692 251824 252055 251904
56484 251904 251840 252749 254380 255622 256209 256832 257598 257808 257272 256531 255837 255236 255471 257292 259980 262050 263299
56467 263299 264628 266067 266712 266497 266239 265912 264759 263172 262501 262819 262761 261835 261043 260862 260561 259923 259828 260602
56449 260602 261537 262456 264011 266023 267300 267599 268019 268996 269667 269660 269666 269742 268959 267312 266119 265818 265309 264200
56431 264200 263763 264677 265621 265195 263749 262348 261354 260920 261477 262823 263971 264593 265355 266369 266768 266327 265977
56414 265977 266179 266357 266452 267334 269046 270362 270768 271223 272289 273202 273475 273713 274121 273922 273041 272656 273280 273973
56396B73973K09N01J255J349J226J835K270J202l64m80M63O99M05J124K541K861
56380B91069J870R24L89l09p28o7Q43P78M51J096J794J035j33L87K059K657K037
56363C06152J691J495K46j198q77O99J254N66K59L14o25j918j502K82J015K62
56347C08115j16M17N21R2M91J596J893J509J946K919K816K084K707M358M755L774
56331C39877L568M469M594L689L612M525M414K918K007K224J864O11L01J306J575
56316C81554K48j065j422j771k345j996q34l69m91N59K700L806L425L423M430
56301C89852N038N021N825P290P394N842M527L896K540Q15R42K798L563K445J915
56286D49703L212M542M836N418O725P139O341O222P233P524O740O916Q479R250
$$ plain form
56396 273973 274182 274683 275938 277287 278513 280348 282618 283820 283456 282976 283439 284138 284543 285667 288208 291069
56380 291069 292939 293863 294252 293943 293215 293148 293991 294769 295220 296316 298110 299145 299012 299399 301458 304115 306152
56363 306152 307843 309338 309584 308386 307509 308208 309462 310028 310287 310601 309976 308058 306556 306838 307853 308115
56347 308115 307999 308416 308937 309029 309520 311116 313009 314518 316464 319383 322199 324283 326990 331348 336103 339877
56331 339877 343445 347914 352508 356197 359809 364334 368748 371666 373673 375897 377761 378372 378673 379979 381554
56316 381554 381802 380737 379315 377544 375199 373203 372369 372000 371509 372068 374768 378574 381999 385422 389852
56301 389852 394890 399911 405736 413026 420420 426262 430789 434685 437225 438040 438982 441780 445343 447788 449703
56286 449703 452915 457457 462293 467711 474436 481575 487916 494138 501371 508895 515635 522551 531030 540280
56272E40280Q682R017J0933J2045J1330J1015J2389J3692J3942J4969J7698K0201
56260F96193K1427K3248K6886L0845L4261L8669M4591N0012N4214N9506O7135
56249A146987P5127Q2112Q9595R8280J05899J11032J15540J20810J24836J25437
56239B195655J23233J19137J11978J00792Q6564O9898M9968K7447N280j5046l4675
56228B840231n3531o9155q0943r1465j01693j09019j12059j13199j14087j12756
56218A882324j07834j01576r6013q9919q2264p4971o9508o4296n8101n2434m8255
56207A037153m3905l8713l4725l2584k9753k5255k1929k1281k0495j7526j4716
56196G36271j4219j4071j2224j0295r957r545p680o328o838o948n030l337l558
$$ plain form
56272 540280 548962 557979 568912 580957 592287 603302 615691 629383 643325 658294 675992 696193
56260 696193 717620 740868 767754 798599 832860 871529 916120 966132 1020346 1079852 1146987
56249 1146987 1222114 1304226 1393821 1492101 1598000 1709032 1824572 1945382 2070218 2195655
56239 2195655 2318888 2438025 2550003 2650795 2737359 2807257 2857225 2884672 2889952 2874906 2840231
56228 2840231 2786700 2717545 2636602 2545137 2443444 2334425 2222366 2109167 1995080 1882324
56218 1882324 1774490 1672914 1576901 1486982 1404718 1329747 1260239 1195943 1137842 1085408 1037153
56207 1037153 993248 954535 919810 887226 857473 832218 810289 789008 768513 750987 736271
56196 736271 722052 707981 695757 685462 675505 665960 658280 651952 645114 638166 633136 629799 626241
56183F26241l390j137N41o60k348j774n35q62j212K91J773J257O91K200L847L316
56167F28239K291L094M460M660N204P360Q782P677O593P916R482Q938Q471J0643
56153G23810J3432J4173J4610J7293K0655K2551K4955L0254L6435M0934M5683
56142A004785N3217O1286O6372O9431P3290P7682Q1628Q7017R4638J00021R8325
56131A867692R0297P9164O5703N1139M0457L7033L7515L7003L5253L2818K6109
56120B400183J2745k471j3302k0009k5756k9795l1044l4173m4518o0060p5003
56109B076797q7846r9254j05912j04146r6651q8517p9612o7657n5370m7032m0990
56098A203810l3063k4496j9238j6190j1612o593m717m856l372r66l40M8K943O027
$$ plain form
56183 626241 622851 621714 622255 621595 619247 617473 616938 616076 614864 615155 616928 618185 618876 621076 624923 628239
56167 628239 630530 633624 638084 642744 647948 655308 664090 671767 678360 686276 695758 704696 713167 723810
56153 723810 737242 751415 766025 783318 803973 826524 851479 881733 918168 959102 1004785
56142 1004785 1058002 1119288 1185660 1255091 1328381 1406063 1487691 1574708 1669346 1769367 1867692
56131 1867692 1957989 2037153 2102856 2153995 2194452 2231485 2269000 2306003 2341256 2374074 2400183
56120 2400183 2412928 2410457 2397155 2377146 2351390 2321595 2290551 2256378 2211860 2151800 2076797
56109 2076797 1988951 1889697 1783785 1679639 1582988 1494471 1414859 1347202 1291832 1244800 1203810
56098 1203810 1170747 1146251 1127013 1110823 1099211 1092618 1087901 1083045 1079673 1078707 1078367 1078415 1081358 1087385
56084A087385N806M590O323Q981Q531O924Q313J0847J0295Q455R656J2269J2072
56071A200447J0766J2633J5974J6508J5953J8473K1898K1441J8906J9056K0323
56060A392378J8311J5219J6062J8829J8163J5548J6074J8322J7569J5701J7648
56049A579824K1312K1455K0176K2813K6996K6784K4195K5278K8374K7855K5940
56038A851002K8695L3822L4670L2873L4466L7251L5178L1505L3869L9754M1089
56027B234174L9778M3972N2041N5456N4790N7537O2724O3360O1598O5410P2625
56016B863465P4498P2596P5559Q1891Q3227Q1969Q7576R7779J02116J01842J07120
56005C829638J16687J20327J19580J25336J36498J42189J43718J52370J66819
$$ plain form
56084 1087385 1093191 1097781 1104104 1113085 1121616 1128540 1136853 1147700 1157995 1166450 1176106 1188375 1200447
56071 1200447 1211213 1223846 1239820 1256328 1272281 1290754 1312652 1334093 1352999 1372055 1392378
56060 1392378 1410689 1425908 1441970 1460799 1478962 1494510 1510584 1528906 1546475 1562176 1579824
56049 1579824 1601136 1622591 1642767 1665580 1692576 1719360 1743555 1768833 1797207 1825062 1851002
56038 1851002 1879697 1913519 1948189 1981062 2015528 2052779 2087957 2119462 2153331 2193085 2234174
56027 2234174 2273952 2317924 2369965 2425421 2480211 2537748 2600472 2663832 2725430 2790840 2863465
56016 2863465 2937963 3010559 3086118 3168009 3251236 3333205 3420781 3518560 3620676 3722518 3829638
56005 3829638 3946325 4066652 4186232 4311568 4448066 4590255 4733973 4886343 5053162
55996E053162J75260J78938J90130K07743K19106K25186K38951K59446K73646
55987G021568K83502L03750L33112L56125L73508M01133M38812M71246N00237
55978A0482993N43201N99228O50897P00356P67299Q50737R31573J013903J122253
55969A7662440J257065J397677J550718J747302J991179K262855K577379K980635
55961C3427250L486502M081677M794229N683536O758031P986620R401014J1099878
55953H6718737J3153860J5619754J8645866K2413934K6961717L2205198L7994354
55946B53713420M3587788M6778124M4144675L3240316J5064723n832171k4023749
55939D06673126l6184381m1941669m2717184m0307564l6232116l1589112k7015371
$$ plain form
55996 5053162 5228422 5407360 5597490 5805233 6024339 6249525 6488476 6747922 7021568
55987 7021568 7305070 7608820 7941932 8298057 8671565 9072698 9511510 9982756 10482993
55978 10482993 11026194 11625422 12276319 12976675 13743974 14594711 15526284 16540187 17662440
55969 17662440 18919505 20317182 21867900 23615202 25606381 27869236 30446615 33427250
55961 33427250 36913752 40995429 45789658 51473194 58231225 66217845 75618859 86718737
55953 86718737 99872597 115492351 134138217 156552151 183513868 215719066 253713420
55946 253713420 297301208 344079332 388224007 421464323 436529046 430696875 406673126
55939 406673126 370488745 328547076 285829892 245522328 209290212 177701100 150685729
55932A50685729k2777689j8995458j5758842j3077110j0862950r030046p541835
55925E2641799o351128n374134m552764l879567l339936k886925k491199k161844
55917B1604302j899032j673362j467976j296331j162383j043785r28873q32152
55909A1300408p59286o92176o21795n62424n20722m81663m37129l99088l73193
55900F452932l46997l15080k89444k74653k57879k33423k13054k02614j91578
55891D128210j74875j62487j58307j51255j36422j24246j19903j13700j00611
55882B886404q9799q5974q0090o7550n7857n7372n9229n8539o1147o9165p3817
55871B125865p0871o8096o9897o9359o2831n7602n7584n5742m8270m2359m2503
$$ plain form
55932 150685729 127908040 108912582 93153740 80076630 69213680 60183634 52641799
55925 52641799 46290671 40916537 36363773 32484206 29144270 26257345 23766146 21604302
55917 21604302 19705270 18031908 16563932 15267601 14105218 13061433 12132560 11300408
55909 11300408 10541122 9848946 9227151 8664727 8144005 7662342 7225213 6826125 6452932
55900 6452932 6105935 5790855 5501411 5226758 4968879 4735456 4522402 4319788 4128210
55891 4128210 3953335 3790848 3632541 3481286 3344864 3220618 3100715 2987015 2886404
55882 2886404 2796605 2710631 2630541 2562991 2505134 2447762 2388533 2329994 2268847 2199682 2125865
55871 2125865 2054994 1986898 1917001 1847642 1784811 1727209 1669625 1613883 1565613 1523254 1480751
55860A480751m2477l8228l5557l7844l8902l5218l2752l4553l3977k7521k2356
55849A101366k3734k6297k5066k3920k6058k6854k3460k1148k3117k3923j9784
55838H38005j5692j5770j6141j3647j2187j4092j4588j1023q398r777j0402p275
55826F89013n129o858p455l886j671m986r000q936q100j0104j1489r077o746p898
55812E87678q736n795k833l450m150j388J510J162R59M300P644P029N309O203
55798E95442P202M908J660M03j387o283j0947j1790j1335j2945j4357j2471r448
55785E18652q228o855l138j82j493n060p533r785j3153j4999j3278j0903j0529
55772D13516r703o155k954l150m188k923j422k440l859l076k363m343o617o332
$$ plain form
55860 1480751 1438274 1400046 1364489 1326645 1287743 1252525 1219773 1185220 1151243 1123722 1101366
55849 1101366 1077632 1051335 1026269 1002349 976291 949437 925977 904829 881712 857789 838005
55838 838005 822313 806543 790402 776755 764568 750476 735888 724865 716467 706690 696288 689013
55826 689013 683884 677026 669571 665685 664014 659028 650028 641092 632992 622888 611399 602322 595576 587678
55812 587678 578942 573147 570314 566864 562714 561326 562836 563998 564957 569257 576901 583930 589239 595442
55798 595442 602644 607552 609212 609615 608228 601945 590998 579208 567873 554928 540571 528100 518652
55785 518652 510424 503569 500431 500249 498756 493696 486163 476378 463225 448226 434948 424045 413516
55772 413516 403813 397658 394704 391554 387366 384443 383021 380581 376722 373646 371283 366940 360323 353991
55758C53991n732p640r702q758o852p259q412p402n815o494p912p168n357m778
55744B54710m129j511J018Q62l29PO01m21j187K54J513O6j689o33J334R04o46
55727B50724l52O64k91k109k180j415k065l123k667j964k665k873p45J155K1j834
55711B28281q93J352J434K20O68J891J185l37K34J940J704J7m03L8j003k828k906
55694B30594j698j525k035j327j75n32j340k76J792K439K193L125M560M597M229
55679B44621N579P623P937O999O537N497K215j337k282j953l532o188o665n151
55665B59900m522m870l977k182j725j987l94K489L615K764K495L179K728J121
55651B58634O06J368J166n64k151l153m673o301o440n567n648o613o713n904n567
$$ plain form
55758 353991 348259 340619 330917 322159 315307 308048 299636 292234 286419 279925 272013 264845 259488 254710
55744 254710 250581 249070 250088 250950 250621 250628 251229 250808 249621 249875 251388 251454 249765 249132 250466 251370 250724
55727 250724 250372 251036 250745 248636 246456 245041 242976 239853 237186 235222 232557 229684 228939 230094 230115 228281
55711 228281 227388 228740 230174 230394 231062 232953 234138 233801 234035 235975 237679 237696 237293 237331 236328 233500 230594
55694 230594 228896 227371 225336 224009 223834 223302 221962 221686 223478 225917 228110 231235 235795 240392 244621
55679 244621 250200 257823 265760 272759 279296 284793 287008 285671 283389 281436 277904 271716 265051 259900
55665 259900 255378 250508 246531 244349 242624 240637 240243 242732 246347 249111 251606 254785 257513 258634
55651 258634 259240 260608 261774 261210 259059 255906 251233 244932 238492 232925 227277 220664 213951 208047 202480
55636B02480n496m603l743m362n206m031j724r68j629j390j33K74j04M06J335
55621A71106P34r14j323n95p68j644j166K89K03j561k477j771j263j666j752j303
55605A54129j409j653n79J066J063m05j110q32j320k333j728L64J329M71j70J92
55589A47075J5j070j311j94O27N27Q03J762J986J305J351K429K788J771R35J285
55573A62084K047K723L821N113N629N686O422P227O335M040K500K238J579j95
55559B17249j969l177m370n268m978m251m708n799n429l577k349k369k154j230
55545A65621q21j123q58J39O81P55J455K355J889L97k41N6k82j072n72P99O06
55528A69784j363k561k056j846l033m086l951l606l508k664j244j014k099k402
$$ plain form
55636 202480 196984 192381 188638 184276 179070 175039 173315 172347 170718 169328 169195 169469 169365 169771 171106
55621 171106 171840 170926 169603 169008 168240 166596 165430 165719 165922 164361 161884 160113 158850 157184 155432 154129
55605 154129 152720 151067 150488 151554 152617 152212 151102 150270 148950 146617 144889 145253 146582 147053 146883 147075
55589 147075 147090 146020 144709 144515 145142 145669 146472 148234 150220 151525 152876 155305 158093 159864 160799 162084
55573 162084 164131 166854 170675 175788 181417 187103 193525 200752 207087 211127 213627 215865 217444 217249
55559 217249 215280 212103 207733 202465 197487 193236 188528 182729 177300 173723 171374 169005 166851 165621
55545 165621 164800 163677 162819 162958 163639 164394 165849 168204 170093 170490 170249 170305 170023 168951 168379 169178 169784
55528 169784 168421 165860 163804 161958 158925 154839 150888 147282 143774 141110 139866 138852 136753 134351
55514A34351j237n73j462k292j813r96o65o4R30R45k53q89k40J01p58j395p80
55497A22910n0j60k34L08L82n52j166n69R2k08o18j34P54J193J158O42n32j486
55479A21730r21N13O89n61j019K35J303P31k98l73j00m91j104j201j050r50n36
55462A16597Q2J01l78k87L93M94j06k15L40L57l03l57L46M18l69n91O2K00m77
55443A16307n69J17O3p20j60K045L227J908J04k08K2n43r74j87P53N99J46M58
55425A22388P67R0q32r67o86n06J07J239J714J150R31J772K328J689J064J423
55409A33671J559L10j240j642j335j325j301q04n97j200j661j313j111j753k185
55394A18073j445l39K19O85J338J163p2o23N73J889J474N4o69o65q03q71l86J8
$$ plain form
55514 134351 133114 132541 131079 128787 126974 125978 125313 125249 126179 127124 126871 125982 125742 125843 125085 123690 122910
55497 122910 122860 122700 122466 122774 123156 122604 121438 120869 120961 120753 120135 120001 120755 121948 123106 123748 123216 121730
55479 121730 120809 121322 122011 121450 120431 120666 121969 122700 122402 122029 121929 121438 120334 119133 118083 117133 116597
55462 116597 116679 116780 116402 116115 116508 117002 116896 116681 117021 117378 117075 116718 117064 117482 117113 116522 116584 116784 116307
55443 116307 115738 115855 115918 115198 115038 117083 120310 122218 122322 122114 122136 121593 120619 120432 121185 121784 121930 122388
55425 122388 123155 123245 122413 121446 120760 120254 120361 121600 123314 124464 125395 127167 129495 131184 132248 133671
55409 133671 135230 135540 134300 132658 131323 129998 128697 127893 127296 126096 124435 123122 122011 120258 118073
55394 118073 116628 116289 116508 117193 118531 119694 119622 118999 119572 121461 122935 122989 122320 121655 120852 119981 119595 119613
55376A19613k39l35M30J109O78j45k95k30q23j610j651j073m45J77N24j35j457
55359A14093j855r16k09n68o26N79J662J193K8m85o39r72o39Q44K020J612N79
55342A15701J79j71j115j403n0J303P21q14j027M5O12K65P8L26M10M01O45M72
55324A16578p40j939j678l65M67M45K34o6p08j150p48L4M48P17J276J652J368
55307A15825R83J018R48L69p2M5Q0j41K72J246J074o87j814p11R69J058J95R4
55289A20751M10l9n58J52J270J107J4m43k41m32q60p20m25p30r59k25O38O06N53
55270A19869J509K223J141n51o87K00k1j204j353k66L89K02K67N46j13j374j604
55253A19173o59R0L19Q31J302O27o08o92K16L20n68p98j1K57m56o89K37J065Q90
$$ plain form
55376 119613 119374 119039 119469 120578 121256 121111 120816 120586 119763 118153 116502 115429 114984 115161 115685 115550 114093
55359 114093 112238 111322 111113 110545 109919 110498 112160 113353 113381 112896 112257 111285 110646 111490 113510 115122 115701
55342 115701 115880 115709 114594 113191 113141 114444 115165 114351 113324 113369 113981 114246 114324 114650 115060 115461 116106 116578
55324 116578 115838 113899 112221 111856 112323 112768 113002 112936 112228 111078 110330 110364 110812 111529 112805 114457 115825
55307 115825 116808 117826 118774 119143 119071 119116 119196 119055 119327 120573 121647 120960 119146 118435 119404 120462 120657 120751
55289 120751 121161 121122 120564 120716 121986 123093 123107 122664 122423 121991 121131 120411 119986 119256 118297 118072 118710 119316 119869
55270 119869 121378 123601 124742 124191 123504 123704 123683 122479 121126 120860 121249 121451 121718 122264 122151 120777 119173
55253 119173 118514 118604 118923 119754 121056 121683 121075 120383 120599 120919 120351 119553 119542 119799 119343 118654 118891 119956 120846
55234A20846L34r5p23j277q18L13N42l95r33l10K77j21p33o03k1L79N58N32J24
55215A17876l36k11L15N50O07J070J478Q18n16r77j83O79Q44P04M60j16m97K30
55197A22795J530J760O16m69o81p55j171j227n27J92L84M93Q03Q38L42k20n51
55180A24152q37r40m15M88R44P39L18j61o68n95L96J198N65p59r40N5M92k29p95
55161A23008l11M88Q38J013J224J044M31j21o99j801k861k587j015L67Q05R61
55145A20784J198R01K6m14J3M71L95K73M18L98J44K17N41K72n41o94K40J092Q81
55126A26615J03l70n06n47l43J31M94O13P26O91P7q73j339j100o26q0O38J103
55108A25407P83J61Q7L29J28j58L55J128Q00l32m90P83J974K132J995K139J945
$$ plain form
55234 120846 121180 121085 120362 119085 118267 118580 119122 118727 117794 117484 117761 117640 116907 116304 116283 116662 117220 117752 117876
55215 117876 117540 117329 117644 118194 118801 119871 121349 122167 121651 120674 120491 121170 122014 122718 123178 123062 122565 122795
55197 122795 124325 126085 126701 126232 125551 124796 123625 122398 121871 122063 122447 122940 123743 124581 124923 124703 124152
55180 124152 123315 122375 121960 122448 123392 124131 124449 124288 123620 123025 123421 124619 125184 124425 123485 123540 124032 123803 123008
55161 123008 122697 123185 124023 125036 126260 127304 127735 127614 126915 125114 122253 119666 118651 119018 119823 120784
55145 120784 121982 122883 122909 122495 122508 122979 123374 123647 124065 124463 124607 124824 125365 125637 125096 124402 124642 125734 126615
55126 126615 126718 126348 125842 125295 124952 125083 125577 126190 126916 127607 127684 126811 125472 124372 123746 123666 124304 125407
55108 125407 126190 126351 126438 126767 126895 126737 127092 128220 129020 128688 128198 128981 130955 133087 135082 137221 139166
55091A39166J071K42j67o65j214r03K81R96N34j65k06Q2K21M44P82O44j3l86j54
55072A40590J19K57P32J313J029j49j056j152j071j109p83k59m01j054j070m72
55056A35464o03j579j756n30N20K63k22K41R74R98P75J004J105L90n47r06r87
55039A34604j216j097l09K89p9q32j055q07n10q0M62N86K16M1J75j82j077j209
55021A27920N1J460J731J197O66J3r05j261m52P09J168J035Q83P33O05R46J579
55004A38078J422K02p95o78l25p36j266q16L37J182J551J837J933J577J062P20
54988A45285L76%k9J83o3p12q16l01l31j243j720j031l00m51n96J42R21P88N16
54969A40618J080J730J348N57O43J383J718J635J661J378K06j017j007k9N59K81
$$ plain form
55091 139166 140237 140479 140312 139647 138433 137530 137811 138807 139341 139176 138970 139052 139273 139717 140499 141143 141130 140744 140590
55072 140590 140709 140966 141698 143011 144040 143891 142835 141683 140612 139503 138720 138461 138060 137006 135936 135464
55056 135464 134861 133282 131526 130996 131516 131779 131557 131798 132772 133770 134545 135549 136654 137044 136497 135591 134604
55039 134604 133388 132291 131982 132271 132192 131360 130305 129498 128988 128908 129370 129956 130172 130213 130388 130206 129129 127920
55021 127920 127971 129431 131162 132359 133025 133038 132133 130872 130420 131129 132297 133332 134215 134948 135553 136499 138078
55004 138078 139500 139702 138907 138229 137904 137168 135902 135086 135423 136605 138156 139993 141926 143503 144565 145285
54988 145285 145661 145661 145632 145815 145752 145040 144224 143923 143592 142349 140629 139598 139298 138847 138251 138393 139314 140102 140618
54969 140618 141698 143428 144776 145333 145976 147359 149077 150712 152373 153751 153957 152940 151933 151904 152463 152744
54953A52744l30r74j517j376k97P55Q41M77O18R30N09l89p65n33l35k73q8q4n58
54934A49355q59l03N53P79O34R73J688K078K215K664L310L742M269N381O669P350
54918A90498P345O801N389L184J347N81k04k225m706n979n984n890n865n088l664
54903A75540k699k541k503k323k405k699k641k162j675j238p66o42r80q04O43
54888A50105K299K477J356P15J447K779L915M887N777O366O708O982O808N721
54874B08342M082K594J210l79j732k350k852m041n311n508m924m809n147m798
54860A74377l716l151l436l418k528j733j792k030j601p91l16k55l84p44j264
54845A47218j454j025l58m7k97r34j576j789j427p95j89L99Q36O54j18n59k7Q91
$$ plain form
54953 152744 152414 151440 149923 148547 148250 149005 149846 150323 150941 151871 152380 151991 151226 150693 150358 150085 149997 149913 149355
54934 149355 148496 148193 148746 149525 150159 151132 152820 154898 157113 159777 163087 166829 171098 176479 183148 190498
54918 190498 197843 204644 210033 213217 214564 215145 214941 212716 208010 202031 196047 190157 184292 179204 175540
54903 175540 172841 170300 167797 165474 163069 160370 157729 155567 153892 152654 151888 151246 150266 149462 150105
54888 150105 152404 154881 156237 156952 158399 161178 165093 169980 175757 182123 188831 195813 202621 208342
54874 208342 212424 215018 216228 215849 214117 211767 208915 204874 199563 194055 189131 184322 179175 174377
54860 174377 170661 167510 164074 160656 158128 156395 154603 152573 150972 150181 149865 149610 149226 148482 147218
54845 147218 145764 144739 144381 144334 144037 143103 141527 139738 138311 137516 137327 137726 138562 139216 139098 138539 138512 139403
54827A39403J341J450J654J529M92q84j539j489j494j599j287p82p58r89o57J45
54811A34536N80O45J130J997K217J478P28O64Q61P28L45k8m00o73n75j87J09K50
54793A44405M63O88P32Q11J181J377P46l82r14l69P25J670K137K052J627J357
54777A58306J359J164P40J006K455L992M293L725L641M312M880N064N408O021
54763B06366O360O147N436M035J946M1r91j882l696n920p114p066o795o659o105
54748A84103n110m223l313j923p58j013k204k481j334j90j5j44M6R7j54J55J407
54731A62946K570K640J963J459J533K298L794N457O302O121N705N498M985L727
54717B16998J968m0k285m289n261n279n266n491n234m298l633l844m183l690k556
$$ plain form
54827 139403 140744 142194 143848 145377 145869 144985 143446 141957 140463 138864 137577 136795 136037 135048 134391 134536
54811 134536 135116 135761 136891 138888 141105 142583 143311 143975 144836 145564 145909 145881 145481 144808 144233 144046 144155 144405
54793 144405 144868 145556 146288 147099 148280 149657 150403 150021 149107 148738 149463 151133 153270 155322 156949 158306
54777 158306 159665 160829 161569 162575 165030 169022 173315 177040 180681 184993 189873 194937 200345 206366
54763 206366 212726 218873 224309 228344 230290 230331 229340 227458 223762 217842 210728 203662 196867 190208 184103
54748 184103 178993 174770 171457 169534 168776 167763 165559 163078 161744 161554 161539 161395 161441 161538 161384 161539 162946
54731 162946 165516 168156 170119 171578 173111 175409 179203 184660 190962 197083 202788 208286 213271 216998
54717 216998 218966 218926 216641 212352 207091 201812 196546 191055 185821 181523 177890 174046 169863 166173 163617
54702A63617j707j597j878j791p79P83J628J051j2k60M5k99j283j672j045l21
54686A54480j01p1j81r09j923k079j119r7L10N03P15N08l9j79N8l22j450k171
54668A45933j924j561j617j353l48N10N41M26Q49J300J116O42L30p9o29n66L57
54651A43927J088Q28K63K67M34J4o07o25j92PQK81P03P30K91j84l50j41J67m9
54631A46860r99j676q47R91J962J441Q11J004R76k73j698j747p77k95n44l82P06
54614A45513J852K048J249K44q3N25J367J474Q20J82j96q83j938k451j947j135
54598A46641o55j47O92J262J094P41Q30J087J064R23P07j07j479k227j560k55
54582A48611N96J025J412J336M41m66m87n8j09m76m44k24n50j148j039r9Q05J133
$$ plain form
54702 163617 161910 160313 158435 156644 155865 156648 158276 159327 159315 159055 159100 158801 157518 155846 154801 154480
54686 154480 154379 154308 154127 153218 151295 149216 148097 148000 148310 148813 149528 150036 149997 149818 149876 149554 148104 145933
54668 145933 144009 142448 140831 139478 139130 139640 140181 140607 141456 142756 143872 144514 144844 144765 144136 143570 143927
54651 143927 145015 145843 146106 146373 146807 146821 146214 145589 145397 145404 145412 145693 146396 147126 147417 147233 146883 146742 146909 146860
54631 146860 145861 144185 143338 144329 146291 147732 148543 149547 150523 150250 148552 146805 146028 145733 145189 144807 145513
54614 145513 147365 149413 150662 150906 150823 151348 152715 154189 155009 155191 154995 154112 152174 149723 147776 146641
54598 146641 145986 145839 146531 147793 148887 149628 150458 151545 152609 153532 154239 154132 152653 150426 148866 148611
54582 148611 149207 150232 151644 152980 153421 152955 152468 152410 152301 151825 151381 151157 150607 149459 148420 148321 149126 150259
54564A50259J128J059Q50M24j72q15j100n62M89R59L92k80p0P05J138J077Q74
54547A56355M80k06o02o1J092J900J926J447R26P76J194J759J682Q48o1p07j401
54530A67347j966j538j50P72L56m42m63JK12L92Q29P60l28j397j332q47j227j986
54512A58993j655k79O59N61J30k70r81j754j683o60M29J056J451J628J193K81
54496A59099l82m89l98l38k56l31p69j142q53j02L94M89N23M83J60q6K69R13J090
54477A58274Q09P70J152J482J542J571J623J475J089N47j63p72n96M10J179R12
54461A71304K53J36K21k82j009j089q01j036j538j285l51J95J43K35N60M22j36
54444A65942k83M9Q2j84N2O28L65q22j458q38j20l37p64m01K59K15l00k87L71
$$ plain form
54564 150259 151387 152446 153296 153720 153548 152733 151633 151071 151560 152519 152911 152631 152561 153266 154404 155481 156355
54547 156355 156835 156629 156027 155966 157058 158958 160884 162331 163257 164033 165227 166986 168668 169516 169455 168748 167347
54530 167347 165381 163843 163693 164465 164821 164379 163916 163917 164129 164521 165350 166110 165782 164385 163053 162206 160979 158993
54512 158993 157338 157059 157718 158279 158409 158139 157158 155404 153721 153061 153490 154546 155997 157625 158818 159099
54496 159099 158717 158228 157830 157492 157236 156905 156136 154994 154141 154039 154433 154922 155445 155928 156088 156002 156271 157184 158274
54477 158274 159083 159853 161005 162487 164029 165600 167223 168698 169787 170334 170171 169399 168803 169213 170392 171304
54461 171304 171557 171693 171914 171632 170623 169534 168733 167697 166159 164874 164523 164718 164861 165096 165656 166078 165942
54444 165942 165659 165708 165790 165606 165658 166286 166651 165829 164371 163533 163413 163076 162312 161911 162170 162385 162085 161798 162169
54425A62169R25J055J138J364J437J159P82O16O11M00k45r75j068k98N91P56L70
54408A70787L38J017J812J999J446N51j09j28K44K40l42o40R1J217J587J193R26
54391A82229R19L88p94j579j169n5P71Q13J24r53j765j721j022m84n22p20n36
54374A73924R7Q56J326J246Q83R17J474J674Q23m34r50o86m20k35M37J470J988
54357A84390J758J454J388J167P83R02J670K264K110J653J540J753J941J897J455
54342B08125N75k93o01n57q99j745k469k723k777k728k285j504q98n97l19j70
54326A88135n95j349j529r16l55m75r86j398j557j186K9J561K178J445K80l58
54310A82924n07n78o11n73o31o99m67j68m62j263j628j218q14r20q97j95N82O56
$$ plain form
54425 162169 163094 164149 165287 166651 168088 169247 170029 170645 171256 171656 171411 170436 169368 169070 169661 170417 170787
54408 170787 171125 172142 173954 175953 177399 177950 177841 177713 177957 178197 177855 177215 177306 178523 180110 181303 182229
54391 182229 183148 183536 182742 181163 179994 179939 180710 181523 181647 180694 178929 177208 176186 175702 175180 174460 173924
54374 173924 174021 174877 176203 177449 178332 179249 180723 182397 183220 182786 181836 181150 180730 180495 180932 182402 184390
54357 184390 186148 187602 188990 190157 190940 191842 193512 195776 197886 199539 201079 202832 204773 206670 208125
54342 208125 208700 208407 207806 207249 206350 204605 202136 199413 196636 193908 191623 190119 189221 188624 188305 188135
54326 188135 187540 186191 184662 183746 183391 182916 181930 180532 178975 177789 177818 179379 181557 183002 183282 182924
54310 182924 182417 181839 181228 180655 180024 179325 178858 178690 178228 176965 175337 174119 173305 172385 171488 171293 171875 172531
54292A72531L31L32N88N48K82L22P28J063J094Q91M45k23p22n96N2O53Q31P13
54274A79863O29O85P01M67Q7j00K9K65M98Q82J246J030K63o7O03J311R01j52m96
54255A88645l5J50j54K9R62J549J041J26k87k37j32r9l31j105j962j894p60L71
54237A85877P23N78L01k51r05r64m36k22n62n01L87J048N75l98r06j082j357j273
54219A80632l35Q52J420J520J610J321J81j129j531j125p97p08l46K32L72K6j58
54202A82037N2J06m11j201j658j472q22k29q0j23J89P58Q62L31r5OJ12r5M2R59
54182A79268J798J589P81M58O04L68l17o91n16l80n91p35m97j29R9K42L79M40
54164A82170L83J91j37l84j54M79Q07L86k97n58m46l44j09N82J372J479P43k52
$$ plain form
54292 172531 172862 173194 173782 174330 174612 174934 175662 176725 177819 178710 179155 178932 178210 177614 177666 178319 179150 179863
54274 179863 180492 181177 181878 182345 182432 182332 182361 182626 183124 184006 185252 186282 186545 186478 187081 188392 189293 189141 188645
54255 188645 188610 188760 188606 188635 189597 191146 192187 192313 192026 191789 191657 191558 191227 190122 188160 186266 185506 185877
54237 185877 186600 187178 187479 187228 186323 185359 184923 184701 184139 183638 184025 185073 185648 185250 184344 183262 181905 180632
54219 180632 180297 181149 182569 184089 185699 187020 187201 186072 184541 183416 182619 181911 181565 181797 182169 182195 182037
54202 182037 182089 182195 181784 180583 178925 177453 176631 176402 176322 176199 176388 177146 178008 178339 178244 178250 178362 178267 178309 179268
54182 179268 181066 182655 183436 183894 184498 184866 184549 183858 183342 182962 182371 181636 181139 181010 181109 181351 181730 182170
54164 182170 182553 182744 182607 182223 182069 182548 183355 183741 183444 182886 182440 182096 181987 182569 183941 185420 186163 185911
54146A85911r04r84n67j00k25r80j504j085j85K69J72J71N66J069J445J644J441
54129A86154O78k16n42j89L33O10N75K50k53n57l51J89P11J190J767K312K619
54112A95280K738K687K146R59l82j244j548j529j242q44q55j425j736r53N14J455
54096A94021J405R41N81K53j45l93l64j95J2K72M93N71O27Q27J029J091J283J975
54078B04284K998L738L801L283K592K317K902M118N148N585N914O508O659N317
54064B65164K479q42l731n768o636o197m971l781k906k059j166n72m80p08j002
54049B26824j177r99l59N26J387K174K777K848K417K277L150M696N956O527O656
54034B65680O450N744M759M157M308M932N558N934N946N515M620L377K074J194
$$ plain form
54146 185911 185007 184023 183456 183356 183131 182151 180647 179562 179377 179646 179818 179989 180555 181624 183069 184713 186154
54129 186154 186832 186616 186074 185885 186218 186828 187403 187653 187400 186843 186492 186681 187392 188582 190349 192661 195280
54112 195280 198018 200705 202851 203810 203428 202184 200636 199107 197865 197021 196166 194741 193005 192052 192566 194021
54096 194021 195426 196367 196948 197201 197056 196663 196299 196104 196116 196388 196881 197452 198079 198906 199935 201026 202309 204284
54078 204284 207282 211020 214821 218104 220696 223013 225915 230033 235181 240766 246680 253188 259847 265164
54064 265164 267643 266801 263070 257302 250666 244469 239498 235717 232811 230752 229586 229014 228534 227826 226824
54049 226824 225647 224648 224289 224815 226202 228376 231153 234001 236418 238695 241845 246541 252497 259024 265680
54034 265680 272130 277874 282633 286790 291098 296030 301588 307522 313468 318983 323603 326980 329054 330248
54020C30248J031J294J449J426J410J003m16k274k937j863n52n66j580k411k860
54005C22402l293l282k261r59n83r25q06j43m9r12j983k937m246n687o064n029
53989B83243l868l803m523n005m839m112k935j775j386j784k004j490r86j364
53975B43369k250k656k414k109j900j283o9J064J232L40p59j041l29N27O53J54
53959B32529j95k3L98Q34J382J933K079J773J525J631J783J711J733K208K861
53944B54162L165L143L345M056M884N156M543L417K629K845L955N190N854N881
53930C12225N710N813O363P234Q205R142J0048J1032J2335J4259J6673J8497J8082
53917D55618J4477Q340J607l669o318o486n302l832k277m19J400K388K346J879
$$ plain form
54020 330248 331279 332573 334022 335448 336858 337861 337445 335171 332234 330371 329819 329253 327673 325262 322402
54005 322402 319109 315827 313566 312607 312024 311099 310293 310150 310101 309189 307206 304269 300023 294336 288272 283243
53989 283243 279375 275572 271049 266044 261205 257093 254158 252383 250997 249213 247209 245719 244733 243369
53975 243369 241119 238463 236049 233940 232040 230757 230688 231752 232984 233324 232565 231524 231195 231722 232375 232529
53959 232529 232334 232311 232709 233543 234925 236858 238937 240710 242235 243866 245649 247360 249093 251301 254162
53944 254162 257327 260470 263815 267871 272755 277911 282454 285871 288500 291345 295300 300490 306344 312225
53930 312225 317935 323748 330111 337345 345550 354692 364740 375772 388107 402366 419039 437536 455618
53917 455618 470095 478435 480042 476373 470055 463569 458267 454435 452158 451739 453139 455527 457873 459752
53903D59752J404P73l6p89j741l437n405o197n387m278l961l916l529l618n017
53888D14618o813p611p705q278r106r006q092p632p743p176n572m141l729l796
53874C18218l675l462l215k708k347k978m350n086m681m160m228m190l427k621
53860B67090k557k803k520j778j139p23n13p74j381j450n19M98M08o96j753k221
53844B47169k376k456k294j787j174q39j003j507j756j255k99K77Q8m61q57r43
53828B28527o08K86J458K273K463K231J681Q13O8M0N01O62N12R20K082L005K976
53811B49890K572K529K634K464K332K679L166L282L289L774M629N252N439N448
53797B99379N452N438N399N188M538L568K892K869L095K934K232J201K01k95j2
$$ plain form
53903 459752 461156 461929 461893 461104 459363 455926 450521 444324 438937 434659 430698 426782 423253 419635 414618
53888 414618 407805 400194 392489 384211 375105 366099 358007 350375 342632 335456 329884 325743 322014 318218
53874 318218 314543 311081 307866 305158 302811 299833 295483 290397 285716 281556 277328 273138 269711 267090
53860 267090 264533 261730 259210 257432 256293 255570 255057 254283 252902 251452 250933 251431 251839 251143 249390 247169
53844 247169 244793 242337 240043 238256 237082 236243 235240 233733 231977 230722 230423 230700 230788 230327 229470 228527
53828 228527 227919 228205 229663 231936 234399 236630 238311 239124 239192 239232 239733 240395 240907 241827 243909 246914 249890
53811 249890 252462 254991 257625 260089 262421 265100 268266 271548 274837 278611 283240 288492 293931 299379
53797 299379 304831 310269 315668 320856 325394 328962 331854 334723 337818 340752 342984 344185 344386 344091 344079
53782C44079N33M12n55j634k410l231m190m630m277l898m228m956n446n709n921
53767B93939n757m991m141l735l507l072k731k806k867k463k088k397k986k915
53753B47483k129j451j314j442j543j541j265o34k2J68J31K39L23Pn52q90r07
53736B34661o94j00P30R20q0j305j172M71K169K742K396J846J294O78K25K71Q01
53719B45853J428J670J256N11K62R70J963K096J170K25L10J356K492L081L217
53704B67860L287L298K845J860J099J431K691L751L914L588L413L360L144K861
53690C08402K625K131J209M49M81R57R37J45p98j276j280j161j203j413j431q80
53674C07894L9N51K95j80k60j00j00j23J34L44m9q86j459j434j066o15j62J79
$$ plain form
53782 344079 344612 345024 344469 342835 340425 337194 333004 328374 324097 320199 315971 311015 305569 299860 293939
53767 293939 288182 283191 279050 275315 271808 268736 266005 263199 260332 257869 255781 253384 250398 247483
53753 247483 245354 243903 242589 241147 239604 238063 236798 236164 236142 236310 236441 236680 237003 237010 236458 235568 234661
53736 234661 233967 233867 234597 235517 235437 234132 232960 233431 235600 238342 240738 242584 243878 244556 244781 245052 245853
53719 245853 247281 248951 250207 250718 250980 251950 253913 256009 257179 257404 257714 259070 261562 264643 267860
53704 267860 271147 274445 277290 279150 280249 281680 284371 288122 292036 295624 299037 302397 305541 308402
53690 308402 311027 313158 314367 314816 315297 316254 317191 317336 316538 315262 313982 312821 311618 310205 308774 307894
53674 307894 307933 308484 308779 308599 308339 308239 308139 308016 308150 308494 308445 307559 306100 304666 303600 302985 302823 303002
53656C03002L58N35O69L78l47p60l40K46jr53j591j424p89J2Q90J422J134M35
53638C02876L59J167K088K499K581K571K252J598J161J358J839K006J800J597
53624C27752J630J786J786J464J035J101K027L351M151M007L303K604K173K090
53610C60260K371K877L394L898M423M818M962N130N640O220O308N927N707N889
53596D27824N924N297M253L346K644J774N65o94j594k036k283k624l007l159l058
53581D33172l027l207l258k846k245j993k142k210j835j154n79m49q17j358j619
53566D04433j516j372j293r54k77J43j57o97o89j91J25J36M16J130J586J176K36
53549D02235l44o9Q00J580J743J344R49J020J414J642J482J092P30O44J104K212
$$ plain form
53656 303002 303360 303895 304564 304942 304595 303835 303495 303741 303740 302787 301196 299772 298983 298995 299885 301307 302441 302876
53638 302876 303235 304402 306490 308989 311570 314141 316393 317991 319152 320510 322349 324355 326155 327752
53624 327752 329382 331168 332954 334418 335453 336554 338581 341932 346083 350090 353393 355997 358170 360260
53610 360260 362631 365508 368902 372800 377223 382041 387003 392133 397773 403993 410301 416228 421935 427824
53596 427824 433748 439045 443298 446644 449288 451062 451627 450933 449339 447303 445020 442396 439389 436230 433172
53581 433172 430145 426938 423680 420834 418589 416596 414454 412244 410409 409255 408676 408227 407410 406052 404433
53566 404433 402917 401545 400252 399298 399021 399164 399007 398310 397621 397430 397555 397691 398107 399237 400823 401999 402235
53549 402235 401891 401822 402622 404202 405945 407289 408238 409258 410672 412314 413796 414888 415618 416262 417366 419578
53533D19578L655M883N471N320M754M519N283O875Q396R227R521R520R198Q892
53519E15092R490J1200J2846J3306J3041J3225J3880J4143J4121J5029J7302J9759
53507F82434K1091K1284K1058K0750K0331K0058K0381K1303K2187K2238K1232
53496I14347J9840J9040J9117J9463J9473J9205J8824J8131J7215J6927J7762
53485A119344J8780J8624J7345J6136J5487J4836J3978J3630J4231J5217J5831
53474A293439J5895J5446J4451J3144J1887J0409Q021M821J907jj381l052n203
53461A379783p658j0301j2692j4023j3993j3282j2714j2444j2387j2777j3770
53450A243742j4983j5973j6811j7753j8667j9270j9542j9499j8873j7499j5795
$$ plain form
53533 419578 423233 428116 433587 438907 443661 448180 453463 460338 468734 477961 487482 497002 506200 515092
53519 515092 524582 535782 548628 561934 574975 588200 602080 616223 630344 645373 662675 682434
53507 682434 703525 724809 745867 766617 786948 807006 827387 848690 870877 893115 914347
53496 914347 934187 953227 972344 991807 1011280 1030485 1049309 1067440 1084655 1101582 1119344
53485 1119344 1138124 1156748 1174093 1190229 1205716 1220552 1234530 1248160 1262391 1277608 1293439
53474 1293439 1309334 1324780 1339231 1352375 1364262 1374671 1382692 1387513 1389420 1389419 1388038 1384986 1379783
53461 1379783 1372125 1361824 1349132 1335109 1321116 1307834 1295120 1282676 1270289 1257512 1243742
53450 1243742 1228759 1212786 1195975 1178222 1159555 1140285 1120743 1101244 1082371 1064872 1049077
53439A049077j4468j3797j3442j2773j1259q827o014l581j894r39p43j297k001
53426I58042j855m18J794M012N785O813O950O677P000Q412J0333J1945J3135J4319
53412A052944J5753J7336J8831K0006K0851K1771K3116K4511K5193K5184K5488
53401A290984K6847K8965L1232L3517L5804L7810L9532M1546M4077M6276M7230
53390A703820M7266M7480M8308M9312N0186N1029N1634N1351M9915M7810M5610
53379B243721M3461M1403L9680L8337L6801L4347L0889K7011K3244J9603J5867
53368B594364J2034Q264M524N48l871q810j4397k0732k7518l4048l9723m4264
53356B426371m7381m8716m8513m7809m7485m7410m6951m5984m4776m3231m1050
$$ plain form
53439 1049077 1034609 1020812 1007370 994597 983338 974511 968497 964916 963022 962083 961340 960043 958042
53426 958042 956187 955769 957563 961575 967360 974173 981123 987800 994800 1003212 1013545 1025490 1038625 1052944
53412 1052944 1068697 1086033 1104864 1124870 1145721 1167492 1190608 1215119 1240312 1265496 1290984
53401 1290984 1317831 1346796 1378028 1411545 1447349 1485159 1524691 1566237 1610314 1656590 1703820
53390 1703820 1751086 1798566 1846874 1896186 1946372 1997401 2049035 2100386 2150301 2198111 2243721
53379 2243721 2287182 2328585 2368265 2406602 2443403 2477750 2508639 2535650 2558894 2578497 2594364
53368 2594364 2606398 2614662 2619186 2619734 2615863 2607053 2592656 2571924 2544406 2510358 2470635 2426371
53356 2426371 2378990 2330274 2281761 2233952 2186467 2139057 2092106 2046122 2001346 1958115 1917065
53345A917065l8514l6390l5039l4275l4033l4513l5573l6609l7077l6682l5129
53334A523231l2373k9108k6278k4054k1948j9930j8529j7656j6264j3666j0553
53323A292872q288p663q628j0606j2687j4008j4372j4257j4019j3529j2682j1700
53311A150433j0689r411p731n882m123k568j431r49r02o61J82J677L851O513Q795
53296A127104R830R966J0507J2056J4056J6025J8151K0337K1805K2321K2754K3698
53284A328610K4396K3877K2470K1254K0534J9702J8302J6538J4866J3544J2303
53273A536396J0294O846K518j233l773n936q536j1072j2609j3256j4000j5491
53261A470148j7671k0154k2430k4083k5238k6368k7418k7751k7259k6648k6280
$$ plain form
53345 1917065 1878551 1842161 1807122 1772847 1738814 1704301 1668728 1632119 1595042 1558360 1523231
53334 1523231 1490858 1461750 1435472 1411418 1389470 1369540 1351011 1333355 1317091 1303425 1292872
53323 1292872 1284584 1276921 1268293 1257687 1245000 1230992 1216620 1202363 1188344 1174815 1162133 1150433
53311 1150433 1139744 1130333 1122602 1116720 1112597 1110029 1108598 1107649 1106747 1106086 1106268 1107945 1111796 1118309 1127104
53296 1127104 1136934 1146900 1157407 1169463 1183519 1199544 1217695 1238032 1259837 1282158 1304912 1328610
53284 1328610 1353006 1376883 1399353 1420607 1441141 1460843 1479145 1495683 1510549 1524093 1536396
53273 1536396 1546690 1553536 1556054 1554821 1551048 1545112 1536576 1525504 1512895 1499639 1485639 1470148
53261 1470148 1452477 1432323 1409893 1385810 1360572 1334204 1306786 1279035 1251776 1225128 1198848
53250A198848k5609k4425k3529k3395k3155k1937k0410j9852k0397k1276k2119
53239I52744k2855k2930k1930k0566j9793j9331j8301j6952j6369j6587j6355
53228G40775j4944j2957j1217r829q650p742p138o842p146q198r324r686r542
53215F17560r966j1270j2624j3335j3596j3716j3518j2838j1907j0910r791q692
53203D75397p981p634p196o564o232o538p217p818q133q084p738p470p618p909
53189C71265p745p062o368n951n589n058m357l500k660k406l060l900l833k873
53175C06903k113k051k008j453r20j064j552j614j164o92m45l18l30o20j047j246
53159B88266j094q81r52j293j532j369j052j176j869k501k489k057j714j341n17
$$ plain form
53250 1198848 1173239 1148814 1125285 1101890 1078735 1056798 1036388 1016536 996139 974863 952744
53239 952744 929889 906959 885029 864463 844670 825339 807038 790086 773717 757130 740775
53228 740775 725831 712874 701657 691828 683178 675436 668298 661456 654310 646112 636788 627102 617560
53215 617560 607594 596324 583700 570365 556769 543053 529535 516697 504790 493880 484089 475397
53203 475397 467416 459782 452586 446022 439790 433252 426035 418217 410084 402000 394262 386792 379174 371265
53189 371265 363520 356458 350090 344139 338550 333492 329135 325635 322975 320569 317509 313609 309776 306903
53175 306903 304790 302739 300731 299278 298358 297294 295742 294128 292964 292272 291827 291509 291179 290559 289512 288266
53159 288266 287172 286291 285339 284046 282514 281145 280093 278917 277048 274547 272058 270001 268287 266946 266429
53144B66429M98Q97N02M7Q6L33L57K87M97J031J605J932J813J300Q51R57J566
53127B80988K108K124J495K70j159j832j013P22J883J790J162P81N05j1m22k90
53111B89101N7J5k46r0M03L63o63j980k613k425k082k017j941j479r10q30j227
53094B71436j389r23k84j5K7K43N48O83Q07J082J012J03j011j173l61K32j1l46
53076B70660j13Q4n97j729k047j110K06Q08M86j03k52O7K38k29j029j441j260
53059B62639r18p64o88n33l25KO02J242J382R42N03N08P65R80J195J355J009J9
53041B69915q84q46OO37K78q51j848j967j240l98m5l8J09L34J55l46m35J34O53
53022B63323N48K86N79J222J422R44K04m56r73j112n21O42J679K059J892J636
$$ plain form
53144 266429 266927 267824 268326 268373 268459 268792 269149 269436 269933 270964 272569 274501 276314 277614 278465 279422 280988
53127 280988 283096 285220 286715 286985 285826 283994 282981 283703 285586 287376 288538 289319 289824 289813 289391 289101
53111 289101 289158 289173 288927 288837 289240 289603 288940 286960 284347 281922 279840 277823 275882 274403 273493 272663 271436
53094 271436 270047 269124 268840 268825 268852 269095 269643 270326 271133 272215 273227 273330 272319 271146 270785 271017 271006 270660
53076 270660 270547 270631 270034 268305 266258 265148 265354 266162 266648 266545 266293 266360 266598 266369 265340 263899 262639
53059 262639 261721 260957 260269 259736 259411 259413 260015 261257 262639 263581 264084 264592 265357 266337 267532 268887 269896 269915
53041 269915 269031 268185 268191 268828 269106 268255 266407 264440 263200 262802 262757 262719 262828 263162 263317 262971 262536 262670 263323
53022 263323 263871 264157 264736 265958 267380 268324 268528 268072 267099 265987 265466 266108 267787 269846 271738 273374
53006B73374J565J604J459R41K33k08j04L49P39P56K69o11j404j525r61l53j81
52989B75942j74J61P44J062Q83M47R0L6L86R76J383J368J238J442J999K603L150
52972B93736L659L883L456K504J619J120P35J52m54o99n22k40j32k17l43m67p12
52955C07078j184j715j935j683j270j139j325j474j318r61o54n25o44j078j668
52940B88505j899j311j25Q35R66M68k8k58m49p91j098j118q43m42p8O2j26l90
52922B81880l10O3J13m50r85p08J22M56r9p57o33J19O19L61l55r24j057q89o81
52903B75885n51m19j52K87P76J062R41N20K34L80O74O10K52J21L06K01m81j081
52885B79565q64j12K99N6m49q69j107r50k28O87J145J006O73M30K74L03O85J255
$$ plain form
53006 273374 274939 276543 278002 278943 279176 278968 278864 279213 279952 280708 280977 280366 278962 277437 276476 276123 275942
52989 275942 275768 275929 276673 277735 278618 279065 279155 279191 279577 280553 281936 283304 284542 285984 287983 290586 293736
52972 293736 297395 301278 304734 307238 308857 309977 310712 310864 310410 309711 309189 308949 308817 308600 308257 307790 307078
52955 307078 305894 304179 302244 300561 299291 298152 296827 295353 294035 293074 292420 291895 291251 290173 288505
52940 288505 286606 285295 285170 286005 286971 287439 287411 287153 286704 285913 284815 283697 282854 282412 282334 282396 282270 281880
52922 281880 281570 281633 281746 281296 280311 279603 279725 280181 280082 279325 278692 278811 279430 279791 279436 278512 277455 276566 275885
52903 275885 275334 274915 274763 275050 275826 276888 277829 278349 278583 278963 279637 280247 280499 280620 280926 281127 280646 279565
52885 279565 278701 278589 278888 278944 278495 277626 276519 275569 275341 276028 277173 278179 278852 279282 279556 279859 280544 281799
52867B81799J709K135K763L310L240K679K256K023J305j69j710k518k449j787
52853B94586q51j04n3o83j474k129k809l563m121m346m266l576j982k03L44o38
52837B64132j751j723j006p80j120j126n07M1rl15k57K56Q31J119J069P75K03
52820B59832p32j729k014j163K31J204J615J999K350K044J156P77J433K092J503
52805B70598m8j185j246q75r87j732k511k666k182j775k016k408j927o12K89N4
52789B48771m74k10O18R95O00l5m31m10J37J051J696J705J555J796K064J629N62
52772B61619m21r82j224j014j95O99Q21J46n65r45j281j624j511q18j42O8O0J96
52754B52887L47K44K1l1J10L37P57J583K697L551L551K592J255L97L89Q51J222
$$ plain form
52867 281799 283508 285643 288406 291716 294956 297635 299891 301914 303219 303050 301340 298822 296373 294586
52853 294586 293735 293631 293578 292895 291421 289292 286483 282920 278799 274453 270187 266611 264629 264426 264770 264132
52837 264132 262381 260658 259652 258872 257752 256626 256119 256160 256151 255836 255579 255835 256666 257785 258854 259629 259832
52820 259832 259100 257371 255357 254194 254425 255629 257244 259243 261593 263637 264793 265570 267003 269095 270598
52805 270598 270550 269365 268119 267244 266257 264525 262014 259348 257166 255391 253375 250967 249040 248428 248717 248771
52789 248771 248297 248087 248705 249700 250300 250265 249834 249424 249561 250612 252308 254013 255568 257364 259428 261057 261619
52772 261619 261198 260216 258992 257978 257783 258482 259303 259449 258884 257939 256658 255034 253523 252705 252563 252631 252691 252887
52754 252887 253234 253478 253499 253468 253578 253915 254672 256255 258952 262503 266054 268646 269901 270298 270687 271538 272760
52737B72760J385J527J605J388R03N26N50R03J310J588J748J857J764J113j48
52722B90779j385j867j688j569j698j534r47o86j212j769j481p07m65q65j100
52707B71806p41j69K75O98J129J297J069O56K20k67o89p30k29O16J418J771J452
52690B79582P00Q0j21j14m2L21R89J461J410J094N86n88k285l053j860Q3O05n19
52672B78329j388p89L72P62M54K98N01P03P41O48L50j04l00J2N28Q57J066J391
52654B84431J770K034K228K427K416J889Q00o07j936k671k507j711r23m77k11
52639B86952N3K64M48P94J223J307Q50J83k39k51J94J135K272K885K434J102m42
52622C01164j631k267k432k327k081j671j159r01j176j611j448m92N11P28J73
$$ plain form
52737 272760 274145 275672 277277 278665 279568 280094 280644 281547 282857 284445 286193 288050 289814 290927 290779
52722 290779 289394 287527 285839 284270 282572 281038 280091 279405 278193 276424 274943 274236 273771 272906 271806
52707 271806 271065 270896 271171 271869 272998 274295 275364 276020 276240 275973 275284 274554 274325 274941 276359 278130 279582
52690 279582 280282 280362 280241 280127 280085 280406 281395 282856 284266 285360 285946 285358 283073 280020 278160 278243 278848 278329
52672 278329 276941 276152 276524 277286 277740 278038 278539 279242 279983 280631 280981 280877 280577 280589 281117 281974 283040 284431
52654 284431 286201 288235 290463 292890 295306 297195 297995 297388 295452 292781 290274 288563 287640 287163 286952
52639 286952 287005 287269 287717 288511 289734 291041 291891 292074 291835 291584 291778 292913 295185 298070 300504 301606 301164
52622 301164 299533 297266 294834 292507 290426 288755 287596 286695 285519 283908 282460 281968 282479 283207 283380
52607B83380l21kJ088K137K294J459L58k49k20J63O69J095J070M55k93n80m04
52590B92099k14j95k06k21k62j9P83J669J793J060L07K03N31O69L00m52j100j048
52572B95697k41M60J70q18j379j035l97o5K1J3k13n32n00j14Q4n7j8L55M11j63
52552B91679o77n11j26j81k86K82J140J115j4j062r20J49J036J110O65K58l9n40
52534B93078j213j435p98J26M24J71L23J180J765J270L14K5M18N73J86k5N12J358
52516B98252J742J577J416J628K015K197K188K350K875L487L751L437K476Q53
52502C30244j065k419k641k269k341l050l570l286k478j677j023n70n02o71n68
52487C02114q1J94r6m53l22M5J27L2K04N77P21N93M79M12K17L9K42Q33J461J956
$$ plain form
52607 283380 283059 283057 284145 286282 288576 290035 290393 290144 289924 290087 290756 291851 292921 293376 293083 292503 292099
52590 292099 291885 291690 291484 291263 291001 290982 291765 293434 295227 296287 296594 296797 297328 297997 298297 297845 296745 295697
52572 295697 295456 295916 296086 295268 293889 292854 292457 292392 292413 292426 292213 291681 291181 291067 291151 291094 291076 291431 291842 291679
52552 291679 291002 290491 290365 290184 289898 290180 291320 292435 292421 291359 290439 290588 291624 292734 293399 293657 293618 293078
52534 293078 291865 290430 289632 289758 290182 290353 290676 291856 293621 294891 295205 295230 295648 296221 296407 296382 296894 298252
52516 298252 299994 301571 302987 304615 306630 308827 311015 313365 316240 319727 323478 326915 329391 330244
52502 330244 329179 326760 324119 321850 319509 316459 312889 309603 307125 305448 304425 303855 303353 302682 302114
52487 302114 302033 302227 302131 301678 301356 301401 301528 301560 301764 302341 303062 303655 304134 304546 304763 304802 305044 305877 307338 309294
52467C09294K369K611K491K134J917J992K169K265K296K248J964J276R2j493l065
52452C30560m104m467m486m404l990l039j863r83n19l34m38q58j271j258q60m88
52436B97198l56m26p49j361j846j506j66J452K345K052R25k05n55P9J150J816
52420B99847J667R82L20QJ8K78Q86J931L161M077M468M663M995N406N876O948
52404C45531R146J1941J3938J4130J2389Q830L645k190o975r650j0551j0473r683
52391C70028q310o953o033n106l604j895q60o95q65r99j079r84n42J02P68J709
52375C34682L087M239M301L531L152L804M875N514N615N431M909L854K362Q06
52361C90162m94j397j857j866j345k43J079J822J546Q31O88J331K029K113J649
$$ plain form
52467 309294 311663 314274 316765 318899 320816 322808 324977 327242 329538 331786 333750 335026 335118 333625 330560
52452 330560 326456 321989 317503 313099 309109 306070 304207 303224 302705 302371 301933 301075 299804 298546 297686 297198
52436 297198 296842 296416 295667 294306 292460 290954 290788 292240 294585 296637 297562 297357 296802 296881 298031 299847
52420 299847 301514 302496 302816 302824 302842 303120 304006 305937 309098 313175 317643 322306 327301 332707 338583 345531
52404 345531 354677 366618 380556 394686 407075 415905 419550 417360 410385 400735 390184 379711 370028
52391 370028 361718 354765 348732 343626 340022 338127 337267 336572 335707 334708 333629 332645 332103 332205 332973 334682
52375 334682 337769 342008 346309 349840 352992 356796 361671 367185 372800 378231 383140 386994 389356 390162
52361 390162 389668 388271 386414 384548 383203 382960 384039 385861 387407 388238 388926 390257 392286 394399 396048
52346C96048J091P21O21P70J070J420J817K164K183J848J726K420L796N176O176
52331D29047O865P275P400P640Q567J0124J1673J2917J4147J5470J6419J6597
52319E64141J6135J5283J4083J2838J2321J3052J4661J6268J7266J7569J7519
52308G31136J7766J8794K0268K1272K1451K1466K1966K2661K2901K2653K2286
52297I64620K1715K0502J8652J6566J4220J1134P342L828J569N15k27j329k671
52284A076436l688m094m220m669n628o580o809o182n214m383l627k671j592p93
52270A016286m11m4Q54K364M024N326O135O621O962P263P760Q813J0630J2939
52256A095522J5146J6813J7966J8892J9654J9995J9738J9070J8238J6990J4710
$$ plain form
52346 396048 397139 397860 398481 399251 400321 401741 403558 405722 407905 409753 411479 413899 417695 422871 429047
52331 429047 435912 443187 450587 458227 466794 476918 488591 501508 515655 531125 547544 564141
52319 564141 580276 595559 609642 622480 634801 647853 662514 678782 696048 713617 731136
52308 731136 748902 767696 787964 809236 830687 852153 874119 896780 919681 942334 964620
52297 964620 986335 1006837 1025489 1042055 1056275 1067409 1074751 1078579 1080148 1080663 1080436 1079107 1076436
52284 1076436 1072748 1068654 1064434 1059765 1054137 1047557 1040748 1034566 1029352 1024969 1021342 1018671 1017079 1016286
52270 1016286 1015875 1015831 1016685 1019049 1023073 1028399 1034534 1041155 1048117 1055380 1063140 1071953 1082583 1095522
52256 1095522 1110668 1127481 1145447 1164339 1183993 1203988 1223726 1242796 1261034 1278024 1292734
52245A292734J1214P221L827J606M03k69q66j729k951m229n163n782o543p761
52231A281712r209j0423j1124j1234j0764r970r462r695j0373j0666j0152r233
52219A159407q523q052p380o289n022l902k915j854o64M52J234J689K164K987
52205A123332L979M490M176L522L338L805M419M800N086N560O370P594R064R930
52191A199465R222P145N203M465M297L372J424p63k626m210n567o658p660q581
52177A198528q776p825o624o521p384p764p073o265n977n441m020k578k188k359
52163A117733j746j55J337J993K093K103K056J842J464Q75J01m94m94o0K24J25
52147A128997N8N04J381K077K036J391R45J254J739J243m24k066k469j663m86
$$ plain form
52245 1292734 1303948 1311169 1314996 1316602 1317005 1316736 1315870 1314141 1311190 1306961 1301798 1296016 1289473 1281712
52231 1281712 1272503 1262080 1250956 1239722 1228958 1218988 1209526 1199831 1189458 1178792 1168640 1159407
52219 1159407 1150884 1142832 1135452 1129163 1124141 1120239 1117324 1115470 1114806 1115258 1116492 1118181 1120345 1123332
52205 1123332 1127311 1131801 1135977 1139499 1142837 1146642 1151061 1155861 1160947 1166507 1172877 1180471 1189535 1199465
52191 1199465 1208687 1215832 1221035 1225500 1229797 1233169 1234593 1233830 1231204 1226994 1221427 1214769 1207109 1198528
52177 1198528 1189752 1181927 1175303 1168782 1161398 1153634 1146561 1140296 1134319 1128878 1124858 1122280 1120092 1117733
52163 1117733 1115987 1115832 1117169 1119162 1121255 1123358 1125414 1127256 1128720 1129595 1129696 1129202 1128708 1128648 1128872 1128997
52147 1128997 1129055 1129559 1130940 1133017 1135053 1136444 1137389 1138643 1140382 1141625 1141201 1139135 1136666 1135003 1134517
52132A134517N58J518K582L972N865P992R685J0737J1775J3395J5408J7405J9405
52119A254814K1431K2973K3614K3702K3704K3411K2577K1809K1900K2604K2956
52108A505495K2580K1826K0892J9761J8836J8739J9426K0267K0797K0722J9524
52097A728865J6964J3746J0724P604L510j382n901r543j2829j5890j7954j8579
52085A699335j8289j7572j6259j4427j2900j2213j1890j1362j0863j0763j0664
52074A552133r923q585p124n587l599j083J528L740N384O616P794R198J0820J2518
52060A573830J4240J5848J6955J7388J7546J7752J7470J5986J3675J1649J0141
52049A742480Q268N598K853O05j656m511p453r489j0375j0573j0479j0321j0472
$$ plain form
52132 1134517 1135075 1136593 1139175 1143147 1149012 1157004 1166689 1177426 1189201 1202596 1218004 1235409 1254814
52119 1254814 1276245 1299218 1322832 1346534 1370238 1393649 1416226 1438035 1459935 1482539 1505495
52108 1505495 1528075 1549901 1570793 1590554 1609390 1628129 1647555 1667822 1688619 1709341 1728865
52097 1728865 1745829 1759575 1770299 1777903 1781413 1780031 1774130 1764587 1751758 1735868 1717914 1699335
52085 1699335 1681046 1663474 1647215 1632788 1619888 1607675 1595785 1584423 1573560 1562797 1552133
52074 1552133 1542210 1533625 1526501 1520914 1517315 1516232 1517760 1521500 1526884 1533500 1541294 1550492 1561312 1573830
52060 1573830 1588070 1603918 1620873 1638261 1655807 1673559 1691029 1707015 1720690 1732339 1742480
52049 1742480 1750748 1756346 1759199 1759804 1758148 1753637 1746184 1736695 1726320 1715747 1705268 1694947 1684475
52036A684475j1214j2355j3419j4080j4294j4285j4606j5635j6993j7934j8431
52025A521229j9094j9919j9978j8864j7433j6544j5888j4844j3704j3073j2597
52014A339291j1418r625q294q083q583r138r633j0353j1558j3340j5558j7818
52002A205890j9684k0850k1073k0246j8722j7215j6094j5113j4090j3471j3792
51991A015540j4944j6378j7751j8975j9869k0247k0209k0000j9815j9819k0150
51980H07383k0570k0593k0135j9626j9157j8080j5886j2958j0046p437n115l133
51968F34647j321Q66L501N716O752O979P110O896N535L060L30k187m554o497p442
51953F59391p528p602p961p975p147n726m004j854N92K640L986N309P336R721
$$ plain form
52036 1684475 1673261 1660906 1647487 1633407 1619113 1604828 1590222 1574587 1557594 1539660 1521229
52025 1521229 1502135 1482216 1462238 1443374 1425941 1409397 1393509 1378665 1364961 1351888 1339291
52014 1339291 1327873 1318248 1309954 1301871 1293288 1284150 1274517 1264164 1252606 1239266 1223708 1205890
52002 1205890 1186206 1165356 1144283 1124037 1105315 1088100 1072006 1056893 1042803 1029332 1015540
51991 1015540 1000596 984218 966467 947492 927623 907376 887167 867167 847352 827533 807383
51980 807383 786813 766220 746085 726459 707302 689222 673336 660378 650332 642895 637780 634647
51968 634647 633326 634192 637693 643409 650161 657140 664250 671146 676681 679741 680071 677884 673330 666833 659391
51953 659391 651863 644261 636300 628325 621178 615452 611448 609594 610186 612826 616812 622121 629457 639178
51939F39178J1513J2427J2986J3565J3823J3188J1437Q779N613K312q82l827o378
51926G33734q387r955j1499j3343j5233j6443j6434j5317j3609j1627r329o691
51914E85867m049j775J92K284M743P430J0257J3427J6983K0101K1162J8778J2985
51901G08385N489j456o746j0900j4818j8380k0743k1668k1783k1495k0474j8500
51889E36911j6158j4118j2245r929o995l848j020J087K327L093M166N917P877
51876D97065R433J0595J1595J2154J1633R747O702K898j043m233o026o498o123
51863E47899n247m198l431k962k093l99J287J786J211P74R09O45q37k906m378
51848E28060n090n878p203q505q937q389p516o894o346n258l525j873j041q75
$$ plain form
51939 639178 650691 663118 676104 689669 703492 716680 728117 736896 742509 744821 743939 740112 733734
51926 733734 725347 715392 703893 690550 675317 658874 642440 627123 613514 601887 592558 585867
51914 585867 581818 580043 580235 582519 587262 594692 604949 618376 635359 655460 676622 695400 708385
51901 708385 713874 712418 705672 694772 679954 661574 640831 619163 597380 575885 555411 536911
51889 536911 520753 506635 494390 484461 477466 473618 472598 473685 476012 479105 483271 489188 497065
51876 497065 506498 517093 528688 540842 552475 562222 568924 571822 570779 566546 560520 554022 547899
51863 547899 542652 538454 535023 532061 529968 529569 530856 532642 533853 534627 535536 536181 535344 532438 528060
51848 528060 522970 517092 509889 501384 492447 484058 476542 469648 463302 458044 454519 452646 451605 450730
51834D50730n59L60J562K519L074L334L298K840J929P38m66j465k156k513k593
51819D60632k571k575k374j456K15J775K299J932J580J489J002j96j415k012k230
51804D56095k480k507k024j475j303r92J68J797K774K675J933Q71n10j864k599
51789D50559k626k266j517l23O25M29o59j455j552j735k434k883k295r26O16K300
51773D33858M224N956P035P628Q127Q587R023R673J0291R806P479M086J089j099
51759E25763l209n564p364p790p144o500o519o935p032o380n135l831k850k154
51745D47356j492q28l57r7L22J298K672L743M077M114M655N783O682O709O043
51730D90680N040L479J139j255k498k220j043N26K396L974L917J518k144n066
$$ plain form
51834 450730 450171 450531 452093 454612 457686 461020 464318 467158 469087 469825 469359 467894 465738 463225 460632
51819 460632 458061 455486 453112 451656 451871 453646 455945 457877 459457 460946 461948 461752 460337 458325 456095
51804 456095 453615 451108 449084 447609 446306 445314 445482 447279 450053 452728 454661 455532 455022 453158 450559
51789 450559 447933 445667 444150 443827 444452 444881 444222 442767 441215 439480 437046 434163 431868 430942 431558 433858
51773 433858 438082 444038 451073 458701 466828 475415 484438 494111 504402 514208 521687 525773 526862 525763
51759 525763 522554 516990 509626 501836 494692 488192 481673 474738 467706 461326 456191 452360 449510 447356
51745 447356 445864 445036 444679 444582 444904 446202 448874 452617 456694 460808 465463 471246 477928 484637 490680
51730 490680 495720 499199 500338 499083 496585 494365 493322 493848 496244 500218 504135 505653 503509 498443
51716D98443o093n451l961k330j029l23k58p96j792k764k941j977l68J095K111
51701D71566K689K461R73j338l044l113j938o30M75J906L682M623L514O59k380
51686D80105m409n434n886n759m913l667k550j678q61j64J40P2j19m31j064j829
51670D41553k083j391K9J759L711O065Q740J1134J2382J1939J0016P245L986J98
51656E15283l727o567p204n820l610j350J144M178P306R534R945Q100M276m47
51642E31041m755p990j0274j1771j2243j1566j0229r006q256p783p203o283n018
51629D18664l555k059o21O25J412J596J484J557J864J848R89n38j924k415j982
51614D16945j297r91j001p52J5R77J733K138K018J233K17j25M16R58R13J045K364
$$ plain form
51716 498443 492350 486899 482938 480608 479579 479256 478998 478202 476410 473646 470705 468728 468360 469455 471566
51701 471566 474255 476716 477689 476351 473307 470194 468256 467626 468101 470007 473689 478312 481826 482485 480105
51686 480105 475696 470262 464376 458617 453704 450037 447487 445809 444948 444784 444924 444996 444877 444446 443382 441553
51670 441553 439470 438079 438108 439867 443578 449643 458383 469517 481899 493838 503854 511099 515085 515283
51656 515283 511556 504989 497785 491965 488355 487005 488149 492327 499633 509167 519112 527212 531488 531041
51642 531041 526286 518296 508022 496251 484008 472442 462213 453207 444951 437168 429965 423682 418664
51629 418664 415109 413050 412429 413054 414466 416062 417546 419103 420967 422815 423804 423266 421342 418927 416945
51614 416945 415648 414657 413656 412904 412919 413896 415629 417767 419785 421018 421235 421110 421526 422484 423397 424442 426806
51597D26806M481O233P504R196J1390J2768J2161R690O070J772k649o225q207
51584D90990q630p886o233l954j539P16K889N143P589J0420J3506J5899J6548
51571E35458J5739J5054J5683J7360J9022J9647J8382J5086J1387J0065J2552
51560G05435J7658K3376K9108L5200M1040M4777M4811M0825L3679K4921J6066
51549A056896P601j089j0342j9181k6333l1744l6213l9859m1937m2099m0919l9025
51537G35756l6511l3308k9603k5622k1553j7851j5161j3692j2916j2031j0602
51526E06906q735o844n344m395l985m121m674n025m376k678q01N08J432K404L193
51511D63465L308L026L197M001M531L762J627j005l118m254m649m734m549l844
$$ plain form
51597 426806 431287 437520 445024 454220 465610 478378 490539 500229 506299 508071 505422 499197 490990
51584 490990 482360 474474 468241 464287 462748 463464 466353 471496 479085 489505 503011 518910 535458
51571 535458 551197 566251 581934 599294 618316 637963 656345 671431 682818 692883 705435
51560 705435 723093 746469 775577 810777 851817 896594 941405 982230 1015909 1040830 1056896
51549 1056896 1064497 1063408 1053066 1033885 1007552 975808 939595 899736 857799 815700 774781 735756
51537 735756 699245 665937 636334 610712 589159 571308 556147 542455 529539 517508 506906
51526 506906 498171 491327 485983 481588 477603 473482 468808 463783 459407 456729 455928 456436 457868 460272 463465
51511 463465 466773 469799 472996 476997 481528 485290 486917 485912 482794 478540 473891 469157 464608 460764
51497D60764k743j913j816k174k480k646k774k722k357j969j884j934j783j580
51483D29989j793k498l281l731l710l290k776k566k665k629k304k209k712l260
51469C90565l082k308j672j416j206j009j142j531j605j083k09P52J654K058J530
51454C80296M27k12J99J293K503L687M817N711O403P341Q889J0972J3318J5512
51440D61156J6645J5588J2175P749M052J791N68j08m09o56j628l987p468j0819
51426D94649j2739j2889j1945j0670r217p483n733m353l238j967n53N68J315K046
51412D17791K800L094K827K662L058L498L290K739K671L106L186K547J868J849
51398D56986K289K637K829L067L204L029K979L766N369P027Q345R697J1362J3037
$$ plain form
51497 460764 458021 456108 454292 452118 449638 446992 444218 441496 439139 437170 435286 433352 431569 429989
51483 429989 428196 425698 422417 418686 414976 411686 408910 406344 403679 401050 398746 396537 393825 390565
51469 390565 387483 385175 383503 382087 380881 379872 378730 377199 375594 374511 374302 375054 376708 378766 380296
51454 380296 380723 380511 380710 382003 384506 388193 393010 398721 405124 412465 421354 432326 445644 461156
51440 461156 477801 493389 505564 513313 517365 519156 519724 519616 519207 518551 516923 512936 505468 494649
51426 494649 481910 469021 457076 446406 437189 429706 423973 419620 416382 414415 413862 414430 415745 417791
51412 417791 420591 423685 426512 429174 432232 435730 439020 441759 444430 447536 450722 453269 455137 456986
51398 456986 459275 461912 464741 467808 471012 474041 477020 480786 486155 493182 501527 511224 522586 535623
51384E35623J4676J7057K0848K5613L0531L5577M1147M6856N1841N6062O0004
51373I35835O2847O2183N6181M5392L1928J7747M176p883j8265k7582l6201m3510
51361A082848m8771n2129n4109n4650n3471n0984m7903m4253l9634l4283k9022
51350E73639k4314k0142j6757j4579j3267j1744r465p079n609n425o035o513o116
51337D26594m929l887l711m011l895l267k781k707k619k287k009j945j868j764
51323C84914j944k318k215j295o3Q96J606K281K704K553K027J777K275L379M359
51308D00936M363L168J549O04P07J454K402L292L574K527J53k572m595n546n559
51293D06457m958m301m087m107l655k603j682j365j178n64K53Q72J622L059M854
$$ plain form
51384 535623 550299 567356 588204 613817 644348 679925 721072 767928 819769 875831 935835
51373 935835 998682 1060865 1117046 1162438 1194366 1212113 1216289 1208406 1190141 1162559 1126358 1082848
51361 1082848 1034077 981948 927839 873189 819718 768734 720831 676578 636944 602661 573639
51350 573639 549325 529183 512426 497847 484580 472836 463371 456292 450683 445258 439223 432710 426594
51337 426594 421665 417778 414067 410056 406161 402894 400113 397406 394787 392500 390491 388546 386678 384914
51323 384914 382970 380652 378437 377142 377079 377975 379581 381862 384566 387119 389146 390923 393198 396577 400936
51308 400936 405299 408467 410016 410620 411327 412781 415183 418475 422049 424576 424729 422157 417562 412016 406457
51293 406457 401499 397198 393111 389004 385349 382746 381064 379699 378521 377957 378210 379082 380704 383763 388617
51278C88617N966N861M955L828K603J209j20q96q64l06J66K76M71J355K778L822
51262D19721L808K929J752N71m38r42q49o71r65j589j992k159k652l658m416l979
51246D04471k362o81ok65m49O7P48P11Jn49n55n27q69j201j097r27j341k204k689
51227C90276k371j680j231j098q89k97N78J343J723J853K028K178J906J176O17
51212C96112Q59J746K556K892K980L210L658M136M398M307L954L611L373K931
51198D40723J926N19p38j594k398l448m388m507l637k428j701j669j920j947j511
51183D11282o48L48R58Q28J97k87k84l9J71M42Q46J081R04O69Q66J318J350P67
51165D20769J28qL58R18J474J900K056J885J417O66k34q30o67Q2P24Q16N70L74
$$ plain form
51278 388617 394583 400444 405399 409227 411830 413039 412919 412023 411159 410853 411019 411295 411766 413121 415899 419721
51262 419721 423529 426458 428210 428781 428343 427401 426552 425881 424916 423327 421335 419176 416524 412866 408450 404471
51246 404471 402109 401428 401422 401157 400708 400775 401523 402234 402235 401686 401131 400604 399735 398534 397437 396510 395169 392965 390276
51227 390276 387905 386225 384994 383896 383007 382710 383288 384631 386354 388207 390235 392413 394319 395495 396112
51212 396112 396971 398717 401273 404165 407145 410355 414013 418149 422547 426854 430808 434419 437792 440723
51198 440723 442649 443168 442430 440836 438438 434990 430602 426095 422458 420030 418329 416660 414740 412793 411282
51183 411282 410634 410982 411940 412768 412965 412678 412394 412355 412526 412968 413814 414895 415799 416468 417334 418652 420002 420769
51165 420769 420897 420889 421247 422165 423639 425539 427595 429480 430897 431563 431329 430499 429832 429914 430638 431454 432024 432398
51147D32398K77J20j20l26m05m07n51j083j878k357k104j467j125j163j120q85
51131D17804q72j190j329r48m10j75p1L89J302K299K973L076K633K016J772K036
51115D31305K423K581K550K500K425K380K606L150L615L645L370L168L115K965
51101D71798K535J887J252Q38N88J92m41q77p10l57o60j634k335k175j693j596
51085D66612j677j305n32j1k4k57m53p03r95r17j18J130K058K222K080K473L456
51068D73039M088L719L060L273M374N418O075O983Q423R926J1534J4104J7406
51055E71422J9104J7042J2069P386N338N922Q213J1768J6052J9561K0525J8525
51043G32927J4858J1196P929M138q47o176j0204j2228j2738j2109j0189p623o452
$$ plain form
51147 432398 432675 432795 432675 432349 431944 431537 430986 429903 428025 425668 423564 422097 420972 419809 418689 417804
51131 417804 416932 415742 414413 413465 413055 412880 412809 413198 414500 416799 419772 422848 425481 427497 429269 431305
51115 431305 433728 436309 438859 441359 443784 446164 448770 451920 455535 459180 462550 465718 468833 471798
51101 471798 474333 476220 477472 478310 478898 479090 478649 477772 477062 476705 476045 474411 472076 469901 468208 466612
51085 466612 464935 463630 463098 463087 463063 462806 462353 461650 460655 459738 459620 460750 462808 465030 467110 469583 473039
51068 473039 477127 480846 483906 487179 491553 496971 503046 510029 518452 528378 539912 554016 571422
51055 571422 590526 607568 619637 627023 632361 638283 646496 658264 674316 693877 714402 732927
51043 732927 747785 758981 766910 771048 770201 764025 753821 741593 728855 716746 706557 698934 692482
51030F92482q274j2294j6085j7948j7788j6144j3546j0687q253o256m168j804
51018E59235M58K348L978N431O636P645Q568R235R369R118Q888Q776Q562Q183
51004F56430P760P372P276Q108J0071J2130J2886J2232J1300J0819J0415R769
50992G76568R348R490R578Q896P687O670N924M964L788L109L519M866O625Q553
50978H69585J0793J3311J5443J6200J5311J3921J3872J6234K0626K6003L1638
50967A062937L7295M2811M8022N2897N7423O1407O4643O7283O9777P2253P4105
50956A710853P4361P2593O9238O4941N9674N2928M4767L6302K8793K2547J7002
50945B253999J1685O752K791M24k9R58J933J226j803o271j0538j3425j4854j5666
$$ plain form
51030 692482 684208 671914 655829 637881 620093 603949 590403 579716 571463 565207 561039 559235
51018 559235 559693 562041 566019 571450 578086 585731 594299 603534 612903 622021 630909 639685 648247 656430
51004 656430 664190 671562 678838 686946 697017 709147 722033 734265 745565 756384 766799 776568
50992 776568 785916 795406 804984 813880 821567 828237 834161 839125 842913 846022 849541 854407 861032 869585
50978 869585 880378 893689 909132 925332 940643 954564 968436 984670 1005296 1031299 1062937
50967 1062937 1100232 1143043 1191065 1243962 1301385 1362792 1427435 1494718 1564495 1636748 1710853
50956 1710853 1785214 1857807 1927045 1991986 2051660 2104588 2149355 2185657 2214450 2236997 2253999
50945 2253999 2265684 2272436 2275227 2275651 2275622 2276580 2278513 2279739 2277936 2271665 2261127 2247702 2232848 2217182
50931B217182j6872j8959k1775k5043k8826l3372l8626m4100m9171n3443n6963
50920A830032o0083o2882o4736o4826o3126o0449n7453n4027m9914m5302m0507
50909A206727l5664l1184k7807k5595k3513k0798j8258j7135j7093j6504j4627
50898I58549j2367j0678r370p931o563n721n193m324k928j488n92l43k30M35J734
50883H92990K897L192L003L468M999O803P983Q556R096R871J0698J1372J1857
50870I86785J2330J3137J4484J6122J7611J8984K0781K3312K6298K9318L2269
50859A211431L5252L8432M2175M6974N3012O0026O7658P5659Q3816R2050J00616
50848A907101J09771J19225J28412J37189J45767J53802J60400J65098J68109
$$ plain form
50931 2217182 2200310 2181351 2159576 2134533 2105707 2072335 2033709 1989609 1940438 1886995 1830032
50920 1830032 1769949 1707067 1642331 1577505 1514379 1453930 1396477 1342450 1292536 1247234 1206727
50909 1206727 1171063 1139879 1112072 1086477 1062964 1042166 1023908 1006773 989680 973176 958549
50898 958549 946182 935504 926134 918203 911640 905919 900726 896402 893474 891986 891394 891051 890821 891256 892990
50883 892990 895887 899079 902082 905550 910549 917352 925335 933891 942987 952858 963556 974928 986785
50870 986785 999115 1012252 1026736 1042858 1060469 1079453 1100234 1123546 1149844 1179162 1211431
50859 1211431 1246683 1285115 1327290 1374264 1427276 1487302 1554960 1630619 1714435 1806485 1907101
50848 1907101 2016872 2136097 2264509 2401698 2547465 2701267 2861667 3026765 3194874
50839C194874J69257J67349J61124J50240J34949J15570R2979O9102M5902K4118
50829D325464L657j4954l0305m1317m7970n0639m9371m4217l5860k5541j4571
50818C974376m311L624P581O529M39j0049k4103m0738n8682p6675r4017j10581
50806C573393j26069j39536j49796j56139j58417j56798j51740j44043j34451
50797B256404j23332j11017r8273q5969p4461o3672n3696m4752l6695k9136k2120
50786A513281j6154j1446p612m300j695k32j16j175k893m577n811o730p601q328
50772A434611q811r500j0891j2657j4029j5032j6481j8687k0981k2662k3596k3686
50760A237598k2669k0860j9225j8207j7153j5357j2958j0345p445m274j450O02
$$ plain form
50839 3194874 3364131 3531480 3692604 3842844 3977793 4093363 4186342 4255444 4301346 4325464
50829 4325464 4329121 4314167 4283862 4242545 4194575 4143936 4094565 4050348 4014488 3988947 3974376
50818 3974376 3970065 3973689 3981270 3987799 3988238 3978189 3954086 3913348 3854666 3777991 3683974 3573393
50806 3573393 3447324 3307788 3157992 3001853 2843436 2686638 2534898 2390855 2256404
50797 2256404 2133072 2022055 1923782 1837813 1763352 1699680 1645984 1601232 1564537 1535401 1513281
50786 1513281 1497127 1485681 1478069 1473769 1472074 1471842 1471726 1470551 1467658 1463081 1457270 1450540 1442939 1434611
50772 1434611 1425800 1416300 1405409 1392752 1378723 1363691 1347210 1328523 1307542 1284880 1261284 1237598
50760 1237598 1214929 1194069 1174844 1156637 1139484 1124127 1111169 1100824 1093379 1089105 1087655 1088257
50748A088257K403M678P312R784J2194J5069J8526K2311K6458L1168L6232M1272
50736A315664M6421N2089N8197O4208O9845P5199Q0164Q4288Q7222Q8908Q9333
50725B111538Q8552Q6829Q4453Q1499P7973P3808O8406O0593M9601L5902K0557
50714B839711M181j2730k8716m1566m9775n3256n2633m8526m1680l3163k4061
50703B457786j5157p023j24N240Q800J0132Q725M198l726j5087k9080m3871n7561
50690B323252o9227p8646q5333q8633q8586q5961q1363p5077o7761o0262n2568
50679A489835m3826l3956k4439j6707j0349l820L400J0243J5672K0014K4330K8930
50667A459327L2833L4627L3668L0691K7287K4578K2314J9477J5856J2620J1010
$$ plain form
50748 1088257 1090660 1095338 1102650 1112434 1124628 1139697 1158223 1180534 1206992 1238160 1274392 1315664
50736 1315664 1362085 1414174 1472371 1536579 1606424 1681623 1761787 1846075 1933297 2022205 2111538
50725 2111538 2200090 2286919 2371372 2452871 2530844 2604652 2673058 2733651 2783252 2819154 2839711
50714 2839711 2843892 2831162 2802446 2760880 2711105 2657849 2605216 2556690 2515010 2481847 2457786
50703 2457786 2442629 2435606 2435482 2440722 2449522 2459654 2468379 2472577 2468851 2453764 2424684 2380813 2323252
50690 2323252 2254025 2175379 2090046 2001413 1912827 1826866 1745503 1670426 1602665 1542403 1489835
50679 1489835 1446009 1412053 1387614 1370907 1360558 1356738 1360138 1370381 1386053 1406067 1430397 1459327
50667 1459327 1492160 1526787 1560455 1591146 1618433 1643011 1665325 1684802 1700658 1713278 1724288
50656A724288J0776J0485R281P714O634N986N181M167L505L562M384O146R104
50643A811213J2938J6899K0746K4985K9883L4853L9082M2302M4617M5976M6173
50632B169667M5018M2411L8705L5148L3209L3195L4374L6624M0502M4365M2673
50621B595891K9577M909k4427m9407o4637o9678o6788n8897m8927l9236l0787
50610B177593k3169j5761q822l269M17K708M168M299J743m189j2571k1729l0744
50597B070674l9607m8262n6005o1842o5045o5494o3847o1240n8425n5214n1110
50586A444583m6272m1450l7135l3353l0191k7933k6505k5310k3758k1756j9561
50575A111359j7390j5195j2641r462o031l217j318N29L280O593R230J0700J1712
$$ plain form
50656 1724288 1735064 1745549 1754830 1762544 1769178 1775164 1780345 1784512 1788017 1791579 1795963 1802109 1811213
50643 1811213 1824151 1841050 1861796 1886781 1916664 1951517 1990599 2032901 2077518 2123494 2169667
50632 2169667 2214685 2257096 2295801 2330949 2364158 2397353 2431727 2468351 2508853 2553218 2595891
50621 2595891 2625468 2630377 2605950 2556543 2491906 2422228 2355440 2296543 2247616 2208380 2177593
50610 2177593 2154424 2138663 2129841 2126572 2126989 2129697 2133865 2138164 2139907 2135718 2123147 2101418 2070674
50597 2070674 2031067 1982805 1926800 1864958 1799913 1734419 1670572 1609332 1550907 1495693 1444583
50586 1444583 1398311 1356861 1319726 1286373 1256182 1228249 1201744 1176434 1152676 1130920 1111359
50575 1111359 1093969 1078774 1066133 1056671 1050640 1047423 1046105 1046634 1049914 1056507 1065737 1076437 1088149
50562A088149J3039J4709J6508J8516K0758K2960K5029K7377L0357L3682L6605
50551A347689L8417L8668L7312L4910L2350L0145K8166K6149K4209K2844K2651
50540A683510K3970K6456K9159L1533L4219L8241M3471M8559N2518N5650N8868
50529B126154O2880O8204P5088Q2972R0619R7265J03026J07940J11332J12648
50519C038128J12106J09890J05332R7614Q6815P3557N8153M0887K2613M213j4266
50508C735042l3005n1216o7496q1299r3033j02530j08418j09405j05601r8159
50498B884880q8108p5922o1856m6295k9864j3322K761J8102L2178M3708N1211
50487B717473N4099N2619M6635L5214J7872m128k8285n2253p4339r3048j07114
$$ plain form
50562 1088149 1101188 1115897 1132405 1150921 1171679 1194639 1219668 1247045 1277402 1311084 1347689
50551 1347689 1386106 1424774 1462086 1496996 1529346 1559491 1587657 1613806 1638015 1660859 1683510
50540 1683510 1707480 1733936 1763095 1794628 1828847 1867088 1910559 1959118 2011636 2067286 2126154
50529 2126154 2189034 2257238 2332326 2415298 2505917 2603182 2706208 2814148 2925480 3038128
50519 3038128 3150234 3260124 3365456 3463070 3549885 3623442 3681595 3722482 3745095 3749308 3735042
50508 3735042 3702037 3650821 3583325 3502026 3408993 3306463 3198045 3088640 2983039 2884880
50498 2884880 2796772 2720850 2658994 2612699 2582835 2569513 2572274 2590376 2622554 2666262 2717473
50487 2717473 2771572 2824191 2870826 2906040 2923912 2919784 2891499 2839246 2764907 2671859 2564745
50476B564745j16139j20702j21541j19005j13445j05802r7322q8838q0640p2923
50466A528388o5906n9462n3150m6874m1143l6313l1882k7065k1914j7257j3477
50455A113945r950n973j738J953M575O043O315N418L860K559K286L279N343Q048
50441A145963J0884J3490J5674J7103J7120J5272J1985Q452N775M338L960M372
50429A274388N430P038Q948J0710J1950J2779J3693J4924J6087J6721J6954J7379
50417A427001J8422K0236K2902K6331L0035L3562L7130M1302M5974N0199N3207
50406A806301N5087N6242N6652N5983N4071N0896M6419M0778L4513K8158K1640
50395B306740J4280N384n274j7329k9944m2125n3063o2131o8692p2269p3042p1721
$$ plain form
50476 2564745 2448606 2327904 2206363 2087358 1973913 1868111 1770789 1681951 1601311 1528388
50466 1528388 1462482 1403020 1349870 1302996 1261853 1225540 1193658 1166593 1144679 1127422 1113945
50455 1113945 1103995 1098022 1096284 1098237 1102812 1108855 1115170 1120588 1124448 1127007 1129293 1132572 1137915 1145963
50441 1145963 1156847 1170337 1186011 1203114 1220234 1235506 1247491 1255943 1261718 1266056 1270016 1274388
50429 1274388 1279818 1286856 1295804 1306514 1318464 1331243 1344936 1359860 1375947 1392668 1409622 1427001
50417 1427001 1445423 1465659 1488561 1514892 1544927 1578489 1615619 1656921 1702895 1753094 1806301
50406 1806301 1861388 1917630 1974282 2030265 2084336 2135232 2181651 2222429 2256942 2285100 2306740
50395 2306740 2321020 2326404 2321130 2303801 2273857 2231732 2178669 2116538 2047846 1975577 1902535 1830814
50383A830814o8702o3741n6700m8202l9073k9601j9830j0253j550O171J3204J9431
50371A531968K4209K6973K7266K4341J7621P805l250j4030k4172l3586m1588m7410
50359A496147n0975n2545n2153m9964m6811m3759m1274l9294l7761l6475l4759
50348A010377l1958k8230k4298k0521j6760j3017r607o663m005j542O83K866N364
50335H62689Q215J1123J3920J6483J8155J7800J4657Q921J605n680j0979j2962
50323I43947j2001r781p544n164k121J198L689M715M689M635N322O640P692P711
50309I53627O884O015N556N432N658O388P285P638P345P020O937O644O045N947
50295A044421O957Q534R749J0366J0612J0588J0638J1619J4154J8217K3924L1359
$$ plain form
50383 1830814 1762112 1698371 1641671 1593469 1554396 1524795 1504965 1494712 1493162 1499333 1512537 1531968
50371 1531968 1556177 1583150 1610416 1634757 1652378 1660183 1656933 1642903 1618731 1585145 1543557 1496147
50359 1496147 1445172 1392627 1340474 1290510 1243699 1199940 1158666 1119372 1081611 1045136 1010377
50348 1010377 978419 950189 925891 905370 888610 875593 865986 859323 855318 853776 854459 857325 862689
50335 862689 870904 882027 895947 912430 930585 948385 963042 971963 973568 967888 956909 943947
50323 943947 931946 922165 914621 909457 907336 908534 912223 916938 921627 926262 931584 938224 945916 953627
50309 953627 960511 966526 972082 977514 983172 989560 996845 1004483 1011828 1018848 1025785 1032429 1038474 1044421
50295 1044421 1051378 1059912 1069661 1080027 1090639 1101227 1111865 1123484 1137638 1155855 1179779 1211138
50283A211138L8282L9218K9344R845j2007k8510l6521l7279l3439k7317k0727
50272A132027j4769r687n362j873P09K540L683L905L102J610o5j527k403k471
50258A109419k025j570j106k35Q15J080Q9j343k029j588l51J367L393N545P889
50243A119350J0841J4553J8483K1975K4848K7021K8040K7677K6626K5883K5527
50232A370824K4846K3650K2746K2868K3479K2941J9721J3478N256l396j1634j9567
50220A515212k7266l3868l8112l9563l8762l6307l2348k7062k1152j5676j1813
50209A193283j0783j3389j9121k5915l1267l3699l3288l1144k8519k6101k3777
50198I16280k1153j8329j5953j4315j2880j1110r410q641q817q963q360p270o247
$$ plain form
50283 1211138 1249420 1288638 1317982 1327827 1315820 1287310 1250789 1213510 1180071 1152754 1132027
50272 1132027 1117258 1107571 1102209 1100336 1101045 1103585 1107268 1111173 1114275 1115885 1115820 1114293 1111890 1109419
50258 1109419 1107394 1105824 1104718 1104483 1105298 1106378 1106467 1105124 1103095 1101507 1101156 1102523 1105916 1111461 1119350
50243 1119350 1130191 1144744 1163227 1185202 1210050 1237071 1265111 1292788 1319414 1345297 1370824
50232 1370824 1395670 1419320 1442066 1464934 1488413 1511354 1531075 1544553 1549809 1546413 1534779 1515212
50220 1515212 1487946 1454078 1415966 1376403 1337641 1301334 1268986 1241924 1220772 1205096 1193283
50209 1193283 1182500 1169111 1149990 1124075 1092808 1059109 1025821 994677 966158 940057 916280
50198 916280 895127 876798 860845 846530 833650 822540 813130 804489 795672 786709 778349 771079 764832
50185G64832n417m765m510m624m503l769k992k896l207l139k770k896l523l656
50171G12165k859j927j515j128k65L99k1j029j234j86J216K034K184K037J929
50156G11800K162K914M033N334O843Q401R303R001P934O886N812M183K250R48
50142G87804M20j93j255j924j355K77K451N165Q493J2009J5305J8539K1852K4765
50128H92353K6890K8834L1667L5713M0487M5426N0016N3325N4386N3230N0977
50117A363304M8727M6834M5491M5333M6826M9190N0466M8895M3953L5980K5215
50106A850214J1825l311j8445l1956m3065n1457n6859n9488o0422o0723o0365
50095A415948n8602n5155n0417m4773l8595l2761k8255k5045k2208j9318j6933
$$ plain form
50185 764832 759415 754650 750140 745516 741013 737244 734252 731356 728149 725010 722240 719344 715821 712165
50171 712165 709306 707379 705864 704736 704471 704870 704849 703820 702586 702400 703616 705650 707834 709871 711800
50156 711800 713962 716876 720909 726243 733086 741487 750790 759791 767725 774611 780423 784606 786856 787804
50142 787804 788224 788031 786776 784852 783497 783774 786225 791390 799883 811892 827197 845736 867588 892353
50128 892353 919243 948077 979744 1015457 1055944 1101370 1151386 1204711 1259097 1312327 1363304
50117 1363304 1412031 1458865 1504356 1549689 1596515 1645705 1696171 1745066 1789019 1824999 1850214
50106 1850214 1862039 1858728 1840283 1808327 1765262 1713805 1656946 1597458 1537036 1476313 1415948
50095 1415948 1357346 1302191 1251774 1207001 1168406 1135645 1107390 1082345 1060137 1040819 1023886
50084A023886j5500j4581j3538j2249j0753q804o295l590j070J246L284M663N262
50071I51961N576O109O700O820O168M843L289K134J635J200O7j506k476k607k898
50056I87015m024n332n948o049o300o671o638o053n139m015k854k077j780j345
50042I22790j67J562L288M833O272P533Q667J0051J1779J3360J4452J5302J6000
50029A035722J6041J5262J4404J3963J3243J1489R224P456O121M529K810J726
50017A151990J307Q17j74j671l890o724q853q622n881j905K415P058J1751J5719
50003A153337J8854K1878K5029K7659K9397L0545L1004K9991K7466K4747K2998
49992A442905K1957K0753J9097J6722J2361M401p457k1700l5927m7883n6088o0203
$$ plain form
50084 1023886 1008386 993805 980267 968018 957265 948461 942166 938576 937506 938752 942036 946699 951961
50071 951961 957537 963646 970346 977166 983334 988177 991466 993600 995235 996435 996502 994996 992520 989913 987015
50056 987015 982991 977659 971711 965662 959362 952691 946053 940000 934861 930846 927992 925915 924135 922790
50042 922790 922623 924185 927473 932306 938578 946111 954778 964829 976608 989968 1004420 1019722 1035722
50029 1035722 1051763 1067025 1081429 1095392 1108635 1120124 1129348 1136804 1142925 1147454 1150264 1151990
50017 1151990 1153297 1154114 1153940 1152269 1148379 1141655 1132802 1124180 1118299 1116394 1118809 1125867 1137618 1153337
50003 1153337 1172191 1194069 1219098 1246757 1276154 1306699 1337703 1367694 1395160 1419907 1442905
49992 1442905 1464862 1485615 1504712 1521434 1533795 1538196 1530739 1509039 1473112 1425229 1369141 1308938
49980A308938o0933n9252n5775n0997m5708m0738l6340l2135k7723k3238j9256
49969H56843j6199j3823j1563r347p754p080o759o031m796l279j389Q86K871L923
49955G76503M525N716P513Q850R035Q358P240N785M326L337K585J295n23j912
49941H42633k501l201m841p008q827j0109j1119j1945j2708j3810j5250j6219
49929G25095j5980j4724j3105j1412r684q099o733n342l870k620j614l68J211
49916F32755K374K637K609L064L782M114M190M673N713P058Q793J1100J3392J4674
49902G20928J4734J4182J3380J2172J0682R496Q784P926O304L998J377j499m756
49889H17708q273j1576j4077j5321j5322j4671j4049j3600j2946j1901j0778j0033
$$ plain form
49980 1308938 1248005 1188753 1132978 1081981 1036273 995535 959195 927060 899337 876099 856843
49969 856843 840644 826821 815258 805911 798157 791077 784318 778287 773491 770212 768823 769709 772580 776503
49955 776503 781028 786744 794257 803107 812142 820500 827740 833525 837851 841188 843773 845068 844545 842633
49941 842633 840132 836931 832090 825082 816255 806146 795027 783082 770374 756564 741314 725095
49929 725095 709115 694391 681286 669874 660190 652091 645358 640016 636146 633526 631912 631544 632755
49916 632755 635129 637766 640375 643439 647221 651335 655525 660198 665911 672969 681762 692862 706254 720928
49902 720928 735662 749844 763224 775396 786078 795574 804358 812284 818588 822586 823963 822464 817708
49889 817708 809435 797859 783782 768461 753139 738468 724419 710819 697873 685972 675194 665161
$$ [...]
##END NTUPLES=NMR SPECTRUM
##END=
