##TITLE=AC1749_SEN00022_9280973_mEKdDWcYx0
##JCAMPDX= 6.0         $$ Bruker NMR JCAMP-DX V2.0
##DATA TYPE= NMR SPECTRUM
##DATA CLASS= NTUPLES
##ORIGIN= BRUKER
##OWNER= Administrator
$$ 1.72 TOPSPIN		Version 2.1
$$ 2015-07-18 22:00:52.682 -0700  Administrator@X
$$ Compression mode = diff/dup
##.OBSERVE FREQUENCY= 400.02188249412
##.OBSERVE NUCLEUS= ^1H
##.ACQUISITION MODE= SIMULTANEOUS (DQD)
##.ACQUISITION SCHEME= undefined
##.AVERAGES= 8
##.DIGITISER RES= 22
##SPECTROMETER/DATA SYSTEM= spect
##.PULSE SEQUENCE= zg30
##.SOLVENT NAME= COFFEE_meoh
##.SHIFT REFERENCE= INTERNAL, COFFEE_meoh, 1, 14.98509
##AUDIT TRAIL= $$ (NUMBER, WHEN, WHO, WHERE, PROCESS, VERSION, WHAT)
$$ ##TITLE= Audit trail, TOPSPIN		Version 2.1
$$ ##JCAMPDX= 5.01
$$ ##ORIGIN= Bruker BioSpin GmbH
$$ ##OWNER= Administrator
$$ $$ E:\/data/COFFEE/nmr/AC1749_SEN00022_9280973_mEKdDWcYx0/20/pdata/1/auditp.txt
$$ ##AUDIT TRAIL=  $$ (NUMBER, WHEN, WHO, WHERE, PROCESS, VERSION, WHAT)
(   1,<2015-07-18 22:00:45.244 -0700>,<Administrator>,<X>,<go>,<TOPSPIN 2.1>,
      <created by zg
	started at 2015-07-18 21:59:39.213 -0700,
	POWCHK enabled, PULCHK disabled,
       configuration hash MD5:
       21 0F 79 D6 B3 7B B4 F6 88 20 88 DB 03 48 BD 9F
       data hash MD5: 64K
       4E 9F D4 1D 19 93 5F E2 29 92 4F A3 FB A1 78 49>)
(   2,<2015-07-18 22:00:48.510 -0700>,<Administrator>,<X>,<proc1d>,<TOPSPIN 2.1>,
      <Start of raw data processing
       efp LB = 0 FT_mod = 6 PKNL = 1 PHC0 = 0 PHC1 = 0 SI = 32K 
       data hash MD5: 32K
       FF 95 EE 39 30 DF 8E AA 47 9A B8 70 B2 43 6D 2B>)
(   3,<2015-07-18 22:00:48.791 -0700>,<Administrator>,<X>,<proc1d>,<TOPSPIN 2.1>,
      <pk PHC0 = 87.24243 PHC1 = 0 
       data hash MD5: 32K
       43 DB EE C1 68 F5 D1 84 1C 8A C2 EC 84 AD 48 AA>)
(   4,<2015-07-18 22:00:48.916 -0700>,<Administrator>,<X>,<proc1d>,<TOPSPIN 2.1>,
      <abs ABSG = 1 
       data hash MD5: 32K
       FB 9A A9 5F 3D 02 5F 83 ED 55 3F 90 24 3C 88 58>)
(   5,<2015-07-18 22:00:48.994 -0700>,<Administrator>,<X>,<proc1d>,<TOPSPIN 2.1>,
      <abs ABSG = 2 
       data hash MD5: 32K
       E1 FC AD 7B 6E 7B 6D FC 21 99 95 E4 BD 1B AF 8A>)
(   6,<2015-07-18 22:00:49.041 -0700>,<Administrator>,<X>,<proc1d>,<TOPSPIN 2.1>,
      <abs ABSG = 3 
       data hash MD5: 32K
       74 73 E1 41 38 FB C3 6F 6B 4F 48 B3 DC 13 DD B8>)
(   7,<2015-07-18 22:00:49.119 -0700>,<Administrator>,<X>,<proc1d>,<TOPSPIN 2.1>,
      <abs ABSG = 4 
       data hash MD5: 32K
       3A 9F 70 F3 8F F7 1D AF 03 52 82 1C D3 B2 8A 25>)
(   8,<2015-07-18 22:00:49.182 -0700>,<Administrator>,<X>,<proc1d>,<TOPSPIN 2.1>,
      <abs ABSG = 5 
       data hash MD5: 32K
       F2 68 CC E5 08 8E A4 88 C5 8E CD D8 7A 83 EF EB>)
$$ ##END=
$$ 
$$ $$ hash MD5
$$ $$ 04 FA 61 EC 58 FB 5C 6C 8D 25 39 0E 40 DE 2F 35
##$RELAX= 
##$RELAX= 
##$RELAX= 
##$RELAX= 
##$RELAX= 
##$RELAX= 
##$RELAX= 
$$ Bruker specific parameters
$$ --------------------------
##$DU= <E:\>
##$EXPNO= 20
##$NAME= <AC1749_SEN00022_9280973_mEKdDWcYx0>
$$ [...]
150 150 150 150 150 150 150 150
##$TP07= 0
##$TPNAME0= <>
##$TPNAME1= <>
##$TPNAME2= <>
##$TPNAME3= <>
##$TPNAME4= <>
##$TPNAME5= <>
##$TPNAME6= <>
##$TPNAME7= <>
##$TPOAL= (0..7)
0.5 0.5 0.5 0.5 0.5 0.5 0.5 0.5
##$TPOFFS= (0..7)
0 0 0 0 0 0 0 0
##$TUNHIN= 0
##$TUNHOUT= 0
##$TUNXOUT= 0
##$USERA1= <user>
##$USERA2= <user>
##$USERA3= <user>
##$USERA4= <user>
##$USERA5= <user>
##$V9= 5
##$VALIST= <valist>
##$VCLIST= <CCCCCCCCCCCCCCC>
##$VD= 0
##$VDLIST= <DDDDDDDDDDDDDDD>
##$VPLIST= <PPPPPPPPPPPPPPP>
##$VTLIST= <TTTTTTTTTTTTTTT>
##$WBST= 2048
##$WBSW= 25
##$XGAIN= (0..3)
0 0 0 0
##$XL= 0
##$YL= 0
##$YMAX_a= 549692
##$YMIN_a= -486384
##$ZGOPTNS= <>
##$ZL1= 120
##$ZL2= 120
##$ZL3= 120
##$ZL4= 120
##$ABSF1= 14.98509
##$ABSF2= -5.573092
##$ABSG= 5
##$ABSL= 3
##$ALPHA= 0
##$AQORDER= 0
##$ASSFAC= 0
##$ASSFACI= 0
##$ASSFACX= 0
##$ASSWID= 0
##$AUNMP= <proc_prof1d_extract_pilot.lims>
##$AXLEFT= 0
##$AXNAME= <>
##$AXNUC= <1H>
##$AXRIGHT= 0
##$AXTYPE= 0
##$AXUNIT= <>
##$AZFE= 0.1
##$AZFW= 0.1
##$BCFW= 0
##$BC_mod= 0
##$BYTORDP= 0
##$COROFFS= 0
##$CY= 15
##$DATMOD= 1
##$DC= 0
##$DFILT= <>
##$DTYPP= 0
##$F1P= 0
##$F2P= 0
##$FCOR= 0.5
##$FTSIZE= 32768
##$FT_mod= 6
##$GAMMA= 0
##$GB= 0
##$INTBC= 1
##$INTSCL= 1
##$ISEN= 128
##$LB= 0
##$LEV0= 0
##$LPBIN= 0
##$MAXI= 10000
##$MC2= 0
##$MEAN= 0
##$ME_mod= 0
##$MI= 0
##$NCOEF= 0
##$NC_proc= -8
##$NLEV= 6
##$NOISF1= 0
##$NOISF2= 0
##$NSP= 0
##$NTH_PI= 0
##$NZP= 0
##$OFFSET= 14.98509
##$PC= 1
##$PHC0= 87.24243
##$PHC1= 0
##$PH_mod= 1
##$PKNL= yes
##$PPARMOD= 0
##$PPDIAG= 0
##$PPIPTYP= 0
##$PPMPNUM= 2147483647
##$PPRESOL= 1
##$PSCAL= 4
##$PSIGN= 0
##$PYNMP= <proc.py>
##$REVERSE= no
##$SF= 400.02
##$SI= 32768
##$SIGF1= 0
##$SIGF2= 0
##$SINO= 400
##$SIOLD= 32768
##$SPECTYP= <>
##$SREGLST= <1H.CDCl3>
##$SSB= 0
##$STSI= 32768
##$STSR= 0
##$SW_p= 8223.68421052631
##$SYMM= 0
##$S_DEV= 0
##$TDeff= 65536
##$TDoff= 0
##$TI= <>
##$TILT= no
##$TM1= 0
##$TM2= 0
##$TOPLEV= 0
##$USERP1= <user>
##$USERP2= <user>
##$USERP3= <user>
##$USERP4= <user>
##$USERP5= <user>
##$WDW= 1
##$XDIM= 32768
##$YMAX_p= 445351746
##$YMIN_p= -707122
##$CURPLOT= <Network HP LaserJet P1505>
##$CURPRIN= <$Network HP LaserJet P1505>
##$DFORMAT= <normdp>
##$LAYOUT= <+/1D_H.xwp>
##$LFORMAT= <normlp>
##$PFORMAT= <normpl>
##$SURQMSG= 1
$$ End of Bruker specific parameters
$$ ---------------------------------
##NTUPLES= NMR SPECTRUM
##VAR_NAME=  FREQUENCY,     SPECTRUM/REAL,   SPECTRUM/IMAG
##SYMBOL=    X,             R,               I
##VAR_TYPE=  INDEPENDENT,   DEPENDENT,       DEPENDENT
##VAR_FORM=  AFFN,          ASDF,            ASDF
##VAR_DIM=   32768,         32768,           32768
##UNITS=     HZ,            ARBITRARY UNITS, ARBITRARY UNITS
##FACTOR=    0.250966925370066, 1,           1
##FIRST=     8223.43324360094, -20834,       -167223
##LAST=      0,             -6948,           53641
##MIN=       0,             -707122,         0
##MAX=       8223.43324360094, 445351746,    0
$$ Real data points
##PAGE= N=1
##DATA TABLE= (X++(R..R)), XYDATA
$$ [...]
$$ plain form
19570 396956 -107296 85761 -34076 -59935 73195 62784 -22774 120211 31919 258746 -208339
19558 -56000 333350 169480 -79382 47946 -3470 -196376 -573292 44280 -45556 154467 -143452
19546 -472295 -158690 130099 -289659 -139188 203282 38253 -398893 3779 -203517 -236271
19536 -236271 -72391 -51447 -85606 -104910 -54374 -61855 -153042 -78745 -287101 -192234 -75273
19524 -256793 -123854 -25731 -434972 -15211 125502 -138908 -14026 -131590 1495 -82688 82098
19512 -179852 -13564 -161558 144012 56221 -235825 -128428 30997 -27899 60622 122073 -90888
19500 -72549 -71541 -250566 78523 112922 110000 -120689 -104342 42540 -8958 197087 -50391 -128756
19488 -128756 -107394 43978 -57746 121537 7264 -177104 -385535 219454 -265677 -116751
$$ packed form
19570C96956a07296H5761c4076k5859G3195j0411b2774A20211C1919K26827b08339
19558e6000C33350j63870g9382D7946c470j92906l76916D4280d5556A54467a43452
19546d72295a58690A30099b89659a39188B03282C8253c98893C779b03517l2754
19536b36271g2391K0944l4159j9304N0536p481r1187P4297k08356R4867g5273
19524b56793a23854b5731m09241a5211A25502a38908a4026j17564A495h2688H2098
19512a79852a3564j47994A44012E6221b35825J07397C0997b7899F0622O1451i0888
19500g2549J008j79025G8523L4399k922a20689J6347D2540h958A97087e0391p8365
19488a28756K1362D3978e7746A21537G264a77104k08431B19454b65677a16751
$$ plain form
19477 -164261 -137057 -6693 -501667 -98145 315659 109446 32837 32132 4660 -320793 -325005 -304827
19465 -304827 -64788 40215 -870 326405 146981 -101980 -168890 67544 -66539 163995 -293440
19453 -150863 -64693 -393699 186756 -110377 -130272 135875 -132274 21668 -153913 12463
19442 172472 -126316 35543 -15058 75483 -21011 -188153 -142623 -151033 -68310 171137 -251560
19430 -191009 94530 -115518 -254060 -110192 725 399861 -86977 47320 -427330 -40699 141439
19418 68949 -538968 -348726 -4338 -59445 201309 -101866 75458 100757 -142593 -276919 -14612
19406 -102042 -216732 -262123 -173617 -259857 -251014 -260248 126161 -93953 58942 -98228 -215233
19395 -215233 19086 -7047 -124506 -291859 -62706 -177108 73803 -76002 -14681 332831 10034
$$ packed form
19477a64261K7204f693m94974i8145C15659A09446C2837p05D660c20793m212K0178
19465c04827f4788D0215h70C26405A46981a01980o6910F7544f6539A63995b93440
19453a50863f4693l29006A86756a10377j9895A35875a32274B1668a53913A2463
19442A72472a26316C5543a5058G5483b1011j67142M5530q410f8310A71137b51560
19430a91009I4530a15518j38542a10192G25L99136h6977D7320d27330d0699A41439
19418F8949e38968J90242d338n5107B01309a01866G5458K5299a42593j34326a4612
19406a02042j14690m5391Q8506q6240Q843r234A26161i3953E8942i8228j17005
19395b15233A9086g047j17459j67353f2706j14402G3803g6002a4681C32831A0034
$$ plain form
19383 -229793 -262207 42704 -12409 -71552 -14919 24932 -26555 -28343 27360 -278450 123056
19371 102005 383319 249958 -80532 50448 -54903 111213 -107388 75564 120012 -39868 -37916
19360 -37916 67617 -107031 -524974 -32626 67655 74742 -206442 -189683 -46379 -79157 -35985
19348 -733 -9285 55860 -213961 54425 22290 -20332 -295794 -12466 95354 -299178 -97655 95983
19335 -120132 42797 67281 -112949 -202052 -71630 -64035 -752 135589 -16774 -124777 -68803
19324 -68803 -92083 -165499 -353703 -84256 -114414 -45893 -6657 88556 -83715 142936 -189111
19312 -156980 -169072 -61859 118554 21998 178106 -12923 32120 118767 59913 14758 -56858
19300 232134 -138262 -15837 80032 -210901 88820 4023 -63879 26748 107493 8700 -238786
$$ packed form
19383b29793l2414D2704a2409n9143a4919B4932b6555j788B7360b78450A23056
19371A02005K81314j33361h0532E0448e4903A11213a07388G5564M4448c9868J952
19360c7916F7617a07031m17943c2626F7655P087b06442J6759d6379l2778c5985
19348g33q552E5860b13961E4425B2290b0332k75462a2466I5354b99178i7655I5983
19335a20132D2797K4484a12949q9103g1630P595g52A35589a6774j08003N5974
19324f8803k3280p3416j88204h4256l0158d5893f657H8556h3715A42936a89111
19312a56980j2092f1859A18554B1998J56108a2923C2120Q6647n8854A4758e6858
19300B32134a38262a5837H0032b10901H8820D023f3879B6748Q0745H700b38786
$$ plain form
19288 -93987 -332024 349654 34558 217797 -170580 -115176 63889 -335045 10623 -77350 -169470
19277 -169470 62553 -104048 79417 -137067 -151934 -5732 -217221 -55013 224945 62514 -28081
19265 354838 -244437 -16965 -116761 -85646 -229331 291630 -206209 -54063 -302584 -12094
19254 -99244 200511 135555 -382721 -270272 -113963 22604 -198906 -18725 -163893 207453
19243 -397038 194821 -223731 -32218 -311729 -55061 -333770 -177708 -62180 -255224 -237654
19233 -237654 74480 -323814 -97078 -138469 18546 283868 -81297 244691 -26355 140130 -275789
19221 117974 59925 249344 -7297 -50024 102996 158029 -171365 12642 -94399 -117246 -86747
19210 -86747 9006 -195987 -67795 -250672 310643 219488 23391 69151 -332843 -59314 -272324
$$ packed form
19288i3987k38037C49654C4558J83239a70580N5404F3889c35045A0623g7350r2120
19277a69470F2553a04048G9417a37067j4867e732k11489e5013B24945F2514b8081
19265C54838b44437a6965r9796L1115j43685B91630b06209e4063k48521a2094
19254i9244B00511o4956c82721J12449a13963B2604a98906a8725j45168B07453
19243c97038A94821b23731c2218k79511e5061k78709J56062f2180j93044J7570
19233b37654G4480c23814i7078m1391A8546K65322h1297B44691b6355A40130b75789
19221A17974n8049J89419g297m2727A02996N5033a71365A2642i4399k2847L0499
19210h6747I006a95987f7795j82877C10643r1155B3391M5760c32843e9314k13010
$$ plain form
19199 -272324 -486405 12132 23806 90295 160329 51858 57553 -287154 -28179 -236185 -103567
19187 91135 -184706 469659 45175 -82837 -220306 24137 32635 426064 -1613 290737 -434981
19175 -79717 -158709 -130221 104926 -336427 -334033 -43816 -263647 -230669 119706 -170128 111618
19163 -98914 -158106 7103 -139905 -51403 18561 -120593 -109860 269031 -143254 -79866 -79701
19152 -79701 -124421 197134 197275 -114741 -126051 27866 81494 51735 -184974 72738 7778 -71831
19139 157734 -100376 -122262 -259126 131884 -46299 -186115 132910 -78321 5811 54358 -125722
19127 -36825 64633 -471873 28904 -106948 66014 100717 -196448 -183189 -52946 -88234 101582
19115 -599837 -53189 -217591 -351110 -53592 -312938 32540 -246119 -182214 -147698 -18325 -1624
$$ packed form
19199b72324k14081A2132J1674O6489P0034E1858N695b87154b8179k08006a03567
19187I1135a84706D69659D5175h2837j37469B4137Q498L93429a613B90737d34981
19175g9717p8992K8488A04926c36427K394d3816k19831L2978A19706a70128A11618
19163i8914n9192G103a39905e1403A8561a20593J0733B69031a43254O3388J65
19152g9701m4720A97134J41a14741j1310B7866N3628k9759a84974G2738G778g1831
19139A57734a00376k1886j36864A31884d6299j39816A32910g8321E811M8547a25722
19127c6825F4633d71873B8904a06948F6014L4703a96448J3259e2946l5288A01582
19115e99837e3189j64402j33519e3592k59346C2540b46119O3905L4516a8325a624
$$ plain form
19103 -37062 31674 -312507 -133926 -177486 -131033 -76922 146751 -94570 -299212 -63928 221351
19091 -76460 54896 -243925 65440 48619 -217066 -119327 -12178 177616 -58153 113725 -41569
19079 184439 158223 -12274 -165121 -193051 -120039 -145998 90314 -287443 -306580 240566 -70028
19067 80244 -215519 353147 -115144 -11259 -73355 90938 -87917 -79349 126326 53938 90437
19056 90437 -92532 -65963 -16054 -9890 -416821 -432066 232959 101621 -15547 -203936 -22762
19044 -197479 -133133 212893 172211 187578 -195898 264039 215084 -93988 -66837 -230907 -113432
19032 17333 -55627 279022 12268 -93755 130788 -6861 222128 -200303 72049 9090 -44546
19020 -215695 274679 -8933 -39995 135617 -273308 -127051 -23759 76909 -316495 -12081 210408
$$ packed form
19103c7062C1674c12507a33926m3560M6453N4111A46751i4570k04642f3928B21351
19091g6460E4896b43925F5440j6821b17066R7739a2178A77616e8153A13725d1569
19079A84439k6216a2274j52847k7930P3012k5959I0314b87443j9137B40566g0028
19067H0244b15519C53147a15144a1259o2096I0938h7917Q568A26326E3938L6499
19056I0437i2532K6569a6054O164m06931j5245B32959A01621a5547j88389b2762
19044a97479O4346B12893m0682J5367a95898B64039m8955i3988K7151j64070a13432
19032A7333e5627B79022A2268i3755A30788f861B22128b00303G2049I090d4546
19020b15695B74679h933l1062A35617b73308a27051b3759G6909c16495a2081B10408
$$ plain form
19008 -69630 108423 116497 52793 -341428 86808 -369954 281392 88077 -150367 33568 -127025
18996 195151 -169534 208809 -158082 158322 -108465 -62527 -293895 8246 -99458 -39214
18985 -234279 -79632 119065 182318 -383463 -138798 -105110 -233436 -106380 -84145 98519
18974 -158353 22596 153445 -336544 56954 -80681 150599 119213 -138960 181173 -267494
18963 198961 15696 -371656 -234434 53264 96550 101443 -34540 3738 -299888 -92973 76193
18951 -239590 -38241 252645 65141 -104025 -12276 -140445 32643 112067 -31250 149343 -50244
18939 208375 126616 44324 -258915 -190162 280312 -238135 -23084 -281505 -7369 -265434 87263
18927 -73702 -105644 -150500 -7286 15168 229392 -300474 -214499 -182599 -433434 -18473 -19936
$$ packed form
19008f9630A08423Q074E2793c41428H6808c69954B81392H8077a50367C3568a27025
18996A95151a69534B08809a58082A58322a08465M5938k31368H246i9458c9214
18985b34279g9632A19065O3253c83463a38798L3688j28326a06380K2235I8519
18974a58353B2596J30849c36544E6954h0681A50599l1386a38960A81173b67494
18963A98961A5696c71656J37222E3264M3286M893c4540C738b99888i2973G6193
18951b39590c8241B52645F5141a04025a2276j28169C2643P9424c1250A49343e0244
18939B08375q1759D4324b58915O8753B80312b38135b3084k58421g369k58065H7263
18927g3702l1942m4856g286A5168K14224c00474Q5975L1900k50835a8473j463
$$ plain form
18916 -19936 -78007 -36019 256376 41049 -104049 25937 -65516 162122 -231357 -127727 122249
18904 88699 64251 -262530 -256923 -42690 277974 -332702 -157436 -58745 -164243 -63362 -220180
18893 -220180 -118376 908 -48299 -151283 -82228 -285932 -176035 -29860 8912 103361 -21436
18881 152383 -47836 97907 86251 -318095 74578 -44447 -171642 -238020 -34169 -13216 -180264
18870 -180264 -108393 170983 -153426 -465830 22754 -43519 130817 -98132 -135307 -318045
18860 -318045 -97194 -125646 -111217 51490 187500 -79450 432286 -275618 -64049 -44790 171937
18848 266331 -304582 51094 45533 -121813 -178981 -156110 13222 -267262 -7664 118416 -283866
18836 26521 50328 -265486 -145089 -34497 142892 215523 -479313 112782 37062 -330626
$$ packed form
18916a9936n8071c6019B56376D1049a04049B5937f5516A62122b31357J03630A22249
18904H8699k4448b62530N607d2690B77974c32702a57436e8745j05498f3362j56818
18893b20180J01804I08d8299j02984O9055k03704J09897b9860H912R4449b1436
18881A52383d7836I7907j1656c18095G4578d4447j27195o6378c4169a3216j67048
18870a80264P1871A70983a53426l12404B2754d3519A30817i8132l7175j82738
18860c18045i7194k8452J4429E1490J36010g9450D32286b75618f4049J9259A71937
18848B66331c04582E1094n561a21813n7168K2871A3222b67262g664A18416b83866
18836B6521K3807b65486J20397c4497A42892P2631d79313A12782C7062c30626
$$ plain form
18825 -179996 56943 200932 435790 -48495 -108961 212092 97462 -329342 281474 336235
18815 336235 36421 -32865 -2090 116616 160826 22207 -77409 -90281 -321750 -180279 -141674
18804 -141674 13413 120621 -83749 70842 128391 96759 63518 209428 -63197 146525 197533
18793 197533 -171933 -64120 -221497 -131070 -131832 146331 -33358 8774 -51291 73497 31090
18781 150126 47287 -218547 -117998 67479 67577 -99340 -50447 -86615 209018 -35030 -235617
18770 -235617 -260327 -134892 270737 -201638 -133232 -324175 -131193 -167744 -200050 97924
18759 81233 -160782 2689 -422947 -219677 91342 -507315 18927 -105749 244450 122408
18749 122408 -130475 128364 -241144 54060 -106384 135970 -73332 79576 -85723 -101112
$$ packed form
18825a79996E6943J43989K34858d8495o0466B12092I7462c29342B81474N4761
18815C36235C6421c2865b090A16616M4210B2207g7409j2872k31469J41471L8605
18804a41674A3413J07208h3749G0842N7549l1632l3241J45910f3197A46525N1008
18793A97533a71933f4120j57377R0427p62A46331c3358H774e1291G3497C1090
18781A50126D7287b18547J00549F7479R8i9340M8893l6168B09018c5030k00587
18770b35617k4710J25435B70737b01638O8406j90943a31193l6551l2306I7924
18759H1233a60782B689d22947K03270I1342e07315A8927a05749B44450j22042
18749A22408a30475A28364b41144E4060a06384A35970g3332G9576h5723j5389
$$ plain form
18739 -101112 71807 138504 129980 -219629 -265643 185453 -431697 -101281 -361517 203994
18728 -91517 -226941 -58966 158361 -464300 -4373 54823 -264506 -128049 -463731 196829
18717 -213515 -8100 -174761 -485631 -196768 -151109 -96979 24289 48920 23475 -60896 -66384
18706 -66384 -435211 39470 -104462 -161155 -285863 152473 -8986 169733 39530 -200923 -49852
18694 29412 28117 220146 -32231 -173092 -16184 -43580 380647 212439 -72531 -84089 -246427
18683 -246427 -318256 -186600 -117755 -162421 -93687 179014 -79333 -45324 -87158 10564 55351
18672 55351 180389 -78400 202953 -214767 -36752 63103 -130702 -167981 -70082 -450899 87935
18660 68947 4353 -236685 154302 -93998 315094 -43800 -273974 14601 -250132 116403 -249929
$$ packed form
18739a01112G1807O6697q524b19629m6014A85453d31697a01281k60236B03994
18728i1517j35424e8966A58361d64300d373E4823b64506a28049l35682A96829
18717b13515h100j66661l10870a96768M5659N4130B4289K4631B3475f0896n488
18706f6384l68827C9470a04462n6693j24708A52473h986A69733C9530b00923d9852
18694B9412j295J92029c2231j40861a6184k7396C80647j68208g2531j1558j62338
18683b46427p1829J31656O8845m4666O8734A79014g9333L4009m1834A0564M4787
18672E5351J25038g8400B02953b14767c6752F3103a30702l7279g0082l80817H7935
18660F8947D353b36685A54302i3998C15094d3800k30174A4601b50132A16403b49929
$$ plain form
18648 -87657 46821 285872 -169958 -77670 -214923 139185 124678 -181135 -91343 -218625
18638 -218625 -221124 -97022 -422966 -316759 128086 73097 -23053 -266591 -313995 -525100 -282001
18627 -282001 6033 -141623 -339789 -173854 -124243 -104101 137704 -3390 -56459 188945 113230
18616 113230 70582 308832 -364284 375365 39894 -4559 -122617 -373735 -132647 161762
18605 -215686 -422296 -101112 -188932 119257 -7649 -221432 -238565 -193983 -42147 60042 71195
18594 71195 66272 168578 -24391 72830 -95295 141968 189973 -47355 -209936 117185 187761
18583 187761 139061 -187431 336884 -111110 41541 154664 -46159 66710 -210468 -158791
18573 -158791 -3269 -27726 -43842 100155 6849 36467 53779 -173780 -203296 -157669 -214580
$$ packed form
18648h7657D6821K39051a69958g7670j37253A39185j4507a81135Q9792j27282
18638b18625k499i7022l25944J06207A28086n4989b3053k43538m7404k11105K43099
18627b82001F033a41623j98166J65935M9611K0142A37704c390n3069A88945p5715
18616A13230m2648K38250c64284C75365C9894d559j18058k51118a32647A61762
18605b15686k06610a01112q7820A19257g649k13783j7133M4582d2147F0042J1153
18594G1195m923J02306b4391G2830i5295A41968M8005d7355j62581A17185P0576
18583A87761m8700a87431C36884a11110D1541J13123d6159F6710b10468N1677
18573a58791c269k4457j6116A00155F849K9618J7312a73780k9516M5627n6911
$$ plain form
18562 -214580 -171304 28537 -80723 87256 -5089 -69366 -102625 -102933 102954 76343 -256799 -3036
18549 57883 -276813 -116734 -77280 187723 75530 211490 -186375 -57311 -412351 -266556
18539 -266556 95795 84017 -203276 -230157 20669 -127690 -304330 144424 -63800 191038
18528 -74819 24569 -219864 -40706 -79404 -21792 -198699 62420 6413 126397 -223977 63948
18516 179546 -313431 -3605 6832 149495 -101902 -42486 27937 82643 -48765 38854 134793
18505 134793 193042 -64766 1260 -16476 64060 -65723 -285173 -186552 200319 161095 105848
18494 105848 -99369 140284 -96093 72795 -152662 -151079 986 31018 178653 12493 -342626
18482 -115300 68121 -19925 136712 -318495 41496 31692 277943 -180259 -165763 46677 49413
$$ packed form
18562b14580M3276B8537h0723H7256e089o4277l3259l08A02954k6611b56799c036
18549E7883b76813a16734L9454A87723G5530J35960a86375e7311l55040J45795
18539b66556I5795j1778b03276k6881B0669a27690j76640A44424f3800A91038
18528g4819B4569b19864d0706l8698b1792j76907F2420F413J19984b23977F3948
18516A79546c13431c605F832J42663a01902d2486B7937N4706d8765C8854R5939
18505A34793N8249f4766A260a6476F4060f5723k19450R8621B00319l9224n5247
18494A05848i9369A40284i6093G2795a52662J583I86L0032J47635A2493c42626
18482a15300F8121a9925A36712c18495D1496r804K46251a80259J4496D6677K736
$$ plain form
18471 49413 1273 53046 -77498 228019 415412 40770 -313953 -259051 125726 -21732 -12105
18460 -12105 -50294 162581 177465 52777 214378 -236011 -143428 157604 55397 10530 -84455
18448 -76727 -369564 73816 67300 19196 -446489 -286580 108793 -21882 -279312 36825 108960
18437 108960 -136553 -141703 -99518 31620 -57506 -257645 -55291 63178 355982 46753 15764
18425 -128607 -32384 -49988 -294092 -204233 -84012 251 -128720 -68064 -17555 85318 -76598
18413 324174 804 -78628 -25492 -24705 -340221 -32639 235455 184848 -88472 37353 113486 -272390
18400 -57876 -307828 -139177 -111407 33992 -72135 16575 31783 -54320 83289 -205732 -220794
18389 -220794 139016 6574 -207061 39326 -118571 25225 -74310 13240 -290266 -110580 8617
$$ packed form
18471D9413A273N1773g7498B28019J87393D0770c13953N4902A25726b1732R627
18460a2105l8189A62581J4884E2777J61601b36011R2583A57604E5397A0530h4455
18448g6727k92837G3816o516A9196d46489J59909A08793b1882k57430C6825P2135
18437A08960a36553n150M2185C1620e7506k00139e5291F3178K92804D6753A5764
18425a28607c2384j7604k44104Q9859h4012B51a28720O0656a7555H5318g6598
18413C24174H04g8628b5492P87l15516c2639B35455n0607h8472C7353P6133b72390
18400e7876k49952a39177K7770C3992g2135A6575J5208e4320H3289b05732j5062
18389b20794A39016F574b07061C9326a18571B5225g4310A3240b90266a10580H617
$$ plain form
18377 78093 159963 73223 -163846 3447 65155 -242361 219270 222911 25384 -70167 -212414
18366 -212414 105944 475203 -139898 394078 29688 38600 175944 54498 -56096 220380
18355 -182596 -58069 127700 -167675 11949 -367240 -211377 -151447 -282679 -29764 113238
18344 -216365 75619 89052 -14983 -64267 -173867 31926 -220967 -33 -228734 41249 -436686
18332 -249501 -70537 -276131 -63917 -196110 -50836 146926 249501 46853 -72242 -424055
18322 -424055 -22025 231 51473 120638 -9775 -184712 -113826 125124 147230 -201160 -52478
18310 -233903 -21203 -61409 83573 -258190 -101895 43032 -24246 11639 -141514 67071 184364
18299 184364 -82866 -147119 -83983 -89402 -203562 -20149 12468 -291250 -277373 -188738 -225856
$$ packed form
18377G8093Q1870G3223a63846C447O1708b42361B19270L641B5384g0167j42247
18366b12414A05944L69259a39898C94078B9688Q912J37344E4498e6096B20380
18355a82596e8069A27700a67675A1949c67240J55863N9930j31232b9764A13238
18344b16365G5619J3433a4983m9284j09600C1926b20967c3k28701D1249d36686
18332b49501g0537k05594f3917j32193e0836A46926J02575D6853g2242l51813
18322d24055b2025B31N1242O9165i775j74937P0886A25124K2106b01160e2478
18310b33903b1203m0206H3573b58190a01895D3032b4246A1639a41514F7071J17293
18299A84364h2866o4253O3136n419j14160b0149A2468b91250J3877Q8635l7118
$$ plain form
18288 -225856 -184091 -276429 -116791 26917 119602 -365637 178004 -191727 -19120 35406 -223693
18276 -75004 71728 52728 -158044 -36784 65676 31408 176960 61420 -6033 46824 -86020
18264 -137651 299004 -181256 -157727 9470 119871 -17597 -122246 -141288 -157427 3009 -145973
18252 11460 -111333 -138109 17462 -273237 338380 -124405 35332 110724 6298 37527 -198441
18240 -26012 -182278 -345299 -147715 19128 -40172 159130 27686 -88883 68112 -21274 -13619
18229 -13619 462239 30487 186600 -220747 -77205 261305 -73481 -137116 -25110 -143585 -137675
18218 -137675 -403367 -23463 6359 -126346 -68106 -80270 -182207 27335 -112571 -174889 -68601
18206 -94833 -281111 -134441 -76404 18315 107431 151402 -83334 170408 -4160 118447 -150999
$$ packed form
18288b25856M1765r2338a16791B6917R2685c65637A78004a91727a9120C5406b23693
18276g5004G1728j9000a58044c6784F5676C1408J45552F1420f033D6824h6020
18264a37651B99004a81256K3529I470J10401a7597j04649j9042j6139C009a45973
18252A1460a11333k6776A7462b73237C38380a24405C5332P5392F298L1229a98441
18240b6012j56266j63021a47715A9128d0172A59130B7686h8883F8112b1274P655
18229a3619D62239C0487J56113b20747g7205B61305g3481o3635b5110j18475N910
18218a37675k65692b3463F359a26346N8240j2164j01937B7335a12571o2318f8601
18206i4833j86278a34441N8037A8315Q9116M3971h3334A70408d160A18447a50999
$$ plain form
18194 249459 -127487 -307899 13887 -424319 94772 -34008 -142029 116626 66907 287331
18184 287331 115872 -42702 192170 210479 -39638 -85541 -236614 -28042 64162 277561 207260
18173 207260 8489 358912 -79905 236026 237182 152878 99777 -118450 -136065 -245351 142584
18161 -97725 80293 127682 -106425 -32121 -102262 53430 -105983 -218540 214748 -50060 -164116
18150 -164116 -73184 162868 -24839 -468352 -123180 153765 -70821 -20031 -183344 -22394
18139 44532 78671 -135833 -178870 -232775 35520 -257767 119414 -275940 -87794 -264526 -58041
18127 289606 200274 -127177 223653 97646 260015 -83305 -552587 -161918 75818 24517
18116 179956 57932 13783 -122490 -294665 -149886 -243799 28744 47067 165946 24220 -298226
$$ packed form
18194B49459a27487j80412A3887d24319I4772c4008j08021A16626m9719K20424
18184B87331A15872d2702A92170J8309c9638m5903j51073b8042F4162K13399p0301
18173B07260H489L50423g9905B36026J156q4304n3101a18450j7615j09286A42584
18161i7725H0293M7389a06425c2121p0141E3430a05983j12557B14748e0060j14056
18150a64116g3184A62868b4839m43513a23180A53765g0821b0031j63313b2394
18139D4532L4139a35833m3037n3905C5520b57767A19414b75940h7794j76732e8041
18127B89606q9332a27177B23653I7646J62369h3305m69282a61918G5818B4517
18116A79956E7932A3783a22490j72175J44779r3913B8744J8323J18879B4220b98226
$$ plain form
18104 -43736 -52630 -255787 -117660 -38395 -81620 -174429 217931 -57092 -39485 -35167 142072
18092 -135404 -321124 98443 -2659 -100182 -70116 416200 99992 -83790 -117751 -42906 -262394
18081 -262394 -101798 -198657 -211618 33961 -246081 -52090 -175121 -5970 116485 -250805 257802
18069 -160447 -62220 -75448 124489 69597 -69311 -414013 -77054 335370 169328 -122486
18058 140766 256173 356333 -162127 -155706 -85521 47276 153014 129171 -71637 157486 17292
18046 -84807 2268 377959 53206 60548 -132342 290352 -28073 116212 -65943 -103951 292624
18034 -13200 281111 7728 -72839 -32558 29486 61341 -30117 107804 -169 -54193 67116 -14840
18021 -62887 74790 20581 -79657 -261074 -191909 -83153 -126341 -262426 166119 208574 238883
$$ packed form
18104d3736q894k03157a17660c8395m3225r2809B17931e7092J7607M318A42072
18092a35404j85720I8443b659r7523L0066D16200I9992h3790l3961d2906k19488
18081b62394a01798r6859j2961C3961b46081e2090j23031e970A16485b50805B57802
18069a60447f2220j3228A24489n4892f9311l44702g7054C35370j66042a22486
18058A40766J15407J00160a62127O421P0185D7276J05738k3843g1637A57486A7292
18046h4807B268L75691E3206P342a32342B90352b8073A16212f5943l8008B92624
18034a3200B81111G728g2839c2558B9486L1855c0117A07804a69n4024F7116a4840
18021f2887G4790B0581g9657j81417O9165h3153m3188j36085A66119M2455L0309
$$ plain form
18010 238883 29523 162897 -3022 72326 -56370 217824 37869 306214 -280758 -129803 -146783
17999 -146783 -179559 44839 -108927 62270 115079 -114967 135251 -361540 -96760 -108966 206709
17987 -209022 -11422 -153911 -6485 -78737 -119723 -271733 88954 -95717 -56244 249184 -297289
17975 364070 14199 -167927 53782 173510 30399 102559 44105 -183277 -56590 184525 41516
17963 -119828 -18211 -54314 -265760 -67262 -12335 -61563 -171010 -9272 -19752 100411 272812
17952 272812 274890 148229 -285967 121318 138828 82990 -67104 215842 -147010 156955
17941 -22378 -193938 169096 3982 -184689 -36795 -35976 -29384 -28494 109366 127123 -1997 -425665
17929 -425665 -218396 35202 58179 190049 -335918 285762 354698 264490 63093 -117285
$$ packed form
18010B38883B9523J33374c022G2326e6370B17824C7869K68345b80758a29803j6980
17999a46783l2776D4839a08927F2270N2809a14967A35251c61540i6760j2206B06709
17987b09022a1422j42489f485p2252m0986j52010H8954i5717L9473B49184b97289
17975C64070A4199a67927E3782J19728C0399P2160D4105a83277e6590A84525D1516
17963a19828a8211l6103k11446f7262a2335m9228j09447i272j0480A00411J72401
17952B72812K078j26661b85967A21318J7510n5838f7104B15842a47010A56955
17941b2378j71560A69096C982a84689c6795Q19O592Q90A09366J7757a997m23668
17929d25665K07269C5202K2977J31870c35918B85762O8936r0208F3093a17285
$$ plain form
17918 -153085 178473 -206326 120478 -274011 -6983 -145614 -93963 -14624 80632 -125766
17907 -39356 -222040 129777 120400 -326807 41224 67645 -149531 111479 -17523 -151035 30640
17895 113714 -50047 -127119 167414 254370 127818 138233 -197055 89741 -1153 -75868 99724
17883 261744 275680 80650 109619 42404 -249477 126409 207137 -61861 55186 11870 12958
17872 12958 17874 82357 -135067 -78980 142223 326929 186354 -131496 44413 -60513 -116084
17861 -116084 -173810 32834 -410635 72063 -157887 284976 13059 -1061 358239 -43883 119608
17849 108291 13031 8515 -39379 78563 2908 -165232 -96107 135829 -250333 17780 -303055
17837 20385 -1723 183700 -50988 -119803 87691 20564 114849 240583 -90663 -148057 -33327
$$ packed form
17918a53085A78473b06326A20478b74011f983j38631N1651a4624H0632a25766
17907c9356j82684A29777r377c26807D1224K6421a49531A11479a7523j33512C0640
17895A13714e0047p7072A67414Q6956j26552J0415a97055H9741a153p4715I9724
17883B61744J3936H0650K8969D2404b49477A26409Q0728f1861E5186A1870J088
17872A2958M916O4483a35067N6087A42223J84706j40575a31496D4413f0513n5571
17861a16084n7726C2834d10635G2063a57887B84976A3059a061C58239d3883A19608
17849A08291A3031m516c9379G8563B908a65232O9125A35829b50333A7780c03055
17837B0385a723A83700e0988o8815H7691B0564R4285J25734i0663n7394c3327
$$ plain form
17825 106608 -208111 -165567 77365 44864 -122203 210851 -260811 -46684 85993 -42336 20599
17813 -155995 15000 89847 -203275 -5554 167830 -91892 -109824 -17431 -187083 175045 -89042
17801 31102 -64087 130902 -5651 22833 -122322 -299530 148959 110460 130385 -290742 -432522
17790 -432522 -100768 -183592 -209201 -94469 -3925 216173 -27023 -16617 -149451 -85104 53896
17778 112051 198238 -167382 -175076 -20706 -172572 -539393 60920 5631 -62553 185293 -349358
17766 51294 -124783 162171 75038 4907 -31385 242156 -148234 -368598 -48409 -111915 -201116
17755 -201116 -71518 165149 220997 107727 160599 -184812 -7334 108147 -295468 -162 -233318
17744 -233318 309396 -106344 117009 -68314 42511 228537 -31441 -180212 -73794 -80586 -226721
$$ packed form
17825A06608b08111M2544G7365l2501a22203B10851b60811d6684H5993d2336B0599
17813a55995A5000P4847b03275e554A67830i1892j7932a7431j69652A75045h9042
17801C1102f4087A30902e651B2833a22322j77208A48959l8499J9925b90742j41780
17790d32522a00768q2824k5609i4469c925B16173b7023J0406j32834O4347E3896
17778A12051Q6187a67382p694b0706j51866l66821F0920E631f2553A85293c49358
17766E1294a24783A62171G5038D907c1385B42156a48234k20364d8409o3506q9201
17755b01116g1518A65149N5848A07727N2872a84812g334A08147b95468a62k33156
17744b33318C09396a06344A17009f8314D2511J86026c1441j48771g3794o792j46135
$$ plain form
17733 -226721 -91719 93705 182128 -101377 191910 10425 -231109 -152008 62623 23131 -116100
17721 57712 46295 154554 160028 26705 -54890 74061 148463 -164681 -81314 273003 28991
17709 15282 95681 -1984 -127890 -62059 81998 -115646 107242 209641 117679 63863 172926
17698 172926 126295 26725 -86040 94646 -157007 40051 135464 -127199 -233727 244834 119163
17686 64337 320562 40132 192495 -27820 -11246 195561 -154812 181432 -161003 -199321
17676 -199321 248467 365914 59361 378236 -87040 -182559 130721 -170689 -459335 -38224
17665 -43170 -183574 -35689 91170 -47630 -119995 67560 -27978 144550 -242149 -76744 259324
17653 -150322 101194 -184552 5714 45269 -155258 -62041 98777 101305 -115311 -78102 129895
$$ packed form
17733b26721i1719I3705Q8423a01377A91910A0425b31109P9101F2623B3131a16100
17721E7712j1417J08259N474B6705e4890G4061P4402a64681h1314B73003B8991
17709A5282Q0399a984j25906f2059H1998a15646A07242J02399r1962n3816J09063
17698A72926m6631B6725h6040I4646a57007D0051R5413a27199j06528B44834A19163
17686F4337K56225D0132J52363b7820a1246A95561a54812A81432a61003l8318
17676a99321B48467J17447E9361L18875h7040r5519A30721a70689k88646c8224
17665d3170j40404c5689I1170d7630p2365F7560b7978A44550b42149g6744B59324
17653a50322A01194a84552E714L9555a55258f2041I8777K528a15311L7209A29895
$$ plain form
17641 -406645 -11428 52899 314380 207185 -143479 -278466 -277110 -238637 -271003 -215955 168063
17629 -16856 -140855 -407 340943 -145173 55171 -111730 201221 -258005 -52326 -100669 -194983
17618 -194983 167208 -182390 -40556 65593 23651 -183942 189305 100123 -4507 117655 -83264
17606 -328774 -14287 -170 171435 -186962 -181211 -197732 385962 230558 108836 87950 102796
17595 102796 191526 -127251 28207 39349 -138204 90192 -34502 -112755 -111074 33369 -60615
17583 153572 201568 -313747 -69601 -57868 189188 76408 -104168 20838 38766 -190878 -39898
17571 129021 14948 222967 -282408 257514 -219134 103328 127824 131971 -28179 -329474
17561 -329474 -185111 -214125 29705 30648 300609 268136 171020 -192346 155135 -9317 -67406
$$ packed form
17641d06645a1428E2899K61481j07195a43479j34987J356L8473l2366N5048A68063
17629a6856j23999d07C40943a45173E5171a11730B01221b58005e2326m8343r4314
17618a94983A67208a82390d0556F5593B3651a83942A89305q9182d507A17655h3264
17606c28774a4287a70A71435a86962N751j6521C85962j55404A08836k0886J4846
17595A02796Q8730a27251B8207J1142a38204I0192c4502p8253J681C3369f0615
17583A53572M7996c13747f9601J1733A89188G6408a04168B0838J7928a90878c9898
17571A29021A4948K08019b82408B57514b19134A03328K4496M147b8179l01295
17561c29474J44363k9014B9705R43K69961l2473r7116a92346A55135i317n8089
$$ plain form
17550 -67406 -325412 18439 208634 214334 38212 201397 -9663 -38878 -30652 -53944 65404 -106545
17537 94691 79112 117379 146353 -174035 89162 -107736 29755 227649 230394 63471 -363971
17525 198338 395978 186283 85566 166072 85803 -286336 21348 97330 46043 65992 123512
17514 123512 8971 -70446 -90177 -37538 278504 63509 35268 218641 -51899 -21950 173822
17502 -279659 61689 206995 61687 43788 -106197 211709 -179954 -10722 176836 457696
17492 457696 -284301 -77894 61729 58121 4635 153596 -182919 154871 -64456 -53126 338372
17480 206425 11335 -110234 53320 41945 11759 -59659 182252 125499 108725 -64606 -118265
17469 -118265 131535 320975 324493 177787 -120528 -79060 239858 -13308 336456 -117396
$$ packed form
17550f7406k58006A8439J90195N700C8212J63185i663k9215Q226k3292F5404a06545
17537I4691j5579L8267K8974a74035H9162a07736B9755J97894K745F3471c63971
17525A98338J97640A86283H5566Q0506q0269b86336B1348P5982D6043J9949N7520
17514A23512H971g0446j9731c7538B78504F3509k8241J83373e1899b1950A73822
17502b79659F1689J45306F1687j7899a06197B11709a79954a0722A76836K80860
17492D57696b84301g7894F1729l608D635J48961a82919A54871f4456J1330C38372
17480B06425A1335a10234E3320j1375A1759e9659A82252n6753j6774f4606n3659
17469a18265A31535J89440L518j46706a20528M1468B39858a3308C36456a17396
$$ plain form
17458 369284 219944 56790 207350 3679 398855 157272 205767 197065 175096 85316 319776
17447 319776 181224 72923 143091 224521 256453 271076 289762 377311 -193401 114590 -34997
17435 193535 126701 161216 353439 419686 -235175 255190 131140 317972 447988 161182
17424 443013 85151 231172 96153 191583 -173475 452260 362601 372287 243789 167876 268514
17413 268514 68064 75674 203867 100354 -130164 142759 110742 425359 -84657 -13706 267073
17401 8528 116017 188206 -334134 77438 267843 -178758 47249 -141426 266193 211550 -43621
17389 310459 25421 170413 285021 236846 218342 82505 275957 262695 54214 312441 -70806
17377 -77264 168272 251663 2870 154807 72780 -89816 -97076 -138475 123208 38128 -34091
$$ packed form
17458C69284j49340E6790J50560C679L95176A57272M8495q702k1969H5316K34460
17447C19776j38552G2923P0168Q1430L1932J4623J8686Q7549a93401A14590c4997
17435A93535o6834L4515J92223O6247b35175B55190j24050J86832J30016A61182
17424D43013H5151J46021I6153R5430a73475D52260q9659R686j28498p5913J00638
17413B68514F8064P610J28193A00354a30164A42759l2017L14617h4657a3706B67073
17401H528J07489P2189c34134G7438J90405a78758D7249a41426B66193n4643d3621
17389C10459B5421J44992J14608m8175j8504H2505J93452j3262E4214K58227g0806
17377g7264A68272Q3391B870J51937G2780h9816p260m1399A23208C8128c4091
$$ plain form
17365 315369 370415 21212 25429 184488 138277 -59728 63654 240418 51627 -45360 -64871
17354 -64871 370948 110957 240757 103181 74251 649830 275711 -193982 184886 101516
17344 101516 265793 25655 171886 -153673 146607 464151 379549 -114975 20949 192693
17334 192693 139389 84304 426896 186257 -41049 279467 73225 299895 -15849 -160301
17324 -160301 -123913 128529 1460 248281 -337627 -31861 135335 227978 250075 39929 127448
17313 127448 260499 35335 -210313 160767 134880 97774 57928 -198364 -181997 39014 163628
17302 163628 -9220 -87009 401649 415151 104337 63123 302346 91507 96909 236286 211359
17291 211359 388753 82059 90301 45066 338680 197642 -10262 112357 151259 53760 2952
$$ packed form
17365C15369N5046B1212M217J59059m6211e9728F3654J76764E1627d5360j9511
17354f4871C70948A10957J29800A03181k8930N75579B75711a93982A84886q3370
17344A01516J64277B5655J46231a53673A46607L17544q4602a14975B0949J71744
17334A92693n3304n5085L42592A86257d1049B79467G3225K26670a5849j44452
17324a60301L6388A28529A460K46821c37627c1861A35335R2643K2097C9929Q7519
17313A27448J33051C5335b10313A60767k5887l7106l9846a98364J6367C9014J24614
17302A63628i220p7789D01649J3502A04337m1214K39223I1507N402J39377k4927
17291B11359J77394H2059Q242D5066K93614j41038a0262A12357L8902E3760B952
$$ plain form
17279 83680 16184 115898 224131 197165 111092 221255 -150720 -61502 180864 377517 -29664
17267 432571 375727 -46723 16691 224007 13404 332123 228132 46929 279130 283097 -46438
17255 197913 67587 308671 198891 471510 69441 100661 81167 122216 3830 49877 184265
17244 184265 37750 109186 96105 122135 -124811 54006 230763 40215 129839 84321 -335248
17232 -27163 440744 161398 -7090 -23309 179654 335948 73718 193317 286667 133835 188888
17221 188888 204486 33810 226378 153091 252681 99595 41515 -94520 91805 -123870 342472
17209 174030 23499 217467 64606 5993 96191 242900 747063 -310411 142992 262280
17199 262280 304303 123456 -539 142382 369192 244903 236072 -209225 87138 268437 321929
$$ packed form
17279H3680A6184R9714J08233k6966q6073J10163a50720f1502A80864J96653b9664
17267D32571n6844d6723A6691K07316A3404L18719j03991D6929K32201L967d6438
17255A97913F7587K41084j09780K72619F9441L1220j9494M1049C830M6047J34388
17244A84265C7750P1436j3081K6030a24811E4006J76757D0215Q9624m5518c35248
17232b7163D40744A61398g090j6219A79654J56294G3718J19599R3350A33835N5053
17221A88888J5598C3810J92568p3287R9590I9595D1515i4520I1805a23870C42472
17209A74030B3499J93968F4606E993R0198J46709N04163c10411A42992J19288
17199B62280M2023A23456e39A42382K26810j24289q831b09225H7138J81299N3492
$$ plain form
17188 321929 148090 39362 352420 137862 142565 281664 -60043 56643 294389 282480 229444
17177 229444 -32335 86794 139836 125053 290029 486522 22058 -24702 201760 86061 356228
17166 356228 272318 -25001 112856 121239 376378 200707 385992 131055 137885 141167 157029
17155 157029 -85433 170116 -70624 199807 418075 163389 497878 232329 340512 298529
17145 298529 218833 308751 196706 397081 -21626 313170 251920 251174 223532 429022 63748
17133 162359 166686 286309 344596 492836 118544 441426 -128200 344784 337012 423021 211322
17121 231028 344833 156631 97584 441817 411827 235724 -42268 652607 311806 286388
17111 286388 635704 206052 332134 450918 359250 286339 141569 93941 172412 278613
$$ packed form
17188C21929A48090C9362L13058A37862M703J39099f0043E6643K37746j1909n3036
17177B29444c2335H6794N3042j4783J64976J96493B2058b4702B01760H6061K70167
17166C56228q3910b5001A12856Q383K55139j75671J85285A31055O830L282J5862
17155A57029h5433A70116g0624A99807K18268A63389L34489B32329J08183m1983
17145B98529p9696Q9918j12045K00375b1626C13170o1250p46k7642K05490F3748
17133A62359M327J19623N8287J48240A18544L22882a28200C44784p772Q6009B11322
17121B31028J13805A56631n9047L44233k9990j76103d2268F52607C11806k5418
17111B86388L49316B06052J26082J18784r1668p2911A41569m7628P8471J06201
$$ plain form
17101 278613 179857 170639 618198 459287 314718 343526 142468 482506 424323 60946 94842
17090 94842 560684 -9907 83625 231269 293415 203712 165276 719038 361050 286736 320197
17079 320197 210196 395744 205490 502732 -116598 106071 204689 85441 403892 573082
17069 573082 447042 174112 778452 317887 456060 306798 419806 314854 418586 682090
17059 682090 649589 379873 234540 178350 316620 383709 635664 195127 588539 595539
17049 595539 372720 102848 391587 190969 581818 638971 368171 454458 170174 318888
17039 318888 275864 435763 465769 575085 611215 413230 525313 466327 78213 572400
17029 572400 469595 219428 527936 375840 -31058 458740 407093 423855 262920 544326
$$ packed form
17101B78613r8756r218M47559j58911j44569K8808A42468L40038n8183F0946L3896
17090I4842M65842i907H3625J47644O2146q9703l8436N53762l57988p4314L3461
17079C20197j10001J85548j90254K97242a16598A06071R8618H5441L18451J69190
17069E73082j26040A74112O04340C17887J38173j49262J13008j04952J03732K63504
17059F82090l2501k69716j45333n6190J38270O7089K51955A95127L93412P000
17049E95539k22819A02848K88739A90969L90849N7153k70800Q6287A70174J48714
17039C18888m3024J59899L0006J09316L6130j97985J12083n8986G8213M94187
17029E72400j02805B19428L08508j52096c1058D58740n1647J6762j60935K81406
$$ plain form
17019 544326 835091 544827 172434 685679 637180 870340 442687 784645 513428 626125
17009 626125 501699 784420 496845 787243 851954 646198 634515 761424 760195 488305
16999 488305 964087 685637 236221 764725 582386 665963 439296 556950 824462 425332
16989 425332 772177 693847 512372 757058 739411 684894 585448 789371 1053253 896285
16979 896285 495301 853619 824715 903178 503647 855681 812321 896866 570981 1078293
16969 1078293 968334 754017 517468 829220 858077 707386 717886 997265 816273 831040
16959 831040 856591 699402 930952 833971 837980 666873 1134403 957688 1098400 913580
16949 913580 877267 1025331 1162892 1171762 937435 1025802 926209 1017985 915231 1066328 1203739
$$ packed form
17019E44326K90765k90264A72434N13245m8499K33160m27653L41958k71217J12697
17009F26125j24426K82721k87575K90398O4711k05756j1683J26909j229k71890
16999D88305M75782k78450B36221N28504j82339Q3577k26667J17654K67512l99130
16989D25332L46845p8330j81475K44686j7647n4517r9446K03923K63882j56968
16979H96285m00984L58318k8904P8463l99531L52034m3360Q4545l25885N07312
16969A078293j09959k14317k36549L11752K8857j50691J0500K79379j80992J4767
16959H31040K5551j57189K31550r6981M009j71107M67530j76715J40712j84820
16949I13580l6313J48064J37561Q870k34327Q8367r9593R1776j02754J51097J37411
$$ plain form
16938 1203739 789650 934941 916734 1151916 979069 873438 958209 1176122 966724 1228375
16928 1228375 1206505 1032121 1054100 1057412 1144956 1216332 1085424 1410715 1215786 1241119 848315
16917 848315 1167113 1455812 1262202 1011655 1342151 1199172 1404907 943594 1300655 1355625
16907 1355625 1145698 1450825 1363998 1498852 1449409 1498215 1543280 1344106 1546402 1422871
16897 1422871 1851451 1647140 1914688 1831429 1329894 1407440 1522489 1394622 1558421 1640522
16887 1640522 1593295 1958974 1480985 1923218 2267690 2010783 1805026 1916777 2239010 1809235
16877 1809235 1928320 2048606 1693993 1978365 2306176 2074749 2018150 2163359 2165304 1845880
16867 1845880 2291934 2368086 2304602 2490110 2193604 2428366 2189913 2300810 2523934 2225550
$$ packed form
16938A203739m14089J45291j8207K35182j72847j05631Q4771K17913k09398K61651
16928A228375k1870j74384K1979L312Q7544P1376j30908L25291j94929K5333l92804
16917H48315L18798K88699j93610k50547L30496j42979K05735m61313L57061N4970
16907A355625k09927L05127q6827J34854m9443M8806M5065j99174K02296j23531
16897A422871M28580k04311K67548q3259n01535P7546J15049j27867J63799Q2101
16887A640522m7227L65679m77989M42233L44472k56907k05757J11751L22233m29775
16877A809235J19085J20286l54613K84372L27811k31427n6599J45209J945l19424
16867A845880M46054P6152o3484J85508k96506K34762k38453J10897K23124k98384
$$ plain form
16857 2225550 2365068 2316906 2538787 2764544 2902914 2513964 2715798 2707932 2696198 2930577
16847 2930577 2772856 3163083 2970110 3250996 3290972 3467427 3207412 3209106 3376418 3591440
16837 3591440 3484195 3566091 3333428 3285822 3600507 3913351 3789049 3885396 4166928 3901069
16827 3901069 3895273 4138625 4344269 4058159 4197361 4486741 4588977 4420282 4560291 4907031
16817 4907031 4687933 4592611 5163892 5111301 5336313 5554712 5574725 5771143 5438483 5927677
16807 5927677 5930352 5966577 6107124 6076553 6570203 6587837 6559121 7213882 7059627 7107448 7748358
16796 7748358 7624945 8030336 8040647 7997410 8790661 8606378 9040430 9230274 9424687 9739323
16786 9739323 10002186 10125355 10509082 10447830 11194250 11245165 11666797 12002587 12270395 12746714
$$ packed form
16857B225550J39518m8162K21881K25757J38370l88950K01834p866j1734K34379
16847B930577j57721L90227j92973K80886L9976J76455k60015J694J67312K15022
16837C591440j07245Q1896k32663m7606L14685L12844j24302R6347K81532k65859
16827C901069n796K43352K05644k86110J39202K89380J02236j68695J40009L46740
16817D907031k19098r5322N71281n2591K25012K18399K0013J96418l32660M89194
16807E927677K675L6225J40547l0571M93650J7634k8716O54761j54255M7821O40910
16796G748358j23413M05391J0311m3237P93251j84283M34052J89844J94413L14636
16786I739323K62863J23169L83727o1252P46420N0915M21632L35790K67808M76319
$$ plain form
16776 12746714 13352655 13666199 14174865 14319171 15287898 15479164 16130455 16350730 17246756
16767 17246756 17678027 18230363 18931390 19860811 20307216 21224478 21884740 22662743 23984711
16758 23984711 24517324 25357961 26796443 27965396 29182941 30355479 31725754 33156959
16750 33156959 34755567 36428592 38274057 39943079 42301847 43953294 46317848 48824338
16742 48824338 51128426 54094134 57405701 60344441 63797904 67592867 71082846 75434360
16734 75434360 79737938 84631491 89209670 94733849 99930547 106167059 111838883 117708024
16726 117708024 124028169 130391328 136392647 142824620 148104764 153269667 157766116 161412488
16718 161412488 165113891 166906842 167384519 167224452 166403851 164093251 160715364 156621852
$$ packed form
16776A2746714O05941L13544N08666J44306R68727J91266O51291K20275Q96026
16767A7246756M31271N52336P01027R29421M46405R17262O60262P78003J321968
16758B3984711N32613Q40637J438482J168953J217545J172538J370275J431205
16750C3156959J598608J673025J845465J669022K358768J651447K364554K506490
16742D8824338K304088K965708L311567K938740L453463L794963L489979M351514
16734G5434360M303578M893553M578179N524179N196698O236512N671824N869141
16726A17708024O320145O363159O001319O431973N280144N164903M496449L646372
16718A61412488L701403J792951M77677j60067q20601k310600l377887m093512
$$ plain form
16710 156621852 151876769 146740516 140642347 134576598 128491767 122053956 115519050 109112323
16702 109112323 103271460 97572933 92298444 86792825 81612763 77166970 72478101 68582885
16694 68582885 64643551 61123237 57815633 54641594 51574451 49054971 46515636 44068275
16686 44068275 41646173 40007550 38101149 35840946 34404861 32662636 31421859 29943354
16678 29943354 28249431 27267560 26226026 24932072 23899780 22899057 22367551 21050138
16670 21050138 20470806 19683469 18771839 18111102 17795098 16966387 16338673 15687376 15264431
16661 15264431 14779415 13978806 13477802 13609628 12823109 12577591 11951740 11536795 11586891
16652 11586891 10959589 10724898 9931523 10096795 9770083 9403634 9143029 9136353 8888698 8327642
$$ packed form
16710A56621852m745083n136253o098169o065749o084831o437811o534906o406727
16702A09112323n840863n698527n274489n505619n180062m445793m688869l895216
16694F8582885l939334l520314l307604l174039l067143k519480k539335k447361
16686D4068275k422102j638623j906401k260203j436085j742225j240777j478505
16678B9943354j693923r81871j041534j293954j032292j000723n31506j317413
16670B1050138n79332p87337r11630o60737l16004q28711o27714o51297m22945
16661A5264431m85016q00609n01004J31826p86519k45518o25851m14945N0096
16652A1586891o27302k34691p93375J65272l26712l66449k60605o676k47655n61056
$$ plain form
16642 8327642 8424748 8431233 7864196 7460100 7600332 7169694 7040736 7065033 6700012 6589488
16632 6589488 6456171 5980191 6205278 5879423 5916896 5815894 6037725 5521606 5524141 5167194
16622 5167194 5305141 5051103 4901784 4820947 4814352 4546045 4729674 4580497 4783132 4496887
16612 4496887 4350885 3857590 4491226 3837322 3993300 3747807 3798993 3357080 3465611 3715116
16602 3715116 3534616 3462646 3443229 3156826 3082441 3257064 2928337 3063610 3010163 2701335
16592 2701335 2835012 3181517 2985200 2918081 2544670 2704949 2433934 2226895 2320021 2647588
16582 2647588 2458656 2462549 2599631 2549406 2085305 2244946 2177966 2543007 2287816 1936248
16572 1936248 2047329 2076413 2044690 2016052 1851924 2065773 2109657 2025684 1914837 2068791
$$ packed form
16642H327642R7106O485n67037m04096J40232m30638j28958K4297l65021j10524
16632F589488j33317m75980K25087l25855L7473j01002K21831n16119K535l56947
16622E167194J37947k54038j49319q0837o595k68307J83629j49177K02635k86245
16612D496887j46002m93295O33636o53904J55978k45493N1186m41913J08531K49505
16602C715116j80500p1970j9417k86403p4385J74623l28727J35273n3447l08828
16592B701335J33677L46505j96317o7119l73411J60279k71015k07039R3126L27567
16582B647588j88932L893J37082n0225m64101J59641o6980L65041k55191l51568
16572A936248J11081K9084l1723k8638j64128K13849M3884q3973j10847J53954
$$ plain form
16562 2068791 1801273 1761867 1682798 1822593 1663239 1552526 2105483 1677606 1613735 1455288
16552 1455288 1544339 1359832 1825765 1381304 1185066 1635787 1372093 1523703 1286684 1474829
16542 1474829 1353733 1498920 1290245 1701391 1211228 1137980 1541816 1296248 1307006 1361117
16532 1361117 1138269 1230066 1139090 1528557 1374824 1093135 1372513 1079127 912609 877801
16522 877801 1089532 1283584 1137487 1336626 977329 1080932 1179060 1183505 885764 824299
16512 824299 1259459 1022799 782691 1015054 640688 1119890 867406 1388454 818517 1354681
16502 1354681 684924 1139701 1127899 874512 923312 679037 1144460 411499 800060 974949
16492 974949 880347 1010880 737650 795799 628584 609908 940224 1034334 994130 929404 743836
$$ packed form
16562B068791k67518l9406p9069J39795j59354j10713N52957m27877o3871j58447
16552A455288Q9051j84507M65933m44461j96238M50721k63694J51610k37019J88145
16542A474829j21096J45187k08675M11146m90163p3248M03836k45568J0758N4111
16532A361117k22848R1797r0976L89467j53733k81689K79378k93386j66518l4808
16522H77801K11731J94052j46097J99139l59297J03603R8128M445k97741o1465
16512H24299M35160k36660k40108K32363l74366M79202k52484N21048n69937N36164
16502A354681o69757M54777j1802k53387M8800k44275M65423D11499L88561J74889
16492I74949r4602J30533k73230N8149j67215j8676L30316R4110m0204o4726j85568
$$ plain form
16481 743836 557372 955603 1100202 745406 674611 765711 706559 820977 705594 814600
16471 814600 1077375 636676 876063 561888 631455 495885 610042 787904 606731 729227
16461 729227 566826 613074 514626 539685 530643 628439 542387 291529 562232 641739 617338
16450 617338 635197 415360 546740 794173 657305 136411 414127 853283 531818 689947
16440 689947 770359 613287 485395 639977 430676 264373 294473 683662 448325 670123
16430 670123 837003 397645 596085 296322 286157 797141 185619 226148 140472 386727
16420 386727 343517 235836 574003 464626 312104 314770 -46159 424836 463177 165184
16409 527762 478149 582367 436230 636892 218363 683981 351296 347661 440099 594001
$$ packed form
16481G43836j86464L98231J44599l54796p0795R1100n9152J14418j15383J09006
16471H14600K62775m40699K39387l14175O9567j35570J14157J77862j81173J22496
16461G29227j62401M6248r8448K5059r042R7796q6052k50858K70703P9507k4401
16450F17338J7859k19837J31380K47433j36868A36411K77716M39156l21465J58129
16440F89947Q0412j57072j27892J54582k09301j66303L0100L89189k35337K21798
16430F70123J66880C97645J98440B96322j0165N10984A85619M0529q5676K46255
16420C86727m3210j07681L38167j09377j52522K666d6159D24836L8341A65184
16409E27762m9613J04218j46137K00662B18363M65618l32685l635R2438J53902
$$ plain form
16399 594001 519943 478047 256115 194844 504144 437003 112392 498740 279860 436171
16389 436171 269087 553063 445578 446468 330790 229119 357696 192419 326881 590956
16379 590956 258176 278283 226596 597677 248429 204464 512299 597941 -17444 90589 288727
16368 288727 182620 371136 -8259 178829 364906 435761 259534 367639 342693 181600
16358 181600 368071 40315 111264 196302 411669 266649 146157 385989 252767 107889
16347 52353 265947 214782 34345 308823 66228 -61383 409995 402271 437578 135062 301030
16336 301030 340771 99607 135660 -51777 371399 90050 134004 238448 200338 199175 182272
16325 182272 385683 10751 328232 251525 354628 159893 406047 351442 221657 90929
$$ packed form
16399E94001p4058m1896k21932o1271L09300o7141A12392L86348k18880J56311
16389D36171j67084K83976j07485Q90j15678j01671J28577j65277J34462K64075
16379E90956B58176K0107n1687L71081B48429m3965L07835Q5642a7444I0589J98138
16368B88727j06107J88516h259A78829J86077P0855j76227J08105k4946j61093
16358A81600J86471D0315P0949Q5038K15367j45020j20492K39832j33222A07889
16347E2353K13594n1165C4345K74478F6228f1383D09995p724L5307A35062J65968
16336C01030L9741I9607L6053e1777C71399I0050M3954J04444l8110j163j6903
16325A82272K03411A0751L17481p6707J03103A59893K46154n4605j29785I0929
$$ plain form
16314 -5640 42726 159732 213063 292908 237279 413818 165757 277738 36066 329519 433000
16303 433000 22120 32385 264320 323146 167392 245682 76531 102280 37758 -43481 321139
16291 171613 131398 221910 75480 476633 212656 -81129 364487 174096 -3706 179046 192882
16280 192882 91345 110021 294754 329529 272662 62854 263165 250546 398678 370238 38591
16268 216039 139009 255677 80605 79326 -178987 202772 225198 250938 -324468 16710 49267
16257 49267 57205 28631 -27456 366659 254410 240941 171170 -70818 263913 -281253 45538
16245 331327 233545 79972 138158 356427 14559 330823 67150 93586 122700 46340 -15988
16233 -82882 408307 24564 -269619 9388 -4204 268221 16915 -4148 73647 162487 250871 174072
$$ packed form
16314e640D2726J17006N3331P9845n5629J76539A65757J11981C6066K93453J03481
16303D33000B2120J0265K31935N8826j55754P8290G6531K5749C7758d3481C21139
16291A71613m0215R0512G5480M01153B12656h1129C64487A74096c706A79046J3836
16280A92882I1345J8676J84733L4775n6867F2854K00311j2619J48132k8440C8591
16268B16039p7030J16668H0605j279a78987B02772K2426K5740c24468A6710L2557
16257D9267P938k8574b7456C66659j12249j3469o9771g0818B63913b81253D5538
16245C31327r7782G9972N8186K18269A4559L16264F7150K6436K9114D6340a5988
16233h2882D08307B4564b69619I388d204B68221A6915d148G3647Q8840Q8384p6799
$$ plain form
16221 174072 -141380 497620 89924 33329 221501 -18981 65097 7711 -36915 -58311 -90284
16210 -90284 967 316963 242269 54821 315189 -35349 148502 -25015 25809 118902 -45799
16198 275816 258063 -356827 -45253 259965 250222 71520 -13210 67363 -122153 23419 213186
16187 213186 213682 359866 107447 46414 99515 321568 281896 -64129 -148921 1189 -352871
16175 231032 -80727 -752 -148442 64132 64145 -133590 77174 -9673 110254 189938 -2594 148417
16162 145086 243950 -139850 214733 140891 9399 170594 80972 4709 46292 -164656 263461
16150 -445053 -350855 422399 226927 18873 -50314 -28953 -44703 -153678 308521 82461 363169
16139 363169 261229 30317 -43458 319277 75414 124881 346085 341519 85484 212147 155862
$$ packed form
16221A74072a41380D97620H9924C3329J88172a8981F5097G711c6915k1396l1973
16210i0284I67L15996p4694E4821K60368c5349A48502b5015B5809R3093d5799
16198B75816j7753c56827d5253B59965r743G1520a3210F7363a22153B3419J89767
16187B13186M96J46184A07447D6414N3101K22053l9672f4129q4792A189c52871
16175B31032h0727g52j47690F4132J3a33590G7174i673A10254P9684b594A48417
16162A45086R8864a39850B14733p3842I399J61195H0972D709M1583a64656B63461
16150d45053R4198D22399j95472A8873e0314K1361j5750j08975C08521H2461K80708
16139C63169j01940C0317d3458C19277G5414M9467K21204m566H5484J26663n6285
$$ plain form
16128 155862 265656 41656 -178102 17482 107051 3427 195136 -163194 232369 11114 -83945
16116 85554 -37288 -332086 3032 4824 47564 120998 -49141 -43976 -371945 -253017 26112 17204
16104 17204 32697 -15828 28419 41859 184554 -295508 199964 -49609 29593 97236 345787
16093 345787 -17954 40777 22439 -97478 -209242 -289118 54161 -420709 -133700 -102880 89704
16081 -177864 14141 122703 -82611 94930 7799 -9701 -252838 -18977 11453 -20742 242487
16069 52148 193477 215123 -230315 -72150 -65416 -99333 120079 72214 -16866 -127206 -284464
16058 -284464 173459 -171382 -55275 169645 -376790 87282 8767 -235950 30548 88961 -153538
16046 117506 37483 229163 -107260 -114724 -40493 -194768 130688 -86887 56871 97147 270660
$$ packed form
16128A55862J09794D1656a78102A7482Q9569C427J91709a63194B32369A1114h3945
16116H5554c7288k94798C032J792M2740P3434d9141N165l27969J18928B6112q908
16104A7204J5493a5828B8419J3440J42695b95508A99964d9609B9593O7643K48551
16093C45787a7954D0777j8338i7478j11764p9876E4161d20709a33700L0820H9704
16081a77864A4141J08562h2611I4930G799i701k43137a8977A1453b0742B42487
16069E2148J41329K1646b30315g2150O734l3917A20079m7865a6866j10340j57258
16058b84464A73459a71382e5275A69645c76790H7282H767b35950C0548N8413a53538
16046A17506C7483J91680a07260p464d0493j54275A30688h6887E6871M0276J73513
$$ plain form
16035 270660 -13555 -84641 201597 -132881 122842 -189127 123864 -161385 75777 -326086
16024 -92191 -6263 -125717 58220 -444588 20256 -69325 -22460 -287290 -93807 -433474 287523
16012 36715 149567 -49948 3868 333465 55015 18679 29519 111035 284935 -82529 -157003
16001 -157003 -401436 46857 509638 62677 -149023 -374641 -38173 38598 -13623 23676 248468
15990 248468 253567 170456 -209226 -52903 286374 317394 226301 91855 106775 226933 3305
15978 -88191 266429 -29317 -326891 -51136 -261779 90930 -212871 -310470 136948 68809 -183212
15966 213878 -69744 182982 -209452 115706 -161479 -274530 -38932 109430 42583 -74892
15955 -203498 129587 -162590 -203956 -44201 -174510 157020 -9495 -235754 -81789 -348441
$$ packed form
16035B70660a3555p1086B01597a32881A22842a89127A23864a61385G5777c26086
16024i2191f263j19454E8220d44588B0256f9325b2460k64830i3807l39667B87523
16012C6715J12852d9948C868L29597E5015A8679J0840Q1516J73900h2529p4474
16001a57003k44433D6857M62781F2677a49023k25618c8173C8598a3623B3676K24792
15990B48468N099q3111b09226e2903B86374L1020r1093I1855J4920J20158C305
15978h8191B66429b9317k97574e1136k10643I0930b12871r7599A36948o8139a83212
15966B13878f9744A82982b09452A15706a61479j13051c8932A09430D2583g4892
15955b03498A29587a62590m1366d4201j30309A57020i495k26259h1789k66652
$$ plain form
15945 -348441 -135902 -180006 -84542 -244281 -59909 -13530 -233991 -125555 111806 -297745
15934 237805 58305 44629 -22924 -98553 -58173 -41086 -111425 118352 -117183 194230 -268313
15922 260742 42406 123979 -76503 -133629 133881 48736 152707 242527 -262101 84111 -223211
15910 -49378 44754 23290 29378 57955 -141664 -126760 -127818 188759 -435342 -185543 23009
15898 83888 378542 -114305 297707 -116237 27283 -255531 -132786 207359 -49013 237848
15887 -172857 75303 -172873 139581 342484 -238435 96862 -126354 -96742 -56735 -44817
15877 -44817 7212 156122 -317692 127826 -74840 78794 -198124 83397 -211506 -43221 141166
15865 47628 110102 200502 -44375 -445953 147377 -183870 -74435 -65995 46774 -138148 192177
$$ packed form
15945c48441a35902m4104h4542j59739e9909a3530k20461J08436A11806b97745
15934B37805E8305j3676b2924p5629M0380J7087p0339A18352a17183A94230b68313
15922B60742D2406Q1573g6503n7126A33881D8736J03971Q9820b62101H4111b23211
15910d9378D4754k1464O088K8577a41664J4904j058A88759d35342a85543B3009
15898H3888K94654a14305B97707a16237B7283b55531J22745B07359d9013B37848
15887a72857G5303a72873A39581K02903b38435I6862a26354K9612M0007J1918
15877d4817G212J48910c17692A27826g4840G8794a98124H3397b11506d3221A41166
15865D7628O2474R0400d4375m01578A47377a83870g4435Q440D6774a38148A92177
$$ plain form
15853 90902 -78004 -139351 -105759 26252 123777 -204500 76568 -257501 106202 141555 52824
15841 -233774 -270094 -369449 -15177 149806 102052 191944 -91223 -87336 103797 -99447 120979
15829 -37297 91537 -106161 49387 14358 -125755 22801 -336168 14402 -11818 -27899 -356896
15818 -356896 41196 36702 138883 -70439 -30693 282772 216352 199988 -160091 16555 -13163
15806 199552 62120 -93921 -91657 56976 207895 -85726 127336 -424712 -127360 27261 -198444
15794 -201970 213660 122813 88780 183405 -163625 150581 -207696 -128565 214445 -108392
15783 18221 -17740 -169985 93975 -53418 -285378 -32782 83789 198437 123539 -26590 -241344
15772 -241344 -28614 -86024 -87744 22993 -78824 177911 -139603 44982 180940 50541 -248268
$$ packed form
15853I0902g8004o1347L3592B6252R7525b04500G6568b57501A06202L5353E2824
15841b33774l6320r9355a5177A49806m7754Q9892i1223L887A03797i9447A20979
15829c7297I1537a06161D9387A4358a25755B2801c36168A4402a1818j6081l28997
15818c56896D1196m494J02181g0439c0693B82772o6420j6364a60091A6555a3163
15806A99552F2120i3921K264E6976J50919h5726A27336d24712a27360B7261a98444
15794b01970B13660r0847l4033R4625a63625A50581b07696P9131B14445a08392
15783A8221a7740j52245I3975e3418k31960c2782H3789J14648p4898b6590k14754
15772b41344b8614n7410j720B2993g8824A77911a39603D4982J35958E0541b48268
$$ plain form
15760 209725 11746 -22113 131868 35053 288940 50627 76800 -160078 120161 -480195
15749 -119075 -70694 110868 115424 -154950 40751 407913 -46959 189642 190098 -300227 -299417
15738 -299417 -182116 -26535 -7536 -164488 -294119 -12637 -14506 -27630 -63110 -199000 -15952
15726 18398 -76622 -210914 -205308 366624 228878 -159115 -147278 247568 -266618 -192550 62374
15714 105550 -255792 -158607 168076 -109110 -69503 -67325 -118740 125848 -46113 184168 2060
15702 -116870 -118000 -12127 59781 -138541 -81045 -133911 -121066 -241347 235863 259561 115405
15690 -10437 -193227 -55878 33103 70140 -267057 -403088 -151810 -9268 140349 -54260 -160620
15679 -160620 -421679 101414 20707 -40115 136846 -490012 -13732 177372 161998 439101
$$ packed form
15760B09725A1746b2113A31868C5053K53887E0627K6173a60078A20161d80195
15749a19075M8381A10868M556a54950D0751L67162d6959A89642M56c00227Q10
15738b99417J17301b6535g536j56952j29631a2637j869j3124l5480j35890a5952
15726A8398g6622j34292N606C66624j37746a59115J1837B47568b66618P4068F2374
15714A05550b55792R7185A68076a09110L9607K178n1415A25848d6113A84168B060
15702a16870j130a2127E9781a38541N7496n2866J2845j20281B35863K3698A15405
15690a0437j82790e5878C3103L7037b67057j36031a51810i268A40349e4260j06360
15679a60620k61059A01414B0707d0115A36846d90012a3732A77372j5374K77103
$$ plain form
15669 439101 -126881 121583 174568 -145124 -25686 298363 -124230 -575080 -382783 147074
15658 -248892 -184213 -175238 1990 -126541 386 -19195 -92232 -47502 -69141 239105 62218 -17505
15645 -281927 150259 5727 74709 361805 -247833 39918 -174882 -26005 -390321 257621
15634 264328 -215589 -100824 294926 -69611 -256779 52679 57142 23307 51754 -103929 -119109
15623 -119109 -67402 -395949 -86221 -221459 -92086 43371 204482 105905 290529 83206 -142607
15611 -24112 103291 -252552 34442 -42736 -194959 -72662 283952 -148407 124656 62793
15601 62793 89601 -192918 -202110 -112235 -274706 210782 -223928 151972 387493 83396 -36402
15589 79101 -218018 -194828 -89726 -79561 -89759 -218175 45622 162339 -85413 -200696 -174624
$$ packed form
15669D39101a26881A21583N2985a45124b5686B98363a24230m50850J92297A47074
15658b48892O4679Q975A990a26541C86a9195p3037M4730k1639B39105F2218a7505
15645b81927A50259E727O8982K87096b47833C9918a74882b6005l64316B57621
15634B64328b15589a00824B94926f9611j87168E2679M463B3307K8447a03929j5180
15623a19109N1707l28547h6221j35238i2086D3371J61111r8577J84624H3206a42607
15611b4112A03291b52552C4442d2736j52223g2662B83952a48407A24656o1863
15601F2793K6808a92918r192Q9875j62471B10782b23928A51972K35521H3396c6402
15589G9101b18018K3190h9726J0165j0198j28416D5622J16717h5413j15283K6072
$$ plain form
15578 -174624 -155663 -411159 -53408 205477 9823 -99682 -59476 345331 29190 173081 -284113
15566 -86525 -152992 -49947 272965 -348141 -187944 62708 23229 6397 38382 42968 -235378
15554 -24065 -339770 -86644 -240730 -101221 -36353 -35176 166137 37312 29951 -80769 37088
15542 124799 111021 90407 168990 -71745 211562 145211 219021 457768 65765 -32829 -185989
15531 -185989 -5882 -496547 -52852 -229831 -6719 2821 194360 190299 -211396 72081 -59516
15519 -150182 213067 -5928 187940 173183 16711 137416 489158 -84421 55534 267247 -208092
15507 9615 -70016 -36634 55354 -164053 73432 -118299 223651 -260252 60411 87873 13691
15495 161628 -222371 154302 90254 28416 119076 -282823 46010 -109294 -337220 -393461
$$ packed form
15578a74624J8961k55496e3408B05477I823i9682M0206C45331B9190J43891b84113
15566h6525o6467d9947B72965c48141J60197F2708B3229F397L1985M586b35378
15554b4065l15705h6644j54086a01221c6353J177A66137C7312p361h0769C7088
15542A24799j3778k0614P8583g1745B11562o6351P3810K38747F5765c2829j53160
15531a85989e882m90665e2852j76979f719B821J91539m061b11396G2081e9516
15519a50182B13067e928A87940j4757A6711J20705L51742h4421E5534K11713b08092
15507I615g0016L3382E5354a64053G3432a18299B23651b60252F0411K7462A3691
15495A61628b22371A54302o4048B8416R0660b82823D6010a09294k27926n6241
$$ plain form
15485 -393461 -126491 243811 -152889 -44097 346076 -128117 130779 -76280 -264121 -38397
15474 102961 97685 -112309 -87179 -44590 -112993 -111085 -224043 -100157 -225905 121041 109671
15463 109671 -401175 23793 -280958 -89691 -186724 -222839 51652 84656 14601 -144583 -115346
15452 -115346 92812 -279792 197102 207315 218436 -63629 259839 -168307 17642 -267658
15441 -361690 8515 60763 180811 109548 77650 -92623 -160923 154115 110505 10216 -42627
15429 -95539 43821 84418 146305 -79695 -211981 -103409 -141775 13602 267704 -37685 471618
15417 -119808 -707122 149565 94812 275159 -75588 -30467 -290596 -9130 -315271 145693
15406 6552 89056 6325 -19707 140205 67399 -30824 -6628 -238061 -250789 -8972 -469502 43615
$$ packed form
15485c93461a26491B43811a52889d4097C46076a28117A30779g6280j87841c8397
15474A02961n276a12309K5130M2589o8403J908j12958a00157j25748A21041j1370
15463A09671d01175B3793b80958h9691r7033l6115E1652L3004A4601a44583K9237
15452a15346I2812b79792A97102J0213J1121f3629B59839a68307A7642b67658
15441c61690H515N2248J20048p1263l1898i2623o8300A54115m3610A0216d2627
15429i5539D3821M0597O1887g9695j32286a03409l8366A3602K54102c7685D71618
15417a19808n87314A49565n4753J80347g5588c0467k60129i130l06141A45693
15406F552Q2504F325a9707A40205F7399c0824f628k31433j2728h972m60530D3615
$$ plain form
15393 -205539 -178161 6800 126990 -341805 227865 -215034 -101215 -157625 154951 86850
15383 86850 -314519 58486 -47594 55235 76926 364691 79449 -94895 19706 47031 -86479
15371 -84255 -91732 72067 -209742 -226312 117919 1854 -58413 -115122 -256287 -4747 16670 -22861
15358 -278784 27077 -228679 10979 -141002 -129213 472550 88970 171739 122015 102412 -89334
15346 -115735 231249 -85001 -195250 116385 232257 16643 -128555 109071 95604 -229716
15335 -108397 -334618 113653 353705 -118458 -63094 144023 -91158 -337544 191286 -56271
15324 -235234 67791 119263 223412 22207 174670 -129552 289398 -351262 -209333 249078
15313 -206632 15277 -220193 211728 -369811 -158024 43813 -10437 -4738 -45340 -105211 -23441
$$ packed form
15393b05539K7378F800J20190c41805B27865b15034a01215n6410A54951o8101
15383H6850c14519E8486d7594E5235K1691K87765G9449i4895A9706K7325h6479
15371h4255p477G2067b09742j6570A17919A854e8413n6709j41165d747A6670b2861
15358b78784B7077b28679A0979a41002J1789D72550H8970Q2769m9724j9603h9334
15346a15735B31249h5001j10249A16385J15872A6643a28555A09071j3467b29716
15335a08397k26221A13653K40052a18458N5364A44023i1158k46386A91286e6271
15324b35234F7791N1472J04149B2207J52463a29552B89398c51262J41929B49078
15313b06632A5277b20193B11728c69811a58024D3813a0437d738m0602n9871b3441
$$ plain form
15301 -137473 -119807 70593 29751 -227351 293944 11131 -294419 -179375 195139 193595 197713
15290 197713 -202193 81786 179572 309208 210634 277530 -63449 113286 118866 163720 -113329
15278 257674 299193 58009 -178016 145561 -273120 118418 -116006 -86458 32447 -46150
15267 -305520 -68514 117687 -198533 150220 -64196 -203869 -218419 48805 319011 -2112 -211706
15256 -211706 141886 316393 -150438 -300934 -127967 -187960 422095 1123883 1217514 1024794
15246 1024794 1065685 997184 -19343 228721 -106856 -98734 -11354 -13048 -211342 -74466 248139
15234 -190786 225501 85248 385311 274199 142639 26768 162183 -124802 245017 -55483
15223 127046 8881 263071 95357 -111328 88905 89789 127676 -133163 246879 -124974 -248841
$$ packed form
15301a37473J7666G0593B9751b27351B93944A1131b94419J15044A95139j544M118
15290A97713b02193H1786R7786J29636r8574O6896f3449A13286N580M4854a13329
15278B57674M1519E8009a78016A45561b73120A18418a16006K9548C2447d6150
15267c05520f8514A17687a98533A50220f4196j39673j4550D8805K70206b112k09594
15256b11706A41886J74507a50438j50496a27967n9993D22095P01788R3631j92720
15246A024794M0891o8501a9343B28721a06856Q122a1354j694j98294g4466B48139
15234a90786B25501H5248L00063j11112j31560B6768J35415a24802B45017e5483
15223A27046H881K54190I5357a11328H8905Q84L7887a33163B46879a24974j23867
$$ plain form
15212 -248841 -54736 137382 28938 -134387 -109008 123784 -146279 81135 -308922 128895
15201 -70922 296151 125091 -331896 -151664 42069 138973 -1615 -57868 -247843 -237407 -121173
15190 -121173 -36003 203201 -103767 251443 177938 233640 -375855 -107781 49405 -181672
15179 236792 365273 145438 57479 -111751 88407 -58970 -51229 45619 -55490 70023 15412
15167 71105 14037 94540 -45986 -117258 199107 -268062 126348 68109 19392 55090 -99734
15155 -276715 156820 63291 33555 50241 206587 174266 -17888 344586 40520 17027 -98789
15143 25130 299456 -429975 -147281 -59861 75498 149793 58413 -136955 82253 -79621 -82916
15132 -82916 170138 471508 -18224 137470 257870 168289 167609 -40402 -83607 155472 14603
$$ packed form
15212b48841e4736A37382B8938a34387K5379A23784a46279H1135c08922A28895
15201g0922B96151A25091c31896a51664D2069R6904a615n6253j89975J0436J16234
15190a21173c6003B03201a03767B51443p3505N5702c75855a07781D9405a81672
15179B36792J28481A45438E7479a11751H8407e8970P741D5619e5490G0023A5412
15167G1105A4037Q0503d5986p1272A99107b68062A26348n8239A9392L5698i9734
15155b76715A56820F3291k9736J6686J56346l2321a7888C44586D0520A7027i8789
15143B5130K74326d29975a47281e9861G5498P4295E8413a36955H2253g9621l295
15132h2916A70138L01370a8224A37470J20400q9581o80d0402m3205A55472A4603
$$ plain form
15120 209096 107339 168382 241379 90584 193717 54123 -212996 97863 225484 181099 -80453
15108 100721 288348 33744 44156 154745 255660 296926 117954 291892 123531 110720
15098 110720 112579 -108253 205784 80008 59800 53047 -67469 370 101328 58270 15230 36245
15086 36245 -152898 -97429 91935 280226 163106 6733 -98693 55057 179266 179255 -144701
15074 90444 212403 25691 30398 -103083 182336 -23828 39340 53800 77519 -56403 -26520
15062 -35671 58625 258342 -270401 70534 168694 227122 298150 -47676 354157 -36468 104003
15050 40678 168882 178569 19843 330293 211134 64115 221896 208411 123121 327709 288601
15039 288601 17302 46120 -301733 343689 209089 -177292 23577 59860 450045 -136422
$$ packed form
15120B09096j01757O1043P2997I0584J03133E4123b12996I7863J27621m4385h0453
15108A00721J87627C3744J0412J10589J00915M1266A17954J73938A23531j2811
15098A10720J859a08253B05784H0008k0208o753f7469C70J00958m3058A5230K1015
15086C6245a52898N5469I1935J88291j17120F733i8693E5057J24209j1a44701
15074I0444J21959B5691M707a03083A82336b3828C9340J4460K3719e6403b6520
15062c5671E8625J99717b70401G0534R8160N8428P1028d7676C54157c6468A04003
15050D0678J28204R687A9843L10450j19159F4115J57781j3485q5290K04588l9108
15039B88601A7302K8818c01733C43689j34600a77292B3577L6283L90185a36422
$$ plain form
15028 329899 152579 -106082 325881 150583 480254 111047 75549 120306 -47746 63561
15017 -50361 387852 24349 177341 127519 -113429 446939 41837 265224 -238820 172427
15006 -133886 330599 79408 146648 169606 130596 263742 98122 72117 71298 341893 403385
14995 403385 44846 325813 221759 -112348 443851 241739 215880 99635 90861 34371 37696
14984 37696 200531 89087 158279 330582 17581 -10564 148970 198865 339323 147513 167459
14973 167459 217699 117277 123254 -151914 199272 260142 328261 286830 239191 237199 538676
14962 538676 176278 327211 -60058 367632 306826 239147 259594 458829 267566 154650
14952 154650 84051 -53670 261687 536681 49823 106582 154461 -30407 212649 280169 -16991
$$ packed form
15028C29899A52579a06082C25881A50583L29671A11047l5498M4757d7746F3561
15017e0361C87852B4349J52992m9822a13429D46939D1837K23387b38820A72427
15006a33886C30599G9408O7240K2958l9010J33146I8122k6005q19K70595O1492
14995D03385D4846K80967j04054a12348D43851k02112k5859I9635q774C4371L325
14984C7696J62835H9087O9192J72303A7581a0564A48970M9895J40458A47513J9946
14973A67459N0240j00422N977a51914A99272O0870O8119m1431m7639j992L01477
14962E38676A76278J50933f0058C67632o0806o7679K0447J99235j91263j12916
14952A54650p0599e3670B61687K74994D9823N6759M7879c0407B12649O7520a6991
$$ plain form
14940 236961 -26703 95224 179896 97840 121908 290196 182020 95752 397575 338652 248930
14929 248930 198828 -78456 350304 300501 169719 120866 240160 94745 300860 176444
14919 176444 154237 237850 245413 222995 125975 -39844 87452 159782 405685 339782 314019
14908 314019 154091 222304 78986 37113 -176328 394002 338013 264435 417794 68658 642556
14897 642556 94554 382325 411391 187431 505850 367946 505825 258043 443864 248611
14887 248611 108455 148414 173879 139952 382468 305169 125544 281839 -32725 314719
14876 223195 42932 455983 271095 372926 -27912 412078 202135 370381 62352 197731
14866 197731 262566 527770 171224 584744 232971 488502 386335 140542 390503 360460
$$ packed form
14940B36961b6703I5224Q4672q2056K4068J68288j08176q6268L01823n8923q9722
14929B48930n0102g8456C50304m9803j30782m8853J19294I4745K06115j24416
14919A76444k2207Q3613P563k2418r7020c9844H7452P2330K45903o5903k5763
14908C14019A54091O8213G8986C7113a76328C94002n5989p3578J53359F8658N73898
14897F42556I4554K87771K9066A87431L18419j37904J37879k47782J85821j95253
14887B48611A08455L9959K5465l3927K42516p7299A25544J56295c2725C14719
14876B23195D2932M13051j84888J01831b7912D12078B02135J68246F2352J35379
14866A97731O4835K65204A71224M13520B32971K55531j02167A40542K49961l0043
$$ plain form
14856 360460 434272 83326 453928 554514 331335 600320 151840 419550 375382 -44320
14845 283415 371983 333512 -7002 275443 244084 417057 313899 458293 620675 594967 403532
14834 403532 405609 370393 13695 513947 348064 485316 456824 616599 414635 431067 218549
14823 218549 259947 373382 391905 177137 232280 315762 294450 379245 585096 347174 419269
14812 419269 410678 464597 376359 53715 255954 292694 610193 497533 416490 254834 415873
14801 415873 337173 318818 533492 481436 102147 335947 418824 412334 150943 535113 380483
14790 380483 196260 389886 264557 688949 104145 522809 532102 444533 381421 536484
14780 536484 343473 263652 522868 409236 259138 516350 540759 716147 628140 743996
$$ packed form
14856C60460P3812H3326L70602J00586k23179K68985A51840K67710m4168d4320
14845B83415Q8568l8471g002B75443l1359J72973j03158J44394J62382k5708j91435
14834D03532K077l5216A3695N00252j65883J37252k8492J59775k01964J6432k12518
14823B18549M1398J13435J8523A77137N5143Q3482k1312Q4795K05851k37922P2095
14812D19269q591N3919q8238E3715K02239L6740L17499j12660q1043j61656J61039
14801D15873p8700j8355K14674n2056A02147K33800Q2877o490A50943L84170j54630
14790C80483j84223J93626j25329M24392A04145M18664R293q7569o3112J55063
14780E36484j93011p9821K59216j13632j50098K57212K4409J75388q8007J15856
$$ plain form
14770 743996 326969 521120 491737 432291 970542 339437 329824 665293 664748 564880 774018
14759 774018 538477 576911 529371 527647 221472 493155 621763 122724 494376 273714
14749 273714 534682 732737 571590 584782 754517 671615 645768 659004 633862 436255
14739 436255 379739 262487 563375 491528 553804 395082 372747 695968 452423 678808
14729 678808 613960 395040 564468 578097 668386 695999 477603 598154 690505 1007030
14719 1007030 734238 760872 524681 639178 599067 876663 662878 614962 759837 837757
14709 837757 780399 490094 677459 784571 534269 462136 757107 723022 649137 838128
14699 838128 253524 602908 753864 688138 882387 654294 591048 596324 492259 577081
$$ packed form
14770G43996C26969J94151k9383n9446N38251C39437r613L35469n45r9868K09138
14759G74018k35541L8434m7540j724B21472K71683J28608A22724L71652k20662
14749B73714K60968J98055j61147J3192J69735q2902k5847J3236k5142j97607
14739D36255n6516j17252L00888p1847O2276j58722k2335L23221k43545K26385
14729F78808o4848k18920J69428J3629R0289K7613k18396J20551R2351L16525
14719A007030k72792K6634k36191J14497m0111K77596k13785m7916J44875P7920
14709H37757n7358k90305J87365J07112k50302p2133K94971l4085p3885J88991
14699H38128B53524L49384J50956o5726J94249k28093o3246N276j04065Q4822
$$ plain form
14689 577081 739345 901105 604233 603082 929639 785633 733844 582345 964299 884823
14679 884823 458046 526449 741472 764265 729670 485789 1067440 927417 988459 794449
14669 794449 750671 609889 775483 652161 1002789 981409 779030 1168898 856717 837072
14659 837072 772070 846033 921053 745434 843139 630450 992723 1032540 900772 786021
14649 786021 893674 1004427 1016448 991087 1179887 921940 758505 1105240 1136731 905075
14639 905075 992097 1264984 1304594 914250 916969 1359772 1055200 1185124 1020137 988842
14629 988842 1115600 981107 1004546 902955 1327118 938776 727940 736157 843139 1097104
14619 1097104 979178 1136063 943493 1352940 1241641 1464969 1241284 960954 982160 1182677
$$ packed form
14689E77081J62264J61760k96872j151L26557j44006n1789j51499L81954p9476
14679H84823m26777O8403K15023K2793l4595k43881N81651j40023O1042j94010
14669G94449m3778j40782J65594j23322L50628k1380k02379L89868l12181j9645
14659H37072o5002P3963P5020j75619R7705k12689L62273L9817j31768j14751
14649G86021J07653J10753J2021k5361J88800k57947j63435L46735L1491k31656
14639I05075Q7022K72887L9610l90344K719M42803l04572J29924j64987l1295
14629I88842J26758j34493K3439j01591M24163l88342k10836Q217J06982K53965
14619A097104j17926J56885j92570M09447j11299K23328k23685k80330K1206K00517
$$ plain form
14609 1182677 1106163 1033656 1338845 1277328 1095476 1197856 1568303 1491784 1432388 1410182
14599 1410182 1258945 1353137 1078021 1297707 1451208 1112339 1300467 1155200 1347187 1853310
14589 1853310 1534299 1240230 1371597 1544699 1476249 1370027 1632602 1884342 1416790 1449359
14579 1449359 1558880 1524242 1465724 1889996 1296211 1729387 1844429 1622218 2012367 1911531
14569 1911531 1491182 2098134 2008433 1860334 1712126 2138175 2084538 2137735 2425856 2081115
14559 2081115 2449446 2412820 2380519 2545417 3018458 2820977 3313955 3491069 3589255 5041211
14549 5041211 6913209 11068038 20427092 37787248 37893889 17002714 6673934 3561557
14541 3561557 2601325 2059663 1558318 1686645 1739465 1621590 1396709 2093318 1932430 1433462
$$ packed form
14609A182677p6514p2507L05189o1517j81852J02380L70447p6519n9396k2206
14599A410182j51237R4192k75116K19686J53501l38869J88128j45267J91987N06123
14589A853310l19011k94069J31367J73102o8450j06222K62575K51740m67552L2569
14579A449359J09521l4638n8518M24272n93785M33176J15042k22211L90149j00836
14569A911531m20349O06952q9701j48099j48208M26049n3637N3197K88121l44741
14559B081115L68331l6626l2301J64898M73041j97481M92978J77114R8186J451956
14549E041211J871998M154829R359054J7360156J06641A7002714F673934l112377
14541C561557r60232n41662n01345J28327N2820j17875k24881O96609j60888m98968
$$ plain form
14531 1433462 1759875 1567832 1837039 1737514 1966041 1841325 2039970 2140000 2135390 2257080
14521 2257080 2253550 1999334 2195756 1990340 2284963 2213470 2129495 2071778 2257653 2311047
14511 2311047 2265548 2250057 2129278 2453321 2651459 2379882 2342295 2473907 2364972 2435357
14501 2435357 2570455 2817493 2658376 2631273 2352713 2587350 2897014 2689717 3028821 2221252
14491 2221252 2620413 2905726 3043050 3034381 3012447 2892311 2831431 3013834 3116432 2932504
14481 2932504 3393730 3187853 2983074 3325763 3438787 3199409 3425192 3735275 3260664
14472 3260664 3415606 3508723 3405942 3589345 3906267 3454817 3838686 3473410 3803301 3797437
14462 3797437 3614203 4144210 3559204 4165825 4210706 4061747 4103662 3973612 4280129 4354698
$$ packed form
14531A433462L26413j92043K69207r9525K28527j24716J98645J00030m610J21690
14521B257080l530k54216J96422k05416K94623p1493q3975n7717J85875N3394
14511B311047m5499j5491j20779L24043J98138k71577l7587J31612j08935P0385
14501B435357J35098K47038j59117k7103k78560K34637L09664k07297L39104q07569
14491B221252L99161K85313J37324q669k1934j20136o0880J82403J02598j83928
14481B932504M61226k05877k04779L42689J13024k39378K25783L10083m74611
14472C260664J54942R3117j02781J83403L16922m51450L83869l65276L29891n864
14462C797437j83234N30007n85006O06621M4881j48959M1915j30050L06517P4569
$$ plain form
14452 4354698 4035627 4235535 4551961 4768799 4555679 4708872 4595875 4482368 5036728
14443 5036728 4631608 4626320 4622508 4968560 4927531 5092745 5328436 5115960 5376672 5296412
14433 5296412 5498117 5774123 5939326 5669177 6053351 5535581 5992124 6098455 6301279
14424 6301279 6078839 6244265 6196416 6453821 6207210 6607041 6817567 7013571 7168200 6931067
14414 6931067 7156092 6924294 7257748 7453098 7541366 7321491 7751684 7927700 8088157 8094343
14404 8094343 8340457 8361696 8547859 8533504 8897386 9134302 8905015 9066626 9307996 9750968
14394 9750968 9909036 9941817 10146496 10098599 10612477 10568443 10957675 10897348 11026608 11264364
14384 11264364 11462926 11600795 11855226 12085694 12565234 12594926 12641028 13426851 13444503 13642176
$$ packed form
14452D354698l19071J99908L16426K16838k13120J53193j12997j13507N54360
14443E036728m05120n288l812L46052m1029J65214K35691k12476K60712q0260
14433E296412K01705K76006J65203k70149L84174n17770M56543J06331K02824
14424F301279k22440J65426m7849K57405k46611L99831K10526J96004J54629k37133
14414F931067K25025k31798L33454J95350Q8268k19875M30193J76016J60457O186
14404H094343K46114K1239J86163j4355L63882K36916k29287J61611K41370M42972
14394I750968J58068L2781K04679m7897N13878m4034L89232o0327J29260K37756
14384A1264364J98562J37869K54431K30468M79540K9692M6102P85823J7652J97673
$$ plain form
14374 13642176 13948923 14441751 14533237 14741867 14965772 15503238 15718584 15987479 16273287
14365 16273287 16883798 17219975 17372590 18141876 18240694 18336459 18848882 19223618 20146636 20426725
14355 20426725 20858022 21341698 22178245 22381573 22990234 23268947 24256179 24312447 25558769
14346 25558769 26247317 26713637 27223559 28113920 28804052 29800695 30723754 31350992 32280244
14337 32280244 33388483 34319115 35193223 36451614 37653696 38253173 39775738 40886428
14329 40886428 42138047 43847511 44792808 46390141 48091571 50065316 51541246 53030270
14321 53030270 55303466 57053254 59284238 61659050 63913494 66428639 68733665 71545296
14313 71545296 74748159 77573010 80733399 84230348 88021912 91844047 96206415 100135433
$$ packed form
14374A3642176L06747M92828R1486K08630K23905N37466K15346K68895K85808
14365A6273287O10511L36177J52615P69286R8818R5765N12423L74736R23018K80089
14355B0426725M31297M83676Q36547K03328O08661K78713R87232N6268J246322
14346B5558769O88548M66320N09922Q90361O90132R96643R23059O27238R29252
14337C2280244J108239R30632Q74108J258391J202082N99477J522565J110690
14329D0886428J251619J709464R45297J597333J701430J973745J475930J489024
14321E3030270K273196J749788K230984K374812K254444K515145K305026K811631
14313G1545296L202863K824851L160389L496949L791564L822135M362368L929018
$$ plain form
14305 100135433 105166181 109730980 114972052 120614062 126719843 132521023 139599138 146888069
14297 146888069 154166556 162099706 170713414 179980239 189588443 199809883 211041667 222308569
14289 222308569 234930797 247699624 260966836 274790339 289455814 304119661 319987620
14282 319987620 335553435 351414255 367102258 382203387 396854550 410730438 423118041
14275 423118041 433636053 441903258 445351746 444534300 442789328 440494344 437802940 433344217
14267 433344217 426620937 417079927 404981711 391777345 376927681 360718963 344714563
14260 344714563 328004537 311258734 295009993 279411327 264650677 250902153 237579439
14253 237579439 224295224 212519706 200870285 190161995 179940395 170363176 161719138
$$ packed form
14305A00135433N030748M564799N241072N642010O105781N801180P078115P288931
14297A46888069P278487P933150Q613708R266825R608204J0221440J1231784J1266902
14289B22308569J2622228J2768827J3267212J3823503J4665475J4663847J5867959
14282C19987620J5565815J5860820J5688003J5101129J4651163J3875888J2387603
14275D23118041J0518012Q267205L448488q17446j744972k294984k691404m458723
14267D33344217o723280r541010j2098216j3204366j4849664j6208718j6004400
14260C44714563j6710026j6745803j6248741j5598666j4760650j3748524j3322714
14253B37579439j3284215j1775518j1649421j0708290j0221600r577219q644038
$$ plain form
14246 161719138 153248663 145655735 138690744 131593775 125622293 119081206 113573240 108251523
14238 108251523 103673882 99371510 94636535 90247442 86408739 83152741 79654268 76662066
14230 76662066 73299123 70399732 67576597 64623142 62636634 59921541 57688283 55660491
14222 55660491 53779910 51812542 50493982 48547345 46700242 45489127 43383771 42511790
14214 42511790 41130364 40376208 38797561 37350182 36288768 35501200 34562149 33519142
14206 33519142 32938413 31369264 30683426 29782961 28909602 28256134 28118700 26880293 26049002
14197 26049002 25498158 24549018 24091719 23600697 23157864 22700238 22194793 21414471 20662542
14188 20662542 20849610 20112096 19665061 18981006 18693356 18095443 17674055 17580963 17101358
$$ packed form
14246A61719138q470475p592928o964991p096969n971482o541087n507966n321717
14238A08251523m577641m302372m734975m389093l838703l255998l498473k992202
14230G6662066l362943k899391k823135k953455j986508k715093k233258k027792
14222E5660491j880581j967368j318560j946637j847103j211115k105356q71981
14214D2511790j381426p54156j578647j447379j061414p87568r39051j043007
14206C3519142n80729j569149o85838r00465q73359o53468j37434j238407q31291
14197B6049002n50844r49140m57299m91022m42833m57626n05445p80322p51929
14188B0662542J87068p37514m47035o84055k87650n97913m21388r3092m79605
$$ plain form
14179 17101358 16836681 16652918 15799753 15592828 15431120 15068492 14828094 14468724 14401770
14170 14401770 13971240 13818805 13549766 13187442 13040575 12849320 12469401 12449225 12358736 11988472
14160 11988472 11637906 11457528 11217540 11053543 11158942 10513295 10271693 9999738 10255359
14151 10255359 9522048 9734119 9384806 9288230 9070529 8985614 8913825 8930816 8495261 8474392
14141 8474392 8400402 8519809 8350690 8193580 7814451 8070127 7758197 7533131 7471833 7677689
14131 7677689 7400887 7277772 7476745 7140620 6754504 6781893 6773193 6289201 6587493 6342607
14121 6342607 6361259 6249077 6300528 6340743 6005118 5961005 5875057 5856662 5646522 5696068 5587484
14110 5587484 5473616 5483901 5214110 5162633 5468723 5256848 5234544 5114283 5060868 5121549
$$ packed form
14179A7101358k64677j83763q53165k06925j61708l62628k40398l59370o6954
14170A4401770m30530j52435k69039l62324j46867j91255l79919k0176r0489l70264
14160A1988472l50566j80378k39988j63997J05399o45647k41602k71955K55621
14151A0255359p33311K12071l49313r6576k17701q4915p1789J6991m35555k0869
14141H474392p3990J19407j69119j57110l79129K55676l11930k25066o1298K05856
14131G677689k76802j23115J98973l36125l86116K7389q700m83992K98292k44886
14121F342607J8652j12182N1451M0215l35625m4113q5948j8395k10140M9546j08584
14110E587484j13868J0285k69791n1477L06090k11875k2304j20261n3415O0681
$$ plain form
14100 5121549 5090345 4835265 4853619 4954184 4772121 4631150 4671559 4616818 4595994 4474087
14090 4474087 4350955 4324278 4509613 4114746 4263193 3985241 3983539 4055250 4106988 4194215
14080 4194215 3840489 4117585 3710798 3806917 3632676 3725683 3646464 3545620 3401545 3623225
14070 3623225 3633233 3265445 3680313 3586534 3314277 3192018 3319389 3511807 3363179 3333046
14060 3333046 3226615 3514772 3448054 2990937 3391920 3262707 3091040 3247942 3154577 2819596
14050 2819596 2885782 2801808 3055513 2862536 2780248 2854269 2566042 2639823 2766545 2538836
14040 2538836 2722732 2552882 2511499 2644175 2625712 2524215 2519416 2221311 2542715 2568152
14030 2568152 2668356 2357074 2461405 2564950 2107165 2311790 2200755 2034123 2396568
$$ packed form
14100E121549l1204k55080J8354J00565j82063j40971M0409n4741k0824j21907
14090D474087j23132k6677J85335l94867J48447k77952j702P1711N1738Q7227
14080D194215l53726K77096m06787R6119j74241R3007p9219j00844j44075K21680
14070C623225J0008l67788M14868r3779k72257j22259J27371J92418j48628l0133
14060C333046j06431K88157o6718m57117M00983j29213j71667J56902r3365l34981
14050B819596O6186q3974K53705j92977q2288P4021k88227P3781J26722k27709
14040B538836J83896j69850m1383J32676j8463j01497m799k98105L21404K5437
14030B568152J00204l11282J04331J03545m57785K04625j11035j66632L62445
$$ plain form
14021 2396568 2167254 1932784 2369944 2180184 2255382 2143908 2268567 1814834 1859723 1815476
14011 1815476 1911342 1950687 2105461 2090453 1927943 1909000 1718169 2060213 1876974 1788828
14001 1788828 1742335 1726140 1930044 1386699 2278387 1524719 1906771 1680643 1870790 2344380
13991 2344380 2177942 2362664 3620578 6433067 14255192 31864283 38601547 20922332
13983 20922332 10070782 6276543 4682028 3959881 3311427 2800324 2604780 2620997 2500085
13974 2500085 2590042 2377904 2232024 2017644 2032421 2154127 1734376 1531366 1827360 1960667
13964 1960667 1962175 1953211 1851164 1605546 1578730 1791633 1932958 1639578 1607045 1758409
13954 1758409 1754356 1764359 1362781 1650447 1660752 1956520 1768084 1844141 1438556 1523506
$$ packed form
14021B396568k29314k34470M37160j89760P5198j11474J24659m53733M4889m4247
14011A815476R5866L9345J54774j5008j62510j8943j90831L42044j83239q8146
14001A788828m6493j6195K03904n43345Q91688p53668L82052k26128J90147M73590
13991B344380j66438J84722J257914K812489P822125J7609091O737264j7679215
13983B0922332A0070782l794239j594515p22147o48454n11103j95544J6217j20912
13974B500085Q9957k12138j45880k14380J4777J21706m19751k03010K95994J33307
13964A960667J508q964j02047k45618k6816K12903J41325k93380l2533J51364
13954A758409m053J0003m01578K87666J0305K95768j88436P6057m05585Q4950
$$ plain form
13944 1523506 1426955 1618575 1582847 1493407 1317484 1530295 1525567 1292828 1358130 1210613
13934 1210613 1070243 1603554 1436877 1310645 1334485 1429258 1078328 1375545 1322433 1428133
13924 1428133 1553836 1442693 1437561 1205731 1241199 1207587 1513085 1170526 1218316 1182416
13914 1182416 1038859 904025 1270825 1215490 1314879 848532 1093708 1379207 1087949 1151443
13904 1151443 1180019 1036006 1165839 943043 1147788 1086098 1348870 813085 1343239 1192071
13894 1192071 1060967 1204984 959605 939519 1164220 767986 1009652 1133314 816933 830549
13884 830549 953061 850859 811337 987665 789547 963158 1171894 982987 905354 1106431
13874 1106431 895209 1100806 1310208 1069823 846046 1185304 794491 998470 848152
$$ packed form
13944A523506r6551J91620l5728q9440j75923K12811m728k32739O5302j47517
13934A210613j40370N33311j66677j26232K3840R4773l50930K97217n3112J05700
13924A428133J25703j11143n132k31830L5468l3612L05498l42559M7790l5900
13914A182416j43557j34834L66800n5335R9389m66347K45176K85499k91258O3494
13904A151443K8576j44013J29833k22796K04745o1690K62772n35785N30154j51168
13894A192071j31104J44017k45379k0086K24701l96234K41666J23662l16381J3616
13884H30549J22512j02202l9522J76328j98118J73611K08736j88907p7633K01077
13874A106431k11222K05597K09402k40385k23777L39258l90813K03979j50318
$$ plain form
13865 848152 924576 738247 980449 755412 868291 975182 996541 955767 959994 778230
13855 778230 815603 810690 1151289 1243800 856707 759646 1154633 646843 526922 1045264
13845 1045264 580991 728623 830219 750184 931160 873518 829460 635261 554824 561446
13835 561446 848009 1070013 483753 856710 775077 651863 491387 1089259 595063 983616
13825 983616 496291 553393 457564 790965 771978 563970 823133 680550 367662 698376
13815 698376 638463 750405 802422 671910 544592 911866 706377 692507 633208 491699
13805 491699 311315 626149 425638 966310 612803 999936 845011 613392 509325 447394
13795 447394 542560 732699 590723 524443 562379 445098 807719 849828 665000 444232
$$ packed form
13865H48152P6424j86329K42202k25037J12879J06891K1359m0774M227j81764
13855G78230L7373m913L40599R2511l87093r7061L94987n07790j19921N18342
13845A045264m64273J47632J01596q0035J80976n7642m4058j94199q0437O622
13835E61446K86563K22004D83753L72957q1633j23214j60476N97872m94196L88553
13825I83616m87325N7102r5829L33401j8987k08008K59163j42583l12888L30714
13815F98376n9913J11942N2017j30512j27318L67274k05489j3870n9299j41509
13805D91699j80384L14834k00511N40672l53507L87133j54925k31619j04067o1931
13795D47394R5166J90139j41976o6280L7936j17281L62621M2109j84828k20768
$$ plain form
13785 444232 900727 699190 500004 985305 605938 718148 589788 728453 328040 645702
13775 645702 598671 196514 826345 648835 658262 498529 562970 592381 619217 666670 841448
13764 841448 715256 815456 684558 647701 415393 461442 449925 712462 300682 616200
13754 616200 779340 384618 661999 241885 689484 591923 592253 374141 549449 271495
13743 600810 586332 565573 587220 548455 638918 535702 640833 402022 465449 365059 437309
13732 437309 377150 738390 508875 509280 386994 471409 640693 429594 339639 600256 561446
13721 561446 209762 431661 420483 342077 615548 496646 555655 545982 521109 439397 80288
13709 459183 559014 405000 376929 501132 540644 210843 623912 377958 352273 402170
$$ packed form
13785D44232M56495k01537j99186M85301l79367J12210j28360J38665C28040L17662
13775F45702m7031A96514O29831j77510R427j59733O4441K9411K6836M7453J74778
13764H41448j26192J00200j30898l6857k32308M6049j1517K62537C00682L15518
13754F16200J63140C84618K77381B41885M47599r7561L30k18112J75308B71495
13743F00810j4478k0759K1647l8765R0463j03216J05131k38811O3427j00390P2250
13732D37309o0159L61240k29515M05j22286Q4415J69284k11099q9955K60617l8810
13721E61446B09762K21899j1178p8406K73471j18902N9009r673k4873q1712H0288
13709D59183R9831j54014k8071J24203L9512B10843M13069k45954k5685M9897
$$ plain form
13699 402170 569561 597110 620300 517511 459434 547111 509026 575261 231024 445601 490863
13688 490863 276299 686136 483375 291466 564062 333381 256464 149693 288882 500305
13678 500305 447517 151005 206865 148451 320101 618211 495734 37770 490294 464870
13668 464870 474082 677851 423390 31772 488128 386335 221096 213852 394547 490660 536802
13657 536802 246457 255813 653181 429859 440225 439247 411730 178338 387927 514785 381271
13646 381271 175420 142746 324689 214074 538080 405722 305448 435798 407020 409994
13636 409994 574732 316055 421462 143885 395727 516094 325603 287839 396085 377265
13626 377265 386424 208018 283616 19228 68262 250764 104111 218150 316593 348091 135312
$$ packed form
13699D02170J67391K7549K3190j02789n8077Q7677l8085O6235B31024K14577M5262
13688D90863k14564M09837k02761j91909K72596k30681p6917j06771J39189K11423
13678E00305n2788A51005N5860n8414J71650K98110j22477C7770M52524k5424
13668D64870R212K03769k54461C1772M56356j01793j65239p244J80695R6113M6142
13657E36802B46457R356L97368k23322J0366r78k7517A78338K09589J26858j33514
13646C81271A75420l2674J81943j10615L24006j32358j00274J30350k8778K974
13636D09994J64738k58677J05407A43885K51842J20367j90491l7764J08246j8820
13626C77265R159j78406P5598A9228M9034J82502A04111J14039R8443L1498A35312
$$ plain form
13614 576073 404389 406461 215874 356552 235274 235845 452855 393465 112141 266001 540030
13603 540030 469646 730761 207290 339097 579672 472082 285893 435605 233703 73611
13592 53891 518213 295131 179931 506206 601522 388719 321646 242489 465406 138903
13581 251833 415544 185324 77740 273178 291467 59717 447941 244150 280748 216330
13571 216330 358797 -56703 47547 464931 420830 124385 402052 185534 532692 172700
13560 370116 -35061 -183636 90700 148762 574787 544693 122132 -46461 530180 -17253 343931
13548 199070 236979 297149 194289 325590 75255 210174 248632 57790 -44968 414874 458480
13537 458480 -168750 201373 215444 491895 -65353 320071 261944 317702 80052 -45261 313311
$$ packed form
13614E76073j71684K072j90587J40678j21278N71K17010n9390A12141J53860K74029
13603E40030p0384K61115B07290J31807K40575j07590j86189J49712k01902G3611
13592E3891M64322k23082j15200L26275R5316k12803o7073p9157K22917A38903
13581B51833J63711A85324G7740J95438J8289E9717L88224k03791L6598o4418
13571B16330J42467e6703D7547M17384m4101A24385K77667A85534L47158A72700
13560C70116c5061j48575I0700N8062M26025l0094A22132d6461E30180a7253C43931
13548A99070L7909O0170j02860J31301G5255J34919L8458E7790d4968D14874M3606
13537D58480a68750B01373J4071K76451f5353C20071n8127N5758H0052d5261C13311
$$ plain form
13525 300677 464255 606077 209274 407551 222511 309514 159021 88922 33631 277572
13515 277572 -11070 337018 -15219 81136 308818 132790 162760 138800 300759 62947 246148
13504 246148 520919 363943 285373 280663 106895 374785 77105 155501 231898 422847 361694
13493 361694 31485 312074 219416 -66414 191924 189621 114330 174988 109947 487261 386391
13482 386391 117229 46590 198690 560819 174702 -68119 499877 371693 230053 393698
13472 393698 66806 394134 164203 247003 251020 430779 368739 98675 334311 40362 74094
13461 74094 67382 348544 176277 209225 299565 116025 237510 51710 294093 67402 98856
13450 98856 440087 135000 22700 398966 293988 209311 214916 286669 46771 132502 117685
$$ packed form
13525C00677J63578J41822B09274J98277j85040Q7003j50493p0099C3631K43941
13515B77572a1070C37018a5219H1136K27682A32790K9970k3960J61959F2947J83201
13504B46148K74771j56976p8570m710A06895K67890G7105P8396P6397J90949o1153
13493C61694C1485K80589r2658f6414A91924k303p5291O0658o5041L77314j00870
13482C86391A17229D6590J52100L62129A74702f8119D99877j28184j41640J63645
13472C93698F6806L27328A64203Q2800M017J79759o2040I8675K35636D0362L3732
13461G4094o712K81162j72267L2948R0340A16025J21485E1710K42383F7402L1454
13450I8856L41231A35000B2700L76266j04978q4677N605P1753D6771Q5731j4817
$$ plain form
13439 117685 175270 336804 218267 -179714 -150412 -56952 299863 -240058 182356 86062
13428 326918 267741 -62957 595365 174425 300657 260567 330476 51982 171419 78874 393542
13417 393542 -24455 -56592 157624 213063 243416 244277 149279 25044 -26626 407410 433255
13406 433255 18397 128803 347143 96611 373267 145016 332620 202459 -15815 281400
13395 -188385 374118 260301 -155258 53208 -186792 222236 170556 -13348 58955 74750
13385 74750 -99395 -85218 -18931 33228 229578 48939 293369 148416 -65777 152675 109650
13374 109650 -62077 9270 -111426 180621 260350 106853 26445 154479 102544 179771 -161884
13362 286552 146083 252706 -56032 195002 101525 125367 51819 87319 57085 176709 -49385
$$ packed form
13439A17685N7585J61534j18537a79714K9302e6952B99863b40058A82356H6062
13428C26918n9177f2957E95365A74425J26232m0090O9909E1982J19437G8874L14668
13417C93542b4455l2137A57624N5439L0353Q61r4998B5044b6626D07410K5845
13406D33255A8397J10406K18340I6611K76656A45016J87604j30161a5815B81400
13395a88385C74118j13817a55258E3208a86792B22236n1680a3348E8955J5795
13385G4750i9395J4177a8931C3228J96350D8939K44430j44953f5777A52675m3025
13374A09650f2077I270a11426A80621P9729A06853B6445J28034n1935P7227a61884
13362B86552j40469J06623e6032A95002r3477K3842E1819L5500l0234J19624d9385
$$ plain form
13350 6014 146858 140775 258347 305562 317843 43554 572447 317592 183552 307364 266749
13339 266749 283626 247858 60344 -28934 381541 102403 331777 18155 -69630 327550 714360
13328 714360 448707 164706 78706 159096 223207 104721 -65353 -117596 303741 579409
13318 579409 268268 93653 353175 165677 35503 85386 146877 170399 119121 85650 58336
13307 58336 81750 300279 461934 -188879 151340 110702 430961 196688 -95906 371941
13296 200829 389402 -42767 314158 -212613 357455 21154 162905 345536 136601 36270
13285 7022 112694 9057 -77764 217661 108139 109806 184348 -21769 -24041 205000 185706 -17829
13272 137203 97815 191971 18582 -42887 83698 182091 80310 -196284 209474 128342 352366
$$ packed form
13350F014J40844o083J17572M7215J2281D3554N28893k54855j34040J23812m0615
13339B66749J6877l5768F0344b8934C81541A02403K29374A8155f9630C27550L86810
13328G14360k65653A64706G8706Q0390O4111A04721f5353n2243C03741K75668
13318E79409B68268I3653K59522A65677C5503M9883O1491K3522n1278l3471k7314
13307E8336K3414K18529J61655a88879A51340m0638L20259A96688i5906C71941
13296B00829J88573d2767C14158b12613C57455B1154J41751J82631A36601C6270
13285G022J05672I057g7764B17661A08139J667P4542b1769k272B05000j9294a7829
13272A37203l9388R4156A8582d2887H3698R8393H0310a96284B09474q1132K24024
$$ plain form
13261 352366 294910 -25643 309467 118812 -102498 117082 168508 167590 117641 240629 226007
13250 226007 -71023 244036 -28429 156156 -69611 202320 415576 -37814 188850 79225
13239 -155458 429489 246954 69822 241887 103982 310189 216174 225961 -67463 -47715 285558
13227 155357 252289 261356 285309 71016 177292 -39743 267346 -39154 498716 -223981 -45847
13215 270285 -144379 -5243 181344 71583 295640 -94171 194782 -137113 30048 221500
13205 221500 117732 167705 226877 140041 4917 39167 -130993 -171970 109944 -95539 99887
13193 130313 30889 190496 205425 221832 157938 -78372 161607 354927 -89511 150984 312642
13182 312642 273817 464024 118675 44006 105502 44105 -37163 143779 4311 69296 130874
$$ packed form
13261C52366n7456b5643C09467A18812a02498A17082N1426r18m9949J22988j4622
13250B26007g1023B44036b8429A56156f9611B02320K13256c7814A88850G9225
13239a55458D29489j82535F9822J72065A03982K06207r4015R787f7463J9748B85558
13227A55357R6932R067K3953G1016J06276c9743B67346c9154D98716b23981d5847
13215B70285a44379e243A81344G1583K24057i4171A94782a37113C0048J91452
13205B21500j03768M9973N9172q6836D917L4250a30993m0977A09944i5539I9887
13193A30313C0889J59607J4929J6407o3894g8372A61607J93320h9511A50984J61658
13182C12642l8825J90207A18675D4006O1496D4105c7163A43779D311O4985O1578
$$ plain form
13171 130874 -152623 -86487 -152150 59031 43988 22088 -170785 -57040 347631 182530 72833
13159 128366 -128814 -78180 141211 -174366 295608 -84866 92896 14132 156921 84152
13149 84152 -199054 210848 120182 128103 238133 118677 -163255 -24519 -26252 121365 -34766
13137 -160840 -85709 -51869 26959 -16786 205996 9617 31637 -50705 -10955 -117643 -233504
13126 -233504 86404 -33187 66390 176096 -41860 283107 -35456 211277 -308761 -42580 221884
13114 362632 34831 26481 155641 144512 31033 -198882 59915 115286 -81191 358832 210288
13103 210288 192898 150261 295644 155225 -168064 59085 279598 -365755 40360 17511
13092 -30044 -80222 10215 86455 290147 -176332 55618 136127 -323727 -173596 -135218 319261
$$ packed form
13171A30874a52623O6136o5663E9031j5043k1900a70785e7040C47631j65101G2833
13159A28366a28814N0634A41211a74366B95608h4866I2896A4132J42789p2769
13149H4152a99054B10848r0666P921J10030A18677a63255b4519j733A21365c4766
13137a60840P5131L3840B6959a6786B05996I617K2020e0705a0955j06688j15861
13126b33504H6404c3187F6390J09706d1860B83107c5456B11277c08761d2580B21884
13114C62632C4831q350J29160j1129C1033a98882E9915N5371h1191C58832j48544
13103B10288j7390m2637J45383j40419a68064E9085K20513c65755D0360A7511
13092c0044n0178A0215P6240K03692a76332E5618Q0509c23727J50131L8378C19261
$$ plain form
13080 -92222 202768 212812 326048 58472 227219 214612 217758 75809 92643 148570 -131180
13068 216617 173370 2305 80375 63910 -17167 56402 191482 326523 -151366 260177 236594
13057 236594 -168229 -72812 109359 253080 81955 66094 65319 283859 204982 -33789 137434
13045 265888 178072 181496 156875 -222109 228438 206700 122267 44021 182412 182103 285149
13034 285149 170837 -92529 132594 245342 36696 -45617 88625 -103986 3828 82708 -44459
13022 12030 -41522 -166446 154190 18784 195315 3510 216895 108766 123246 123215 104990
13011 104990 171296 376131 -144652 50160 232221 -44300 145605 -37783 537558 -123465
13000 2010 365090 -158170 26540 -108194 222938 -41420 -121669 -132578 -91278 240553 237379
$$ packed form
13080i2222B02768J0044J13236E8472J68747j2607L146G5809J6834N5927a31180
13068B16617m3247B305P8070j6465a7167E6402J35080J35041a51366B60177k3583
13057B36594a68229g2812A09359J43721H1955j5861p75K18540p8877c3789A37434
13045B65888q7816L424k4621b22109B28438k1738q4433D4021J38391l09J03046
13034B85149j14312i2529A32594J12748C6696d5617H8625a03986C828P8880d4459
13022A2030d1522j24924A54190A8784J76531C510K13385j08129J4480l1j8225
13011A04990O6306K04835a44652E0160J82061d4300A45605c7783E37558a23465
13000B010L63080a58170B6540a08194B22938d1420q0249j0909M1300B40553l174
$$ plain form
12989 237379 100342 -44825 -151004 198394 52124 66556 7047 110870 168165 215540 6967
12977 67091 -13410 -124522 56818 -171925 -13768 60014 99117 -65591 -145384 89434 14341
12965 -48292 172422 45509 39372 -106798 155138 -64213 48871 -106223 -230946 -58119 133061
12953 -101196 -38284 -121695 -54555 -5026 -116569 124643 59816 273591 139787 17501 -179513
12941 -200193 -39197 -169399 -121513 112471 -242732 -45215 116369 99409 -286643 309556
12930 304812 223754 53471 153491 -144870 -217878 258290 14364 -2277 19338 73832 -60331
12918 173063 -105443 -129900 -129111 17489 -152673 292972 124072 -75841 35733 -157545 -147008
12907 -147008 -221510 219701 29977 201156 320819 -113777 -13351 983 367572 259136 228381
$$ packed form
12989B37379A00342d4825j06179A98394E2124J4432G047J03823N7295M7375F967
12977F7091a3410j11112E6818a71925a3768F0014L9103f5591p9793H9434A4341
12965d8292A72422D5509o137a06798A55138f4213D8871a06223j24723e8119A33061
12953a01196c8284q3411e4555e026j11543A24643E9816K13775j33804A7501a79513
12941b00193c9197j30202M7886A12471b42732d5215A16369j6960b86643C09556
12930C04812q1058E3471J00020a44870p3008B58290A4364b277A9338N4494f0331
12918A73063a05443k4457P89A7489a52673B92972A24072g5841C5733a57545J0537
12907a47008p4502B19701B9977J71179J19663a13777a3351I83L66589j08436l0755
$$ plain form
12896 228381 46948 194493 198906 -221976 -62390 -255188 141577 -340403 127897 13230
12885 -362292 110232 70359 18649 -116523 173337 14082 175154 159509 -126774 -24408
12874 -169191 444897 -213522 -94319 32716 206011 -133005 -40260 44259 122625 296435
12864 296435 109252 280897 38173 -34334 -24323 -252166 -97652 107439 -71008 54844 -94787
12852 192470 23226 -185645 -131418 109562 15476 121740 161065 -86940 8790 -35969 29021
12840 21506 147418 -79504 -134838 151449 -176 -108011 -199912 5000 474087 -59080 -317558
12829 -317558 208859 -2996 196574 -83808 350152 221060 -123239 109613 -129857 18065
12818 -72016 -124681 -194222 -56116 73657 53879 181118 55774 -127770 37328 -141851 83405
$$ packed form
12896B28381D6948J47545M413b21976f2390j92798A41577c40403A27897A3230
12885c62292A10232l9873A8649a16523A73337A4082J61072j5645a26774b4408
12874a69191D44897b13522i4319C2716J73295a33005d0260D4259P8366J73810
12864B96435A09252J71645C8173c4334J0011k27843i7652A07439g1008E4844i4787
12852A92470B3226a85645N4227A09562A5476J06264L9325h6940H790c5969B9021
12840B1506J25912g9504n5334A51449a76j07835r1901E000M69087e9080k58478
12829c17558B08859b996A96574h3808C50152j29092a23239A09613a29857A8065
12818g2016n2665o9541e6116G3657j9778J27239E5774a27770C7328a41851H3405
$$ plain form
12806 21053 -63482 173847 -85230 -140506 185901 -87656 131209 138205 -81416 24845 -99568
12794 -98899 -215638 -5892 233057 144912 311389 -36810 -56533 -220001 75057 -294864 -109872
12782 142044 19337 21408 318161 -6962 134567 162325 -187864 157692 171278 -189414 28359
12770 -121294 -25985 47092 -83590 -159798 12266 -349936 -286282 191507 -31348 366036 226318
12759 226318 172889 3826 -114268 78032 -27787 -34242 8219 357801 -163271 318053 211711
12748 211711 -58025 78658 189914 84917 -105988 -95885 -71041 103781 -270751 28440 89464
12737 89464 -110089 22751 441093 -125564 271945 -9268 347927 195199 -40583 40600 4333
12725 129075 -30501 437080 32986 38098 -233858 -30834 -111305 121753 25675 -136081 -267737
$$ packed form
12806B1053f3482A73847h5230n5276A85901h7656A31209O996h1416B4845i9568
12794i8899j16739e892B33057q8145J66477c6810j9723j63468G5057b94864a09872
12782A42044A9337K071K96753f962A34567K7758a87864A57692J3586a89414B8359
12770a21294b5985D7092h3590p6208A2266c49936O3654A91507c1348C66036j39718
12759B26318n3429C826a14268G8032b7787o455H219L49582a63271C18053j06342
12748B11711e8025G8658J11256H4917a05988J0103K4844A03781b70751B8440O1024
12737H9464a10089B2751M18342a25564B71945i268C47927j52728d0583D0600D333
12725A29075c0501D37080C2986N112b33858c0834q0471A21753B5675a36081j31656
$$ plain form
12714 -267737 -135475 182715 195097 137644 241075 27138 181957 -276695 363562 299207
12704 299207 352413 533692 -36907 18354 5448 172065 332700 -292156 171523 473821
12694 473821 -154929 34305 -138366 -100146 -305814 -61193 95932 -26560 70929 247048 70606
12682 -23286 162312 123894 108370 280161 276719 126908 -118521 -98606 79873 -106710 -17750
12670 227466 178661 173680 237831 -230995 -117231 201862 -132038 -18441 18736 81171 119940
12659 119940 40358 -102679 222939 11607 -26130 20458 96310 190517 -93858 165613 211345
12648 211345 -231063 152427 -19535 94693 202889 -85741 138699 225740 -107129 -34994
12637 -48493 -4487 26973 -21324 -7010 149708 247393 -53865 76579 -78814 297356 308367 378902
$$ packed form
12714b67737J32262A82715J2382n7453J03431B7138J54819b76695C63562o4355
12704B99207N3206J81279c6907A8354E448J66617J60635b92156A71523L02298
12694D73821a54929C4305a38366L8220k05668f1193I5932b6560G0929J76119G0606
12682b3286A62312l8418j5524J71791l442A26908a18521J9915G9873a06710a7750
12670B27466m8805m981O4151b30995J13764B01862a32038a8441A8736O2435L8769
12659A19940D0358a02679B22939A1607b6130B0458P5852R4207i3858A65613M5732
12648B11345b31063A52427a9535I4693J08196h5741A38699Q7041a07129c4994
12637d8493d487B6973b1324g010A49708R7685e3865G6579g8814B97356J1011P0535
$$ plain form
12625 378902 -71401 152600 553719 337944 37593 276325 97512 108829 53797 175723
12615 175723 218692 153407 -4534 -193986 16465 259978 -166875 9944 -73323 24331 -108922
12603 96398 -137279 96160 305816 -48646 -224068 130355 -250232 -65976 -106067 13175 -20589
12591 259101 -6718 47153 -162105 30602 27305 147170 136221 -124292 -248690 218549 213310
12580 213310 -55439 -55789 66553 -127497 -119712 -31520 51273 169836 17908 -46072 -167053
12569 -167053 112257 -71538 109235 -230921 -33421 6537 -23141 -182442 27409 226966 94895
12557 -171043 389224 -17985 -128382 49241 -69087 118351 -209737 -25125 -162775 -192155
12547 -192155 -215945 74223 -270156 -898 -225189 329141 10982 403669 -374221 64317 226742
$$ packed form
12625C78902g1401A52600M01119k15775C7593K38732I7512J1317E3797J21926
12615A75723M2969o5285d534j89452A6465K43513a66875I944g3323B4331a08922
12603I6398a37279I6160K09656d8646j75422A30355b50232f5976m0091A3175b0589
12591B59101f718D7153a62105C0602l297J19865j0949a24292j24398B18549n239
12580B13310e5439l50F6553a27497P785c1520E1273J18563A7908d6072j20981
12569a67053A12257g1538A09235b30921c3421F537b3141j59301B7409J99557I4895
12557a71043C89224a7985j10397D9241f9087A18351b09737b5125j37650k9380
12547a92155k3790G4223b70156h98k24291C29141A0982L92687c74221F4317J62425
$$ plain form
12536 226742 165412 -180393 -5567 -161338 138659 -51374 -142449 120991 1969 200228 171877
12525 171877 -226905 -111338 28123 -2081 33525 3293 163444 224817 -161346 182082 301739
12514 301739 -12576 25666 22893 236710 117036 306867 -66931 -115108 115058 18090 247038
12503 247038 137975 -60517 -69932 36185 -19642 -42816 145842 -100530 204020 57356 -203108
12491 -104513 -144900 -67152 22367 -75197 -50057 -19610 177106 -254176 -297112 430140 92698
12479 102026 298410 94794 349649 303187 -45084 195163 -205889 169415 -22312 -178246
12469 -178246 -169719 -260647 -69740 -198813 88662 -26752 7939 54311 18620 57043 193489
12458 193489 25246 33373 175148 153068 -136232 -204192 -291114 188386 72702 166087 -121251
$$ packed form
12536B26742o1330a80393e567j55771A38659e1374r1075A20991A969J98259k8351
12525A71877b26905a11338B8123b081C3525C293J60151O1373a61346A82082J19657
12514C01739a2576B5666k773K13817A17036J89831f6931m8177A15058A8090K28948
12503B47038j09063f0517r415C6185a9642k3174A45842a00530B04020E7356b03108
12491a04513m0387f7152B2367g5197K5140a9610A77106b54176m2936D30140I2698
12479A02026J96384I4794K54855m6462d5084A95163b05889A69415b2312j55934
12469a78246Q527r0928f9740j29073H8662b6752G939M6372A8620L8423J36446
12458A93489B5246Q127J41775k2080a36232o7960q6922A88386G2702R3385a21251
$$ plain form
12446 163573 -245380 59707 -75809 -57318 -127605 99515 -44656 -48955 -117678 -22415 -219657
12435 -219657 -148125 -166595 206893 57520 -49312 157354 102436 289828 344705 -124702 39222
12423 -71071 -88496 250323 -179086 -49808 24694 170123 231897 81847 -61990 202027 -172765
12411 -152780 170576 -291010 49727 16501 -272438 -53176 123721 -316255 -76604 -26269
12400 -101751 67133 127695 -75887 27184 66576 187821 68348 -141087 -60014 505655 -79014
12388 -69802 24770 -16720 69261 92275 -128788 -394784 118193 -68827 -70395 39078 -258597
12376 250694 -140212 -42424 181003 -60149 -242467 -134364 -134164 -294936 -129906 -93117 244304
12364 33190 -39531 131354 16786 183608 17783 267186 -246911 -346054 -133572 161591
$$ packed form
12446A63573b45380E9707g5809J8491p0287I9515d4656m299o8723b2415j97242
12435b19657P1532j8470B06893E7520d9312A57354n4918J87392N4877a24702C9222
12423g1071j7425B50323a79086d9808B4694J45429O1774H1847f1990B02027a72765
12411a52780A70576b91010D9727A6501b72438e3176A23721c16255g6604b6269
12400a01751F7133O0562g5887B7184L9392J21245F8348a41087f0014E05655g9014
12388f9802B4770a6720F9261K3014a28788k65996A18193f8827j568C9078b58597
12376B50694a40212d2424A81003f0149j82318J08103K00j60772a29906L6789B44304
12364C3190c9531A31354A6786J66822A7783K49403b46911r9143a33572A61591
$$ plain form
12353 74416 115010 -205250 -63907 -181493 -50289 310974 -216710 228033 823 -105024 171904
12341 -71886 66774 -94897 -228089 172349 -59599 -398259 101560 -110585 -168736 -51245 -167709
12330 -167709 229454 304598 2743 -176312 -170075 118471 15404 -3860 175273 203882 -17787
12318 -45825 237535 53798 100908 276145 -11982 5175 341866 24324 131125 4457 101801
12307 101801 28514 41983 45144 -9468 40854 -355179 -260505 -131901 -6793 8595 104591 -128608
12294 143404 210767 345444 17771 -27854 129168 108978 150484 -406635 -8294 -148449 -248406
12283 -248406 110282 -63997 205161 -25891 343188 7560 -61934 265550 203760 156597 80222
12272 80222 -185892 262245 -227112 -44510 82904 -170948 -97719 -102755 83845 155231 -120501
$$ packed form
12353G4416M0594b05250f3907j17586e0289C10974b16710B28033H23a05024A71904
12341g1886F6774i4897j33192A72349e9599l38660A01560a10585n8151e1245j16464
12330a67709B29454P5144B743a76312O237A18471A5404c860A75273K8609a7787
12318d5825B37535E3798M7110J75237a1982E175L36691B4324J06801D457R7344
12307A01801B8514J3469L161i468D0854c55179R4674J28604f793H595R5996a28608
12294A43404O7363J34677A7771b7854A29168k0190M1506d06635h294j40155r9957
12283b48406A10282f3997B05161b5891C43188G560f1934B65550o1790m7163p6375
12272H0222a85892B62245b27112d4510H2904a70948P3229n036H3845P1386a20501
$$ plain form
12260 106433 96783 93180 133941 -24163 -15430 286360 -224786 -54578 34842 -183519 70293
12248 103669 208602 279918 126125 -91041 174787 -52839 -90497 85959 120802 234069 128810
12237 128810 358011 225511 351751 138632 -228319 212394 137112 -222379 73689 282521
12227 282521 475831 170697 113837 125350 249920 263786 -53142 185695 34652 276809
12217 276809 -28058 205933 76805 161321 88434 180751 122596 342060 -184630 196494 198962
12206 198962 -188077 37617 214357 256800 123917 112480 236034 -4292 67216 182639 286161
12195 286161 4517 70947 266304 99841 121154 267605 291625 -93273 136546 202926 34626
12183 83256 108083 165770 184089 -41995 83231 124691 -160990 -28760 54600 -28752 146939
$$ packed form
12260A06433r650l603M0761b4163Q733B86360b24786e4578C4842a83519G0293
12248A03669J04933P1316A26125i1041A74787e2839l7658H5959L4843J13267j05259
12237A28810K29201j32500J26240A38632b28319B12394p5282b22379G3689K08832
12227B82521J93310A70697n6860J1513J24570J3866e3142A85695C4652K42157
12217B76809b8058B05933G6805Q4516p2887R2317n8155K19464a84630A96494K468
12206A98962a88077C7617J76740M2443A23917j1437J23554d292F7216J15423J03522
12195B86161D517O6430J95357I9841K1313J46451K4020i3273A36546O6380C4626
12183H3256K4827N7687J8319d1995H3231M1460a60990b8760E4600b8752A46939
$$ plain form
12171 -268741 -39530 142581 -203019 -183833 339118 105970 -26199 237559 -163770 112350
12160 47067 190389 181351 -138947 16054 215231 182332 62094 -398706 -11947 -35085 -1324
12148 -76266 -307056 2093 -46805 218076 399932 298541 31257 53889 -42422 -225523 153325
12136 132168 136812 -56750 -77143 -318747 -52628 393551 290705 -227454 -78796 104621 146642
12125 146642 -211968 -151252 -186609 232133 7094 48129 -382365 252796 -25498 -100663 20587
12113 -53727 237597 -184030 -110264 85825 -3797 -101545 207565 68166 -50399 -17532 -307727
12102 -307727 -73075 11271 12419 -76012 -138259 153471 77168 -300301 -293945 4738 110012
12091 110012 -120149 -27097 -64448 -207065 100832 -21664 62400 -152936 24891 -223135
$$ packed form
12171b68741c9530A42581b03019J9186C39118A05970b6199B37559a63770A12350
12160D7067J43322r038a38947A6054J99177l2899F2094c98706a1947k3138a324
12148g6266k30790B093d6805B18076J81856j01391C1257K2632d2422j83101A53325
12136A32168M644e6750k0393k41604e2628C93551j02846b27454g8796A04621M2021
12125A46642b11968O0716l5357B32133G094M1035c82365B52796b5498p5165B0587
12113e3727B37597a84030P3766H5825c797r7748B07565F8166e0399a7532k90195
12102c07727g3075A1271J148g6012o2247A53471p6303c00301O356D738J05274
12091A10012a20149b7097l7351j42617A00832b1664F2400a52936B4891b23135
$$ plain form
12080 145262 -30185 -160822 100617 -179229 259530 -159516 89827 310014 625219 1464718
12070 1464718 1271061 385837 11908 85853 -68897 -211422 17811 -134089 59212 -17208
12059 210569 -128988 49158 -60503 -136877 -206833 96181 -51100 -143384 219042 -3698 -144911
12048 -144911 -222628 -130728 -8984 123781 -46321 118619 -74560 -149342 -314129 -430 105751
12036 -54009 -3206 -114617 -62772 95672 -89947 -137274 -91100 -240519 -178892 -227270 -202916
12025 -202916 -135723 29861 -41676 -161380 -397398 246468 -16606 13247 -277997 -26431 -210385
12014 -210385 323908 112001 267999 215702 15342 -70026 95429 56003 222302 15924 4988
12002 60719 178511 40983 19620 -110601 66477 197890 53017 -141538 -79897 86488 184598
$$ packed form
12080A45262c0185j30637A00617a79229B59530a59516H9827K20187L15205Q39499
12070A464718j93657C85837A1908P3945f8897j42525A7811a34089E9212a7208
12059B10569a28988D9158f0503p6374o9956I6181e1100r2284B19042c698j41213
12048a44911p7717R1900h984A23781d6321A18619g4560p4782j64787d30A05751
12036e4009c206j11411N1845I5672h9947m7327M6174j49419O1627m8378K4354
12025b02916O7193B9861d1676j19704k36018B46468a6606A3247b77997b6431j83954
12014b10385C23908A12001J55998n2297A5342g0026I5429l9426J66299A5924D988
12002F0719J17792D0983A9620a10601F6477J31413E3017a41538O1641H6488R8110
$$ plain form
11991 184598 192547 9323 -66819 -152411 200870 229811 -96527 -217173 -41993 -144346 -98516
11980 -98516 -49635 2911 151424 130783 -191024 -199348 -103783 -156681 -147631 -28709 18049 -310665
11967 -118265 107696 116569 -14213 274332 194215 -172292 41669 119754 188538 -61934 50645
11955 -205964 463778 -872 33177 -64122 223022 173780 37858 214431 -50491 -149172 78019
11943 140447 238142 -141890 -183849 -100917 227415 -146410 62519 251903 -229708 -366550
11933 -366550 48445 218980 -184215 -126908 8272 194365 -60588 -32138 148510 -81379 193858
11921 -154578 118750 -29582 5298 -108875 -226593 -155720 91065 -218747 -85431 -136916 347509
11909 85525 2718 7295 110435 -78115 101420 438351 -171482 -310872 34259 263514 31800
$$ packed form
11991A84598P949I323f6819q5592B00870K8941i6527j20646d1993j02353M5830
11980i8516M8881B911J48513k0641a91024q324R5565n2898R050b8709A8049c10665
11967a18265A07696Q873a4213B74332q0117a72292D1669P8085O8784f1934E0645
11955b05964D63778h72C3177f4122B23022m9242C7858J76573e0491r8681G8019
11943A40447R7695a41890m1959Q2932B27415a46410F2519J89384b29708j36842
11933c66550D8445J70535a84215N7307H272J86093f0588K8450A48510h1379A93858
11921a54578A18750b9582E298a08875j17718P0873I1065b18747h5431n1485C47509
11909H5525B718M577J03140g8115A01420L36931a71482j39390C4259K29255C1800
$$ plain form
11897 -68458 -482014 32515 67972 29430 -165567 -124399 40271 -225996 190161 -163060 73253
11885 -280806 68215 224809 5183 -68634 -75840 -118558 2259 6261 -152144 -35465 -185960 225010
11872 32333 -63316 -254643 -81803 -143359 25839 -89001 128143 271807 -97745 -210900 -205908
11861 -205908 55821 200540 131573 69609 152561 -195110 57061 137860 -156205 -346418 -155412
11849 -57853 -132401 -250497 -89865 -222699 -148126 -52636 -120745 5642 5635 117520 8620 150968
11837 150968 -91591 -235059 129337 -20206 312639 42469 33496 -323933 -296917 -93528 95876
11825 -35505 -352311 -35450 151400 64610 172948 -86176 60966 139885 31351 382559 -491362
11813 296217 -217672 62483 -232637 -218059 9772 25535 -144946 -25144 -239293 -81246 -157681
$$ packed form
11897f8458m13556C2515L5457B9430a65567M1168D0271b25996A90161a63060G3253
11885b80806F8215J56594E183f8634p206m2718B259M002a52144c5465j50495B25010
11872C2333f3316j91327h1803o1556B5839h9001A28143J43664i7745j13155M992
11861b05908E5821J44719o8967o1964Q2952a95110E7061Q0799a56205j90213a55412
11849e7853p4548j18096h9865j32834P4573e2636o8109E642pJ11885H620J42348
11837A50968i1591j43468A29337b0206C12639D2469q973c23933K7016i3528I5876
11825c5505l16806c5450A51400F4610J08338h6176F0966P8919C1351L51208d91362
11813B96217b17672F2483b32637J4578I772J5763a44946b5144k14149h1246p6435
$$ plain form
11802 -157681 111544 160281 311564 -95279 -173707 -130774 -18410 -124853 -52564 -37713 -193726
11791 -193726 -68569 -37599 -206658 -346157 -245293 295933 -172902 44182 -170311 379223
11780 236939 76637 -20678 -73728 -35879 -213474 12900 187852 -210197 -78344 87082 186922
11769 186922 -200856 71228 -401593 342643 -150478 24632 259542 -12930 -200086 116808
11758 -166140 -208481 -96305 19084 105533 72601 -162064 -90866 -192954 -232105 -104444 -73564
11747 -73564 203108 38288 -287282 -345473 -309424 113037 -125881 -73852 68377 -48119 -251395
11736 -251395 77374 -63640 99308 9714 139309 -161465 -49720 243799 -89487 60962 -87747
11724 58438 -93806 -41908 65767 265705 -169809 -35682 -82192 -37224 -340783 -171078 170397
$$ packed form
11802a57681A11544M8737J51283i5279p8428M2933a8410j06443e2564J4851j56013
11791a93726f8569L0970j69059j39499J00864B95933a72902D4182a70311C79223
11780B36939G6637b0678n3050c5879j77595A2900J74952b10197g8344H7082R9840
11769A86922b00856G1228d01593C42643a50478B4632K34910a2930j87156A16808
11758a66140m2341i6305A9084Q6449l2932a62064P1198j02088l9151a04444L0880
11747g3564B03108C8288b87282n8191L6049A13037a25881N2029F8377d8119k03276
11736b51395G7374f3640I9308I714J29595a61465d9720B43799h9487F0962h7747
11724E8438i3806d1908F5767J99938a69809c5682m6510c7224l03559J69705A70397
$$ plain form
11712 -57839 135269 -281891 131911 -187037 -18637 310966 -96256 180869 -41801 -115772
11702 -115772 125827 4360 -62626 106197 106547 -172478 165844 13562 -87301 20077 175171
11691 175171 -106994 -71348 238188 -53127 68586 141922 134754 83272 -152122 -89416 5803
11679 97488 95392 159641 239263 259994 164561 -306995 -129398 151827 -236912 182706 70705
11667 -129411 -284826 -70411 -62869 18597 33409 306700 10912 122084 56892 -132985 220727
11655 183452 532634 9083 227735 95367 102685 180297 25581 32225 104326 -30023 58747 22693
11642 146334 184494 92667 -172156 185115 141806 -40296 102314 138124 -226179 40818 26744
11631 26744 295744 184232 174613 66160 146846 -33892 -301257 277145 95284 162857 24752
$$ packed form
11712e7839A35269b81891A31911a87037a8637C10966i6256A80869d1801p3971
11702a15772A25827D360f2626A06197L50a72478A65844A3562h7301B0077J55094
11691A75171a06994L5646B38188e3127F8586P3336p168n1482a52122O2706E803
11679I7488k096O4249P9622K0731r5433c06995a29398A51827b36912A82706G0705
11667a29411j55415g0411P542A8597J4812K73291A0912J11172E6892a32985B20727
11655A83452L49182I083K18652I5367P318P7612B5581O644P2101c0023E8747B2693
11642A46334L8160r1827a72156A85115m3309d0296A02314L5810b26179D0818j4074
11631B6744K69000j11512r619F6160Q0686c3892k67365B77145I5284O7573B4752
$$ plain form
11619 -46085 -114059 -106367 -287284 -52721 6143 -55663 409911 35540 -49672 -70758 257223
11607 -14428 14364 -479591 -136941 92052 316985 320392 171029 -98189 -48242 256634 324182
11596 324182 16879 141618 207336 27293 -308469 120354 -49193 -116793 -31110 360986 168141
11584 261621 105257 270225 217590 21689 153155 50249 -306516 -75413 41316 118527 196513
11573 196513 133118 102810 207182 381933 -328676 -68018 168405 59293 170829 91509
11563 91509 98163 146742 -40157 7145 70165 221086 -61572 -587106 -104682 -48752 45357
11551 164588 318206 -126608 -375896 308842 219538 -61441 -30222 114169 -306115 -258072
11541 -258072 111212 26083 213102 -235970 209251 -77705 222975 386662 -211117 -39683
$$ packed form
11619d6085o7974P692j80917e2721F143e5663D09911C5540d9672k1086B57223
11607a4428A4364d79591a36941I2052K24933L407j49363i8189d8242B56634O7548
11596C24182A6879J24739O5718B7293c08469A20354d9193o7600c1110C60986A68141
11584B61621A05257J64968n2635B1689J31466E0249c06516g5413D1316P7211P7986
11573A96513o3395l0308J04372J74751c28676f8018A68405E9293J11536p9320
11563I1509O654M8579d0157G145O3020J50921f1572n25534a04682d8752D5357
11551A64588J53618a26608k49288C08842q9304f1441c0222A14169c06115M8043
11541b58072A11212B6083J87019b35970B09251g7705B22975J63687b11117c9683
$$ plain form
11530 34746 344425 294963 -187703 106474 119510 254071 157243 -219816 136290 71348
11520 71348 -56710 110504 -64597 132607 121098 199787 74504 -43674 -197598 281052 387758
11509 387758 319025 7508 352081 176258 -147480 8738 314459 21829 75527 61983 -229730
11497 78296 56544 257505 74110 289979 -85306 -13608 317161 103603 422600 -76813 205285
11485 176440 -129916 155439 279559 145300 171492 148267 273152 -33626 209657 131013
11475 131013 45657 28377 -23235 154048 -205756 339679 489309 15278 -78714 80497 145476
11464 145476 296153 329996 -112132 59466 266521 -211170 -41233 235383 22261 148104
11454 148104 -125355 -82801 -142385 -310214 172441 285123 74218 -20302 -57938 31628 45180
$$ packed form
11530C4746L09679m9462a87703A06474J3036J34561r6828b19816A36290o4942
11520G1348e6710A10504f4597A32607j1509P8689G4504d3674j53924B81052J06706
11509C87758o8733G508L44573j75823a47480H738L05721B1829N3698j3544b29730
11497G8296k1752K00961G4110K15869h5306a3608C17161A03603L18997g6813B05285
11485A76440a29916A55439J24120j34259K6192k3225J24885c3626B09657p8644
11475A31013D5657j7280b3235A54048b05756C39679J49630A5278g8714H0497O4979
11464A45476J50677L3843a12132E9466K07055b11170d1233B35383B2261J25843
11454A48104a25355M2554n9584j67829A72441J12682G4218b0302l7636C1628J3552
$$ plain form
11443 45180 83366 275998 -208471 -568253 3838 152619 -90614 24103 201439 -158559 -96599
11432 -96599 90286 -41332 69110 -23898 -52130 237711 -65819 41396 298227 14217 -185859
11420 193614 -6670 378094 -3964 57382 196448 79061 71789 160071 24142 -326384 7188 167523
11408 167523 341424 -20882 -67515 279273 127748 56615 160510 -38850 -52286 -186279
11398 -186279 -147868 74837 -66660 -263346 212882 -152008 -510936 -211739 414516 133387
11387 84114 -20674 -45008 -95767 -122467 -31044 132370 22379 -66909 -31424 -75446 174970
11375 70604 -80562 -86415 -61963 -510816 39635 -55935 104772 -156034 78283 155604 57650
11363 34953 13585 253154 -6139 317682 -370740 95486 191468 -54079 -35213 -104671 -59210
$$ packed form
11443D5180L8186J92632b08471l59782C838J48781i0614B4103J77336a58559O1960
11432i6599I0286d1332F9110b3898k8232B37711f5819D1396K56831A4217a85859
11420A93614f670C78094c964E7382J39066G9061p272Q8282B4142c26384G188J60335
11408A67523J73901b0882m6633B79273A27748E6615J03895c8850j3436j33993
11398a86279L8411G4837f6660j96686B12882a52008l58928b11739D14516A33387
11387H4114b0674k4334n0759k6700c1044A32370B2379f6909c1424m4022A74970
11375G0604h0562n853K4452m48853C9635e5935A04772a56034G8283P7321E7650
11363C4953A3585K39569f139C17682c70740I5486R5982e4079J8866o9458M5461
$$ plain form
11352 -59210 -504982 151232 -90285 -105208 272809 -104912 161915 -83619 145294 -186311
11341 116779 95467 -23779 203596 215054 -178848 84804 -11123 -58993 -278529 170006 2672
11329 -301246 -108634 353187 -168339 -286252 141876 -364744 -65894 -628510 146563 236319
11319 236319 -72985 128730 345244 -160833 -61165 -68973 -137517 60898 -145708 203700 284521
11308 284521 -31856 35489 285036 148650 17150 -438719 -171271 84122 -316942 113729
11297 -216403 -235856 107865 88956 39124 -107560 161388 44585 12079 -254173 119277
11286 21033 19022 -196325 116778 -222920 222434 22689 83299 7001 -183487 37297 -240151
11274 -88649 20065 56199 -33784 -234679 146339 77301 -396875 196823 -122344 -368184
$$ packed form
11352e9210m45772A51232i0285j4923B72809a04912A61915h3619A45294a86311
11341A16779k1312b3779B03596J1458a78848H4804a1123m7870k19536A70006B672
11329c01246a08634C53187a68339j17913A41876c64744f5894n62616A46563Q9756
11319B36319g2985A28730K16514a60833f1165p808o8544F0898a45708B03700Q0821
11308B84521c1856C5489K49547j36386A7150d38719a71271H4122c16942A13729
11297b16403j9453A07865j8909C9124a07560A61388D4585A2079b54173A19277
11286B1033k011a96325A16778b22920B22434B2689O0610G001a83487C7297b40151
11274h8649B0065L6134c3784k00895A46339o9038c96875A96823a22344k45840
$$ plain form
11264 -368184 46987 -141040 18093 -96459 -98106 -43227 -88250 26483 -17035 -276271 149113
11252 -22392 -115851 16367 164283 -82614 62656 184009 -85231 -23533 -19668 -188149 56334
11240 -243900 -40627 -16875 -7737 -127556 -244890 -407326 106201 -18258 309339 103400
11229 379468 75199 -354763 66546 -95316 227499 -79329 83679 21062 -266758 180028 -227165
11217 32069 150661 87487 -146919 68333 300186 -218850 -5090 -210434 -295982 52150 -11324
11205 60494 20664 -379996 34499 83725 -83017 -198932 -84311 -45864 -16620 -225953 -669
11193 213912 -25290 1592 -21683 -99086 39144 -117944 40668 -216938 -172067 -221041 97919
11181 197631 -9329 116097 199965 -162040 -45978 -305445 172308 164263 -61304 -108880 90766
$$ packed form
11264c68184D6987a41040A8093i6459j647d3227m5023B6483a7035k59236A49113
11252b2392r3459A6367J47916h2614F2656J21353h5231b3533L865j68481E6334
11240b43900d0627a6875g737j19819j17334j62436A06201a8258C09339A03400
11229C79468G5199c54763F6546i5316B27499g9329H3679B1062b66758A80028b27165
11217C2069J18592o3174a46919F8333K31853b18850e090k05344q5548E2150a1324
11205F0494B0664c79996C4499M9226h3017j15915h4311L8447a6620k09333f69
11193B13912b5290A592b1683p7403C9144a17944D0668b16938M4871m8974I7919
11181A97631i329A16097Q3868a62040d5978k59467A72308q045f1304m7576I0766
$$ plain form
11169 -271293 117162 -241032 20212 -46582 -116434 201864 -79991 -245412 -10319 -262884
11159 -262884 -12958 -40574 -93084 51566 -88537 -229763 -229612 65949 -282910 -47673 -27581
11148 -27581 -44754 136436 -127190 8810 -22170 -138470 76779 263296 -70826 -220636 20729
11136 -174407 114822 182451 242900 -78928 90258 -125667 35708 210593 129258 -148519 94352
11124 247742 47070 -66054 134754 161052 39226 -54715 117342 399528 -278639 -60328 146330
11112 -38193 743 -105453 150012 -128110 121671 195701 200441 -17144 139003 -309081 118543
11100 441364 30448 224721 204308 -2183 26059 331626 257582 87652 -204839 25462 242459
11089 242459 434665 -346792 371579 -355823 -75215 383603 186976 42771 -348 223021
$$ packed form
11169b71293A17162b41032B0212d6582o9852B01864g9991j65421a0319k52565
11159b62884a2958k7616n2510E1566h8537j41226J51F5949b82910d7673K0092
11148b7581j7173A36436a27190H810b2170j16300G6779J86517g0826j49810B0729
11136a74407A14822O7629O0449g8928I0258a25667C5708J74885q1335a48519I4352
11124B47742D7070f6054A34754K6298C9226e4715A17342K82186b78639f0328A46330
11112c8193G43a05453A50012a28110A21671P4030M740a7144A39003c09081A18543
11100D41364C0448J94273k0413b183B6059L05567p4044H7652b04839B5462K16997
11089B42459J92206c46792C71579c55823g5215C83603A86976D2771c48B23021
$$ plain form
11078 219560 120337 117307 190108 147400 258703 140677 541299 322178 202067 462132
11068 462132 422524 144324 618860 666205 382796 250943 775502 631270 844779 280864
11057 331646 504845 661079 438209 611569 503019 579741 275050 253544 442162 418212
11047 418212 410541 582717 548609 466874 608208 361236 303030 596544 804208 717971 519505
11036 519505 477839 766137 745017 820201 629400 656645 604789 761312 649274 564090 356453
11025 356453 627206 824420 679766 309509 704118 872813 1096316 817147 476749 619315
11015 619315 354113 790749 413584 533954 715583 813636 410805 156464 750596 119348
11004 845104 335378 787249 512450 202042 326687 673177 421610 577271 738496 606695
$$ packed form
11078B19560r9223l030P2801m2708J11303j18026M00622k19121j20111K60065
11068D62132l9608A44324M74536M7345k83409j31853N24559j44232K13509B80864
11057C31646J73199J56234k22870J73360j08550P6722B75050k1506J88618k3950
11047D18212p671J72176l4108q1735J41334k46972n8206K93514K07664q6237j98466
11036E19505m1666K88298k1120P5184j90801K7245n1856J56523j12038q5184k07637
11025C56453K70753J97214j44654C09509L94609J68695K23503k79169l40398J42566
11015F19315k65202M36636l77165J20370J81629R8053m02831A56464N94132A19348
11004H45104C35378M51871k74799B02042J24645L46490k51567J55661J61225j31801
$$ plain form
10994 606695 545081 645492 600664 524496 628377 642358 1037336 733279 627924 756770
10984 756770 900797 752938 1075671 1084045 1197991 1166771 1187274 1369464 1733666 1542975
10974 1542975 2277745 1961124 2644589 2288649 2689714 2203513 2021788 1764042 2008280
10965 2008280 1650938 1691834 1386921 1339877 1484076 1458387 1720088 1555998 1387093 1452559
10955 1452559 1686579 1440047 1160804 971454 1082634 788192 787044 806621 130355 311309
10945 311309 574267 325269 414409 266707 63143 185464 197512 210289 134278 64263 74195
10934 74195 -27506 -45476 123454 -61736 141102 190013 241091 332282 -51185 135695 32746
10922 79524 -18018 -180891 180614 -95845 45650 -126905 4516 99098 262183 -80539 -18918
$$ packed form
10994F06695o1614J00411m4828p6168J03881J3981L94978l04057j05355J28846
10984G56770J44027j47859L22733Q374J13946l1220K0503J82190L64202j90691
10974A542975P34770l16621O83465l55940M01065m86201j81725k57746K44238
10965B008280l57342M0896l04913m7044J44199k5689K61701j64090j68905O5466
10955A452559K34020k46532k79243j89350J11180k94442j148J9577A30355J80954
10945C11309K62958k48998Q9140j47702F3143J22321J2048J2777p6011F4263R932
10934G4195b7506j7970A23454f1736A41102M8911N1078R1191e1185A35695C2746
10922G9524a8018j62873A80614i5845D5650a26905D516R4582J63085h0539a8918
$$ plain form
10910 -19253 -2399 -210322 251755 48139 -13596 36551 81875 -243672 -34153 -186822 17183
10898 -149220 50354 160675 96482 -28683 27034 270911 -443169 35014 -254739 100808
10887 -91526 -142803 -21234 127659 -47369 -144015 -140819 26333 -244731 123170 273554 -33586
10875 58901 -17266 -227 -72194 53010 253671 -76171 277875 68725 107530 -84398 84413 -326437
10862 148183 -91068 -165903 -88582 -22887 240677 -296773 49205 184386 134904 -123346 -133049
10851 -133049 -64245 8133 134132 146160 -138394 220362 256019 -36497 -200295 190119 -242902
10839 7939 187300 267364 53095 -206971 -100253 -185015 -20487 -225609 66517 56127 214460
10828 214460 -239231 -65573 -536634 -65519 94253 147979 -146175 2535 456 150811 -251564
$$ packed form
10910a9253b399k07923B51755D8139a3596C6551M5324b43672c4153j52669A7183
10898a49220E0354J10321o4193b8683B7034K43877d43169C5014b54739A00808
10887i1526n1277b1234A27659d7369r6646L196B6333b44731A23170J50384c3586
10875E8901a7266b27p1967E3010K00661g6171B77875F8725L8805h4398H4413c26437
10862A48183i1068p4835P7321b2887B40677b96773D9205J35181m9482a23346r703
10851a33049f4245H133J25999J2028a38394B20362L5657c6497j63798A90119b42902
10839G939J79361Q0064E3095b06971a00253q4762b0487k05122F6517j0390J58333
10828B14460b39231f5573m71061f5519I4253N3726a46175B535D56J50355b51564
$$ plain form
10816 -127 5402 -75687 -134701 -200721 -168466 52094 -151476 278126 -218580 46529 -78720 -454676
10804 -454676 84230 -60219 -332529 -107570 115912 -198047 160830 99448 276311 21961
10793 -319297 321779 279097 -234055 -146747 -69058 -99717 -68851 95518 -43866 -194463 -137438
10782 -137438 -105241 124922 122377 207694 -27806 180637 -14234 -199324 -96463 -186664 20441
10770 -2321 187195 -32144 39150 109333 -66432 -1253 301527 -248693 51265 -26850 248187
10758 -156944 -21831 28202 -173915 -84496 21246 -218177 127267 -252241 3525 107309 -151355
10746 -61350 -188241 21008 43867 -50441 -26281 -105200 -126668 -79633 -445397 -201526 -145862
10735 -145862 -62586 -102608 260189 204548 20453 -315772 -8201 -124186 202552 393691 -208421
$$ packed form
10816a27E402g5687n9014o6020L2255E2094a51476B78126b18580D6529g8720l75956
10804d54676H4230f0219k72310a07570A15912a98047A60830o1382J76863B1961
10793c19297C21779m2682b34055Q7308f9058l0659L0866I5518d3866j50597N7025
10782a37438L2197A24922k545Q5317b7806A80637a4234j85090i6463r0201B0441
10770b321A87195c2144C9150P0183f6432a253C01527b48693E1265b6850B48187
10758a56944b1831B8202a73915h4496B1246b18177A27267b52241C525J03784a51355
10746f1350j26891B1008K2859e0441K4160p8919k1468M7035l65764b01526N5664
10735a45862f2586m0022B60189n5641B0453c15772h201j15985B02552J91139b08421
$$ plain form
10723 -141507 221882 118621 -338890 99056 14224 294729 135940 128030 -18113 36093 -26134
10711 -209372 55443 -165294 74999 11222 -234185 -43840 -109216 150713 1621 -45735 -39867
10700 -39867 -167885 -435306 63559 -222296 -30516 -83804 374959 94894 -26849 -169200 279757
10688 -370258 228387 182478 -217270 -139311 198984 43555 67335 329295 64255 -31630 -25063
10677 -25063 -204433 -235404 -110807 77443 190913 -279856 -35660 -265698 -24086 -347400
10667 -347400 104983 -57217 218898 108511 -75578 -14177 -341227 -152673 -284130 -33193
10656 -368872 -325671 -121077 -101098 -86817 -20108 -268706 -243209 -277407 -78294 73925 202385
10645 202385 2814 -41234 -121783 -112333 -209370 -83565 55662 97919 -366560 129031 -83197
$$ packed form
10723a41507B21882j03261c38890I9056A4224K80505A35940p910a8113C6093b6134
10711b09372E5443a65294G4999A1222b34185d3840o5376A50713A621d5735N868
10700c9867j28018k67421F3559b22296c0516n3288C74959I4894b6849j42351B79757
10688c70258B28387m5909b17270P7959A98984D3555K3780K61960F4255c1630O567
10677b5063j79370l0971a10807G7443J13470b79856c5660k30038b4086l23314
10667c47400A04983e7217B18898A08511g5578a4177l27050a52673j31457c3193
10656c68872M3201a21077J9979J4281b0108k48598K5497l4198g8294G3925J28460
10645B02385B814d1234q0549R450r7037h3565E5662M2257c66560A29031h3197
$$ plain form
10633 -20694 -313947 -102583 -55662 -84673 85849 125337 98929 101856 -22252 184717 100640
10622 100640 -66199 172015 -161899 -127057 70286 -29605 63598 -493898 -121150 106657
10611 -296267 91295 101595 5210 39697 -181684 -120392 -90622 95709 -57928 -19207 -102564
10600 -102564 112721 -87915 61176 -276776 -13662 -89042 150099 142373 247873 -90822 -24570
10588 72762 59273 11852 160674 -340717 37055 117567 245465 -298843 255675 -236442
10577 401887 -48229 128569 -130877 -237417 162807 51729 32768 31126 11658 -289829 -139272
10565 -223303 99938 73221 176890 -90673 64607 -298852 -176275 297531 -24482 -27267 249701
10553 -85347 -33811 29465 -11833 -70968 70380 231482 -75370 75842 10846 -29622 129222
$$ packed form
10633b0694k93253a02583M6921k9011H5849L9488k6408K927b2252A84717q4077
10622A00640f6199A72015a61899L4842G0286b9605F3598d93898a21150A06657
10611b96267I1295J0300E210L4487a81684O1292K9770I5709e7928a9207q3357
10600a02564A12721h7915F1176b76776a3662p5380A50099p726J05500i0822b4570
10588G2762j3489A1852J48822c40717C7055Q0512J27898b98843B55675b36442
10577D01887d8229A28569a30877j06540A62807E1729j8961j642A1658b89829a39272
10565b23303I9938k6717J03669i0673F4607b98852J22577B97531b4482k785B49701
10553h5347c3811B9465a1833n9135G0380J61102g5370G5842A0846b9622A29222
$$ plain form
10541 3482 -260073 -378549 -55864 -192031 138217 27032 20339 19414 -620 -10550 -98172 32169
10528 -216268 289976 -45140 -91938 154864 -183578 73209 -153335 -347545 -198843 -332356
10518 -332356 -124234 56226 -105470 149713 166740 -486038 -73091 386554 -51429 -228994
10508 -228994 -175318 -73573 -307999 -185836 -10068 -104677 -323208 113247 -113004 -38330
10497 -58993 120720 -264089 -244381 -66874 -68932 198596 -140401 176861 108183 -87010 12109
10485 166625 -100903 204245 341228 490490 480878 593607 502432 443438 -37982 96766 -171188
10473 236605 280493 -173809 -241359 -73714 201777 -79489 -357402 63619 255633 37903 300535
10462 300535 -302072 -80339 -134855 -189059 -233052 101113 4286 -241009 49403 -15636 156514
$$ packed form
10541C482b60073j18476e5864j36167A38217B7032o693r25f20r930q7622C2169
10528b16268B89976d5140m6798A54864a83578G3209a53335j94210J48702j33513
10518c32356a24234E6226a05470A49713J7027d86038g3091C86554e1429j77565
10508b28994N3676g3573k34426J22163a0068r4609k18531A13247a13004c8330
10497e8993A20720b64089J9708f6874k058A98596a40401A76861o8678h7010A2109
10485A66625a00903B04245J36983J49262r612J12729r1175n8994c7982I6766a71188
10473B36605M3888a73809o7550g3714B01777g9489k77913F3619J92014C7903K62632
10462C00535c02072h0339n4516n4204m3993A01113D286b41009D9403a5636A56514
$$ plain form
10450 129434 -205129 -53814 -252001 244852 -240334 77081 62797 -226952 -141432 117621
10439 -38191 -62179 71099 293934 96573 -101354 137195 -34419 -246874 107173 -2111 186916
10427 -133196 188842 77491 -37900 -45529 -327727 -133935 59263 -22369 129189 -24517 101171
10415 -2978 389762 59106 -169804 139850 -202801 107542 227369 -74908 196487 -49090
10404 -176679 -85410 20188 98180 -25979 -280346 -146127 211666 -31369 124138 186957 -164879
10392 -40194 130554 269969 69619 249825 126849 120452 -163049 -77290 -5256 -108042 -105208
10381 -105208 69844 -60372 -138204 -960 16126 278605 224048 262989 372391 279331 526870
10370 526870 42983 319637 290900 266643 205557 196238 356768 130452 -101546 453178 -26895
$$ packed form
10450A29434b05129e3814j98187B44852b40334G7081j4284b26952Q5520A17621
10439c8191k3988G1099K22835I6573a01354A37195c4419k12455A07173b111A86916
10427a33196A88842G7491c7900p629k82198a33935E9263b2369A29189b4517A01171
10415b978C89762E9106a69804A39850b02801A07542J19827g4908A96487d9090
10404a76679h5410B0188P7992b5979k54367J34219B11666c1369A24138O2819a64879
10392d0194A30554J39415F9619J80206j22976o397a63049g7290e256j02786K834
10381a05208F9844f0372p7832i60A6126K62479n4557L8941J09402r3060K47539
10370E26870D2983K76654k8737k4257o1086r319J60530A30452a01546D53178b6895
$$ plain form
10358 191289 165215 359031 414926 405882 231685 208007 215211 476611 290056 151053 424112
10347 424112 -78378 363520 150065 337597 492828 596802 274278 -133058 -10829 217555
10336 74738 178481 -22067 -36305 175833 44963 72911 -59911 413532 -5353 78767 129158
10325 129158 207472 165734 -135252 6443 63130 167916 170319 -200031 -32038 38267 358342
10314 358342 91890 132969 -140147 -93069 -52868 -250877 -38944 234683 -208970 21400 214106
10303 214106 -54544 146366 -55379 187114 408537 -195867 111234 -267326 -206172 334594
10292 -83237 -12167 -175010 -6566 113672 163965 -13998 -353442 -88670 -78895 120714 -217819
10280 2551 89625 108887 219579 63773 -66501 63769 197970 -373369 -323999 78270 -205586
$$ packed form
10358A91289k6074J93816N5895r044j74197k3678P204K61400j86555j39003K73059
10347D24112g8378C63520A50065J87532J55231J03974B74278a33058a0829B17555
10336G4738J03743b2067j4238A75833D4963K7948e9911D13532e353G8767N0391
10325A29158P8314m1738a35252F443N6687J04786K403b00031c2038C8267L20075
10314C58342I1890M1079a40147M7078M0201j98009c8944B34683b08970B1400J92706
10303B14106e4544A46366e5379A87114K21423a95867A11234b67326O1154C34594
10292h3237a2167j62843f566A13672N0293a3998l39444h8670R775A20714b17819
10280B551Q7074J9262J10692F3773f6501F3769J34201c73369M9370G8270b05586
$$ plain form
10268 -124359 -313883 492663 -142355 -148308 -133751 -31379 222339 457313 386485 139314
10257 265279 382870 425754 -13039 180974 -76013 -138654 60982 -184186 -208016 -125214 -13583
10245 -28281 -376301 -407236 -109420 -138102 61013 65943 -49696 -16804 141756 94353 -37966
10233 -286438 82376 -197002 92837 -175423 -140425 197575 118965 113244 25963 -26510 162640
10221 -710 -43015 -201842 -251732 299248 196266 -51445 18506 -213267 -215988 -38790 -184206
10210 -184206 -35989 -149970 152418 97298 -153256 41378 -148326 162099 230316 119237
10200 119237 -428196 36703 -134116 -80373 -42618 -57683 -255362 152266 -295131 -217283
10190 -217283 -6580 30652 -186577 -41493 210525 -18469 -111918 -170554 47166 -91087 16632
$$ packed form
10268a24359j89524D92663a42355n953J4557c1379B22339K34974p0828A39314
10257B65279J17591M2884a3039A80974g6013o2641F0982a84186k3830Q2802a3583
10245b8281l48020l0935a09420k8682F1013M930d9696a6804A41756m7403c7966
10233b86438H2376a97002I2837a75423L4998A97575p8610n721B5963b6510A62640
10221g10m2305j58827m9890B99248j02982e1445A8506b13267k721c8790j45416
10210a84206c5989j13981A52418n5120a53256D1378a48326A62099O8217j11079
10200A19237d28196C6703a34116N3743L7755j5065j97679A52266b95131P7848
10190b17283f580C0652a86577d1493B10525a8469r3449n8636D7166i1087A6632
$$ plain form
10178 -66705 -118793 -49242 319996 -67459 -462644 -108473 -257108 -270626 189801 123785 -417059
10166 32537 -141369 -86589 20794 -119205 388213 145169 -349242 -384781 29707 -405492
10155 -79000 251994 -251905 -299139 -173486 -117072 -302112 280321 -82809 31813 -177423
10144 -255055 -6506 -87208 -14573 -18016 96318 -77079 -27501 143142 -175169 28253 7662 -195901
10131 -225009 88424 -143421 -268372 -6779 204028 66526 -106301 -182753 218179 122190 -3793
10119 -191046 -132039 87037 -144695 105476 9854 -62670 -7963 107569 4037 33657 53508
10108 53508 94729 -177048 57823 222412 -157024 87511 -237617 49417 118316 105172 113966
10097 113966 21043 -146246 -21187 9239 -170682 -108015 -121654 -347190 193589 -135245 -27489
$$ packed form
10178f6705n2088d9242C19996f7459l95185a08473j48635j3518A89801o6016d17059
10166C2537a41369N4780B0794a19205C88213A45169c49242l5539B9707d05492
10155g9000B51994b51905m7234J25653N6414j85040B80321h2809C1813a77423
10144b55055f506q0702a4573l443I6318g7079b7501A43142a75169B8253G662a95901
10131b25009H8424a43421j24951f779B04028F6526a06301p6452B18179r5989c793
10119a91046N9007H7037a44695A05476I854f2670g963A07569D037K9620J9851
10108E3508M1221a77048E7823J64589a57024H7511b37617D9417O8899j3144Q794
10097A13966B1043a46246b1187I239a70682O2667j3639k25536A93589a35245b7489
$$ plain form
10085 16869 -297243 -175654 51870 3998 106540 -131539 90964 213705 16025 158464 99902
10074 99902 -44028 -208501 -14939 -250904 59603 -127776 94256 -318500 34620 107913 273565
10063 273565 -18713 -88047 -174740 156126 -52573 53476 -140609 -470 -89556 -116610 100258
10051 178995 23265 -73087 -329048 -301101 -80813 163254 -257173 109046 -14836 125964
10040 -259285 -92733 -11438 -259087 -62648 -153972 -249375 -175045 427831 -101384 -358449 -51690
10028 -249912 -2870 68010 186524 -8935 158784 -333424 -86663 -175259 34862 201376 89402
10016 56995 163232 -204812 -10848 -184416 -207798 -102134 39103 -279918 -243913 -108595
10005 1911 -409840 -208427 -22761 -142017 -318003 4523 -35197 309055 -234626 -154163 -282613
$$ packed form
10085A6869b97243J21589E1870C998J02542a31539I0964J22741A6025J42439n8562
10074I9902d4028j64473a4939k35965E9603a27776I4256c18500C4620P3293J65652
10063B73565a8713o9334q6693A56126e2573E3476a40609d70q9086k7054A00258
10051A78995B3265g3087k55961K7947h0813A63254b57173A09046a4836A25964
10040b59285i2733a1438k47649f2648r1324r5403P4330D27831a01384k57065e1690
10028b49912b870F8010J18514h935A58784c33424h6663q8596C4862J66514H9402
10016E6995J06237b04812a0848j73568k3382a02134C9103b79918L6005a08595
10005A911d09840K01413b2761j19256j75986D523c5197C09055b34626Q0463j28450
$$ plain form
9994 -282613 8584 -109448 -60783 -397896 -196119 -15123 -113414 -144218 151102 -43020 68146
9982 -125122 -446078 7074 -149800 68633 -80407 -91373 -311580 -23223 -58183 246412 -59595
9970 -106985 45503 -17550 -127441 -61697 -168461 42233 -238748 -305832 208729 88972 -34838
9958 146486 -81591 -244645 127564 -330432 -162507 6416 -105319 5417 -169427 -14686 -332926
9947 -332926 -172673 -126436 176026 -700148 164281 -154442 58800 -235454 -98111 -14804
9936 20313 -13956 28949 37961 -109798 -180053 27180 -53278 254286 163556 -35506 -91 139347
9923 -169350 -88181 40592 -191945 -90876 -122624 -76029 -10114 -216678 23222 85354 145000
9912 145000 43138 252786 -283413 40595 -185613 -307881 -78667 -156037 -99957 -236478 -203506
$$ packed form
9994b82613H584a09448M8665l37113a96119a5123r8291l0804A51102d3020F8146
9982a25122l20956G074a49800F8633h0407j0966k20207b3223l4960B46412e9595
9970a06985D5503a7550j09891f1697j06764D2233b38748o7084B08729H8972c4838
9958A46486h1591j63054A27564c30432a62507F416a05319E417a69427a4686l18240
9947c32926J60253M6237A76026g00148A64281a54442E8800b35454i8111a4804
9936B0313a3956B8949R012a09798p0255B7180e3278B54286r0730c5506i1A39347
9923a69350Q1169D0592a91945i0876l1748M6595a0114k06564B3222O2132N9646
9912A45000D3138K09648b83413D0595a85613j22268g8667p7370N6080j36521L2972
$$ plain form
9901 -203506 -106402 -24445 -201 139842 90003 -186441 -90645 76165 359355 52440 -4147 -111002
9889 -111002 -193254 32854 -244091 -30132 286092 5769 -23908 41151 298610 154203 266198
9878 266198 -21499 -160432 159386 -54243 -319873 -40097 29827 -101504 60199 -30829 -33785
9867 -33785 -102233 207590 319716 -174880 -4125 -128693 -267765 333031 -48265 -270578 -108957
9855 -176895 8855 -301751 92910 106835 83276 38404 45272 -259704 -52458 -44548 38978 104452
9843 104452 1213 223414 78627 61565 -185659 -78841 -37402 16312 -204220 2280 199551
9832 199551 -228058 -172806 50564 -7028 -205265 -119893 -152088 -174200 -81888 23740 4270 -69512
9819 118382 48721 -45121 -212305 -13446 -317773 -214188 -96938 104286 -184907 -102030 -63454
$$ packed form
9901b03506R7104b4445b01A39842m9839a86441i0645G6165K83190E2440d147j06855
9889a11002q2252C2854b44091c0132B86092E769b3908D1151K57459j44407J11995
9878B66198b1499j38933A59386e4243k65630d0097B9827a01504F0199c0829k956
9867c3785o8448B07590J12126a74880d125j24568j39072C33031d8265k22313a08957
9855a76895H855c01751I2910J3925k3559C8404O868b59704e2458P910C8978O5474
9843A04452A213K22201G8627j7062a85659g8841c7402A6312b04220B280J97271
9832A99551b28058N5252E0564g028j98237Q5372l2195k2112h1888B3740D270f9512
9819A18382D8721d5121j67184a3446l04327J03585i6938A04286a84907Q2877L8576
$$ plain form
9808 -63454 -21699 -176382 35824 25370 -125392 -62342 112398 -143351 -314912 -375359 -117838
9796 -193668 39470 162034 -129657 105000 -42568 135412 -115438 -319251 259553 -259723
9785 60009 67966 208869 -170752 120698 -192644 -204525 143891 -173369 4736 74223 16691
9773 -92565 -285340 -168825 -117886 148467 9208 -32545 -126370 -139488 -141035 -197006 -322866
9762 -322866 84096 -191364 27594 141738 -36263 66888 -16705 -133504 -106237 -100089 -96594
9751 -96594 -133148 -94272 62597 17694 -279854 6925 119070 -235774 -41806 -197102 -99699
9740 -99699 -8118 -166494 -210946 -231515 -236762 -185397 85610 43857 -118693 137756 372397
9729 372397 146047 -21051 129968 -66632 -122115 -275649 -46446 -115509 -227689 -114104 21429
$$ packed form
9808f3454b1699j54683C5824j0454a25392f2342A12398a43351j71561o0447a17838
9796a93668C9470J22564a29657A05000d2568A35412a15438k03813B59553b59723
9785F0009P957J40903a70752A20698a92644j1881A43891a73369D736O9487A6691
9773i2565j92775J16515N0939A48467I208c2545r3825j3118j547n5971j25860
9762c22866H4096a91364B7594J14144c6263F6888a6705j16799K7267O148L495
9751i6594l6554L8876F2597A7694b79854F925J12145b35774d1806j55296R7403
9740i9699h118j58376m4452k0569n247N1365H5610m1753a18693A37756K34641
9729C72397A46047b1051A29968f6632n5483j53534d6446o9063j12180J13585B1429
$$ plain form
9717 -123703 -233951 25720 -86054 -299689 -293180 -496561 204932 -53714 -114155 -268268 -302403
9706 -302403 -194845 312294 -95786 102568 -307162 29098 231957 -79824 -255795 81181
9695 -83637 58208 300805 128636 -17836 -178955 227359 35531 -182320 -20600 112615 201489
9684 201489 -220429 -62113 99283 -103248 7447 -146293 -138644 -222317 20150 -29094 -139132
9673 -139132 -115970 201376 -48200 12301 192683 708 22014 -107073 -224705 -69 -64584 -129128
9661 -129128 -132147 -321397 196505 49137 39002 335396 226271 -226353 -202760 -61226 -91733
9650 -91733 83593 -41871 54178 -94157 -376434 -96852 -341029 65244 -102329 -400904 39709
9638 -46406 -236787 179301 -74278 67535 263306 -352412 134386 -264105 -93196 189008
$$ packed form
9717a23703j10248B5720h6054k13635O509k03381B04932e3714o0441j54113l4135
9706c02403J07558C12294i5786A02568c07162B9098K02859g9824j75971H1181
9695h3637E8208K42597A28636a7836j61119B27359C5531a82320b0600A12615Q8874
9684B01489b20429f2113I9283a03248G447a46293P649q3673B0150b9094j10038
9673a39132K3162B01376d8200A2301J80382G08K1306a07073j17632f9o4515o4544
9661a29128l019j89250A96505D9137j0135K96394j09125b26353K3593f1226l0507
9650i1733H3593d1871E4178i4157k82277i6852k44177F5244a02329k98575C9709
9638d6406j90381A79301g4278F7535J95771c52412A34386b64105i3196A89008
$$ plain form
9627 -185735 -119391 390132 34640 120484 -78497 -18748 -111216 200453 -118015 -23535 -150863
9616 -150863 117700 201258 99792 5994 -181995 -216899 55022 -322836 -174426 -153645 177350
9604 -161568 -116752 21690 -39354 -259659 205069 52717 -227427 -65476 40860 -50336 -211177
9593 -211177 -301068 106211 116136 47774 98330 -67289 23565 11748 30413 -86780 9259 -126466
9580 -63093 -215863 -3233 23101 -198047 -127894 -62725 -131527 -10413 -296157 -7509 192759
9568 -164868 -30806 -472181 -92655 28692 -116688 -89513 -87015 73354 174022 96904 49259
9557 49259 -181993 31482 118912 -343106 65540 142801 -8261 -66557 -78161 55117 -386167
9545 -169858 -163874 58834 -185191 -21287 336529 83004 -113507 18706 30162 -378528 -69022
$$ packed form
9627a85735O6344C90132C4640Q5844g8497a8748r2468B00453a18015b3535j27328
9616a50863A17700Q3558I9792E994a81995l4904E5022c22836J48410K0781A77350
9604a61568M4816B1690c9354k20305B05069E2717b27427f5476D0860e0336j60841
9593b11177q9891A06211R925D7774N0556f7289B3565A1748J8665h6780I259a26466
9580f3093j52770c233B3101a98047P0153f2725o8802a0413k85744g509A92759
9568a64868c0806m41375i2655B8692a16688K7175K498G3354J00668p7118m7645
9557D9259a81993C1482Q7430c43106F5540P7261h261n8296j1604E5117c86167
9545a69858N984E8834a85191b1287C36529H3004a13507A8706J1456c78528f9022
$$ plain form
9533 14730 42589 -131195 -249322 258 -170335 -459119 -100777 75125 -283550 116532 45127
9521 -49044 -336844 -24281 -47886 -346903 -136944 -154323 -283140 -108393 144621 -6115 164083
9509 90879 -22933 -514647 103103 -18907 183156 -286160 -91654 -129728 -153689 18072 -77643
9497 -250394 -58563 228695 -148529 -132274 -209862 500788 107909 -60964 -233600 144663
9486 -117003 46349 -138537 28568 -36450 41266 -48149 -243712 -143100 71149 6867 166295
9475 166295 -120594 36 2661 92177 34863 305213 -194483 -52639 -66376 19472 -211352 -167693
9463 -167693 -210678 164164 -37168 -176775 -124788 131178 -81534 36173 147767 102561 -373727
9451 -100580 -224448 -175020 117923 -152270 -117993 -55149 59327 -19093 3166 -83885 -231284
$$ packed form
9533A4730K7859a31195j18127B58a70335k88784a00777G5125b83550A16532D5127
9521d9044k87800b4281k3605k99017a36944j7379j28817a08393A44621f115A64083
9509I0879b2933m91714A03103a8907A83156b86160i1654l8074k3961A8072g7643
9497b50394e8563B28695a48529J6255p7588E00788A07909f0964j72636A44663
9486a17003D6349a38537B8568c6450D1266d8149j95563J00612G1149F867J59428
9475A66295a20594C6K625Q9516C4863K70350a94483e2639j3737A9472b11352M3659
9463a67693m2985A64164c7168j39607N1987A31178h1534C6173J11594m5206c73727
9451a00580j23868M9428A17923a52270L4277e5149E9327a9093C166h3885j47399
$$ plain form
9440 -231284 119778 -259946 17829 -112849 91495 21475 117797 123429 64451 -10503 -29293
9429 -29293 42856 -199724 147658 -28944 117297 378302 -201946 44449 -10748 72529 -72269
9417 5261 -16338 -74987 -22940 15461 -142241 -154614 -162361 62294 -184985 -291298 -35195 -100371
9405 -100371 -92487 -136749 229052 -68922 -125930 66638 85498 -244122 281712 48730 3062
9393 80775 -23537 -190472 -60857 132226 166087 61700 -36087 -263230 -305493 -155835 -11497
9381 -274264 -45388 51598 89283 18903 -35603 -209804 -123222 -58380 -300293 234102 90822
9369 302544 -84672 24098 -115706 83258 -283126 -109220 -301677 -223044 180382 -29519 -117384
9358 -117384 102292 -75214 1297 -296150 -29610 69608 122940 -174407 -376182 -169878 -74488
$$ packed form
9440b31284A19778b59946A7829a12849I1495B1475R6322N632n8978a0503j8790
9429b9293D2856a99724A47658b8944A17297K61005b01946D4449a0748G2529g2269
9417E261a6338n8649b2940A5461a42241j2373p747F2294a84985j06313c5195o5176
9405a00371P884m4262B29052f8922n7008F6638J8860b44122B81712D8730C062
9393H0775b3537j66935f0857A32226L3861F1700c6087k27143m2263J49658a1497
9381b74264d5388E1598L7685A8903c5603j74201Q6582e8380k41913B34102I0822
9369C02544h4672B4098a15706H3258b83126a09220j92457P8633A80382b9519q7865
9358a17384A02292g5214A297b96150b9610F9608N3332a74407k01775a69878g4488
$$ plain form
9346 -31842 -150255 -217941 -58590 100653 -241468 245240 235949 -17863 -126539 -343489 -138703
9334 -267724 59666 -100312 26590 92678 -160804 -96660 -67851 139081 -400216 -13587 -22127
9323 -22127 -86367 -70228 2929 -209862 -181765 76139 -111920 83800 -6053 -144633 -15229 40784
9310 110484 -271484 3910 -153737 22798 9652 -238012 -178926 99895 -155186 -168840 -22130
9298 -73735 -466545 -277831 -67487 60660 100492 -134667 90822 -69435 -138265 53942 -228764
9286 -204346 -215933 12090 -5239 -141028 -17204 42850 234353 -20233 -176539 -221218 214307
9274 24019 -188011 -121403 -116053 -256730 19153 169436 127517 58710 -248172 6603 -78564
9262 -266507 -43122 108888 259879 98538 176607 -27352 26534 -33745 144199 -258966 -77652
$$ packed form
9346c1842j18413o7686e8590A00653b41468B45240r291a7863j08676k16950a38703
9334b67724E9666a00312B6590O6088a60804O4144K8809A39081d00216a3587q540
9323b2127o4240J6139B929b09862K8097G6139a11920H3800f053j38580a5229D0784
9310A10484b71484C910a53737B2798I652b38012N9086I9895a55186j3654b2130
9298g3735l92810J88714f7487F0660L9832a34667I0822f9435o8830E3942b28764
9286b04346j1587A2090e239j35789a7204D2850J91503b0233j56306m4679B14307
9274B4019a88011O6608N350j40677A9153J50283m1919E8710b48172F603g8564
9262b66507d3122A08888J50991I8538P8069b7352B6534c3745A44199b58966g7652
$$ plain form
9250 7105 -53164 -91945 -138830 -319526 186958 161969 61930 -153340 -13043 32003 -127369
9238 -269776 -82222 -180606 -342632 77929 82967 -164871 -208505 -135196 -258363 -65649 157264
9226 39585 -48950 -50049 -179913 276181 -24225 1055 -123260 -234044 -353534 246420 -294113
9214 -38378 -147018 96250 100766 58757 71374 -39213 293562 413592 -73012 -138031 32340
9202 -199079 76429 39096 -326724 -228211 -71274 -25754 -28000 -89062 268696 -106165 -102212
9191 -102212 -63978 -136487 -49680 -128839 -171145 -130156 93575 358019 22371 213906 -211910
9179 121649 57200 -19289 43278 -43469 -95417 108608 -100076 -11419 72696 -116421 20979
9167 -106420 14047 42676 -222641 -266752 64331 -119267 307948 48647 -254349 -213311 287174
$$ packed form
9250G105e3164l8781m6885j80696A86958k4989F1930a53340a3043C2003a27369
9238b69776h2222r8384j62026G7929N038a64871m3634P3309j23167f5649A57264
9226C9585d8950j099j29864B76181b4225A055a23260j10784j19490B46420b94113
9214c8378j08640I6250M516m2009J2617c9213B93562J20030g3012o5019C2340
9202a99079G6429l7333c26724R8513g1274b5754k246o1062B68696a06165L953
9191a02212L8234p2509d9680p9159m2306M0989I3575K64444B2371J91535b11910
9179A21649E7200a9289D3278d3469n1948A08608a00076a1419G2696a16421B0979
9167a06420A4047K8629b22641m4111F4331a19267C07948D8647b54349M1038B87174
$$ plain form
9155 -161911 60516 -458866 82066 -248204 -181554 -95880 139191 -162268 -136716 -233814 103990
9143 74252 -99715 -59318 -112026 -48304 17419 -163286 154179 -352854 -232867 -247526 -312652
9132 -312652 -86541 -20899 105112 -122090 8467 99755 54370 -29581 -111035 155223 46006
9120 -230704 178471 -126190 -268690 -84646 93872 -101261 -62425 -151847 -389694 -83311 -70333
9109 -70333 -28620 -32408 -185171 -77274 -279950 -182139 -185581 -10732 123887 -41597 -207664
9098 -207664 -156507 213270 -1047 -340965 -42622 -159118 -192522 55472 -112935 -88699 -149981
9087 -149981 -119654 -68230 66193 92598 175211 -103416 -8616 145060 -24226 142472 -114734
9075 -403615 71192 -43208 101084 -69093 -108266 -214800 19895 49418 -183324 143713 -192957
$$ packed form
9155a61911F0516d58866H2066b48204O6650Q5674A39191a62268K5552r7098A03990
9143G4252i9715M0397n2708d8304A7419a63286A54179c52854J19987j4659o5126
9132c12652h6541b0899A05112a22090H467R1288m5385b9581q1454A55223D6006
9120b30704A78471a26190j42500h4646I3872a01261L8836q9422k37847h3311J2978
9109g0333b8620l788j52763g7274k02676R7811l442a0732A23887d1597j66067
9098b07664N1157B13270a047l39918d2622j16496l3404E5472a12935K4236o1282
9087a49981L0327N1424F6193K6405Q2613a03416h616A45060b4226A42472a14734
9075d03615G1192d3208A01084f9093l9173j06534A9895K9523a83324A43713a92957
$$ plain form
9063 -52352 95271 208755 -22624 228453 -103851 176093 -417515 -151485 -196008 64088 186633
9052 186633 -210622 113110 -2217 -121592 -237538 59306 69512 -77974 -57717 125022 -335990
9040 -56465 -78651 123101 -97502 75446 162316 -104719 -235198 -138159 75711 79939 66642
9029 66642 39554 241652 -215075 -57441 -103992 -25149 28094 95694 19298 -190721 -182305
9018 -182305 199640 -59471 12118 -131210 -38848 70304 -39581 73554 -192814 -213176 -46984
9006 -67730 -236281 160838 38915 -374911 -58745 -205081 -481253 -198559 -255417 -286498 118911
8994 16649 25859 200907 4572 -556417 31232 -50419 -184342 -218481 -149031 163222 -305139
8982 -42049 179021 -39261 238529 -91487 133357 -106826 -151781 310676 -399884 40143 60083
$$ packed form
9063e2352I5271J13484b2624B28453a03851A76093d17515a51485m4523F4088J22545
9052A86633b10622A13110b217j19375j15946E9306J0206g7974K0257A25022c35990
9040e6465k2186A23101i7502G5446Q6870a04719j30479R7039G5711M228j3297
9029F6642k7088K02098b15075e7441m6551b5149B8094O7600A9298a90721Q416
9018a82305A99640e9471A2118a31210c8848G0304c9581G3554a92814k0362d6984
9006f7730j68551A60838C8915c74911e8745j46336k76172a98559n6858l1081A18911
8994A6649R210J75048D572e56417C1232e0419j33923l4139O9450A63222c05139
8982d2049A79021c9261B38529i1487A33357a06826m4955C10676c99884D0143J9940
$$ plain form
8971 60083 -458305 -43007 -292208 151132 -69321 -35981 98570 -157121 176639 47277 -159848
8959 -65261 -136391 -239307 200012 127226 155782 163887 129554 -167524 -219543 -203107 -125689
8948 -125689 -23632 -172968 -2726 233446 28607 113330 -109402 219386 236663 -35554 75225
8936 10779 -120162 150835 -87445 -296533 326651 296152 -147759 200414 -42536 95743 -5547
8924 -186069 -69856 205119 644893 377993 -285843 87599 -152124 -148746 -307294 275755
8913 84865 3397 -145718 -82417 -35642 -142971 -29487 111989 160635 -27199 -17885 -95641 65923
8900 573 51108 -177434 101919 -102980 -287821 107275 -33097 -14567 -180313 -31161 -140790
8889 -140790 157962 57099 -264934 7798 -167939 -231566 -31290 -387292 -100126 -127047 -45250
$$ packed form
8971F0083d58305d3007k49201A51132f9321L3340I8570a57121A76639D7277a59848
8959f5261p1130j02916B00012p2786K8556Q105l4333a67524n2019J6436P7418
8948a25689b3632j49336b726B33446B8607Q4723a09402B19386J7277c5554G5225
8936A0779a20162A50835h7445k09088C26651l0499a47759B00414d2536I5743e547
8924a86069f9856B05119M39774k66900b85843H7599a52124L378j58548B75755
8913H4865C397a45718O3301c5642j07329b9487A11989M8646b7199R314p7756F5923
8900E73N0535a77434A01919a02980j84841A07275c3097a4567j65746c1161j09629
8889a40790A57962E7099b64934G798a67939o3627c1290l56002a00126k6921d5250
$$ plain form
8877 -8261 52958 -292021 -243815 -75784 170695 224170 -123410 -463403 -201987 -201610 -79763
8865 -53408 58868 -57681 -125523 38926 144103 -199590 -126447 -56703 -174211 -96741 -135676
8854 -135676 -307516 -58273 135268 -219245 -3813 212672 -30169 -232654 131482 279224
8844 279224 76674 -21304 -74175 106647 -56284 -308691 191195 32030 59902 -471571 21277
$$ packed form
8877h261E2958b92021M8206g5784A70695N3475a23410l39993b01987L77g9763
8865e3408E8868e7681o7842C8926J05177a99590P3143e6703j17508P7470l8935
8854a35676j71840e8273A35268b19245c813B12672c0169k02485A31482J47742
8844B79224G6674b1304n2871A06647e6284k52407A91195C2030K7872d71571B1277
$$ [...]
##END NTUPLES=NMR SPECTRUM
##END=
