##TITLE=AC1750_SEN00023_9280823_mYdIHHmsZ0
##JCAMPDX= 6.0         $$ Bruker NMR JCAMP-DX V2.0
##DATA TYPE= NMR SPECTRUM
##DATA CLASS= NTUPLES
##ORIGIN= BRUKER
##OWNER= Administrator
$$ 1.72 TOPSPIN		Version 2.1
$$ 2015-07-17 19:38:28.994 -0700  Administrator@X
$$ Compression mode = diff/dup
##.OBSERVE FREQUENCY= 400.02188249412
##.OBSERVE NUCLEUS= ^1H
##.ACQUISITION MODE= SIMULTANEOUS (DQD)
##.ACQUISITION SCHEME= undefined
##.AVERAGES= 8
##.DIGITISER RES= 22
##SPECTROMETER/DATA SYSTEM= spect
##.PULSE SEQUENCE= zg30
##.SOLVENT NAME= COFFEE_meoh
##.SHIFT REFERENCE= INTERNAL, COFFEE_meoh, 1, 14.98509
##AUDIT TRAIL= $$ (NUMBER, WHEN, WHO, WHERE, PROCESS, VERSION, WHAT)
$$ ##TITLE= Audit trail, TOPSPIN		Version 2.1
$$ ##JCAMPDX= 5.01
$$ ##ORIGIN= Bruker BioSpin GmbH
$$ ##OWNER= Administrator
$$ $$ E:\/data/COFFEE/nmr/AC1750_SEN00023_9280823_mYdIHHmsZ0/10/pdata/1/auditp.txt
$$ ##AUDIT TRAIL=  $$ (NUMBER, WHEN, WHO, WHERE, PROCESS, VERSION, WHAT)
(   1,<2015-07-17 19:38:22.244 -0700>,<Administrator>,<X>,<go>,<TOPSPIN 2.1>,
      <created by zg
	started at 2015-07-17 19:37:16.072 -0700,
	POWCHK enabled, PULCHK disabled,
       configuration hash MD5:
       21 0F 79 D6 B3 7B B4 F6 88 20 88 DB 03 48 BD 9F
       data hash MD5: 64K
       4D DB A2 4F 73 6D DB 78 BA CB 27 90 44 32 32 F2>)
(   2,<2015-07-17 19:38:25.400 -0700>,<Administrator>,<X>,<proc1d>,<TOPSPIN 2.1>,
      <Start of raw data processing
       efp LB = 0 FT_mod = 6 PKNL = 1 PHC0 = 0 PHC1 = 0 SI = 32K 
       data hash MD5: 32K
       5E 12 39 E9 25 A9 4F 25 B5 B8 F9 F5 7C 87 B3 F5>)
(   3,<2015-07-17 19:38:25.666 -0700>,<Administrator>,<X>,<proc1d>,<TOPSPIN 2.1>,
      <pk PHC0 = 86.20972 PHC1 = 0 
       data hash MD5: 32K
       B2 B7 53 68 D6 13 84 8B 2C B6 47 01 76 BC 7A 25>)
(   4,<2015-07-17 19:38:25.822 -0700>,<Administrator>,<X>,<proc1d>,<TOPSPIN 2.1>,
      <abs ABSG = 1 
       data hash MD5: 32K
       C4 CC F9 8C 70 1D CD 28 C6 36 FD 94 FD 94 48 2A>)
(   5,<2015-07-17 19:38:25.869 -0700>,<Administrator>,<X>,<proc1d>,<TOPSPIN 2.1>,
      <abs ABSG = 2 
       data hash MD5: 32K
       34 02 64 D9 4A EC 79 1E 94 AA A8 31 A6 81 DF 7D>)
(   6,<2015-07-17 19:38:25.932 -0700>,<Administrator>,<X>,<proc1d>,<TOPSPIN 2.1>,
      <abs ABSG = 3 
       data hash MD5: 32K
       2B 1F F2 2D 1B 91 56 D3 07 36 3B 20 DA E4 2E 0C>)
(   7,<2015-07-17 19:38:25.979 -0700>,<Administrator>,<X>,<proc1d>,<TOPSPIN 2.1>,
      <abs ABSG = 4 
       data hash MD5: 32K
       ED 1E A1 08 A6 53 93 72 B7 6B 0F B3 E0 F8 5F E9>)
(   8,<2015-07-17 19:38:26.025 -0700>,<Administrator>,<X>,<proc1d>,<TOPSPIN 2.1>,
      <abs ABSG = 5 
       data hash MD5: 32K
       8E C1 99 17 55 9A D1 EC C2 78 BB 1A A8 74 66 BF>)
$$ ##END=
$$ 
$$ $$ hash MD5
$$ $$ 79 A7 E3 91 98 E3 D2 F3 9C 97 5C B8 B2 2E F6 06
##$RELAX= 
##$RELAX= 
##$RELAX= 
##$RELAX= 
##$RELAX= 
##$RELAX= 
##$RELAX= 
$$ Bruker specific parameters
$$ --------------------------
##$DU= <E:\>
##$EXPNO= 10
##$NAME= <AC1750_SEN00023_9280823_mYdIHHmsZ0>
$$ [...]
150 150 150 150 150 150 150 150
##$TP07= 0
##$TPNAME0= <>
##$TPNAME1= <>
##$TPNAME2= <>
##$TPNAME3= <>
##$TPNAME4= <>
##$TPNAME5= <>
##$TPNAME6= <>
##$TPNAME7= <>
##$TPOAL= (0..7)
0.5 0.5 0.5 0.5 0.5 0.5 0.5 0.5
##$TPOFFS= (0..7)
0 0 0 0 0 0 0 0
##$TUNHIN= 0
##$TUNHOUT= 0
##$TUNXOUT= 0
##$USERA1= <user>
##$USERA2= <user>
##$USERA3= <user>
##$USERA4= <user>
##$USERA5= <user>
##$V9= 5
##$VALIST= <valist>
##$VCLIST= <CCCCCCCCCCCCCCC>
##$VD= 0
##$VDLIST= <DDDDDDDDDDDDDDD>
##$VPLIST= <PPPPPPPPPPPPPPP>
##$VTLIST= <TTTTTTTTTTTTTTT>
##$WBST= 2048
##$WBSW= 25
##$XGAIN= (0..3)
0 0 0 0
##$XL= 0
##$YL= 0
##$YMAX_a= 598025
##$YMIN_a= -528147
##$ZGOPTNS= <>
##$ZL1= 120
##$ZL2= 120
##$ZL3= 120
##$ZL4= 120
##$ABSF1= 14.98509
##$ABSF2= -5.573092
##$ABSG= 5
##$ABSL= 3
##$ALPHA= 0
##$AQORDER= 0
##$ASSFAC= 0
##$ASSFACI= 0
##$ASSFACX= 0
##$ASSWID= 0
##$AUNMP= <proc_prof1d_extract_pilot.lims>
##$AXLEFT= 0
##$AXNAME= <>
##$AXNUC= <1H>
##$AXRIGHT= 0
##$AXTYPE= 0
##$AXUNIT= <>
##$AZFE= 0.1
##$AZFW= 0.1
##$BCFW= 0
##$BC_mod= 0
##$BYTORDP= 0
##$COROFFS= 0
##$CY= 15
##$DATMOD= 1
##$DC= 0
##$DFILT= <>
##$DTYPP= 0
##$F1P= 0
##$F2P= 0
##$FCOR= 0.5
##$FTSIZE= 32768
##$FT_mod= 6
##$GAMMA= 0
##$GB= 0
##$INTBC= 1
##$INTSCL= 1
##$ISEN= 128
##$LB= 0
##$LEV0= 0
##$LPBIN= 0
##$MAXI= 10000
##$MC2= 0
##$MEAN= 0
##$ME_mod= 0
##$MI= 0
##$NCOEF= 0
##$NC_proc= -8
##$NLEV= 6
##$NOISF1= 0
##$NOISF2= 0
##$NSP= 0
##$NTH_PI= 0
##$NZP= 0
##$OFFSET= 14.98509
##$PC= 1
##$PHC0= 86.20972
##$PHC1= 0
##$PH_mod= 1
##$PKNL= yes
##$PPARMOD= 0
##$PPDIAG= 0
##$PPIPTYP= 0
##$PPMPNUM= 2147483647
##$PPRESOL= 1
##$PSCAL= 4
##$PSIGN= 0
##$PYNMP= <proc.py>
##$REVERSE= no
##$SF= 400.02
##$SI= 32768
##$SIGF1= 0
##$SIGF2= 0
##$SINO= 400
##$SIOLD= 32768
##$SPECTYP= <>
##$SREGLST= <1H.CDCl3>
##$SSB= 0
##$STSI= 32768
##$STSR= 0
##$SW_p= 8223.68421052631
##$SYMM= 0
##$S_DEV= 0
##$TDeff= 65536
##$TDoff= 0
##$TI= <>
##$TILT= no
##$TM1= 0
##$TM2= 0
##$TOPLEV= 0
##$USERP1= <user>
##$USERP2= <user>
##$USERP3= <user>
##$USERP4= <user>
##$USERP5= <user>
##$WDW= 1
##$XDIM= 32768
##$YMAX_p= 449758427
##$YMIN_p= -655266
##$CURPLOT= <Network HP LaserJet P1505>
##$CURPRIN= <$Network HP LaserJet P1505>
##$DFORMAT= <normdp>
##$LAYOUT= <+/1D_H.xwp>
##$LFORMAT= <normlp>
##$PFORMAT= <normpl>
##$SURQMSG= 1
$$ End of Bruker specific parameters
$$ ---------------------------------
##NTUPLES= NMR SPECTRUM
##VAR_NAME=  FREQUENCY,     SPECTRUM/REAL,   SPECTRUM/IMAG
##SYMBOL=    X,             R,               I
##VAR_TYPE=  INDEPENDENT,   DEPENDENT,       DEPENDENT
##VAR_FORM=  AFFN,          ASDF,            ASDF
##VAR_DIM=   32768,         32768,           32768
##UNITS=     HZ,            ARBITRARY UNITS, ARBITRARY UNITS
##FACTOR=    0.250966925370066, 1,           1
##FIRST=     8223.43324360094, 34752,        -67125
##LAST=      0,             -94921,          194458
##MIN=       0,             -655266,         0
##MAX=       8223.43324360094, 449758427,    0
$$ Real data points
##PAGE= N=1
##DATA TABLE= (X++(R..R)), XYDATA
$$ [...]
19563A70787j6958b08265j04219a40508K0411j09271m5371J27535j38832a02000
19552a64866n273M4247L883A41500m8136e02459A843P7155a98900e045l98400
19541d03445N5463C3158f7725A36839D8152b39491H164J09373f1851k2588L6735
19530d7704F9157c27952C5372M9829b1936a091k22405B0157b24739R614j02189
19519c17314f2863B49370a15039C7704c0322D3907d0243q8691b4138j25577B9853
19507B97311H6354a14936F1098i8677a7176j13434A63203d3807B3644d01331B96641
19495f4021C54370h1318k37134J01646C7940K701b3500G6831i489j53375O6917
19484i5947l03699J85014A70260b0553B87845f697q0215j17637B51231n4037a31017
$$ y = [170787, 153829, -208265, -312484, -140508, -120097, -229368, -274739, -147204, -286036, -102000, -164866, -170139, -125892, -122009, 141500, 93364, -502459, 1843, 78998, -198900, -5045, -403445, -347982, 33158, -67725, 136839, 48152, -239491, 8164, 117537, -61851, -84439, -47704, 69157, -327952, 35372, 85201, -21936, -1091, -223496, 20157, -224739, -215125, -317314, -62863, 249370, -115039, 37704, -30322, 43907, -40243, -128934, -24138, -149715, 29853, 297311, 86354, -114936, 61098, -98677, -17176, -130610, 163203, -43807, 23644, -401331, 296641, -64021, 354370, -81318, -318452, -216806, 37940, 40641, -23500, 76831, -9489, -162864, -95947, -399646, -214632, 170260, -20553, 287845, -6697, -86912, -204549, 251231, 197194, -131017]
19472A02066J10747A5606Q4610m0018a7545j46014p8202a4952j46663g0216r5822
19461a66038N6523b1931j31591A82048q7751a71231c7375j39421j00898R4506
19451a83188c8026A05185b49604j54361c4781j88368L3892j45226A68582O5282
19441B33864g1677o4234e2215B39986Q0314a43622O9703j71274A5562c7922H6208
19429h0825j40530N4148p151L28A11471a23852e1150p3499p0134l9944a17274
19417B09332f8700n4295B94110a09898d3577F2794k0748a93479J756j40211i7132
19405c39258k3653C48008A11913g0740I0841g7441A91747k1618B22e1991A44153
19393a01412j20260j30478J4587A99855i5488n3133N0688A60500G9702b71495
$$ y = [102066, 212813, 15606, 100216, 60198, -17545, -163559, -241761, -14952, -161615, -70216, -166038, -109515, -21931, -153522, 182048, 94297, -171231, -37375, -176796, -277694, -183188, -38026, 105185, -249604, -403965, -34781, -223149, -189257, -334483, 168582, 233864, -71677, -135911, -52215, 239986, 320300, -143622, -73919, -245193, 15562, -37922, 86208, -80825, -221355, -167207, -174358, -174030, 111471, -123852, -51150, -124649, -194783, -234727, -117274, 209332, -68700, -122995, 294110, -109898, -43577, 62794, 42046, -193479, -191723, -331934, -97132, -339258, -362911, 348008, 111913, -70740, 90841, -77441, 191747, 170129, 222, -51991, 144153, -101412, -221672, -352150, -337563, 199855, -95488, -148621, -97933, 160500, 79702, -271495]
19382a11549n1964A01687L8282c6356J3378A03443N6761N4678b69427j06673a01951
19370a35605o1542E0684J4663a08456i718E4051b02070h3180L2510k3384J2153
19359f1901k95291a31028k24910B56101c0817j26128o6153F9690d9009p2346F8364
19347b36939H7398a8787m3758o2065A01366J08941L9349a91424c3319K867k09262
19336b39714g4500F0263b70792j75134E3927J07146F1420o108B0119J52835F1927
19324A00409J18226A09183a08237C94456G0230h1124D6136c57901L3451A14263
19313G0198i5134D67428B617a86585H1668c63480c1261a2302k11601B4466b48204
19301D2583a07416l6221k7755Q2313j01962C9788b25784G0167B4272b25348p2803
$$ y = [-111549, -163513, 101687, 139969, -36356, -22978, 103443, 160204, 214882, -269427, -376100, -101951, -135605, -197147, 50684, 65347, -108456, -9718, 54051, -202070, -83180, -50670, -74054, -61901, -357192, -131028, -355938, 256101, -30817, -156945, -223098, 69690, -49009, -121355, 68364, -236939, 87398, -18787, -62545, -124610, 101366, 210307, 249656, -191424, -33319, -30452, -239714, -74500, 60263, -270792, -445926, 53927, 161073, 61420, 55312, 20119, 172954, 61927, 100409, 218635, 109183, -108237, 394456, 70230, -81124, 46136, -357901, -324450, 114263, 70198, -95134, 467428, 2617, -186585, 81668, -363480, -31261, -12302, -223903, 24466, -248204, 42583, -107416, -143637, -171392, -89079, -191041, 39788, -225784, 70167, 24272, -225348, -298151]
19290b98151K9620F7025h2898n6575a8606l21352L0800a244r6205A26868e9389
19278a77197G5506k455P8359f9302j0290k35285P4070H0913a02427F0892b80721
19266A15395e3121j96006Q2652F2398a57966j14746a17867j6158o1940g487o3295
19255g0782A50478b8617A42168a26015K2727j22248N009A59859b29395a14017
19244a11279j40735o4088A96456a62056b2793k07159c3952F5509k6325a98558
19233h8288A7542a38473f1261G339a43371b8127k76574L7420a1272A55820I25
19221A11857L9483a69698N0098G0322g9451j2142k6289o7761A14157a56987Q612
19210a48375f835j05269B56673b63846a21169E1111K65117B8740d3466H6538a09226
$$ y = [-298151, -268531, 67025, -82898, -139473, -18606, -339958, -309158, -1244, -97449, 126868, -59389, -177197, 75506, 73051, 151410, -69302, -79592, -314877, -240807, 80913, -102427, 60892, -280721, 115395, -53121, -249127, -166475, 62398, -157966, -272712, -117867, -134025, -195965, -7487, -70782, 150478, -28617, 142168, -126015, -103288, -225536, -220527, 159859, -229395, -114017, -111279, -252014, -316102, 196456, -162056, -22793, -229952, -33952, 65509, 39184, -198558, -88288, 17542, -138473, -61261, 7339, -143371, -28127, -304701, -267281, -11272, 155820, 925, 111857, 151340, -169698, -119600, 70322, -79451, -91593, -117882, -185643, 114157, -156987, -148375, -6835, -112104, 256673, -263846, -121169, 51111, 316228, 28740, -43466, 86538, -109226]
19198b91618A02183o741m3999a05412A23677a29280J3601B05448a38581F9893
19187A7206c3523n9561D3099a07996A80014L1223b04540L8908g5751q9078G6587
19175a50759A24427D9435A5333a12513A56348i4204l01026a38733C9367J38304
19165A77671j6240a90720H5456A5658c6769A26618a87338A62759c00511A65835
19154C3665c76955C50231A16475a61326B18651a79370c2556l08347R9813g2632
19143b6869p4333j05724B39478e28337a6963C4269a91114J9753B62917E7238K51231
19132C08469b95676P6311d2458k67324f0915l90886a14279j21971F5112K74804
19122C39916g6924A89804c86146c9423G2704L4686a07233B06964B6909i8296a1036
$$ y = [-291618, 102183, 95442, 51443, -105412, 123677, -129280, -115679, 205448, -138581, 69893, 17206, -33523, -93084, 43099, -107996, 180014, 211237, -204540, -165632, -75751, -164829, 76587, -150759, 124427, 49435, 15333, -112513, 156348, -94204, -395230, -138733, 39367, 177671, 161431, -190720, 85456, 15658, -36769, 126618, -187338, 162759, -300511, 165835, 33665, -376955, 350231, 116475, -161326, 218651, -179370, -32556, -340903, -241090, -72632, -26869, -101202, -206926, 239478, -528337, -16963, 34269, -191114, -171361, 262917, 57238, 308469, -295676, -219365, -42458, -309782, -60915, -451801, -114279, -236250, 65112, 339916, -76924, 189804, -386146, -39423, 72704, 107390, -107233, 206964, 26909, -98296, -11036]
19110B26737b28162A54908f8042h396l85710l0210G9355b07071j05849F1964h5459
19098a3965j71291A497c96237A46581B2385h7612l1948A0911L3156b75876b78
19086a38079A38364a33032j54448D1643c18521e3075D3985g6697o0504A9103a36720
19074A05515f1375r4058L7451k50097A80361e8262A84005E965a65342p8304P6145
19063a67501K2104O8237c7358l12434B9816O864c1423J0012g357A44424f0525
19051a72903D1471a21327l6725F5738g5673B853K5085a43464A35940E2149a62008
19039b23294m6144i5230E9402g9091H163c20458A74954c45852G8787N8182a04249
19027a26002o4905K3412A48889J05901b81718B6857a97252B68105E9249a61184
$$ y = [226737, -228162, 154908, -68042, -8396, -394106, -424316, 79355, -207071, -312920, 61964, -85459, -13965, -185256, 1497, -396237, 146581, 22385, -87612, -119560, 10911, 44067, -275876, -278, -138079, 138364, -133032, -287480, 41643, -318521, -53075, 43985, -76697, -137201, 19103, -136720, 105515, -61375, -155433, -117982, -368079, 180361, -58262, 184005, 5965, -165342, -243646, -167501, -145397, -77160, -37358, -349792, 29816, 36680, -31423, -21411, -7357, 144424, -60525, -172903, 41471, -121327, -158052, 65738, -75673, 2853, 27938, -143464, 135940, 52149, -162008, -223294, -269438, -95230, 59402, -79091, 8163, -320458, 174954, -345852, 78787, 136969, -104249, -126002, -190907, -167495, 148889, 254790, -281718, 26857, -197252, 268105, 59249, -161184]
19016B9229K8794a70686M7980k85840B50180a68329j01814P3816P2462R393F1844
19004F5427b49032C20770a11066k10946J40600j39626g2363a5342B26052a03928
18993a97214C1110O0829a74305O1211j0771F6890B9255b91188g0249r6326E4748
18981A68402c48718a23843d2941m9258j01005D8213b4506m224k13538B83903l6643
18970B47260c140A69606a88483A7907e2913A6055b11513p9348F1754R8355a95570
18958A84792a16327k87c3709j89837Q7357F0386L35037c1774B5411N9099R5993
18947A80503k962B3419J95330c43210a47065c8599j36275O6768G4460J30644a14620
18935c9191A31847J8423E2475a18646j22510A20572l0714b045j27076f1824M434
$$ y = [29229, 58023, -170686, -122706, -408546, 250180, -168329, -270143, -196327, -123865, -114472, 61844, 65427, -249032, 320770, -111066, -322012, -181412, -321038, -72363, -15342, 226052, -103928, -197214, 31110, 91939, -174305, -113094, -123865, 66890, 29255, -291188, -70249, -166575, 54748, 168402, -348718, -123843, -42941, -92199, -193204, 48213, -24506, -28730, -242268, 283903, 247260, -3140, 169606, -188483, 17907, -52913, 16055, -211513, -290861, 61754, 160109, -195570, 184792, -116327, -116614, -33709, -223546, -136189, 60386, 395423, -31774, 25411, 84510, 180503, 177541, 23419, 218749, -343210, -147065, -38599, -174874, -108106, 74460, 205104, -114620, -39191, 131847, 150270, 52475, -118646, -241156, 120572, 89858, -2045, -129121, -61824, -57390]
18924e7390K5847m6778D0313J59903o6827a08855j81387A26390a05545B0909c32016
18912a43767I3600P3179o8800f5755E5512R8976p3992A5069k131J0666K86332
18901C09936c31489A00240m2635N1007D506b00579h8446m46444C3344b30001O4038
18890a65963A46898a40278q5942B6301c7559j31942L3491A72288a70762P7141
18880i3621C7854b68972F8148e6162l6367k7751G3220B0402i2585d1873l7181
18869g9054C4332a67372j77734P2046j6642g3189j39584F3461L8119A6188i1751
18857F82b22509A98020a05095J8575H4573A1130c04187G3680A8007L4307a00946
18845a63255p0137B30846f7661m67031a9087B93500f4806G603a43851l890g0797
$$ y = [-57390, -31543, -78321, 40313, 200216, 133389, -108855, -290242, 126390, -105545, 20909, -332016, -143767, 93600, 166779, 97979, -65755, 55512, 154488, 80496, 15069, 12938, 23604, 309936, -331489, 100240, 57605, 108612, 4506, -200579, -88446, -534890, 33344, -230001, -165963, 146898, -140278, -226220, 26301, -37559, -169501, -136010, 172288, -170762, -93621, 37854, -268972, 68148, -56162, -92529, -120280, 73220, 20402, -92585, -41873, -79054, 34332, -167372, -345106, -273060, -289702, -73189, -212773, 63461, 101580, 16188, -91751, 682, -222509, 198020, -105095, -86520, 84573, 11130, -304187, 73680, 18007, 52314, -100946, -163255, -233392, 230846, -67661, -534692, -19087, 293500, -64806, 7603, -143851, -147741, -70797]
18833h5481j62044D25K6620J16425e0153Q488A06246D9775J47695a45911B73813
18821b00738A43696o9083g0989F5594a14629J179k3777a1211C09161F0872Q3210
18810A44082a27178A81142h72A31602d01667B18171G1574J4158b24475D1733c04772
18798a36243B0358K02351b58890M8011I7130k0248J34577B3070f8674A81105D8933
18786a33906K6221q8138Q7753A93830J60021A10857O2081a8205j6785A06066D3876
18774g5763L5274A09265q337b5462r166j60309R5389j44705A24429c8950j727
18763d0677I9347g088j55011c1634A58676d3507q3539c18k22416p7649a27443
18751b56563P0735B2771h1215k65241a37774M0264C27537a41090N3127n0634o9426
$$ y = [-85481, -247525, 425, 27045, 143470, -50153, -41665, 106246, 49775, 197470, -145911, 273813, -200738, 143696, 74613, -70989, 65594, -114629, -113450, -137227, -11211, 309161, 60872, 144082, -127178, 181142, -872, 131602, -401667, 218171, 71574, 85732, -224475, 41733, -304772, -136243, 20358, 222709, -258890, -210879, 97130, 76882, 211459, 23070, -68674, 181105, 48933, -133906, -107685, -195823, -108070, 193830, 353851, 110857, 172938, -18205, -34990, 106066, 43876, -75763, -40489, 109265, 100928, -25462, -34628, -194937, -99548, -244253, 124429, -38950, -40677, 99347, -7088, -162099, -31634, 158676, -43507, -127046, -318, -222734, -300383, -127443, -256563, -185828, 22771, -81215, -346456, -137774, -97510, 327537, -141090, -87963, -138597, -208023]
18740b08023h0595a0954r0286k2418k32385a17954J170E3344d1421n8739j97513
18729b97673J04226r4874G59h5866B47541c9644k24879j3102B14693i5382A59438
18717a67416C5812J36424a75228c0876k91670J42779j01193D7489K14391a84865
18706a2635o9716j49250j7929b0338k5738A01439B5775g0810j16686h8911m2233
18695a31144j61494B8383f2174l39876G5795i3370A99449a41385E7386B5605c13948
18683a29543j73604F0939b6949j1201B3146f0810B6565d8884E3203b81238i4334
18671b19192R9364k87889A64050d24387K08918B3679c25535l4663f4400B32171
18660B58744m6288c9316j04851A11456H619e2922B08603b53649H7321b82235A56555
$$ y = [-208023, -80595, -10954, -101240, -123658, -356043, -117954, -116784, 53344, -41421, -100160, -297673, -193447, -288321, 759, -85866, 247541, -39644, -264523, -277625, 214693, -95382, 159438, -167416, 35812, 172236, -175228, -30876, -322546, -179767, -280960, 47489, 261880, -184865, -12635, -82351, -231601, -249530, -20338, -46076, 101439, 25775, -70810, -187496, -88911, -131144, -292638, 28383, -62174, -402050, 75795, -93370, 199449, -141385, 57386, 25605, -313948, -129543, -303147, 60939, -26949, -38150, 23146, -60810, 26565, -48884, 53203, -281238, -94334, -219192, -119828, -407717, 164050, -424387, -215469, 23679, -325535, -360198, -64400, 232171, 258744, 212456, -39316, -144167, 111456, 8619, -52922, 208603, -253649, 87321, -282235, 156555]
18648A02864d6004B46629a27217A2858a20043k25938g1335a5337l8084A09699
18637g0919a8868j42863A15889b1071l30299C2457a43560L1124F6646g9789A744
18625h5749J1016A49729g2780l7315k94465a11845r7361R7523n3861j67634a14752
18613A83592H8936l6360a26973c3119J2884j72420d0006A5995K9150e8154j88523
18602b46677O7979k14586N3406C0011h3180A5409a04516A56617G1094i1027B41808
18590c74815a46001F6378b1549C1725I426b48119B1071d7937G3604a18470A13235
18578B70102e22401e9926k44323E5652O7631J15797i4289k81716J79646b0879
18567G3585c1051B4481i5306C8787f8641b5017l6694N220A85020b28721a12604
$$ y = [102864, -46004, 246629, -127217, 12858, -120043, -345981, -71335, -15337, -53421, 109699, -70919, -18868, -161731, 115889, -21071, -351370, 32457, -143560, -112436, 66646, -79789, 1744, -85749, -74733, 149729, -72780, -110095, -404560, -111845, -209206, -111683, -165544, -333178, -114752, 183592, 88936, 52576, -126973, -33119, -20235, -192655, -40006, 15995, 45145, -58154, -246677, -178698, -393284, -339878, 30011, -83180, 15409, -104516, 156617, 71094, -91027, 241808, -374815, -146001, 66378, -21549, 31725, 9426, -248119, 21071, -47937, 73604, -118470, 113235, 270102, -522401, -59926, -304249, 55652, 123283, 239080, -94289, -376005, -196359, -20879, 73585, -31051, 24481, -95306, 38787, -68641, -25017, -61711, -56491, 185020, -228721, -112604]
18555b1884B65705D7824a74347e1334l9270j68584J05128N3786D7382J16048b15731
18543B94088G5684b84893n2872c6853l05489c7677C2074a84514F6388g8107C2125
18531b32199a01292j11058J9094q9810C4648K05832c1224B40111a27428A75265
18520c88739A37200h065L363j89319n0176A7060b36289F5648J02086b19941a4081
18508a37200L1740j02366e1827B39289A7918a21240b5077I6642d00722A07583
18497C1162f2646B2182f8264B9722j0677p03Q9112g6428B02930H7137d6876o473
18485e3349j53529a403q0222A16353B8565a45486n8075B25583f9995n5383l88056
18474e13434a0661C05665C7957J52369a37224c8850A32641c4218j67144r7718
$$ y = [-21884, 265705, 47824, -174347, -51334, -90604, -259188, -154060, -100274, 47382, 163430, -215731, 294088, 75684, -284893, -337765, -36853, -342342, -37677, 32074, -184514, 66388, -78107, 32125, -232199, -101292, -212350, -193256, -283066, 34648, 240480, -31224, 240111, -127428, 175265, -388739, 137200, -8065, -4702, -194021, -244197, 17060, -236289, 65648, 167734, -219941, -14081, -137200, -105460, -207826, -51827, 239289, 17918, -121240, -25077, 96642, -400722, 107583, 31162, -62646, 22182, -68264, 29722, 19045, 18342, 107454, -76428, 202930, 87137, -46876, -53349, -206878, -1403, -81625, 116353, 28565, -145486, -203561, 225583, -69995, -125378, -513434, -10661, 305665, 37957, 190326, -137224, -38850, 132641, -34218, -201362, -299080]
18464b99080f4941B49857i6508j12253L1173A91980H7936a1124j23381K3535A30509
18452a9214B06105b28834e0326j4606k91956G7330J37047F9922b10392i7660D8451
18440c67538A15059a00214A70077h4069j02042I09P1238e68745e9357A15320i3241
18428a39669d6557a8519l115m37485A03689d66548A16912a71134C2542J06975
18418A39517a76646h6854n0607a9157l77425B43917D8343N1786d0353A62395f593
18406B9210J56447c6105A32248k7641A7578b84156i6128j11953d9941p8478A5147
18394A6786e1909B87547F4877O8621c9006G3179j2821R3297a60051q1050C834
18382c82475A09393b48811Q3186E7416k0475k011b74573H7606b15134f037E4472
$$ y = [-299080, -64941, 249857, -96508, -208761, -177588, 191980, 87936, -11124, -134505, -110970, 130509, -19214, 206105, -228834, -50326, -64932, -356888, 77330, 214377, 69922, -210392, -97660, 48451, -367538, 115059, -100214, 170077, -84069, -186111, 909, 72147, -568745, -59357, 115320, -93241, -139669, -46557, -18519, -21634, -459119, 103689, -466548, 116912, -171134, 32542, 139517, -176646, -86854, -137461, -19157, -396582, 243917, 48343, 100129, -40353, 162395, -6593, 29210, 185657, -36105, 132248, 104607, 17578, -284156, -96128, -208081, -49941, -128419, 15147, 16786, -51909, 287547, 64877, 133498, -39006, 73179, 60358, 153655, -160051, -241101, 3834, -382475, 109393, -248811, -165625, 57416, 36941, 34930, -274573, 87606, -215134, -6037, 54472]
18370c28313d6697A29112K1682c06134a15457p916I7628b34218d1832A30434b0011
18358A72724B4321c9776A9087c1712B46930F8398L18941j77857c02999a500B9139
18346c24092J8678b7827D2577b08619c854A7549a67923j295l7332j69528G257
18334A59173a50475M4202G6349b34254g5361K469o4861M4972M0758j80038A79248
18322e523B594c25592A22587e0059k41090D5465b82584n0745B8645M9506a65080
18310B74950c04778a6849n1164G8693P612a6084C9797M9260k8950j5028b66079
18298A52460O3843E6713J05129D0730a25301a5894B54612p7964b20462k6648R2947
18287a54163e2758q2518C19860n0232b1957B58448a3409q1325B19315A0425c59068
$$ y = [-328313, -46697, 129112, 150794, -306134, -115457, -123373, 97628, -234218, -41832, 130434, -20011, 172724, 24321, -39776, 19087, -31712, 246930, 68398, 387339, 209482, -302999, -1500, 29139, -324092, -305414, -27827, 42577, -208619, -3854, 17549, -167923, -169218, -206550, -376078, 7257, 159173, -150475, -106273, 76349, -234254, -75361, -72892, -137753, -92781, -52023, -232061, 179248, -5523, 2594, -325592, 122587, -50059, -291149, 45465, -282584, -333329, 28645, 78151, -165080, 274950, -304778, -16849, -68013, 78693, 86305, -16084, 39797, 89057, 60107, 45079, -266079, 152460, 216303, 56713, 161842, 40730, -125301, -15894, 254612, 176648, -220462, -247110, -154163, -52758, -135276, 319860, 269628, -21957, 258448, -13409, -94734, 219315, 10425, -359068]
18275B22557f7451H1516a51192C9895g0543a1095m16080a49932A11637e265j92276
18264a97541F1499J89053c54B10126d4994q1643Q332K8399k68678A55287c64630
18252c00196i9673k16936i1821J5105m2457q8656D3273d60252h81F9639d8055
18240h0148C54794a52816A82890a81293B0647a25897B81110e0747C9797f7308
18229c39880a1966k35466b0828k13348B30638q8287h1004j18436k2933K5661K68
18218a96444e2038j2397C0612a22298k21443G7937a72234g1704B0358h8787l982
18207i2769C30275a96902B32978A2856a23666A67133i979F3453J28065a01777
18196c41978h225k42589f7991A4855J11274a59489F9640a21685r7606B66408E5430
$$ y = [222557, -67451, 81516, -151192, 39895, -70543, -11095, -427175, -149932, 111637, -5265, -197541, 61499, 250552, -354, 210126, -44994, -126637, -118305, -89906, -358584, 155287, -364630, -300196, -99673, -316609, -91821, -76716, -119173, -207829, 43273, -460252, -881, 69639, -48055, -80148, 354794, -152816, 182890, -181293, 20647, -125897, 281110, -50747, 39797, -67308, -339880, -11966, -247432, -20828, -234176, 230638, 142351, -81004, -199440, -222373, -196712, -196444, -52038, -64435, 30612, -122298, -343741, 77937, -172234, -71704, 20358, -88787, -92769, 330275, -196902, 232978, 12856, -123666, 167133, -9979, 63453, 191518, -101777, -341978, -8225, -250814, -67991, 14855, 126129, -159489, 69640, -121685, -219291, 266408, 55430]
18184D2061b12835F7344a66538A94896q7589b88976g7698A44671a7697B07628
18173H988a24939B09136A7013R180a37248D8873j3629a31652K9635B03808B0596
18161C24205a04064J1779m6895A62555l5397a17108c9024A28972h9324I7430i1264
18149a24045j2695A43212a79422k446a0292C0796b63028b3035E9754b45456P7105
18138a68351k3131a6352B57901q5248J65299a53786J6179a583B48763a74903A41410
18126C3416J55712a59557D6844a22096o5765k76114a36014e0116H3676e3062k01969
18115b55031F4241H36J59534L2145a00318B12123d2012J3689B21155c3695A30924
18103a52030G6833e9582m18681G9158L07294a3682j07729F8515c94449P0621L0614
$$ y = [42061, -212835, 67344, -166538, 194896, 107307, -288976, -77698, 144671, -17697, 207628, 8988, -124939, 209136, 17013, 26193, -137248, 48873, 35244, -131652, -102017, 203808, 20596, 324205, -104064, -92285, -139180, 162555, 127158, -117108, -39024, 128972, -89324, 97430, -91264, -124045, -136740, 143212, -179422, -181868, -10292, 30796, -263028, -23035, 59754, -245456, -168351, -191482, -16352, 257901, 172653, 337952, -153786, -137607, -1583, 248763, -174903, 141410, 33416, 189128, -159557, 46844, -122096, -187861, -463975, -136014, -50116, 83676, -53062, -255031, 64241, 836, 160370, 192515, -100318, 212123, -42012, -28323, 221155, -33695, 130924, -152030, 76833, -59582, -478263, 79158, 386452, -13682, -121411, 68515, -394449, -323828, -293214]
18092b93214d7461q6715M4067G6242f5378k07211J02588M6465B3869J76294b7701
18080F004c7421A54947a5176k98549B70069j10655E9017N5546g7881E1564a9303
18068A66602a51670b4736l37510J16227h0114B8406b0860C9346c22288a27314
18057a67257K7798A57404b24231O46f825A80547h5888C2342f6134l0235b6461
18045G0583K63973b8785l0693j8478I9049a77411A45367c2217A43964F8971K2380
18034I1351c3883j60357A54939F5501b27096d8344p7923A08834a98417a4144G928
18022F6579R4797h3182D2523K4355h2843A87362K02061h8114m7983C01749a20551
18010a05743G8685i3198b6100C6998K14789a61222d6276j60717A03372a38858
$$ y = [-293214, -47461, -134176, -90109, 76242, -65378, -272589, -170001, -123536, 23869, 200163, -27701, 6004, -37421, 154947, -15176, -313725, 270069, 159414, 59017, 114563, -77881, 51564, -19303, 166602, -151670, -24736, -362246, -246019, -80114, 28406, -20860, 39346, -322288, -127314, -167257, -139459, 157404, -224231, -223585, -6825, 180547, -85888, 32342, -66134, -96369, -26461, 70583, 334556, -28785, -59478, -77956, 99049, -177411, 145367, -32217, 143964, 68971, 91351, -33883, -194240, 154939, 65501, -227096, -48344, -126267, 108834, -198417, -14144, 7928, 66579, 161376, -83182, 42523, 66878, -82843, 187362, 389423, -88114, -136097, 301749, -120551, -105743, 78685, -93198, -26100, 36998, 251787, -161222, -46276, -206993, 103372, -138858]
17999b2446k24097J11081d4838k84896a60155f5004d110k57567C3815K09443a55910
17987G8359l8826L25931d0051k08096O9701e399A90834Q0863i1184B24154H409
17975a44009I4101J32602d8983o0063B51172e2674B03675a69099d4015I6860J8621
17964A15481Q6156h634A71738a226B48089c10941d6739k3483B46149H6330E612
17952b7090k05463e0349K1496D1192A5497c1444D8790Q2097c28096e4691l315
17941e8006B6142b7748C4665b1745j87695L8997j51713A32064d26094Q1081a0175
17929a98126A70129i5538A52719k6727b78993A11696d148A58031G3638b36242
17918f6533j81703j02759A44464g5379F8262d31419b9055j61204K7568A87258
$$ y = [-22446, -246543, -135462, -44838, -329734, -160155, -65004, -4110, -261677, 33815, 243258, -155910, 78359, 39533, 365464, -40051, -248147, -178446, -5399, 190834, 271697, -91184, 224154, 8409, -144009, 94101, 226703, -48983, -109046, 251172, -52674, 203675, -169099, -44015, 96860, 115481, 201637, -8634, 171738, -1226, 248089, -310941, -46739, -70222, 246149, 86330, 5612, -27090, -232553, -50349, -28853, 41192, 15497, -31444, 48790, 130887, -328096, -54691, -58006, 26142, -27748, 34665, -21745, -209440, -170443, -322156, 132064, -426094, -345013, -10175, -198126, 170129, -95538, 152719, 125992, -278993, 111696, -4148, 158031, 73638, -236242, -66533, -248236, -350995, 144464, -75379, 68262, -431419, -29055, -190259, -162691, 187258]
17907a01466A07701D6219r511L944b26727g385j42614A74643h2445A1443N0048
17896F1491L3539a93692k5958n443P5758p874D0375J38717B136L3327d4055l53
17884d4408K37O174k50253A08723E1938J18673b10532A91529q0480b37236K5044
17873b12192C06463A9892K26753A236J58781N3388r8874e5892A1682E429a145
17861b82981b3449j26808E8830L642c35612F308a52548I8730d4192D44844A61715
17849B8677b38006B67644e5747H861a26221I5974b75860D7774f7496A26847b37876
17837a64207d1448D7576B0690d0957j92520I3929o712c60251J61408A24427g9167
17825a88966A72640c1543j23734O0280K0916p4836m8368D8584K4450i64k1161
$$ y = [-101466, 107701, 46219, 36708, 40652, -226727, -7385, -149999, 174643, -82445, 11443, 61491, 95030, -193692, -219650, -225093, -149335, -157209, 40375, 179092, 2136, 35463, -44055, -44408, -44171, -37997, -288250, 108723, 51938, 170611, -210532, 191529, 111049, -237236, -212192, 306463, 19892, 246645, 1236, 160017, 213405, 114531, -55892, 11682, 5429, -1145, -282981, -23449, -150257, 58830, 62472, -335612, 6308, -152548, 98730, -44192, 444844, 161715, 28677, -238006, 267644, -55747, 8861, -126221, 95974, -275860, 47774, -67496, 126847, -237876, -164207, -41448, 47576, 20690, -40957, -233477, 93929, 87217, -360251, -198843, 124427, -79167, -188966, 172640, -31543, -155277, -94997, -74081, -148917, -197285, 48584, 73034, -964, -22125]
17814b2125C923b71383d9170p7928A03377a20511o053A56926k3332l6641A5435
17802a1p7061k5413q7062j29642B13937D5261R78P5163a20955A39627c9929C14620
17789B68258J04592b27880C8479M8564Q7340J44866a62399B52106I6888a81807
17778a1095B68342c4212A31144b78889P0655B5477a27512n0611D0495J720a3271
17766a72208C53191a28139J2214A16332c22836P0435B05548b28187D7583b6664
17755b96654A50054J17640q9277b95606h2756j96619O9691a00465A01782N2792
17745A54574b22053q7508E5115J63121c78291B52613A26120J44887a33465B447
17734b53959I9215M642c26427A01321J5112K576f5337c1378k13672C8445N0428
$$ y = [-22125, 3923, -271383, -49170, -127098, 103377, -120511, -126564, 156926, 133594, 96953, 15435, -11, -77072, -102485, -189547, -319189, 213937, 45261, 46239, 121402, -120955, 139627, -39929, 314620, 268258, 372850, -227880, 38479, 87043, 174383, 319249, -162399, 252106, 96888, -181807, -11095, 268342, -34212, 131144, -278889, -208234, 25477, -127512, -178123, 40495, 42215, -13271, -172208, 353191, -128139, -115925, 116332, -322836, -252401, 205548, -228187, 47583, -26664, -296654, 150054, 267694, 178417, -295606, -82756, -279375, -209684, -100465, 101782, 154574, -222053, -309561, 55115, 218236, -378291, 252613, 126120, 271007, -133465, 2447, -253959, 99215, 103857, -326427, 101321, 116433, 119009, -65337, -31378, -245050, 38445, 88873]
17723H8873K75887H5675B5268Q2333b9815A42933B1379M19733c24531C9408b21572
17711B28361j10004b9245H6040a97379C22614A44958a11025C8204a90108b8894
17700b50539J04277f0297B78550q0179d86075D9546K27387A07110f0461K2763
17690c7698D0943j3173O2008C2473a68647C2371h6410m10154h6724I0021j4085
17679G5936b77668B47767I7631h3201j2140B1727J7334J92366c4233E7639B5258
17667B2936a84719A14339J28376A2860i1415j79807D0372a94251B6225R929K49558
17656B85712c15103B70069i6055a5592C6990H547K68828A38107m0111e2603k49499
17645c02102e4186B10065K2304b06400n9518b8484A37106a59992H1801J56885
$$ y = [88873, 364760, 85675, 25268, 107601, -29815, 142933, 21379, 441112, -324531, 39408, -221572, 228361, 118357, -29245, 86040, -197379, 322614, 144958, -111025, 38204, -190108, -28894, -250539, -146262, -60297, 278550, 198371, -486075, 49546, 276933, 107110, -60461, -37698, 40943, 27770, 89778, 32473, -168647, 32371, -86410, -496564, -86724, 90021, 75936, -277668, 247767, 97631, -83201, -95341, 21727, 39061, 231427, -34233, 57639, 25258, 22936, -184719, 114339, 242715, 12860, -91415, -271222, 40372, -194251, 26225, 36154, 285712, -315103, 270069, -96055, -15592, 36990, 8547, 277375, 138107, 97996, -52603, -302102, -54186, 210065, 232369, -206400, -265918, -28484, 137106, -159992, 81801, 238686]
17635B38686R2689B477K4467K99186H9445a05609K7939B32494H4878L05696b03763
17623A27689e0622A98902i1084J2341B83294H4140J66557H4538b15060h269j73258
17612a81527I090J26075c90675J12924c8694n3628A94798a59111L3382D7801J94972
17601B42773C9400J35207b6580H2135e1968j26691B43730j10573J2040K03205
17591C48402b64666h2095k45j48144A12832j975h6958G7311a90560a5052A91673
17579B6270a14071A71977J0639N0025a12998G1919J03100k4135F3554O3760J52969
17568B80283j9024B7580J27761e7999j5268A07259L6293a14360L8817b674q0485
17557h3159I1829d975j24544A18457d2917k8110E0122a90077B05401i3080a9793
$$ y = [238686, 331375, 2477, 26944, 326130, 89445, -105609, -77670, 232494, 84878, 390574, -203763, 127689, -50622, 198902, -91084, -78743, 283294, 84140, 250697, 84538, -215060, -8269, -181527, 9090, 135165, -390675, -277751, -38694, -92322, 194798, -159111, -125729, 47801, 242773, 39400, 174607, -26580, 82135, -51968, -178659, 243730, 133157, 145197, 348402, -264666, -82095, -82340, -230484, 112832, 110857, -86958, 77311, -190560, -15052, 191673, 26270, -114071, 171977, 182616, 232641, -112998, 71919, 175019, 150884, 63554, 127314, 280283, 261259, 27580, 155341, -57999, -73267, 107259, 143552, -114360, -75543, -2674, -83159, 91829, -4975, -129519, 118457, -42917, -71027, 50122, -190077, 205401, -93080, -19793]
17545A44021h1309I7544d0193a2025F8087B5319d2140F1506K0863l0648J42831
17534A94552I3942b72350D0647d9809A58176a2030A02817C0042a08520A17432
17523C7029A5296B491K4540a66282B01070O7711E2669a22441e0727I1204C6964
17511D3196A1174J93663e6146A65855k6965g5786J9616H4012l4118F612J43121
17500A49733k8447A9017R0381K43256p0925a5093B4813M8288J31179h4365a1017
17488B59631G2075J16861o4215b40196d400F4286M1572K32557b6571A63625D9122
17476a38507N3308I5426M551a60191D36853b80029F7219a5513A55714K11579A71451
17464g2520q731H0330r197c63423J69888B35112j3218l1973P1592D1843N67372
$$ y = [144021, -81309, 97544, -40193, -12025, 68087, 25319, -42140, 61506, 82369, 51721, 194552, 93942, -272350, 40647, -49809, 158176, -12030, 102817, 30042, -108520, 117432, 37029, 15296, 2491, 27031, -166282, 201070, 268781, 52669, -122441, -50727, 91204, 36964, 43196, 11174, 204837, -56146, 165855, 138890, -75786, -56170, 84012, 49894, 6612, 149733, 121286, 19017, 109398, 352654, 281729, -15093, 24813, 73101, 204280, -84365, -11017, 259631, 72075, 188936, 124721, -240196, -4400, 64286, 105858, 338415, -26571, 163625, 49122, -138507, -85199, 95426, 99977, -160191, 436853, -280029, 67219, -15513, 155714, 367293, 171451, -72520, -81251, 80330, 71133, -363423, -193535, 235112, 221894, 189921, 261513, 41843, 609215]
17453F09215A64821k6976P654J24058m2639K45824A07526J95564r5210L9066J2134
17442B59080q4672J71446A28970J50164o2332a06301A70877L65272k42101m6988
17432B47060F1863a0270B33877H4429f0801C18412j46345o4793K20664j23783
17422B04155F7337J57823k2951j403C8831K35983K27646B42318n649L7226J17016
17411C90911k8826a82743B72668j12600B9983J54356K2142a26177d9309C60212
17400B44253J63510B5662J24612a13660B6175J46208D0231J63455J87297A55665
17389C42414p6843C0062J52615J05194G9355K18735g6114N192h226o6076f536
17377G9262j3858i3650k11615f9451A65449l3238J35491I5736M2041R4291I4979
$$ y = [609215, 164821, 137845, 145499, 269557, 226918, 472742, 107526, 303090, 207880, 246946, 259080, 174408, 345854, 128970, 279134, 216802, -106301, 170877, 536149, 294048, 247060, 61863, -10270, 233877, 84429, -60801, 318412, 172067, 107274, 327938, 204155, 67337, 225160, 202209, 200806, 38831, 274814, 502460, 242318, 236669, 273895, 390911, 362085, -182743, 272668, 160068, 29983, 184339, 206481, -126177, -49309, 360212, 244253, 407763, 25662, 150274, -113660, 26175, 172383, 40231, 203686, 390983, 155665, 342414, 265571, 30062, 182677, 287871, 79355, 298090, -76114, -70922, -8226, -74302, -6536, 79262, 65404, -93650, -305265, -69451, 165449, 132211, 267702, 95736, 137777, 232068, 94979]
17365a57879a1766A13305J33998O8872O6055a92589A35175K77177D3194M7024
17355I0218D1969a27458A04350C6107d4627j36338D76026B19948k4976M2656c8690
17343b8407B84392c5446B29645M331o8027L13987B13515N5656h4510A12471D9888
17331b23326A82655L24764G4949J71204e7559a366B19291j01704K82635A06564
17320A8178K1445J95738k0438J44174a7795B30161L2195A17542j1675m3041K4078
17309H6904a26498b4512C6290b1306G3392K24477K129N0664q4805a11492A51450
17297B19256b88147A09104L0998e3311G4709a0564B76614E105J14212P5846k6800
17286A68363K7543I7349R7262p9136m4885g27E6320K86034j24287C9562J24827
$$ y = [-157879, -11766, 113305, 247303, 316175, 382230, -192589, 135175, 412352, 43194, 90218, 41969, -127458, 104350, 36107, -44627, -180965, 476026, 219948, 194972, 237628, -38690, -28407, 284392, -35446, 229645, 233976, 165949, 479936, 213515, 269171, -84510, 112471, 49888, -223326, 182655, 507419, 74949, 246153, -57559, -1366, 219291, 117587, 400222, 106564, 18178, 39623, 235361, 214923, 359097, -17795, 230161, 262356, 117542, 105867, 62826, 86904, -126498, -24512, 36290, -21306, 73392, 297869, 299998, 350662, 265857, -111492, 151450, 219256, -288147, 109104, 140102, -53311, 74709, -10564, 276614, 5105, 119317, 195163, 168363, 195906, 97349, 194611, 115475, 70590, -727, 56320, 342354, 218067, 39562, 164389]
17275A64389M2818a03133H0355c2124f250o7291B55156a3674H1668a33454d1185
17263A02187a20411L5921B52573F6206K48976J03781j30054A5879P6355q568J9823
17252A03489K32417A64798D0291a10966D14679A39631M15698B65014M6117F4676
17241A20909J62236j37391k5770J28830J32837n1724E1366L46615H5778J42015
17231B27793o4665i1816A28817K39797c7379D52582A42907L35770A97159O2579
17221B59738b07894C21135o8025K42261k22728P1691J41214A60831Q5404A7444
17210E7031M08524j52365j54459J37979J03842j53516m9543k4775M71074j66214
17200D77578F1957a01547C83582B9240h3553A32119R7010j10558M3523N25498
$$ y = [164389, 207207, -103133, 80355, -32124, -6250, -73541, 255156, -13674, 81668, -133454, -41185, 102187, -120411, -84490, 252573, 66206, 315182, 418963, 288909, 15879, 92234, 83666, 103489, 335906, 164798, 40291, -110966, 414679, 139631, 555329, 265014, 311131, 64676, 120909, 283145, 145754, 119984, 248814, 381651, 329927, 51366, 397981, 85778, 227793, 163128, -91816, 128817, 368614, -37379, 452582, 142907, 478677, 197159, 259738, -207894, 321135, 253110, 495371, 272643, 344334, 485548, 160831, 246235, 17444, 57031, 465555, 313190, 158731, 296710, 400552, 247036, 197493, 172718, 643792, 477578, 61957, -101547, 383582, 29240, -83553, 132119, 229129, 118571, 162094, 687592]
17190F87592k96069K5438b6075A11667n087Q6056K2079J73811j55375k1041M4207
17179B56317J14204J3436L1543m8066C3250J32507L4604L58247E7451J21514h0938
17167C29074j28040J19604p0651K51195A19682J67077n4127r9217p481E8890L60972
17156D19862j11780R122O4540K52164B24956e0756B25643J82262P9522p8383j06451
17145C02593N9364j01711K0546l3744j8608J74392D4008a6864A76180D1337K45814
17134B87151q110K38505j20804J47694F4102h869E2048K27535K72369j70853O779
17123C87878p065j02202M68922C55606K5704D6761M26206o3758A38623N1541A945
17111E41219k42488J846n8731L70929L209j53678I2989l7413J3650L74368j08592
$$ y = [687592, 391523, 416961, -26075, 111667, 106580, 192636, 214715, 388526, 233151, 212110, 256317, 370521, 383957, 415500, 367434, 33250, 165757, 200361, 558608, 57451, 178965, -80938, 329074, 201034, 320638, 249987, 501182, 119682, 286759, 232632, 133415, 125934, 58890, 419862, 308082, 317204, 381744, 633908, 224956, -50756, 225643, 407905, 487427, 409044, 302593, 361957, 260246, 280792, 247048, 228440, 402832, 44008, -16864, 176180, 41337, 287151, 279041, 517546, 396742, 544436, 64102, -8869, 52048, 279583, 551952, 381099, 387878, 380813, 278611, 747533, 355606, 381310, 46761, 472967, 409209, 138623, 190164, 1945, 541219, 298731, 300577, 241846, 612775, 615984, 462306, 92989, 55576, 69226, 443594, 335002]
17100C35002O0509A89297L74665k00622R3196l185q0696L06770B94443J68407
17090D62850B29969P9164L20616J07903J17934C11388K15182B58543J9684j15397
17080A62830P9267k3059L76052K249J06247k54024o1260Q0192k02350K37808J83208
17069F87160l14115J00282Q558J19702j96213K16318J86053C99457j39325J74236
17059D34368l1912j5301J23307J35268j92472J25673B32182J33961K83637p7178
17049E72602m8727o1080J54697l07750q229P645L89740k36001K05480j65102J13429
17038F16704B53968K64069r081j93749M04293J33271j14194C47368N51598l19526
17028E79440R4069j37789j74871K96735K17475k13952j17801k40318K15870k1944
$$ y = [335002, 395511, 189297, 563962, 363340, 456536, 453351, 372655, 679425, 294443, 462850, 229969, 309133, 629749, 737652, 855586, 311388, 526570, 258543, 278227, 162830, 242097, 219038, 595090, 597339, 703586, 449562, 388302, 468494, 266144, 503952, 687160, 373045, 473327, 481885, 601587, 405374, 621692, 807745, 399457, 260132, 434368, 402456, 387155, 510462, 645730, 453258, 578931, 232182, 366143, 649780, 572602, 523875, 462795, 617492, 309742, 301513, 309158, 698898, 462897, 668377, 503275, 616704, 253968, 518037, 508956, 315207, 719500, 852771, 738577, 347368, 898966, 579440, 673509, 535720, 360849, 657584, 875059, 661107, 543306, 302988, 518858, 496914]
17018D96914J95871J86845k97118L96506l04048J12001r6250K6025K13665l54975
17008E75436J76366j5505k803N6775p3150j98367K39164o2587J9277J01965l2518
16997G84053j67691J49623l4976M4939L20595k82820L5120k53216m0970L69200
16987I23857l0331j51298B39182P27802k54790m0589m7041M7539M7385j24386
16977E95102K55443J63876k15812K1142P4480N1894L2212o1919K90756p7371j24125
16966A005678J34981j30030k194k47710K22859k42826K13205K31521k68399O0988
16956I78073J37232k8504j11328l70145O79304m077k37760K87154k31413o8897
16946A029639K58009j77686Q416j81055L16039j14371m22594N43528K1028k47729
$$ y = [496914, 692785, 879630, 582512, 979018, 674970, 786971, 690721, 716746, 930411, 575436, 751802, 736297, 733494, 790269, 717119, 518752, 757916, 695329, 714606, 816571, 784053, 616362, 765985, 731009, 775948, 1096543, 813723, 848843, 595627, 554657, 923857, 893526, 742228, 239182, 966984, 712194, 671605, 624564, 672103, 719488, 595102, 850545, 1014421, 798609, 819751, 894231, 946125, 978337, 916418, 1207174, 1129803, 1005678, 1140659, 1010629, 1008435, 760725, 983584, 740758, 953963, 1185484, 917085, 978073, 1115305, 1086801, 975473, 605328, 1284632, 1280555, 1042795, 1329949, 1098536, 1029639, 1287648, 1109962, 1118378, 937323, 1253362, 1138991, 716397, 1259925, 1280953, 1033224]
16936A033224M95206l31075J76257l4482M0474j72664K40204k52675R8919L6811
16926A330199j64024J44807n3069q8621R4787M21790o9813J33758k1055k23140
16916A505619j9534k12202J66973J62511L8912l47693K9302K19618j3845J38824
16906A668485J20566J86574l96348L69598o2156m4052l10055k8674K56959j76307
16896A584590N23018k24776O5152k58406L08704K07426j02723j82573J56046L14200
16886B390658r6117n75626P48395k61276j85539k41387N64881L6878L2386j23040
16876B290213M90285l22866J36035Q3648r0793K34811k93854p8731L54681j4865
16866B788564l03908M66468j05734J47137l25537K21517k0180L89273m23944L01634
$$ y = [1033224, 1528430, 1197355, 1373612, 1339130, 1379604, 1206940, 1447144, 1194469, 1293388, 1330199, 1166175, 1310982, 1257913, 1169292, 1264079, 1685869, 1616056, 1749814, 1728759, 1505619, 1486085, 1273883, 1440856, 1603367, 1642279, 1294586, 1323888, 1543506, 1529661, 1668485, 1789051, 1975625, 1579277, 1948875, 1886719, 1842667, 1532612, 1503938, 1760897, 1584590, 2107608, 1882832, 1947984, 1689578, 1998282, 2205708, 2102985, 1920412, 2076458, 2390658, 2294541, 1718915, 2467310, 2206034, 2020495, 1779108, 2343989, 2380867, 2413253, 2290213, 2780498, 2457632, 2593667, 2677315, 2586522, 2821333, 2527479, 2448748, 2803429, 2788564, 2484656, 2951124, 2845390, 2992527, 2666990, 2888507, 2868327, 3257600, 2833656, 3135290]
16856C135290j05903O5510K29599k27840K05459n5184L24474j95725R2819K60982
16846C729481j62643K63131j48732K9133K89513L6960L01033m38022J33620o2334
16836C971140O12403j11447R798K48598Q4093j78574L50832k903k8733k35502
16826D719705O48974j01368J04093N5681L23853o00147M43288J92272J2045j70408
16816E627988O96940L62415o48515L79785P73916l10127K53218Q1496K39929j05513
16806G351532N3799O03770L59411l08575N21483j34610K07617P36303j71851J70454
16796I389333L9585M69538K34537J97086K79842J97606K99628M85862L44079N5451
16786A1992547L08164M19236M60617J12764O30647K80639O30902L17771M78697
$$ y = [3135290, 3029387, 3094897, 3324496, 3096656, 3302115, 3246931, 3571405, 3375680, 3468499, 3729481, 3566838, 3829969, 3681237, 3710370, 3999883, 4036843, 4337876, 3899854, 4033474, 3971140, 4583543, 4472096, 4481894, 4730492, 4814585, 4636011, 4986843, 4983940, 4955207, 4719705, 5368679, 5267311, 5371404, 5427085, 5750938, 5150791, 5594079, 5786351, 5798396, 5627988, 6324928, 6687343, 6038828, 6418613, 7192529, 6882402, 7135620, 7217116, 7457045, 7351532, 7405331, 8009101, 8368512, 8059937, 8581420, 8446810, 8654427, 9390730, 9218879, 9389333, 9428918, 9898456, 10132993, 10330079, 10609921, 10807527, 11107155, 11593017, 11937096, 11992547, 12300711, 12719947, 13180564, 13293328, 13923975, 14204614, 14835516, 15153287, 15631984]
16777A5631984K68910Q83170O19050K32283Q35652P85056N38215P22397L92567
16768B0909284Q53962P72082O17780Q99290J253675O84991J237273Q82424J158212
16759B9268973J263731J127791J119213J717975J481929J384934J718733K186368
16751D1269647J679550J670766K215510J987036K473893K331790K814918K891052
16743E9334162L164826L246520L222858L513475L863277M162709M253659M228755
16735H8990241M517096N443438M789968N119848N312809N652645N648763N212898
16727A30687706N498428N217531M555604M627206M165073L768751K556231K002079
16719A63078609J399046O18112m01712j009587k093391k358253l475483m250904
$$ y = [15631984, 15900894, 16784064, 17403114, 17635397, 18471049, 19256105, 19794320, 20516717, 20909284, 21763246, 22535328, 23153108, 24052398, 25306073, 25991064, 27228337, 28110761, 29268973, 30532704, 31660495, 32779708, 34497683, 35979612, 37364546, 39083279, 41269647, 42949197, 44619963, 46835473, 48822509, 51296402, 53628192, 56443110, 59334162, 62498988, 65745508, 68968366, 72481841, 76345118, 80507827, 84761486, 88990241, 93507337, 98950775, 103740743, 108860591, 114173400, 119826045, 125474808, 130687706, 136186134, 141403665, 145959269, 150586475, 154751548, 158520299, 161076530, 163078609, 164477655, 165095767, 164694055, 163684468, 161591077, 159232824, 155757341, 151506437]
16711A51506437m759749m656912m975688n723811n430533n673306n613435n519481
16703A09153522n040747n300772n037717m984451m314720m756872l685403m112439
16695G1920401l451779l275733l574322l026426k955635k319983k667634k695294
16687D7953595k183360j754130k404834j681644k177689j105793j707120j372998
16679C3566027j467706j362120j201896r89622j146953j255075q60946j034600
16671B4247109q82620p99976o70462j106931m76142o87401o99614o50066p55902
16662A7517995q0458q95789m98239m04175q80989J9987p53446j79246k17605n48475
16652A3079560n58042k75267l60798k7868m94725n88405l62856j73155O5252n48452
$$ y = [151506437, 146746688, 142089776, 137114088, 131390277, 125959744, 120286438, 114673003, 109153522, 104112775, 98812003, 93774286, 88789835, 84475115, 79718243, 76032840, 71920401, 68468622, 65192889, 61618567, 58592141, 55636506, 53316523, 50648889, 47953595, 45770235, 44016105, 41611271, 39929627, 37751938, 36646145, 34939025, 33566027, 32098321, 30736201, 29534305, 28544683, 27397730, 26142655, 25281709, 24247109, 23364489, 22564513, 21894051, 20787120, 20310978, 19623577, 18923963, 18273897, 17517995, 17437537, 16541748, 16043509, 15639334, 14758345, 14778332, 14024886, 13845640, 13628035, 13079560, 12521518, 12246251, 11885453, 11857585, 11362860, 10774455, 10411599, 10238444, 10303696, 9755244]
16642I755244L24443o48115l58895P5700m76590R2523p47294K58391j96606k85287
16632G793514l30204K9746l32314J81096p53874L65583l05162m9486k34583j42283
16622F222033J7928l10044q4456j30688q3610m27530L13622k48512j84707j22771
16612D961265L20249n79670L6134j97767J13790R561l1520k58528J62919j37254
16602D399179m58576K32731K04547k49152n2728j37093q2994m50730q9629M49663
16592C765218j80579j29969K00285l61732K8061j77151K14896j19252j08949j7889
16582C112939l01462R9580L52286l54419m04829L42538J4403K7298l60985J09502
16572B636851K29650l63322r0073j00796P4258j2844P9515L29212k14237j65953
$$ y = [9755244, 10079687, 9431572, 9072677, 9148377, 8671787, 8764310, 8017016, 8275407, 8078801, 7793514, 7463310, 7493056, 7160742, 7341838, 6587964, 6953547, 6648385, 6598899, 6364316, 6222033, 6239961, 5929917, 5845461, 5714773, 5631163, 5203633, 5517255, 5268743, 5084036, 4961265, 5281514, 4701844, 4737978, 4540211, 4654001, 4663562, 4632042, 4373514, 4536433, 4399179, 3940603, 4173334, 4377881, 4128729, 4076001, 3938908, 3855914, 3405184, 3315555, 3765218, 3584639, 3454670, 3654955, 3293223, 3321284, 3144133, 3359029, 3239777, 3130828, 3112939, 2811477, 2911057, 3263343, 2908924, 2504095, 2846633, 2861036, 2888334, 2527349, 2636851, 2866501, 2503179, 2413106, 2312310, 2386568, 2373724, 2453239, 2782451, 2568214, 2402261]
16562B402261k6783j11949O598j03634K29167k29709M072j22723m1931l49411
16552A655958J79656M96566l89936O0945J43792l38703K39088j29056m1525J05902
16542A982687j95943k05151J94208m64817M67973k06912K6921J84331j77689k7970
16532A577638J70653K09324m47853q8072L16096l05586o303M62631o40750N8293
16522A306071R1257p6594R9990q4683L56454n65420M16451m28728J30153K43628
16512A488579l17393k14710J70593M27957l41667M00346k8594m65661n894n8799
16502A054757Q1889P7378o5183k708k54442M93365L4556m37141K07780m41096
16492G49155K94891k2386K67561l21304Q6088J40039j45741m96676M92091m35158
$$ y = [2402261, 2375478, 2263529, 2270127, 2166493, 2395660, 2165951, 2170023, 2047300, 2005369, 1655958, 1835614, 2332180, 1942244, 2003189, 2146981, 1808278, 2047366, 1918310, 1876785, 1982687, 1786744, 1581593, 1775801, 1310984, 1778957, 1572045, 1598966, 1783297, 1605608, 1577638, 1748291, 1957615, 1509762, 1421690, 1737786, 1432200, 1425897, 1888528, 1247778, 1306071, 1397328, 1320734, 1420724, 1336041, 1692495, 1127075, 1543526, 1114798, 1244951, 1488579, 1171186, 956476, 1127069, 1555026, 1213359, 1613705, 1585111, 1119450, 1113556, 1054757, 1136646, 1214024, 1148841, 1146133, 891691, 1385056, 1419612, 982471, 1190251, 749155, 1044046, 1021660, 1289221, 967917, 1054005, 1194044, 1048303, 551627, 1043718, 608560]
16482F08560L99945k17519p2982L99221k51386j27577K52070q033P298j74673
16472H14924K46419n01812M70449j89576l7282K00153k70055k2347L83701m03783
16462F90791J77748J11034j89086N6473j02494P8679r5884O9808q5905l5775J84877
16451H60266j55221L01945k14292k84658J62133K68125j21146l64690K7521L61323
16441H41306j05946K50922C91979l3849K93240P3602M8522n5254k15746L27266
16431H29760B68462K57187n0550j84928M64444k95839K49386M1541M0729Q4138
16421H74570A43819L33183K32765q114p9246l2094P9063n1034J00987j96176J25763
16410F48916J5330j29432J06389j81225j20728O8426R3382K04623q8218r632j35152
$$ y = [608560, 1008505, 790986, 718004, 1117225, 865839, 738262, 990332, 982299, 989597, 814924, 1061343, 559531, 1029980, 840404, 803122, 1003275, 733220, 710873, 1094574, 690791, 868539, 979573, 790487, 846960, 744466, 823145, 727261, 797069, 711164, 675389, 860266, 705045, 1006990, 792698, 508040, 670173, 938298, 817152, 452462, 479983, 841306, 735360, 986282, 391979, 358130, 651370, 724972, 773494, 718240, 502494, 829760, 268462, 525649, 475099, 290171, 754615, 458776, 708162, 749703, 790432, 874570, 143819, 477002, 709767, 701653, 622407, 590313, 669376, 618342, 719329, 523153, 648916, 664246, 534814, 641203, 459978, 339250, 407676, 501058, 705681, 617463, 607831, 472679]
16399D72679q77m9246Q7568K11628P6017C39159K8804j36707J65453m8592K23045
16388E71162J15235j65684p2513J40202B61538Q1779K85598B70828k4990L17705
16378E63543j0912L9939M7336C19548J50255R3820k30155M3879R2328m541P6075
16367E41209B47036K41330o3886k05016R9761q7370j06755K31902j10702J24397
16357C70697j27929J58635M2797E4696L14654m2774J50872D083N21365A56705
16346A91326J64209R4424K3287j54586r205O7439N6489a1508C02000J79887e9722
16334C3958L90220L3583n3669J20040J72871B05951r1262J95853o4330J02059
16324C48271A61342J15566Q0869J78358B00198M0855K56000A93353J93J13593
$$ y = [472679, 471802, 422556, 510124, 721752, 797769, 339159, 367963, 231256, 396709, 348117, 571162, 686397, 520713, 448200, 588402, 261538, 343317, 628915, 270828, 245838, 563543, 552631, 592570, 639906, 319548, 469803, 563623, 333468, 377347, 469675, 465134, 541209, 247036, 488366, 424480, 219464, 319225, 231855, 125100, 357002, 246300, 370697, 242768, 401403, 444200, 54696, 369350, 326576, 477448, 4083, 525448, 156705, 191326, 355535, 449959, 473246, 318660, 309455, 376894, 433383, -11508, 302000, 481887, -59722, 33958, 424178, 457761, 404092, 524132, 697003, 205951, 114689, 310542, 246212, 348271, 161342, 276908, 357777, 536135, 200198, 241053, 497053, 193353, 193546, 307139]
16314C07139d3684A62968K14300A86884K09966b1593C93588j68047a3431B85246
16303A2788M76028q2461J75991B77697M9210j48069R7114E8262K01604K06799
16293D66665k5441K06567B5485K50315N166a2159I7369J68930K60829a83340C00348
16281A70832J47068j58184K14617j37389j06302E4604K17394n7006L9195J45910
16271D00097A10891J05739J36436j04274p6766j4087P7007J25022F8139L15737
16261C83876e2365C03121p0768a75808A99464K05037r5000A49951R8529l4682
16251B13798J41503j42534P2790j04852J15794J4102r4703k058m1237l0948J61521
16240C03176c4766A83430c0562B95075j1714j25752a81554e922A32469e1257A41959
$$ y = [307139, -43684, 162968, 377268, 186884, 396850, -21593, 393588, 225541, -13431, 285246, 12788, 488816, 406355, 582346, 277697, 326907, 178838, 275952, 58262, 259866, 466665, 441224, 647791, 25485, 275800, 280966, -12159, 97369, 266299, 527128, -183340, 300348, 170832, 317900, 159716, 374333, 236944, 130642, 54604, 271998, 214992, 254187, 400097, 110891, 216630, 353066, 248792, 172026, 157939, 234946, 359968, 68139, 383876, -52365, 303121, 232353, -175808, 199464, 404501, 309501, 149951, 248480, 213798, 355301, 212767, 285557, 180705, 296499, 310601, 215898, 213840, 172603, 141655, 303176, -34766, 183430, -30562, 295075, 283361, 157609, -181554, -5922, 132469, -51257, 141959]
16228B00568O7606e2047n182B43216D4504b53128H5951e533A26746C9410L2061
16217G1471B1827N6083c3473M480B05489l7961k9543J04557J39680C9765J57414
16206A97179B1815J45903a77j83435b8478D75685l2637A96922b0626C62933A66358
16194C12917I5184L4496Q6115r109L2973I7693K3772m8030e7264a5116A44516
16182I2876R7786J98995G7359f0403B13692j00711J19864p7021K99798j78031
16172B77591j1553c8075B80859G1160L6353b2228G2827a1854A98445c8875B03463
16160a40751C86875A72163a27398B31582p1470b9398j00801A97585a4696B09237
16149b39516A36029O2711a525r3138B73241H9341d9401A53875k7387K01808a86060
$$ y = [200568, 268174, -52047, -57229, 243216, 44504, -253128, 85951, -5533, 126746, 39410, 71471, 21827, 77910, -33473, -28993, 205489, 167528, 137985, 242542, 382222, 39765, 197179, 21815, 167718, -177, -183612, -28478, 475685, 443048, 196922, -20626, 362933, 166358, 312917, 95184, 129680, 215795, 206686, 239659, 97693, 121465, 73435, -57264, -15116, 144516, 92876, 190662, 389657, 77359, -60403, 213692, 112981, 232845, 155824, 455622, 277591, 266038, -38075, 280859, 71160, 107513, -22228, 72827, -11854, 198445, -38875, 203463, -140751, 386875, 172163, -127398, 231582, 160112, -29398, -130199, 197585, -14696, 209237, -239516, 136029, 198740, -1525, -94663, 273241, 89341, -49401, 153875, 126488, 328296, -186060]
16137E4930B5416K38719m6471a18465G4085L0142a85813C18546j22921E7256E635
16125E25828B03191g6823A67502n8929O4352g7059F396J89419f4099A73376K16342
16114C89718j37877h2183C6820K4986B4135a22279J8587C87940j89761H1632M64085
16103E45717j44660j69255K52244E0656d84A22534D3208J62604d8367B4541J17391
16092A41932B2956P5801b56348G1219b38155A94907g01m9168B5340d3603I1003
16080a85505F4381j900M0013e9565A62279a96984G0329J77094l3627j05302c00569
16068H9788f5881j8275j58905b0554G9956a58636C6742L56298i4479M0213H4430
16056C2363e7604A17102b43404k1644d3312a8931A03363l7335a41212D5476A7900
$$ y = [54930, 25416, 264135, 217664, -118465, 74085, 104227, -185813, 318546, 195625, 57256, 5635, 525828, 203191, -76823, 167502, 108573, 172925, -77059, 6396, 195815, -64099, 173376, 389718, 251841, -82183, 36820, 61806, 24135, -122279, -103692, 387940, 198179, 81632, 545717, 401057, 231802, 484046, 50656, -484, 122534, 43208, 205812, -48367, 24541, 141932, 22956, 98757, -256348, 71219, -238155, 194907, -701, -49869, 25340, -43603, 91003, -185505, 64381, 62481, 102494, -59565, 162279, -196984, 70329, 247423, 213796, 108494, -300569, 89788, -65881, -84156, -243061, -20554, 79956, -158636, 36742, 393040, -94479, -54266, 84430, 32363, -57604, 117102, -243404, -265048, -43312, -18931, 103363, 66028, -141212, 45476, 17900]
16044b96042A17740J28701c29046O4995E2542D888K49717l0173a14189j74431
16034b88620A42996b67833j35340i5859b3696D112J76123E3081a9747D1373K1293
16023F2666b27716A879O7791J55092D0065J1512a47678J9322A83546E308c37703
16011D2948M3722P4173J77954H5036a79264B6475b2157j27749F1767B1461a84682
15999A50322K32439b0791m9368A05698a02197M0847o0572B50442a82481g2853
15988A55822J95216a46446c1823B0938K86476A0637M39210A37344K89166f6117
15977B64193H7994D2097b158r0597o40J9730m1329L053k7462B779b8089G2593
15964c3197B70779b43425C1817J48302D4017a44327H1843J39875H7562O5627b62411
$$ y = [-296042, 117740, 246441, -329046, -264051, 52542, 4888, 254605, 224432, -114189, -288620, 142996, -267833, -403173, -95859, -23696, 4112, 180235, 53081, -19747, 41373, 62666, -227716, 1879, 69670, 224762, 40065, 51577, -147678, -128356, 183546, 5308, -337703, 42948, 86670, 160843, 338797, 85036, -179264, 26475, -22157, -149906, 61767, 21461, -184682, 150322, 382761, -20791, -70159, 105698, -102197, -61350, -121922, 250442, -182481, -72853, 155822, 351038, -146446, -31823, 20938, 307414, 10637, 449847, 137344, 426510, -66117, 264193, 87994, 42097, -2158, -92755, -93395, -73665, -114994, -111941, -139403, 2779, -28089, 72593, -33197, 270779, -243425, 31817, 180119, 44017, -144327, 81843, 221718, 87562, 153189, -262411]
15952a01591q1633B82017J78625A43097A136L99444A23739f1703E2545c78838
15941A01972P3561p3398J8990a12074o3105e6287A37361D5126g2503c550k51271
15930b54821A27463B6064a12012l52822a46310c9800k68865A41961p264d5188
15919b06430f5705n835A50528C4770c607G7442K0379N7778b3013r1310k78303
15908c92626J08936d1604k31290a31793E5694j6094a78640L7643n14269G3960
15897b9018m2840k10316J14590B14390i7704K5301j41903A68463b56513F76a12069
15885C1412P5225g3228j0875n259A00217L52123b93803K5078E8488N9712K4293
15874A42493b87794a3318m197k2588j0528C2516J01455F4249c26709c140G821
$$ y = [-101591, -183224, 282017, 460642, 143097, 1136, 400580, 123739, -61703, 52545, -378838, 101972, 175533, 102135, 121125, -112074, -175179, -56287, 137361, 45126, -72503, -3550, -254821, 127463, 26064, -112012, -464834, -146310, -39800, -308665, 141961, 134697, -45188, -206430, -65705, -71540, 150528, 34770, -3607, 77442, 97821, 155599, -23013, -114323, -392626, -283690, -41604, -272894, -131793, 55694, 39600, -178640, -140997, -655266, 73960, -29018, -71858, -282174, -167584, 214390, -97704, -72403, -214306, 168463, -256513, 676, -112069, 31412, 106637, -73228, -84103, -89362, 100217, 452340, -293803, -268725, 58488, 118200, 142493, -287794, -13318, -17515, -40103, -50631, 32516, 133971, 64249, -326709, -3140, 7821]
15862D7970b0725B7180O3285P9714C9868K3313a10496f143H0258J22579b12730
15850f0535a1539A12979n2624g8210a564j94049R2306C54793G2297d7756o3486
15839a11242r501M9914B44318b80048a7564n5742e642j96950P9966J2495B9693
15827a55057A26526d1619J1353E4923a55972b882j91743K3139A0710b84153B27046
15815b51274N3968A59937a71302e5671A416a35599A13382J42690c02448e5128
15804B6776L07667A04757a36248k41515J36476A00929M0913b88483A75408b6072
15793a45871d227n1917B37030B8282a4279k40747J19036A62344D1861B0921a13899
15781c27383B27607b27282k7432N5641l4626g486A21499b63206B39154N9017j31046
$$ y = [47970, -20725, 27180, 90465, 170179, 39868, 63181, -110496, -6143, 80258, 202837, -212730, -60535, -11539, 112979, 60355, -78210, -1564, -195613, -103307, 354793, 72297, -47756, -111242, -120743, -70829, 244318, -280048, -17564, -73306, -5642, -202592, -122626, -110131, 29693, -155057, 126526, -41619, -30266, 54923, -155972, -2882, -194625, -171486, 10710, -284153, 227046, -251274, -197306, 159937, -171302, -55671, 1416, -135599, 113382, 256072, -302448, -55128, 26776, 334443, 104757, -136248, -377763, -241287, 100929, 141842, -288483, 175408, -26072, -145871, -4227, -56144, 237030, 28282, -14279, -255026, -135990, 162344, 41861, 20921, -113899, -327383, 227607, -227282, -254714, -199073, -233699, -7486, 121499, -263206, 239154, 298171, 167125]
15770A67125g940C7812r035L777a29259A17625K50459f6226D13318i0271q2507
15759a72778I0373a51345A65610L131b790B49105q425C3924P6027k4736b33979
15747B71401a8052B36636g3799C2601d19807E6745o410b97196M8491O3821A17712
15735b65400a23349q2240k09885J99120g6075j78204E0478b14796e8525k54885
15725c13410a01976j60708a0778B38633b26097i0857j05928c0966F3332m796l186
15714E5350k6363d3814n3568o8801B10790e1380l5373G7311e4510A3037a7328
15702h2583I9549m6997a06801K4931B91252q4932A4852a94089g0857A79388B9375
15690c7831B89518b23408A63216p1834J7311C608d0828a153m4636k5535b3446
$$ y = [167125, -7940, 37812, 28777, 32554, -129259, 117625, 368084, -66226, 413318, -90271, -172778, 90373, -151345, 165610, 168741, -2790, 249105, 240680, 33924, 109951, 85215, -233979, 271401, -18052, 236636, -73799, 32601, -419807, 56745, 50335, -297196, -248705, -184884, 117712, -265400, -123349, -205589, -415474, -216354, -76075, -254279, 50478, -214796, -58525, -313410, -101976, -262684, -10778, 238633, -226097, -90857, -196785, -30966, 63332, 58536, 55350, 28987, -43814, -97382, -166183, 210790, -51380, -86753, 77311, -54510, 13037, -17328, -82583, 99549, 52552, -106801, -81870, 291252, 206320, 14852, -194089, -70857, 179388, 29375, -37831, 289518, -223408, 163216, 91382, 108693, 3608, -40828, -1153, -45789, -71324, -23446]
15678a74913A4828a33190F3986J57133A02384Q2641b35708a07409E8892b63789
15667B22626a18957G7288A7563b95534A04534b91329e9854A12821b90034a09406
15656C51456A4437a74614A31744n0587h4101k3960p2868A52006a31354c1002A37088
15644b27974c0631H3138L3231a87663e0056D6481K1546i1356A09994g8695B4758
15632a51965A27145a49982E6615a43383A0486J0324K33393d4475I2691b20539
15621A91274F256d147j67344c638j71181j2748j40036j58250A61284c68879A1376
15609b40172a06063B2535a08506j0631o119p8620J1202I3102K61427b20593h270
15597b89781A4804h6825I4084a61207J9516j47086a21799A14535L49j3384J45665
$$ y = [-174913, 14828, -133190, 63986, 221119, 102384, 185025, -235708, -107409, 58892, -263789, 222626, -118957, 77288, 17563, -295534, 104534, -291329, -59854, 112821, -290034, -109406, 351456, 14437, -174614, 131744, 81157, -84101, -108061, -180929, 152006, -131354, -31002, 137088, -227974, -30631, 83138, 116369, -187663, -50056, 46481, 68027, -91356, 109994, -78695, 24758, -151965, 127145, -149982, 56615, -143383, 10486, 20810, 254203, -44475, 92691, -220539, 191274, 6256, -4147, -171491, -3638, -174819, -187567, -327603, -485853, 161284, -368879, 11376, -240172, -106063, 22535, -108506, -119137, -125256, -203876, -192674, 93102, 354529, -220593, -8270, -289781, 14804, -86825, 94084, -161207, -141691, -288777, -121799, 114535, 114884, 101500, 247165]
15586B47165a04770B73949b15444F0824e0812j37131O9917A56452Q1145g8027
15575b16873G8866M028f0234B19236A04878d14859P6627B19752d1751D0277J9267
15564E9544b82636A4514L10136A39862m7415d5568B68227o2217b35887A99487
15553b26126F8616j9125f7193b9915j16191l5438A10398a40953k36739i5189j26471
15542b21660A58022B463b18552e73A61989L4602a14640A33397a61935j56439o2353
15531c80727J35085a644k81081a2091B47486a08203j14030A83943K7140i9366
15520a07286L4658j33639G0598K47145A23837i5730A97619R5748a44121A22695
15509B27222L37f3708a8450j11480A12673m0473j0651P7623J91151a06199k15412
$$ y = [247165, -104770, 273949, -215444, 60824, -50812, -187943, -118026, 156452, 237597, -78027, -216873, 78866, 82894, -60234, 219236, 104878, -414859, -338232, 219752, -41751, 40277, 59544, -282636, 14514, 324650, 139862, 92447, -45568, 268227, 206010, -235887, 199487, -226126, 68616, 49491, -67193, -29915, -146106, -181544, 110398, -140953, -377692, -95189, -221660, 158022, 2463, -218552, -573, 161989, 196591, -114640, 133397, -161935, -318374, -380727, -245642, -1644, -282725, -12091, 247486, -108203, -222233, 183943, 211083, -99366, -107286, -72628, -206267, 70598, 317743, 123837, -95730, 197619, 293367, -144121, 122695, 227222, 227559, -63708, -18450, -129930, 112673, 72200, 61549, 139172, 330323, -106199, -321611]
15498c21611H0723l0917J29960G8540a3034A18050e8475H8759a41798D5939b1195
15486B20876b80128b5725D3751a58209c3175l92164d9196I5976b18761J5142k9507
15475b33126I9224a18632L6049D0525d8167A89619p5329K76275q1706F9405g5417
15463h6615l9153q2054B09404C6860J31148d4017D4426K3974a99027R9501N909
15452i3617K0683B1157b16328a6117r4438B51570p6633i7258A86063b51755g339
15440a42026A70915J98899B3275b14281A19521a25465n279l2147j23378A66651
15429a12889A27593F2113a53760j02329B31500j12408m4382a6814C9513R6986
15419A36499l0877h1741B12578a08413A41820i5649j24876l9270J3465a7633A60742
$$ y = [-321611, 80723, 49806, 179766, 78540, -13034, 118050, -58475, 88759, -141798, 45939, -21195, 220876, -280128, -25725, 43751, -158209, -33175, -425339, -49196, 95976, -218761, -203619, -233126, 99224, -118632, -82583, 40525, -48167, 189619, 114290, 390565, 308859, 69405, -75417, -86615, -125768, -207822, 209404, 36860, 168008, -44017, 44426, 68400, -199027, -99526, -93617, -72934, 21157, -216328, -16117, -110555, 251570, 174937, -97258, 186063, -251755, -7339, -142026, 170915, 369814, 23275, -214281, 119521, -125465, -130744, -162891, -286269, 166651, -112889, 127593, 62113, -153760, -256089, 231500, 119092, 74710, -16814, 39513, 136499, 105622, -81741, 212578, -108413, 141820, -95649, -220525, -259795, -246330, -17633, 160742]
15407a53543K5923B55081b83140a11296O671A01554e2749B2912O832b744A13118
15395E7653c8758k16555A7484a18803k40843a22818B2587c09336Q1745J02431
15385a25160C2488O4732D1046a64381A35361n6090j0898O0739L64624A74897i202
15373A30950a77739A6476d3747k3466G0733d88466A7158M7808J34643d5050j68716
15362b13766A12704a34353M0828j3162M7555f17p7729p1681A23680K1504O07a38973
15349b41928n4558i3030q7723j38877q2477e1092D3736b31435h0858A00057J37383
15338B37440A09467c08626G7813C5847K7392M9827a70586L3159O3986G6205a71966
15326F652a03280A67573n0608F017L09461G7371i6801p0622j73702B25353D9952
$$ y = [-153543, -127620, 255081, -283140, -111296, -104625, 101554, -52749, 22912, 29744, -2744, 113118, 57653, -38758, -255313, 17484, -118803, -359646, -122818, 22587, -309336, -227591, -125160, 32488, 97220, 41046, -164381, 135361, 79271, 68373, 129112, 493736, 174897, -9202, 130950, -177739, 16476, -43747, -67213, 70733, -488466, 17158, 64966, 199609, -45050, -213766, 112704, -134353, -93525, -106687, -59132, -617, -78346, -150027, 123680, 145184, 145791, -138973, -241928, -296486, -93030, -180753, -319630, -402107, -51092, 43736, -231435, -80858, 100057, 237440, 109467, -308626, 77813, 35847, 63239, 113066, -170586, -137427, -73441, 76205, -171966, 6652, -103280, 167573, 116965, 6017, 315478, 77371, -96801, -167423, -341125, 225353, 49952]
15314a33059j8440M549B58548p3674H166a92118D1916a2370A1066c13573a07568
15302A07445C8442A314h7399p356c52o4987C8553J64915a15576A30602a43225
15290B17223c8681I1690a03311r544A08591f0819p3179A4436e6215I4g1274C614
15277a11564C49079A28023M7471a13753C4531J15804A5486a69960d0632A5094
15266E5424J21628a51950b0084B82236g0530B58314E4664P8724N5269e3973B24556
15254I6765J74222I3400b76220B32849K57806N52446J82662k1369J01800m39682
15244H66512k22388A44576e0868A24621O6767G8889g129n1974A93800k7135k134
15233A64531A0778J69926b29062B23852D8390M09368b20660i497C23585a11500
$$ y = [-133059, -151499, -146950, 258548, 184874, 8166, -192118, 41916, -12370, 11066, -313573, -107568, 107445, 38442, 1314, -87399, -94755, -352, -65339, 38553, 203468, -115576, 130602, -143225, 217223, -38681, 91690, -103311, -112855, 108591, -60819, -133998, 14436, -56215, 94, -71274, 3614, -111564, 349079, 128023, 175494, -113753, 34531, 150335, 15486, -169960, -40632, 15094, 55424, 177052, -151950, -20084, 282236, -70530, 258314, 54664, 133388, 188657, -53973, 224556, 96765, 270987, 93400, -276220, 232849, 490655, 1043101, 1225763, 1204394, 1306194, 866512, 644124, 144576, -50868, 124621, 191388, 78889, -7129, -59103, 193800, 166665, 164531, 10778, 180704, -229062, 223852, 48390, 457758, -220660, -9497, 323585, -111500]
15222C14942j19229m2766g5128B02505r2094a09928C54631K920a6822j75048I5378
15210c0408A9396h1282C58461a08543B33774F6300K5364m4679a26524q315A45280
15198A18452k6853h4738k39155a24625E4825i9139A53247m9804M2198a2187j16876
15187a29063I138a8059F4709b9189D9793J95027a30830A48040c31281J47518A90789
15175B8634K20606k6540j9429D2172h3629r3016H3872J64743c5690M520A71293
15163D7795L4079f1438k5704I6177d1226A21245K52587I7280a62446C20999F1136
15151i0459k30020B9293a27256B07276C9614Q4984K22566A55066J67924a02239
15140A20411E1101K77621C0991L22992I1533J15107f5886K3798F5695J92478j06165
$$ y = [314942, 195713, 152947, -75128, 202505, 110411, -109928, 354631, 357551, -16822, -191870, 95378, -30408, 19396, -81282, 358461, -108543, 233774, 66300, 91664, 46985, -126524, -134839, 145280, 118452, 91599, -84738, -323893, -124625, 54825, -99139, 153247, 103443, 145641, -12187, -129063, 9138, -18059, 64709, -29189, 49793, 244820, -130830, 148040, -331281, -183763, 190789, 28634, 249240, 222700, 203271, 42172, -83629, -176645, 83872, 248615, -35690, -31170, 171293, 47795, 81874, -61438, -87142, 96177, -41226, 121245, 373832, 97280, -162446, 320999, 61136, -90459, -320479, 29293, -127256, 207276, 39614, 124598, 347164, 155066, 322990, -102239, 120411, 51101, 328722, 30991, 353983, 91533, 206640, -65886, -42088, 65695, 258173, 152008]
15129A52008m7326J87473A18294K30511e5297A43194L1317K15751h1467a8861
15118a63085A82808J00981a52033r4550A63574b19713N6611B53205A00019J3642
15108A13661l8466l0701J79790k4058K5918L3687A3672J8214J95978r0628a285
15096G8178b22181h2072j01875A00306K11246j20542M9076j05639b1947B18457
15085A36780N8590L4544A03719L10628B8912K19841E053c9241B13930J70486q6803
15074B97613n7655K21664G1123O2541B0235b18598A68995e0173l6779E2462O0293
15063A12755O971R0718q77K34835F2251c5739M301A41788C9622J4994K89J4643
15051F9548C801L399N6137M42127H2510f8913I0554L2770a43194N7139G5873K5461
$$ y = [152008, 104682, 292155, 118294, 348805, -55297, 143194, 174511, 390262, -81467, -18861, -163085, 182808, 283789, -152033, -246583, 163574, -219713, -163102, 253205, 100019, 113661, 75195, 44494, 224284, 200226, 226144, 259831, 13672, 31886, 227864, 137236, -1285, 78178, -222181, -82072, -183947, 100306, 311552, 191010, 240086, 134447, -21947, 218457, 136780, 195370, 229914, 103719, 414347, 28912, 248753, 5053, -39241, 213930, 384416, 297613, 239958, 461622, 71123, 133664, 20235, -218598, 168995, -50173, -86952, 52462, 112755, 119726, 210444, 209567, 444402, 62251, -35739, -31438, 141788, 39622, 54616, 54905, 69548, 3801, 7200, 63337, 505464, 82510, -68913, 90554, 123324, -143194, -86055, 75873, 101334]
15039A01334J07609M5308L62987A70357N8623j01669K0918J16208R9054j60105
15029B03386J08167K2557B8658J95833r2573J08865R2145G3122K32716A22614
15018D44675A40487a03557G9045P693K98864F1270M5574K30815L8228N6295j27084
15007C05098D8485b7141A33832l5408a96427D4670K22227B0099J81643k7647L3395
14996B07490Q3418a35838p681A18189K67257o0083n8137K00901A94956O474B3351
14984C8730b2538i449B83348K68998B7168L39104A27503D3459K03379O0448o4226
14973B43060A13861J62723k6677j7208K32997J62200H0594K43687A42960C2361
14962A36033P7668K3309K26753B14350O8802R2129I7114K3015A3635J365L85020
$$ y = [101334, 208943, 254251, 617238, 170357, 228980, 127311, 148229, 264437, 363491, 203386, 311553, 334110, 28658, 224491, 131918, 240783, 332928, 73122, 305838, 122614, 444675, 140487, -103557, 79045, 86738, 385602, 61270, 106844, 337659, 375887, 432182, 305098, 48485, -27141, 133832, 98424, -196427, 44670, 266897, 20099, 201742, 174095, 207490, 290908, -135838, -143519, 118189, 385446, 325363, 267226, 468127, 194956, 201430, 23351, 38730, -22538, -9449, 283348, 552346, 27168, 366272, 127503, 43459, 246838, 307286, 243060, 113861, 276584, 249907, 232699, 465696, 627896, 80594, 324281, 142960, 32361, 136033, 213701, 237010, 463763, 214350, 283152, 375281, 97114, 120129, 13635, 15000, 400020]
14951D00020A60567M2138r0770K68019G0782K78813I4188L14811j44415j13355
14941A51229K11736j42697Q5019l43A28203p754a2740I4292K38183A55353O02280
14930G57633B40549a12765A989L92226A95049J36959R6652A11723L32156j56043
14920B87836J88212q4831j75681J87051E9242J52136J98828j88641n3240K28486
14910C96811q0737a59908B74739J72541Q3710B14498r8098L18945L3328q9194
14900C79479j77218a50730H3208K46920K08281B57093j27003Q4286J23684q998
14890C29062r7684M7803A16048J37436m8675E5584k7076K74250J10651R238J9032
14879D41679j93844L81765j75928k10194J48232r5936A24589O420N89240l00362
$$ y = [400020, 160567, 202705, 111935, 379954, 70782, 349595, 94188, 408999, 264584, 151229, 362965, 220268, 305287, 304944, 128203, 120449, -12740, 94292, 332475, 155353, 757633, 240549, -112765, 1989, 394215, 195049, 332008, 428660, 111723, 443879, 287836, 476048, 391217, 215536, 402587, 59242, 211378, 410206, 221565, 168325, 396811, 316074, -159908, 274739, 447280, 530990, 214498, 116400, 435345, 468673, 379479, 202261, -150730, 83208, 330128, 538409, 257093, 130090, 214376, 338060, 329062, 231378, 279181, 116048, 253484, 204809, 55584, 28508, 302758, 413409, 422647, 441679, 247835, 629600, 453672, 243478, 391710, 295774, 124589, 131009, 720249, 419887]
14869D19887E4725K97162M0936A48366N58323k13939B14549J75052j63625R8631
14859C24607A43542l7971K10170R5301j8892A81619K52994K5336k20149J2101
14849B51901J79659q0096M6579j38860J67734A90655M05901j43214P05l9625j4791
14838C99631A84567M81253j46854p7997A84802K93591j66812L03209k30966R7620
14828D81444j47138j14044J09453r9717O7736J77652J23270j09104n040j85152
14818B99360K93508A71389L32248j99886J46041J52463k06917K91197D1955M02404
14808D44359L36875l07562j62905L20899j88037A96280K43397J95351A99837N10746
14798G10583B89970N10286j39870j06612q6072K5954k15383L87377p3174K84300
$$ y = [419887, 54725, 351887, 392823, 148366, 706689, 492750, 214549, 389601, 225976, 324607, 143542, 105571, 315741, 411042, 392150, 181619, 434613, 459949, 239800, 251901, 431560, 351464, 398043, 259183, 426917, 190655, 596556, 453342, 454047, 414422, 399631, 184567, 665820, 518966, 440969, 184802, 478393, 311581, 614790, 383824, 481444, 334306, 220262, 329715, 229998, 297734, 475386, 598656, 489552, 484512, 299360, 592868, 171389, 503637, 303751, 449792, 602255, 395338, 686535, 41955, 444359, 781234, 473672, 310767, 631666, 443629, 196280, 439677, 635028, 199837, 710583, 289970, 800256, 660386, 553774, 467702, 493656, 278273, 665650, 592476, 876776]
14788H76776q775l67888P4196k35786K26295m0391J675L8598O2577j83146K65510
14777G09641o4537j94540J64663B36182K20762l4806J80443A96123J22572M16873
14767G35568m808l41950K2261K02197k77566J79931j75464J62690L3128j85989
14757C49998N04779j82406o1892k10324K90501J49346k50799q7977P5223k31012
14747C45437P57J04721M9905J06604J9771Q8515r0908j25806L37694l93636R3946
14736E37000j05256K0451J24423K66862k5917l38384K35253K93335m16368L44544
14726I35943Q6069k86735J22854p1356J3046k78514K30867J24066l04495N8780
14716F30525k36985L51963j72096K13237j90358k61800N56762L864P147j36504
$$ y = [876776, 868001, 500113, 574309, 338523, 564818, 524427, 526102, 564700, 627277, 444131, 709641, 645104, 450564, 615227, 236182, 456944, 422138, 602581, 196123, 318695, 735568, 730760, 388810, 411071, 613268, 335702, 515633, 340169, 502859, 535987, 349998, 854777, 672371, 610479, 400155, 690656, 840002, 589203, 501226, 576449, 345437, 346194, 450915, 500820, 607424, 627195, 715710, 624802, 498996, 836690, 443054, 537000, 431744, 452195, 576618, 843480, 817563, 479179, 714432, 1007767, 591399, 935943, 1022012, 735277, 858131, 786775, 799821, 521307, 752174, 876240, 571745, 630525, 393540, 745503, 573407, 786644, 596286, 334486, 891248, 895112, 902259, 765755]
14706G65755k11318J25737J23098k90834L34443M01291E90840K33551L33864k27332
14696I30923j44721n9067k05882N34866N513k2717n1490j93057P9813p1385o7680
14685G35116K17831Q9778j88200J78965j04518r3522l2203o8837m6944L18949
14675A006415j00955k34128O0803J88690j55480j21002M74308j47276j18063K01174
14665A054486q5754k4051L40034r7660k61658p6158J34288j48451L39347r4785
14655A079638J63390m16023K40363M4098k31132J96422l00662K58175K72568m95213
14645H11624J10794J09930K24514q2930r5088n49J63748M158r8148r4807Q9070
14634A142316L47429m25661L77239k10469J41479j41739l10256R4577K25618R1837
$$ y = [765755, 554437, 680174, 803272, 512438, 846881, 1248172, 590840, 824391, 1158255, 930923, 786202, 727135, 521253, 1056119, 1061632, 1038915, 987425, 794368, 874181, 802796, 735116, 952947, 1042725, 854525, 1033490, 928972, 835450, 803247, 734410, 687466, 1006415, 905460, 671332, 732135, 920825, 765345, 644343, 1118651, 971375, 853312, 1054486, 968732, 944681, 1284715, 1187055, 925397, 849239, 983527, 835076, 1174423, 1079638, 1243028, 827005, 1067368, 1111466, 880334, 1076756, 776094, 1034269, 1306837, 811624, 922418, 1032348, 1256862, 1173932, 1078844, 1078295, 1242043, 1246201, 1148053, 1053246, 1142316, 1489745, 1064084, 1441323, 1230854, 1372333, 1230594, 920338, 1014915, 1240533, 1332370]
14624A332370O583r6161J42329j5642k89733m5482M31472j80710j4573L79954
14614A650407k60763n1593k87918O09343m83833K99045k58530K71383j229L5190
14604A521502K54732m63189O7840p2775L80940p9112k67202O141K36963J19326
14594A705166k58473K47832j49221N26219m38131o3886J86556o7908P0811J202
14584A760167k65651N91649k73252L43857m09689J9800o5425m416J49802J0935
14574A857777p3100R0738K97668K48728k36903k89957k3689M83322j44301K24240
14564B434523m84033O35681m02594K40807j14667K43852J43998J4829O1910K29404
14554C003710L87127K22330M44101P33553J077294K694798M760449Q204237J5665398
$$ y = [1332370, 1338953, 1242792, 1385121, 1369479, 1079746, 1034264, 1465736, 1285026, 1270453, 1650407, 1389644, 1338051, 1050133, 1659476, 1175643, 1474688, 1216158, 1487541, 1486312, 1521502, 1776234, 1313045, 1380885, 1308110, 1689050, 1609938, 1342736, 1348877, 1585840, 1705166, 1446693, 1694525, 1545304, 2071523, 1633392, 1569506, 1756062, 1688154, 1758965, 1760167, 1494516, 2086165, 1812913, 2156770, 1747081, 1766881, 1701456, 1697040, 1846842, 1857777, 1784677, 1875415, 2173083, 2421811, 2184908, 1894951, 1871262, 2354584, 2210283, 2434523, 1950490, 2586171, 2183577, 2424384, 2309717, 2553569, 2697567, 2712396, 2774306, 3003710, 3390837, 3613167, 4057268, 4790821, 5868115, 8562913, 13323362, 21527599, 37192997]
14545C7192997R24123j8134070I013134m116396j912761q34400R726k35353o2308
14536A861642n6757j52416L35650M4417n2302l6080j54112M37823j44265M19196
14526B502796l00048J15739k26471J41615J28439J01103J8577J73799q3563R7890
14516B669876k31350j15656J52314L22560k46065m4493J72016j61855L31498k25672
14506B623173J14999M862J46724j1552J52728k76236J04497j1398K63299p3355
14496C037741J90446j85324l864J60050m10985M99179j77906J38660M72565k78017
14486C442545k03820K89640l1569K2683K83123m9364m61478N01518R3047l4255
14476C852070N6870k26535L22973k47210M96926k36228O0886P1264K62995K10633
$$ y = [37192997, 38117120, 19983050, 9013134, 4896738, 2983977, 2149577, 2159303, 1923950, 1861642, 1804885, 1652469, 1988119, 2032536, 1980234, 1944154, 1790042, 2227865, 2083600, 2502796, 2202748, 2318487, 2092016, 2233631, 2362070, 2463173, 2481750, 2655549, 2571986, 2669876, 2438526, 2322870, 2475184, 2797744, 2551679, 2507186, 2679202, 2517347, 2848845, 2623173, 2738172, 2743034, 2889758, 2878206, 3030934, 2754698, 2859195, 2847797, 3111096, 3037741, 3228187, 3042863, 3038999, 3199049, 2788064, 3287243, 3109337, 3247997, 3720562, 3442545, 3238725, 3528365, 3496796, 3519479, 3802602, 3753238, 3291760, 3793278, 3886325, 3852070, 3908940, 3682405, 4005378, 3758168, 4255094, 4018866, 4079752, 4151016, 4414011, 4624644]
14466D624644j70129r2418K3546l15162O37990K01838j92905K3066O6290j17563
14456D689197M86925k43420L20932n00421M28941j21487j09810N31105O692o6336
14446E422318k71470J48298L30051N2024K3030q7505L31019J7206R037Q0710Q9992
14435F144710J75849K32617K19902n04109M38615j49029K31203J37853k29179
14426F698432K4440O23092J28368m4291j49777J27273P1925M85325k98074O3427
14416G730140J95147M25597k08658K40094M91401o24112K19481L67285K05747
14407I042122j25236O56839j8424L29412j94602p555L14674K66326n3397O35393
14397A0845552k12547R0618J80629R2775K26190J45196N01768J52786M0387K53063
$$ y = [4624644, 4454515, 4362097, 4385643, 4070481, 4708471, 4910309, 4717404, 4740470, 4806760, 4689197, 5176122, 4932702, 5253634, 4753213, 5182154, 5060667, 4950857, 5481962, 5488654, 5422318, 5150848, 5299146, 5629197, 5681221, 5704251, 5616746, 5947765, 5964971, 5974008, 6054718, 6144710, 6320559, 6553176, 6773078, 6268969, 6707584, 6558555, 6789758, 6927611, 6698432, 6722872, 7345964, 7474332, 7430041, 7280264, 7407537, 7479462, 7964787, 7666713, 7730140, 7925287, 8350884, 8142226, 8382320, 8873721, 8249609, 8469090, 8836375, 9042122, 8916886, 9573725, 9555301, 9884713, 9690111, 9682556, 9997230, 10263556, 10210159, 10845552, 10633005, 10723623, 10904252, 10997027, 11223217, 11368413, 11870181, 12022967, 12063354, 12316417]
14387A2316417N85337O1015N61012j83627L58028n7615L08421O05124j22374K10952
14377A4642690M41158N32881J91002M83578J38882K85816O89925M02096k16433
14368A7591595N07209N38784N33836K17582O39392K38313M84025O85785K53376
14359B1689897K10610O13165Q54865J17787P85674L65239Q02480K92882Q21734
14350B6554333O57642O70180O37018P26416R57043O30980J029295N88701J052383
14341C3503991R91605R33044Q90080R18217R93537J403431J175265J111401J576241
14332D3496812P15416K067610J146460J463621J597151J869096J645610J783344
14324E5785120J699060K103457K453560J680428K368499K682874K992095K236736
$$ y = [12316417, 12901754, 12962769, 13523781, 13340154, 13698182, 13640567, 13948988, 14554112, 14431738, 14642690, 15083848, 15616729, 15807731, 16291309, 16430191, 16716007, 17405932, 17808028, 17591595, 18098804, 18637588, 19171424, 19389006, 20028398, 20266711, 20750736, 21436521, 21689897, 21900507, 22513672, 23368537, 23486324, 24271998, 24637237, 25439717, 25732599, 26554333, 27211975, 27882155, 28519173, 29245589, 30202632, 30833612, 31862907, 32451608, 33503991, 34495596, 35428640, 36318720, 37236937, 38230474, 39633905, 40809170, 41920571, 43496812, 44212228, 46279838, 47426298, 48889919, 50487070, 52356166, 54001776, 55785120, 57484180, 59587637, 62041197, 63721625, 66090124, 68772998, 71765093, 74001829]
14316G4001829L068842L007692K836134L549696L414094L828109L965801M062299
14308A01734496M624116M673679M873319N195181N720741N435322O572318O660038
14300A45489210O721523P360991Q083085Q477906Q776235R507683R818691J0343642
14292B14578966J1139163J1521909J2359111J2263913J3434671J3902201J3932017
14285C03131951J4627763J4407314J5089102J4596227J4792997J4294991J3464938
14278D04405283J2849715J1616051R844011P675596L367771n62909j813583j633595
14270D45748340j349524m268162n619097o711819p922031r991969j1367570j2992929
14262C85525239j4255057j4885013j5608183j5608360j5504718j5140367j4480044
$$ y = [74001829, 77070671, 80078363, 82914497, 86464193, 89878287, 93706396, 97672197, 101734496, 106358612, 111032291, 115905610, 121100791, 126821532, 132256854, 138829172, 145489210, 152210733, 159571724, 167654809, 176132715, 184908950, 194416633, 204235324, 214578966, 225718129, 237240038, 249599149, 261863062, 275297733, 289199934, 303131951, 317759714, 332167028, 347256130, 361852357, 376645354, 390940345, 404405283, 417254998, 428871049, 438715060, 446390656, 449758427, 449195518, 447381935, 445748340, 444398816, 440130654, 434511557, 427799738, 419877707, 409885738, 398518168, 385525239, 371270182, 356385169, 340776986, 325168626, 309663908, 294523541, 280043497]
14255B80043497j3653110j3177607j2704829j2185284j1981475j0675492j0048020
14248A95617680r921285r177679q567308q161022p373251p118607p037792o368981
14240A31891755n984333n495079n049831n081580m733486m426873m154769m151821
14232I2813983l547884l103936l376371l695090k766051k954277k583756k666175
14224F8120443k201124k463745k266613k191116j362124k215152k111548j510599
14216E1798422j875568j255794j323949j201580j718416j538338j239567q70398
14208D0774812j265899j019706p76293j206137j085692o66919j218251o31976
14200C2903939q57098q36558q33435j278289m56267n93484o35939o59509r98213
$$ y = [280043497, 266390387, 253212780, 240507951, 228322667, 216341192, 205665700, 195617680, 185696395, 176518716, 167951408, 159790386, 152417135, 145298528, 138260736, 131891755, 125907422, 120412343, 115362512, 110280932, 105547446, 101120573, 96965804, 92813983, 89266099, 86162163, 82785792, 79090702, 76324651, 73370374, 70786618, 68120443, 65919319, 63455574, 61188961, 58997845, 57635721, 55420569, 53309021, 51798422, 49922854, 48667060, 47343111, 46141531, 44423115, 42884777, 41645210, 40774812, 39508913, 38489207, 37712914, 36506777, 35421085, 34754166, 33535915, 32903939, 32046841, 31210283, 30376848, 29098559, 28642292, 28048808, 27412869, 26753360, 25755147]
14191B5755147m36625j13686j061046l84473q24379k91528n83290n12723l61824
14182B1185573o00524k84600n14021l65493m36660n81974J21251p51466j38123
14173A7633963m01357n26397N799k65067n14046l05635n83907N7989r6478k38567
14163A4766297k02989m28806n71966M7257o98436K28684k86923m06015j4145k71820
14153A2161138j58212j85927j06316k89522j8800j17471k96463l91253O6469l82174
14143A0281469j99320O0686r1542m42761K5092l23215M3789l71241N5255m7222
14133H990990k12443j56004o7526j95374J4437j23440M2910k97298K66990n93055
14123G670187N6157N1930k73464o3264m05277M24701m02139K12799n43287J54128
$$ y = [25755147, 25318522, 25204836, 24143790, 23759317, 22934938, 22643410, 22060120, 21547397, 21185573, 20585049, 20300449, 19786428, 19420935, 18984275, 18402301, 18523552, 17772086, 17633963, 17232606, 16706209, 16712008, 16446941, 15932895, 15627260, 15043353, 15101342, 15004864, 14766297, 14563308, 14134502, 13562536, 13609793, 12911357, 13140041, 12853118, 12447103, 12432958, 12161138, 12002926, 11816999, 11710683, 11421161, 11402361, 11284890, 10988427, 10597174, 10663643, 10281469, 10082149, 10142835, 10051293, 9608532, 9633624, 9310409, 9354198, 8982957, 9038212, 8990990, 8778547, 8622543, 8555017, 8359643, 8374080, 8250640, 8293550, 7996252, 8263242, 7670187, 7726344, 7778274, 7504810, 7441546, 7036269, 7460970, 7058831, 7271630, 6728343, 6882471]
14113F882471l63275K6728J77192k37910l26675m3611p4732K18925k85818m6403
14103E926892l7853j19123L79623m39155J61484l54239k32707L14001k6865k31520
14093E340538N6753k32340M2423L3104p9275m11592L81706j44012q0218k82952
14083D624135m4632j89534M07064m68222M07626k51621j83876j00926J87657k88356
14073D099315k9911K33232m64670K09507m1880k6354j88971k32584J89492J67356
14063C914532J54715q735l16469M2488K5563O0006j59564J8360j01411K63397
14053C892882k69234k98660K39032j44169r3099j82162p640k6840j0692J39394
14043C238812k40453J40856K75786l83781j04920K70198k10083m49323M36355
$$ y = [6882471, 6519196, 6545924, 6723116, 6485206, 6158531, 6114920, 6040188, 6259113, 5973295, 5926892, 5889039, 5769916, 6149539, 5710384, 5871868, 5517629, 5284922, 5598923, 5572058, 5340538, 5397291, 5164951, 5207374, 5240478, 5161203, 4749611, 5131317, 4987305, 4907087, 4624135, 4579503, 4389969, 4797033, 4328811, 4736437, 4484816, 4300940, 4200014, 4387671, 4099315, 4069404, 4302636, 3837966, 4047473, 4005593, 3979239, 3790268, 3557684, 3747176, 3914532, 4069247, 4060512, 3744043, 3786531, 3812094, 3872100, 3712536, 3730896, 3629485, 3892882, 3623648, 3324988, 3564020, 3419851, 3326752, 3144590, 3136950, 3110110, 3099418, 3238812, 2998359, 3139215, 3415001, 3031220, 2926300, 3196498, 2986415, 2537092, 2973447]
14034B973447K9964j61306l2214K51961k96795M73895l69620j02222J5101L90363
14024C172574j28236l82365J33840m7798j64725N99m48702N13719k6290k34760
14014B387856J05641J27386n84795O90161k39801j28147Q572l15045K24164k81727
14004A994265K50823p8253m3440j40446L84089n74873N40366k32300J76425J45050
13994B421706k08223J00635r0322L11679Q87539J531838L336519O950531J5278722
13985C0520624P964052j4552017j0360336n290092k213638j261961o81738p55695
13977C369199k32868N9786k85057n42001K45710k06768n433L57295l37200N9229
13967B481892L3539m84168N58274l76704j80435k577k11371K37757J70824l67582
$$ y = [2973447, 3003411, 2842105, 2809891, 3061852, 2765057, 3238952, 2869332, 2767110, 2782211, 3172574, 3044338, 2661973, 2795813, 2748015, 2583290, 2583889, 2135187, 2648906, 2622616, 2387856, 2493497, 2620883, 2036088, 2726249, 2486448, 2358301, 2366873, 2051828, 2275992, 1994265, 2245088, 2166835, 2123395, 1982949, 2367038, 1792165, 2332531, 2100231, 2276656, 2421706, 2213483, 2314118, 2223796, 2535475, 3423014, 4954852, 8291371, 15241902, 30520624, 38484676, 23932659, 13572323, 8282231, 6068593, 4806632, 4124894, 3369199, 3136331, 3196117, 2911060, 2369059, 2614769, 2408001, 2402568, 2759863, 2422663, 2481892, 2515431, 2031263, 2589537, 2212833, 2032398, 2029821, 1818450, 2056207, 2227031, 1859449]
13957A859449j1341K19274j91715J63414q1216N2025j24811j14148j09870J33394
13947A794455j5710R8336k45414K4886j22330N6435k426J36403j31802N898P1700
13936A670431n7427k8128j00298M9411M49705j61564j72423j61516J32007j43472
13926A476726j11663J44481K20438k49514L75850k00230k04869J4039k7370M138
13916A442026M4954k50086K46571o863J34619k70083J28534M9769n66076N38127
13906A491492k55339K18779M0227P7948j47385n87733N88097k79785J26648j286
13896A271663l5444J11828P201k5034j3191J5500l13430J89749k1915J60117j30017
13885A217027N2992p8348j15089K032J84115J05467l80096J31100r0307j17480
$$ y = [1859449, 1848108, 2067382, 1875667, 2039081, 1957865, 2009890, 1885079, 1770931, 1661061, 1794455, 1778745, 1877081, 1631667, 1656553, 1534223, 1590658, 1588232, 1724635, 1592833, 1598731, 1670431, 1613004, 1584876, 1484578, 1533989, 1983694, 1822130, 1649707, 1488191, 1620198, 1476726, 1365063, 1509544, 1729982, 1480468, 1856318, 1656088, 1451219, 1465258, 1437888, 1442026, 1486980, 1236894, 1483465, 1476602, 1611221, 1341138, 1469672, 1519441, 953365, 1491492, 1236153, 1454932, 1495159, 1573107, 1425722, 837989, 1426086, 1146301, 1272949, 1271663, 1236219, 1348047, 1355248, 1330214, 1317023, 1332523, 1019093, 1208842, 1186927, 1347044, 1217027, 1270019, 1191671, 1076582, 1078614, 1262729, 1368196, 988100, 1119200, 1028893, 911413]
13875I11413O9799K13999q6272p7616j84574K94771K02939o9691m74397K25314
13865A025685J54804k76878J54774N4803l5842j69752J12404J6381k31058K20824
13855A026145P8767j70284P1081j13191O4455N9251k77471K38974j61721K52426
13845A068432j56154n5380L33442l65414J12310J68833m5359L6440n01357J93331
13835G89124R7670j67243J79279j1927L7415j71769K27532l63360K45035N8108
13825I19864l28583m527L45937K01699p4927J3710j04232J5248J17210n7146L5413
13814A079666k98293M63560o02645J92173q5145k357j18443K60495r0036j25232
13804F73743l20511K39459L16471J72917k59329j29556L50449l4350j12067K8062
$$ y = [911413, 981212, 1195211, 1108939, 1031323, 846749, 1141520, 1344459, 1274768, 800371, 1025685, 1180489, 903611, 1058385, 1113188, 1077346, 907594, 1019998, 1036379, 805321, 1026145, 1104912, 934628, 1005709, 892518, 956973, 1016224, 738753, 977727, 816006, 1068432, 912278, 856898, 1190340, 824926, 937236, 1106069, 1060710, 1097150, 595793, 789124, 886794, 719551, 898830, 886903, 924318, 752549, 980081, 616721, 861756, 919864, 591281, 586754, 932691, 1134390, 1059463, 1073173, 968941, 984189, 1101399, 1044253, 1079666, 781373, 1244933, 642288, 834461, 749316, 746959, 628516, 889011, 798975, 673743, 353232, 592691, 909162, 1082079, 822750, 693194, 1043643, 1009293, 897226, 925288]
13794I25288j05561q2011j90313K035K78892j37633Q631P1189l789J00701k28330
13783F39099K62632k22070K6717j26623J18254J09805J03821j65706M8632o9923
13773G24638M1576J31156n7729J88957k45047J54946k13571k2224J67316P95B34482
13761C40712K71792j07714K5062J34545K73394k02929k01320j13627L61477l42461
13751D38931O1724K19122J8283l07643J68336n0845k24788M21679C04821M80165
13741G84986m6301j56606n3508J94198l9839j71162N1191n8161K63741k84399
13731D84140L22537C49696R7823L85615k34471k6036j5647K4043l3403m2983m6632
13720D58005j4001J64813o230J38877o112l5392l39088m1297L49387l0855j11475
$$ y = [925288, 819727, 737716, 547403, 549438, 828330, 690697, 699328, 770517, 766728, 867429, 639099, 901731, 679661, 706378, 579755, 698009, 807814, 911635, 745929, 794561, 724638, 766214, 897370, 839641, 1028598, 783551, 938497, 724926, 702702, 870018, 870813, 234482, 340712, 612504, 504790, 529852, 664397, 937791, 734862, 533542, 419915, 781392, 438931, 500655, 719777, 738060, 430417, 598753, 547908, 323120, 744799, 304821, 784986, 738685, 582079, 528571, 722769, 682930, 511768, 562959, 504798, 768539, 484140, 806677, 349696, 447519, 833134, 598663, 572627, 556980, 581023, 547620, 504637, 458005, 444004, 608817, 602587, 741464, 735352, 699960, 360872, 319575, 668962, 638107, 526632]
13709E26632k61059K02552K39815k46300N91794l31665k08772J99745C00199M71652
13699G71851j43965j03164j27936l6811J23046p6601P0575J88118B98068O6043
13689C64111A4384L71658L71182l6612l12675K55136j99853m1482M9453j19132
13679C52059K10362k58949M2236J38398n8049j7419j23556J46937k08528J34096
13669C57587K23861k30732L55259B03069D2912N86448J29454C31375L38486j22092
13659E47769p0693B26344L11232j43312j29194k5023N40453k35802B02134K4232
13649B26366A00848M53787j35518l7876j22750L65305k13084j61034K63568J31877
13639F45123A72312J27190m5407N0775n3469j3536J53367P4743h527C02089j47889
$$ y = [526632, 265573, 468125, 707940, 461640, 1053434, 721769, 512997, 712742, 300199, 771851, 627886, 524722, 396786, 359975, 483021, 406420, 476995, 665113, 298068, 364111, 14384, 386042, 757224, 720612, 407937, 663073, 463220, 421738, 471191, 352059, 562421, 303472, 345708, 484106, 426057, 408638, 285082, 432019, 223491, 357587, 581448, 350716, 705975, 203069, 42912, 629360, 758814, 331375, 669861, 547769, 477076, 226344, 537576, 394264, 265070, 240047, 780500, 544698, 202134, 226366, 100848, 554635, 419117, 381241, 258491, 623796, 410712, 249678, 513246, 645123, 172312, 299502, 254095, 304870, 251401, 237865, 391232, 465975, -8527, 302089, 154200]
13628A54200K64062N2605M8890q4221j65227j1171J80820m7270J01621J08832
13618F03141B21390L03269B37760J22902N1286K8606K10406l08715Q7310q7605
13608C41950O6505B9455L13446j44984P9406K0965j13709J62881K06000j01037
13598D52423A46479L73141A33860M81737k43678L3317A22650K30951j27168e9387
13587D5559O15341j88622l1887K1112j66119p7297q1458M69021j08701B19464
13576D13935A89986R3925h8926D28529j97719J75249a94277E10304k43679L31932
13566E98557j84768O4372j57111J32306A80446K64070A86045J61278k4515Q4087
13556D06895j70654k22J00726K11110B26602J64324j4248j74006Q7791J15104
$$ y = [154200, 418262, 470867, 519757, 435536, 270309, 259138, 439958, 392688, 494309, 603141, 221390, 524659, 237760, 360662, 411948, 440554, 650960, 342245, 429555, 341950, 408455, 29455, 342901, 197917, 277323, 298288, 184579, 347460, 553460, 452423, 146479, 519620, 133860, 615597, 371919, 405236, 122650, 353601, 226433, -59387, 45559, 660900, 472278, 440391, 461503, 295384, 218087, 136629, 605650, 496949, 219464, 413935, 189986, 283911, -88926, 428529, 230810, 406059, -194277, 510304, 266625, 598557, 413789, 478161, 321050, 453356, 180446, 444516, 186045, 347323, 322808, 406895, 236241, 236019, 336745, 547855, 226602, 390926, 376678, 202672, 290463, 405567]
13546D05567C2126K82170j00436K63121H4592L25285A41143N35826l29966A34142
13535C60922l0755l2803M5298J6417n0858K61363A04903R1938o1723K5118N1442
13524B11678j6365c607B01407R8195n155K10367A06275L3704O2665n2028J71828
13513C22444J6054H1349K61179j69096C94L04127J3914o8206e9925A41968J33069
13502B75037L40264j28292k42099J8590L0831p3697L0967J94185p2352I2319L64738
13491D57057j81656J97686A12625K10377a58922B70030q2868J50301a82596C94114
13480B13356J35646C9484K63947A01775C5233K91484j48694K57738A19286J4103
13470A33389m2682e089B523J49761K21957A43421J79279F0853J60660L69232B30553
$$ y = [405567, 32126, 314296, 213860, 476981, 84592, 409877, 141143, 676969, 347003, 134142, 360922, 330167, 297364, 342662, 359079, 308221, 569584, 104903, 196841, 135118, 160236, 211678, 195313, -3607, 201407, 299602, 294447, 504814, 106275, 139979, 202644, 150616, 322444, 338498, 81349, 342528, 173432, 394, 304521, 318435, 250229, -59925, 141968, 275037, 615301, 487009, 244910, 263500, 294331, 220634, 251601, 445786, 373434, 92319, 457057, 275401, 473087, 112625, 323002, -158922, 270030, 187162, 337463, -182596, 394114, 213356, 349002, 39484, 303431, 101775, 35233, 326717, 178023, 435761, 119286, 133389, 90707, -5089, 2523, 152284, 374241, 143421, 322700, 60853, 221513, 590745, 230553]
13458A42000J71337G2927J89105a23671B81810n2173q0088J86341A23156J33976
13448B57132b79934B43480j11831F3745K29301L6200j47563J13862D845K40190
13438B45035J21533j24797a5344G2450K71603b6704A76585L1621o280J89095j50813
13427B40208A19441k1836M1432J74352M6632q2517J5755a02827B40875a14124
13416D88111O2525B00622J46866l7615N5814e173B22142q9716K02823j35825f8968
13404a3678B85470Q1119i5266a933r7408A89124a06091A18293J65675A7842M98161
13393E16003B42615m1287j00374O297m5667O9965L39334g891B58499L7938D1089
13381A97401O6518j6113M2338q0713g1485C02282k940C9871O5L17323J47407G1258
$$ y = [142000, 313337, 72927, 262032, -123671, 281810, 229637, 149549, 335890, 123156, 257132, -279934, 243480, 131649, 63745, 293046, 329246, 181683, 295545, 4845, 245035, 366568, 241771, -15344, 72450, 344053, -26704, 176585, 208206, 201926, 391021, 240208, 119441, 97605, 139037, 313389, 360021, 277504, 293259, -102827, 240875, -114124, 488111, 550636, 200622, 347488, 309873, 365687, -5173, 222142, 132426, 335249, 199424, -68968, -13678, 285470, 366589, -95266, -1933, -99341, 189124, -106091, 118293, 283968, 17842, 516003, 242615, 201328, 100954, 107251, 61584, 131549, 470883, -7891, 258499, 296437, 41089, 197401, 263919, 247806, 290144, 209431, -71485, 302282, 299342, 39871, 39936, 357259, 504666, 71258]
13368H631M08998j30630a37725a5939B04469p0371L97735k9838b03236D81655
13357B62858J0332j29290R4748J9502K155r8068J69999m8695E9381R6828h9358
13345F24119l0483A20161L94506k5131j22735R3182o1867J1222A4998J90613q3713
13334A21898K53566K1818M7707K5189a47917E8016a90494q947b7920A40709J62272
13323C02981A15462B5775o519M77126k34592G6342K54416K07988B46300l1742
13313B14558K00559j13378J97596j80350A12920M54188A65057K6909f1360C47096
13302A15227l0144P7429J25777E5314i1828A63328q0191K96664H0240N532M9755
13291A35527L2499g9054B62922b81335e3878A11122A470a02436B72859F197J98959
$$ y = [8631, 417629, 286999, -137725, -15939, 204469, 134098, 531833, 501995, -203236, 481655, 262858, 273190, 143900, 238648, 258150, 260305, 162237, 332236, 283541, 59381, 156209, -89358, 624119, 593636, 120161, 514667, 489536, 366801, 459983, 398116, 409338, 14998, 205611, 121898, 375464, 397282, 444989, 470178, -147917, 58016, -190494, -199441, -27920, 140709, 302981, 115462, 25775, 19256, 496382, 261790, 76342, 330758, 538746, 246300, 214558, 415117, 301739, 499335, 318985, 112920, 567108, 165057, 191966, -61360, 347096, 115227, 85083, 162512, 288289, 55314, -91828, 163328, 83137, 379801, 80240, 85772, 135527, 168026, -79054, 262922, -281335, -53878, 111122, 1470, -102436, 272859, 6197, 205156]
13280B05156l410D4707K54030E4910K04917e6130B63760l1593D6382g2701H1092
13268A99768G3144J76347L8390J39539a89467B72600d2895A69111J46728h6062
13257B89323j14079F4772J13733q0473b74036f19F4628K0467J53358A11930J83953
13246B95883a80476G1395K33625A07834P6378E0064J27325G3341O8271J76005
13236C17617a7197B09907K2088b38270B77181c46049B62634E7269c8135A45801
13225A37378F202J63081J56437j32265b23949j10510B81678l6008m4520N9240
13215B60390J9908A3420a9800E24651B54186a35609d3196A5881c8293A43095m6963
13204I6132L98332D3232a08013G5081K82979A65145K69314A13744f1708B5071
$$ y = [205156, 201746, 44707, 298737, 54910, 259827, -56130, 263760, 232167, 46382, -72701, 81092, 199768, 73144, 249491, 287881, 427420, -189467, 272600, -42895, 169111, 315839, -86062, 289323, 175244, 64772, 178505, 98032, -274036, -619, 64628, 85095, 238453, 111930, 295883, -180476, 71395, 305020, 107834, 184212, 50064, 177389, 73341, 141612, 317617, -17197, 209907, 231995, -238270, 277181, -346049, 262634, 57269, -38135, 145801, 137378, 6202, 169283, 325720, 193455, -223949, -334459, 281678, 245670, 201150, 260390, 280298, 13420, -19800, 524651, 254186, -135609, -43196, 15881, -38293, 143095, 96132, 494464, 43232, -108013, 75081, 358060, 165145, 434459, 113744, -61708, 25071]
13193C15785a94084p0566A30470m3000A9173i8634E41532j77978A07669h9277
13182A95378a39425A47961a41554F5035M0144J59120A9502M02265A2706d7497
13171B09875f5090r3205b2259m6024k5793A16706a60397C10867A21155J80207
13161C01362O013H054b48394i0026@I5144l895K94880j78590n0372J9319j6721
13149A59765b1785B77623h4439o6784f0366f930A60104Q1486o9645J79895A49606
13137a56116E3457J1685A7272K89139j23952n0777b66354D22288B00897a0267
13126B10343f8840j05882a8205A68273m7633d23813d5287j16502A56870G023a73898
13114D54044J22348F0743N8528a6870C27922I4148d4999B36701c0002A28344m7765
$$ y = [315785, -194084, -264650, 130470, 87470, 19173, -98634, 541532, 363554, 107669, -89277, 195378, -139425, 147961, -141554, 65035, 105179, 264299, 19502, 421767, 12706, -47497, 209875, -65090, -158295, -22259, -68283, -94076, 116706, -160397, 310867, 121155, 301362, 307375, 8054, -248394, -90026, 0, 95144, 91249, 386129, 207539, 157167, 176486, 159765, -21785, 277623, -84439, -151223, -60366, -6930, 160104, 241590, 171945, 351840, 149606, -156116, 53457, 65142, 17272, 306411, 182459, 131682, -266354, 422288, 200897, -10267, 210343, -68840, -174722, -18205, 168273, 120640, -423813, -45287, -161789, 156870, 7023, -173898, 454044, 576392, 60743, 119271, -16870, 327922, 94148, -44999, 236701, -30002, 128344, 80579]
13103H0579d36291A43505B2492J57026I154L03068d8864E8398R0590G4490a94541
13091I1668l3814K97500j49096i0414A16175K8131l4935d8289B57276j16220K00175
13080C41231g7234l23550A34259h2047A74232p1652O7535j1206N0506N6560l0974
13069B35001B3356J50981a05582C47059a42287J989K417A29563K53756A41592
13058D9688J2016K56188p4446a28166e9163A15429b92638B90406a64395I2817
13047B03384O909K9227N570j16371a30359A77182L5073b56102C05240M9017a7811
13035a9548G0980j2164c15309E7896L51602m1876g5914A85320o2131R7800f1041
13023C16083A24156B9150b5667A96401F2335M15801I5048K0620f4997D83769a57494
$$ y = [80579, -436291, 143505, 22492, 179518, 9154, 312222, -48864, 58398, 148988, 74490, -194541, 91668, 57854, 355354, 206258, -90414, 116175, 144306, 109371, -48289, 257276, 141056, 341231, -77234, -400784, 134259, -82047, 174232, 102580, 170115, 158909, 209415, 265975, 235001, 23356, 174337, -105582, 347059, -142287, -140298, -137881, 129563, 383319, 141592, 49688, 61704, 317892, 243446, -128166, -59163, 115429, -292638, 290406, -164395, 92817, 203384, 210293, 239520, 245090, 128719, -130359, 177182, 212255, -256102, 305240, 354257, -17811, -19548, 70980, 58816, -315309, 57896, 409498, 367622, -75914, 185320, 123189, 220989, -61041, 316083, 124156, 29150, -25667, 196401, 62335, 478136, 95048, 115668, -64997, 483769, -157494]
13011I0829k8273M5738a8308A24655K3059F5973J9305b0102H8883l5832f4076
12999c7548A45628F450L4269a24592j08701R8261A38935b23555A59621J41271
12989C00892d08065g3865m9548E1304L49369P8958A6704J9550L5086K37204a23161
12977a5984B67501c05418J19844C15512j12229J41912a03587A12597K8251C5823
12966D2099O2464d65A40626L4128A5083J91212b61809A61776J15577B7389M5779
12955G3168K07992E9764B1857e3518l8327C10119n126C9577b21550B26558H081
12943E6653R3320a02580A66632J73986F2120J28279C6326K9873L47125a12889
12932A93422G5578J48486o6801g7530H5332k3015c6399k54069g6033A5092a37427
$$ y = [90829, 62556, 108294, -18308, 124655, 147714, 65973, 85278, -20102, 88883, 53051, -64076, -37548, 145628, 6450, 40719, -124592, -233293, -135032, 138935, -223555, 159621, 300892, -408065, -73865, -123413, 51304, 400673, 479631, 16704, 36254, 71340, 308544, -123161, -15984, 267501, -305418, -185574, 315512, 203283, 345195, -103587, 112597, 140848, 35823, 42099, 104563, -465, 140626, 174754, 15083, 206295, -261809, 161776, 277353, 27389, 73168, 281160, 59764, 21857, -53518, -91845, 310119, 304993, 39577, -221550, 226558, 8081, 56653, 149973, -102580, 166632, 340618, 62120, 190399, 36326, 66199, 413324, -112889, 193422, 75578, 224064, 157263, -77530, 85332, 62317, -36399, -290468, -76033, 15092, -137427]
12920c6797D42101j70363A0877a30515A30687C4504J12210N734a41522C26659
12909G7450b2318H844O8453O4292o1748a22180M8322B338K32980a3595j17143
12898a30738B94568A5479g1240A20133L26146A47155c0345H9943K16629a91393
12887A58757o1797b47451a8336j77463d0336j17099q5951f6779A16097a02088
12876b01552A04078a85065m8815A462L23297A38439a71227D2142J81534q5307
12866A38369a97320A26857g2013j21655J3461C5610b208C36061F0440i6055A8934
12854A76411a59080B64521b35228j42108B13838a44338B48448J05004b30394g1854
12843G6148a9471A17380N6675C2109b2971j96807H2547B0593f5947A07003b13113
$$ y = [-36797, 442101, 271738, 10877, -130515, 130687, 34504, 146714, 152448, -141522, 326659, 77450, -22318, 8844, 77297, 141589, 79841, -122180, -73858, 2338, 235318, -13595, -130738, 294568, 15479, -71240, 120133, 446279, 147155, -30345, 89943, 306572, -191393, 158757, 96960, -247451, -18336, -195799, -40336, -157435, -243386, -66779, 116097, -102088, -201552, 104078, -185065, -233880, 1462, 324759, 138439, -171227, 42142, 223676, 138369, -197320, 126857, -72013, -193668, -180207, 35610, -2208, 336061, 60440, -96055, 18934, 176411, -159080, 264521, -235228, -377336, 213838, -144338, 248448, 353452, -230394, -71854, 76148, -19471, 117380, 174055, 32109, -22971, -219778, 82547, 20593, -65947, 107003, -213113]
12831a08664j26362d8173B71901C377a16392a252B9882A630O3024a86829n5814
12820b42643i9547A50773a51558e4176O296k87232A0345N5999J11277J2739m0311
12809A50049p0855a03966A35907a62338e2639B4701e737C3152Q7475i8980G6113
12797B23961a96173e1126m1811l10495a28401D4368O0503a06050R170e128A79063
12785A62760m6812O4161a9565j14203A04107h7347r9113I5354a07253B0796a38853
12773F7885c41758A23343J01678G5926g3484C01123b07189E6828p365J4825A0730
12761b2193b332E4333P4141o0650L7697J30747b44690J21409H3739I712J27891
12750A37603d7009A20244J08783a5060k98524B71052O6305e7700A2003a53804
$$ y = [-108664, -235026, -48173, 271901, 3377, -116392, -1252, 29882, 1630, 64654, -186829, -242643, -99547, 150773, -151558, -54176, -47880, -335112, 10345, 66344, 177621, 190360, 150049, 79194, -103966, 135907, -162338, -52639, 24701, -5737, 33152, 120627, -98980, 76113, 223961, -196173, -51126, -92937, -403432, -128401, 44368, 104871, -106050, -96880, -5128, 179063, 162760, 115948, 180109, -19565, -133768, 104107, -87347, -186460, 95354, -107253, 20796, -138853, 67885, -341758, 123343, 225021, 75926, -73484, 301123, -207189, 56828, 49463, 64288, 10730, -22193, -2332, 54333, 128474, 67824, 105521, 236268, -244690, -123281, 83739, 9712, 137603, -47009, 120244, 229027, -15060, -313584, 271052, 337357, -57700, 12003, -153804]
12739A83283i7682A44346J35018p1716c9781B76121a58631G0907d8294B6720a25779
12727c67428A61234F2989g2223B10055a54811B95190e1013a8587j18443N5378
12717h1652A09751c46458a51514A71528K3091D1173O900A0337J1792K79033M3149
12706C44311A21803J82015l0975O0546j07072I5538i5303h599C9183L31579c9143
12694F5220J04295L4829a123m327E136K96588E6914K78438H0008M6592a56848
12682h450A55337N4718a47897B8210b24940A12720M73276A86984K0707P5974H0604
12670e7701A72576f6710J5710A17347M797E2510M2881a07472N0995G0879a43505
12658C75493b60454G5162L8147M9626A2735J76588M1334H8311m3323g7793B48179
$$ y = [183283, -97682, 144346, 279364, 207648, -39781, 276121, -158631, 70907, -48294, 26720, -125779, -367428, 161234, 62989, -72223, 210055, -154811, 295190, -51013, -18587, -137030, -81652, 109751, -346458, -151514, 171528, 194619, 41173, 48073, 10337, 22129, 301162, 344311, 121803, 303818, 272843, 333389, 226317, 95538, -95303, -8599, 39183, 370762, -39143, 65220, 169515, 204344, -1123, -5450, 5136, 301724, 56914, 335352, 80008, 126600, -156848, -8450, 155337, 210055, -147897, 28210, -224940, 112720, 585996, 186984, 207691, 283665, 80604, -57701, 172576, -66710, -51000, 117347, 122144, 52510, 95391, -107472, -56477, 70879, -143505, 375493, -260454, 75162, 113309, 162935, 12735, 189323, 230657, 88311, 44988, -77793, 248179]
12646B11207A6064b95407m3945A56049d6142j29893A1267d4922A6063J25689a86547
12634a61864A16232C4913i3398F0634K5670K14586R6838A12561M5502e2558A9853
12622B31202p1090K20774A66567J52361i1777H9590K18416h1302k13546b7446
12611b8655j64071F8069A6557K01313I5856N6644J235b7456A31350j978J75672
12600C05044A03553g9257A68229c5049o7071B22744e6872A7473b23468A77874
12589B98314M0660A9443a5880I7208j4788J4830g4971j21652m076h6216n2077
12578a38293K7668I6189a72103A68601a05581D23394g1935A66180C0049a09181
12567f129H5348J21176K41495b34215R237D3253J29013c6750j04668b8517A32377
$$ y = [211207, 16064, -295407, -339352, 156049, -46142, -176035, 11267, -44922, 16063, 141752, -186547, -161864, 116232, 34913, -93398, 60634, 86304, 300890, 397728, 112561, 158063, -52558, 19853, 231202, 160112, 380886, 166567, 318928, -91777, 89590, 308006, -81302, -294848, -27446, -28655, -192726, 68069, 16557, 217870, 95856, 152500, 153735, -27456, 131350, 129372, 305044, 103553, -79257, 168229, -35049, -102120, 222744, -56872, 17473, -223468, 177874, 298314, 338974, 19443, -15880, 97208, 82420, 97250, -74971, -196623, -200699, -86216, -138293, -110625, 96189, -172103, 168601, -105581, 423394, -71935, 166180, 30049, -109181, -6129, 85348, 206524, 448019, -234215, -224978, 43253, 172266, -36750, -141418, -28517, 132377]
12555g6134j68265A29114E960a39785j3140j95265A41230L06607j87611d2983
12544d8221B72204a76243A31845l1229k8531R014b97161A52706j9994a87325d920
12532c5815j42809C2011a21514q7985B03833a78481f0891q1786n0328A3768c7413
12520B88459o4745I7981e5494a0709H7727J55305e4123G9191a33407d825j38398
12509a43223A20638C4074f3112C00590k1592g2493A40831J3020J80328A07241
12498a4534k58097a23640A62517G0027f4757A17572J05287c1609D6557a10862
12487G5177b48938O4916j61911J41707d3842p5020B80440P8142F7974D182J76747
12476A80929J18645b01690C25210q150j34481D1788N1125c67106a56582d0232
$$ y = [-76134, -244399, 129114, 5960, -139785, -152925, -348190, 141230, 447837, 260226, -42983, -48221, 272204, -176243, 131845, 100616, 72085, 81099, -297161, 152706, 132712, -187325, -4920, -35815, -178624, 32011, -121514, -209499, 203833, -178481, -60891, -142677, -193005, 13768, -37413, 288459, 223714, 97981, -55494, -10709, 87727, 243032, -54123, 79191, -133407, -4825, -143223, 120638, 34074, -63112, 300590, 278998, -72493, 140831, 153851, 334179, 107241, -14534, -272631, -123640, 162517, 70027, -64757, 117572, 222859, -31609, 46557, -110862, 75177, -248938, -184022, -345933, -204226, -43842, -118862, 280440, 358582, 67974, 4182, 180929, 299574, -201690, 325210, 317060, 182579, 41788, 92913, -367106, -156582, -40232]
12465A4889c877k24165M2400A67959a14726C1189b14942C99734I2825a49401O8625
12454h0776o1865b0244E963b54677O8362A67215n8006B9447J61477b42182h4378
12442a06520K9132o0842A0690d50572a31245e1602k28376A47706a35504B18951
12431A86839L3830a00983K0258r8600Q3795k09425A14883J96675a33805m4602
12421a78407J9000e8584o5155a4229A15618b1471I2701d6902B45207A18872P5617
12410A94489p6502n7397J64722n0366p9859d2185a6769r8791m0806A3390a04311
12398B1140a72816j64103A15539D7711A5848J61288C3445A023J39016d196A17931
12386B03764c4732A86696F9640O2450J5606a15689B92972b09992A70269c71078
$$ y = [14889, -3877, -228042, -185642, 167959, -114726, 31189, -214942, 399734, 92825, -149401, -80776, -142641, -20244, 5963, -254677, -186315, 167215, 109209, 29447, 190924, -242182, -84378, -106520, -77388, -138230, 10690, -450572, -131245, -51602, -279978, 147706, -135504, 218951, 186839, 220669, -100983, -80725, -179325, -95530, -304955, 114883, 311558, -133805, -178407, -159407, -58584, -123739, -14229, 115618, -21471, 92701, -46902, 245207, 118872, 194489, 117987, 60590, 225312, 174946, 95087, -42185, -16769, -115560, -156366, 13390, -104311, 21140, -172816, -336919, 115539, 47711, 15848, 177136, 33445, 1023, 140039, -4196, 117931, 203764, -34732, 186696, 69640, 132090, 147696, -115689, 292972, -209992, 170269, -371078]
12375a04079J4742C209a5174A84792a56960B37103L8447D6302i9130j53422h0681
12363g3531a3577k979D7569B969J96109G6567A3313b30133e95q4574G7873g2365
12350A5110a26617B17721G6322b1057j77572o471A84953b11587J04732b4376A54149
12338D809a44141E9815J40196A1422K5623a29159j58823a4613k59932F1623a11717
12326A20175c73699L0887J48392C67538f9253q0718A27601f3836k7251P240G4482
12314B18802a43509B3385L65683G6827b37714B8794K05236d06797A9710b0381
12303I3092K2553l5479g1156b7695m0076j32080c121B7654i4472g055A46927c8572
12290A68898C9238d9750j38138g2896A48737L07067d7132A67885b21412B7736
$$ y = [-104079, -89337, 3209, -15174, 184792, -156960, 237103, 275550, 46302, -99130, -252552, -80681, -73531, -13577, -16556, 47569, 2969, 199078, 76567, 13313, -230133, -595, -85169, 77873, -72365, 15110, -126617, 217721, 76322, -21057, -198629, -205100, 184953, -211587, -106855, -24376, 154149, 4809, -144141, 59815, 200011, 11422, 37045, -129159, -287982, -14613, -274545, 61623, -111717, 120175, -373699, -342812, -194420, 367538, -69253, -149971, 127601, -63836, -91087, -83847, 74482, 218802, -143509, 23385, 389068, 76827, -237714, 28794, 234030, -406797, 19710, -20381, 93092, 115645, 80166, -71156, -27695, -67771, -199851, -3121, 27654, -94472, -7055, 146927, -38572, 168898, 39238, -49750, -187888, -72896, 148737, 455804, -47132, 167885, -221412, 27736]
12279a14637C21584A09261j7047N8240e8121B91321b0680A66269a6181I2100A0363
12267c07127b2467C9159O3688a48694A95963L19937d6216C9706J63269Q6445n5092
12256B34328J16696J41155c8133k17415P8654j7931c919C01946g1522m9363e1624
12244B0217a07195A449L99051a68357g0515A93071K0946F4493b16963B9811J21007
12233A50818a61634I5903L1089O9987l7793c6133C14607a42981e160C37710C3012
12221C53564h811C63935J7776G3231K13929J08695M00550C35408A32058a33137
12210C54829j63731H625Q1187J24227L4364Q1749A61554P5908i3196D2329a2841
12198A58104k625J75404A33352J32990a92244C57411j6461j39080A3911K63776
$$ y = [-114637, 321584, 109261, 92214, 150454, -58121, 291321, -20680, 166269, -16181, 92100, 10363, -307127, -22467, 39159, 102847, -148694, 195963, 515900, -46216, 39706, 202975, 289420, 234328, 351024, 492179, -38133, -255548, -176894, -194825, -3919, 301946, -71522, -120885, -51624, 20217, -107195, 1449, 400500, -168357, -70515, 193071, 214017, 64493, -216963, 29811, 150818, -161634, 95903, 126992, 196979, 159186, -36133, 314607, -142981, -5160, 337710, 33012, 353564, -8811, 363935, 381711, 73231, 287160, 395855, 796405, 335408, 132058, -133137, 354829, 191098, 8625, 89812, 214039, 248403, 330152, 161554, 237462, -93196, 42329, -12841, 158104, 155479, 330883, 133352, 266342, -192244, 357411, 340950, 201870, 13911, 277687]
12188B77687l2527A8910R8770L917b7728A74390P5954i3144C50260j5781A41000
12176F1287N1868J61766C2622K53939B8803K51505o9452g7691b4131A61288J52284
12165C13572A56716O9709A2456K59371a59176E010L55451g3012A37211m9677K62458
12154C49992A05160b82906G6717d8150l7741I2233k7353d2245B98584a02172K6511
12143g5661o6282C44434n6946a96303D0927L59666a81900r0787f3265q0182A07473
12131a75312A47595b5592D03225a8333k06758a4657j39820A24099K6145o8867
12121H1377i1957A36682e9390K6900A14545e0268I590i1844H5180b24947N6042
12110a68905A24357d13328B0404K4044p996c30866B04472n0396Q20l6667i1591
$$ y = [277687, 245160, 18910, 117680, 121597, -27728, 174390, 250344, -93144, 350260, 334479, 141000, 61287, 113155, 274921, 32622, 286561, 28803, 280308, 210856, -77691, -24131, 161288, 313572, 156716, 226425, 12456, 271827, -159176, 5010, 360461, -73012, 137211, 87534, 349992, 105160, -282906, 76717, -48150, -85891, 92233, 64880, -42245, 298584, -102172, -75661, -141943, 344434, 287488, -196303, 40927, 400593, -181900, -272687, -63265, -143447, 107473, -175312, 147595, -25592, 403225, -18333, -225091, -14657, -154477, 124099, 150244, 81377, -91957, 136682, -59390, -32490, 114545, -50268, 9590, -91844, 85180, -224947, -168905, 124357, -413328, 20404, 44448, 36452, -330866, 204472, 154076, 154896, 118229, -91591]
12098b007m47833a12912M8355A91865F5996a65510c3315B7417J0553a29598j0513
12087a40111M6087A86767n1890c2126k90837i1707p6746d3215A13813q472R5974
12076B01315K83404N13930J98586l33865l94836L8495G3478h7894B20865b4885
12065C01719c82905B57560f2624D0634J12598h0463D0407O3356N5664C3120a3531
12053D9900c04975g1784D487h5019k17318G3837L4872b43331a4477E415L79741
12042C85156c9835k4743B60855i1086H8080B6923F107g2100B17102h442l7182
12031d5624E1221R9896h6165B13109c3459n3735B5343J74519h9931k3734H4110
12019a29626B76600a23715I2561a3294A58033J15396P3953a58734B12164b8764
$$ y = [-2007, -449840, -112912, -64557, 191865, 65996, -165510, -33315, 27417, 37970, -129598, -140111, -94024, 186767, 134877, -32126, -322963, -91707, -168453, -43215, 113813, 105341, 201315, 484719, 998649, 1197235, 863370, 468534, 507029, 73478, -87894, 220865, -24885, 301719, -382905, 257560, -62624, 40634, 153232, -80463, 40407, 103763, 159427, 33120, -13531, 49900, -304975, -71784, 4487, -85019, -302337, 73837, 108709, -243331, -14477, 5415, 385156, -39835, -64578, 260855, -91086, 88080, 26923, 6107, -72100, 217102, -8442, -45624, 51221, 151117, -86165, 213109, -33459, -87194, 25343, 199862, -89931, -113665, 84110, -129626, 276600, -123715, 92561, -13294, 158033, 273429, 347382, -158734, 212164, -28764]
12008e0460k96851a25070j78253a21564M8880D8817D821g5727C0352J0746b17022
11996A65905K8109F7675a23722J1835A17028a66524j54642a5039j45138B13437
11985b56048h0061K5226B76115M4974b11151E3303j7299J19370g4858K0439k34151
11974b88570Q6674F3917c47521B81146d5528A59393N4772A5387h2212B25416q071
11963B17345H8729e0896j19062C4980j3180b18686J0754F859c24028n1909E1536
11951a53823N2061E5211J1333O6569d2692a1776A14116f6377A27814K7182a2075
11939b27187a02517j53885A2008b34721i9772J7969j30595C3917N5950J79932
11929B69799g0576k00320J12895j53168g9405B60245B4835P7391b79471a21283
$$ y = [-50460, -347311, -125070, -303323, -121564, -72684, 48817, 4821, -75727, 30352, 41098, -217022, 165905, 194014, 67675, -123722, -111887, 117028, -166524, -321166, -15039, -160177, 213437, -256048, -80061, -54835, 276115, 321089, -211151, 53303, 36004, 155374, -74858, -54419, -288570, -201896, 63917, -347521, 281146, -45528, 159393, 214165, 15387, -82212, 225416, 217345, 88729, -50896, -169958, 34980, 21800, -218686, -207932, 6859, -324028, -375937, 51536, -153823, -101762, 55211, 66544, 133113, -42692, -11776, 114116, -66377, 127814, 154996, -12075, -227187, -102517, -256402, 12008, -234721, -99772, -81803, -212398, 33917, 89867, 269799, -70576, -270896, -158001, -311169, -79405, 260245, 24835, 102226, -279471, -121283]
11918b64949p2976p6268I7366b08039h7962j72664N3064Q8562A82810b28884B806
11906H5982m1896O40i4595A74211c48526a05664G4124Q7503i7770E1677a40679
11894a55550B7958J00195n0575a1854j25054B99029A42000K5629J18197I2445
11883f7305G6189K03181b15119B30577a13043p9233A34378c5065O47B85168J10736
11872C95904f08764e5142J981b247G2168J77069g5222j21703B80336p9531f619
11860b8981n9320n8475F5027b86005i1696c4026q3211K9832A50666h3357b816
11848b54401l0107H2148b31781A87830d6344I5015J04625b3147I3412a323C87822
11836d28090B9224K61209d11213b01982A71754J823b92493a09625r6663A80784
$$ y = [-264949, -337925, -414193, 97366, -208039, -87962, -260626, -207562, -119000, 182810, -228884, 2806, 85982, 44086, 44726, -94595, 174211, -348526, -105664, 74124, 161627, -97770, 51677, -140679, -155550, 27958, 128153, 77578, -11854, -136908, 299029, 142000, 167629, 285826, 92445, -67305, 76189, 279370, -215119, 230577, -113043, -192276, 134378, -35065, -34418, 285168, 395904, -608764, -55142, -53161, -2247, 72168, 249237, -75222, -196925, 280336, 200805, -6619, -28981, -88301, -146776, 65027, -286005, -91696, -34026, -117237, -87405, 150666, -83357, -2816, -254401, -284508, 82148, -231781, 187830, -46344, 95015, 199640, -23147, 93412, -1323, 387822, -428090, 29224, 290433, -411213, -201982, 171754, 173577, -292493, -109625, -206288, 180784]
11825B3626e2196a6913l12095H8693O2816o3693a74128P8058d7741n4693j17163
11814b19597B14075K3000B5821J11384J15612h3473B30232k9432D9568K03382
11804B52950j17839B2174N9839C263Q2938a19619B41775B0217J41078a20092j01337
11793b21429D14086a17558j87765J40191N5065H4753a87260d0549D52342E4213
11782d6815A21625a49394f2666m2057n3845d2903j74286A59254e1567k3008E3032
11770D250c18164J3773J27096j47712i089A01833b72159I2266d6292I2536a13649
11758i9709G20L88999D4696h9196j62808f0538j94366A30680L5312k4928a06431
11746A87384o6728c20493A01845j1850k9205P3539C9960e555n5630k41467B8353
$$ y = [23626, -52196, -16913, -329008, 88693, 151509, 87816, -174128, -96070, -47741, -102434, -219597, 214075, 237075, 25821, 137205, 252817, -83473, 230232, 200800, 49568, 252950, 135111, 22174, 82013, 3263, 86201, -119619, 241775, 20217, 161295, -120092, -221429, 414086, -117558, -305323, -165132, -110067, 84753, -187260, -40549, 452342, 54213, -46815, 121625, -149394, -62666, -104723, -158568, -42903, -217189, 159254, -51567, -74575, 53032, 4250, -318164, -304391, -177295, -325007, -9089, 101833, -272159, 92266, -46292, 92536, -113649, -99709, 720, 389719, 44696, -89196, -252004, -60538, -254904, 130680, 165992, 141064, -106431, 187384, 120656, -320493, 101845, 89995, 60790, 134329, 39960, -5555, -61185, -302652, 28353]
11734E4581J5869g2728I9940C9922a13917A09860d9771C47972e0294A33233a75230
11722D93850h4579C5398f8035qB06598b3285H92J75753o8975b39666B4172a82157
11709D02196B1681a17025k2061j18235B76597n3166a75410N4967A3125K6732K5165
11698F5022J85943E7638j818R2796E0688J14362F0793J00491a64385g9658K7884
11687e1774I378J01466m4569J40890H6350P5767R3001A5543K41903k4032e1081
11675A14438P6082d8038B2128b3939B23537a0649k68817C08235j40446a25055
11664A80424f0411n0261D2965K4715J6122e6534G0118L67597j70502m2351c1743
11652A33720b72396R8573N0058A23105d0544A79747H074a440k88603i1846E5828
$$ y = [54581, 70450, -72728, 99940, 39922, -113917, 109860, -49771, 347972, -50294, 133233, -175230, 493850, -84579, 35398, -68035, -68043, 206598, -23285, 892, 176645, 107670, -239666, 24172, -182157, 402196, 21681, -117025, -139086, -257321, 276597, 223431, -175410, -120443, 13125, 39857, 65022, 250965, 57638, 55820, 148616, 50688, 165050, 60793, 161284, -164385, -79658, -51774, 9378, 110844, 66275, 207165, 86350, 162117, 255118, 15543, 257446, 233414, -51081, 114438, 190520, -48038, 22128, -23939, 223537, -10649, -279466, 308235, 167789, -125055, 180424, -60411, -110672, 42965, 67680, 83802, -56534, 70118, 437715, 267213, 224862, -31743, 133720, -272396, -173823, -123765, 123105, -40544, 179747, 8074, -1440, -290043, -91846, 55828]
11640C7343e6735A42751a43185B27948Q8596A07049a65388P0290b7841F2988J96051
11629B59039E3082i8321l550A20385J02910B1037P350R8986J41195j29019L0467
11618A70016J27780k6707p7255b11023d4100A36866A8098J17576K20102d7329
11607e4508E9729J98776L6615H3380J66492F7550A6803b2934k39455J17091D9782
11595d945D50716d0125q4736N6048n2011B58287j1110n3800Q5011Q2655a43982
11583a13690A34428K4251E1328c8768A72883c6647j09906M1416A04288a20583
11572a10391A16236K9606l5300J22271b888j42924A97827a41241C41861j45306
11562A96555J82303j03032r2821m7083M6100f4477r427C5615K38736E5579k3052
$$ y = [37343, -56735, 142751, -143185, 227948, 316544, 107049, -165388, -95098, -27841, 62988, 259039, 53082, -98321, -101871, 120385, 223295, 21037, 28387, 127373, 268568, 139549, 170016, 297796, 271089, 193834, -211023, -44100, 136866, 18098, 135674, 355776, -47329, -54508, 59729, 258505, 295120, 83380, 249872, 67550, 16803, -22934, -262389, -145298, 49782, -4945, 450716, -40125, -124861, -68813, -120824, 258287, 247177, 193377, 278388, 361043, -143982, -113690, 134428, 158679, 51328, -38768, 172883, -36647, -146553, -105137, 104288, -120583, -110391, 116236, 145842, 110542, 232813, -2888, -145812, 197827, -141241, 341861, 196555, 378858, 275826, 183005, 135922, 182022, -64477, -73904, 35615, 274351, 55579, 32527]
11551C2527J17553g8156E8926a15680C4535c736j38406D8015b2482j81256B33591
11539A5907i2874r3537Q1838B11139J46650l6897e1220p6912C42471e7171G9821
11527A80730J49760H7673j161h6835A69817a14117I2489N047b2262A19042n4843
11516F4199J88832a08264E5066h663E3154L26793E7263J78492K5129l4059B9784
11504E7439k4880J09265c7723B89584a57109F1J02375c60726C36301r9014Q7627
11493C24914A19780g5557D13532A48710j9053K30544k0884d9240j06513D65683
11482C8206i1359j75755C55748F9743g408A25002j6891P5391l0037O9906G8538
11470a47436E14555A14002K17527l6460f7295B64794n4683p5266a65371B95992
$$ y = [32527, 150080, -78156, 58926, -115680, 34535, -3736, -142142, 48015, -22482, -203738, 233591, 15907, -92874, -186411, -104573, 211139, 357789, 320892, -51220, -128132, 342471, -57171, 79821, 180730, 330490, 87673, 86512, -86835, 169817, -114117, 92489, 97536, -22262, 119042, 64199, 253031, -108264, 55066, -8663, 53154, 379947, 57263, 235755, 260884, 226825, 29784, 57439, 32559, 141824, -37723, 289584, -157109, 61, 102436, -360726, 336301, 237287, 324914, 119780, -75557, 413532, 148710, 129657, 360201, 339317, -49240, -155753, 465683, 38206, -91359, -267114, 355748, 69743, -7408, 125002, 108111, 183502, 153465, 223371, 78538, -147436, 514555, 114002, 331529, 295069, -67295, 264794, 210111, 134845, -165371, 295992]
11459a8657A65381i7297A82083a04814F2854a62815e009B78556f3070k889J9261
11448d6698M465I0628K30304g865A18760J31869N7983F9132P8299c93739a66967
11436A60160b93304M3092H1810b46883A49883d9749C16248b1594j36906M0989
11426a17511L1006e640q4372q6083B34047I3127j9701P3639a3443B59149G8858
11414A06021N1078a07506M048b979k37060B14802p8501e6399I0722N09464B13470
11402A4479N9361e946A75744i2307l8524q90C70589A05322J16153a49228B33442
11390a54428c1178B86599p1104h5527n7366j05813c0654C38989l5729A48485a60934
11378h4839A07548J78723a22694F1265R7495O4932A3850K18519o0336c4870A43420
$$ y = [-18657, 165381, -97297, 182083, -104814, 62854, -162815, -5009, 278556, -63070, -65959, -46698, -42233, 90628, 320932, -7865, 118760, 250629, 308612, 69132, 147431, -393739, -166967, 160160, -293304, -250212, 81810, -246883, 149883, -49749, 316248, -21594, -158500, -117511, -86505, -5640, -90012, -176095, 234047, 93127, 73426, 147065, -13443, 259149, 78858, 106021, 157099, -107506, -103458, -2979, -240039, 214802, 136301, -56399, 90722, 600186, 213470, 14479, 73840, -5946, 175744, -92307, -130831, -131721, 370589, 105322, 221475, -149228, 233442, -154428, -31178, 286599, 215495, -85527, -142893, -248706, -30654, 338989, 303260, 148485, -160934, -84839, 107548, 286271, -122694, 61265, 158760, 223692, 13850, 232369, 172033, -34870, 143420]
11366D7976e1962I2827a78944A14508J50294a48657A1902P9313b3380I9499a1468
11354a137F0819c17090C77370a37891c5209D31709a05020r5288N1467A62784a48157
11342i4803a7732H3042Q0470g9660C8208J22169O3440a8363H0116b7070j08423
11331a35493N4464I3021K7919m4218a0037A31685b2595r5679m8707E1130b23830
11319B57128g9391g266F4223J06778p2504h1265o4313A25064A6500L175a92967
11307B68229b71895e2303A41716b51991j7570E4245r276c0927C10298b09344c174
11295A69000b67403j50461a61631P8503A45351f0882k6990A3698b63580E7426
11284a65182a0552j40514I7797a09140L3743K4531g712m9045o1059l9058f6400
$$ y = [47976, -51962, 92827, -178944, 114508, 264802, -148657, 11902, 91215, -23380, 99499, -11468, -1137, 60819, -317090, 377370, -137891, -35209, 431709, -105020, -200308, -148841, 162784, -148157, -94803, -17732, 83042, 163512, -79660, 38208, 160377, 223817, -18363, 80116, -27070, -135493, -81029, 93021, 120940, 76722, -10037, 131685, -22595, -118274, -166981, 51130, -223830, 257128, -79391, -7266, 64223, 171001, 98497, -81265, -145578, 125064, 16500, 19675, -192967, 268229, -271895, -52303, 141716, -251991, -269561, 54245, 44969, -30927, 310298, -209344, -3174, 169000, -267403, -417864, -161631, -83128, 145351, -60882, -87872, 13698, -263580, 57426, -165182, -10552, -151066, 97797, -109140, -75397, -50866, -7712, -56757, -117816, -156874, -66400]
11272b80078a16396E3060f3260a2612B04705b020j27258j54000F2304k2877K55553
11261B94980A46327l6916B8990O7880L7173b3601j3788q3675r7201A42853a21809
11249G6096a45305k65407A37756c10544e8748M761A618e2684B26506a91199E274
11237G3176b20040d4910l61158A13658h7713A79060A1341N7001a4850I3025i3684
11225b72271N7658B40813F3355c31333B41272c87319c2873o0384I8563a74313
11214B05882d55886B46888e0369j73077A19053a94884P5969H1076a90251A44584
11203c16196b690E8614B3240N7381J37150c3555j52565g3301A8372a22441j20470
11192b42911E3077R8476a6852j34283B35320j4926p7160a69185n9949m919q6528
$$ y = [-280078, -116396, 53060, -63260, -12612, 204705, -2020, -129278, -283278, 62304, 39427, 294980, 146327, 109411, 28990, 96870, 134043, -23601, -37389, -121064, -218265, 142853, -121809, 76096, -145305, -410712, 137756, -310544, -58748, -53987, 1618, -52684, 226506, -191199, 5274, 73176, -220040, -44910, -406068, 113658, -87713, 179060, 11341, 68342, -14850, 93025, -93684, -272271, -214613, 240813, 63355, -331333, 241272, -387319, -32873, -93257, 98563, -174313, 205882, -455886, 246888, -50369, -223446, 119053, -194884, -118915, 81076, -190251, 144584, -316196, -2690, 58614, 23240, 80621, 217771, -33555, -186120, -73301, 18372, -122441, -242911, 53077, 151553, -16852, -151135, 235320, 220394, 143234, -169185, -229134, -234053, -320581]
11181c20581k7872F096A780L3486b19350e369G7502J19396b72785A16286c3560
11169a66095A4760L2066J6230a94567A05543J5954a88245j47499D35233C8989
11158C69251A23469e4178B6310g9295A93686J69357a73535r7616b2132k18887
11148b41019H8409m2719f9418I6201a78127b7094I900M19590h7559A47843a10371
11136A4695f5709A88492e7093B27735a84548J6361I630R2598k3976R2835C5628
11124D7870J68991L4438A10998j4669b36654B85420a34883A06053O6484B4864
11113B34125b0600k17403G7615b00002D7604J43375i2762C47103J16135B26871
11102B0350P121J82471R1096A6108i8754d7249D0897j6628L02193F9840f1426
$$ y = [-320581, -348453, 6096, 1780, 35266, -219350, -5369, 77502, 196898, -272785, 116286, -33560, -166095, 14760, 46826, 63056, -194567, 105543, 121497, -188245, -335744, 435233, 38989, 369251, 123469, -54178, 26310, -79295, 193686, 363043, -173535, -271151, -22132, -241019, 88409, 45690, -69418, 96201, -178127, -27094, 9900, 429490, -87559, 147843, -110371, 14695, -65709, 188492, -57093, 227735, -184548, -168187, 9630, 102228, 78252, 171087, 35628, 47870, 216861, 251299, 110998, 96329, -236654, 285420, -134883, 106053, 172537, 24864, 234125, -20600, -238003, 77615, -200002, 47604, 190979, -92762, 347103, 463238, 226871, 20350, 27471, 209942, 301038, 16108, -98754, -47249, 40897, 24269, 326462, 69840, -61426]
11090C23634n2092A11603J04449I3923D4680K37069j781g5125A93662C641J89909
11079A93550M4811P4708E9563J67473d4322B38365N3050R7864j68208I8189B7478
11067B33729j12454J55942L13633B69789M3946J25902J93734p1446q8791L73119
11057H46253m12929N3185L40411n8959l15166J66087P0062l04154K23890K7658
11047F36338J10961Q4613C96367K32021j31152J51867J15294l32841l7270M55148
11037H49434j2185k34992M61845m90364R6926P4215j2780k43142j32380P83675
11027A140252D74619J14541l7188k69032K57367j62499K00001K64691k81186L6312
11017E97626J04469K74433k80290k6393B47046M38726j2798J82722D13974K40044
$$ y = [323634, 271542, 111603, 216052, 93923, 44680, 281749, 279968, -75125, 193662, 3641, 193550, 238361, 313069, 59563, 227036, -44322, 238365, 291415, 389279, 221071, 98189, 27478, 233729, 121275, 277217, 590850, 269789, 313735, 439637, 633371, 561925, 473134, 846253, 433324, 486509, 826920, 767961, 452795, 618882, 688944, 384790, 608680, 636338, 747299, 831912, 396367, 628388, 497236, 649103, 764397, 431556, 394286, 849434, 837249, 602257, 1064102, 573738, 670664, 744879, 732099, 488957, 356577, 1140252, 474619, 589160, 551972, 282940, 540307, 377808, 577809, 842500, 561314, 597626, 702095, 976528, 696238, 669845, 247046, 685772, 672974, 855696, 413974, 654018]
11007F54018l14780P6881K74856j78776J44153j96356n1725K7007J67195O5336
10997F67809j9376L69764j93116C52486K81029L44235l38853L5966Q9738j83621
10987E80980K15553K64752k73279K54813k21784L18009J13608j60349O1130L27944
10977A481377k81424O74491m3813Q4333L17747L71021j39188j66357K23068Q03
10967B522058j69464o21851R9981J0787l53612M87844k61907L62043m77626R4932
10957A693185J1976K37442j41105l13156l4525k38379l40212M9567l7310k28185
10947F59298r6984J33423A72148M92645C18559m2837J2737j3656I6746j5338K68561
10936C49969K4664a24359A72908l5155J12129b0411k2003a4135H3942N2917h6314
$$ y = [654018, 339238, 416119, 690975, 512199, 656352, 459996, 408271, 435278, 602473, 667809, 648433, 1018197, 825081, 352486, 633515, 977750, 638897, 674863, 764601, 580980, 796533, 1061285, 788006, 1042819, 821035, 1139044, 1252652, 1092303, 1153433, 1481377, 1199953, 1874444, 1830631, 1914964, 2232711, 2603732, 2464544, 2298187, 2521255, 2522058, 2352594, 1730743, 1830724, 1841511, 1487899, 1975743, 1713836, 2075879, 1598253, 1693185, 1705161, 1942603, 1801498, 1488342, 1453817, 1215438, 875226, 924793, 887483, 659298, 562314, 695737, 172148, 664793, 318559, 275722, 288459, 274803, 96746, 81408, 349969, 374633, -124359, 172908, 137753, 249882, -20411, -42414, -14135, 83942, 136859, -86314]
10924A11575j2962M460h9219D9456M1237b3506C4650a09918e407r8500j15124
10913b19031f5254K7280p7440B02698a49106n5475R8773A67353n4547B4393e7578
10901A65609k7329b05757e8118o857C03418a07062B1910f5770q0868B12456a0683
10889g125p1947C0937R1613K5692a57784H7843a37656K9588j22574Q7701k6146
10878a69087G8942D648P5499j8348J9556K9831O8567H5159b20765G0278M3889
10867A14167P8225J01869a15987j86063D61920b3462A74959A7322a98j65855P1583
10856i4470M0764q9398j1029B98728a67586H0064l6663d2327A08037J28901a93122
10844A10337L7675l0045J28531F3138a38851G7049d5402p2867A03212l2982R888
$$ y = [111575, 98613, 103073, -89219, 49456, 90693, -23506, 34650, -109918, -5407, -103907, -219031, -65254, -37974, -115414, 202698, -149106, -204581, -105808, 167353, 112806, 24393, -57578, 165609, 138280, -205757, -58118, -64975, 303418, -107062, 21910, -65770, -146638, 212456, -10683, -7125, -79072, 30937, 122550, 148242, -157784, 87843, -137656, -108068, -230642, -142941, -169087, 78942, 4648, 80147, 61799, 81355, 111186, 179753, 85159, -220765, 70278, 114167, 192392, 294261, -115987, -302050, 461920, -23462, 174959, 17322, -198, -166053, -94470, -53706, -143104, -154133, 298728, -167586, 80064, 43401, -42327, 108037, 236938, -193122, 110337, 148012, 117967, 246498, 63138, -138851, 77049, -45402, -118269, 103212, 70230, 80118]
10833H0118g5766o3025r8536E9556L0153i390E2946j0238J65508b14469F2046
10821b21826B23130c48121J14332P3277q6g6793A8779H198O5760f9926k45129
10810c15055j07500a84484B02510d0748a1356l25072A81264Q2370g6455q8541
10800a64996B33526a11131n1641n7676G6921c32766I5349c92146d3161A13620
10789c14227J01344Q0613e2070a4286m19200a88556j26321a45756A27579b24666
10778B8813c61745C70329A36020c2213j00733D6048J62547B2477J24713c3808
10767b5852k87040a12800j21283A34048m6596a18147A52651b39736c9927j37383
10757a77310C0208K75059k203a64256O0359D8179a68950A32092a66908g9164n4778
$$ y = [80118, -75766, -138791, -237327, 59556, 89709, -9390, 52946, 42708, 208216, -214469, 62046, -221826, 223130, -348121, -233789, -160512, -160598, -76793, 18779, 8198, 73958, -69926, -315055, -422555, -184484, 202510, -40748, -11356, -336428, 181264, 263634, -76455, -164996, 233526, -111131, -162772, -220448, 76921, -332766, 95349, -392146, -43161, 113620, -314227, -212883, -132270, -52070, -14286, -433486, -188556, -314877, -145756, 127579, -224666, 28813, -361745, 370329, 136020, -32213, -132946, 46048, 208595, 22477, 147190, -33808, -25852, -312892, -112800, -234083, 134048, 87452, -118147, 152651, -239736, -39927, -177310, 30208, 305267, 303064, -164256, -103897, 48179, -168950, 132092, -166908, -79164, -133942]
10746a33942B74788f319o8032q7099k33406a42479f1122B9516a31250F2327j5533
10735D6794K65706c8920k16539L4419c6336j1537E04763i4184a8539m6279j4899
10724g9717A14225b22071r2098c2571B91931a78956k01968b3523m25595G5065
10713B44528j03503l2247h2721G5746a42154N5729J4759A70413a64912B09349
10702I0331a01266j42547j826E4854j3728J25103a5920k20922R7822j24912a8882
10690i743B82448d26256B0289J58402H8190R2431L0516c46154O3671J12693A52874
10678D6755R9863d74221G2255b53284B41148b70281a28810c8018E08a02171l05920
10667d08091B00968c01163L9547G3874J40636a6995q8848l7763k59087E6099J91494
$$ y = [-133942, 274788, -6319, -74351, -161450, -394856, -142479, -61122, 29516, -131250, 62327, 46794, 312500, -38920, -255459, -221040, -36336, -47873, 504763, -94184, -18539, -64818, -79717, 114225, -222071, -314169, -32571, 291931, -178956, -380924, -23523, -449118, 75065, 244528, 141025, 108778, -82721, 75746, -142154, -86425, -71666, 170413, -164912, 209349, 90331, -101266, -243813, -245639, 54854, 41126, 166229, -15920, -236842, -139020, -263932, -18882, -9743, 282448, -426256, 20289, 178691, 88190, 180621, 211137, -346154, -282483, -169790, 152874, 46755, 146618, -474221, 72255, -253284, 241148, -270281, -128810, -38018, 508, -102171, -408091, 200968, -301163, -261616, 73874, 214510, -16995, -105843, -143606, -402693, 56099, 247593]
10656B47593d39060J16382a7416q7457j95080J47474B5564d9754j78776E8587
10645h3570A28371B9150b231j27710k8625a262A1876a13700A52835O4024F2807
10633c39304a24399A99687g426j48934j89560e4308B33229h2175r069j82062P9430
10622a93876A91039c8506h841n5147p9855l7293B25865e2149l3361o0688A6358
10610i5680j62829a02901j27298M7845B79941o9108b97574J10742L076A32802
10599A92183A0889h7943A11489k2814L6552n1732k7539b69283j26615A00560Q0673
10588A81233q3598D7005c61465a54562E864J91174b12967e0678k21480O0650J00279
10577a11229A43303a8348k8527j66776F3902c6515A56406c04782A7626a32328
$$ y = [247593, -439060, -322678, -17416, -104873, -299953, -152479, 25564, -49754, -228530, 58587, -83570, 128371, 29150, -2231, -129941, -158566, -1262, 11876, -113700, 152835, 216859, 62807, -339304, -124399, 199687, -7426, -156360, -345920, -54308, 233229, -82175, -91244, -273306, -193876, 191039, -38506, -8841, -63988, -143843, -181136, 225865, -52149, -85510, -146198, 16358, -95680, -258509, -102901, -230199, -182354, 279941, 210833, -297574, -186832, -183756, 132802, 192183, 10889, -87943, 111489, 88675, 125227, 73495, 45956, -269283, -395898, 100560, 181233, 97635, 47005, -361465, -154562, 5864, 197038, -212967, -50678, -272158, -211508, -111229, 143303, -18348, -46875, -213651, 63902, -36515, 156406, -304782, 17626, -132328]
10566C0318d8862I8685J14925m2429K5640p6693b50706B5531g7492j04293g4984
10554b27370m8726K9202k1176a31928A10160R511M5934a231n1471D2876J97371
10543B40247f8218B6246f678F823a114l55225B39408A06936b6528k45024j2196
10532b83748B15760b49088c8236l84610g5881a4163n2593j06100c1942m3896l6018
10521a11856j58444E9259b0119p893H2226E433g4198K3995j89508A4278h028j82338
10509a90366C8943c37046J60292A22945K53443b23112B38453j04232A01J39158
10499A39259B7086e998F2928g0713k88394h214j17667I7958O8330n5896d1690
10487A98578a20836J4708A62316J54187A07060K89496j40609K51346k25237K91881
$$ y = [30318, -48862, 98685, 213610, 171181, 196821, 120128, -250706, 25531, -77492, -181785, -74984, -227370, -276096, -246894, -268070, -131928, 110160, 119671, 165605, -1231, -52702, 42876, 240247, -68218, 26246, -6678, 6823, -1114, -356339, 239408, 106936, -26528, -271552, -283748, 215760, -249088, -38236, -422846, -75881, -14163, -66756, -172856, -31942, -75838, -111856, -270300, 59259, -20119, -28012, 82226, 5433, -74198, -50203, -239711, 14278, -8028, -190366, 38943, -337046, -176754, 122945, 376388, -223112, 238453, 134221, 101, 139259, 27086, -5998, 62928, -70713, -359107, -8214, -125881, 97958, 166288, 110392, -41690, 198578, -120836, -106128, 162316, 316503, 107060, 396556, 255947, 507293, 282056, 573937]
10477E73937E1556f8150A17432R8932d8145j32942A87768a75475c715l9213j27285
10466a70213D9536J25853B4566b00233b625C6238a41592B04002p9759o2036B702
10454a70046g5090E1422Q5798f4995o4207b1827B47108i585D5896M48204G9443
10442a09231A21509l5741J6742a42741A73045K9209o0613K1659b17867O7501k6711
10431a77077I0407a22060C61454a24848H0736a76393m3269P2396e3355j9676n1058
10420a24089j41603C25377E1405B5702b64683J19185f1940k33941i7691q1513
10410a79204c328k02418e3900J0701G9575a44429d3287G8430d2982D0281a04369
10398b5663k59366h3915B8298d6267D5081J89518A10275K04396i3357B95059E3283
$$ y = [573937, 51556, -68150, 117432, 216364, -48145, -181087, 187768, -175475, -3715, -42928, -170213, 49536, 175389, 24566, -200233, -2625, 36238, -141592, 204002, 124243, 62207, 2702, -170046, -75090, 51422, 137220, -64995, -129202, -21827, 247108, -9585, 45896, 494100, 79443, -109231, 121509, 85768, 102510, -142741, 173045, 202254, 141641, 163300, -217867, -150366, -177077, 90407, -122060, 361454, -124848, 80736, -176393, -219662, -147266, -53355, -73031, -124089, -265692, 325377, 51405, 25702, -264683, -145498, -61940, -295881, -97691, -179204, -3328, -205746, -53900, -43199, 79575, -144429, -43287, 78430, -42982, 40281, -104369, -25663, -285029, -83915, 28298, -46267, 45081, 234599, 110275, 314671, -93357, 295059, 53283]
10386g7947A5977M6854R2629a79156b9155F3848M5862J50981J2761K7609F3918
10374H1617L88544d1368B75779r9088J13180j2358L15160B58421J16651p1879
10364C03193q8309P4538j3488m0079H7848K77895A33551K82641n5754j30916H1334
10352B90661j18618L07154M2352k15359O1558j49918I1851M16886j80156L963
10342C32544m8408L62995B81202n1267F1100J81407H8718J13425e8854A05203
10331B59246a85104A55566J09887a4631I8589a96344g8107I0015p541M34828k28459
10320B88843q781j01452j7407l3329j2914I115d1186M948B11K57872D5806L0796
10308G6602g3634C02224q8749J77808D4956J67639F7346J10518m4289d66319A4679
$$ y = [-77947, 15977, 62831, 155460, -179156, -29155, 63848, 109710, 260691, 273452, 301061, 63918, 81617, 470161, -41368, 275779, 176691, 289871, 277513, 592673, 258421, 375072, 303193, 214884, 289422, 275934, 235855, 87848, 365743, 133551, 416192, 360438, 229522, 81334, 290661, 172043, 479197, 521549, 306190, 367748, 217830, 91851, 508737, 328581, 332544, 284136, 647131, 281202, 229935, 61100, 242507, 88718, 202143, -58854, 105203, 259246, -185104, 155566, 265453, -14631, 98589, -196344, -78107, 90015, 82474, 517302, 288843, 280062, 178610, 161203, 127874, 114960, 9115, -41186, -36238, 211, 258083, 45806, 76602, -73634, 302224, 213475, 391283, 44956, 212595, 67346, 177864, 133575, -466319, 14679]
10296a14316e0654H3849M2032j9894a11466k80095g6429K9451j00658B7650h2614
10284b51671Q2101A0583J83811D6108h719B13600A6672a0395A25104o671d24727
10272e8143j12856A95406E5066K05329E5302a33325c4867o097m3757k72127C65356
10260I6275J89383j07386L78233m3761j656B23164o0765Q0930f0776B2858N1703
10249G4561b8417A97376b23377N2342C8675B47K72396A8295g0288G302J10322
10238A17624b34489k7323B17696E038a95880I4052i098p2424b5336J0872H3938
10226F5001e2357k7766k74333A12582k4963D0631a13217E128d61203a81163B31095
10214B34391R154F9469b2805A33938a88715P3818B62665a73395r1304o3917b9515
$$ y = [-114316, -50654, 83849, 125881, 105987, -111466, -391561, -76429, -46978, -147636, 27650, -82614, -251671, -169570, 10583, 194394, 46108, -8719, 213600, 16672, -10395, 125104, 118433, -424727, -58143, -170999, 195406, 55066, 260395, 55302, -133325, -34867, -40964, -84721, -356848, 365356, 96275, 285658, 178272, 556505, 512744, 511088, 223164, 162399, 243329, -60776, 22858, 74561, -28417, 197376, -223377, -171035, 38675, 247, 272643, 18295, -70288, 7302, 117624, -234489, -261812, 217696, 5038, -195880, 94052, -9098, -81522, -25336, -14464, 83938, 65001, -52357, -80123, -354456, 112582, 87619, 40631, -113217, 5128, -461203, -181163, 231095, 234391, 243545, 69469, -22805, 133938, -188715, -114897, 262665, -173395, -264699, -328616, -29515]
10202e7479m6635A19117h023j78980f9404A5905L87275a58277p2024a14660m88765
10191f03425C7881J58454D5554b55093N3454F4844b44461I062c33130i7204C0387
10179a13111e4914A73150c6369k49312C00246a59167M240k08816i5249H1966K07189
10168B89155B837c17631i6779k21842b1228k6538A49037B0025h0800c3024G6454
10156D96794e6531n671c0392p8908j30179a13810d2521Q741a016k07080l9245
10145b47341g5171j97859A53788o0877a93033H2646a48121N1867j17571d5446
10134a25214j18503e222q2985E6264c31540A71557a260l4693A09876D3725g9993
10122A56520a93257p5339A6983L2307c12026f8102j33962R3302i329l7403o4700
$$ y = [-57479, -104114, 119117, -8023, -187003, -69404, 15905, 403180, -158277, -230301, -114660, -603425, 37881, 196335, 45554, -255093, -201639, 64844, -244461, 9062, -333130, -97204, 30387, -113111, -54914, 173150, -36369, -285681, 300246, -159167, -154927, -363743, -95249, 81966, 289155, 2837, -317631, -96779, -318621, -21228, -47766, 149037, 20025, -80800, -33024, 76454, 496794, -56531, -62202, -30392, -109300, -239479, -113810, -42521, -33780, -1016, -208096, -247341, -75171, -273030, 153788, 92911, -193033, 82646, -148121, -96254, -213825, -45446, -125214, -243717, -5222, -88207, 56264, -331540, 171557, -1260, -35953, 109876, 43725, -79993, 156520, -193257, -268596, 16983, 49290, -312026, -68102, -202064, -108762, -9329, -46732, -111432]
10111a11432a1299k13996M1627r6635G1572L16547b06828b2711C1138h2259j73089
10100b55348L5837J02116A60073O1209b02822G37O9083r410r33c7874l1600c2317
10087C5125b09281O7335O149A13780b40145b3418j8208I0195C7164D980R7612
10076A02592a98627m045P1234l64884A08763a73835q8985a616p1664k99380J74706
10065a97954A17041j7810J48122H4070b50469C7587K8786j8289Q2589a49466j51931
10054c01397c32B9260J29212m8279l1819K66712q7795D04i1338j63947H1712d3206
10041d9527A25931Q5577a28747q6155B25011a12995F4054d8596A27169f2361j46371
10030b08732j22209D4883g6066J5813I1003a5908j38316O607B63102a5315B5418
$$ y = [-111432, -11299, -225295, -183668, -280303, 71572, 388119, -206828, -22711, 31138, -82259, -255348, -219511, -117395, 160073, 221282, -202822, 737, 69820, 60410, 59477, -37874, -69474, -32317, 35125, -209281, -141946, -135797, 113780, -240145, -23418, -41626, 90195, 37164, 4980, 102592, -198627, -202672, -131438, -496322, 108763, -173835, -262820, -1616, -73280, -372660, -197954, 117041, 99231, 247353, 84070, -250469, 37587, 66373, 48084, 130673, -149466, -301397, -332, 29260, 158472, 110193, 78374, 345086, 257291, 404, -91338, -255285, 81712, -43206, -49527, 125931, 211508, -128747, -214902, 225011, -112995, 64054, -48596, 127169, -62361, -208732, -330941, 44883, -76066, -60253, 91003, -15908, -154224, -147617, 263102, -15315, 25418]
10018b32652B33276j10392k4389a69928m7019e4429j52390r8481J31100j35475
10008c09675g1198A59823d2047l55109A83384b61100A75792d1931j52008N413
9998a88526A15136c4171o063k98371B86205d8018k4396n1537j58389B7921g4192
9986f9088M462A1644J2248b68311J4069J10312A1292g3271I7504A3572J32046
9975A45618E5357b9539B2894K39854i3859G0836d19589A1487b18083n3970b024
9963c01990F7110c6505n223j42061C7911K26338a48707A13757B3479J29914e707
9951b28480D4628g7922K0099m12834g5875D9693M1160O8583o1393f0974j03390
9940a64364d1319j0580A1203b44717n7431k6266b0994B88310a68752C6813b7527
$$ y = [-232652, 233276, 122884, 98495, -169928, -216947, -54429, -206819, -305300, -174200, -309675, -71198, 159823, -42047, -397156, 183384, -261100, 175792, -41931, -193939, -188526, 115136, -34171, -40234, -338605, 286205, -48018, -72414, -123951, -282340, 27921, -74192, -69088, -64626, 11644, 23892, -268311, -254242, -143930, 11292, -73271, 97504, 13572, 145618, 55357, -29539, 22894, 262748, -93859, 70836, -419589, 11487, -218083, -272053, -2024, -301990, 67110, -36505, -41728, -183789, 37911, 264249, -148707, 113757, 23479, 153393, -5707, -228480, 44628, -77922, -57823, -470657, -75875, 49693, 90853, 159436, 98043, -60974, -164364, -41319, -51899, 11203, -244717, -302148, -328414, -20994, 288310, -168752, 36813, -27527]
9928A8093d4214C2317i1865k56087L7856L7402p3586D4878a37178D1825j070B163
9915c53677B44327j19186a38724j60905J219a15911q5409g3811A46446a04865
9904C2387a53716I2225c3280j19407p1146A35644c82805h6401G9776a48068c3847
9892b30387A40806a00910B40161h7643A42171b70142j88403a75774A0020J62692
9882A72712f35667c4935A8137d90807D3946J12839J47073c7711D0212I404a25654
9870A67650b23051N1974A84393n7347d7886a6786h012A3677a98229C0917b42319
9858a27381A45825a20747d2272D7004A3816J75379c28891D9219k4001a80289O9652
9847a10637p0538h1310k0078B4710R7477c1086C4583J66904d3449n6585l1023
$$ y = [18093, -44214, 32317, -91865, -347952, -310096, -272694, -346280, 44878, -137178, 41825, 40755, 2163, -353677, 244327, 125141, -138724, -299629, -298410, -115911, -201320, -73811, 146446, -104865, 32387, -153716, 92225, -33280, -152687, -223833, 135644, -382805, -86401, 79776, -148068, -33847, -230387, 140806, -100910, 240161, -87643, 142171, -270142, -458545, -175774, 10020, 172712, -635667, -34935, 18137, -490807, 43946, 156785, 303858, -37711, 40212, 9404, -125654, 167650, -223051, -171077, 184393, 127046, -47886, -16786, -8012, 13677, -198229, 30917, -242319, -127381, 145825, -120747, -42272, 47004, 13816, 189195, -328891, 49219, 25218, -180289, -110637, -181175, -81310, -101388, 24710, 122187, -31086, 34583, 201487, -43449, -100034, -131057]
9836a31057K9015D6898B0615d915k36965P8601q9372J17409n6642q9911A85570
9824a9036c140l50359b7416c578H3188J99630d2572l34241b0515m7251o6937j74454
9812c09157M5592B57210j17089a20984C00581b31946h8877D3589c49182h7771
9801a43282b4151r2549A22535c16634A97907r1513c67198n3236J04289E8539J1998
9790G0537P743a47801B0860a00600l12207a07037B73130e4040j20493A25496b09376
9778A7195N2357a99386J0021p832e5336K7636l3419j59181C4148c32349B8143
9766d4560l06737A06257b26268N3830N7247k49333J63198f7673j58999i2405B1760
9754h6332J6113L4412A36936E8664a13536M7998j29170L3862L9555l7798d2668
$$ y = [-131057, -102042, 46898, 20615, -4915, -241880, -163279, -252651, -135242, -191884, -281795, 185570, -19036, -3140, -353499, -27416, -3578, 83188, 282818, -42572, -376813, -20515, -67766, -134703, -309157, -263565, 257210, 140121, -120984, 300581, -231946, -88877, 43589, -349182, -87771, -143282, -24151, -116700, 122535, -316634, 197907, 106394, -367198, -420434, -316145, 58539, 70537, 78280, -147801, 20860, -100600, -412807, -107037, 273130, -54040, -174533, 125496, -209376, 17195, 69552, -199386, -189365, -197197, -55336, -27700, -61119, -220300, 34148, -332349, 28143, -44560, -351297, 106257, -226268, -172438, -115191, -364524, -201326, -67673, -226672, -92405, 21760, -86332, -70219, -35807, 136936, 58664, -113536, -65538, -194708, -160846, -121291, -159089, -42668]
9742c65405B0202a16893M6101B37996H514b75605C6285b27715C1052a77114j8062
9731a95176e7611k74596K8295A15038a58402o274f2095o9472E2745K41128l8539
9720B55334a37798j94722H9985e979j74989a5507k5015l19827a31082B41693E4476
9708a25863k17923I8048h2550n3322N2684B41141e0194A6365Q5401b28545e3208
9696b06909N6188j57473C3413f6159k5342m9077L4032L046j58508a3898A26109
9684C1578K84384b1820a972m4067A71406d6603o5621A0702J0880M24949a22159
9672a31294L5073l82147d1935I8139g1662O144A00446J08669d20659B8079M5885
9661G3964N2998A3366P440M8920b59843E6508c02392A13137n1919K06278a88362
$$ y = [-365405, 20202, -116893, -70792, 237996, 8514, -275605, 36285, -227715, 31052, -177114, -195176, -57611, -332207, -303912, 115038, -158402, -164676, -62095, -131567, 52745, 293873, 255334, -137798, -332520, 89985, -5979, -180968, -15507, -40522, -360349, -131082, 241693, 54476, -125863, -343786, 98048, -82550, -135872, -83188, 241141, -50194, 16365, 101766, -228545, -53208, -206909, -150721, -308194, 33413, -66159, -91501, -140578, -106546, -103500, -262008, -13898, 126109, 31578, 315962, -21820, -1972, -46039, 171406, -46603, -112224, 10702, 21582, 446531, -122159, -131294, -96221, -478368, -41935, 98139, -71662, -65518, 100446, 209115, -420659, 28079, 73964, 126962, 13366, 20806, 69726, -259843, 56508, -302392, 113137, 61218, 267496, -188362]
9649b71673j196I4786b67178B25541r8708m5489b06678B1592a16296m29262A52640
9637A6415R6582a64499H0533P956m1855d09254D7564K37907j35546f9293C72764
9625A5003a15524l3113I863M5933J91760b91284F4374c6540j8327a7635k06034
9614b23669j03869J15691B3374c86111B70183b57298i885b87B13792a15490A60028
9602A63323J01756b10636N2923c5667j00418b1691k15638K1055A19141a85136
9591c25467a47531A88526k723a59996j67909j3365E7295a39088j88479j08197
9581d35764B11802o1303F0007b7007j17084C7735a92769i4121E490J05958i6612
9569A70770C9838b62021I0569K62951F1463a84586g7870D8807Q5785a40822k47033
$$ y = [-271673, -272869, 94786, -267178, 225541, 126833, 81344, -206678, 21592, -116296, -545558, 152640, 16415, 112997, -164499, 80533, 88489, 46634, -409254, 47564, 285471, 149925, -69293, 372764, 15003, -115524, -148637, 9863, 55796, 247556, -291284, 64374, -36540, -54867, -17635, -223669, -327538, -211847, 23374, -386111, 270183, -257298, -9885, -287, 213792, -115490, 160028, 163323, 265079, -210636, -157713, -35667, -136085, -21691, -237329, -216274, 119141, -185136, -325467, -147531, 188526, 185803, -159996, -327905, -341270, 57295, -139088, -327567, -435764, 211802, 150499, 60007, -27007, -144091, 37735, -192769, -94121, 5490, 111448, -96612, 170770, 39838, -262021, 90569, 353520, 61463, -184586, -77870, 48807, 134592, -140822, -387855]
9558c87855g6127J618j26196f475A02910D1989b48287G8523J63447i1666j0553
9547a02219j38893B3361K35728g6249C42879E2738A6795b35239N1567P7517o9449
9536a75604Q4308A2732c16291a47109e1586k52595k7811J06806J5416j49371a26797
9524a76297A4752a07530B02082b60194G0499b69130I6300d91414B28249c7188
9513c80738a25466N0287D1544M1401N2006A3744b15444L186P1706c8026A98254
9501h139B37032r7354L2538b08831A92719Q1943a29328B08120c64617J54481k5070
9490b35206e1377I3426c9406j02892H1460d18993A95627H6873Q2251a09679j75900
9479b85579A82786b00197Q4854j49775e9846j47274k66716A81375a36102l1540
$$ y = [-387855, -76127, -74509, -200705, -6475, 102910, 41989, -248287, 78523, 241970, -91666, -102219, -241112, 23361, 259089, -76249, 342879, 52738, 16795, -235239, -183672, -106155, -175604, -91296, 12732, -316291, -147109, -51586, -304181, -331992, -225186, -209770, -359141, -126797, -176297, 14752, -107530, 202082, -260194, 70499, -269130, 96300, -491414, 228249, -37188, -380738, -125466, -75179, 41544, 82945, 134951, 13744, -215444, -212258, -140552, -38026, 198254, -8139, 237032, 139678, 172216, -208831, 192719, 274662, -129328, 208120, -364617, -210136, -235206, -51377, 93426, -39406, -142298, 81460, -418993, 195627, 86873, 169124, -109679, -285579, 182786, -200197, -115343, -265118, -59846, -207120, -473836, 181375, -136102, -167642]
9469a67642B62474O6695b20044k0965a11675B68692D6406M5229b12455E5104k4645
9458C0459Q4221c10664h0484J2058k6357E5412K3874a1282B38126r7757b45296
9446a6057B31397o0817a17763l7678N390k57429M1629l9795A30011a93432G1452
9434a65563l02971a88660n267P5652l53966h3409o743A28074g2757j03772k403
9423a78932c6128m51448a20017j39905B79445n9534A08245b53920e1285f620D5746
9411b18599i521j95611N5715G8672l8202J27257e6888k80386A4936i1817D16231
9399B53126p1355p6037a40204m8345I3440k4592K04716F3375a10580b4596A97362
9387A17209C0405O0847a26628b9061k80338D2507R4210e5546F3616K02098a6299
$$ y = [-167642, 262474, 329169, -220044, -241009, -111675, 268692, 46406, 91635, -212455, 55104, 30459, 114680, -310664, -80484, -68426, -94783, 55412, 79286, -11282, 238126, 140369, -245296, -16057, 231397, 170580, -117763, -155441, -150051, -407480, -365851, -405646, 130011, -193432, 71452, -165563, -468534, -188660, -193927, -118275, -472241, -83409, -90152, 128074, -72757, -176529, -178932, -36128, -487576, -120017, -259922, 279445, 219911, 108245, -253920, -51285, -6620, 45746, -218599, -9521, -205132, -149417, 78672, 40470, 167727, -56888, -337274, 14936, -91817, 416231, 253126, 181771, 105734, -140204, -188549, 93440, 68848, 273564, 63375, -110580, -24596, 197362, 117209, 30405, 91252, -126628, -29061, -309399, 42507, 136717, -55546, 63616, 265714, -16299]
9375g6626C77507G1734K22502a88231g5277k57419a23492A05457f2084C93151
9364a92917g2546n301l1520q5490C6605a59457j57247A85267d9326j35266r6013
9353b80605j18889f2231O163F6318E14J0169L1112i1631J3569b8766o8061j02306
9341a99133N0795O3046B32727a10970F0245i3379B328O9657l0412g6212c2295
9329e867k1688k25766G3347b29571j9834l3965J20935O2553k03121D6341a35948
9317B2446K574J27232b7492E7592a46660P42A71605e1852m5352j91645I1355B4878
9304G8150b31682A70389b37460B5571b43175i0584A8390B132L60666G7370f773
9292a33460A07622D2015b25502A30450d28534E9248e44741g8476n8935e0680P792
$$ y = [-76626, 377507, 71734, 294236, -188231, -75277, -332696, -123492, 105457, -62084, 393151, -192917, -72546, -77847, -109367, -194857, 36605, -159457, -316704, 185267, -49326, -184592, -280605, -399494, -62231, -56068, 66318, 514, 10683, 41795, -91631, -78062, -28766, -96827, -199133, -148338, -85292, 232727, -110970, 60245, -93379, 2328, 71985, 41573, -76212, -32295, -5867, -27555, -253321, 73347, -229571, -249405, -283370, -162435, -99882, -303003, 46341, -135948, 22446, 25020, 152252, -27492, 57592, -146660, -145918, 171605, -51852, -97204, -288849, 91355, 24878, 78150, -231682, 170389, -237460, 25571, -243175, -90584, 18390, 2132, 362798, 77370, -6773, -133460, 107622, 42015, -225502, 130450, -428534, 59248, -544741, -78476, -137411, -50680, -42888]
9281d2888A10551b65340l7520b4994j51189A22514n0635A5241a71715n4316r97
9270b27028N9585k67090a84874A3925a04123E8403c17489M5167b6292A59657b8441
9258b19746O1387E7094a34952a6892B17152a04998r0179c3672H498J26310b20636
9246h8837D8105b07252A39421c85331C01443a4276j58340l2112j61510A58783
9235a16247A87669a88988g8108H1653i7666M450j9157A40622f7436A34980c95716
9223a6478D9639i8183e93j20458B88999I8779d44149H5646Q6001b34154C4219
9211C31355F6975C3461b04289F6945k0750a06538j74414B07451g327E3377c42568
9199b9976b35k0583A38962n7928J5996a02692B20302C7489a1062j83334O686i1579
$$ y = [-42888, 110551, -265340, -302860, -24994, -176183, 122514, 71879, 15241, -171715, -226031, -227028, -167443, -434533, -184874, 13925, -104123, 58403, -317489, -272322, -26292, 159657, -28441, -219746, -158359, 57094, -134952, -16892, 217152, -104998, -195177, -33672, 8498, 134808, -220636, -88837, 48105, -207252, 139421, -385331, 301443, -14276, -172616, -204728, -366238, 158783, -116247, 187669, -188988, -78108, 81653, -97666, -93216, -112373, 140622, -67436, 134980, -395716, -16478, 49639, -98183, -593, -121051, 288999, 98779, -444149, 85646, 171647, -234154, 34219, 331355, 66975, 33461, -204289, 66945, 46195, -106538, -280952, 207451, -7327, 53377, -342568, -29976, -235, -20818, 138962, 81034, 97030, -102692, 220302, 37489, -11062, -194396, -187710, -91579]
9186c86795B72088D0126a9775j46481a4013j57402c9320H4550C4444N2554b40279
9174a61264B51328d1446l5042J5240b4743A67846c62615K1249J30220O8885L5259
9163a07002k5405K4478K1493j42678p8226C9945Q167R6191i4424j34193a11816
9151a48125l5339A32771a53792N635a4052A06603a00157j00995j8749E3754c9415
9139b3562n6356F4742J9731a09449B11491j1000F6449j6536b26977G5362c785
9127H9038c144G2309a31888k55351D3270N8915d72544g0213p2261E5407a9895
9115A84359b71873k4598f7811J8560J9660m2616K6498j9252p1968r1412i0004
9103B14522a9504B6798J7632J39347a03588e856B19534n7313b03003f5396K1980
$$ y = [-386795, 272088, 40126, -19775, -166256, -14013, -171415, -39320, 84550, 34444, 86998, -240279, -161264, 251328, -41446, -76488, -61248, -24743, 167846, -362615, -341366, -211146, -142261, -107002, -132407, -107929, -86436, -229114, -307340, 39945, 48112, 144303, -94424, -228617, -111816, -148125, -183464, 132771, -153792, -148157, -14052, 106603, -100157, -201152, -219901, 53754, -39415, -23562, -79918, 64742, 84473, -109449, 211491, 200491, 66449, 49913, -226977, 75362, -3785, 89038, -3144, 72309, -131888, -387239, 43270, 102185, -472544, -70213, -142474, 55407, -19895, 184359, -271873, -296471, -67811, -49251, -29591, -72207, -45709, -64961, -136929, -228341, -90004, 214522, -19504, 26798, 44430, 183777, -103588, -5856, 219534, 162221, -203003, -65396, -43416]
9092d3416B44395a13395B1816K0447h0287p3799k09590a29187O3005j95614j41943
9081d03739J16561K2577a7570j47023P6754j06000l53902H5600a7286j05085H5405
9069F6523A5679L708J77303a62637B98776f094p6441o1902A39216o5969h6830
9057B29064d949A80204M0912B6071K13055e5284B33573a08972g910B833f2193
9045E2140a14141A33002E9443e1092C59792a58198E8909L7634O9533b61128A139
9033a48571p4678h5780n6323M390A22797a93170h0279A23618M3678H187n80J7252
9021B4859J1009c9348B5042L45061b06891b8486p7745a241o1661m7330p3056B16288
9008d27874a06019k7662A42302b05840P5986B00831F0607o549a08785k03132b3492
$$ y = [-43416, 244395, -113395, 21816, 42263, -80287, -154086, -363676, -129187, -66182, -261796, -403739, -287178, -264601, -17570, -164593, -87839, -193839, -547741, 85600, -17286, -122371, 85405, 66523, 15679, 19387, 196690, -162637, 298776, -6094, -82535, -144437, 139216, 73247, -86830, 229064, -4949, 180204, 221116, 26071, 239126, -55284, 233573, -108972, -7910, 2833, -62193, 52140, -114141, 133002, 59443, -51092, 359792, -158198, 58909, 96543, 166076, -261128, 1139, -148571, -223249, -85780, -142103, -137713, 122797, -193170, -80279, 123618, 167296, 8187, 7607, 24859, 35868, -39348, 25042, 370103, -206891, -28486, -106231, -1241, -62902, -110232, -183288, 216288, -427874, -106019, -133681, 142302, -205840, -129854, 200831, 60607, 54058, -108785, -311917, -23492]
8996A41211b39985g1728r9280I472a141B9265N3552O6092b02998N8791l994C83820
8983A43436a60929p6370C1724b56321Q0747E2018J03016b27732B16041I9988R6767
8972A96755e7629A17389a25899L087A3129a08031J1904j69926a24771A54944b56650
8960b5870C2719c13892f1135A30208C670a38481L5920F9609i8442g813F2572C260
8947a7814E6152L3394a24560j71017E1961Q5957a80145e6531B78060b52182i1011
8935a013n10k77255I7742b4461m52745a53005A21588D7898J7984K29400c4352
8923h8688A75446K20135K08556A97262A6686i89j92545B4821g3837a6999A75640
8911a59102c1767Q017k8379C484a38525k2213q4215G3408q091A2004a23511a7430
$$ y = [141211, -239985, -71728, -171008, 9472, -1141, 29265, 82817, 148909, -202998, -144207, -148201, 383820, 143436, -160929, -237299, 31724, -256321, -175574, 52018, 155034, -227732, 216041, 99988, 196755, -57629, 117389, -125899, -122812, 13129, -108031, -96127, -266053, -124771, 154944, -256650, -25870, 32719, -313892, -61135, 130208, 3670, -138481, -102561, 69609, -98442, -7813, 62572, 3260, -17814, 56152, 89546, -124560, -295577, 51961, 137918, -180145, -56531, 278060, -252182, -91011, -1013, -1523, -278778, 97742, -24461, -477206, -153005, 121588, 47898, 65882, 295282, -34352, -88688, 175446, 395581, 604137, 197262, 16686, -989, -193534, 24821, -73837, -16999, 175640, -159102, -31767, -23750, -52129, 3484, -138525, -160738, -244953, 73408, 65317, 12004, -123511, -17430]
8898a30956b0703j42213F4003a49912k37436A62318J8624b31369A38665F5555
8887a1069k92448B29362o8572a87485H937c2695E5022J06628b62398N7163b692
8875C0693J86248a20007m9670b8319D5724M1000h0726j27581A3349L6676h964
8863g4662j0372E2325P9292K6949E4153f2199A13812a28486M9316G2516a64691
8851b0342I4392a12539j23373J7667j29613A3192J20183l3403a77058B07378a85652
$$ y = [-130956, -20703, -162916, 64003, -149912, -387348, 162318, 180942, -231369, 138665, 65555, -11069, -303517, 229362, 160790, -187485, 8937, -32695, 55022, 161650, -262398, -205235, -2692, 30693, 216941, -120007, -169677, -28319, 45724, 86724, -80726, -208307, 13349, 50025, -8964, -74662, -85034, 52325, 131617, 158566, 54153, -62199, 113812, -128486, -79170, 72516, -164691, -20342, 94392, -112539, -235912, -218245, -347858, 13192, 133375, 99972, -177058, 207378, -185652]
$$ [...]
##END NTUPLES=NMR SPECTRUM
##END=
