##TITLE=AC1750_SEN00023_9280823_mYdIHHmsZ0
##JCAMPDX= 6.0         $$ Bruker NMR JCAMP-DX V2.0
##DATA TYPE= NMR SPECTRUM
##DATA CLASS= NTUPLES
##ORIGIN= BRUKER
##OWNER= Administrator
$$ 1.72 TOPSPIN		Version 2.1
$$ 2015-07-18 23:53:21.307 -0700  Administrator@X
$$ Compression mode = diff/dup
##.OBSERVE FREQUENCY= 400.02188249412
##.OBSERVE NUCLEUS= ^1H
##.ACQUISITION MODE= SIMULTANEOUS (DQD)
##.ACQUISITION SCHEME= undefined
##.AVERAGES= 8
##.DIGITISER RES= 22
##SPECTROMETER/DATA SYSTEM= spect
##.PULSE SEQUENCE= zg30
##.SOLVENT NAME= COFFEE_meoh
##.SHIFT REFERENCE= INTERNAL, COFFEE_meoh, 1, 14.98509
##AUDIT TRAIL= $$ (NUMBER, WHEN, WHO, WHERE, PROCESS, VERSION, WHAT)
$$ ##TITLE= Audit trail, TOPSPIN		Version 2.1
$$ ##JCAMPDX= 5.01
$$ ##ORIGIN= Bruker BioSpin GmbH
$$ ##OWNER= Administrator
$$ $$ E:\/data/COFFEE/nmr/AC1750_SEN00023_9280823_mYdIHHmsZ0/20/pdata/1/auditp.txt
$$ ##AUDIT TRAIL=  $$ (NUMBER, WHEN, WHO, WHERE, PROCESS, VERSION, WHAT)
(   1,<2015-07-18 23:53:14.041 -0700>,<Administrator>,<X>,<go>,<TOPSPIN 2.1>,
      <created by zg
	started at 2015-07-18 23:52:08.229 -0700,
	POWCHK enabled, PULCHK disabled,
       configuration hash MD5:
       21 0F 79 D6 B3 7B B4 F6 88 20 88 DB 03 48 BD 9F
       data hash MD5: 64K
       34 47 12 ED AB 69 68 2E 96 7A 23 C5 72 86 C9 4C>)
(   2,<2015-07-18 23:53:17.182 -0700>,<Administrator>,<X>,<proc1d>,<TOPSPIN 2.1>,
      <Start of raw data processing
       efp LB = 0 FT_mod = 6 PKNL = 1 PHC0 = 0 PHC1 = 0 SI = 32K 
       data hash MD5: 32K
       71 D7 87 27 CE 78 F7 C3 B2 C4 79 8B 18 91 71 7F>)
(   3,<2015-07-18 23:53:17.463 -0700>,<Administrator>,<X>,<proc1d>,<TOPSPIN 2.1>,
      <pk PHC0 = 88.43445 PHC1 = 0 
       data hash MD5: 32K
       27 1A 89 95 89 A9 DC B5 D6 D8 C1 96 4C D6 D0 2D>)
(   4,<2015-07-18 23:53:17.572 -0700>,<Administrator>,<X>,<proc1d>,<TOPSPIN 2.1>,
      <abs ABSG = 1 
       data hash MD5: 32K
       33 82 80 1A 6B 7C 59 93 CA 24 0B 68 84 D8 D4 64>)
(   5,<2015-07-18 23:53:17.635 -0700>,<Administrator>,<X>,<proc1d>,<TOPSPIN 2.1>,
      <abs ABSG = 2 
       data hash MD5: 32K
       A6 22 45 C1 3B 5C D7 2B AE 1C B6 A1 29 68 D7 F6>)
(   6,<2015-07-18 23:53:17.697 -0700>,<Administrator>,<X>,<proc1d>,<TOPSPIN 2.1>,
      <abs ABSG = 3 
       data hash MD5: 32K
       BF E6 54 C6 96 8B 4F 49 F0 A9 E3 12 C7 2F EA 48>)
(   7,<2015-07-18 23:53:17.760 -0700>,<Administrator>,<X>,<proc1d>,<TOPSPIN 2.1>,
      <abs ABSG = 4 
       data hash MD5: 32K
       2C 21 C7 B4 EB 15 B4 18 BC A4 36 7F 6E A9 22 4E>)
(   8,<2015-07-18 23:53:17.822 -0700>,<Administrator>,<X>,<proc1d>,<TOPSPIN 2.1>,
      <abs ABSG = 5 
       data hash MD5: 32K
       1C 14 05 BD 06 A1 64 F3 EE DD 04 49 E1 E7 8C AB>)
$$ ##END=
$$ 
$$ $$ hash MD5
$$ $$ 56 17 2C B2 2A 90 C6 25 7B 5D B5 C0 69 39 14 C3
##$RELAX= 
##$RELAX= 
##$RELAX= 
##$RELAX= 
##$RELAX= 
##$RELAX= 
##$RELAX= 
$$ Bruker specific parameters
$$ --------------------------
##$DU= <E:\>
##$EXPNO= 20
##$NAME= <AC1750_SEN00023_9280823_mYdIHHmsZ0>
$$ [...]
150 150 150 150 150 150 150 150
##$TP07= 0
##$TPNAME0= <>
##$TPNAME1= <>
##$TPNAME2= <>
##$TPNAME3= <>
##$TPNAME4= <>
##$TPNAME5= <>
##$TPNAME6= <>
##$TPNAME7= <>
##$TPOAL= (0..7)
0.5 0.5 0.5 0.5 0.5 0.5 0.5 0.5
##$TPOFFS= (0..7)
0 0 0 0 0 0 0 0
##$TUNHIN= 0
##$TUNHOUT= 0
##$TUNXOUT= 0
##$USERA1= <user>
##$USERA2= <user>
##$USERA3= <user>
##$USERA4= <user>
##$USERA5= <user>
##$V9= 5
##$VALIST= <valist>
##$VCLIST= <CCCCCCCCCCCCCCC>
##$VD= 0
##$VDLIST= <DDDDDDDDDDDDDDD>
##$VPLIST= <PPPPPPPPPPPPPPP>
##$VTLIST= <TTTTTTTTTTTTTTT>
##$WBST= 2048
##$WBSW= 25
##$XGAIN= (0..3)
0 0 0 0
##$XL= 0
##$YL= 0
##$YMAX_a= 556876
##$YMIN_a= -488990
##$ZGOPTNS= <>
##$ZL1= 120
##$ZL2= 120
##$ZL3= 120
##$ZL4= 120
##$ABSF1= 14.98509
##$ABSF2= -5.573092
##$ABSG= 5
##$ABSL= 3
##$ALPHA= 0
##$AQORDER= 0
##$ASSFAC= 0
##$ASSFACI= 0
##$ASSFACX= 0
##$ASSWID= 0
##$AUNMP= <proc_prof1d_extract_pilot.lims>
##$AXLEFT= 0
##$AXNAME= <>
##$AXNUC= <1H>
##$AXRIGHT= 0
##$AXTYPE= 0
##$AXUNIT= <>
##$AZFE= 0.1
##$AZFW= 0.1
##$BCFW= 0
##$BC_mod= 0
##$BYTORDP= 0
##$COROFFS= 0
##$CY= 15
##$DATMOD= 1
##$DC= 0
##$DFILT= <>
##$DTYPP= 0
##$F1P= 0
##$F2P= 0
##$FCOR= 0.5
##$FTSIZE= 32768
##$FT_mod= 6
##$GAMMA= 0
##$GB= 0
##$INTBC= 1
##$INTSCL= 1
##$ISEN= 128
##$LB= 0
##$LEV0= 0
##$LPBIN= 0
##$MAXI= 10000
##$MC2= 0
##$MEAN= 0
##$ME_mod= 0
##$MI= 0
##$NCOEF= 0
##$NC_proc= -8
##$NLEV= 6
##$NOISF1= 0
##$NOISF2= 0
##$NSP= 0
##$NTH_PI= 0
##$NZP= 0
##$OFFSET= 14.98509
##$PC= 1
##$PHC0= 88.43445
##$PHC1= 0
##$PH_mod= 1
##$PKNL= yes
##$PPARMOD= 0
##$PPDIAG= 0
##$PPIPTYP= 0
##$PPMPNUM= 2147483647
##$PPRESOL= 1
##$PSCAL= 4
##$PSIGN= 0
##$PYNMP= <proc.py>
##$REVERSE= no
##$SF= 400.02
##$SI= 32768
##$SIGF1= 0
##$SIGF2= 0
##$SINO= 400
##$SIOLD= 32768
##$SPECTYP= <>
##$SREGLST= <1H.CDCl3>
##$SSB= 0
##$STSI= 32768
##$STSR= 0
##$SW_p= 8223.68421052631
##$SYMM= 0
##$S_DEV= 0
##$TDeff= 65536
##$TDoff= 0
##$TI= <>
##$TILT= no
##$TM1= 0
##$TM2= 0
##$TOPLEV= 0
##$USERP1= <user>
##$USERP2= <user>
##$USERP3= <user>
##$USERP4= <user>
##$USERP5= <user>
##$WDW= 1
##$XDIM= 32768
##$YMAX_p= 451288596
##$YMIN_p= -730106
##$CURPLOT= <Network HP LaserJet P1505>
##$CURPRIN= <$Network HP LaserJet P1505>
##$DFORMAT= <normdp>
##$LAYOUT= <+/1D_H.xwp>
##$LFORMAT= <normlp>
##$PFORMAT= <normpl>
##$SURQMSG= 1
$$ End of Bruker specific parameters
$$ ---------------------------------
##NTUPLES= NMR SPECTRUM
##VAR_NAME=  FREQUENCY,     SPECTRUM/REAL,   SPECTRUM/IMAG
##SYMBOL=    X,             R,               I
##VAR_TYPE=  INDEPENDENT,   DEPENDENT,       DEPENDENT
##VAR_FORM=  AFFN,          ASDF,            ASDF
##VAR_DIM=   32768,         32768,           32768
##UNITS=     HZ,            ARBITRARY UNITS, ARBITRARY UNITS
##FACTOR=    0.250966925370066, 1,           1
##FIRST=     8223.43324360094, -66845,       -210180
##LAST=      0,             93802,           -104173
##MIN=       0,             -730106,         0
##MAX=       8223.43324360094, 451288596,    0
$$ Real data points
##PAGE= N=1
##DATA TABLE= (X++(R..R)), XYDATA
$$ [...]
$$ plain form
19530 -1852 -69376 -50743 -21624 -115234 -68793 215693 -318847 -86956 -173479 254304 34984
19518 49750 119165 141745 169722 41567 36796 144983 219924 -8292 -170283 22773 81565 -211213
19505 -6425 -39461 49191 317836 212317 -54341 -91214 -328257 -113059 -117183 126120 34079
19493 -447671 -430152 -205836 -84485 -249607 475706 -54899 189057 -123385 107525 -32195
19482 -176621 -185039 189869 -345749 80692 -182622 -114107 -53118 -263708 -222763 -91025 -251205
19471 -251205 -241560 108438 -129567 -193243 355048 -272144 -36181 -120364 -48149 -326411 -77558
19459 -109076 192787 -193201 75530 -98234 -144612 -113850 100338 -140809 -140729 29481 -47948
19447 -148721 -146013 112054 139725 362602 203648 -285460 -114372 -285864 184482 -441350
$$ packed form
19530a852o7524J8633b1624r3610M6441B15693c18847h6956q6523B54304C4984
19518D9750O9415K2580K7977D1567m771J08187P4941h292j61991B2773N8792b11213
19505f425l3036D9191K68645j05519e4341l6873k37043a13059m124A26120C4079
19493d47671J7519b05836h4485j65122D75706e4899A89057a23385A07525c2195
19482a76621q418A89869c45749H0692a82622O8515e3118k10590M0945i1025j60180
19471b51205R645A08438a29567o3676C55048b72144c6181q4183d8149k78262g7558
19459a09076A92787a93201G5530i8234m6378L0762A00338a40809Q0B9481d7948
19447a48721K708A12054K7671K22877j58954b85460a14372j71492A84482d41350
$$ plain form
19436 -58406 272071 -57992 193504 20785 -74794 -141511 84026 19094 -99895 263572 -212341
19424 -5912 -27918 73110 -262025 189944 -68222 -234694 -126862 279768 -16260 79927 -57316
19412 25844 -160680 -14583 -64346 -105190 177390 -241808 307594 -208592 170621 71479
19401 -28261 61958 150945 -80831 -157845 68417 57581 -48384 333928 -1526 -135527 -26535
19389 -255615 -162559 246951 -75543 -128689 -113522 -92965 60360 78949 -31332 -181905 -225025
19378 -225025 -24300 -103874 -170849 -47281 292115 206670 178916 -87264 102278 -289110 -202055
19367 -202055 -258086 43495 -270594 -340878 -81175 -78578 257989 56185 -169227 -48337 -146814
19356 -146814 103876 92651 -210498 -75924 -18071 -38903 -101033 -234384 26206 170365 131262
$$ packed form
19436e8406B72071e7992A93504B0785g4794o6717H4026A9094i9895B63572b12341
19424e912k2006G3110b62025A89944f8222j66472J07832B79768a6260G9927e7316
19412B5844a60680a4583m9763m0844A77390b41808C07594b08592A70621G1479
19401b8261F1958Q8987h0831p7014F8417j0836d8384C33928a526j34001b6535
19389b55615R3056B46951g5543n3146J5167K0557F0360J8589c1332j50573m3120
19378b25025b4300p9574o6975d7281B92115q5445k7754h7264A02278b89110Q7055
19367b02055n6031D3495b70594p0284h1175K597B57989E6185a69227d8337r8477
19356a46814A03876j1225b10498g5924a8071k0832o2130j33351B6206J44159l9103
$$ plain form
19345 131262 -121296 49957 189161 -347396 197458 255656 325017 154407 140032 140537 -104197
19333 -236616 -205080 97950 -95277 100428 -236514 -8298 -44577 134301 29808 63671 234985
19322 234985 -128452 141950 -440248 -315123 164164 53045 -345 -19570 -123601 -12083 -92025
19311 -92025 -208326 -51166 -128169 -285827 -28617 -39177 -102213 -250767 39521 -100622 -292944
19300 -292944 -58712 -20540 49237 -63306 -331207 -209693 -83072 105876 91878 -5244 -175363
19289 -175363 -110761 -262246 -51485 -188253 -248772 -104424 -75997 -46114 -104128 70121 -25886
19277 -82969 -55647 -244493 -28196 86033 -166418 -329706 178309 -7350 48506 11342 80654
19266 80654 57342 -61232 -230130 108548 -51634 -102193 71520 -4375 82264 -109299 -169965
$$ packed form
19345A31262a21296D9957J39204c47396A97458N8198O9361A54407j4375N05a04197
19333b36616L1536I7950i5277A00428b36514h298l6279A34301B9808L3863J71314
19322B34985a28452A41950d40248J25125A64164E3045c45j9225j04031a2083p9942
19311i2025j16301e1166p7003j57658b8617j0560o3036j48554C9521a00622j92322
19300b92944e8712b0540D9237f3306k67901J21514h3072A05876j3998e244j70119
19289a75363O4602j51485e1485j36768o0519a04424K8427K9883n8014G0121b5886
19277h2969K7322j88846b8196H6033a66418j63288A78309g350D8506A1342O9312
19266H0654k3312f1232j68898A08548e1634n0559G1520d375H2264a09299o0666
$$ plain form
19255 -169965 -236511 -84418 61620 103504 42098 -353771 -129528 -150066 -25344 -156176 16895
19243 -108406 102249 -158676 -177784 162956 -208232 -154466 -474024 -43931 -248953 -495713
19233 -495713 121604 199334 -140450 213644 -168835 -29586 147669 171721 -1896 97522 97544
19222 97544 -45471 188066 -107612 -392357 -246648 -79068 -307471 381657 -56604 -3169 -182641
19211 -182641 224375 -92004 107689 190445 -234283 11754 92341 58359 64701 -44571 -283247
19200 -283247 -228858 137149 -17720 112282 155798 -158658 -177661 -225064 -46761 -110263 163467
19188 -160413 -30848 -80758 -104737 -100579 -17744 25118 -46226 -219424 140832 -206910 -277247
19177 -277247 -272328 -393171 105133 42243 -263450 -85026 -187355 -280423 -243977 -38668 95454
$$ packed form
19255a69965o6546h4418F1620M1884D2098c53771a29528k0538b5344j30832A6895
19243a08406A02249a58676j9108A62956b08232N3766l19558d3931k05022k46760
19233d95713A21604P7730a40450B13644a68835b9586A47669K4052a896I7522K2
19222I7544d5471A88066a07612k84745J45709g9068k28403C81657e6604c169j79472
19211a82641B24375i2004A07689Q2756b34283A1754Q0587l3982O342d4571k38676
19200b83247N4389A37149a7720A12282M3516a58658j9003m7403d6761o3502A63467
19188a60413c0848m9910k3979M158a7744B5118d6226j73198A40832b06910p0337
19177b77247M919j20843A05133D2243b63450h5026j02329r3068L6446c8668I5454
$$ plain form
19165 -21402 -180133 20749 -388580 -215753 -203021 -119806 -115467 -252465 -253435 -146042 -35376
19153 53699 176832 -282560 38207 68179 -65656 188231 103414 134923 -127637 -57030 59322
19141 3938 -315141 -85181 -71269 146510 212023 -331534 99341 -22263 -16808 -155410 -65981
19129 105073 -175302 -153256 -175267 -59868 -114180 -13284 82326 80538 -41699 162188 109610
19118 109610 16211 75738 94915 -34124 97829 -138662 -22286 -50878 -192612 -192732 -35209
19106 204570 -291455 -253159 162070 -113587 8245 -108027 -291964 -154662 -209484 371290
19095 129831 -45077 -313303 2619 -98469 -214032 -85133 132939 195326 -8338 14622 48839
19084 48839 193019 45526 1258 290915 -308955 -43026 -136641 -17702 -83666 -63834 -283109
$$ packed form
19165b1402j58731B0749c88580J72827J2732Q3215M339j36998r70J07393c5376
19153E3699J23133b82560C8207K9972f5656A88231q4817L1509a27637e7030E9322
19141C938c15141h5181J3912A46510O5513c31534I9341b2263N455j38602f5981
19129A05073a75302K2046k2011e9868n4312a3284H2326j788d1699A62188n2578
19118A09610A6211N9527J9177c4124I7829a38662b2286k8592j41734j20c5209
19106B04570b91455L8296A62070a13587H245a08027j83937J37302n4822C71290
19095A29831d5077k68226B619i8469j15563h5133A32939O2387h338A4622L4217
19084D8839J44180D5526A258K89657c08955d3026r3615a7702o5964J9832k19275
$$ plain form
19073 -283109 -161008 -231924 146431 -82037 158605 97047 47916 -182771 -293449 135916
19062 -212008 333605 -100464 134622 -138973 101099 13594 -73207 93934 -276385 164428
19051 -184835 -104866 -89011 78869 146064 -60324 -37641 -95682 -245500 -17033 -106152 -283803
19040 -283803 117625 -144989 164031 100650 -144021 271214 -20407 330251 131462 21210
19029 -148699 -6400 139035 69008 121616 184448 -59631 259886 -253815 49420 283663 -234002
19017 -39008 -157674 -167136 -9791 -25511 100447 -13207 -57741 284402 44315 136728 -184984
19005 -119432 -541819 -126407 101573 -37365 -287492 -255362 -299257 -399946 344328 23760
18994 -167817 29612 -253265 -133144 60717 -29003 199617 117948 -488948 -316392 -94023
$$ packed form
19073b83109J22101p0916A46431h2037A58605o1558D7916a82771j10678A35916
19062b12008C33605a00464A34622a38973A01099A3594g3207I3934b76385A64428
19051a84835P9969J5855G8869O7195f0324K2683n8041j49818a7033q9119j77651
19040b83803A17625a44989A64031o3381a44021B71214b0407C30251A31462B1210
19029a48699f400A39035F9008N2608O2832e9631B59886b53815D9420K34243b34002
19017c9008j18666r462i791j5720A00447a3207m4534B84402D4315R2413a84984
19005a19432m22387a26407A01573c7365k50127L2130m3895j00689C44328B3760
18994a67817B9612b53265J20121F0717b9003A99617q1669d88948J72556i4023
$$ plain form
18983 -270122 59723 -135056 49472 -281045 -41946 -216124 -404852 -108804 6767 -336365
18972 -202597 -35003 205194 -330178 88053 -59544 152597 245749 -285775 -418424 -123354
18961 -327640 14737 425826 -51069 -368603 25836 -95393 -89146 141096 280614 -97946 -63288
18950 -63288 132541 -212993 64247 -120927 203393 -48994 -326304 72773 -4187 60388 -26444
18938 -200963 363351 40656 -95541 -218006 12113 58954 51415 145808 -5441 -69773 154257
18926 -58800 -187624 -191133 -22177 -143197 -176179 45311 18674 55213 -48883 -27261 31003
18914 -240926 -60534 71954 138228 -120128 -116006 -1857 98730 4106 -148905 -330341 -55821
18902 -69460 -38086 -309386 53259 144384 13771 203091 274467 169873 -113835 231374 260175
$$ packed form
18983b70122E9723a35056D9472b81045d1946j74178j88728a08804F767c36365
18972b02597c5003B05194c30178H8053e9544A52597R3152b85775j32649a23354
18961c27640A4737M11089e1069l17534B5836i5393O247A41096J39518i7946L4658
18950f3288A32541b12993F4247a20927B03393d8994k77310G2773d187F0388b6444
18938b00963C63351D0656i5541j22465A2113M6841p539R4393e441o4332A54257
18926e8800j28824l509b2177j21020l2982D5311A8674L6539d8883K1622C1003
18914b40926f0534G1954O6274a20128M122a857I8730D106a48905j81436e5821
18902f9460L1374k71300E3259R1125A3771J89320P1376j04594a13835B31374K8801
$$ plain form
18891 260175 -305741 -446667 -301232 -182629 28452 19755 -225473 -55214 15700 -431820
18880 359604 195689 83398 -253059 -165512 116692 -74496 8248 125661 25786 -124591 -238319
18869 -238319 -62803 -1234 -167275 -273534 -223239 -155073 -42534 -74233 -66545 -142458 11325
18857 304539 280802 -129464 -295860 87054 410590 -200075 39981 362934 301572 -125006
18846 -69635 -81243 104183 2479 -300024 88514 -110771 219637 11847 -70361 -520708 -44521
18834 -97610 -127885 44391 -122584 -158145 -132023 184560 -74945 80216 -118076 -152912 82383
18822 -217162 -222127 -178434 160014 -260010 -51740 218568 97230 -75730 101312 183120 163179
18811 163179 5011 310065 75207 -36158 274050 153626 123373 -124946 -33405 -359264 -142784
$$ packed form
18891B60175c05741j40926J45435J18603B8452q697b25473e5214A5700d31820
18880C59604j63915H3398b53059Q7547A16692g4496H248J17413B5786a24591j13728
18869b38319f2803a234j66041j06259N0295O8166d2534l1699P688p5913A1325
18857C04539k3737a29464j66396H7054L23536b00075C9981L22953o1362a25006
18846f9635j1608A04183B479c00024H8514a10771B19637A1847g0361m50347d4521
18834i7610l0275D4391a22584l5561K6122A84560g4945H0216a18076l4836H2383
18822b17162m965M3693A60014b60010e1740B18568I7230g5730A01312Q1808j9941
18811A63179E011L05054G5207c6158B74050j20424l0253a24946c3405l25859a42784
$$ plain form
18799 -410985 12184 -311005 -267980 150552 40040 -6029 82205 -70460 165390 -308658 -206717
18788 -206717 -42258 -26730 135934 -127412 28483 45526 -15067 80478 -113426 63429 152334
18777 152334 167507 -189715 -117993 -110915 -170092 280296 -44056 24462 -132013 -184207 -233970
18766 -233970 313017 257358 112084 -124848 -50260 -58416 -223851 27116 -93601 -216060 -25375
18754 -141636 -245842 -62363 85387 -239782 -62170 -46873 -223454 90611 -75587 118557 -131490
18742 76932 -177943 -104313 -133742 -100787 -210336 -33815 -11371 128840 293041 221371 -52735
18730 -433768 16122 -80184 -64347 -20163 -140001 -7105 60162 -270852 30381 60663 -194220
18718 -313039 89248 162648 106971 103152 -286976 203343 -252630 235346 171507 -144170 -241670
$$ packed form
18799d10985A2184c11005M3025A50552D0040f029H2205g0460A65390c08658J01941
18788b06717d2258J5528A35934a27412B8483J7043a5067H0478a13426F3429Q8905
18777A52334J5173a89715P1722P078n9177B80296d4056B4462a32013n2194m9763
18766b33970C13017n5659A12084a24848e0260q156j65435B7116i3601j22459b5375
18754a41636j04206f2363H5387b39782f2170J5297j76581I0611g5587A18557a31490
18742G6932a77943P3630k9429L2955j09549c3815a1371A28840J64201p1670e2735
18730d33768A6122h0184J5837b0163j19838g105F0162b70852C0381L0282a94220
18718c13039H9248P3400n5677l819b86976B03343b52630B35346o3839a44170r7500
$$ plain form
18707 -241670 -77158 -76655 50082 365925 -244714 149368 40612 -75405 -101994 40164 -325946
18695 -152937 -160017 -110949 -84801 133651 185344 -453465 -47884 -90126 518797 -35713 -312150
18684 -312150 67546 -249570 348336 -220358 103462 -292467 67313 6853 -34732 46810 -228799
18672 85727 -283768 111232 66752 -173982 22598 -187540 -48587 -147933 128003 -16191 -216651
18661 -216651 138832 -13645 -138483 141390 -94415 -125004 54372 -146073 70079 -275843
18650 445287 227865 -284764 -353991 138656 85640 118128 -236995 200890 -107887 -385784
18640 -385784 -72233 -282567 -204298 216785 169429 289878 -21531 -152836 39872 223363
18630 223363 -490578 -16472 -34467 130695 75573 61108 -136554 114877 114784 64894 36949
$$ packed form
18707b41670g7158N03E0082L15843b44714A49368D0612g5405k6589D0164c25946
18695a52937p080M9068K6148A33651N1693d53465d7884m2242E18797c5713k76437
18684c12150F7546b49570C48336b20358A03462b92467F7313F853c4732D6810b28799
18672H5727b83768A11232m4480a73982B2598a87540d8587r9346A28003a6191k00460
18661b16651A38832a3645j24838A41390i4415l0589E4372a46073G0079b75843
18650D45287k17422b84764o9227A38656n3016L2488b36995B00890a07887k77897
18640c85784g2233k10334P8269B16785m7356J20449b1531j31305C9872J83491
18630B23363d90578a6472j7995A30695n5122j4465a36554A14877r3m9890k7945
$$ plain form
18619 36949 -63598 -187157 148882 -321195 -359500 -141923 171492 -164826 232366 -115988
18608 30171 -356639 -157998 -277626 -50180 -237142 -80519 -148090 -81070 184152 161619 -152946
18596 -360783 66781 -118180 -13588 -134499 -50565 -333745 -143376 -202949 -107079 -160081 -53432
18584 -182310 -50236 177798 -44268 -167308 180719 -161777 -122562 17244 112537 -106550
18573 -179424 -113644 162013 -6450 -57219 -46882 -47821 309556 -100984 -56436 212570 -25293
18561 -68183 -385085 -63390 -34745 -334884 40667 207880 -288943 138995 119190 -252685
18550 -327293 -170465 -6680 -210603 -162734 -185678 -77300 42307 82400 -154793 -213661 41833
18538 256785 -179970 44400 -17930 -42867 102996 -35473 335479 -132873 -310501 -118519
$$ packed form
18619C6949f3598j23559A48882c21195l8305a41923A71492a64826B32366a15988
18608C0171c56639a57998j19628e0180j86962h0519o7571O7020A84152k2533a52946
18596c60783F6781a18180a3588j20911e0565k83180a43376n9573R5870n3002e3432
18584a82310e0236A77798d4268j23040A80719a61777L9215A7244R5293a06550
18573a79424O5780A62013f450n0769J0337r39C09556a00984M4548B12570b5293
18561f8183l16902f3390K8645l00139D0667J67213b88943A38995j9805b52685
18550c27293J56828f680k03923M7869k2944g7300D2307M0093a54793n8868D1833
18538B56785a79970D4400a7930k4937A02996c5473C35479a32873j77628a18519
$$ plain form
18527 173538 -75370 -210371 -184854 -27068 -404635 97897 252974 41604 67591 176562 269914
18516 269914 -200996 -123504 -142925 -262502 -93939 239468 -189914 -407135 -134428 209495
18505 -147486 50309 -241229 -41195 -208019 -145827 -274823 -119182 250588 100794 148268
18495 148268 105041 20518 -141227 -214125 -189172 -104567 -51965 -249398 -182026 77884 23326
18483 -57980 276388 -270395 -113015 -42702 -47441 -168338 -169241 6160 -234118 11369 -79180
18471 330704 -95085 -99613 -37658 283142 4239 -50870 -137565 291825 127427 -135332 -201474
18460 -201474 -308472 -82021 -60571 2950 265650 -333565 300275 -86337 -123425 -49923 143158
18448 292779 -101186 26346 68223 993 -125139 172616 -11123 -70915 35533 63284 -373029
$$ packed form
18527A73538g5370j35001K5517b7068l77567I7897J55077D1604K5987J08971R3352
18516B69914b00996P7492j9421j19577i3939B39468a89914k17221a34428B09495
18505a47486E0309b41229d1195j66824O2192j28996a19182B50588A00794M7474
18495A48268m3227B0518a41227p2898K4953Q4605e1965j97433O7372G7884B3326
18483e7980B76388b70395a13015d2702m739j20897r03F160b34118A1369g9180
18471C30704i5085m528c7658B83142D239e0870q6695B91825A27427a35332o6142
18460b01474j06998h2021K1450B950K62700c33565C00275h6337l7088d9923A43158
18448B92779a01186B6346M1877I93a25139A72616a1123n9792C5533K7751c73029
$$ plain form
18436 -45195 115855 -203017 -92224 230227 -131272 -42710 58938 -148244 73307 -134391
18425 -112967 76030 -62356 165366 -183358 -277815 -318439 29855 -83278 -4295 86881 -270160
18413 140122 214112 -179699 256355 -214329 -12308 150404 76897 -192125 -158232 -488916
18403 -488916 -112287 -200570 -71817 121019 -292163 77113 90958 103254 -129855 -191491 -403719
18392 -403719 228 -185995 -221392 47592 39650 -7074 -326764 -27432 9721 357660 -399985 -21806
18379 25582 267611 -170141 -26675 -307109 -56361 -112280 184368 114136 121013 97793 -193730
18367 -340337 114011 53113 -52335 -241291 -92870 -87274 101533 -213948 -181710 -35498 24021
18355 -76373 32301 -135460 33273 -62915 -181176 -52087 -59138 276629 -203 128536 -7924 -35456
$$ packed form
18436d5195A15855b03017i2224B30227a31272d2710E8938a48244G3307a34391
18425a12967G6030f2356A65366a83358r4457m0624B9855h3278d295H6881b70160
18413A40122P3990a79699B56355b14329a2308A50404p3507a92125L3893l30684
18403d88916a12287q8283g1817A21019b92163G7113J3845J2296a29855o1636k12228
18392d03719B28a85995l5397D7592p942g074l19690b7432I721L47939c99985b1806
18379B5582K42029a70141b6675k80434e6361n5919A84368p0232O877k3220a93730
18367c40337A14011E3113e2335j88956i2870N596A01533b13948L2238c5498B4021
18355g6373C2301a35460C3273f2915j18261e2087p051B76629b03A28536g924k7532
$$ plain form
18343 -35456 -122127 -32278 15171 167995 -7918 -511984 19472 -156633 306606 43217 -82032
18331 -258681 -111013 146307 84848 -451787 -57619 277526 -119692 -32401 36937 175136
18321 175136 -207567 333015 -99559 -184981 -47036 -187290 96789 197735 -35782 220682
18310 -67371 85498 -133853 -2570 296741 -162998 107157 -46595 93648 -47226 235872 -180816
18298 -266053 -39880 111616 -89323 -299297 -85179 263509 337705 -90459 552396 42045 74841
18287 74841 140426 -163861 110308 -128305 -22685 165544 -238758 -321122 -2670 70257 108850
18276 108850 -441588 -4860 21930 41702 134885 -102295 -117888 46479 -2132 -143712 -33450
18264 -205602 186655 -155532 80764 184654 -139967 -90579 -68747 -181852 -224479 89385
$$ packed form
18343c5456q6671c2278A5171J52824g918n04066A9472a56633C06606D3217h2032
18331b58681a11013A46307o1459d51787e7619B77526a19692c2401C6937J38199
18321A75136b07567C33015i9559q5422d7036j40254I6789J00946c5782B20682
18310f7371H5498a33853b570B96741a62998A07157d6595I3648d7226B35872a80816
18298b66053c9880A11616h9323k09974h5179B63509P4196i0459E52396D2045L2796
18287G4841O5585a63861A10308a28305b2685A65544b38758q2364b670G0257L8593
18276A08850d41588d860B1930J9772R3183a02295j5593D6479b132j41580c3450
18264b05602A86655a55532H0764J03890a39967M9388K1832j13105m2627H9385
$$ plain form
18253 185347 -331742 61112 99814 -12085 49097 -191403 61833 187418 -133464 -281180
18243 -281180 38984 126265 108026 -200909 125595 -304409 -160424 -96230 -39993 118859
18232 -324468 -12177 -87985 28026 233445 -225413 152372 103155 -270563 -293870 -53501 -115501
18221 -115501 -56675 -18790 6650 -413811 -84883 -99844 -396063 284640 -8893 -148077 115168
18209 57232 4524 41944 -18291 187433 -139067 -260183 -301637 -149119 36802 -156440 103967
18197 -112939 257337 -41832 -130436 -128871 -347563 -26847 -113694 -59583 -78557 30731 -367911
18185 85719 -344323 73179 -46810 41507 -230597 -243090 -33558 -11884 -319047 66517 -59387
18173 -89525 -158111 16849 91396 -263524 -55734 -152898 28328 -70447 -5615 301917 -73427
$$ packed form
18253A85347c31742F1112L8702a2085D9097a91403F1833J25585a33464j47716
18243b81180C8984Q7281j8239b00909A25595c04409J43985O4194c9993A18859
18232c24468a2177p5808B8026K05419b25413A52372m9217b70563k3307e3501o2000
18221a15501e6675a8790F650d13811h4883j4961k96219B84640h893j39184A15168
18209E7232D524L7420a8291A87433a39067j21116m1454a49119C6802a56440A03967
18197a12939B57337d1832q8604J565k18692b6847q6847N4111j8974C0731c67911
18185H5719c44323G3179d6810D1507b30597j2493c3558a1884l07163F6517e9387
18173h9525o8586A6849P4547b63524e5734r7164B8328g0447e615C01917g3427
$$ plain form
18161 25934 -131960 292912 -160366 422008 182538 -60174 -169031 169993 -64926 -161139
18151 -161139 108584 -96151 11543 312879 14019 -29764 -51102 24654 47660 -254435 -69875
18139 -40726 282958 -244675 -455933 -57494 -84053 17100 -137550 -131006 4228 -74729 -36147
18127 84451 43909 221547 -82562 78293 -78883 -115792 148427 -304551 -115989 -885 -276983
18116 -276983 -146889 -506330 -232572 -99260 49397 -97996 -108416 -168308 166185 236201 -244649
18104 -40727 79538 -448141 -107321 -83688 -180080 103533 -323652 -180915 221722 378156
18094 378156 -23567 79783 -159471 51996 193180 -214819 -181609 -78028 -529214 -231388
18083 10100 -339560 413491 -130422 15684 -62982 -187399 134646 -139626 548899 -121366
$$ packed form
18161B5934a31960B92912a60366D22008A82538f0174j08857A69993f4926r6213
18151a61139A08584i6151A1543L01336A4019b9764k1338B4654K3006b54435f9875
18139d0726B82958b44675k11258e7494k6559A7100a37550O544D228g4729c6147
18127H4451m0542J77638h2562G8293g8883l6909A48427c04551a15989h85k76098
18116b76983J30094l59441b32572i9260D9397i7996j0420n9892A66185P0016b44649
18104d0727G9538d48141a07321K3633r6392A03533c23652J42737B21722J56434
18094C78156b3567G9783a59471E1996J41184b14819L3210g8028m51186b31388
18083A0100c39560D13491a30422A5684f2982j24417A34646a39626E48899a21366
$$ plain form
18072 -53427 -135083 -50898 -91514 74671 -60802 -104530 -50166 78141 -157004 35746 -235271
18060 230986 19764 -11258 -109325 -139700 73503 -58784 -188379 -45622 140560 -32064 39245
18048 25390 -362433 -180697 -2303 -180234 -185699 -61982 238895 -72066 127479 -73896 -46389
18037 -46389 98607 -163937 -25915 240594 -229067 -126350 -233346 82506 -67468 -194902
18027 -194902 -54138 -222158 -236811 -137400 146281 -142547 -110820 -227137 137743 78127
18017 78127 62463 217769 180780 278100 -159634 240762 15988 3187 -267168 1383 240510
18006 240510 240335 -220328 -157640 -200839 -197394 -87538 -166120 -200543 4213 -109345 -371742 -104056
17993 -75467 25980 -168866 -56741 109762 1325 30824 50432 35388 -130431 -253855 111432
$$ packed form
18072e3427q1656e0898m0616G4671f0802m3728e0166G8141a57004C5746b35271
18060B30986A9764a1258r8067l0375G3503e8784j29595d5622A40560c2064C9245
18048B5390c62433a80697b303j77931n465f1982B38895g2066A27479g3896K7507
18037d6389I8607a63937b5915B40594b29067J02717j06996H2506f7468j27434
18027a94902e4138j68020j4653R9411A46281a42547L1727j16317A37743n9616
18017G8127j5664J55306l6989R7320a59634B40762A5988C187b67168A383K39127
18006B40510j75b20328O2688m3199L445h7538p8582l4423D213a09345k62397a04056
17993g5467B5980a68866e6741A09762A325K9499J9608j5044a30431j23424A11432
$$ plain form
17981 166985 58879 61256 -80763 228255 15234 134801 -248898 191554 -207646 -228167 21235
17969 -34120 99190 -117520 6816 -83700 120221 -198568 67419 115328 -98707 281509 122225
17957 45859 -38267 150743 -336205 172535 74684 -86978 -60160 -21565 15901 27380 -209738
17945 43111 332321 102038 157546 71390 -151298 -68564 -142467 -362062 149530 -254457
17934 -121792 -175729 -39357 -106060 151229 133055 129578 128994 -51927 -179682 -24850 -237631
17923 -237631 -269799 2142 -8632 260811 -280035 112022 -395507 -270836 274569 -239460
17912 -26150 -202303 86624 111336 -247855 -211424 -190449 -385725 -344729 121480 -124854 -153062
17901 -153062 -35363 71750 230620 4817 296731 -221813 -32284 -276344 -46693 -52790 -150569
$$ packed form
17981A66985E8879K377h0763B28255A5234J19567b48898A91554b07646k0521B1235
17969c4120I9190a17520F816h3700A20221a98568F7419M7909i8707B81509A22225
17957D5859c8267A50743c36205A72535G4684h6978K6818b1565A5901J1479b09738
17945D3111K89210A02038N5508G1390a51298f8564p3903k19595A49530b54457
17934a21792n3937c9357o6703A51229j8174l477n84e1927j27755b4850k12781
17923b37631l2168B142h632B60811b80035A12022c95507J24671B74569b39460
17912b6150j76153H6624K4712b47855L6431K0975j95276M0996A21480a24854k8208
17901a53062c5363G1750J58870D817K91914b21813c2284k44060d6693o097r7779
$$ plain form
17890 -150569 -68811 113642 312332 29663 -3272 90266 -217437 -134997 -158271 -173426 -273808
17879 -273808 365875 77823 -273894 142301 208700 355626 3397 -291623 8416 55300 133125
17868 133125 179155 -2381 46198 79391 -97525 -130239 -26464 198202 -220421 -43093 245178
17856 -57880 -218129 -5094 33442 124586 276249 5217 72683 72764 30107 -128295 205999 -130076
17843 159840 -210990 -121215 -388774 -187664 -244861 33057 -110640 383426 46156 28263
17833 28263 63237 -112775 -240537 88355 -173820 -261756 -145389 -9639 -245985 100764 176154
17822 176154 27878 -166530 34738 344341 -3071 -86694 -222682 269602 1199 116888 202404
17811 202404 162924 183761 -90444 -363091 -231121 -70845 91925 146746 223172 -215081 -82060
$$ packed form
17890a50569f8811A13642J98690B9663c272I0266b17437Q2440k3274j5155j00382
17879b73808C65875G7823b73894A42301O6399J46926C397b91623H416M6884P7825
17868A33125M6030b381D6198L3193i7525l2714b6464A98202b20421d3093B45178
17856e7880j60249e094C3442R1144J51663E217O7466Q1C0107a28295B05999a30076
17843A59840b10990Q9775k67559a87664n7197C3057a10640C83426D6156j7893
17833B8263L4974a12775j27762H8355a73820q7936J16367i639k36346A00764P5390
17822A76154B7878a66530C4738L09603c071q3623j35988B69602A199J15689Q5516
17811B02404l9480K0837i0444k72647J31970g0845I1925N4821P6426b15081h2060
$$ plain form
17799 -116972 355482 -76663 146737 20097 132592 -27332 -470394 -73554 -13054 -325388
17789 -325388 60450 -130877 -8059 83599 251335 135533 555480 -16553 -148014 -134004 -63142
17777 -188648 308739 22308 -80750 -315045 -61653 211880 -156815 203306 24537 -78714
17766 -397423 109202 -58607 72354 -250741 112003 335 -18807 -2175 69577 -31786 131190
17754 -357570 182492 -151648 -188740 80673 92001 212926 -115384 -183040 -160309 -178914 28091
17742 -108269 -39057 106433 31689 88329 -393991 132621 -391143 176805 -3957 -292115
17732 -292115 -253558 81616 183229 184708 112709 -148450 -71099 44753 -288382 -143219 6687
17720 485015 191096 -6348 -62003 138760 -359694 323822 -164302 136865 69073 -297310
$$ packed form
17799a16972C55482g6663A46737B0097J12495b7332m43062g3554a3054l12334
17789c25388F0450a30877h059H3599J67736j15802M19947a6553j31461J4010f3142
17777a88648C08739B2308h0750k34295f1653B11880a56815B03306B4537g8714
17766c97423A09202e8607G2354b50741A12003C35a8807b175F9577c1786A31190
17754c57570A82492a51648l7092H0673J1328J20925a15384o7656K2731j8605B8091
17742a08269c9057A06433C1689N6640c93991A32621c91143A76805c957k88158
17732b92115L8557H1616J01613J479p1999a48450g1099D4753b88382a43219F687
17720D85015A91096f348n5655A38760c59694C23822a64302A36865o7792b97310
$$ plain form
17709 25588 -106667 -34529 -46743 59330 113812 -39332 27405 165593 -133349 -212382 -206785
17698 -206785 79971 -36080 -57601 -71038 491726 86932 120360 -183577 -84259 33272 78096
17687 78096 62773 -52708 136664 125894 -13637 -51889 -356887 125970 -219 -62433 -146487
17676 -146487 16453 227027 -141826 -25960 168993 258225 163205 71640 -215780 29063 94194
17665 94194 48200 154260 -22579 194993 235673 -75788 -28627 -304356 -293660 59913 171300
17654 171300 -67685 -5356 -673 -45989 11455 31835 -225932 -247161 -61562 -252346 -45658 315647
17641 -247081 -16237 207381 -27587 460160 -77551 127891 -3841 314598 -77487 225338 35431
17629 135991 241052 -78255 -135730 -62271 -269706 -233959 -58186 12000 87352 1848 -233982
$$ packed form
17709B5588a06667c4529j2214E9330N4482c9332B7405J38188a33349p9033N597
17698b06785G9971c6080k1521j3437D91726H6932L3428a83577h4259C3272M4824
17687G8096j5323e2708A36664j0770a3637l8252l04998A25970b19o2214q4054
17676a46487A6453K10574a41826b5960A68993Q9232r5020G1640b15780B9063O5131
17665I4194m5994J06060b2579A94993M0680g5788b8627k75729J0696E9913J11387
17654A71300f7685e356f73m5316A1455K0380b25932k1229f1562j90784d5658C15647
17641b47081a6237B07381b7587D60160g7551A27891c841C14598g7487B25338C5431
17629A35991J05061g8255n7475f2271k07435L5747e8186A2000P5352A848b33982
$$ plain form
17617 -10572 101023 148541 235326 -25234 155066 334705 -38492 79646 -100322 11397 178516
17606 178516 -197102 42714 -191891 182935 103340 -13752 228461 -175360 103311 -106375
17595 103490 -462516 -199370 -89244 113956 68733 564964 16080 47662 285074 -13657
17584 165814 113992 201266 122 34692 -15826 270262 -198780 -58 -252048 7486 30238 -166595
17571 194313 141025 -131212 -37794 42980 -26812 61485 30816 -154231 -207710 -204962 -15746
17559 66870 210362 3843 -68275 -55889 422147 386653 -109575 -56260 294041 40175 28492
17548 28492 118352 -100178 -283054 -339253 -105506 46895 461763 -29297 -126528 151764 106564
17537 106564 -115517 223308 342470 204962 378801 114092 117040 81901 -12783 36792
$$ packed form
17617a0572A01023M7518Q6785b5234A55066J79639c8492G9646a00322A1397J67119
17606A78516a97102D2714a91891A82935p9595a3752B28461a75360A03311a06375
17595A03490d62516a99370h9244A13956m5223M96231A6080L1582K37412a3657
17584A65814n1822Q7274A22L4570a5826B70262a98780e8k51990G486K2752a66595
17571A94313n3288a31212c7794D2980b6812F1485l0669a54231n3479K748a5746
17559F6870J43492C843f8275J2386D22147l5494a09575N3315B94041D0175j1683
17548B8492Q9860a00178j82876n6199a05506D6895M14868b9297r7231A51764m5200
17537A06564a15517B23308J19162j37508J73839A14092K948l5139a2783C6792
$$ plain form
17526 -118086 32627 -93560 85807 -65343 149946 97021 -35906 259170 -73001 99265 15802
17514 -64187 -250789 32724 247381 96812 47005 -69090 -63447 -70965 100966 91227 50102 78601
17502 78601 147727 189083 212998 -72205 -98912 -334697 265954 -141712 205037 444248 232326
17491 232326 248910 -74942 -217629 -30558 247692 132589 300543 318199 168077 -22932
17480 321677 13246 -106677 -33707 31200 276132 292416 -292859 -57537 300399 256874 -6786
17468 67184 -156480 -8666 -95288 -214182 -39082 53993 4314 -23910 175740 -56254 153927
17456 107279 -446 -147817 65517 311940 251203 165131 159700 314685 23686 359 322788 172526
17444 172526 185279 354382 294859 75099 239642 342176 119322 233784 -145742 -184575
$$ packed form
17526a18086C2627i3560H5807f5343A49946n2925c5906B59170g3001I9265A5802
17514f4187j86602C2724K14657I6812D7005f9090N643p518A00966r739m1125K8499
17502G8601O9126M1356K3915g2205k6707k35785B65954a41712B05037K39211k11922
17491B32326J6584g4942j42687c0558B47692j15103J67954J7656j50122b2932
17480C21677A3246a06677c3707C1200K44932J6284b92859e7537C00399m3525f786
17468F7184a56480h666q6622j18894c9082E3993D314b3910A75740e6254A53927
17456A07279d46j47371F5517K46423o0737q6072n431J54985B3686C59L22429j50262
17444A72526J2753J69103n9523G5099J64543J02534A19322J14462a45742l8833
$$ plain form
17434 -184575 -38755 303063 279387 319234 360026 95882 144727 -31819 -5874 92556 138922
17423 138922 569242 88038 48485 109108 272861 115595 244662 417660 282633 490282
17413 490282 396147 293482 214271 281744 279508 -3589 325751 284824 323649 263071 92475
17401 176287 51511 -272009 500138 -32710 -258026 -283150 353464 219583 164020 315026
17391 315026 -12979 67753 286904 85484 74466 -50811 190753 529146 274539 28565 312175
17380 312175 -247242 -188958 83929 -446436 100300 -95250 -40987 295368 505108 64974
17369 -85041 99211 290511 123798 -39471 105354 85768 137080 -49335 231557 203087 -56754
17357 244878 -211592 255908 12893 283770 239528 422227 250353 112292 327414 247286
$$ packed form
17434a84575c8755C03063k3676L9847M0792I5882M8845c1819e874I2556M6366
17423A38922M30320H8038l9553O0623J63753A15595J29067J72998j35027K07649
17413D90282r4135j02665p9211O7473k236c589C25751m0927L8825o0578I2475
17401A76287E1511b72009E00138c2710k25316k5124C53464j33881n5563J51006
17391C15026a2979F7753K19151H5484j1018e0811A90753L38393k54607B8565K83610
17380C12175b47242N8284H3929d46436A00300i5250d0987B95368K09740F4974
17369h5041I9211J91300A23798c9471A05354j9586N1312d9335B31557k8470e6754
17357B44878b11592B55908A2893K70877m4242J82699j71874A12292K15122q0128
$$ plain form
17347 247286 -60180 191856 -104474 172060 178768 370897 -112352 163504 -199328 230660
17336 13020 -44291 -5233 12082 65612 14714 18603 458871 -89888 157445 390426 204659
17325 204659 385099 29041 57552 -57542 159495 32955 24624 79537 233188 291559 164162
17314 164162 216492 161906 51017 -132658 68359 136835 72057 40923 -105743 440585 -27453
17302 196738 121642 430123 -201079 -3842 109563 -212397 14640 183560 59660 170751
17292 170751 -104201 406518 81902 92924 192633 112559 185938 140999 384267 66323 -35488
17280 -206761 -26190 181618 114209 143553 256549 388551 141826 314524 225378 -30387
17269 154367 558956 234071 -45945 390937 -204715 -42483 131038 -6266 242240 349472
$$ packed form
17347B47286f0180A91856a04474A72060O708J92129a12352A63504a99328B30660
17336A3020d4291e233A2082N3530A4714L889M40268h9888A57445K32981j85767
17325B04659J80440B9041K8511e7542A59495C2955q331N4913J53651N8371j27397
17314A64162N2330n4586E1017a32658F8359O8476o4778l1134a05743D40585b7453
17302A96738p5096L08481b01079c842A09563b12397A4640J68920E9660J11091
17292A70751a04201D06518H1902J1022R9709q0074P3379m4939K43268F6323c5488
17280b06761b6190A81618o7409K9344J12996J32002A41826J72698q9146c0387
17269A54367M04589B34071d5945C90937b04715d2483A31038f266B42240J07232
$$ plain form
17259 349472 92316 35755 -74284 -271127 5955 -67482 279948 391286 46305 74285 80779
17248 80779 173852 165254 131314 247522 221648 235911 221526 459767 20218 -64782 90828
17236 119384 -77034 46008 188601 225638 168345 179484 260986 242932 -68640 462026 425516
17225 425516 108374 -40351 134633 187639 -54519 255777 270212 -10475 40100 215746 255363
17214 255363 145845 183284 216060 -49233 155909 458471 100062 348894 252709 -8282 80921
17202 -16413 189509 86112 -53572 296709 132151 550457 482787 249119 13943 -172950
17191 -78177 481113 443715 154520 453560 293394 252953 388386 443852 219863 336579
17181 336579 73676 219400 194450 259724 70577 -143479 276361 251189 242096 -97331 331354
$$ packed form
17259C49472I2316C5755g4284j96843E955f7482B79948J11338D6305K7980O494
17248H0779R3073q598l3940J16208k5874J4263j4385K38241B0218f4782I0828
17236A19384g7034D6008J42593L7037n7293J1139Q1502j8054f8640D62026l6510
17225D25516A08374d0351A34633N3006e4519B55777J4435a0475D0100J75646L9617
17214B55363j09518L7439L2776d9233A55909L02562A00062K48832r6185h282H0921
17202a6413A89509H6112e3572B96709A32151M18306o7670k33668A3943a72950
17191g8177D81113l7398A54520K99040j60166m0441J35433N5466B19863J16716
17181C36579G3676J45724k4950O5274G0577a43479B76361k5172r093i7331C31354
$$ plain form
17169 218318 297504 124419 202472 94662 30024 174094 269007 280029 45297 283270 256021
17158 256021 381153 325295 158735 172875 299548 338382 235823 349285 -44642 192354
17147 170114 242434 443402 450274 208606 226692 118241 45004 217498 276816 276415 267029
17136 267029 237538 369115 201337 373140 51382 321463 140830 149351 94629 207089
17126 207089 171744 600467 223218 328741 90294 472994 98911 200735 342262 212547
17116 212547 270863 179598 373778 437439 674094 676251 491700 247450 422645 353813 267280
17105 267280 283921 374954 62841 229956 -95004 140581 156439 155348 271217 227588 399414
17094 399414 399144 338058 398825 380829 484885 516820 122988 611557 417099 278776 263525
$$ packed form
17169B18318P9186A24419P8053I4662C0024J44070R4913J1022D5297K37973k7249
17158B56021J25132n5858A58735J4140J26673L8834j02559J13462d4642A92354
17147A70114P2320K00968O872B08606J8086j08451D5004J72494N9318m01r386
17136B67029k9491J31577j67778J71803E1382K70081A40830Q521n4722J12460
17126B07089l5345M28723B23218J05523I0294L82700I8911J01824J41527j29715
17116B12547N8316r1265J94180O3661K36655K157j84551k44250J75195o8832q6533
17105B67280J6641R1033F2841J67115i5004A40581J5858j091J15869m3629J71826
17094C99414k70o1086O0767j7996J04056L1935A22988M88569j94458j38323j5251
$$ plain form
17083 263525 252892 267182 619885 155652 356549 226753 354704 394920 422591 293794
17073 293794 261059 147444 183948 92670 611379 351476 405350 202350 206133 299048 272108
17062 272108 315014 414204 358826 324163 519275 373278 275254 415932 517201 279008
17052 279008 470938 334219 412647 207033 347257 753663 441056 632267 407402 158114
17041 156104 639199 219983 491637 759417 427437 547304 506806 262940 348972 229141
17031 229141 589437 640448 528927 540756 210942 346283 513533 700108 749834 728101
17021 728101 965368 556132 231270 734756 679581 706277 425362 363119 595421 539171
17011 539171 645355 615628 519115 579574 691660 295147 1083290 895865 561832 698756
$$ packed form
17083B63525j0633J4290L52703A55652K00897j29796J27951M0216K7671j28797
17073B93794l2735j13615L6504r1278N18709k59903N3874B02350L783R2915k6940
17062B72108M2906R9190n5378l4663J95112j45997r8024J40678J01269k38193
17052B79008J91930j36719P8428k05614J40224M06406l12607J91211k24865A58114
17041A56104M83095B19983K71654K67780l31980J19867m0498k43866Q6032j19831
17031B29141L60296N1011j11521J1829B10942J35341J67250J86575M9726k1733
17021G28101K37267m09236B31270N03486n5175K6696k80915o2243K32302n6250
17011E39171J06184k9727r6513O0459J12086B95147P88143j87425l34033J36924
$$ plain form
17001 698756 488520 779573 567587 356437 318028 771061 105980 463324 456344 633472
16991 633472 623447 585773 601472 633937 968044 724332 698221 514900 602464 540972 526812
16980 526812 640910 618525 779716 576313 620236 904555 625268 647874 801058 741572
16970 741572 866496 737960 808199 544526 416614 973673 725159 1199162 1003473 946183
16960 946183 994856 1020592 893005 1052194 567402 1113911 957834 1047250 806608 944495
16950 944495 707771 874883 840537 922888 753852 735435 1005764 1360729 970846 792112
16940 792112 1091002 1101627 943144 878268 1003201 1065979 1220467 1118460 943071 948443
16930 948443 1209336 1104418 992655 971606 1138024 1308147 1188373 819685 1292229 1617105
$$ packed form
17001F98756k10236K91053k11986k11150l8409M53033A05980L57344o980J77128
16991F33472j0025l7674J5699L2465L34107k43712k6111j83321Q7564o1492j4160
16980E26812J14098k2385J61191k03403M3923K84319k79287K2606J53184n9486
16970G41572J24924j28536P0239k63673j27912N57059k48514M74003j95689n7290
16960I46183M8673K5736j27587J59189m84792N46509j56077Q9416k40642J37887
16950I44495k36724J67112l4346Q2351j69036j8417K70329L54965l89883j78734
16940G92112K98890J0625j58483o4876J24933O2778J54488j02007j75389N372
16930I48443K60893j04918j11763k1049J66418J70123j19774l68688M72544L24876
$$ plain form
16920 1617105 1174818 1120115 1279390 1213580 1292080 1496241 1157668 910374 1701481 1281229
16910 1281229 1407980 1195645 1277008 1545877 1536698 1365289 1067887 1714697 1447722 1713442
16900 1713442 1508903 1408302 1490678 1716822 1526156 1610291 1697170 1852537 1637113 1669118
16890 1669118 1836288 1666766 1524690 1946823 1951731 1686196 1684619 2271908 1897081 1591788
16880 1591788 1840815 1702977 1885719 1835997 1953048 2373391 2187458 2009244 1968506 2104818
16870 2104818 2062402 2124430 2374314 2143168 2267712 2496497 2285059 2241067 2584424 2480388
16860 2480388 2425477 2526549 2488949 2996179 2636302 2598280 2891732 2535843 2817858 2742103
16850 2742103 3028532 3003611 2599270 3014212 2856163 3181210 3032875 2929408 3231043 3310919
$$ packed form
16920A617105m42287n4703J59275o5810P8500K04161l38573k47294P91107m20252
16910A281229J26751k12335Q1363K68869r179j71409k97402O46810k66975K65720
16900A713442k04539j00601Q2376K26144j90666Q4135Q6879J55367k15424L2005
16890A669118J67170j69522j42076M22133M908k65535j577N87289l74827l05293
16880A591788K49027j37838J82742m9722J17051M20343j85933j78214m0738J36312
16870B104818m2416O2028K49884k31146J24544K28785k11438m3992L43357j04036
16860B480388n4911J01072l7600N07230l59877l8022K93452l55889K82015p5755
16850B742103K86429k4921m04341M14942j58049L25047j48335j03467L01635P9876
$$ plain form
16840 3310919 3464316 3070421 3533236 3717610 3520660 3473950 3450267 3906079 3693215 3799686
16830 3799686 3740865 3688045 4200074 4473278 4198977 4341537 4697592 4309735 4627364 4629851
16820 4629851 4669184 4923661 4761338 5160630 5351812 5311821 5667747 5288766 5462599 5441507
16810 5441507 5454688 5852797 5924318 6307138 6403657 6535991 6517070 6690122 6818262 6981153
16800 6981153 7572277 7283587 7398673 7583855 7943747 8214954 8315836 8439123 8615624
16791 8615624 8633080 9213421 9738949 9419204 9717606 9943604 10399805 10630921 11262061 11501524
16781 11501524 11722679 11991360 12699120 12754314 12899431 13652205 14119396 14273667 15198090
16772 15198090 15716123 15953825 16454983 17091444 17552582 18212601 18871113 19742262 20426485
$$ packed form
16840C310919J53397l93895M62815J84374j96950m6710k3683M55812k12864J06471
16830C799686n8821n2820N12029K73204k74301J42560L56055l87857L17629K487
16820D629851L9333K54477j62323L99292J91182l9991L55926l78981J73833k1092
16810E441507J3181L98109P1521L82820R6519J32334j8921J73052J28140J62891
16800F981153N91124k88690J15086J85182L59892K71207J00882J23287J76501
16791H615624J7456N80341N25528l19745K98402K25998M56201K31116O31140K39463
16781A1501524K21155K68681P07760N5194J45117P52774M67191J54271R24423
16772A5198090N18033K37702N01158O36461M61138O60019O58512Q71149O84223
$$ plain form
16763 20426485 20980082 22224762 22787900 23767119 24797811 25603353 26620309 27651534 28833105
16754 28833105 30226169 31473366 32868424 34279868 36115052 37793212 39325772 41953570
16746 41953570 43768841 45992815 48329148 50892590 53608413 56869077 59630848 63018146
16738 63018146 66392261 70174486 74424958 78572852 83013017 87810187 93046837 97962668
16730 97962668 103968607 109468094 115442412 121090842 127587129 133581087 139059386 144523664
16722 144523664 149694414 154591793 158643704 161698812 163866624 165264191 165416583 164884294
16714 164884294 162736547 160216466 156847467 152545950 147702280 142360136 136267980 130761274
16706 130761274 124596962 118407491 112038654 106497055 100559642 95319990 89914727 85173750
$$ packed form
16763B0426485N53597J244680N63138R79219J030692Q05542J016956J031225J181571
16754B8833105J393064J247197J395058J411444J835184J678160J532560K627798
16746D1953570J815271K223974K336333K563442K715823L260664K761771L387298
16738F3018146L374115L782225M250472M147894M440165M797170N236650M915831
16730I7962668O005939N499487N974318N648430O496287N993958N478299N464278
16722A44523664N170750M897379M051911L055108K167812J397567J52392n32289
16714A64884294k147747k520081l368999m301517m843670n342144o092156n506706
16706A30761274o164312o189471o368837n541599n937413n239652n405263m740977
$$ plain form
16698 85173750 80171136 75824346 71400260 67518792 64269563 60463265 57300034 54216863
16690 54216863 51031711 48607010 46404902 43685673 41852466 39806937 37789044 35946812
16682 35946812 34402677 32976809 31444501 30295774 29068444 27583772 26188156 25209903
16674 25209903 24176443 23045181 22403232 21645836 20668896 19706029 19033373 18289641 17659812
16665 17659812 17061605 16466247 15864486 15411360 14913769 14274801 13877518 13593978 13185089
16656 13185089 12603499 12180402 11675769 11453897 11421477 11075940 10865042 10377083 10121523
16647 10121523 10006488 9381957 9309478 8705161 8945847 8675216 8366801 8163293 7921936
16638 7921936 7756099 7296891 7443117 7328129 6986671 6331635 6439777 6711463 6272107
$$ packed form
16698H5173750n002614m346790m424086l881468l249229l806298l163231l083171
16690E4216863l185152k424701k202108k719229j833207k045529k017893j842232
16682C5946812j544135j425868j532308j148727j227330j484672j395616r78253
16674B5209903j033460j131262o41949p57396r76940r62867o72656p43732o29829
16665A7659812n98207n95358o01761m53126m97591o38968l97283k83540m08889
16656A3185089n81590m23097n04633k21872l2420l45537k10898m87959k55560
16647A0121523j15035o24531p2479o04317K40686k70631l08415k03508k41357
16638G921936j65837m59208J46226j14988l41458o55036J08142K71686m39356
$$ plain form
16629 6272107 6800435 5737373 5748654 5506672 5271131 5473839 5600766 5379734 5356887 5054808
16619 5054808 4964834 5195704 4607703 4572056 4455157 4386578 4455047 4088283 3992292 4037162
16609 4037162 4394468 4261699 3805339 3704251 3851246 3779509 3660206 3779096 3462318 3332455
16599 3332455 3384040 3490064 3358135 2964143 3245635 3372523 2926448 2987414 3279200 3078749
16589 3078749 3218198 2734323 2548490 2572026 2998837 2754589 2671099 2825709 2431805 2521377
16579 2521377 2561991 2209888 2348223 2347026 2256317 2474615 2383450 2112354 2182713 2582801
16569 2582801 2163102 1929563 2176523 2060831 1704240 1888977 1829501 1828439 1550437 1616374
16559 1616374 1784347 1796936 1921663 1832472 2069691 1467270 1662935 1697623 1622210 1778442
$$ packed form
16629F272107N28328j063062J1281k41982k35541K02708J26927k21032k2847l02079
16619E054808q9974K30870n88001l5647j16899o8579O8469l66764r5991M4870
16609D037162L57306j32769m56360j01088J46995p1737j19303J18890l16778j29863
16599C332455N1585J06024j31929l93992K81492J26888m46075O0966K91786k00451
16589C078749J39449m83875j85833K3536M26811k44248q3490J54610l93904Q9572
16579B521377M0614l52103J38335j197r0709K18298r1165k71096P0359M00088
16569B582801m19699k33539K46960j15692l56591J84737n9476j062k78002O5937
16559A616374J67973J2589J24727q9191K37219o02421J95665L4688p5413J56232
$$ plain form
16549 1778442 2022035 1432267 1870604 1533183 1500638 1620330 1681872 1477220 1564854 1139798
16539 1139798 1561516 1424586 1227466 1307059 1683026 1497460 1290205 1598314 1565031 1118288
16529 1118288 1235944 1132737 1427512 1317632 1153969 1288591 1412376 991253 1267711
16520 1267711 1511741 971918 1154478 1121399 1200486 1181044 1267430 1059684 1008169 1145842
16510 1145842 1293762 1135724 842503 924547 1279554 1019506 770117 1076349 1238836 715608
16500 715608 968149 926814 792968 770470 876618 974941 1148518 949307 769135 865982
16490 865982 1029654 741133 1053704 1075555 885224 641100 674826 961524 866991 725224
16480 725224 841593 925366 569344 1170686 914742 690954 640551 780315 730760 703213
$$ packed form
16549A778442K43593n89768M38337l37421l2545J19692O1542k04652Q7634m25056
16539A139798M21718j36930j97120P9593L75967j85566k07255L08109l3283m46743
16529A118288J17656j03207K94775j09880j63663J34622J23785m21123K76458
16520A267711K44030n39823J82560l3079P9087j9442Q6386k07746n1515J37673
16510A145842J47920j58038k93221Q2044L55007k60048k49389L06232J62487n23228
16500G15608K52541m1335j33846k2498J06148R8323J73577j99211j80172R6847
16490H65982J63672k88521L12571K1851j90331k44124L3726K86698r4533j41767
16480G25224J16369Q3773l56022O01342k55944k23788n0403J39764m9555k7547
$$ plain form
16470 703213 877249 722095 584507 515396 497249 486672 857738 318185 436570 779756
16460 779756 1003541 524236 712712 759703 461629 481306 833078 513001 923002 730084
16450 730084 577589 531532 367178 661127 796636 439842 817724 528176 564875 -33963
16439 456545 596941 371976 441172 453148 484546 641340 780705 387934 481195 677834
16429 677834 406518 550986 795801 445991 377384 448618 497567 420391 523915 348348
16419 348348 372075 274625 655736 627881 330161 516971 179207 566613 588408 492227
16409 492227 281607 450537 445682 531977 389239 465421 612928 585086 509317 271763 336207
16398 336207 273892 673824 153967 611233 164168 316427 426666 83175 574054 344869
$$ packed form
16470G03213J74036j55154j37588o9111j8147j0577L71066C18185J18385L43186
16460G79756K23785m79305J88476M6991k98074J9677L51772l20077M10001j92918
16450G30084j52495m6057j64354K93949J35509l56794L77882k89548L6699c3963
16439D56545J40396k24965O9196J1976L1398J56794J39365C87934R3261J96639
16429F77834k71316J44468K44815l49810o8607P1234M8949p7176J03524j75567
16419C48348K3727r7450L81111k7855k97720J86810A79207L87406K1795r6181
16409D92227k10620J68930m855Q6295j42738P6182J47507k7842p5769k37554O4444
16398C36207o2315L99932A53967M57266A64168J52259J10239H3175M90879k29185
$$ plain form
16388 344869 321091 131917 418441 266510 265351 528519 75133 221189 317760 348288 399524
16377 399524 138644 491708 523303 40821 335906 247596 323185 122534 262954 626082
16367 626082 204906 273739 304359 443206 817964 133629 119692 -78573 344267 146055
16356 391486 166397 225081 87545 180637 387494 58576 451101 518432 362191 614244
16346 614244 -89663 309677 -84624 490403 54529 393675 397167 159750 382216 595187
16336 595187 235236 -72032 315362 222939 430210 29566 131855 428325 586243 90251
16325 131339 166270 -120608 183614 88822 408794 186936 148005 276094 45337 145629
16315 145629 164384 266029 275998 233840 118017 322663 90765 458599 302751 -280365
$$ packed form
16388C44869k3778A31917K86524j51931j159K63168G5133J46056R6571L0528N1236
16377C99524A38644L53064L1595D0821K95085q8310P5589A22534J40420L63128
16367F26082B04906O8833L0620J38847L74758A33629j3937g8573C44267A46055
16356C91486A66397N8684H7545R3092K06857E8576L92525O7331j56241K52053
16346F14244h9663C09677h4624D90403E4529L39146L492A59750K22466K12971
16336E95187B35236g2032C15362r2423K07271B9566J02289K96470J57918I0251
16325A31339L4931a20608A83614H8822L19972A86936l8931J28089D5337J00292
16315A45629J8755J01645R969m2158j15823K04646I0765L67834j55848b80365
$$ plain form
16304 201428 26052 266723 228447 366352 258211 122123 132170 -40032 661872 -172799
16293 188266 359991 -152891 245129 44503 258771 300571 181275 27683 226687 300123
16283 300123 5425 38773 83339 76698 -45131 462405 236469 652949 12833 469149 9278
16271 265295 327324 100734 161940 174367 144809 212952 195461 -101074 -9939 175457 -32574
16259 5088 -33101 248200 284880 267893 167387 323994 -47540 539695 17461 88346 171323
16248 171323 338013 174969 303544 273574 92876 277823 270458 274721 -80012 119035 139237
16237 139237 -99107 270213 -151463 471467 133549 223313 -3825 103789 -231615 -45270
16226 95317 285229 -81103 155090 237911 444981 -8847 206196 238410 -19394 1831 215708
$$ packed form
16304B01428B6052K40671l8276J37905j08141A22123J0047d0032F61872a72799
16293A88266J71725a52891B45129D4503K14268M1800j19296B7683J99004P3436
16283C00123E425L3348M4566o641d5131D62405k25936M16480A2833M56316I278
16271B65295O2029A00734O1206J2427k9558O8143j7491a01074i939A75457c2574
16259E088c3101B48200L6680j6987j00506J56607d7540E39695A7461P0885Q2977
16248A71323J66690j63044J28575k9970I2876J84947p365M263h0012A19035K0202
16237A39237i9107B70213a51463D71467A33549Q9764c825A03789b31615d5270
16226I5317J89912h1103A55090Q2821K07070h847B06196L2214a9394A831K13877
$$ plain form
16215 215708 333218 352817 198295 -113431 541503 143587 511880 -11611 -208115 208836
16204 200299 249689 125201 -76861 192257 -68214 -149270 26614 69057 198335 386739 -171641
16192 -124001 213510 -164311 -221185 110947 175607 130957 96545 132481 -144629 120958
16181 18778 58307 53703 60667 164042 -68365 283251 -249986 110830 -66258 -64373 -54835 226409
16168 156153 23135 -267470 110867 -46056 89912 18273 -341796 359787 208650 -91033
16157 -30222 346386 2135 -118544 283045 -136584 431139 -176706 -40466 174313 -70811
16146 -51157 22765 -153839 35692 -88707 -106297 11043 78903 93155 -40381 176893 165415
16135 165415 -21990 85188 -60398 40457 339500 314318 -3531 -79393 -31645 -39754 -78602 132851
$$ packed form
16215B15708J17510J9599j54522a13431E41503A43587L68293a1611j96504B08836
16204B00299M9390j24488g6861A92257f8214q1056B6614M2443J29278J88404a71641
16192a24001B13510a64311n6874A10947O4660m4650l4412L5936a44629A20958
16181A8778L9529m604O964J03375f8365B83251b49986A10830f6258J885R538B26409
16168A56153B3135b67470A10867d6056H9912A8273c41796C59787j51137i1033
16157c0222C46386B135a18544B83045a36584D31139a76706d0466A74313g0811
16146e1157B2765a53839C5692h8707j7590A1043O7860J4252d0381A76893j1478
16135A65415b1990H5188f0398D0457K99043k5182c531p5862c1645q109l8848A32851
$$ plain form
16122 10717 -205082 119958 89232 34313 69408 231030 -139871 33855 22619 149638 109563
16111 109563 -166150 225675 167930 288019 51032 -60931 118685 57075 -94829 67850 38001
16100 38001 272430 39231 190612 -13921 -307232 80564 -249801 39343 187927 -172531
16089 202873 19134 80066 -33617 43725 3891 145667 -143377 158085 17972 -88355 141829
16077 9420 86046 32824 -60452 11321 -68069 -156557 -408703 107665 110010 -218128 9017 35090
16065 35090 56064 38151 -150742 178790 87964 -94565 249749 -12894 213238 476127 363646
16054 363646 124168 262594 -10997 52320 120074 -230306 -142594 -356187 193621 -55094
16043 -91355 -364495 -261373 58672 81170 -203245 66407 -265595 219529 187274 34366 -7050
$$ packed form
16122A0717b05082A19958l0726C4313L5095J61622a39871C3855j1236J27019m0075
16111A09563a66150B25675n7745J20089E1032f0931A18685E7075i4829F7850k9849
16100C8001K34429C9231J51381a3921k93311H0564b49801C9343J48584a72531
16089B02873A9134O0932c3617D3725C891J41776a43377A58085A7972h8355A41829
16077I420P6626C2824f0452A1321f8069q8488k52146A07665K345b18128I017K6073
16065C5090K0974j7913a50742A78790H7964i4565B49749a2894B13238K62889j12481
16054C63646A24168J38426a0997E2320O7754b30306Q7712k13593A93621e5094
16043i1355k73140J03122E8672K2498b03245F6407b65595B19529l2255C4366g050
$$ plain form
16031 -277737 156810 -25079 77205 25643 -227712 174332 464631 127578 -79249 -259007
16021 -259007 211800 112154 111010 75609 87067 28834 93343 -235982 -53572 165059 -63147
16009 -37260 -38835 27386 225109 -42372 -105542 193730 303153 -25332 -215270 26563 -312583
15997 -119591 105816 -176285 -166221 51830 -168014 131225 2188 -117482 -34274 -155562
15987 -155562 255279 -8465 173561 163596 156022 486664 11129 382084 150655 -119211 183189
15975 -201324 -14661 -84750 209757 366220 -85733 200203 -129440 -35271 -66050 -175694
15965 -175694 -14529 -191183 45029 78160 219574 8985 -109840 -163400 -26839 -289678 -363202
15954 -363202 -68712 15782 -177135 190377 -202397 -229447 230997 94266 104318 -10826 -514679
$$ packed form
16031b77737A56810b5079G7205B5643b27712A74332K90299A27578g9249j79758
16021b59007B11800r9646j144l5401J1458B8834O4509b35982e3572A65059f3147
16009c7260j575B7386J97723d2372o3170A93730J09423b5332j89938B6563c12583
15997a19591A05816a76285J0064E1830a68014A31225B188a17482c4274j21288
15987a55562B55279h465A73561r965p574L30642A1129L70955A50655a19211A83189
15975b01324a4661p0089B09757J56463h5733B00203a29440c5271l0779j09644
15965a75694a4529j76654D5029L3131J41414H985a09840n3560b6839k62839p3524
15954c63202f8712A5782a77135A90377b02397k7050B30997I4266J0052a0826n03853
$$ plain form
15943 -514679 -31038 -313185 -264320 -75944 -48778 248719 115572 -208532 -98236 94680 -156885
15931 -129498 248769 -33430 153429 -229939 -129073 239199 -161442 -274568 9380 -223074
15920 208345 -155719 -45622 32612 -102392 15708 97510 74814 60860 -161553 162214 129244
15909 129244 -100093 189398 -103911 75398 -243655 23934 -405911 -28121 83255 157001
15899 157001 294762 -110758 272815 -148045 119543 22809 -281110 376723 108540 461226
15889 461226 -251727 -163488 -116937 -6995 102628 46305 151717 14318 91312 541050 54178
15877 3708 -45530 297236 -259736 51491 -259014 -24239 -47708 -279630 135604 -145675 -377505
15866 -377505 -50705 -134548 -41914 -3452 182729 -150137 34368 -268234 -192361 19821 -126743
$$ packed form
15943e14679c1038k82147M8865g5944K7166B48719A15572b08532i8236I4680a56885
15931a29498B48769c3430A53429b29939J00866B39199a61442j13126I380b23074
15920B08345a55719d5622C2612a02392A5708Q1802k2696j3954a61553A62214l2970
15909A29244a00093A89398a03911G5398b43655B3934d05911b8121H3255P3746
15899A57001J37761a10758B72815a48045A19543B2809b81110C76723A08540L52686
15889D61226b51727Q8239M6551f995A02628D6305J05412A4318P6994M49738E4178
15877C708d5530B97236b59736E1491b59014b4239k3469k31922A35604a45675k31830
15866c77505e0705q3843d1914c452A82729a50137C4368b68234P5873A9821a26743
$$ plain form
15854 -68258 143703 87793 -88534 -313278 88491 263987 -22423 -94031 -181618 243060 -113924
15842 -72377 -87035 -111079 180499 -57421 -149742 49053 -56417 -255556 71559 357100 -28756
15830 -124223 -415555 -31705 -69264 136436 51504 -86880 -129609 -217038 -139338 -166953 -13602
15818 67838 -151189 106428 -82493 -64447 -494177 -41280 -72648 -285016 -262493 122946 50867
15806 160427 -123845 137314 4143 -177907 -36173 62740 95994 56502 7788 125627 -342938
15794 -72487 -271126 140344 136714 -90715 -126902 120995 82601 -35937 -197679 -457110 -145975
15782 -275973 -15097 -62748 476 -423749 153051 228252 -280849 91886 103443 -266 -81223 -126822
15770 -126822 11317 89076 -72201 29241 192956 -49602 -160548 -107305 83658 91003 -15880
$$ packed form
15854f8258A43703n5910h8534k24744H8491J75496b2423p1608q7587B43060a13924
15842g2377j4658k4044A80499e7421r2321D9053e6417j99139G1559K85541b8756
15830a24223k91332c1705l7559A36436E1504h6880m2729q7429P7700k7615a3602
15818F7838a51189A06428h2493J8046m29730d1280l1368k12368K2523A22946E0867
15806A60427a23845A37314D143a77907c6173F2740L3254l9492G788J17839c42938
15794g2487j98639A40344l630i0715l6187A20995l8394c5937j61742k59431a45975
15782b75973a5097m7651D76d23749A53051P5201b80849I1886J1557b66q0957m5599
15770a26822A1317P7759g2201B9241J63715d9602j10946N3243H3658P345a5880
$$ plain form
15758 129837 -162566 198103 -67355 274717 -11011 170740 382101 250109 -243133 -203828
15748 -203828 140131 20213 66825 -113790 6170 114620 -52578 -12594 130298 80640 -88845
15736 123611 7656 -496878 -70896 -450036 18496 39615 -57078 -75253 -69841 496753 -80669
15724 -68463 -89286 136282 140243 13936 112947 -181998 46142 -224961 164153 273798 8122
15712 -176014 -220446 -301112 -210167 8465 425902 191404 -113246 294925 -261813 -216902 247476
15700 240062 -172245 -215102 -5901 293728 20179 -208880 -169474 -58968 -51499 -105584 -271097
15689 -271097 -25650 -228526 33013 -219689 15564 -172241 384833 -37756 -145412 -94624
15679 -94624 100417 187786 -280297 -186992 135372 37348 176978 14870 -205634 82320 169908
$$ packed form
15758A29837a62566A98103f7355B74717a1011A70740K11361j31992b43133L9305
15748b03828A40131B0213M6612a13790F170J08450e2578a2594A30298m9658h8845
15736A23611G656d96878g0896l79140A8496K1119e7078j8175N412D96753h0669
15724f8463k0823A36282L961A3936R9011a81998D6142b24961A64153J09645H122
15712a76014m4432q0666R0945H465M17437A91404a13246B94925b61813M4911B47476
15700B40062a72245m2857e901B93728B0179b08880L9406e8968P469n4085j65513
15689b71097b5650k02876C3013b19689A5564a72241C84833c7756j07656N0788
15679i4624A00417Q7369b80297R3305A35372C7348J39630A4870b05634H2320Q7588
$$ plain form
15668 169908 218880 -348232 -38028 46053 5446 111092 109399 135796 -84545 -24607 -148152
15657 -148152 7543 248254 61435 -614002 114865 3117 -133383 -44063 -106633 -18379 -34670
15646 -34670 281268 130465 49257 166430 6540 141248 591931 -63572 282109 -54855 61613
15634 -107554 137981 266816 -20569 -34599 -221969 45571 -29084 -15730 -323650 154195
15623 -135125 262378 -149769 -25632 113831 -56788 -74733 307578 -111557 -8933 -302480
15613 -302480 -141774 -220031 -266312 144482 33879 8008 -97585 144251 -241417 -167802 118792
15601 -36391 124993 18136 102418 -49756 -280385 -79143 -241587 266467 148443 -52137 171199
15589 -183295 -33609 6143 143383 -150134 -359812 -79942 157244 -177309 88336 -243479
$$ packed form
15668A69908M8972c48232c8028D6053E446J05646j693K6397h4545b4607j23545
15657a48152G543K40711F1435f14002A14865C117a33383d4063o2570a8379j6291
15646c4670B81268A30465D9257J17173F540J34708M50683f3572B82109e4855F1613
15634a07554A37981J28835b0569j4030j87370D5571b9084J3354l07920A54195
15623a35125B62378a49769b5632A13831e6788j7945C07578a11557h933k93547
15613c02480a41774p8257m6281A44482C3879H008i7585A44251b41417P3615A18792
15601c6391A24993A8136Q4282d9756k30629g9143j62444B66467j18024e2137A71199
15589a83295c3609F143J37240a50134k09678g9942A57244a77309H8336b43479
$$ plain form
15578 333827 64748 103778 -48620 -262885 -332435 -53418 -30343 -261916 341715 -164650 -263021
15567 -263021 65527 47357 -14884 26548 -124980 212880 -146181 -253155 -190300 60770 35928
15556 35928 194192 103923 -12542 -138494 -110276 276509 -231354 -298853 40518 -361352 61163
15544 -457258 292298 22511 262556 45485 -88578 90744 -38471 126942 -151077 -30461 -19606
15533 -19606 -78892 156071 -191965 -223172 -99347 176828 -102855 70134 286356 -231768
15522 -25798 -100768 116415 -39697 -6754 -165012 -47388 -253006 163441 -151827 -32456 -206731
15511 -206731 -65952 99140 105375 -310430 -259828 121727 26823 164157 -390400 -179128 -106021
15500 -106021 -182869 -147540 10370 -268488 -61255 -20260 -78249 -344532 44740 -163587 -68213
$$ packed form
15578C33827F4748L9030d8620k14265o9550e3418K3075k31573C41715a64650r8371
15567b63021F5527j8170a4884B6548a24980B12880a46181j06974O2855F0770k4842
15556C5928J58264r0269a2542j25952K8218B76509b31354o7499D0518c61352F1163
15544d57258B92298B2511K40045D5485h8578I0744c8471A26942a51077c0461J0855
15533a9606n9286A56071a91965l1207i9347A76828a02855G0134K16222b31768
15522b5798p4970A16415c9697f754j58258d7388k05618A63441a51827c2456j74275
15511b06731f5952I9140O235c10430N0602A21727B6823J37334c90400a79128P3107
15500a06021p6848L5329A0370b68488f1255b0260n7989k66283D4740a63587f8213
$$ plain form
15488 -193600 158888 34641 200949 24803 3665 209726 -32528 -207173 40361 -256184 -248629
15477 -248629 40018 213864 -36850 250946 26924 -330850 261173 -39977 -397109 -283078
15467 -283078 85295 53865 -279387 -54307 112216 48245 -201832 44074 -45907 -30995 -66189
15456 -66189 42139 18500 -336933 40778 30377 98940 -135302 24495 -443980 174519 86443
15444 66004 -191194 -59922 -112674 -9736 -140815 -13944 78523 69016 -114442 284380 -205880
15432 -449727 253693 -35598 46586 -124658 107255 -147565 59556 -74914 -335517 -98808
15421 -142712 -15566 -21231 -234783 -305534 153376 -337378 -199930 78261 199854 -127066
15410 87900 48291 104073 347408 -316009 -203499 -66668 87651 -80882 -147108 -187715 194197
$$ packed form
15488a93600A58888C4641J66308B4803C665K06061c2528j74645D0361b56184P555
15477b48629D0018J73846c6850B50946B6924c30850B61173c9977l57132J14031
15467b83078H5295l1430b79387e4307A12216D8245b01832D4074d5907J4912l5194
15456f6189D2139A8500c36933D0778j0401O8563a35302B4495d43980A74519H6443
15444F6004a91194e9922n2752i736j31079a3944G8523r507a14442B84380b05880
15432d49727B53693c5598D6586a24658A07255a47565E9556g4914k60603i8808
15421a42712a5566n665k13552p0751A53376c37378J37448G8261J21593a27066
15410H7900l9609N5782K43335c16009J12510f6668H7651h0882o6226m0607A94197
$$ plain form
15398 32188 74298 -85959 -475917 208481 169175 204635 -206986 156129 -141391 -104369 -12880
15386 200775 -162007 69276 15740 -52931 -272466 -250910 -234896 -122248 110397 36858 -25050
15374 1262 151477 84094 107184 307719 129400 140210 -283537 -148086 -10080 84222 222956
15363 222956 -73319 58621 -34118 30938 -26125 131453 -317019 -218626 -96458 -18308 186295
15351 97671 4422 -167595 241070 -65611 -27712 103110 145498 -33224 316241 99371 41284
15339 -187205 65966 -131296 -19603 45465 121412 -3373 -54125 -73717 50289 -42115 52764
15327 62521 -181593 149728 -188927 34581 58051 97855 -32817 108521 -289585 -8552 10164
15315 33724 78227 6740 -91465 -22304 47355 127648 179974 173445 -176925 -30240 34553 -216120
$$ packed form
15398C2188M2110h5959l89958B08481l9306L5460b06986A56129a41391L7022a2880
15386B00775a62007F9276A5740e2931k19535K1556J6014J12648A10397C6858b5050
15374A262J50215o7383K3090K00535A29400J0810b83537J35451a0080H4222J38734
15363B22956g3319E8621c4118C0938b6125A31453c17019R8393i6458a8308A86295
15351I7671D422a67595B41070f5611b7712A03110M2388c3224C16241I9371D1284
15339a87205F5966a31296a9603D5465P5947c373n0752j9592E0289d2115E2764
15327F2521a81593A49728a88927C4581K3470L9804c2817A08521b89585h552A0164
15315C3724M4503F740i1465b2304D7355Q0293N2326o529a76925c0240C4553b16120
$$ plain form
15302 146952 93346 199655 -178407 124474 -200959 -107184 -58445 72199 145547 257361
15292 257361 267093 26694 -16775 -81414 -242367 -32287 130318 14900 281139 132585 -50484
15280 -114693 173916 -204551 343897 -29541 363374 47807 -161096 32187 -198466 -58864
15269 -81935 -245666 -73893 -303206 -190687 180173 260981 233426 -64096 143619 381602
15259 381602 14590 211574 139626 229277 119533 47962 7391 -2495 451073 383688 790446
15248 790446 1029921 946514 1277244 616011 360931 151434 -39332 311213 57771 345833
15238 345833 -34753 -132079 262303 11021 60850 326991 -82612 106077 -64126 71309 -138709
15226 -221614 145976 117984 -26851 124201 -126839 124990 36234 -230016 379060 126970
$$ packed form
15302A46952n3606J06309a78407A24474b00959R3775M8739G2199P3348J11814
15292B57361R732B6694a6775o4639j60953c2287A30318A4900K66239A32585e0484
15280a14693A73916b04551C43897b9541C63374D7807a61096C2187a98466e8864
15269h1935j63731g3893k29313J12519A80173Q0808k7555f4096A43619K37983
15259C81602A4590J96984p1948Q9651j09744D7962G391b495D51073o7385M06758
15248G90446K39475q3407L30730F16011k55080A51434c9332C11213E7771K88062
15238C45833c4753r7326B62303A1021M9829K66141h2612A06077f4126G1309a38709
15226b21614A45976k7992b6851A24201a26839A24990C6234b30016C79060A26970
$$ plain form
15215 -57324 269774 51716 -149499 87215 -82660 34058 31441 -139655 95695 41656 -12360
15203 -112157 -38030 56173 -161264 -159883 -205147 190628 -206466 -105607 -24100 -91028 519100
15191 -48503 -194255 -135690 165800 199826 18626 -142355 -56631 -71210 -251159 -222275 -324569
15180 -324569 26278 173663 -70730 326433 -36969 96761 15760 164463 91084 -102106 -277161
15169 -277161 -302089 135261 220797 240708 144332 23321 113794 68913 75062 30950 -300300
15157 11506 -85900 58247 85255 -40238 -240546 38413 44037 -61419 -57497 -128581 66547 244493
15145 244493 280843 155624 185767 49435 -29616 16909 228489 -65901 290034 166422 184368
15134 184368 -115628 -11979 13286 155677 508938 230030 79449 184104 93829 459030
$$ packed form
15215e7324B69774E1716a49499H7215h2660C4058k617a39655I5695D1656a2360
15203a12157c8030E6173a61264J381m5264A90628b06466J00859b4100o6928E19100
15191d8503j45752N8565A65800L4026A8626a42355e6631j4579j79949K8884j02294
15180c24569B6278J47385g0730C26433c6969I6761A5760J48703p3379a02106j75055
15169b77161k4928A35261Q5536J9911r6376B3321R0473m4881O149C0950c00300
15157A1506h5900E8247K7008d0238k00308C8413N624f1419L922p1084F6547J77946
15145B44493L6350j25219L0143D9435b9616A6909K11580f5901B90034j23612J7946
15134A84368a15628a1979A3286J42391L53261B30030G9449J04655r0275L65201
$$ plain form
15124 459030 -183307 30048 227278 98146 299791 -94196 203763 78648 25779 219533
15114 219533 -57929 210014 145425 -88210 168637 -18855 431942 137267 115475 -214466
15103 360467 102991 -16640 -182483 -128346 -248949 28139 214308 -81329 -59488 47314 194669
15092 194669 153024 233962 -139832 77275 58732 382964 184325 244300 -121256 69529 238992
15081 238992 49687 328250 160784 316067 -119388 -44325 84662 77881 140054 25626 -12108
15069 -311504 165475 -213858 -50627 -143083 157212 144310 103260 70276 -82201 155562 285338
15058 285338 22993 -65831 166004 117801 105773 259417 74925 379646 116888 71318 72436
15047 72436 -170443 45250 -115032 66719 180090 336237 223394 -185960 76023 185822
$$ packed form
15124D59030a83307C0048J97230I8146K01645i4196B03763G8648B5779J93754
15114B19533e7929B10014o4589h8210A68637a8855D31942A37267k1792b14466
15103C60467A02991a6640j65843N4137j20603B8139J86169h1329K1841D7314J47355
15092A94669m1645Q0938a39832G7275j8543L24232A84325N9975a21256F9529J69463
15081B38992D9687K78563A60784J55283a19388d4325H4662o781O2173B5626a2108
15069c11504A65475b13858e0627r2456A57212j2902m1050l2984h2201A55562J29776
15058B85338B2993f5831A66004m8203j2028J53644G4925L04721A16888m5570J118
15047G2436a70443D5250a15032F6719J13371J56147j12843a85960G6023J09799
$$ plain form
15037 185822 -92652 2192 484218 386205 75369 418062 300167 59271 101189 -24504 -255893
15026 -255893 78018 326502 178835 190281 298622 -174404 285946 159668 154258 -26897
15015 110425 350331 237455 332669 200786 3811 -253655 375756 57181 109735 90989 300855
15004 300855 -189420 46526 84370 164237 24657 110617 -80574 13455 -286858 168607 -94017
14992 222822 369575 367880 322531 271787 19367 159647 16023 461190 411604 363848 76486
14980 -89405 360814 291802 281677 380900 -12336 126709 434684 305222 275863 180603 394581
14969 394581 63866 527028 279116 273552 311682 544952 669691 283009 260452 139773
14959 139773 40307 78576 46495 91892 -337698 -3251 -24792 239704 354143 211374 14471
$$ packed form
15037A85822i2652B192M82026r8013G5369L42693j17895E9271M1918b4504k31389
15026b55893G8018K48484j47667J1446J08341a74404B85946j26278n410b6897
15015A10425K39906j12876R5214j31883C811b53655C75756E7181N2554j8746K09866
15004C00855a89420D6526L7844P9867B4657Q5960h0574A3455b86858A68607i4017
14992B22822J46753j695m5349n0744A9367J40280A6023M45167m9586m7756G6486
14980h9405C60814o9012j0125R9223a2336A26709L07975j29462k9359r5260K13978
14969C94581F3866M63162k47912n564L8130K33270J24739B83009k2557j20679
14959A39773D0307L8269l2081M5397c37698c251k1541B39704J14439j42769A4471
$$ plain form
14947 232580 345453 -59161 304325 -4735 195329 373237 463090 271177 32584 16275 467113
14936 467113 431650 93776 78215 349948 168796 456179 244761 346701 310711 224040
14926 224040 342070 -17247 343884 414968 -147124 307196 110356 -217929 183127 282487
14916 282487 401756 214259 180477 538607 346425 -108727 166968 -21301 173425 416702
14906 416702 553363 251300 461404 188771 191947 140769 339549 262405 261903 365226 395951
14895 395951 50370 373555 271500 215044 134834 122814 -27912 161100 86436 118611 404763
14884 404763 276696 231378 533281 221603 310345 137824 314676 346860 182644 314582
14874 314582 463426 224062 432517 444534 294583 558069 265545 470027 -19533 450241
$$ packed form
14947B32580J12873e9161C04325d735A95329J77908Q9853j91913C2584A6275M50838
14936D67113l5463I3776j5561K71733A68796K87383k11418J01940l5990q6671
14926B24040J18030a7247C43884P1084a47124C07196A10356b17929A83127R9360
14916B82487J19269j87497l3782L58130j92182a08727A66968b1301A73425K43277
14906D16702J36661B51300K10104A88771L176n1178J98780p7144n02J03323L0725
14895C95951E0370L23185j02055n6456q0210j2020b7912A61100p4664L2175K86152
14884D04763j28067m5318L01903B21603Q8742A37824J76852L2184j64216J31938
14874C14582J48844B24062K08455J2017j49951K63486B65545K04482a9533D50241
$$ plain form
14863 170191 348855 138229 82138 91612 366403 393133 64069 89739 258831 382683 -250683
14851 133050 306394 286284 -23857 142357 300910 592113 598683 22647 -4111 284181 373881
14840 373881 396965 433916 391322 298905 436321 354487 161690 -135837 193837 675478
14830 675478 -100511 59256 299873 427462 512901 879 520353 284979 397457 530242
14820 530242 551048 265319 99925 240903 632201 348710 355395 440911 473861 693038 380447
14809 380447 728749 263418 430399 240675 612787 76371 365588 484217 263653 427120
14799 427120 343651 -50768 393171 341918 464638 245655 149972 398945 643441 365675
14789 365675 321056 247831 452290 591623 540845 382386 258692 424728 354285 185994
$$ packed form
14863A70191J78664A38229n6091R474K74791K6730F4069K5670J69092J23852b50683
14851A33050J73344k0110b3857A42357J58553K91203O570B2647d111B84181Q9700
14840C73881K3084L6951m2594r2417J37416q1834A61690a35837A93837M81641
14830F75478a00511E9256K40617J27589Q5439H79N19474k35374J12478J32785
14820E30242K0806B65319I9925J40978L91298k83491O685Q5516L2950K19177l12591
14809C80447L48302B63418J66981j89724L72112G6371K89217J18629k20564J63467
14799D27120q3469e0768C93171n1253J22720k18983r5683K48973K44496k77766
14789C65675m4619p3225K04459J39333n0778j58459j23694J66036p0443j68291
$$ plain form
14779 185994 578650 292886 529443 533767 493560 515610 402002 580945 506279 193278
14768 491853 421578 610246 600633 265381 376717 988465 651264 363115 547737 537521
14758 537521 163873 290488 627174 587762 10898 739184 533332 694999 443895 406034
14748 406034 671575 822905 648872 710468 366911 280587 571266 522129 631446 607891
14738 607891 685479 424448 441051 597489 602479 483401 582329 323194 656265 249368
14727 922803 672180 616096 724628 404034 768095 983164 614571 624853 666507 617080
14717 617080 634520 394234 747485 270573 507026 769999 470917 637289 616572 693734
14707 693734 819909 983429 475836 519374 760553 771854 500654 680818 727467 776859
$$ packed form
14779A85994L92656k85764K36557M324m0207K2050j13608J78943p4666A93278
14768D91853p0275J88668r613B65381J11336O11748l37201k88149J84622j0216
14758E37521A63873J26615L36686l9412A0898P28286k05852J61667k51104l7861
14748D06034K65541J51330j74033O1596l43557q6324K90679m9137J09317k3555
14738F07891P7588k61031J6603J56438M990j19078R8928k59135L33071B49368
14727I22803k50623n6084J08532l20594L64061K15069l68593J0282M1654m9427
14717F17080J7440k40286L53251B70573K36453K62973k99082J66372k0717P7162
14707F93734J26175J63520D75836M3538K41179J1301k71200J80164M6649M9392
$$ plain form
14697 776859 617052 764880 756022 657787 548282 781450 693842 673787 218914 835183
14687 835183 643747 854372 316324 733859 806173 664087 539204 856693 722103 577394
14677 577394 722666 964256 529350 752157 720143 876267 935214 766558 1143583 748961
14667 748961 484323 945259 699603 996368 683125 705477 547014 825920 1179097 995974
14657 995974 1048834 950148 781507 663646 1133955 1216320 1062760 1011769 1093359 1006826 966724
14646 966724 1013510 822349 714339 534998 884356 1063725 828556 868417 904137 1092439
14636 1092439 1047398 1057503 1054213 1149654 712028 1079785 921355 1190122 1240410 1052173
14626 1052173 902935 1228570 1362512 1369262 1392053 896864 1121009 1263678 1162681 1042453
$$ packed form
14697G76859j59807J47828q858r8235j09505K33168q7608k0055B18914O16269
14687H35183j91436K10625C16324M17535P2314j42086j24883L17489j34590j44709
14677E77394J45272K41590m34906K22807l2014J56124N8947j68656L77025l94622
14667G48961k64638M60936k45656K96765l13243K2352j58463K78906L53177j83123
14657I95974N2860r8686j68641j17861M70309Q2365j53560n0991Q1590q6533m0102
14646I66724M6786j91161j08010j79341L49358J79369k35169L9861L5720J88302
14636A092439m5041J0105l290R5441m37626L67757j58430K68767N0288j88237
14626A052173j49238L25635J33942O750K2791m95189K24145J42669j00997j20228
$$ plain form
14616 1042453 1289917 1266277 1124693 1515921 1178965 1388391 1187754 911935 1433148 1405307
14606 1405307 1064173 1348519 1379079 1099588 1275146 1468461 1118665 1608930 1690248 1032203
14596 1032203 1624201 1322568 1283132 1459970 999972 1233364 1288916 1558406 1617155 1511273
14586 1511273 1395741 1474145 1467245 1172209 1229934 1627086 1507068 1499161 1391950 1618751
14576 1618751 1687255 1789165 1710142 1657737 1539814 1906506 1807895 1744286 1742706 1792791 1577983
14565 1577983 2093974 1590346 2149730 1962895 2069983 1813935 1840079 2215291 2433825 2475186
14555 2475186 2557543 2828244 3402527 3020786 3692168 4327906 6019557 9577379 17479040
14546 17479040 37795779 40931239 19098787 7853253 3908217 2810828 2234333 1615142
$$ packed form
14616A042453K47464k3640j41584L91228l36956K09426k00637k75819N21213k7841
14606A405307l41134K84346L0560k79491J75558J93315l49796M90265Q1318o58045
14596A032203N91998l01633l9436J76838m59998K33392N5552K69490N8749j05882
14586A511273j15532P8404o900k95036N7725L97152j20018p907j07211K26801
14576A618751O8504J01910p9023n2405j17923L66692r8611o3609j580N0085k14808
14565A577983N15991n03628N59384j86835J07088k56048K6144L75212K18534M1361
14555B475186Q2357K70701N74283l81741O71382O35738J691651L557822P901661
14546A7479040K0316739L135460A9098787G853253C908217j097389n76495o19191
$$ plain form
14538 1615142 1564948 1641752 1557997 1772344 1586960 1935621 1618283 1823695 1903160 1760359
14528 1760359 1965906 1781413 1802952 1691272 1769285 1910560 2220551 2006268 1979389 2308194
14518 2308194 1885730 2162869 2216384 1813827 1877698 2215941 2370767 2196754 2305488 2250462
14508 2250462 2423154 2577269 2189024 2149605 2364497 2451105 2609689 2540847 2471596 2472397 2484818
14497 2484818 2602675 2928579 2529487 2611293 3013505 2508197 2632823 3132692 2824964 2706606
14487 2706606 3109559 2959314 2939275 3302070 3169338 2979598 3048299 2883260 3142120 2862746
14477 2862746 3141454 3126677 3308140 3329866 3142967 3297224 3301441 3403590 3507147 3315096
14467 3315096 3360909 3703864 3688376 3666002 3677194 3826613 3867285 3792050 3988961 3575059
$$ packed form
14538A615142n0194P6804q3755K14347j85384L48661l17338K05412P9465j42801
14528A760359K05547j84493K1539j11680P8013J41275L09991k14283k6879L28805
14518B308194m22464K77139N3515m02557O3871L38243J54826j74013J08734n5026
14508B250462J72692J54115l88245l9419K14892Q6608J58584o8842o9251Q01J2421
14497B484818J17857L25904l99092Q1806M02212n05308J24626M99869l07728j18358
14487B706606M02953j50245k0039L62795j32732j89740O8701j65039K58860k79374
14477B862746K78708j4777J81463K1726j86899J54257M217J02149J03557j92051
14467C315096M5813L42955j5488k2374J1192J49419M0672p5235J96911m13902
$$ plain form
14457 3575059 4058688 4128200 4117193 4084303 4255990 4226545 4250790 4513177 4511035 4226406 4513064
14446 4513064 4415030 4762322 4712286 4929333 4939017 4886717 4733024 4871859 5078138 4859300
14436 4859300 5085790 5249619 5338913 5551710 5456110 5331780 5807996 5703219 5711242 6002620
14426 6002620 6007970 5724839 6115964 6047056 6152170 6120468 6492185 6571537 6495687 6998783
14416 6998783 6557592 6687224 7061132 7179137 7274083 6964224 7467775 7390520 7579217 7683487
14406 7683487 7924439 7984664 8022613 8167342 8320022 8379587 8322110 8739270 9024058 9170840
14396 9170840 8833241 9200912 9943970 9446820 9904316 9926548 10109354 10642132 10290111 10569544
14386 10569544 10832598 10877181 11075081 11378228 11181334 11623694 12411112 12251749 12830685
$$ packed form
14457C575059M83629O9512j1007l2890J71687k9445K4245K62387k142k84629K86658
14446D513064r8034L47292n0036K17047R684n2300j53693J38835K06279k18838
14436D859300K26490J63829Q9294K12797r5600j24330M76216j04777Q023K91378
14426F002620N350k83131L91125o8908J05114l1702L71717P9352p5850N03096
14416F998783m41191J29632L73908J18005R4946l09859N03551p7255J88697J04270
14406G683487K40952O0225L7949J44729J52680N9565n7477M17160K84788J46782
14396I170840l37599L67671P43058m97150M57496K2232J82806N32778l52021K79433
14386A0569544K63054M4583J97900L03147j96894M42360P87418j59363N78936
$$ plain form
14377 12830685 12519310 13176787 13122607 13468127 13720081 14203994 13991026 14936005 14720183
14368 14720183 15013065 15864079 15995880 16296989 16420198 16905063 17738676 17744679 18069619 18566147
14358 18566147 18826919 19473369 19907741 20382529 20812170 21243173 21922353 22209989 22801984
14349 22801984 23491269 23788089 24736712 25317836 26065228 26665958 27227059 28460008 28880574
14340 28880574 29878034 30593288 31436924 32076209 33644228 34237259 35087466 36294271 37100410
14331 37100410 38547218 39777543 41259291 42455469 43492820 45141737 46631929 47927301
14323 47927301 49924624 51486121 53621953 55498871 57393598 59852362 62319822 64282486
14315 64282486 67197131 69537715 72440130 75634622 79032030 82052620 85771574 89086117
$$ packed form
14377A2830685l11375O57477n4180L45520K51954M83913k12968R44979k15822
14368A4720183K92882Q51014J31801L01109J23209M84865Q33613O003L24940M96528
14358A8566147K60772O46450M34372M74788M29641M31003O79180K87636N91995
14349B2801984O89285K96820R48623N81124P47392O00730N61101J232949M20566
14340B8880574R97460P15254Q43636O39285J568019N93031Q50207J206805Q06139
14331C7100410J446808J230325J481748J196178J037351J648917J490192J295372
14323D7927301J997323J561497K135832J876918J894727K458764K467460J962664
14315F4282486K914645K340584K902415L194492L397408L020590L718954L314543
$$ plain form
14307 89086117 93417695 97900892 101849315 107012082 112137500 117553436 123217624 130114103
14299 130114103 136045299 143429588 150925936 158797022 167462422 176366239 186242883 196889844
14291 196889844 207165258 218916921 231364805 244273974 257914519 272058672 286824040
14284 286824040 301887012 317657105 333768986 349859248 365673827 381213705 396421202
14277 396421202 410650881 423604925 435190232 444430773 450278543 451288596 451246331 448950355
14269 448950355 445082928 439585442 433326573 425518157 414403326 401578186 387602947
14262 387602947 371917779 355728017 338795315 321996155 305781074 289520970 274557602
14255 274557602 260029668 245878240 232686643 220048107 208139379 196534976 186277298
$$ packed form
14307H9086117M331578M483197L948423N162767N125418N415936N664188O896479
14299A30114103N931196P384289P496348P871086Q665400Q903817R876644J0646961
14291A96889844J0275414J1751663J2447884J2909169J3640545J4144153J4765368
14284B86824040J5062972J5770093J6111881J6090262J5814579J5539878J5207497
14277C96421202J4229679J2954044J1585307R240541N847770J010053m2265k295976
14269D48950355l867427n497486o258869p808416j1114831j2825140j3975239
14262C87602947j5685168j6189762j6932702j6799160j6215081j6260104j4963368
14255B74557602j4527934j4151428j3191597j2638536j1908728j1604403j0257678
$$ plain form
14248 186277298 176613355 167342475 158788361 150262821 143174894 135870794 129261504 123028117
14240 123028117 116899912 111703426 106734846 101793838 97167387 92630925 88717035 84935893
14232 84935893 81417825 78756269 75020888 72136823 68964093 66190705 63723394 61635098
14224 61635098 59237163 56688164 54725188 52627503 51062888 49477038 47281845 46244072
14216 46244072 44450029 42882870 41826951 40903876 39496079 38169085 36904856 35549855
14208 35549855 34818085 34430779 33625460 32246503 31076060 30277400 29517640 28552954 28333041
14199 28333041 27467916 26718022 25631042 25098600 24404572 23891743 23504849 22582098 21871154
14190 21871154 21712879 21080656 20401320 20111484 19616780 19223458 19104749 18505792 17793015
$$ packed form
14248A86277298r663943r270880q554114q525540p087927p304100o609290o233387
14240A23028117o128205n196486m968580m941008m626451m536462l913890l781142
14232H4935893l518068k661556l735381k884065l172730k773388k467311k088296
14224F1635098k397935k548999j962976k097685j564615j585850k195193j037773
14216D6244072j794043j567159j055919r23075j407797j326994j264229j355001
14208C5549855p31770l87306q05319j378957j170443p98660p59760r64686k19913
14199B8333041q65125p49894j086980n32442o94028n12829l86894r22751p10944
14190B1871154j58275o32223o79336k89836m94704l93322j18709n98957p12777
$$ plain form
14181 17793015 17479290 17369871 16681332 16667268 16367864 16036996 15553904 15317063 14976327
14172 14976327 14509374 14590001 14289196 13709064 13372051 13142189 13113813 12878160 12409364 12591969
14162 12591969 12275312 11947805 11899595 11390713 11337739 10769077 10944786 10637556 10668345 10491086
14152 10491086 10239494 9992418 9784867 9855944 9302955 9276620 8951212 9159341 8735093 8719621
14142 8719621 8791430 8670160 8478083 8244253 8097069 8065121 7951852 8039518 7648707 7675630
14132 7675630 7386921 7370658 7253524 7031195 7352630 7057596 6797982 6762139 6998309 6600229
14122 6600229 6572565 6388606 6382797 6142203 6164512 6305345 6130027 6099147 6156634 5683812
14112 5683812 5808066 5840856 5679921 5491231 5533662 5253580 5348100 5343543 5310084 5159124
$$ packed form
14181A7793015l13725j09419o88539j4064k99404l30868m83092k36841l40736
14172A4976327m66953Q0627l00805n80132l37013k29862k8376k35653m68796J82605
14162A2591969l16657l27507m8210n08882n2974n68662J75709l07230L0789j77259
14152A0491086k51592k47076k07551P1077n52989k6335l25408K08129m24248j5472
14142H719621P1809j21270j92077k33830j47184l1948j13269Q7666l90811K6923
14132G675630k88709j6263j17134k22329L21435k95034k59614l5843K36170l98080
14122F600229k7664j83959n809k40594K2309J40833j75318l0880N7487m72822
14112E683812J24254L2790j60935j88690M2431k80082R4520m557l3459j50960
$$ plain form
14102 5159124 5112221 5036918 5013529 4782132 4670437 4629671 4637379 5025298 4576941 4256935
14092 4256935 4699515 4596778 4334295 4279391 4508354 4158252 4044211 4301984 4046055 4094171
14082 4094171 4128881 4214856 4043459 3766085 4108059 3623973 3875558 3777397 3423771 3872146
14072 3872146 3615743 3373693 3456428 3699157 3220069 3131428 3399098 3521415 3195991 3350918
14062 3350918 3272740 3567884 3461327 3361754 3417761 3327646 3126735 3173895 3140818 3009010
14052 3009010 2971758 3134244 2911568 2659816 2667187 2786001 2798261 2693675 2908388 2668736
14042 2668736 2726354 2825077 2835903 2823038 2660987 2616090 2615996 2596638 2359325 2600858 2619216
14031 2619216 2723410 2536092 2288972 2415995 2461813 2316400 2290229 2372970 2285756 2528595
$$ packed form
14102E159124m6903p5303k3389k31397j11695m0766P708L87919m48357l20006
14092D256935M42580j02737k62483n4904K28963l50102j14041K57773k55929M8116
14082D094171L4710Q5975j71397k77374L41974m84086K51585r8161l53626M48375
14072C872146k56403k42050Q2735K42729m79088q8641K67670J22317l25424J54927
14062C350918p8178K95144j06557r9573N6007r0115k00911M7160l3077j31808
14052C009010l7252J62486k22676k51752P371J18814J2260j04586K14713k39652
14042B668736N7618R8723J0826j2865j62051m4897r4j9358k37313K41533J8358
14031B619216J04194j87318k47120J27023M5818j45413k6171Q2741q7214K42839
$$ plain form
14021 2528595 2292380 1995603 2263789 2222733 2136369 1732133 2449033 2483972 2347665 2004783
14011 2004783 1945443 1924722 1656495 2131006 1924188 1649982 1933968 1934179 1562356 1654828
14001 1654828 1748000 2072044 1848541 1685415 1523376 1688073 1799746 1612394 1858702 1805701
13991 1805701 1952530 2157917 2780509 5145084 10895494 30367622 40791726 23355571
13983 23355571 11822195 7108745 4918027 3838171 3447993 3376263 2866382 2463670 2484508
13974 2484508 2215867 2294508 1953366 2101774 2120618 1837628 1911868 1898315 1981469 1741659
13964 1741659 1570633 1629493 1943212 1746466 1759000 2072102 1985705 1715737 1846066 1547845
13954 1547845 1500651 1749308 1620998 1486539 1817471 1625129 1458644 1667441 1444675 1438518
$$ packed form
14021B528595k36215k96777K68186m1056q6364m04236P16900L4939j36307l42882
14011B004783n9340k0721k68227M74511k06818k74206K83986K11l71823R2472
14001A654828R3172L24044k23503j63126j62039J64697J11673j87352K46308n3001
13991A805701J46829K05387O22592K364575N750410J9472128J0424104j7436155
13983B3355571j1533376m713450k190718j079856l90178p1730n09881m02712K0838
13974B484508k68641P8641l41142J48408J8844k82990P4240j3553Q3154k39810
13964A741659j71026N8860L13719j96746J2534L13102q6397k69968J30329k98221
13954A547845m7194K48657j28310j34459L30932j92342j66485K08797k22766o157
$$ plain form
13944 1438518 1389439 1254012 1834764 1487034 1648258 1281411 1601599 1476143 1759342 1379191
13934 1379191 1179502 1112071 1212158 1432969 1411076 1383889 1461219 1508784 1374436 1596687
13924 1596687 1407723 1201911 1325004 1306853 751223 1215793 1345670 1091278 1471451 1092083
13914 1092083 1226266 1328247 1099583 1197482 1186819 833819 1328672 1219099 1272262 1273427
13904 1273427 1086206 846438 1191299 1224850 1237000 1384054 1006255 1102985 1000573 1218715
13894 1218715 1184683 1077491 1137770 980664 966152 1000971 930510 1079914 764667 765168 1175013
13883 1175013 1211638 928131 713731 760889 795155 956855 1063891 912464 1174197 873140
13873 873140 938174 1051522 939131 1003130 824614 916281 681811 951184 1003766 1034391
$$ packed form
13944A438518m9079j35427N80752l47730J61224l66847L20188j25456K83199l80151
13934A379191j99689o7431J00087K20811k1893k7187P7330M7565j34348K22251
13924A596687j88964k05812J23093j8151n55630M64570J29877k54392L80173l79368
13914A092083J34183J01981k28664R7899j0663l53000M94853j09573N3163J165
13904A273427j87221k39768L44861L3551J2150J47054l77799R6730j02412K18142
13894A218715l4032j07192O0279j57106j4512L4819p0461J49404l15247N01M09845
13883A175013L6625k83507k14400M7158L4266J61700J07036j51427K61733l01057
13873H73140O5034J13348j12391O3999j78516R1667k34470K69373N2582L0625
$$ plain form
13863 1034391 772338 661733 879677 957143 1061542 941669 514530 830814 800265 827892
13853 827892 948382 829850 796841 925045 522357 921553 660237 720634 470190 1092880
13843 1092880 787342 651021 605665 804551 579459 799917 785055 1017548 1045197 598031
13833 598031 634366 731834 931539 491230 821740 575635 697331 851320 652422 723356
13823 723356 818044 806035 530712 379725 689490 741845 912667 487340 511237 588851
13813 588851 673589 698920 800654 872297 700516 679639 659212 378760 791167 880976 446855
13802 446855 531970 597906 1029375 567224 748629 1003935 700608 726453 571946 544598
13792 544598 649097 669547 1028337 688184 761522 580747 504809 586932 918556 730270
$$ packed form
13863A034391k62053j10605K17944P7466J04399j19873m27139L16284l0549K7627
13853H27892J20490j18532l3009J28204m02688L99196k61316O0397k50444O22690
13843A092880l05538j36321m5356J98886k25092K20458j4862K32493K7649m47166
13833E98031L6335R7468J99705m40309L30510k46105J21696J53989j98898P0934
13823G23356R4688j2009k75323j50987L09765N2355J70822m25327K3897P7614
13813E88851Q4738K5331J01734P1643j71781k0877k0427k80452M12407Q9809m34121
13802D46855Q5115O5936M31469m62151J81405K55306l03327K5845j54507k7348
13792E44598J04499K0450L58790l40153P3338j80775p5938Q2123L31624j88286
$$ plain form
13782 730270 441201 589788 629491 539867 663955 524361 619970 473336 288268 481958
13772 481958 679292 748143 574279 489636 510662 514414 902816 595606 469159 673300
13762 673300 537989 931956 342856 518067 587701 796862 576693 286284 444776 485070
13752 485070 714821 655688 568938 549956 1014556 718600 572261 840828 202510 409216
13742 409216 628087 3303 688728 377909 620058 513076 384742 381192 495160 864504
13732 864504 842569 482554 683361 498938 573127 271177 606832 718620 171362 402218
13722 402218 697756 451972 622810 344620 390725 372859 506041 362341 502916 594794
13712 594794 202469 111552 346359 720849 366979 579259 484110 518173 360560 634202
$$ packed form
13782G30270k89069J48587L9703q9624J24088j39594R5609j46634j85068J93690
13772D81958J97334O8851j73864q4643K1026L752L88402l07210j26447K04141
13762F73300j35311L93967C42856J75211O9634K09161k20169B86284J58492M0294
13752D85070K29751n9133q6750j8982M64600k95956j46339K68567B02510K06706
13742D09216K18871C303O85425l10819K42149j06982j28334l550J13968L69344
13732H64504k1935l60015K00807j84423P4189B71177L35655J11788A71362K30856
13722D02218K95538k45784J70838k78190M6105j7866J33182j43700J40575R1878
13712E94794B02469r0917K34807L74490l53870K12280r5149L4063j57613K73642
$$ plain form
13702 634202 465185 387141 377075 431975 173976 455667 437547 518146 349753 477353
13692 477353 552164 410458 517314 301762 443150 546439 -264836 509223 343769 504717
13682 504717 690855 280445 348176 473585 626569 509595 363333 442970 384439 408929
13672 408929 509962 365583 532977 564218 568017 525625 290245 237894 295971 524448 338604
13661 338604 113865 392761 413988 509294 597492 292949 166564 421107 159928 617960
13651 617960 502079 512124 202949 300537 268277 244830 259056 479804 245764 126468
13641 126468 240878 404601 189832 522914 508222 404660 314232 255004 434146 329597
13631 329597 509699 793562 611924 480899 426342 420133 393718 292098 507556 573381
$$ packed form
13702F34202j69017p8044j0066N4900A73976K81691j8120Q0599j68393J27600
13692D77353P4811j41706J06856k15552J41388J03289b64836E09223j65454J60948
13682E04717J86138B80445O7731J25409J52984j16974j46262P9637n8531K4490
13672D08929J01033j44379J67394L1241L799m2392k35380n2351N8077K28477j85844
13661C38604A13865K78896K1227R5306Q8198B92949j26385K54543A59928M58032
13651F17960j15881J0045B02949R7588l2260k3447J4226K20748k34040j19296
13641A26468J14410J63723A89832L33082j4692j03562r0428n9228J79142j04549
13631C29597J80102K83863j81638j31025n4557o209k6415j01620K15458O5825
$$ plain form
13621 573381 252101 290770 206610 193693 119500 402971 170315 325370 416908 529985
13611 529985 421307 337138 113056 454633 594606 539840 35146 262566 249341 344551
13601 344551 290360 222686 294096 454263 261036 299413 57784 338057 83462 151510 169661
13590 169661 362488 232776 251438 538636 670093 319224 392579 277125 389089 232407
13580 232407 298763 233412 509587 210065 342807 544569 282278 16489 49076 197503
13570 197503 140098 360962 245657 483114 209105 386400 291564 384539 130280 639299
13560 639299 289864 284963 -52507 -212802 151701 171825 154956 261620 -69519 -114226 546047
13548 72345 19663 453529 33268 341727 220513 293421 -23951 52872 320090 379014 194813
$$ packed form
13621E73381B52101L8669q4160j2917p4193K83471A70315J55055R1538J13077
13611E29985j08678q4169A13056L41577J39973n4766C5146K27420j3225R5210
13601C44551n4191o7674P1410J60167j93227L8377E7784K80273H3462O8048J8151
13590A69661J92827j29712J8662K87198J31457C19224P3355j15454J11964j56682
13580B32407O6356o5351K76175B10065J32742K01762k62291A6489L2587J48427
13570A97503n7405K20864j15305K37457B09105J77295r4836R2975A30280N09019
13560F39299B89864m901e2507j60295A51701K0124j6869J06664f9519m4707E46047
13548G2345A9663M33866C3268L08459j21214P2908b3951E2872K67218N8924j84201
$$ plain form
13537 194813 510758 113449 217957 -231964 83884 16538 94113 405807 227954 -42579
13526 -69886 122050 289076 247824 340460 439015 247637 210600 327414 414746 26314 427490
13515 427490 380575 345181 543503 85079 15741 -77069 291350 95815 442300 -133838 261207
13503 424442 62690 77225 300412 282448 78031 92742 198591 259496 20809 427494 522803
13492 522803 586808 160764 -85537 380976 -43411 121403 134873 217080 -111913 -50604 444066
13480 163214 300601 11684 483510 475702 111118 128024 93892 -80700 -169964 243622 293385
13469 293385 68101 153505 82374 260889 133010 329813 211282 -8958 16691 27854 250738
13458 250738 116888 -102637 464351 84201 154097 566115 514678 330787 -47326 101705
$$ packed form
13537A94813L15945A13449J04508b31964H3884A6538P7575L11694j77853d2579
13526f9886A22050J67026m1252R2636R8555j91378l7037J16814Q7332B6314M01176
13515D27490m6915l5394J98322H5079A5741g7069B91350I5815L46485a33838B61207
13503D24442F2690J4535K23187j7964G8031J4711J05849O0905B0809M06685R5309
13492E22803O4005A60764h5537C80976d3411A21403J3470Q2207a11913e0604D44066
13480A63214J37387A1684M71826p808A11118J6906l4132h0700q9264B43622M9763
13469B93385F8101Q5404p1131J78515j27879J96803j18531h958A6691J1163K22884
13458B50738A16888a02637D64351H4201O9896M12018n1437j83891d7326A01705
$$ plain form
13447 26849 220515 427229 -149712 190480 77462 400995 337156 332250 93700 -191463 87588
13435 -179981 191685 501805 180190 -18207 181816 264440 355244 -18845 190443 126791
13425 126791 -24635 249164 -62320 142728 212747 3523 -125972 277735 451407 12650 346897
13414 346897 37254 389114 88082 183227 261892 405764 -223544 69796 183352 85172 87717
13403 87717 151537 141219 237915 408404 40005 288325 79757 29885 587452 155797 192092
13392 192092 133694 -209310 85984 153876 136544 -65136 222574 84231 168575 450988 342441
13381 342441 9508 -106136 186936 376556 260891 276314 454916 -52660 -26719 74020 312235
13370 312235 194956 417920 343671 383447 317571 53652 27121 96938 63937 189830 49690
$$ packed form
13447B6849J93666K06714a49712A90480G7462L23533o3839m906I3700a91463H7588
13435a79981A91685L10120A80190a8207A81816Q2624R0804a8845A90443o3652
13425A26791b4635B49164f2320A42728P0019C523a25972B77735J73672A2650L34247
13414C46897C7254L51860H8082R5145P8665J43872b23544F9796J13556H5172K545
13403H7717O3820j0318R6696J70489D0005K48320G9757B9885N57567A55797L6295
13392A92092n8398b09310H5984O7892j7332f5136B22574H4231Q4344K82413j08547
13381C42441I508a06136A86936J89620j15665J5423J78602e2660K5941G4020K38215
13370C12235j17279K22964p4249L9776o5876E3652k6531O9817l3001J25893D9690
$$ plain form
13358 -28188 157516 175386 138642 257451 294517 276233 210320 10856 202277 -42315 138285
13346 238780 105942 174551 304463 442987 215911 522228 235475 128844 60946 444463
13336 444463 450223 495139 251563 352483 273391 314772 -43784 218637 274803 152151 -5292
13324 206412 125157 -74096 127414 376516 165645 69039 350559 209643 491490 533969
13314 533969 -51754 -26172 30635 14358 208363 130664 217904 131322 36502 40415 256307
13303 256307 -84010 -15699 -164347 -31001 190452 131409 -227107 -57065 455904 120721
13292 -59846 285225 206477 183426 225182 270893 -105656 218771 13835 -63746 410232 119222
13280 163448 107274 107760 -159665 198687 -11894 9682 -210642 -129999 99960 30777 13662
$$ packed form
13358b8188A57516J7870l6744J18809L7066j8284o5913A0856J91421d2315A38285
13346B38780A05942O8609J29912J38524B15911L06317B35475j06631F0946L83517
13336D44463N760M4916k43576J00920p9092M1381d3784B18637N6166j22652e292
13324B06412q1255g4096A27414K49102A65645F9039K81520j40916K81847M2479
13314E33969e1754K5582C0635A4358J94005p7699Q7240q6582C6502L913K15892
13303B56307h4010a5699j48648c1001A90452n9043b27107e7065D55904A20721
13292e9846B85225p8748k3051M1756M5711a05656B18771A3835f3746D10232A19222
13280A63448n6174M86a59665A98687a1894I682b10642Q0643I9960C0777A3662
$$ plain form
13268 22501 -99871 -79211 142360 -116895 -8806 343861 127671 -69386 227579 159489 -168360
13256 133673 352172 -5050 265158 231698 245967 190484 672563 76218 30996 -30511 91224
13244 178066 4757 148341 288996 88507 56073 -30989 24069 170321 -23394 97555 19994
13232 324371 185841 -172453 196663 146574 -70499 -151624 -8524 83950 -65669 227382 -15062
13220 -285439 24793 177049 128658 143435 84063 200906 153761 279029 53886 101955 -154910
13208 249488 -38449 139036 69646 470 159052 -80434 318026 -75314 -142192 -37417 226696
13196 255260 -110830 70966 379163 253036 38717 -72889 -40725 97941 -29258 255185 69112
13184 117164 -196471 312802 -62699 341374 236360 246145 315251 72745 -13688 -42548 104264
$$ packed form
13268B2501i9871K0660A42360a16895h806C43861A27671f9386B27579o8090a68360
13256A33673K18499e050B65158l3460J4269n5483M82079G6218C0996c0511I1224
13244A78066D757J43584J40655H8507l2434c0989B4069J46252b3394I7555A9994
13232C24371j38530a72453A96663n0089g0499q1125h524H3950f5669B27382a5062
13220b85439B4793J52256m8391J4777n9372J16843m7145J25268E3886M8069a54910
13208B49488c8449A39036o9390D70J58582h0434C18026g5314o6878c7417B26696
13196B55260a10830G0966L08197j26127C8717g2889L2164I7941b9258B55185F9112
13184A17164a96471C12802f2699C41374j05014R785O9106G2745a3688k8860A04264
$$ plain form
13172 -50120 -202714 313090 -215310 -229090 242262 79670 -120922 -100561 -142525 -120069 151480
13160 -35636 -116221 159633 212009 227251 206403 141698 280934 120561 149087 106593 -155805
13148 110433 124364 -107448 -203052 -84827 308888 209364 -29506 8872 16887 -175443 -101821
13137 -101821 316960 -112979 -72265 -5808 335050 118814 266012 -140682 87285 -167786
13126 112653 134593 232143 71129 78189 -45193 290466 -176278 -26513 -302357 143050 263024
13115 263024 119643 29224 -54622 44343 -33175 320773 -83901 50034 134967 -51836 185121
13103 27795 19158 76236 -120359 13413 132809 255226 -17070 -72606 17694 75145 -256899
13091 28552 246221 221293 -26984 102121 -60241 -199553 -54687 342918 59761 -269063 321875
$$ packed form
13172e0120j52594C13090b15310j3780B42262G9670a20922K0361m1964K2456A51480
13160c5636q0585A59633N2376J5242k0848o4705J39236A20561K8526m2494a55805
13148A10433J3931a07448r5604h4827C08888r9524b9506H872Q015a75443P3622
13137a01821C16960a12979M0714e808C35050A18814J47198a40682H7285a67786
13126A12653K1940R7550G1129P060d5193B90466a76278b6513k75844A43050J19974
13115B63024A19643B9224e4622D4343c3175C20773h3901E0034Q4933e1836A85121
13103B7795q637N7078a20359A3413J19396J22417a7070n5536A7694N7451b56899
13091B8552K17669k4928b6984A02121f0241j39312e4687C42918E9761b69063C21875
$$ plain form
13079 100123 236463 194416 -50698 1458 22750 -11178 104770 156412 228647 154725 78676
13068 78676 -11684 -68720 -16301 178928 211758 461902 422354 -132173 -81332 23466 -92789
13056 264114 253279 16130 185785 -15352 -56827 -165051 -18664 271979 80294 -332060 225645
13044 9633 -62817 347066 68832 209299 306696 490964 105971 226831 353575 -131564
13033 -466972 155233 -10843 75200 205487 205026 463453 249860 42546 -56145 21792 4078
13021 74553 97733 418152 80179 446369 75734 -7455 -256489 327718 191678 174658 411844
13010 411844 -291663 130961 82124 378999 168991 175148 163205 -110062 -48648 244657
12999 24244 311833 -210452 -67176 311409 309647 7783 221117 66567 74125 185430 180511
$$ packed form
13079A00123J36340m2047e0698A458K1292a1178A04770N1642P2235p3922p6049
13068G8676a1684n7036a6301A78928L2830K50144l9548a32173N0841B3466i2789
13056B64114j0835A6130J69655a5352m1475j08224a8664B71979H0294c32060B25645
13044I633f2817C47066F8832J40467R7397J84268A05971J20860J26744a31564
13033d66972A55233a0843G5200J30287m61K58427k13593D2546e6145B1792D078
13021G4553K3180L20419H0179L66190G5734g455k49034C27718j36040j7020K37186
13010D11844b91663A30961m8837K96875A68991O157j1943a10062d8648B44657
12999B4244K87589b10452f7176C11409j762G783K13334F6567P558J11305m919
$$ plain form
12988 180511 341139 -125136 -5690 132832 74447 188076 211689 118678 32788 92122 254412
12977 254412 207775 -302386 456412 188791 61496 169889 -29952 -13960 -25785 142189
12966 4072 -93945 -15162 56309 -93625 -156875 -125570 15546 -8853 -178173 18152 225459 33041
12953 37619 231589 -181361 245910 210476 65809 20698 38855 84349 65420 39673 -201890
12941 -103506 -70709 163401 520000 108112 25019 82666 -50078 295309 -23012 213890
12930 322115 206037 -217520 409004 34861 98015 -22323 166804 2363 437561 -34177 113489
12918 -168532 49577 -4114 -26919 -103327 -162514 -135049 174550 65082 -159979 -184845 92461
12906 -232815 184114 47602 217207 -230502 -48657 -96758 12068 -137422 115052 6943 251683
$$ packed form
12988A80511J60628a25136e690A32832n8385J13629K3613r3011C2788N9334J62290
12977B54412m6637c02386D56412A88791F1496J08393b9952a3960j1825A42189
12966D072i3945a5162E6309i3625o3250L1305A5546h853j69320A8152K07307C3041
12953C7619J93970a81361B45910l5434F5809B0698J8157M5494j8929k5747b01890
12941a03506L2797A63401L56599A08112B5019N7647e0078B95309b3012B13890
12930C22115j16078b17520D09004C4861O3154b2323A66804B363M35198c4177A13489
12918a68532D9577d114k2805p6408n9187K7465A74550F5082a59979k4866I2461
12906b32815A84114D7602J69605b30502d8657m8101A2068a37422A15052F943K44740
$$ plain form
12895 251683 12397 66310 224458 -20791 257028 27894 -47290 -53876 -23057 94092 145981
12884 145981 10293 143138 106063 -79703 -121369 -17445 -68191 321088 -29092 -227322 -153419
12873 -153419 66260 -74229 140929 107475 -26475 93391 -37409 -283664 -58029 -14728 70434
12861 383354 -199978 85684 20002 250827 12859 -54183 -32636 -102842 15066 -184763 292441
12849 -256875 205414 196159 -133209 -94233 142891 59362 213019 -114300 -169254 163351
12838 256587 -156601 102421 -28522 142989 -169921 84380 60010 33413 -76325 141351
12827 294568 5466 28971 322268 -80065 -367933 115991 67105 586876 -194572 -788 203363
12815 152687 -216519 168367 202438 74271 -99097 -274935 -295730 -59204 192122 -335990
$$ packed form
12895B51683A2397N3913J58148b0791B57028B7894d7290o586b3057I4092N1889
12884A45981A0293J32845l7075g9703m1666a7445n0746C21088b9092j98230P3903
12873a53419F6260g4229A40929l3454b6475I3391c7409k46255e8029a4728G0434
12861C83354a99978H5684B0002K30825A2859e4183K1547p0206A5066a84763B92441
12849b56875B05414r255a33209L8976A42891E9362J53657a14300n4954A63351
12838B56587a56601A02421b8522A42989a69921H4380k4370k6597g6325A41351
12827B94568E466K3505K93297h0065k87868A15991m8886N19771a94572g88B03363
12815A52687b16519A68367L4071G4271i9097j75838k0795e9204A92122c35990
$$ plain form
12804 240049 216063 478964 -126170 81607 -42730 339797 246669 127108 -29985 133358
12793 111751 -56734 231370 8998 -259012 -57571 270009 -128833 -45857 -376607 110739
12782 61830 -46152 213443 -217503 369892 -150535 -63087 -27371 -302144 -147179 87860
12771 224581 261574 164456 169909 -120064 -120352 480395 -168590 27099 220404 -198249 194545
12759 -174171 -31838 72080 -228312 75274 -223779 60445 42257 68575 -208220 122026 276612
12748 276612 -383526 503898 107625 -126108 -183869 100799 441549 175563 451 91387
12738 91387 27159 189195 271087 -98418 -88046 162451 260669 3434 -77401 119034 -92884
12726 -109361 82520 65743 541483 -18762 144830 189694 -231820 -183835 145964 15480 -161257
$$ packed form
12804B40049k3986K62901a26170H1607d2730C39797r3128j19561b9985A33358
12793A11751e6734B31370H998b59012e7571B70009a28833d5857l30750A10739
12782F1830d6152B13443b17503C69892a50535f3087b7371k74773a47179H7860
12771B24581L6993r7118N453a20064k88D80395a68590B7099J93305a98249A94545
12759a74171c1838G2080b28312G5274b23779F0445j8188K6318b08220A22026J54586
12748B76612c83526E03898A07625a26108n7761A00799L40750A75563D51R0936
12738I1387B7159J62036Q1892i8418J0372A62451R8218C434g7401A19034i2884
12726a09361H2520j6777M75740a8762A44830M4864b31820M7985A45964A5480a61257
$$ plain form
12714 207984 -2266 113817 190801 -126821 -191141 203899 -5370 394831 37006 80227 -48227
12702 320742 363669 314167 -104364 110430 -81617 -107704 33370 98504 -134137 -47171 262718
12690 58329 -416628 14432 151902 83984 38878 9729 -4600 92140 377046 42446 290580
12679 290580 362186 525061 22029 408030 -206306 -587 53347 276075 -54620 273645 -92262
12667 44400 42096 17781 92852 158011 148317 20693 135493 -191176 147306 16872 16621 138710
12655 138710 141961 387624 312922 72674 205577 -145344 -26152 -118232 136628 521890 167322
12643 -5627 -122345 116952 174404 16645 -86797 114403 55304 -187445 35072 -169182 -162887
12632 -162887 52286 163761 139815 63227 20946 317862 192062 31746 161884 242676 265200
$$ packed form
12714B07984b266A13817P6984a26821o4320B03899e370C94831C7006M3221d8227
12702C20742M2927m9502a04364A10430h1617k6087C3370O5134a34137d7171B62718
12690E8329d16628A4432J37470o7918C8878I729d600I2140K84906D2446K48134
12679B90580P1606J62875B2029L86001b06306e87E3347K22728e4620B73645i2262
12667D4400k304A7781P5071O5159r694B0693J14800a91176A47306A6872k51J22089
12655A38710L251K45663p4702G2674J32903a45344b6152r2080A36628L85262A67322
12643e627j16718A16952N7452A6645h6797A14403E5304a87445C5072a69182O295
12632a62887E2286J11475k3946F3227B0946K96916j25800C1746J30138Q0792K2524
$$ plain form
12621 265200 421551 146758 -160132 175113 111411 -29051 -116631 45992 -54562 -10829 133636
12609 -274585 15749 -268992 115509 -54222 68779 98207 139009 919 -33450 221298 -83233
12597 -65396 46573 282917 159793 -28214 -47279 40314 183101 21545 -69979 -49998 -160900
12586 -160900 -178380 -247873 -14245 -57963 -345817 -270365 88238 -133414 -4842 -141764 73990
12574 338099 -114688 266693 -178706 179975 -262103 -86539 -331317 -113046 23761 288705
12564 288705 73165 163462 192488 15692 253335 164209 -211506 -287976 37460 281001 62741
12552 -52499 59154 -152897 -69402 -13037 -38907 -309541 -357854 -93263 -208018 70528 -5606
12540 134457 130993 76505 -92136 5197 -21358 -63271 66761 118495 -354320 440059 522932
$$ packed form
12621B65200J56351A46758a60132A75113o3702b9051q7580D5992e4562a0829A33636
12609b74585A5749b68992A15509e4222F8779K9428M0802I19c3450B21298h3233
12597f5396D6573K36344j23124b8214j9065D0314J42787B1545f9979J9981j10902
12586a60900j7480o9493a4245m3718k87854P5452H8238a33414d842j36922G3990
12574C38099a14688B66693a78706A79975b62103h6539k44778a13046B3761K64944
12564B88705G3165R0297K9026A5692K37643q9126b11506p6470C7460K43541F2741
12552e2499E9154a52897f9402a3037k5870k70634m8313i3263j14755G0528e606
12540A34457l464n4488i2136E197b1358m1913F6761N1734c54320D40059Q2873
$$ plain form
12529 522932 -64364 -78588 42468 118600 -315183 -36405 21253 -269548 -162992 6229 -80671
12517 159149 207383 -128105 -15373 -40341 366539 139274 -107959 -51052 5892 130227 -157291
12505 -144442 -233824 -50520 -219051 -240418 134104 -211094 -397381 355882 19875 -167697
12494 128547 -452608 86080 -250531 71875 239051 122509 107041 52600 -43988 -126487 549916
12482 -361090 75814 -273192 37332 -67879 98213 76587 146730 -142653 208772 -310293 -156735
12471 -156735 -155034 -328968 -187844 147124 -318405 -314529 306396 -29948 -285817 -246174 124853
12459 70898 36420 -199409 201108 -298191 196879 -147589 132438 -114972 242646 49805
12448 4055 -338012 -160255 -449144 -65203 322062 -70705 -61255 -290631 241348 177352 23118
$$ packed form
12529E22932f4364j4224D2468P6132c15183c6405B1253b69548J06556F229h0671
12517A59149M8234a28105a5373k4968C66539A39274a07959e1052E892J24335a57291
12505a44442q9382e0520j68531k1367A34104b11094j86287C55882A9875a67697
12494A28547d52608H6080b50531G1875J67176j16542j5468E2600d3988q2499E49916
12482c61090G5814b73192C7332f7879I8213k1626P0143a42653B08772c10293J53558
12471a56735J701j73934J41124A47124c18405L876C06396b9948k55869L9643A24853
12459G0898l4478a99409B01108b98191A96879a47589A32438a14972B42646D9805
12448D055c38012a60255k88889f5203C22062g0705R450k29376B41348o3996B3118
$$ plain form
12436 -11977 -184772 -47109 -316196 62484 148284 -242682 137530 248214 206628 47660 -93262
12424 -114342 188916 22226 -194030 -234039 160653 31800 9013 -175210 158483 -64793 -306420
12413 -306420 -77829 -3661 -67302 -157815 -222785 -221362 26661 -155553 51535 -99964 -7186 -312446
12401 -312446 228034 133509 -14020 74253 -40814 40336 -321656 162287 47494 233977 -183894
12389 -27696 -388640 -52877 154281 -3955 -135675 229029 160609 -179271 52177 -159076 -87520
12378 -87520 -69879 -122304 55568 135225 31863 -258692 -14581 299199 -141176 -139712 -40068
12366 369309 -10070 -153304 80243 192983 247786 -573095 -238416 -193463 75258 27178 -171842
12354 -4905 2780 219098 53153 -121476 80721 -269119 156762 -234952 -35620 141808 -338963
$$ packed form
12436a1977j72795d7109k69087F2484Q5800b42682A37530J10684m1586D7660i3262
12424a14342A88916B2226a94030m0009A60653C1800I013a75210A58483f4793k41627
12413c06420g7829c661o3641r0513o4970J423B6661a55553E1535i9964g186l05260
12401c12446B28034r4525a4020G4253d0814D0336c21656A62287D7494J86483a83894
12389b7696l60944e2877A54281c955j31720B29029o8420a79271E2177a59076P1556
12378h7520J7641n2425E5568P9657C1863b58692a4581B99199a41176J464d0068
12366C69309a0070j43234H0243J12740N4803e73095b38416M4953G5258B7178a71842
12354d905B780K16318E3153a21476H0721b69119A56762b34952c5620A41808c38963
$$ plain form
12342 173435 64442 -51699 119609 -35277 104791 196930 137924 22917 315089 210016 -180552
12330 -180268 98924 61644 -164938 -83056 -3228 -46137 181457 79940 97302 -201129 -45291
12318 86012 10366 -79517 -89825 -130926 -28733 -65474 58623 152894 203760 -71470 -15058 -159947
12306 -159947 105638 -284402 -12060 204726 -150391 150393 -110603 -179974 34895 86717
12296 86717 122688 76507 -299283 111949 -107998 -44432 48141 -150389 32841 304204 92892
12284 -148856 -112885 6336 218498 146931 71246 6957 -4268 229458 70106 114758 22206 303275
12272 303275 205179 103385 257404 -100424 -104798 432436 91951 179401 -82356 -102160 -95170
12261 -95170 289984 92102 269744 208649 126113 129784 -44972 221509 218095 82998 53514
$$ packed form
12342A73435F4442e1699A19609c5277A04791R2139n9006B2917K92172j05073a80552
12330a80268I8924l7280a64938Q1882c228m2909A81457G9940J7362b01129d5291
12318H6012A0366g9517j0308m1101b8733l6741E8623R4271N0866g1470a5058j44889
12306a59947A05638b84402a2060B04726a50391A50393a10603o9371C4895N1822
12296H6717L5971m6181b99283A11949a07998d4432D8141a50389C2841K71363I2892
12284a48856L5971F336K12162p1567G1246F957d268B29458G0106M4652B2206K81069
12272C03275r8096j01794J54019a00424m374D32436I1951Q7450h2356j9804O990
12261i5170B89984I2102J77642o1095q2536L671d4972B21509l414H2998k9484
$$ plain form
12250 53514 114113 49478 190917 143543 -63643 -85765 81506 -1195 -240648 -114458 138318
12238 113578 198153 244934 -52552 62216 -97080 164390 21615 -25107 360107 27802 110743
12227 110743 353661 -12433 548133 -175807 50655 343015 76345 134146 439303 273351
12217 273351 -61841 256400 101450 131059 127750 234093 -85153 237629 36893 353611 113409
12205 -122258 351679 -21901 231309 158206 -145715 -162013 128943 307795 431867 148423
12194 185789 223595 -12292 162715 -134124 -111194 266149 161961 -36971 -44312 81027 -72763
12182 -5854 105918 68575 281047 527745 321817 640554 4312 -43093 43427 130069 -17391
12170 338432 497393 198643 -95346 33120 -33074 226269 165566 -331818 221268 258342
$$ packed form
12250E3514O0599D9478J41439m7374f3643k2122H1506a195k39453a14458A38318
12238A13578Q4575M6781e2552F2216i7080A64390B1615b5107C60107B7802Q2941
12227A10743K42918a2433E48133a75807E0655K92360G6345N7801L05157j65952
12217B73351f1841B56400A01450K9609l309J06343h5153B37629C6893L16718A13409
12205a22258C51679b1901B31309p3103a45715j6298A28943J78852J24072A48423
12194A85789L7806a2292A62715a34124K2930B66149j04188c6971p341H1027g2763
12182e854A05918l7343K12472K46698k05928L18737D312d3093D3427Q6642a7391
12170C38432J58961A98643i5346C3120c3074B26269o0703c31818B21268L7074
$$ plain form
12160 258342 355298 22718 -36593 17597 -83306 112650 220821 374723 125194 -43485 17404
12148 -190787 -66090 38089 235568 104701 119889 46754 -259313 65664 401068 -97913 -179103
12137 -179103 -232182 -26539 -8990 4868 -16011 -10244 -117423 62658 -27710 -95979 186395 -61832
12124 -80539 -51166 -11539 134072 -159757 146432 292176 38787 -93262 -26794 30248 -51193
12112 -104447 -79160 -188729 178838 -68793 35496 67881 -195745 61546 -126207 -101605 -214297
12101 -214297 131491 82997 66745 -23553 44047 -118955 -111940 245107 -99607 261897 140188
12090 140188 25354 32624 -198683 198249 -33648 228404 136610 -56417 -177665 -175107 -137106
12079 -137106 -117983 -172235 272533 608583 507033 1778934 357862 491346 225066 -84165
$$ packed form
12160B58342R6956B2718c6593A7597h3306A12650J08171J53902A25194d3485A7404
12148a90787f6090C8089J97479A04701J5188D6754b59313F5664L35404i7913q1190
12137a79103n3079b6539h990D868a6011N767j07179F2658b7710o8269A86395f1832
12124h0539K9373a1539A34072a59757A46432J45744C8787i3262b6794C0248e1193
12112a04447K5287j09569A78838f8793C5496L2385a95745F1546a26207K4602j12692
12101b14297A31491m8494j6252b3553D4047a18955P015B45107i9607B61897j21709
12090A40188B5354P270a98683A98249c3648B28404r1794e6417j21248K558L8001
12079a37106J9123n4252B72533L36050j01550J271901C57862J33484B25066h4165
$$ plain form
12068 -182712 125318 311120 284071 -14368 248857 -111979 50349 -320735 117548 11419
12057 50304 150829 -29711 -8478 -2267 -205170 31915 -189614 -289187 -3793 83040 16893 -114543
12044 -228224 130790 34457 174995 -352281 253590 -192151 -141892 -209317 30265 204694
12034 204694 45463 246604 -107923 117096 173833 -162916 -124582 -33130 39915 108561 38101
12022 -152331 116596 72191 -134686 263412 11738 -142889 -146946 -60897 172409 -154456
12011 336859 -133206 187072 -21608 42663 58875 -53706 -99979 -160973 -97823 -44634 -62789
12000 -62789 21572 -44772 41518 -109326 -94235 -52614 -237973 -200111 36701 146952 -338603
11988 44301 114240 -106035 -461219 396297 169658 31932 200491 -56826 -48613 42932 -1069
$$ packed form
12068a82712A25318J85802k7049a4368B48857a11979E0349c20735A17548A1419
12057E0304J00525b9711h478b267k02903C1915a89614r9573c793H3040A6893a14543
12044b28224A30790C4457J40538c52281B53590a92151N0259o7425C0265J74429
12034B04694D5463K01141a07923A17096N6737a62916L8334c3130C9915O8646C8101
12022a52331A16596m4405a34686B63412A1738a42889m057f0897A72409a54456
12011C36859a33206A87072b1608D2663J6212e3706m6273o0994O3150d4634j8155
12000f2789B1572d4772D1518a09326J5091M1621j85359L7862C6701J10251c38603
11988D4301O9939a06035l55184C96297A69658C1932J68559e6826Q213D2932a069
$$ plain form
11976 -23470 168642 271422 -66484 -254280 18254 79373 196179 -143532 29000 138174
11966 138174 138208 107579 67077 197208 -58718 -58481 137122 8583 -288054 131997 -66567 -71474
11954 -71474 8137 39224 -248307 -73073 1079 -227074 134005 76107 124387 204328 -12868
11942 123625 134775 -110109 59673 -4044 86291 -140467 69060 -209072 -100642 77996 247603
11931 247603 90517 -391566 -103086 -227519 -124902 222988 236139 313496 64753 174559
11921 174559 124058 -219328 58497 70889 -54027 155112 -384623 -187820 157883 15194
11910 -94713 -22118 -9820 148250 73438 -11232 -356200 -25713 94057 33539 -143671 -292200
11899 -292200 -207271 -85827 -46791 93365 96294 -107838 66287 -104671 279886 -79361 -124713
$$ packed form
11976b3470A68642J02780f6484j87796A8254O1119J16806a43532B9000J09174
11966A38174L4l0629m0502J30131e8718K37A37122H583b88054A31997f6567m907
11954g1474H137L1087b48307g3073A079b27074A34005n7898M8280P9941a2868
11942A23625J1150a10109E9673d044H6291a40467F9060b09072a00642G7996J69607
11931B47603I0517c91566a03086j24433J02617B22988J3151P7357F4753J09806
11921A74559n0501b19328E8497J2392e4027A55112c84623a87820A57883A5194
11910i4713b2118i820A48250G3438a1232l44968b5713I4057C3539a43671j48529
11899b92200Q4929h5827L9036I3365K929a07838F6287a04671B79886g9361m5352
$$ plain form
11888 -124713 140078 -269693 274992 -262139 -267369 -36746 -22643 -473802 25912 99553 -113582
11876 -21829 290312 395375 -248237 136782 -8578 -196099 118930 33235 224108 -234531
11865 64413 200698 -190373 -160435 -692 93650 -147376 -32039 -33637 -83867 -133590 -61241 -120097
11853 -120097 -106269 -174293 39678 106459 -145212 125876 3325 -67013 -169428 -127358 25453
11841 -401440 -102057 -228466 -183436 236456 138444 281554 -1748 -29019 -307816 51578 -184807
11829 54502 168752 -297616 -366828 54650 -134296 -4888 -100564 -112494 -215584 72658 87146
11818 87146 -102012 -215235 85557 -158172 73414 -716 -328692 -53077 368697 -91689 -97737
11807 -97737 14145 -225757 -64953 -43664 -40205 60642 -160940 -286662 -261274 30215 -47792
$$ packed form
11888a24713A40078b69693B74992b62139n230c6746J4103m51159B5912P3641a13582
11876b1829B90312J05063b48237A36782h578j87521A18930C3235J90873b34531
11865F4413J36285a90373K9938f92I3650a47376c2039j598n0230m9723f1241n8856
11853a20097J3828o8024C9678O6781a45212A25876C325f7013j02415M2070B5453
11841d01440a02057j26409M5030B36456r8012J43110a748k7271k78797E1578a84807
11829E4502J14250b97616o9212E4650a34296d888r5676j1930j03090G2658J4488
11818H7146a02012j13223H5557a58172G3414g16l27976e3077C68697i1689o048
11807i7737A4145b25757f4953K1289L459F0642a60940j25722K5388C0215d7792
$$ plain form
11795 206278 157946 -29092 -210978 139477 137311 -155503 260501 32895 305043 61882 -48799
11783 -175074 -45704 189685 -62198 25279 -1820 -190501 -30040 -50239 -108599 -222150 -178728
11772 -178728 -83494 -71325 -340785 147912 288752 254417 -227786 -87190 -10273 483480
11761 182116 -24372 -111357 141239 -120556 451361 -103858 -97758 -65637 109813 -257869
11750 -264399 -194514 117702 -126801 257459 21184 108434 177701 172221 -144644 53599 -77978
11738 84437 -38544 98601 171609 -141121 -90069 -26492 26888 114477 49791 -146124 177943
11726 -58856 43458 173011 249986 -254355 -1175 -40647 140755 -116463 -30851 110879 -35745
11714 46880 228309 -140999 -121164 -100624 197471 -42099 290527 102127 -67556 132578
$$ packed form
11795B06278m8332b9092j81886A39477k166a55503B60501C2895K72148F1882d8799
11783a75074d5704A89685f2198B5279a820j88681c0040k0199n8360j13551M3422
11772a78728h3494J2169k69460A47912J40840l4335b27786h7190a0273D83480
11761A82116b4372q6985A41239a20556D51361a03858O100L2121A09813b57869
11750b64399O9885A17702a26801B57459B1184Q7250O9267n480a44644E3599g7978
11738H4437c8544I8601P3008a41121N1052b6492B6888Q7589D9791a46124A77943
11726e8856D3458J29553P6975b54355a175l9472A40755a16463c0851A10879c5745
11714D6880J81429a40999J9835K0540A97471d2099B90527A02127f7556A32578
$$ plain form
11703 84333 -372601 11322 298564 62882 18266 -148160 -84155 -105012 177926 51341 260539
11692 260539 -311736 5648 178921 187092 336004 376540 284777 -93761 186562 -51298 272651
11680 305725 317980 118330 52063 -167608 166339 -147020 -147639 95903 -22646 -127013 3824
11668 30401 27631 60109 71741 186081 161437 99096 69383 65426 103891 70739 -355968 -159017
11655 -73128 93707 -192484 -134681 61444 293534 -304534 128501 -10322 30113 -150671 -165893
11644 -165893 -91028 -257771 -328689 -92437 79746 301587 301575 -77785 -204863 122200 -258153
11632 -74422 149232 72692 10341 62010 -45813 -336259 112907 -164809 -117767 353692 65296
11620 146037 -149731 -354167 220692 -215528 9705 56018 69973 398432 82245 -148871
$$ packed form
11703H4333c72601A1322K87242F2882A8266a48160O4005k0857A77926E1341K09198
11692B60539c11736E648J73273Q171J48912M0536r1763i3761A86562e1298B72651
11680C05725J2255A18330E2063a67608A66339a47020o19I5903b2646j04367C824
11668C0401k770L2478J1632J14340k4644o2341k9713l957L8465l3152c55968a59017
11655g3128I3707a92484N7803F1444K32090c04534A28501a0322C0113a50671j5222
11644a65893P4865j66743p0918i2437G9746K21841j2g7785j27078A22200b58153
11632g4422A49232G2692A0341N1669d5813k90446A12907a64809M7042C53692F5296
11620A46037a49731k04436B20692b15528I705M6313J3955L28459H2245a48871
$$ plain form
11609 211930 298114 59720 -85572 231972 102614 46275 63403 54671 106660 154414 -9668
11597 504193 -41964 -91077 -20551 91356 -58049 283683 -109196 -146927 173947 263946 200269
11586 200269 124496 186295 -86291 89143 -84790 48993 -85484 161926 228454 12018 52342
11575 52342 73654 -72347 119354 257229 74382 245333 171562 232533 64436 32573 207647
11564 207647 345896 74471 396499 209061 10714 -281088 -153674 62309 318239 158952
11553 47795 -39088 12339 39972 -45453 416411 100073 -34441 38034 -82844 141882 97752
11542 97752 237883 87381 -169472 -37324 67026 192290 -152824 -158934 221281 43862 74474
11531 74474 103320 205566 249808 -79804 -126344 -225865 32755 13202 37670 258558 -195793
$$ packed form
11609B11930Q6184E9720h5572B31972A02614D6275J7128q732N1989M7754i668
11597E04193d1964m9113b0551I1356e8049B83683a09196l7731A73947Q9999o3677
11586B00269p5773O1799h6291H9143h4790D8993h5484A61926O6528A2018M0324
11575E2342K1312g2347A19354J37875G4382J70951p3771O0971F4436l1863J75074
11564B07647J38249G4471L22028j87438A0714b81088J27414F2309K55930A58952
11553D7795c9088A2339K7633d5453D16411A00073c4441C8034h2844A41882m4130
11542I7752J40131H7381a69472c7324F7026J25264a52824o110B21281D3862L0612
11531G4474K8846J02246M4242g9804m6540r9521C2755A3202K4468K20888a95793
$$ plain form
11519 290697 -73688 -225474 107666 -91756 174803 187070 26536 548358 -221675 141141
11508 64683 170472 304974 72014 -141512 127763 64931 440078 245910 55783 10572
11497 64670 369323 -279112 59511 -92661 -169327 -557 274223 301427 -320654 187856 148667
11486 148667 88841 264091 234983 215017 -12441 53239 157428 195989 47765 -83788 130133
11474 57902 114979 295452 86726 -16237 100002 140136 52855 -524 83980 127493 307188
11463 307188 -52581 133254 -389279 363436 25690 130780 43558 -95336 -213902 86349
11452 -86141 -56590 63657 445737 300649 -121040 -43341 480039 -348 -296703 89762 -235972
11440 -119343 49376 454575 -175026 -39030 -34130 -153050 -97284 -152414 -359992 61234 60047
$$ packed form
11519B90697g3688j51786A07666i1756A74803J2267B6536N21822b21675A41141
11508F4683J05789J34502G2014a41512A27763o2832L75147j94168E5783A0572
11497F4670L04653b79112E9511i2661p6666e57B74223K7204c20654A87856l9189
11486A48667n9826J75250k9108j9966a2441E3239J04189L8561D7765h3788A30133
11474E7902N7077J80473H6726a6237A00002M0134E2855e24H3980M3513J79695
11463C07188e2581A33254c89279C63436B5690J05090D3558i5336j18566H6349
11452h6141K9551F3657L82080j45088a21040d3341D80039c48k96355H9762b35972
11440a19343D9376M05199a75026c9030M900j18920N5766n5130k07578F1234j187
$$ plain form
11429 60047 82548 -161471 -990 -183907 202360 278359 -51752 89870 -187971 187986 210836
11418 210836 -37575 -22294 -217105 167424 78098 186143 -30056 -60959 278274 -243892
11407 -246774 -149151 -158020 39280 111260 205775 227366 48161 178464 -129519 331076 70118
11395 149007 98987 -202375 -162800 -28023 137510 95575 222619 184285 32190 164418 -285823
11383 81965 -182177 4868 -185194 -131059 32505 9774 376454 117349 -21604 146883 106550
11372 106550 107604 -397299 87540 -332036 -55945 74312 132334 28028 152959 -140098 299384
11360 15693 -113444 -23899 54859 8772 207601 -29435 -100896 -79119 -100405 130846 -439711
11348 25865 44326 -83725 62353 74898 -57638 -79467 21086 -20266 164098 1005 -22788 44695
$$ packed form
11429F0047K2501a61471i90j82917B02360P5999e1752H9870a87971A87986K2850
11418B10836c7575J5281j94811A67424G8098J08045c0056l0903B78274b43892
11407b46774R7623q869C9280P1980R4515K1591D8161J30303a29519C31076G0118
11395A49007n0020b02375L9575b8023A37510m1935J27044l8334C2190J32228b85823
11383H1965a82177D868a85194N4135C2505I774L66680A17349b1604A46883m0333
11372A06550J054c97299H7540c32036e5945G4312N8022B8028J24931a40098B99384
11360A5693a13444b3899E4859H772J98829b9435p1461K1777k1286A30846d39711
11348B5865J8461h3725F2353J2545e7638k1829B1086b0266A64098A005b2788D4695
$$ plain form
11335 -257110 -124419 -215374 260300 346339 -27281 -135001 315700 -26125 45357 -250293
11324 -145603 46978 92833 325234 -251760 -133257 -79879 177298 250461 496452 -121441
11313 -153030 -57780 189274 269192 -388696 -63980 160979 -7711 -145116 -177408 57480 222641
11302 222641 -114048 120524 -36234 73998 -148772 -1050 268625 107004 101986 -143553 148280
11290 -49777 -32730 82069 29916 -56752 -107806 -457304 359806 432412 -17870 -14783 85241
11278 69379 74084 31951 -257381 232521 194641 -244307 -89635 -70550 59075 24788 -307801
11266 -300816 24034 1105 -16817 -261126 -70396 -102847 -74386 -96222 -27010 264163 -43054
11254 56453 -114160 180509 -137089 -124389 95999 13035 -100103 250386 324333 30468 -328439
$$ packed form
11335b57110a24419r0955B60300Q6039b7281j07720C15700b6125D5357b50293
11324a45603D6978M5855K32401b51760J18503N3378A77298P3163K45991a21441
11313a53030e7780A89274P9918c88696f3980A60979g711j37405l2292E7480J65161
11302B22641a14048A20524c6234G3998a48772a050B68625A07004n018a43553A48280
11290d9777J7047H2069B9916e6752n1054l49498C59806P2606a7870L087H5241
11278F9379M705C1951b57381B32521l7880b44307h9635J9085E9075B4788c07801
11266c00816B4034A105a6817k44309g0396l2451K8461k1836b7010B64163d3054
11254E6453a14160A80509a37089J2700I5999A3035a00103B50386P3947C0468c28439
$$ plain form
11242 329560 -76783 333230 82476 -30578 -23892 -204775 193345 145766 93619 -123775 -17311
11230 231373 -147803 -76262 -185263 -124583 -241515 -192776 -40972 133071 -122367 -213981
11220 -213981 104871 -394948 -172956 -93900 33204 122673 -40709 199956 183490 -173053
11209 65873 26884 -225972 -209039 234777 -132094 -169449 88830 158185 -243426 67921 97650
11198 97650 29079 -370175 1816 26245 21604 101931 292678 -85006 -72230 -239174 -158084
11187 -158084 -9189 -231062 -84494 -140597 -320336 -359164 -137648 128362 -28801 -88204 52482
11175 -69859 -341696 -87551 384889 104877 83695 -249585 61039 -565569 4942 -78849 14789
11163 -835 -49588 55875 132627 -107355 342610 158685 -34540 -22202 96484 58898 -145804
$$ packed form
11242C29560g6783C33230H2476c0578O686j80883A93345m7579n2147a23775a7311
11230B31373a47803P1541j09001O0680j16932M8739d0972A33071a22367r1614
11220b13981A04871c94948a72956P9056C3204Q9469d0709A99956j6466a73053
11209F5873B6884b25972J6933B34777a32094l7355H8830O9355b43426F7921K9729
11198I7650B9079c70175A816K4429m641Q0327J90747h5006J2776j66944Q1090
11187a58084i189k21873h4494n6103j79739l8828a37648A28362b8801n9403E2482
11175f9859k71837h7551C84889A04877k1182b49585F1039e65569D942g8849A4789
11163h35m8753E5875P6752a07355C42610A58685c4540J2338I6484l7586a45804
$$ plain form
11151 120278 -223987 -109866 35825 37543 -50123 -68593 -7752 36882 -144484 -155169 -297398
11140 -297398 -31798 50635 25855 -283803 -48810 -284108 -6795 -193035 135805 -287756 213361
11128 171830 122105 -88396 191869 -173633 274148 90208 -28245 -150786 19132 452402
11118 452402 234406 20842 20049 -108996 -180567 111598 -143903 -42704 113562 111856 117145
11107 117145 -17994 -249941 100860 341344 252353 -96111 246131 150610 126874 175462 60332
11095 18266 -149798 -230083 368391 -95502 -12150 191763 125581 -242604 -127656 351423
11084 63081 214978 49716 152646 399452 262267 -119347 158994 162568 -91509 87854 381802
11073 381802 386682 427714 277525 346307 421139 292109 61842 60423 226995 595240 448279
$$ packed form
11151A20278b23987a09866C5825J718e0123j8470g752C6882a44484j0685j42229
11140b97398c1798E0635k4780b83803d8810k35298f795j86240A35805b87756B13361
11128A71830m9725h8396A91869a73633B74148I0208b8245j22541A9132M33270
11118D52402k17996B0842p93a08996p1571A11598a43903d2704A13562j706N289
11107A17145a7994k31947A00860K40484q8991i6111B46131r5521k3736M8588F0332
11095A8266a49798q0285C68391i5502a2150A91763o6182b42604J14948C51423
11084F3081J51897D9716J02930K46806j37185a19347A58994L574i1509H7854K93948
11073C81802M880M1032j50189O8782P4832j29030F1842j419J66572L68245j46961
$$ plain form
11062 448279 145317 233001 356616 493802 531777 723442 371759 494294 568128 256851
11051 468796 931973 655963 405624 783408 567683 479543 853930 813271 744587 591706
11041 591706 1040705 562785 560462 504708 507159 800557 731214 466267 575356 689806 783991
11030 783991 934931 885866 608680 315395 542226 674962 527505 473428 443620 600711
11020 600711 636582 525586 838927 300759 419555 553031 609636 645969 374408 541239
11010 541239 286633 542250 528829 449238 453434 497882 479326 709635 786613 580412 606203
10999 606203 583737 338649 498079 591094 815611 823407 466880 607708 1065384 751372
10989 751372 430917 333921 729188 530483 1026850 1126506 923038 1069884 851484 1015051
$$ packed form
11062D48279A45317Q7684J23615J37186L7975J91665l51683J22535P3834B56851
11051D68796M63177k76010k50339L77784k15725q8140L74387m0659o8684j52881
11041E91706M48999m77920k323n5754K451K93398o9343k64947J09089J14450R4185
11030G83991J50940m9065k77186k93285K26831J32736j47457n4077k9808J57091
11020F00711L5871j10996L13341C00759J18796J33476N6605L6333k71561J66831
11010E41239k54606K55617j3421p9591M196M4448j8556K30309P6978k06201K5791
10999F06203k2466k45088J59430R3015K24517P796l56527J40828M57676l14012
10989G51372l20455r6996L95267j98705M96367R9656k03468J46846k18400J63567
$$ plain form
10979 1015051 1301921 1191946 1433170 1926085 1705416 2230911 2516355 2376309 2697598
10970 2697598 2372965 2352296 2285285 2259886 1646548 1362993 1393225 1753557 1590133 1691724
10960 1691724 1959192 1803578 1860327 1626876 1677878 1396294 1547930 1706567 1127742 998866
10950 998866 934963 577765 476240 815183 639107 552327 144669 342182 437731 170005
10939 95770 229891 172510 244103 235719 106863 105714 -82816 317549 250793 -21562 8851 102023
10927 102023 -34764 41043 214184 64356 230848 135277 30221 -58781 148009 158899 -99388
10915 -133005 244696 -35457 109606 -191097 185783 268946 -5621 -221865 -120302 136376
10904 314661 18703 193666 -140901 57182 -161479 -200505 -142722 -236704 -55787 140309 145611
$$ packed form
10979A015051K86870j09975K41224M92915k20669N25495K85444j40046L21289
10970B697598l24633k0669o7011k5399o13338k83555L0232L60332j63424J01591
10960A691724K67468j55614N6749k33451N1002k81584J51636J58637n78825j28876
10950I98866o3903l57198j01525L38943j76076q6780A44669J97513R5549A70005
10939I5770J34121n7381P1593q384A06863j149h2816C17549o6756b1562H851R3172
10927A02023c4764D1043J73141F4356J66492r5571C0221e8781A48009J0890i9388
10915a33005B44696c5457A09606a91097A85783Q3163e621k16244J01563A36376
10904C14661A8703J74963a40901E7182a61479l9026N7783r3982e5787A40309N302
$$ plain form
10893 145611 292467 101422 52164 -230058 -81792 -45264 -29386 -200880 -198681 -161738 -189048
10882 -189048 28702 230664 -170393 -302403 131559 -214152 -70383 -47058 -27536 181591
10871 -211739 64659 -65843 -259556 200048 198386 316838 -80558 138806 204502 157875 193765
10860 193765 139878 239462 -197206 -62702 -198170 235384 -4573 -153190 44299 -193102 -34016
10848 -190835 71889 -70932 -244473 -83725 258318 -225400 30476 -140869 -201029 16259 342086
10837 342086 265997 -38441 -108071 131992 -70324 269934 89387 -145734 -270536 -200729 -280234
10826 -280234 -109098 -184444 -423935 -34534 232480 -99512 -285130 31518 -4653 -180155 -221739
10815 -221739 9714 98852 1838 219572 44418 -92126 -146536 331302 -104769 130277 -58094
$$ packed form
10893A45611J46856A01422m9258b30058h1792L6528J5878j71494K199L6943k7310
10882a89048B8702K01962a70393j32010A31559b14152g0383K3325J9522A81591
10871b11739F4659f5843j93713B00048j662J18452h0558A38806O5696m6627L5890
10860A93765n3887R9584a97206f2702j35468B35384d573j48617D4299a93102c4016
10848a90835G1889g0932j73541h3725B58318b25400C0476a40869o0160A6259L25827
10837C42086p6089c8441o9630A31992g0324B69934H9387a45734j24802O9807p9505
10826b80234a09098p5346k39491c4534B32480i9512j85618C1518d653j75502m1584
10815b21739I714Q9138A838K17734D4418i2126n4410C31302a04769A30277e8094
$$ plain form
10803 163288 9589 -19446 297728 -351897 -258153 209833 -318905 -53910 -205432 -123896 -40502
10791 -103616 -192997 -390373 -122991 -153072 127851 120708 -127655 -122641 -299241 -64068 -168926
10780 -168926 271497 -182431 -12924 -184836 -322286 -22819 202828 -120866 283441 -141089
10769 177735 -8560 46557 142228 76818 -120693 156080 98657 -73920 -70070 -318440 88744
10757 10458 -142994 -186612 72576 -70489 10223 26288 14307 -19177 -211573 -144173 -125940
10746 -125940 -228759 3504 -187456 68563 -112255 111177 -338707 -253967 -123751 -141931
10736 -141931 8620 282999 -39504 120236 -13584 93682 233398 15221 133043 -12786 -228840
10725 -228840 174594 45805 -201417 42764 -108098 -51899 -275187 -11209 187884 -99937
$$ packed form
10803A63288I589a9446B97728c51897R3744B09833c18905e3910j51522Q1536d0502
10791a03616q9381j97376a22991l0081A27851p143a27655N014j76600f4068j04858
10780a68926B71497a82431a2924j71912j37450b2819B02828a20866B83441a41089
10769A77735h560D6557R5671o5410a20693A56080n7423g3920L850k48370H8744
10757A0458a42994m3618G2576g0489A0223J6065j1981a9177j92396O7400J8233
10746a25940j02819C504a87456F8563a12255A11177c38707Q4740a23751j8180
10736a41931H620K74379c9504A20236a3584I3682J39716A5221J17822a2786k16054
10725b28840A74594D5805b01417D2764a08098e1899k23288a1209A87884i9937
$$ plain form
10714 -268509 263096 -21321 -158027 -131061 -255077 -32922 85979 200687 -332587 -209281
10704 -209281 -247168 -256621 -76674 -104672 60458 -227442 -60811 -118352 -143477 22368 116084
10693 116084 -114086 -105212 -65418 99831 -241348 65517 -324163 -156257 -232320 -46930 63790
10681 344759 308453 -414513 -135835 165592 -93151 -71947 -237530 139501 -136499 -179186
10671 -179186 -470464 -67699 115445 23421 -59656 -134030 -207394 168452 -134992 158499
10660 29516 -243600 -212530 -68926 280841 -14428 -226121 -157110 10556 -304989 -243804 258358
10648 -115173 -279710 -20600 173818 -380045 80384 -217480 -62364 -187428 -244390 385013
10637 85704 56577 131615 -93006 261243 -85850 -61190 -1043 260462 210775 153472 -174301
$$ packed form
10714b68509B63096b1321j36706K6966j24016c2922H5979J14708c32587J23306
10704b09281l7887r453g6674k7998F0458b27442f0811n7541k5125B2368R3716
10693A16084a14086Q874L9794I9831b41348F5517c24163a56257p6063d6930F3790
10681C44759l6306d14513a35835A65592i3151K1204j65583A39501a36499m2687
10671a79186k91278f7699A15445B3421e9656p4374p3364A68452a34992A58499
10660B9516b43600L1070f8926B80841a4428k11693O9011A0556c04989O1185B58358
10648a15173j64537b0600A73818c80045H0384b17480f2364j25064n6962C85013
10637H5704k9127P5038i3006B61243h5850K4660a043B60462m9687n7303a74301
$$ plain form
10625 23502 55526 -153413 -57201 75174 -214456 -15110 -207649 312083 49835 231764 -153574
10613 63598 70202 -134839 157942 227679 125611 -79640 -63888 208792 88397 -64794 -52815
10602 -52815 -168469 -124746 159215 -175106 -199450 -304810 310206 -37839 82747 -16777 -367031
10591 -367031 392946 -33335 104866 -92669 231640 -136093 -214630 -189254 -30758 -78332 80204
10579 -27897 -103611 -209001 36286 -19889 -141203 -36081 -43749 -90169 47208 -334946 34553
10567 -33487 -199088 54512 -56754 371191 -168472 -35171 78635 -243869 256897 -186781
10556 -397257 78096 94881 -65008 -187389 170344 -56188 -137179 202880 384859 -86794 -143485
10545 -143485 -220687 201757 8093 -108335 -52896 128112 -188855 -38988 -26086 130855 -46694
$$ packed form
10625B3502L2024a53413e7201G5174b14456a5110j92539C12083D9835J81929a53574
10613F3598O604a34839A57942O9737j02068g9640J5752B08792H8397f4794J1979
10602e2815j15654M3723A59215a75106k4344j05360C10206c7839H2747a6777l50254
10591c67031C92946c3335A04866i2669B31640a36093p8537K5376c0758m7574H0204
10579b7897p5714j05390C6286a9889j21314c6081p668m6420D7208c34946C4553
10567c3487j65601E4512e6754C71191a68472c5171G8635b43869B56897a86781
10556c97257G8096J6785f5008j22381A70344e6188q0991B02880J81979h6794n6691
10545a43485p7202B01757H093a08335e2896A28112a88855c8988J2902A30855d6694
$$ plain form
10533 -150032 154365 -193369 -80636 -18481 -171843 -96490 -97333 -7342 -284297 -297269 -511554
10522 -511554 -142873 83086 108486 7159 -141781 114401 -199159 -155701 -208836 -35148 107694
10510 46991 121034 33114 72904 56092 42104 149245 40228 -212363 -3159 157658 157212 1768
10497 -162421 -137990 52860 -242773 -6173 -387253 74282 -254158 61399 -298743 -3931 4274
10485 234521 218686 43370 263206 532801 212038 434604 177844 519212 459742 220512
10474 215766 -22239 -98642 -11748 -39011 -73602 36135 69376 -135562 -76874 -263937 17497
10462 299121 -200223 -196534 -138078 8633 73224 -161922 35379 270109 210199 -107963 -19465
10450 -45408 409129 -85177 -20838 -131170 6440 66971 40514 108526 -137621 -75738 -190861
$$ packed form
10533a50032A54365a93369h0636a8481j53362P5353q43g342k76955j2972k14285
10522e11554a42873H3086K5400G159a41781A14401a99159M3458n3135c5148A07694
10510D6991P4043C3114L9790j6812j3988J07141D0228b12363c159A57658m46A768
10497a62421K4431E2860b42773f173l81080G4282b54158F1399b98743c931D274
10485B34521j5835D3370K19836K69595B12038K22566A77844L41368n9470B20512
10474B15766b2239p6403a1748k7263l4591C6135L3241a35562N8688j87063A7497
10462B99121b00223L689N8456H633O4591a61922C5379K34730n9910a07963a9465
10450d5408D09129h5177b0838j10332F440O0531k6457O8012a37621O1883j15123
$$ plain form
10439 -190861 299626 -140367 105682 -109117 3730 -135254 -124558 -28614 394269 228301
10429 228301 -166549 -47112 -184861 -180295 -159714 -112050 -391129 -34556 85728 30716 35474
10418 35474 -157901 -38688 69923 1014 62314 -115814 -151187 91373 -73178 -66396 -85487 -154304
10406 -154304 13101 149000 -106509 257488 184539 -43953 265188 -97035 355709 -86594
10395 -45171 245217 -560 381421 177156 118728 175525 385224 -110403 471985 81756 125064
10384 125064 43813 31650 166740 406670 335336 30921 181248 159606 216606 206505 40181
10372 -82273 334161 329720 221627 662694 -100126 484245 497979 426725 266949 276679 -209227
10360 361429 17046 55765 144807 181192 185990 231893 366245 288280 713864 267112 524114
$$ packed form
10439a90861B99626a40367A05682a09117C730a35254J0696b8614C94269j65968
10429B28301a66549d7112j37749M566K0581M7664k79079c4556H5728C0716M758
10418C5474a57901c8688F9923A014O1300a15814l5373I1373g3178O782j9091o8817
10406a54304A3101J35899a06509B57488p2949d3953B65188i7035C55709h6594
10395d5171B45217e60C81421A77156n8428N6797K09699a10403D71985H1756M3308
10384A25064D3813j2163J35090K39930p1334C0921J50327k1642N7000j0101D0181
10372h2273C34161m441j08093M41067a00126D84245J3734p1254j59776R730b09227
10360C61429A7046L8719Q9042L6385M798M5903J34352p7965M25584B67112K57002
$$ plain form
10349 524114 359819 202779 504951 261595 165455 312070 410040 337847 191047 38970
10338 205869 -140185 216817 202929 40504 420306 308551 167555 70950 388547 252599
10328 252599 60236 -99245 106696 272195 16963 -223737 163634 -284891 199671 -35961
10317 90564 90299 -180072 325 199155 -23646 87245 -83190 97575 466 65439 -2105 -223127
10305 -223127 -156198 -36091 -96964 8365 26404 -163436 -136104 -62117 165072 -40976 8643
10293 -312444 -7201 -99267 359151 -340908 -268383 -246773 -389740 78228 74637 -73170 -144004
10282 -144004 -12028 39849 -108738 -61725 -66290 -47064 130635 115065 -139195 -25461 23536
10270 -106938 162057 -53074 124632 35000 -130831 20737 390089 176768 215891 554004
$$ packed form
10349E24114j64295j57040L02172k43356r6140J46615R7970p2193j46800C8970
10338B05869a40185B16817j3888D0504L79802j11755j40996G0950L17597j35948
10328B52599F0236i9245A06696J65499A6963b23737A63634b84891A99671c5961
10317I0564k65a80072C25J98830b3646H7245h3190I7575D66O4973b105k21022
10305b23127O6929c6091o0873H365J8039a63436K7332f2117A65072d0976H643
10293c12444g201r2066C59151c40908P2525K1610j42967G8228l591g3170p0834
10282a44004a2028C9849a08738M7013m565J9226A30635j5570a39195b5461B3536
10270a06938A62057e3074A24632C5000a30831B0737L69352A76768L9123L38113
$$ plain form
10260 554004 282002 274386 653244 429669 84750 325228 434416 -165538 64613 -421441
10249 -227191 50200 224656 4930 93753 46808 -29252 -15981 119604 127015 48691 -72006
10237 54301 -88481 150273 217156 28270 25696 1729 48283 44426 -94336 113126 -86363 -148814
10225 -148814 149968 -175434 -45321 268177 28618 43510 60854 -76926 -91817 190972 -96914
10213 -12962 293183 -151320 -109791 41563 -61149 24999 -230608 -101653 244870 83746 165461
10202 165461 -225811 -176193 136483 14583 -167090 -111398 -186086 167920 162871 -290793 8568
10190 -214556 -80142 -335386 -87181 -263891 -260403 35943 51509 -369967 24943 42068 113564
10179 113564 72871 -367962 -126859 -65938 10268 72167 -89530 -114389 -243696 176250 -287241
$$ packed form
10260E54004k72002p616L78858k23575H4750K40478J09188a65538F4613d21441
10249b27191E0200J74456D930Q8823D6808b9252J3271A19604P411D8691g2006
10237E4301h8481A50273O6883B8270k574A729M6554l857i4336A13126h6363o2451
10225a48814A49968a75434d5321B68177B8618J4892J7344g6926j4891A90972i6914
10213a2962B93183a51320M1529D1563f1149B4999b30608a01653B44870H3746Q1715
10202A65461b25811M9618A36483A4583a67090N5692p4688A67920n049b90793H568
10190b14556h0142k55244h7181j76710L488C5943J5566c69967B4943J7125P1496
10179A13564m0693c67962a26859O0921A0268O1899h9530k4859j29307A76250b87241
$$ plain form
10167 -319755 -60161 -295356 -28233 175767 58747 -34116 -243582 -98195 24082 -229142 -40514
10155 256593 -171263 -355257 -48757 -73175 42774 -252129 -192667 -59792 -121243 168247 -184769
10143 110688 -135950 120091 -10288 -23083 -152272 -172181 -113543 142877 -183621 -67345
10132 -198388 -34047 6835 140979 -123710 58137 -189081 21676 178509 47713 -77254 -51111
10121 -51111 -183900 33755 -142021 -17042 -223810 -257983 -40070 -121344 -292995 -11289 67110
10109 79315 188259 394737 -7979 -3315 173441 -314784 -81413 84133 -134915 143187 68342
10097 21574 28845 -73146 -90925 -58539 44626 -119121 -99930 -74780 36166 78152 -393716
10085 -89575 121632 60493 321683 -64763 39066 -275812 75370 126786 106034 -324783 63521
$$ packed form
10167c19755f0161k35195b8233A75767E8747c4116k09466i8195B4082b29142d0514
10155B56593a71263j83994d8757k4418D2774b52129N9462e9792o1451A68247a84769
10143A10688a35950A20091a0288j2795j29189j9909N8638A42877a83621f7345
10132a98388c4047F835J34144a23710E8137a89081B1676J56833D7713g7254K6143
10121e1111j32789C3755a42021a7042k06768l4173d0070q1274j71651a1289F7110
10109G9315J08944K06478g979c315A73441c14784h1413H4133a34915A43187F8342
10097B1574P271g3146j7779L2386D4626a19121J9191K5150C6166M1986c93716
10085h9575A21632F0493K61190f4763C9066b75812G5370N1416k0752c24783F3521
$$ plain form
10073 -72363 -192908 -56922 351 -195313 50566 19883 -35193 230879 -74757 -250895 294450
10061 -209154 -147171 -148928 -148774 -130886 -3924 40591 -59536 -17279 -16639 -192682 -127061 179199
10048 -112850 109525 183145 152663 237482 -197522 73494 -224615 81228 -210582 101122
10037 -133719 129718 40787 42851 92538 -70852 -6341 -26495 -31671 -128115 -60473 -380760 131507
10024 -385624 -61109 51126 83617 40371 -161828 -234029 122423 -352025 -33157 130265 -189220
10012 -261255 -20671 25358 -319315 151413 -62914 -164884 -45404 -92649 214790 5989 166584
10001 166584 -64212 21559 -184480 -83387 -87029 9353 -28905 18603 -419886 -86219 126753
9989 -219199 5542 -32228 -9159 39417 -140193 -60176 -71623 -46690 -267578 51207 4428 37385
$$ packed form
10073g2363j20545e6922C51a95313E0566A9883c5193B30879g4757j76138B94450
10061b09154O1983j757J54J7888c924D0591e9536a7279O40j76043O5621A79199
10048a12850A09525P3620l0482Q4819a97522G3494b24615H1228b10582A01122
10037a33719A29718D0787K064M9687g0852f341k0154n176r6444f0473l20287A31507
10024c85624f1109E1126L2491D0371a61828p2201A22423c52025c3157A30265a89220
10012b61255b0671B5358c19315A51413f2914j01970d5404m7245B14790E989J60595
10001A66584f4212B1559a84480h3387l642I353b8905A8603d19886h6219A26753
9989b19199E542c2228i159C9417a40193f0176j1447K4933k20888E1207D428L2957
$$ plain form
9977 37385 -260987 88045 154164 47660 77943 -64234 17757 -51143 -50101 -5700 -173478 -40853
9964 -433235 96 -9789 -76641 -240594 -392348 23793 115894 32214 -245960 -129091 93424 87045
9952 87045 405485 -198198 52018 -68125 127207 -163201 49305 -23076 -213744 30969 -139658
9940 -439032 -381898 63030 -109458 -204094 -261409 60303 -161267 -301397 18691 -88301 -139267
9929 -139267 30634 -70772 -166338 -61889 318458 19947 -219638 -244656 -90644 -359296 -66508
9917 -263199 106916 -126066 116759 -351333 61662 62863 -122147 -167139 -165887 105802 7228
9905 -18007 -113866 235425 -197209 -153479 35817 -185577 37179 -169263 -109552 40482 31285
9894 31285 -97865 136463 -128102 -29527 -66283 -91967 91888 12625 11634 104930 90356 -6869
$$ packed form
9977C7385b60987H8045O6119D7660L0283f4234A7757e1143J042e700j67778d0853
9964d33235I6i789o6852j63953j51754B3793R2101C2214b45960J16869I3424o379
9952H7045L18440a98198E2018f8125A27207a63201D9305b3076j90668C0969a39658
9940d39032N7134F3030a09458r4636n7315F0303a61267j40130A8691h8301n0966
9929a39267C0634g0772r5566f1889C18458A9947b19638k5018i0644k68652f6508
9917b63199A06916a26066A16759c51333F1662J201a22147m4992J252A05802G228
9905a8007r5859B35425a97209M3730C5817a85577C7179a69263N9711D0482r197
9894C1285i7865A36463a28102b9527l6756k5684I1888A2625r91R3296j4574f869
$$ plain form
9881 168159 182531 -298470 -232147 -166370 -103690 -230178 141125 81135 54066 212172 61012
9869 81383 -96430 -188492 -241355 51773 -189676 -183140 135204 -145745 -37107 -275655 11308
9857 -3736 237683 69310 -341143 215015 57699 -32238 22794 -15984 -136281 -315874 -47972
9845 117527 -79821 96408 -139057 399948 113534 87121 -197116 -86370 -28872 117219 62202
9834 62202 5599 -177595 -258827 -329758 70665 15615 115509 103639 28061 -46281 -166881 -268472
9822 -268472 26791 327208 -255097 298604 331468 -100559 -463157 -36532 -59716 -393653
9812 -393653 -220508 -214991 91376 -93231 -240418 201904 -231943 141199 -45342 -209315 51811
9800 96580 32478 40533 -122511 -212570 176812 42179 35147 -9319 164635 38919 16921 -79687
$$ packed form
9881A68159J4372b98470O6323O5777O2680j26488A41125n9990k7069J58106F1012
9869H1383i6430r2062n2863E1773a89676O536A35204a45745c7107k38548A1308
9857c736B37683F9310c41143B15015E7699c2238B2794a5984j20297j79593d7972
9845A17527g9821I6408a39057C99948A13534k6413a97116h6370b8872A17219n5017
9834F2202E599a77595q1232p0931G0665A5615R9894j1870B8061d6281j20600j01591
9822b68472B6791L00417b55097B98604L2864a00559l62598c6532k3184l33937
9812c93653J73145N517I1376i3231j47187B01904b31943A41199d5342j63973E1811
9800I6580C2478Q055a22511r0059A76812D2179p032i319A64635C8919A6921g9687
$$ plain form
9787 -94761 10351 -87025 -268358 401737 -210753 -279596 21140 117938 58367 -67413 -117084
9776 -117084 -104862 -349949 -113380 87307 -323131 202013 -43521 -83973 65461 -37319 126573
9764 -65843 112125 18381 73004 -12623 71645 -49450 -4843 -85158 -60368 -60277 -70329 -106498
9752 -106498 -202484 -120563 155954 -89252 128683 232830 185967 188981 -195967 -64180 18329
9740 299755 -62553 288297 246652 -187466 -341256 120922 -73846 53559 191845 11465 263176
9729 263176 87750 94666 -21417 -74895 -37323 -197926 -120997 -167027 64880 -115298 -202728
9718 -202728 -101708 124877 -12821 -419048 -51104 -152040 65703 -96214 -1983 -240152 -332853
9707 -332853 -129891 273395 131074 -27395 73659 -178030 3270 -27046 -58337 4628 31114
$$ packed form
9787i4761A0351h7025j81333D01737b10753o8843B1140R6798E8367f7413m9671
9776a17084J2222k45087a13380H7307c23131B02013d3521m0452F5461c7319A26573
9764f5843A12125A8381N4623a2623G1645d9450d843q0315K4790R1j0052l6169
9752a06498r5986Q1921A55954h9252A28683J04147m6863L014a95967f4180A8329
9740B99755f2553B88297m1645a87466j53790A20922g3846E3559J38286A1465K51711
9729B63176H7750O916b1417n3478c7323j60603P6929m6030F4880a15298q7430
9718b02728J01020A24877a2821m06227e1104j00936F5703i6214a983k38169r2701
9707c32853a29891B73395A31074b7395G3659a78030C270b7046l1291D628K6486
$$ plain form
9696 31114 -86413 -85489 70221 125292 242275 24202 122318 -45832 -31414 -169893 -114515 165873
9683 130768 -77485 -2813 -338809 204217 15395 -84837 42441 -137075 102123 -81073 69638
9671 -26048 130266 -250328 82274 -140519 40333 182620 -123687 -256879 135075 -174803
9660 -32403 -116664 -16676 28241 140821 -147299 116562 -19089 -220136 -336130 -284970 -28119
9648 79452 287060 15040 -526371 39113 205396 -107554 373778 38784 -56023 -164229 4695
9636 183847 87161 287471 -364769 -39592 83631 85278 77926 99567 -84855 -38255 -167114
9625 -167114 -108958 -107595 -146402 -122131 -105281 -191858 148257 -86209 -625809 20938 80644
9614 80644 -282562 -4783 -23691 -159817 21184 -112371 68100 -140814 -82046 -268362 164303
$$ packed form
9696C1114h6413R24G0221N5071J16983B4202R8116d5832J4418j38479N5378A65873
9683A30768g7485b813l35996B04217A5395h4837D2441a37075A02123h1073F9638
9671b6048A30266b50328H2274a40519D0333J42287a23687j33192A35075a74803
9660c2403q4261a6676B8241J12580a47299A16562a9089k01047j15994N1160b8119
9648G9452K07608A5040e26371C9113J66283a07554C73778C8784e6023j08206D695
9636A83847H7161K00310c64769c9592H3631J647p352K1641h4855c8255j28859
9625a67114N8156J363l8807K4271J6850q6577A48257h6209n39600B0938N9706
9614H0644b82562d783j8908j36126B1184a12371F8100a40814N8768j86316A64303
$$ plain form
9602 163904 -76366 -385467 -114052 56092 395471 220132 -98097 228209 -152513 -199889
9592 -199889 -147652 47389 110032 -310510 -123432 -592969 -344776 -179289 38806 7554 45803
9581 45803 242979 75598 -152677 -204936 -17273 -91670 -61173 -138868 -396010 5367 181983
9570 181983 -210556 -51678 -120677 -88086 -413988 -133366 -257167 -24518 116241 -36923 111652
9558 -393416 -156150 143099 121237 11431 -23279 -130558 -145277 -69429 54281 -135163 232746
9546 -37696 -426643 -174591 -194476 -49487 -264675 3238 120034 108248 12590 -247377 178275
9534 127434 -249058 -197652 80121 -8835 8662 -66797 -182156 73185 134243 -243408 -64311
9522 -153230 -152273 -266933 -96482 -8689 -352872 51671 181744 40765 50405 -88412 -163154 92845
$$ packed form
9602A63904g6366l09101a14052E6092L39379j75339i8097B28209a52513m7376
9592a99889N2237D7389O2643c10510a23432m69537K48193J65487C8806G554L8249
9581D5803J97176G5598a52677n2259a7273p4397L0497p7695k57142E367J76616
9570A81983b10556e1678o8999L2591l25902a33366j23801b4518A16241c6923A11652
9558c93416a56150A43099k1862A1431b3279j07279j4719f9429E4281a35163B32746
9546c7696l88947a74591j9885d9487k15188C238J16796j1786A2590b47377A78275
9534A27434b49058N1406H0121h835H662f6797j15359G3185O1058b43408f4311
9522a53230R57j14660i6482h689l44183E1671J30073D0765R640h8412p4742I2845
$$ plain form
9509 -123001 -142811 -225318 -221542 250900 96839 -328980 -304063 -183907 -326979 204262 -116795
9497 24734 8418 -171785 -252428 -2323 71511 147440 172905 -228187 -66770 356186 88554 -55629
9484 -275677 252764 -139804 -65526 -47477 -219280 110376 5916 46829 -104381 137764 -300857
9472 157709 -39241 -66787 -301039 -187513 1096 169854 -19582 44995 103810 273433 -38086
9460 210525 -27926 -80706 -261960 17682 -126248 -128729 -234734 151947 60488 345034 -135510
9448 96324 -190155 -20401 -139631 -74924 58458 67617 50956 -206489 -201240 79805 69888 -235588
9435 -106963 -85654 -563348 56296 350470 -163427 -165894 -109735 20013 -348532 50449 168290
9424 168290 -248793 -30144 -79158 -200083 -106379 -177373 -108282 -185065 -99151 -178078 -137157
$$ packed form
9509a23001j9810q2507L776B50900I6839c28980K4917J20156j43072B04262a16795
9497B4734H418a71785q0643b323G1511P5929K5465b28187f6770C56186H8554e5629
9484b75677B52764a39804f5526J8049j71803A10376E916M0913a04381A37764c00857
9472A57709c9241k7546k34252J13526A096J68758a9582D4995N8815J69623c8086
9460B10525b7926n2780j81254A7682a26248k481j06005A51947F0488K84546a35510
9448I6324a90155b0401j19230O4707E8458R159j6661b06489N249G9805r917b35588
9435a06963K1309m77694E6296K94174a63427k467N6159B0013c48532E0449J17841
9424A68290b48793c0144m9014j20925R3704p0994O9091p6783Q5914p8927M0921
$$ plain form
9413 -137157 35273 -374076 9759 -17669 -207340 87179 119781 -33059 20552 -103707 -52469
9402 -52469 -22043 274229 -230814 16208 -19819 -288077 60073 -121421 -136216 131108 -360926
9390 -119533 -215655 -102867 -118950 -12127 -68534 -118844 34579 -106177 -82792 -196797 12909
9378 -166695 -20200 -22510 -211841 183890 111591 -200278 157827 -176954 156695 -326423
9367 163651 201202 -165007 -221819 128497 -138627 -74305 -106612 -213732 -282786 -303944 69143
9355 -8423 -342144 71447 -636690 -74101 -34229 200679 142733 -242387 -21196 186308 -178663
9343 -173966 -9855 26793 -319839 -282555 -53560 -14908 -434844 193846 -145619 62237 64580
9332 64580 -312632 42429 61211 -208259 -255490 -54227 -87342 -58766 -30320 -34805 128502
$$ packed form
9413a37157C5273c74076I759a7669j89671H7179L2602c3059B0552a03707N1238
9402e2469b2043B74229b30814A6208a9819k68258F0073a21421j4795A31108c60926
9390a19533r6122a02867j6083a2127n6407n0310C4579a06177K3385j14005A2909
9378a66695b0200k310j89331A83890p2299b00278A57827a76954A56695c26423
9367A63651L7551a65007n6812A28497a38627O4322l2307j07120o9054k1158F9143
9355h423l33721G1447f36690g4101c4229B00679n7946b42387b1196A86308a78663
9343a73966i855B6793c19839L7284e3560a4908m19936A93846a45619F2237K343
9332F4580c12632D2429J8782b08259m7231e4227l3115K8576K8446m485A28502
$$ plain form
9320 -69476 65647 64146 201498 -107794 -2359 51255 228928 -150744 -34322 -89902 -132008
9309 -132008 -245929 291856 600718 143463 116687 -182547 463483 201532 -168978 8385
9298 115344 -329582 109919 -146561 150487 59453 -215307 -98498 128671 -92755 340351
9287 -280857 -54729 -254572 -249742 -178730 186811 82503 93620 61210 41748 -75847 -2125 15870
9274 -189206 -120872 -34326 -407107 82191 -240208 -170634 -384806 -299574 13637 -159359 14561
9262 57274 -45311 -153980 102061 213135 25044 -30828 77818 61728 53196 122513 -739 41645
9249 -182004 -320789 14719 -365911 3437 -121278 -94441 177776 -217422 23391 -204108 -100494
9237 -56168 -351571 165187 -173323 -84837 -17704 45265 -76269 -276704 -2912 -144405 -270335
$$ packed form
9320f9476F5647j501J37352a07794b359E1255J77673a50744c4322n5580m2106
9309a32008j13921B91856L08862A43463k6776a82547D63483B01532a68978H385
9298A15344c29582A09919a46561A50487E9453b15307i8498A28671i2755C40351
9287b80857e4729j99843M830P1012A86811H2503J1117l2410j9462g5847b125A5870
9274a89206O8334c4326l72781H2191b40208O9574k14172Q5232A3637a59359A4561
9262E7274d5311j08669A02061J11074B5044c0828G7818j6090q532O9317g39D1645
9249a82004j38785A4719c65911C437a21278K6837A77776b17422B3391b04108a00494
9237e6168k95403A65187a73323h4837a7704D5265g6269k00435b912j41493j25930
$$ plain form
9226 -270335 -252188 -4494 -15061 69955 -190237 -4753 -58975 -221450 -106928 9058 -48831 -138624
9214 -138624 17589 -117079 -255600 -81439 -404746 -5134 -280264 -26186 -34533 -233189 59193
9202 294320 -307989 34323 173507 -193326 -47672 -228100 185320 42061 -217321 -383817
9192 -383817 -74591 94415 -140162 37111 -102524 -96434 132829 -93405 34476 -195592 -107644
9181 -107644 299255 -89186 -123939 -313856 -186818 -178894 -59388 -92369 -53520 143018 22261
9169 -14258 -157690 -81838 -139770 -120259 225979 37295 135565 29698 -61590 -240699 -331920
9158 -331920 -306122 -1356 127194 67794 -327125 -319420 50688 38119 -199365 -93891 192690
9146 -242081 -112057 -186306 99790 57663 -151422 -185557 -238812 133172 -186738 61712 86156
$$ packed form
9226b70335J8147d494j0567F9955a90237d753n4222j62475a06928I058d8831q9793
9214a38624A7589a17079j38521h1439l23307e134k75130b6186q347j98656E9193
9202B94320c07989C4323J39184a93326d7672j80428A85320D2061b17321j66496
9192c83817g4591I4415a40162C7111a02524O090A32829i3405C4476a95592Q7948
9181a07644B99255h9186l4753j89917J27038P924e9388l2981L8849A43018B2261
9169a4258j43432P5852n7932J9511B25979C7295R8270B9698f1590j79109r1221
9158c31920K5798a356A27194n9400c27125P705E0688j2569a99365i3891A92690
9146b42081a12057p4249I9790m2127a51422l4135n3255A33172a86738F1712K4444
$$ plain form
9135 86156 -81281 206262 -188223 -110789 -310764 -3291 8425 237640 -222958 29914 57109
9124 57109 -312908 399289 -28214 -46886 273442 -163174 -40470 -131955 21150 76616 112355
9113 112355 16449 -90114 -348843 127458 65197 -201720 41672 55957 -237219 168848 157190
9102 157190 -295054 24019 414531 -33795 -150642 247291 155388 -79734 62609 -124160 40738
9090 2239 -195961 169038 -109932 -252088 -160317 -613490 -253503 88521 53577 9235 38652
9079 38652 -347777 158412 -211292 8184 -175379 198128 -96341 4709 183558 -109857 96387
9067 -28956 -86649 122481 2062 -87433 200833 14746 -76516 -246195 317209 144197 -114686
9055 67820 -188877 9513 174233 150262 -100891 35416 -446237 57122 -130123 -296289 85228
$$ packed form
9135H6156h1281B06262a88223P7434j99975c291H425K29215b22958B9914K7195
9124E7109c12908C99289b8214j8672B73442a63174d0470r1485B1150N5466L5739
9113A12355A6449i0114k58729A27458o2261b01720D1672J4285b37219A68848j1658
9102A57190b95054B4019L90512c3795j16847B47291r1903g9734F2609a24160D0738
9090B239a95961A69038a09932j42156R1771m53173b53503H8521l4944I235K9417
9079C8652c47777A58412b11292H184a75379A98128i6341D709J78849a09857I6387
9067b8956n7693A22481B062h7433B00833A4746g6516j69679C17209A44197a14686
9055F7820a88877I513J64720k3971a00891C5416d46237E7122a30123j66166H5228
$$ plain form
9043 -50469 -79448 -48117 -87796 -249660 -177590 -41564 157406 -361090 -328698 17285 -30881
9031 -16008 -92500 8001 -279091 -131407 79814 -302114 -120824 28855 -231422 -144724 -61490
9019 129297 312696 -185426 -167657 -404870 290964 -186315 30261 35421 -126347 -79996 -170417
9008 -170417 82322 45609 -193634 59461 -201810 -172486 112281 -83551 166096 346274 80663
8996 -166490 -13212 67521 -153728 -204738 31878 144011 -22356 -101832 -91979 -164139 217457
8984 72075 9791 -63591 -44006 -87776 49859 -269472 169616 -29860 -72492 6289 389173 -136532
8971 -197779 20029 -103674 -60802 65871 77922 -352814 41906 -226232 326564 -121077 262097
8959 -151130 48976 -99700 -351380 59400 45331 -63892 -48820 -380925 -231182 -223427 -131513
$$ packed form
9043e0469k8979L1331l9679j61864P2070d1564A57406c61090L2392A7285c0881
9031a6008p6492H001b79091a31407G9814c02114a20824B8855b31422Q6698f1490
9019A29297J83399a85426J7769k37213B90964a86315C0261N160a26347M6351r0421
9008a70417H2322l6713a93634E9461b01810K9324A12281h3551A66096J80178H0663
8996a66490a3212F7521a53728n1010C1878J12133b2356p9476R853p2160B17457
8984G2075I791f3591J9585m3770D9859b69472A69616b9860m2632F289L82884a36532
8971a97779B0029a03674M2872F5871J2051c52814D1906b26232C26564a21077B62097
8959a51130D8976i9700k51680E9400j4069f3892J5072l32105J49743P755R1914
$$ plain form
8948 -131513 88185 306825 -88774 -59346 48459 64037 -86788 -119754 30086 -441856 259542
8936 270330 -227466 37138 -58217 -77067 183308 3586 44993 -321573 -209278 83809 78042
8925 78042 -230720 266952 67898 564800 429676 60775 -240320 -172053 -388905 41583 23694
8914 23694 -282363 131772 129871 -89680 -261127 -10183 -173631 149879 -61847 7438 -8330
8902 -1456 173703 -45875 325668 -20828 -9798 -47656 -305541 189408 -248009 41710 46335
8891 46335 -83041 204635 182679 172770 -112123 21752 373449 -276463 -154763 -369752 -7398
8879 -45368 -54576 -147789 -121258 -141105 -213980 -343652 -1085 332068 -18985 62934 -78992 60243
8866 44085 -28118 31643 -364257 -309603 -11404 -102721 -64284 -244637 -28080 -286688 -229566
$$ packed form
8948a31513H8185K18640h8774K9428D8459J5578h6788l2966C0086d41856B59542
8936B70330b27466C7138e8217j8850A83308C586M1407c21573J12295H3809n767
8925G8042b30720B66952F7898M96902j35124F0775b40320O8267k16852D1583j7889
8914B3694b82363A31772j901h9680j71447a0183j63448A49879f1847G438h330
8902a456A73703d5875C25668b0828i798l7858k57885A89408b48009D1710M625
8891D6335h3041B04635k1956r909a12123B1752L51697b76463J21700k14989g398
8879d5368r208r3213K6531j9847p2875j29672a085C32068a8985F2934g8992F0243
8866D4085b8118C1643c64257N4654a1404r1317L8437j80353b8080k58608N7122
$$ plain form
8855 -229566 -11008 17076 73778 -293861 -14930 272703 399511 58523 -138775 -101091 -12480
8843 102701 -316801 12043 28282 -65096 71999 -332200 -126618 75703 47588 332230 -136611
8831 300328 -401707 -120062 -108754 40726 84808 -101727 -86100 17615 -15285 -73775 -83568
8820 -83568 255740 -285537 43554 155973 37087 -79684 -193035 -88153 -92935 -15175 -34236
$$ packed form
8855b29566a1008A7076N6702b93861a4930B72703J26808E8523a38775L7684a2480
8843A02701c16801A2043J6239f5096G1999c32200a26618G5703k8115K84642a36611
8831C00328d01707a20062J1308D0726M4082a01727J5627A7615a5285n8490r793
8820h3568B55740b85537D3554J12419C7087g9684j13351h8153m782a5175j9061
$$ [...]
##END NTUPLES=NMR SPECTRUM
##END=
