##TITLE=AC1750_SEN00023_9280823_mYdIHHmsZ0
##JCAMPDX= 6.0         $$ Bruker NMR JCAMP-DX V2.0
##DATA TYPE= NMR SPECTRUM
##DATA CLASS= NTUPLES
##ORIGIN= BRUKER
##OWNER= Administrator
$$ 1.72 TOPSPIN		Version 2.1
$$ 2015-07-19 00:06:25.994 -0700  Administrator@X
$$ Compression mode = diff/dup
##.OBSERVE FREQUENCY= 400.02188249412
##.OBSERVE NUCLEUS= ^1H
##.ACQUISITION MODE= SIMULTANEOUS (DQD)
##.ACQUISITION SCHEME= undefined
##.AVERAGES= 64
##.DIGITISER RES= 22
##SPECTROMETER/DATA SYSTEM= spect
##.PULSE SEQUENCE= noesygpps1d.comp
##.SOLVENT NAME= COFFEE_meoh
##.SHIFT REFERENCE= INTERNAL, COFFEE_meoh, 1, 14.96071
##AUDIT TRAIL= $$ (NUMBER, WHEN, WHO, WHERE, PROCESS, VERSION, WHAT)
$$ ##TITLE= Audit trail, TOPSPIN		Version 2.1
$$ ##JCAMPDX= 5.01
$$ ##ORIGIN= Bruker BioSpin GmbH
$$ ##OWNER= Administrator
$$ $$ E:\/data/COFFEE/nmr/AC1750_SEN00023_9280823_mYdIHHmsZ0/22/pdata/1/auditp.txt
$$ ##AUDIT TRAIL=  $$ (NUMBER, WHEN, WHO, WHERE, PROCESS, VERSION, WHAT)
(   1,<2015-07-19 00:06:20.713 -0700>,<Administrator>,<X>,<go>,<TOPSPIN 2.1>,
      <created by zg
	started at 2015-07-18 23:54:50.791 -0700,
	POWCHK enabled, PULCHK disabled,
       configuration hash MD5:
       21 0F 79 D6 B3 7B B4 F6 88 20 88 DB 03 48 BD 9F
       data hash MD5: 64K
       63 28 5F 01 83 57 38 29 F8 1F 56 2D 5C BA 05 70>)
(   2,<2015-07-19 00:06:23.900 -0700>,<Administrator>,<X>,<proc1d>,<TOPSPIN 2.1>,
      <Start of raw data processing
       efp LB = 0.3 FT_mod = 6 PKNL = 1 PHC0 = 0 PHC1 = 0 SI = 128K 
       data hash MD5: 128K
       1E B9 1D 1B 84 CC 8F 24 29 1B AF A4 39 84 1C 9D>)
(   3,<2015-07-19 00:06:24.775 -0700>,<Administrator>,<X>,<proc1d>,<TOPSPIN 2.1>,
      <pk PHC0 = -89.48364 PHC1 = 0 
       data hash MD5: 128K
       06 C8 77 E1 F3 DE 89 85 65 A3 30 C2 C0 55 50 B4>)
(   4,<2015-07-19 00:06:25.166 -0700>,<Administrator>,<X>,<proc1d>,<TOPSPIN 2.1>,
      <abs ABSG = 1 
       data hash MD5: 128K
       62 34 6B 10 47 CB 0C D7 07 C1 D8 8F 50 E5 C8 6A>)
(   5,<2015-07-19 00:06:25.275 -0700>,<Administrator>,<X>,<proc1d>,<TOPSPIN 2.1>,
      <abs ABSG = 2 
       data hash MD5: 128K
       6B 47 A0 07 07 90 80 9C 6C 46 39 36 F5 E3 EF 1B>)
(   6,<2015-07-19 00:06:25.369 -0700>,<Administrator>,<X>,<proc1d>,<TOPSPIN 2.1>,
      <abs ABSG = 3 
       data hash MD5: 128K
       85 60 94 87 4A FE F3 3D C6 B9 86 7A 64 31 1E 33>)
(   7,<2015-07-19 00:06:25.447 -0700>,<Administrator>,<X>,<proc1d>,<TOPSPIN 2.1>,
      <abs ABSG = 4 
       data hash MD5: 128K
       48 45 A5 C8 8F 19 5A 6D 71 92 15 43 F3 D4 57 01>)
(   8,<2015-07-19 00:06:25.541 -0700>,<Administrator>,<X>,<proc1d>,<TOPSPIN 2.1>,
      <abs ABSG = 5 
       data hash MD5: 128K
       21 4A 33 81 85 5C 8B 3E 58 52 14 34 8C EE 0B 63>)
$$ ##END=
$$ 
$$ $$ hash MD5
$$ $$ 0A C2 42 0E 41 5F F2 61 6A 04 92 93 DC 2F B5 E5
##$RELAX= 
##$RELAX= 
##$RELAX= 
##$RELAX= 
##$RELAX= 
##$RELAX= 
##$RELAX= 
##$RELAX= 
$$ Bruker specific parameters
$$ --------------------------
##$DU= <E:\>
##$EXPNO= 22
$$ [...]
##$TP07= 0
##$TPNAME0= <>
##$TPNAME1= <>
##$TPNAME2= <>
##$TPNAME3= <>
##$TPNAME4= <>
##$TPNAME5= <>
##$TPNAME6= <>
##$TPNAME7= <>
##$TPOAL= (0..7)
0.5 0.5 0.5 0.5 0.5 0.5 0.5 0.5
##$TPOFFS= (0..7)
0 0 0 0 0 0 0 0
##$TUNHIN= 0
##$TUNHOUT= 0
##$TUNXOUT= 0
##$USERA1= <user>
##$USERA2= <user>
##$USERA3= <user>
##$USERA4= <user>
##$USERA5= <user>
##$V9= 5
##$VALIST= <valist>
##$VCLIST= <CCCCCCCCCCCCCCC>
##$VD= 0
##$VDLIST= <DDDDDDDDDDDDDDD>
##$VPLIST= <PPPPPPPPPPPPPPP>
##$VTLIST= <TTTTTTTTTTTTTTT>
##$WBST= 2048
##$WBSW= 25
##$XGAIN= (0..3)
0 0 0 0
##$XL= 0
##$YL= 0
##$YMAX_a= 5510896
##$YMIN_a= -10276348
##$ZGOPTNS= <>
##$ZL1= 120
##$ZL2= 120
##$ZL3= 120
##$ZL4= 120
##$ABSF1= 14.96071
##$ABSF2= -5.597472
##$ABSG= 5
##$ABSL= 3
##$ALPHA= 0
##$AQORDER= 0
##$ASSFAC= 0
##$ASSFACI= 0
##$ASSFACX= 0
##$ASSWID= 0
##$AUNMP= <proc_prof1d_extract.lims>
##$AXLEFT= 0
##$AXNAME= <>
##$AXNUC= <1H>
##$AXRIGHT= 0
##$AXTYPE= 0
##$AXUNIT= <>
##$AZFE= 0.1
##$AZFW= 0.1
##$BCFW= 0
##$BC_mod= 0
##$BYTORDP= 0
##$COROFFS= 0
##$CY= 15
##$DATMOD= 1
##$DC= 0
##$DFILT= <>
##$DTYPP= 0
##$F1P= 0
##$F2P= 0
##$FCOR= 0.5
##$FTSIZE= 131072
##$FT_mod= 6
##$GAMMA= 0
##$GB= 0
##$INTBC= 1
##$INTSCL= 1
##$ISEN= 128
##$LB= 0.3
##$LEV0= 0
##$LPBIN= 0
##$MAXI= 10000
##$MC2= 0
##$MEAN= 0
##$ME_mod= 0
##$MI= 0
##$NCOEF= 0
##$NC_proc= -2
##$NLEV= 6
##$NOISF1= 0
##$NOISF2= 0
##$NSP= 0
##$NTH_PI= 0
##$NZP= 0
##$OFFSET= 14.96071
##$PC= 1
##$PHC0= -89.48364
##$PHC1= 0
##$PH_mod= 1
##$PKNL= yes
##$PPARMOD= 0
##$PPDIAG= 0
##$PPIPTYP= 0
##$PPMPNUM= 2147483647
##$PPRESOL= 1
##$PSCAL= 4
##$PSIGN= 0
##$PYNMP= <proc.py>
##$REVERSE= no
##$SF= 400.020009752414
##$SI= 131072
##$SIGF1= 0
##$SIGF2= 0
##$SINO= 400
##$SIOLD= 131072
##$SPECTYP= <>
##$SREGLST= <1H.CDCl3>
##$SSB= 0
##$STSI= 131072
##$STSR= 0
##$SW_p= 8223.68421052631
##$SYMM= 0
##$S_DEV= 0
##$TDeff= 65536
##$TDoff= 0
##$TI= <>
##$TILT= no
##$TM1= 0
##$TM2= 0
##$TOPLEV= 0
##$USERP1= <user>
##$USERP2= <user>
##$USERP3= <user>
##$USERP4= <user>
##$USERP5= <user>
##$WDW= 1
##$XDIM= 131072
##$YMAX_p= 412453027
##$YMIN_p= -10477
##$CURPLOT= <Network HP LaserJet P1505>
##$CURPRIN= <$Network HP LaserJet P1505>
##$DFORMAT= <normdp>
##$LAYOUT= <+/1D_H.xwp>
##$LFORMAT= <normlp>
##$PFORMAT= <normpl>
##$SURQMSG= 1
$$ End of Bruker specific parameters
$$ ---------------------------------
##NTUPLES= NMR SPECTRUM
##VAR_NAME=  FREQUENCY,     SPECTRUM/REAL,   SPECTRUM/IMAG
##SYMBOL=    X,             R,               I
##VAR_TYPE=  INDEPENDENT,   DEPENDENT,       DEPENDENT
##VAR_FORM=  AFFN,          ASDF,            ASDF
##VAR_DIM=   131072,        131072,          131072
##UNITS=     HZ,            ARBITRARY UNITS, ARBITRARY UNITS
##FACTOR=    0.0627417313425164, 1,          1
##FIRST=     8223.62146879497, 2095,         -52814
##LAST=      0,             4047,            -52404
##MIN=       0,             -10477,          0
##MAX=       8223.62146879497, 412453027,    0
$$ Real data points
##PAGE= N=1
##DATA TABLE= (X++(R..R)), XYDATA
$$ [...]
61727C97921K216K613K350J518N22r7j1O22J243J448J454J756K308K437J850J173
61711D21323J080J291J059L20l15n50p64j344k260l250l981m057l439k790k769
61696C99554l130l156k895l109l889m279l668k718k386k690k986k963k742k365
61682C56578j854j492j488j547j267p93o49r91j460j725j774j654j335q51l80
61667C37318o0P3l5m66j075j347p43O28J813J889J165R58J903K911K518Q81m32
61650C47899m68K46Q96J349J641J522J181J459K589L411K856J591J130J681J998
61635C70981J323K95l14p41j584k730l560l826l743l470k992k408j903j492j104
61620C42732r09j144j505j229j00R19N96j055k731l393l262l036k801k361k060
$$ y = [397921, 400137, 402750, 405100, 406618, 407140, 407043, 407032, 407654, 408897, 410345, 411799, 413555, 415863, 418300, 420150, 421323, 422403, 423694, 424753, 425073, 424758, 424208, 423444, 422100, 419840, 416590, 412609, 408552, 405113, 402323, 399554, 396424, 393268, 390373, 387264, 383375, 379096, 375428, 372710, 370324, 367634, 364648, 361685, 358943, 356578, 354724, 353232, 351744, 350197, 348930, 348137, 347488, 346497, 345037, 343312, 341538, 339884, 338549, 337698, 337318, 337258, 337331, 337296, 336830, 335755, 334408, 333665, 334293, 336106, 337995, 339160, 340118, 342021, 344932, 347450, 348331, 347899, 347431, 347677, 348573, 349922, 351563, 353085, 354266, 355725, 358314, 361725, 364581, 366172, 367302, 368983, 370981, 372304, 372599, 372285, 371544, 369960, 367230, 363670, 359844, 356101, 352631, 349639, 347231, 345328, 343836, 342732, 341823, 340679, 339174, 337945, 337845, 338764, 339360, 338305, 335574, 332181, 328919, 325883, 323082, 320721, 318661]
61605C18661k366k961l207l321l974m701m073j965l38q25k488l122k201j187j233
61590B80699j814j831j079k08J52j19o74j008r49q51j069j405j421j054n54p8
61574B66737K13p9j035j828j501k64O99P90N35M56L36p5l30R2R52J548J588J290
61556B70124R51P82R47J381J756J868J846J748J319M94k22k97O3J88j29m01j11
61539B82307P53J813K656K977K685J980J166M24k15p07j007j147j153r61n90k80
61523B90701k86n94j008j432j761j732j210n76l76n44m51J66P66P83M06J80J86
61506B83218J03j23k28k13l83p55r27o81k64J34O45J164J110K79m96k46P20J099
61488B84156K76r14j328q19j5O65J275J856K203K155J844J560J505J580J431P72
$$ y = [318661, 316295, 313334, 310127, 306806, 302832, 298131, 294058, 292093, 291755, 290930, 288442, 285320, 283119, 281932, 280699, 278885, 277054, 275975, 275767, 275919, 275800, 275126, 274118, 273169, 272318, 271249, 269844, 268423, 267369, 266815, 266737, 266950, 266871, 265836, 264008, 262507, 262243, 262942, 263732, 264267, 264723, 265059, 264984, 264654, 264746, 265698, 267246, 268834, 270124, 271075, 271857, 272804, 274185, 275941, 277809, 279655, 281403, 282722, 283216, 282994, 282697, 282760, 282948, 282819, 282418, 282307, 283060, 284873, 287529, 290506, 293191, 295171, 296337, 296761, 296546, 295839, 294832, 293685, 292532, 291571, 290981, 290701, 290415, 289821, 288813, 287381, 285620, 283888, 282678, 282102, 281726, 281182, 280731, 280897, 281663, 282446, 282852, 283032, 283218, 283321, 283198, 282970, 282757, 282374, 281619, 280692, 280011, 279747, 279881, 280526, 281690, 282800, 283079, 282583, 282337, 283057, 284156, 284432, 283518, 282190, 281371, 281356, 282021, 283296, 285152, 287355, 289510, 291354, 292914, 294419, 295999, 297430, 298202]
61472B98202j84q11o99q2M34M61K6o08j120j253r97o04l10j24Jn3l92p64o68J19
61452B90574J254K141K467K362K128J857J429P85J47j03K73J103J817J788R70
61437C10992J41K05J156K127K491K506K506K238J443O13L46L23j44q40q91k74
61421C24938J10k4J31R95J761J676J234J207J356R72J52m60p00q56q41m33p9n48
61403C30591j774k816l075k852k669k534k130j277j79N96N41j50n94k44M24P04
61387C12562O45P27R04P62L39J22K77O04J022J471J579J191R16J387K126K189
61371C28823J689J628K200K408J698Q14O62J143J656J936J981J755J425J324J424
61356C52566J451J606K427L700M501M606M912N966P027P190O506N364L766K054
$$ y = [298202, 298018, 297207, 296508, 296426, 296860, 297321, 297347, 296739, 295619, 294366, 293369, 292765, 292455, 292331, 292332, 292279, 291887, 291123, 290455, 290574, 291828, 293969, 296436, 298798, 300926, 302783, 304212, 304997, 305144, 305041, 305314, 306417, 308234, 310022, 310992, 311133, 311338, 312494, 314621, 317112, 319618, 322124, 324362, 325805, 326418, 326764, 327087, 326943, 326103, 325212, 324938, 325048, 325024, 325155, 326150, 327911, 329587, 330821, 332028, 333384, 334356, 334508, 334048, 333348, 332492, 331651, 331218, 331139, 330591, 328817, 326001, 322926, 320074, 317405, 314871, 312741, 311464, 311285, 311881, 312422, 312272, 311678, 311434, 311858, 312562, 313207, 313934, 314838, 315600, 315939, 316061, 316338, 316942, 317964, 319435, 321014, 322205, 323121, 324508, 326634, 328823, 330512, 332140, 334340, 336748, 338446, 339260, 339922, 341065, 342721, 344657, 346638, 348393, 349818, 351142, 352566, 354017, 355623, 358050, 361750, 366251, 370857, 375769, 381735, 388762, 395952, 402458, 407822, 411588, 413642]
61342D13642J390K383L907M406L864L338L091K495J493Q04O12K63m85j080j302
61327D38821j768k822l768l833l225k578j900p42P94J908K023J471J118J515K517
61312D29531L615M503N201N800O387P273Q847J0963J2754J3457J3126J2187J0591
61299E44235P990M652J528o28j804k356k605k942l711m819n786o430p103p995
61285E12226q629q423p509o542n838n088l997k773j804j084k45Q45J832K295K247
61270D67513K043J948K021K245K496K445J945J492J879L205M691N587N816N544
61256E10870M737L557K643K416K390J876J011M83M28L45k9m98j069k033l266m077
61240E19784m045l413k505j373k80J03m95j417j775j373n52M68J660K844L773
$$ y = [413642, 415032, 417415, 421322, 425728, 429592, 432930, 436021, 438516, 440009, 440813, 441425, 441688, 441203, 440123, 438821, 437053, 434231, 430463, 426630, 423405, 420827, 418927, 418185, 418979, 420887, 422910, 424381, 425499, 427014, 429531, 433146, 437649, 442850, 448650, 455037, 462310, 471157, 482120, 494874, 508331, 521457, 533644, 544235, 552225, 556877, 558405, 557777, 555973, 553617, 551012, 548070, 544359, 539540, 533754, 527324, 520221, 512226, 503597, 495174, 487665, 481123, 475285, 470197, 466200, 463427, 461623, 460539, 460294, 461139, 462971, 465266, 467513, 469556, 471504, 473525, 475770, 478266, 480711, 482656, 484148, 486027, 489232, 493923, 499510, 505326, 510870, 515607, 519164, 521807, 524223, 526613, 528489, 529500, 529983, 530411, 530756, 530727, 530229, 529160, 527127, 523861, 519784, 515739, 512326, 509821, 508448, 508168, 508271, 507776, 506359, 504584, 503211, 502659, 503127, 504787, 507631, 511404]
61225E11404M461N003N249N040M686M685N066N412N640O172P105P632O855N018
61211E89428L456L125L564L593K823K037K108K930L689L836L566L455L885M830
61197F36325O016P304Q862J0830J2758J3765J3474J2518J1750J1185J0069P872
61185G62728M874J912j53r22q66j021j934l060l712m250n575p560q945r012q499
61170G14005q474q978r356r419r564j0018j0539j0856j0987j1043j1023j0877
61158E92871j0687j0651j0738j0389q931o547m425l398k799j433N51J770J552
61145E26746O41l19j771m044o202p071o737o068n316m129k566j099K29J697L090
61130D87081L841L976M184M916O092P585R359J1080J2307J3148J4187J5727J7608
$$ y = [511404, 515865, 520868, 526117, 531157, 535843, 540528, 545594, 551006, 556646, 562818, 569923, 577555, 584410, 589428, 592884, 596009, 599573, 603166, 605989, 608026, 610134, 613064, 616753, 620589, 624155, 627610, 631495, 636325, 642341, 649645, 658507, 669337, 682095, 695860, 709334, 721852, 733602, 744787, 754856, 762728, 767602, 769514, 769361, 768439, 767573, 766552, 764618, 761558, 757846, 753596, 748021, 740461, 731516, 722504, 714005, 705531, 696553, 687197, 677778, 668214, 658196, 647657, 636801, 625814, 614771, 603748, 592871, 582184, 571533, 560795, 550406, 541475, 534928, 530503, 527105, 524306, 522873, 523424, 525194, 526746, 527387, 527068, 525297, 521253, 515051, 507980, 501243, 495175, 489859, 485730, 483164, 482065, 482294, 483991, 487081, 490922, 494898, 499082, 503998, 510090, 517675, 527034, 538114, 550421, 563569, 577756, 593483, 611091]
61117F11091J9558K1165K1765K1178K0436K0789K1981K2491K1609K0257J9379
61106H41699J8619J7170J5040J2739J0342P678M963K437k37l511p101j0299j2967
61093H96572j5519j7980j9776k0590k0856k1115k1286k0936k0020j8985j8193
61082F81316j7503j6571j5353j4108j2911j1557j0014q653p775p126o193m815
61070E48737l195j568j48P50J066J252J779K522L093L544M178M865N297N760O847
61055E84779Q402R590J0080J0449J1203J2296J3710J5630J7722J9117J9622K0150
61043G52750K1476K3206K4548K5462K6442K7635K8742K9537L0165L1045L2569
61032A053577L4596L6457L7859L9321M0884M1162L9159L6623L6560L9492M3370
$$ y = [611091, 630649, 651814, 673579, 694757, 715193, 735982, 757963, 780454, 802063, 822320, 841699, 860318, 877488, 892528, 905267, 915609, 923287, 928250, 930687, 930450, 926939, 919838, 909539, 896572, 881053, 863073, 843297, 822707, 801851, 780736, 759450, 738514, 718494, 699509, 681316, 663813, 647242, 631889, 617781, 604870, 593313, 583299, 574646, 566871, 559745, 553552, 548737, 545542, 543974, 543826, 544576, 545642, 546894, 548673, 551195, 554288, 557832, 562010, 566875, 572172, 577932, 584779, 593181, 602771, 612851, 623300, 634503, 646799, 660509, 676139, 693861, 712978, 732600, 752750, 774226, 797432, 821980, 847442, 873884, 901519, 930261, 959798, 989963, 1021008, 1053577, 1088173, 1124630, 1162489, 1201810, 1242694, 1283856, 1323015, 1359638, 1396198, 1435690, 1479060]
61021A479060M7396N3285O1784P0702P7971Q4354R1539J00144J11858J30726J59373
61010B468192J95994K38079K86685L43928M09793M86681N84199P13546Q81466
61001F608563J098309J381810J722327K027855K129146J887088J320472O19164
60993A8794734J7823l43680m45403l19349j1680L76257O58256O39784K55884l70700
60983A9251926j015848j498532j755378j814305j734077j571198j373434j175253
60975G313901r93085q30619o89142n70275m72319l90615l22323k67384k24886
60966B553253j91815j65636j45349j29589j16114j03782r3084q4192p6095o8013
60956A379584o0204n2966m6104l9837l5043l2299l1384l1701l2358l2107l0266
$$ y = [1479060, 1526456, 1579741, 1641525, 1712227, 1790198, 1874552, 1966091, 2066235, 2178093, 2308819, 2468192, 2664186, 2902265, 3188950, 3532878, 3942671, 4429352, 5013551, 5727097, 6608563, 7706872, 9088682, 10811009, 12838864, 14968010, 16855098, 18175570, 18794734, 18812557, 18468877, 18023474, 17704125, 17692445, 18068702, 18726958, 19366742, 19622626, 19251926, 18236078, 16737546, 14982168, 13167863, 11433786, 9862588, 8489154, 7313901, 6320816, 5490197, 4801055, 4230780, 3758461, 3367846, 3045523, 2778139, 2553253, 2361438, 2195802, 2050453, 1920864, 1804750, 1700968, 1607884, 1523692, 1447597, 1379584, 1319380, 1266414, 1220310, 1180473, 1145430, 1113131, 1081747, 1050046, 1017688, 985581, 955315]
60945I55315k7582k5286k3546k1858k0462k0086k0417k0239j9134j7891j7228
60934G21586j7101j7239j7340j6871j5634j4353j3692j3098j1778j0310r836r999
60922E54335r331p579o018n390n165m986n129n293m565l051k006j827j459k77
60908D92259Q90J306J433J752J869J615J693K384K799K343J735J653J413J20j791
60893E13473l178l662l599l253k850k806l149l403l512m124n313o032n630m939
60879D58023m994n554n860n973o291o493o110n521n299n097m279l178k625k561
60865C88188k159j085K13J291J975K097J749J506J742K060J945J619J501J389
60851D04031R48N77Q78J588J906J608J115P30N15N86Q11N89m11j645k466k992
$$ y = [955315, 927733, 902447, 878901, 857043, 836581, 816495, 796078, 775839, 756705, 738814, 721586, 704485, 687246, 669906, 653035, 637401, 623048, 609356, 596258, 584480, 574170, 564334, 554335, 545004, 537425, 531407, 526017, 520852, 515866, 510737, 505444, 500879, 497828, 495822, 493995, 492536, 492259, 493149, 494455, 495888, 497640, 499509, 501124, 502817, 505201, 508000, 510343, 512078, 513731, 515144, 515264, 513473, 510295, 506633, 503034, 499781, 496931, 494125, 490976, 487573, 484061, 479937, 474624, 468592, 462962, 458023, 453029, 447475, 441615, 435642, 429351, 422858, 416748, 411227, 405928, 400831, 396552, 393374, 390749, 388188, 386029, 384944, 385157, 386448, 388423, 390520, 392269, 393775, 395517, 397577, 399522, 401141, 402642, 404031, 404979, 405556, 406434, 408022, 409928, 411536, 412651, 413381, 413896, 414482, 415293, 415882, 415471, 413826, 411360, 408368]
60835D08368l477l503k718j817j719k172k235j758j282q08P6J047J254O34l8m53
60819C89399j003j744k208k330k570k965l039k731k534k569k481k350k744l622
60805C54509m131l753k868k042j492j428j963k536k296j351p59j028j524j614
60791C25724j441j174n54K58L30q01k225k758k275j390m11N16Q82L33n18o63O6
60774C13899R70J556J925K197K270K284K698L622M462M525L762K716J872J345
60760C50103J059R59R07O56J29l92o31p68j164j671j720j155n35l19k73k6L02
60743C45461M68N54N43q9j660l484m607n013n351n702n475m533l510k909k616
60728C02077k427k361k313k001j416q31l57pr6q37j539j130L44J543J422L18q04
$$ y = [408368, 404891, 401388, 398670, 396853, 395134, 392962, 390727, 388969, 387687, 386879, 386955, 388002, 389256, 389890, 389852, 389399, 388396, 386652, 384444, 382114, 379544, 376579, 373540, 370809, 368275, 365706, 363225, 360875, 358131, 354509, 350378, 346625, 343757, 341715, 340223, 338795, 336832, 334296, 332000, 330649, 329890, 328862, 327338, 325724, 324283, 323109, 322555, 322813, 323143, 322342, 320117, 317359, 315084, 313694, 313283, 313799, 314681, 315014, 314496, 313833, 313899, 314869, 316425, 318350, 320547, 322817, 325101, 327799, 331421, 335883, 340408, 344170, 346886, 348758, 350103, 351162, 352121, 353028, 353684, 353813, 353421, 352790, 352022, 350858, 349187, 347467, 346312, 345777, 345458, 345185, 345159, 345461, 345929, 346483, 347026, 346937, 345277, 341793, 337186, 332173, 326822, 321120, 315645, 311112, 307602, 304693, 302077, 299650, 297289, 294976, 292975, 291559, 290728, 290371, 290364, 290268, 289431, 287892, 286762, 287106, 288649, 290071, 290389, 289585]
60711B89585j401j311m69P76J647J777J706K038K569K599J900R53L97M74R05J193
60695C05338J191J313J891K579K878K951L261L584L321K715K661L231L420K730
60681C43064J908J610J420Q60M18O80J259J483J461J569J446N76o15j294j594
60666C54251k387l733m675m628m088l726l514l095k416j670r97m89j82Q0N31J164
60650C20426J813K500L341M050M062L264K198J286K73j226k861l738l522k855
60636C29011k508k448k089j308o74o60j063j421j525j212k38J135J928J573R04
60621C19405J093J861J828O31m57l96K99O69P01P47M91m11j248j019qM81Km80
60603C24189j19O91J085Q83M80P6l64o17l04M98J181J298J064R24Q27L11o77j488
$$ y = [289585, 288184, 286873, 286404, 287180, 288827, 290604, 292310, 294348, 296917, 299516, 301416, 302369, 302766, 303240, 304145, 305338, 306529, 307842, 309733, 312312, 315190, 318141, 321402, 324986, 328307, 331022, 333683, 336914, 340334, 343064, 344972, 346582, 348002, 348862, 349280, 349960, 351219, 352702, 354163, 355732, 357178, 357754, 357139, 355845, 354251, 351864, 348131, 343456, 338828, 334740, 331014, 327500, 324405, 321989, 320319, 319322, 318833, 318651, 318731, 319262, 320426, 322239, 324739, 328080, 332130, 336192, 339456, 341654, 342940, 343213, 341987, 339126, 335388, 331866, 329011, 326503, 324055, 321966, 320658, 319984, 319324, 318261, 316840, 315315, 314103, 313865, 315000, 316928, 318501, 319405, 320498, 322359, 324187, 324818, 324361, 323965, 324264, 324933, 325634, 326381, 326872, 326461, 325213, 324194, 324186, 324667, 324669, 324189, 324070, 324761, 325846, 326729, 327209, 327285, 326921, 326304, 326000, 326498, 327679, 328977, 330041, 330965, 331792, 332103, 331426, 329938]
60585C29938j538j031n51k08L48J181J912K289K436K466K386K429K930L780M484
60570C53251N004N916P470R045R931J0142J0049R592Q397O394L933J446p33k408
60556D37429l597m410m829m845m756m734m213k507j48J361J539J649K807M381
60542D15127N209N533O454Q086R586J0812J2478J4524J5616J4770J2574J0207
60530E40976P978N369K081j478m495o280o700o368o164o401o666o463n750m723
60516D94916l468k025o49K28K97l13r32p33M93K102L344M293N674P883J0598J3393
60500E35101J6311J9616K3260K6848K9998L2635L4847L6442L6724L5001L1509
60489H58292K7445K3747J9957J4811P889K27o838j3024j9026k5317l1340l5945
$$ y = [329938, 328400, 327369, 326818, 326610, 326958, 328139, 330051, 332340, 334776, 337242, 339628, 342057, 344987, 348767, 353251, 358255, 364171, 371641, 380686, 390617, 400759, 410808, 420400, 428797, 435191, 439124, 440570, 439837, 437429, 433832, 429422, 424593, 419748, 414992, 410258, 406045, 403538, 403390, 404751, 406290, 407939, 410746, 415127, 420336, 425869, 432323, 440409, 449995, 460807, 473285, 487809, 503425, 518195, 530769, 540976, 548954, 554323, 556404, 554926, 550431, 544151, 537451, 531083, 524919, 518518, 511852, 505389, 499639, 494916, 491448, 489423, 488774, 489002, 489299, 488986, 488054, 487321, 487814, 489916, 493260, 497553, 503227, 511110, 521708, 535101, 551412, 571028, 594288, 621136, 651134, 683769, 718616, 755058, 791782, 826783, 858292, 885737, 909484, 929441, 944252, 952141, 952368, 945530, 932506, 913480, 888163, 856823, 820878]
60477H20878l8401l8878l7989l6128l3479l0460k7646k5187k2706j9982j7355
60466D92667j5221j3456j1760j0268r314q772q096p027n889n110m713m392l853
60453C84796l028k106j419j181j307j534j713j966k446k982k957j879j85Q72N64
60438C61529l66o72k81k28r27j485j132l53m6j82j24K09K99m9m67o56o59n81m16
60419C53413j77J39O59J394K064K410K502K496K340J996J673J550J571J711K064
60404C77805K415K242J521J055J479K399K934K774K162J337N79M03J020J880K319
60389D04324K357K337K186J707J190J054J206J445K078L289M284M068K865J865
60375D36255J674J877K060K300K589K645K467K397K512K498K162J554P17p4j45
$$ y = [820878, 782477, 743599, 705610, 669482, 636003, 605543, 577897, 552710, 530004, 510022, 492667, 477446, 463990, 452230, 441962, 432648, 423876, 415780, 408753, 402864, 397754, 393041, 388649, 384796, 381768, 379662, 378243, 377062, 375755, 374221, 372508, 370542, 368096, 365114, 362157, 360278, 360093, 360965, 361529, 361163, 360491, 360210, 359982, 359055, 357570, 356438, 356085, 356039, 355857, 355733, 355942, 356241, 356192, 355725, 355069, 354410, 353829, 353413, 353236, 353375, 354034, 355428, 357492, 359902, 362404, 364900, 367240, 369236, 370909, 372459, 374030, 375741, 377805, 380220, 382462, 383983, 385038, 386517, 388916, 391850, 394624, 396786, 398123, 398702, 399105, 400125, 402005, 404324, 406681, 409018, 411204, 412911, 414101, 415155, 416361, 417806, 419884, 423173, 427457, 431525, 434390, 436255, 437929, 439806, 441866, 444166, 446755, 449400, 451867, 454264, 456776, 459274, 461436, 462990, 463707, 463633, 463488]
60360D63488Q29K171L111L958N398P030P913Q366R672J1841J3218J2789J1425
60347E61209J0085Q154M669J87l746o411q195r464j0112j0061r484q550p469o566
60333E04246n946n273m231l001k014j553j778k757m101m999m938m183l280k457
60319D53735j737j141n28M07J582K506L094M082O122Q913J1647J3944J5894J7427
60305E35947J8341J8728J8847J8480J6885J3499Q533K749l198r073j4662j9154
60293F05922k1365k0888j8758j6536j4826j3171j1207r165p267n411l669k475
60281D61184k034k052k265k680l095l088k693k525k868l312l561l897m385m353
60267D18376l344k035j487j829k274k184j536o12K05N24L46K13N30R89J060P78
$$ y = [463488, 464317, 466488, 469599, 473557, 478955, 485985, 493898, 502264, 511936, 523777, 536995, 549784, 561209, 571294, 579448, 584117, 584304, 580558, 574147, 565952, 556488, 546376, 536315, 526831, 518281, 510812, 504246, 498300, 493027, 488796, 485795, 483781, 482228, 480450, 477693, 473592, 468593, 463655, 459472, 456192, 453735, 451998, 450857, 450329, 450736, 452318, 454824, 457918, 462000, 468122, 477035, 488682, 502626, 518520, 535947, 554288, 573016, 591863, 610343, 627228, 640727, 649260, 652009, 648811, 639738, 625076, 605922, 584557, 563669, 544911, 528375, 513549, 500378, 489171, 480006, 472739, 467328, 463659, 461184, 459150, 457098, 454833, 452153, 449058, 445970, 443277, 440752, 437884, 434572, 431011, 427114, 422729, 418376, 415032, 412997, 411510, 409681, 407407, 405223, 403687, 403075, 403280, 403804, 404150, 404363, 404893, 405882, 406942, 407720]
60251D07720N85O03O53P65J136J631J837J646J404J415J562J488R58O2p99j189
60235D21477j035o42k97n1J18K17M01Q52J416J745J882K242K777K814K029J138
60219D37083J084J916K996L904M667N310N830O439P326Q203Q565Q382Q095P960
60205E17760P712P047O084N236M771M562M268L720L104K699K491K241J835J294
60191E74824N63m07j329j816j971k309k968l492l528l326l304l529l902m435n105
60176E33966n682n972n862n189l893k438j520j235j113j040j463k387k950k479
60162D90743j344k99M43R27R60N08J22K93P83J130J364J632J647J192P14O62O46
60145E02123J54l34R8J324K262K409K417K940L753M308M510M591M696M848M979
$$ y = [407720, 408305, 408908, 409561, 410326, 411462, 413093, 414930, 416576, 417980, 419395, 420957, 422445, 423403, 423465, 422666, 421477, 420442, 419800, 419503, 419452, 419570, 419787, 420188, 421040, 422456, 424201, 426083, 428325, 431102, 433916, 435945, 437083, 438167, 440083, 443079, 446983, 451650, 456960, 462790, 469229, 476555, 484758, 493323, 501705, 509800, 517760, 525472, 532519, 538603, 543839, 548610, 553172, 557440, 561160, 564264, 566963, 569454, 571695, 573530, 574824, 575387, 574980, 573651, 571835, 569864, 567555, 564587, 561095, 557567, 554241, 550937, 547408, 543506, 539071, 533966, 528284, 522312, 516450, 511261, 507368, 504930, 503410, 502175, 501062, 500022, 498559, 496172, 493222, 490743, 489399, 489100, 489543, 490470, 491430, 491938, 492060, 492353, 493136, 494266, 495630, 497262, 498909, 500101, 500815, 501477, 502123, 502277, 501943, 502041, 503365, 505627, 508036, 510453, 513393, 517146, 521454, 525964, 530555, 535251, 540099, 545078]
60130E45078M803L987K634J355O64N46O48P11P26Q29J106J475J802K130K627L178
60114E74299L295K609J324N1o81p24m38n16j309k297k699k631l017m126n043m938
60098E53159m167l497k987k306j593j146o99J95J318K039K131J763J052K96J40
60083E45698P52J218P12j73k61K76P1j431l278m470n092n624o130o483o624o266
60067E02895n139l799l390m131m898m781m280m286m580m235l132k107j699j609
60053D50829j504j564j839j643k62J972L870M739N014N326N524N155M572M597
60039D84786N188N267M228K831K062J876J586J005L71l56j372k399k997l341l982
60024D94753m909n509n461n068m780m883n582o785p825q011p423o658n948n125
$$ y = [545078, 549881, 553868, 556502, 557857, 558521, 559067, 559715, 560426, 561152, 561981, 563087, 564562, 566364, 568494, 571121, 574299, 577594, 580203, 581527, 581578, 580897, 580173, 579735, 579219, 577910, 575613, 572914, 570283, 567266, 563140, 558097, 553159, 548992, 545495, 542508, 540202, 538609, 537463, 536764, 536959, 538277, 540316, 542447, 544210, 545262, 545558, 545698, 546450, 547668, 548380, 548207, 547946, 548222, 548293, 546862, 543584, 539114, 534022, 528398, 522268, 515785, 509161, 502895, 497756, 493957, 490567, 486436, 481538, 476757, 472477, 468191, 463611, 459376, 456244, 454137, 452438, 450829, 449325, 447761, 445922, 444279, 444017, 445989, 449859, 454598, 459612, 464938, 470462, 475617, 480189, 484786, 489974, 495241, 499469, 502300, 504362, 506238, 507824, 508829, 509200, 508844, 507472, 505073, 502076, 498735, 494753, 489844, 484335, 478874, 473806, 469026, 464143, 458561, 451776, 443951, 435940, 428517, 421859, 415911, 410786]
60010D10786m255l620l123k467j916k059k673k687j586j86M32J65k76l33O3P26
59994C86991J389J807J977K124K388K631K692K598K493K522K769L116L224K853
59980D21574K105J187J24j051k067k767l425m266m907m799m031l220k695k313
59966C89449j909j386n46O16J576J798J461J156J039R24R28J201J280O33k70m04
59950C97546K04M21k23p23n3J394K366K176J086j54q30p40m56o74j248j394r60
59933C97738o83r37j078m69N94J495K189K877L348L351L205L448M131M873N338
59918D29420N254M369K871J452N66j19r87j639j396l63O36J127J382J743K125
59903D46441K329K375K293J931J293Q84J288K363L211L193K734K792L568M277
$$ y = [410786, 406531, 402911, 399788, 397321, 395405, 393346, 390673, 387986, 386400, 386214, 386646, 386811, 386535, 386202, 386265, 386991, 388380, 390187, 392164, 394288, 396676, 399307, 401999, 404597, 407090, 409612, 412381, 415497, 418721, 421574, 423679, 424866, 424990, 423939, 421872, 419105, 415680, 411414, 406507, 401708, 397677, 394457, 391762, 389449, 387540, 386154, 385608, 386224, 387800, 389598, 391059, 392215, 393254, 394178, 395106, 396307, 397587, 398220, 397950, 397546, 397750, 398171, 397948, 397225, 397172, 398566, 400932, 403108, 404194, 404040, 403210, 402470, 402014, 401340, 400092, 398698, 397738, 397055, 396118, 395040, 394571, 395165, 396660, 398849, 401726, 405074, 408425, 411630, 415078, 419209, 424082, 429420, 434674, 439043, 441914, 443366, 443932, 443813, 442826, 441187, 439791, 439428, 440064, 441191, 442573, 444316, 446441, 448770, 451145, 453438, 455369, 456662, 457546, 458834, 461197, 464408, 467601, 470335, 473127, 476695, 480972]
59889D80972M270L832L645L904M370M834N037M577L479K544K467K920L152L065
59875E33068L009K805J978P69j06o78j654l097m199m566m666m654l929k330q30
59860E10920l26n15o05m83m21j79P47K329M046N599P084Q622J0019J0666R701
59845E67204O778K853k87j522j087J90J622K488K062L82j674l516n394p372q570
59830E54157q205o792n438m404l238k021j507j988k858l417l512l293k849k353
59816E02282k173k496k987l115k800k578k939l586l629k686j476r85j338j836
59802D67658j881j356l98O03R16J53r96j416r77n67o74q24n56j20O2l4k84o12
59784D58697p32l80O6j06q64j450j597j795k175k153j521q47l77L98J558K225
$$ y = [480972, 485242, 489074, 492719, 496623, 500993, 505827, 510864, 515441, 518920, 521464, 523931, 526851, 530003, 533068, 536077, 538882, 540860, 541629, 541523, 540845, 539191, 536094, 531895, 527329, 522663, 518009, 514080, 511750, 510920, 510594, 510079, 509474, 508991, 508570, 508391, 509138, 511467, 515513, 521112, 528196, 536818, 546837, 557503, 567204, 573982, 576835, 576548, 575026, 573939, 574129, 575751, 578239, 580301, 580683, 579009, 575493, 570099, 562727, 554157, 545952, 539160, 533722, 529318, 526080, 524059, 522552, 520564, 517706, 514289, 510777, 507484, 504635, 502282, 500109, 497613, 494626, 491511, 488711, 486133, 483194, 479608, 475979, 473293, 471817, 470832, 469494, 467658, 465777, 464421, 464023, 464626, 465542, 465695, 464699, 463283, 462306, 461739, 461065, 460241, 459685, 459565, 459627, 459593, 459309, 458697, 457965, 457585, 457651, 457545, 456681, 455231, 453634, 451839, 449664, 447511, 445990, 445143, 444766, 445164, 446722, 448947]
59768D48947J952J597J984K593K538K036J929K376K951L506M077M419M493M881
59754D90279N894O789O622N528M415L772L603L992M914N808O096N875N483M869
59740E63939M027L452L427L364K668J696J066N78j88p51l52O13R55L88j54MM30
59723E85162L23n08j520j892j266l16k47j297k355k494k195k288k514k179j532
59708E62882j328j423j061k96J27J02K73Q16J213J261J317J520J738K191L182
59693E72514M163M085K767J075k70j253j957k310k514k866l052k479j356o27p86
59678E65134j538k613m047n570o605p011p053o678n675m625m591n594o279n537
59664D91718l727k006j095r56j097q73N5J356K427L093L488L502L078K760L137
$$ y = [448947, 450899, 452496, 454480, 457073, 459611, 461647, 463576, 465952, 468903, 472409, 476486, 480905, 485398, 490279, 496173, 502962, 509584, 515112, 519527, 523299, 526902, 530894, 535808, 541616, 547712, 553587, 559070, 563939, 567966, 571418, 574845, 578209, 580877, 582573, 583639, 584217, 584029, 583278, 582926, 583539, 584494, 584882, 584728, 584732, 585162, 585485, 584977, 583457, 581565, 580299, 579983, 579736, 578439, 576084, 573590, 571395, 569107, 566593, 564414, 562882, 561554, 560131, 559070, 558774, 558901, 559003, 559276, 560092, 561305, 562566, 563883, 565403, 567141, 569332, 572514, 576677, 580762, 583529, 584604, 584334, 583081, 581124, 578814, 576300, 573434, 570382, 567903, 566547, 565920, 565134, 563596, 560983, 556936, 551366, 544761, 537750, 530697, 524019, 518344, 513719, 509128, 503534, 497255, 491718, 487991, 485985, 484890, 483934, 482837, 481964, 482019, 483375, 485802, 488895, 492383, 495885, 498963, 501723, 504860]
59649E04860L771L589K313P09n63j474k100k499l069m073m826m426l304k801l157
59634D82950l151k120r91p48j029j039q51j022j606k335l147l881m004l253k129
59619D51644j285q87r29j602k798l798l902l080j680k7J424K167K252K359K816
59604D42674L116K732J904J187P36M77M69O75P70N62K84K46M44P90J238J529J255
59587D61088L70p43j774k581k836k268j392j182j821k502k679k719k973l072k606
59572D30310j819j079l21N14J042R37M16j11l93k07M64J000P05J8R6R61J247L25
59554D34105o28n17k2j92n18K00J759K909L336L785M485M917N136O008Q015J1028
59538D83806J5174K0308K4229K3208J5671M606m865r917j1273j0806r369p140
$$ y = [504860, 508631, 512220, 514533, 515242, 514679, 513205, 511105, 508606, 505537, 501464, 496638, 492212, 488908, 486107, 482950, 479799, 477679, 476688, 475940, 474911, 473872, 473021, 471999, 470393, 468058, 464911, 461030, 457026, 453773, 451644, 450359, 449472, 448543, 446941, 444143, 440345, 436443, 433363, 431683, 431656, 433080, 435247, 437499, 439858, 442674, 445790, 448522, 450426, 451613, 452349, 452826, 453295, 453970, 454740, 455302, 455586, 455832, 456276, 457066, 458304, 459833, 461088, 461458, 460715, 458941, 456360, 453524, 451256, 449864, 448682, 446861, 444359, 441680, 438961, 435988, 432916, 430310, 428491, 427412, 427091, 427605, 428647, 429584, 430000, 429889, 429496, 429289, 429753, 430753, 431458, 431476, 431572, 432533, 433780, 434105, 433477, 432960, 432938, 432746, 432228, 432428, 434187, 437096, 440432, 444217, 448702, 453619, 458755, 464763, 472778, 483806, 498980, 519288, 543517, 566725, 582396, 587002, 582137, 572220, 560947, 550141, 540772, 533632]
59526E33632m702k719j102O95K598L835L953L278K269J005l82j464k196l240m953
59511E30507o520o909o370o082o502p018p116o889o353n299m093l563l787l867
59497D50139l291k576k186j778j023k72K24Q54J764K285K030J698J993K473K433
59482D54767K237K696L693M502N046N827O841P607P981Q046P434N758L508J666
59468E27609M83l85q11l39O38R75L42k32K91J815L558M943N789O260O840P811
59452E65587Q657Q586P739P175P464Q029Q053P305N691K848j171n370q527j0136
59438F11930j0299r225p401n765n053n092n200n077m852m542l979l141k085o47
59424E39572J308L480N450P278R324J1605J3870J6087J8360K0658K3462K8102
$$ y = [533632, 528930, 526211, 525109, 525804, 528402, 532237, 536190, 539468, 541737, 542742, 542360, 540896, 538700, 535460, 530507, 523987, 517078, 510708, 504626, 498124, 491106, 483990, 477101, 470748, 465449, 461356, 457793, 454006, 450139, 446848, 444272, 442086, 440308, 439285, 439013, 439237, 440091, 441855, 444140, 446170, 447868, 449861, 452334, 454767, 457004, 459700, 463393, 467895, 472941, 478768, 485609, 493216, 501197, 509243, 516677, 522435, 525943, 527609, 528092, 527707, 526896, 526557, 527195, 528170, 528512, 528280, 528571, 530386, 533944, 538887, 544676, 550936, 557776, 565587, 574244, 582830, 590569, 597744, 605208, 613237, 621290, 628595, 634286, 637134, 635963, 630593, 622066, 611930, 601631, 592406, 585005, 579240, 574187, 569095, 563895, 558818, 553966, 549424, 545445, 542304, 540219, 539572, 540880, 544360, 549810, 557088, 566412, 578017, 591887, 607974, 626334, 646992, 670454, 698556]
59412F98556L4744L9748L7100K4216N518j1115k0937k4379k3816k0675j5570q807
59400G14583k6J0613J9863K2073J4361J68j3763k3172k7834k8856k6949k3135
59388F37926j8989j5363j2103r170o926n207l345j374p0L80O67J129J395J464
59374E70414J936K761L014K359J677J676J950J956J944K191K297J948J565J552
59360E99240J694J864K463L566M486M823N152O009P104Q192R659J1460J2594J2615
59346F90921J2709J3987J5608J5989J5107J4100J3009J0716P095L622J443Pj831
59333H12482m293o770q831j0573j2265j3881j4897j4631j3073j1190j0069r919
59321F82090j0196j0394j0233r467q138o863o343o601p091p292o921n866m390
$$ y = [698556, 733300, 773048, 810148, 834364, 839882, 828767, 807830, 783451, 759635, 738960, 723390, 714583, 714557, 725170, 745033, 767106, 781467, 781635, 767872, 744700, 716866, 688010, 661061, 637926, 618937, 603574, 591471, 582301, 575375, 570168, 566823, 565449, 565379, 565759, 566426, 567555, 568950, 570414, 572350, 575111, 578125, 580484, 582161, 583837, 585787, 587743, 589687, 591878, 594175, 596123, 597688, 599240, 600934, 602798, 605261, 608827, 613313, 618136, 623288, 629297, 636401, 644593, 654252, 665712, 678306, 690921, 703630, 717617, 733225, 749214, 764321, 778421, 791430, 802146, 809241, 812863, 814306, 814313, 812482, 808189, 801419, 792588, 782015, 769750, 755869, 740972, 726341, 713268, 702078, 692009, 682090, 671894, 661500, 651267, 641800, 633662, 626799, 620456, 613855, 606764, 599472, 592551, 586685, 582295]
59308E82295l048j968n66J600M160O682R349J2100J3503J1701O460m44o876j1702
59294F23246j4655j5802j5517j4408j2905j1099r051o999n237l947l004j946l60
59281E08316J449K653L047L451M614O203P458Q300R169J0181J1172J2262J3551
59268F01826J4446J4115J2527J0479Q571O792N012L285J634J0j529k892m220n664
59254F64392p038p961q208p738o590n056l724l017k849k805k386j150Q40K620
59240F09330L195K943L289M675N918O059N691N637N480M546L374K823K483J328
59226F66771n05k089l395n152p138q182q005p754q296r099r235q629p845p206
59212E74241o522n444m022l048l428m844n655m709k776j405j022j003r87r22l59
$$ y = [582295, 579247, 577279, 576713, 578313, 582473, 589155, 598504, 610604, 624107, 635808, 642268, 641824, 634948, 623246, 608591, 592789, 577272, 562864, 549959, 538860, 529809, 522810, 517573, 513626, 510622, 508676, 508316, 509765, 512418, 515465, 518916, 523530, 529733, 537191, 545491, 554660, 564841, 576013, 588275, 601826, 616272, 630387, 642914, 653393, 661964, 668756, 673768, 677053, 678687, 678697, 677168, 674276, 670056, 664392, 657354, 649393, 641185, 633447, 626857, 621801, 618077, 615060, 612211, 609406, 607020, 605870, 606710, 609330, 612525, 615468, 618757, 623432, 629350, 635409, 641100, 646737, 652217, 656763, 660137, 662960, 665443, 666771, 666266, 664177, 660782, 655630, 648492, 640310, 632305, 624551, 616255, 607156, 597921, 589292, 581447, 574241, 567719, 562275, 558253, 555205, 551777, 546933, 541278, 536569, 533793, 532388, 531366, 530363, 529376, 528454, 528095]
59197E28095R76K175K040Q69Q4K56P46J152J733K374K591K683L475M649M854L807
59181E62559K885K998L341L009K602L167M444N267N169M666M318M239M382M703
59167F17749N100N418N403M666L122J429M88L99L52l43j701l457n318o762p282
59152F19263p076o888p080p375p570p766p914p818p653p753p843p285o198n447
59138E17597n341n205m512l628l059k770k614k699k846k365r27Q12J964K441K775
59123D89623L280L787M088M272M636N272N856O096O372P413R037R968R480Q547
59109E77727Q458Q927Q717P625O530N680M426K739J577J377J327O50m17j303j953
59094F32087k499k856l009l126l126k735k055j504j125o87l62n54j137j687k368
$$ y = [528095, 529071, 531246, 533286, 534155, 534239, 534495, 535241, 536393, 538126, 540500, 543091, 545774, 549249, 553898, 558752, 562559, 565444, 568442, 571783, 574792, 577394, 580561, 585005, 590272, 595441, 600107, 604425, 608664, 613046, 617749, 622849, 628267, 633670, 638336, 641458, 642887, 643375, 643774, 644126, 643783, 642082, 638625, 633307, 626545, 619263, 612187, 605299, 598219, 590844, 583274, 575508, 567594, 559776, 552123, 544370, 536527, 529242, 523044, 517597, 512256, 507051, 502539, 498911, 495852, 493082, 490468, 487769, 484923, 482558, 481631, 482443, 484407, 486848, 489623, 492903, 496690, 500778, 505050, 509686, 514958, 520814, 526910, 533282, 540695, 549732, 559700, 569180, 577727, 586185, 595112, 603829, 611454, 617984, 623664, 628090, 630829, 632406, 633783, 635110, 635760, 635343, 634040, 632087, 629588, 626732, 623723, 620597, 617471, 614736, 612681, 611177, 610052, 609365, 609003, 608449, 607312, 605625, 603257]
59079F03257l571m827n226m917m934n471n581m846m018l658l367k882k722l192
59065E44045l681l564k981k282j514q52o82r46j168j244j409j386o99J66K00m52
59049E21551o29j89k57j050j256k43P40O38K22M80Q11K14q05j029m55m2j04j84
59031E18413j9L32R90J948K771L274M030N406O754P374P680Q546R901J0853J0843
59016E99096R982Q576O923N281L622J738j95j676k638l438l896l341j848l89O61
59001F18458K015L905N302N417M861M453M054L412L090L374L384K401J216Q82
58987F66224R26J23j501k738k938k522k036j606j120l03J160L027M566N663P080
58972F74005R106J0851J1621J2011J2655J2914J1982J0530R917J0286J0602J0206
$$ y = [603257, 599686, 594859, 589633, 584716, 579782, 574311, 568730, 563884, 559866, 556208, 552841, 549959, 547237, 544045, 540364, 536800, 533819, 531537, 530023, 529171, 528489, 527543, 526375, 525131, 523722, 522336, 521637, 521803, 522003, 521551, 520922, 520733, 520476, 519426, 518170, 517927, 518667, 519305, 519527, 520007, 520818, 521032, 520227, 519198, 518743, 518701, 518597, 518413, 518394, 518726, 519716, 521664, 524435, 527709, 531739, 537145, 543899, 551273, 558953, 567499, 577400, 588253, 599096, 609078, 617654, 624577, 629858, 633480, 635218, 635023, 633347, 630709, 627271, 623375, 620034, 618186, 617797, 618458, 620473, 624378, 629680, 635097, 639958, 644411, 648465, 651877, 654967, 658341, 661725, 664126, 665342, 666224, 667150, 667273, 665772, 663034, 660096, 657574, 655538, 653932, 652812, 652509, 653669, 656696, 661262, 666925, 674005, 683111, 693962, 705583, 717594, 730249, 743163, 755145, 765675, 775592, 785878, 796480, 806686]
58960H06686R301Q121O608M696K237r64m536p504r449j1030j2771j4250j5096
58947G62049j5790j6570j6617j5406j3815j2747j1611r511p050n491m836m268
58935F28337l826m115m750m647l658k589j854j321j171j602k015j678r41o47o67
58920E92856l30J37k1n35m38K31L94k83q99o97J73J367K747L989M824N698P251
58903F16464R215J0667J1335J1752J2191J2364J2042J1180R707Q061P483Q693
58891G41154J0631J1747J2237J3638J6276J8633J9384J8805J7734J6334J4377
58880I10950J1877Q928N488J717j872m877p286r365j1440j3579j5179j5317j3927
58867H46118j2173j1113j0558r833q914q085p226o349o237p451r271j0543j1035
$$ y = [806686, 815987, 824108, 830716, 835412, 837649, 836685, 832149, 824645, 815196, 804166, 791395, 777145, 762049, 746259, 729689, 713072, 697666, 683851, 671104, 659493, 649982, 642932, 637441, 632605, 628337, 624511, 620396, 615646, 610999, 607341, 604752, 602898, 601577, 600406, 598804, 596789, 595111, 594170, 593523, 592856, 592526, 592663, 592642, 592107, 591669, 591900, 592294, 592011, 591112, 590415, 590588, 591955, 594702, 598691, 603515, 609213, 616464, 625679, 636346, 647681, 659433, 671624, 683988, 696030, 707210, 716917, 724978, 732461, 741154, 751785, 763532, 775769, 789407, 805683, 824316, 843700, 862505, 880239, 896573, 910950, 922827, 931755, 937243, 938960, 937088, 932211, 924925, 915560, 904120, 890541, 875362, 860045, 846118, 833945, 822832, 812274, 802441, 793527, 785442, 778216, 771867, 765630, 758179, 748908, 738365, 727330]
58854G27330j1145j0917j0432j0378j0989j1177r942q005o694n969n044m295m717
58841F17626n971o746o844p090p387o790n538n069n638n732m385k550j530j320
58827E45036j206q94m24K40J010J729K576L743M745M880M356M067M325M642M629
58812E83454M238L357K126J343J463J577N71j101k115k357k806l582l819l460
58798E78889l520m348n141n434n686o079o159n895n836n874n190l687k205j099
58784E12736J52J622K557K662K604K861L225L674M563N590N721M508K523L41j818
58769E53521l466m063m113m786o214p278p275o609n686m404l036k320k350k363
58755D89558j869j033R5J541K681K803K364K388K692K239J258J285K843M667N636
$$ y = [727330, 716185, 705268, 694836, 684458, 673469, 662292, 652350, 644345, 637651, 631682, 626638, 622343, 617626, 611655, 604909, 598065, 590975, 583588, 576798, 571260, 566191, 560553, 554821, 550436, 547886, 546356, 545036, 543830, 542936, 542512, 542752, 543762, 545491, 548067, 551810, 556555, 561435, 565791, 569858, 574183, 578825, 583454, 587692, 591049, 593175, 594518, 595981, 597558, 598129, 597028, 594913, 592556, 589750, 586168, 582349, 578889, 575369, 571021, 565880, 560446, 554760, 548681, 542522, 536627, 530791, 524917, 519727, 516040, 513835, 512736, 512888, 514510, 517067, 519729, 522333, 525194, 528419, 532093, 536656, 542246, 547967, 552475, 554998, 555339, 553521, 550055, 545992, 541879, 537093, 530879, 523601, 516326, 509717, 504031, 499627, 496591, 494271, 491921, 489558, 487689, 486656, 486751, 488292, 490973, 493776, 496140, 498528, 501220, 503459, 504717, 506002, 508845, 513512, 519148]
58740E19148N953O084O022O000O447O883O300M997M448N002N349M757M120M193
58726E95703M415M217L951L775L099J944J448K227L482M482N511O712P361P129
58712F55456O729O546N907M496L114K206R16j434m060n890p033q258r860j1720
58698F37115j3558j4740j4772j4275j4307j4534j3601j1514r923r431q596o488
58686D91376m445m008m689n037m686m073l313k521k246k539k539j832j139q78
58672D47431l04R69K018K179K304L313M712N749O908Q896J1068J2163J1745R965
58658E29116O782K628j052l149m140n047n876o118n961n951o011n810n532n419
58644D78460n076m068k687j540q51o10p64q05P5J891L615M368M151L280K031R79
$$ y = [519148, 525101, 531185, 537207, 543207, 549654, 556537, 562837, 567834, 572282, 577284, 582633, 587390, 591510, 595703, 600118, 604335, 608286, 612061, 615160, 617104, 618552, 620779, 624261, 628743, 634254, 640966, 648327, 655456, 662185, 668731, 674638, 679134, 682248, 684454, 685370, 683936, 679876, 673986, 666953, 658695, 648835, 637115, 623557, 608817, 594045, 579770, 565463, 550929, 537328, 525814, 515891, 506460, 497864, 491376, 486931, 482923, 478234, 473197, 468511, 464438, 461125, 458604, 456358, 453819, 451280, 449448, 448309, 447431, 447127, 448096, 450114, 452293, 454597, 457910, 462622, 468371, 475279, 484175, 495243, 507406, 519151, 529116, 535898, 538526, 537474, 534325, 530185, 525138, 519262, 513144, 507183, 501232, 495221, 489411, 483879, 478460, 473384, 469316, 466629, 465089, 464238, 463628, 462864, 462059, 462134, 464025, 467640, 472008, 476159, 479439, 481470, 482449]
58628D82449O74P36L76j78p7L77K9r52r90L49J632J984K317L388M501N067N656
58611E07338O478O498N199L596K491J358l6o17J62J137J293J190J358R44o36k296
58595E35457k965l167l569l435k038j80J140K256L623M579M751N301P114R073
58581E57940R719R372R085Q763P948P341P731Q465Q483Q003P786P740P649Q233
58567F74258J0069J2439J4478J6488J8883K1019K2323K3341K4418K4572K2996
58556H85284K0402J7574J3924Q896L523q41m155o733q005p601o464n567m767m078
58542I01392m579o790r653j2288j5130j8148j9918j9905j9648k0045j9631j7278
58530G18379j4455j2754j1219q508n739m645m581l941k971k702k542j502n30j027
$$ y = [482449, 483123, 483859, 484235, 484057, 483980, 484357, 484386, 483434, 482444, 482793, 484425, 486409, 488726, 492114, 496615, 501682, 507338, 513816, 520314, 525513, 529109, 531600, 532958, 532922, 532305, 532467, 533604, 534897, 536087, 537445, 538389, 537753, 535457, 532492, 529325, 525756, 522321, 520283, 520103, 521243, 523499, 527122, 531701, 536452, 541753, 548867, 557940, 567659, 577031, 586116, 594879, 602827, 610168, 617899, 626364, 634847, 642850, 650636, 658376, 666025, 674258, 684327, 696766, 711244, 727732, 746615, 767634, 789957, 813298, 837716, 862288, 885284, 905686, 923260, 937184, 946080, 949603, 948762, 944607, 937874, 929869, 922268, 915804, 910237, 905470, 901392, 896813, 890023, 880370, 868082, 852952, 834804, 814886, 794981, 775333, 755288, 735657, 718379, 703924, 691170, 679951, 671443, 665704, 661059, 656478, 652537, 649566, 646864, 644322, 642820, 642290, 641263]
58516F41263k226k486k069k239k734k480j806j632j594j076r25j905k822k355
58502F12914j422j379j457m27P30N36j28L44J172P27k15J96J393J494R19J662
58486F17059L610M764M777N290P018R100J1128J3407J5506J6779J7686J8649J8467
58473G63240J6045J2414Q913M774r02o367r322j0396j1473j2000j0234o977m515
58460G33200k804j65L079N107O080P666R708J0679J0823J1475J1827R807N719
58447H22201J810j307m596p629r058r469j0414j1216j0125p869o569n831l722
58434G36206q90K49n3P30K825M076M163M878O283O635O192P026Q886R253P734
58419H04193O413N619L427k60l162m712o706r273j0180q936p863q237q811q821
$$ y = [641263, 639037, 636551, 634482, 632243, 629509, 627029, 625223, 623591, 621997, 620921, 619996, 618091, 615269, 612914, 611492, 610113, 608656, 608229, 608959, 609495, 609367, 609711, 610883, 611610, 611395, 611591, 612984, 614478, 615397, 617059, 620669, 625433, 630210, 635500, 642518, 651618, 662746, 676153, 691659, 708438, 726124, 744773, 763240, 779285, 791699, 800612, 805386, 804484, 798117, 788795, 778399, 766926, 754926, 744692, 737715, 733200, 730396, 730231, 733310, 738417, 744497, 752163, 761871, 772550, 783373, 794848, 806675, 816482, 822201, 824011, 822704, 818108, 810479, 801421, 791952, 781538, 770322, 760197, 752328, 745759, 739928, 736206, 735316, 735565, 735512, 736242, 739067, 743143, 747306, 752184, 758467, 765102, 771294, 778320, 787206, 796459, 804193, 810606, 816225, 819652, 819392, 816230, 811518, 804812, 795539, 785359, 776423, 768560, 760323, 751512, 742691]
58405G42691r021r133p721n123l194j984l1K068K245J146J681M049N390M708M016
58390G31787M030L015O78q95j017j254j892j472l58o10j746q42K480N373O704
58375G43981Q274J0556J1614J1162J1215J1927J1222R339R060J0572J0975R767
58363H69664R869J2012J3235J2426J2225J3728J4339J2752J1176J0650Q981N419
58351A006476K725K386K294J179Q82K219L081K695L262N436O666O037O114Q067
58337A059519R597R661J0513J2979J4590J4534J5526J8411J9824J7771J4751J2913
58325A230589J0796P404M801M109L492K336K766M928N690M186L563N108N988N083
58311A300839N394Q146J0103R545R343J1305J3033J3209J4277J7023J8302J7118
$$ y = [742691, 733670, 724537, 716816, 711693, 708499, 706515, 706484, 708552, 710797, 711943, 713624, 717673, 723063, 727771, 731787, 735817, 738832, 739510, 738615, 737598, 736344, 734452, 732980, 732622, 732012, 730266, 729424, 731904, 737277, 743981, 752255, 762811, 774425, 785587, 796802, 808729, 819951, 829290, 838350, 848922, 859897, 869664, 879533, 891545, 904780, 917206, 929431, 943159, 957498, 970250, 981426, 992076, 1001057, 1006476, 1009201, 1011587, 1013881, 1015060, 1015942, 1018161, 1021242, 1023937, 1027199, 1032635, 1039301, 1045338, 1051452, 1059519, 1069116, 1078777, 1089290, 1102269, 1116859, 1131393, 1146919, 1165330, 1185154, 1202925, 1217676, 1230589, 1241385, 1248789, 1253590, 1257699, 1261191, 1263527, 1266293, 1271221, 1276911, 1281097, 1284660, 1289768, 1295756, 1300839, 1306233, 1314379, 1324482, 1334027, 1343370, 1354675, 1367708, 1380917, 1395194, 1412217, 1430519, 1447637]
58299A447637J7077J9752K1623K0670J9899K1094K1352J9321J8406K0222K1256
58288A668309J9743J9374K2300K5013K5119K5568K8166K9677K8537K8575L1694
58277A952075L3870L2752L2118L4200L5135L2843L1868L5158L8623L9234M0811
58266B338687M6159N1179N2636N4185N8734O2581O3081O4235O8495P1140O9109
58255C000221O7174O8914P0075O7627O6594P0767P5488P6858P9155Q5704R1714
58244C820291R3853R7425J06150J14635J18924J24418J34993J45025J50777J58404
58234E064895J71690J83705J90201J98800K14693K30299K40042K51795K71923
58225G018043K93101L09463L29230L58781L89406M14229M42683M83007N26777
$$ y = [1447637, 1464714, 1484466, 1506089, 1526759, 1546658, 1567752, 1589104, 1608425, 1626831, 1647053, 1668309, 1688052, 1707426, 1729726, 1754739, 1779858, 1805426, 1833592, 1863269, 1891806, 1920381, 1952075, 1985945, 2018697, 2050815, 2085015, 2120150, 2152993, 2184861, 2220019, 2258642, 2297876, 2338687, 2384846, 2436025, 2488661, 2542846, 2601580, 2664161, 2727242, 2791477, 2859972, 2931112, 3000221, 3067395, 3136309, 3206384, 3274011, 3340605, 3411372, 3486860, 3563718, 3642873, 3728577, 3820291, 3914144, 4011569, 4117719, 4232354, 4351278, 4475696, 4610689, 4755714, 4906491, 5064895, 5236585, 5420290, 5610491, 5809291, 6023984, 6254283, 6494325, 6746120, 7018043, 7311144, 7620607, 7949837, 8308618, 8698024, 9112253, 9554936, 10037943, 10564720]
58216A0564720N66962O14103O77292P47122Q16032Q96599R99963J116262J237496
58207A8236551J378173J551040J746750J963249K230285K578572L013763L549879
58199C6248262M232793N092915O110333P269578Q614190J0210726J2115992J4437101
58191A04331890J7364363K1081843K5710074L1326003L7683787M3472789M5941114
58184C26911863M1989287L0390429J3161448n388674k1110064l1816527l7367461
58177C16770301l8743452l7235410l4055169l0139108k6070454k2171681j8644051
58170A09710976j5597239j3028005j0872292r082115p622391o431588n440779
58163D1636567m616182l944787l396035k932551k541441k222038j956954j723923
$$ y = [10564720, 11131682, 11745785, 12423077, 13170199, 13986231, 14882830, 15882793, 16999055, 18236551, 19614724, 21165764, 22912514, 24875763, 27106048, 29684620, 32698383, 36248262, 40481055, 45573970, 51684303, 58953881, 67568071, 77778797, 89894789, 104331890, 121696253, 142778096, 168488170, 199814173, 237497960, 280970749, 326911863, 368901150, 399291579, 412453027, 407064353, 385954289, 354137762, 316770301, 278026849, 240791439, 206736270, 176597162, 150526708, 128355027, 109710976, 94113737, 81085732, 70213440, 61131325, 53508934, 47077346, 41636567, 37020385, 33075598, 29679563, 26747012, 24205571, 21983533, 20026579, 18302656]
58155A8302656j521765j357356j219637j091431r74343q77995p96092p15760o39828
58146I108449n78171n26514m74222m24400l86936l59529l33291l09353k93040
58137E422993k79186k59619k38170k22956k10882j94573j77416j66895j59773
58128C513523j48357j35263j27798j23650j15873j06562j02130j00185r4156q6194
58118B373355q2722q1674p6538o8988o5359o4377o0068n3491n0266m9647m6745
58107A673480m2632m1845m2799m0655l6846l6145l7254l5711l3094l3932l6396
58096A256171l5388l2149l1672l3173l2129k9237k8485k8657k5532k0404j7926
58085I41419j7627j5709j3167j3876j6674j7342j6449j7471j9232j8119j5657
$$ y = [18302656, 16780891, 15423535, 14203898, 13112467, 12138124, 11260129, 10464037, 9748277, 9108449, 8530278, 8003764, 7529542, 7105142, 6718206, 6358677, 6025386, 5716033, 5422993, 5143807, 4884188, 4646018, 4423062, 4212180, 4017607, 3840191, 3673296, 3513523, 3365166, 3229903, 3102105, 2978455, 2862582, 2756020, 2653890, 2553705, 2459549, 2373355, 2290633, 2208959, 2132421, 2063433, 1998074, 1933697, 1873629, 1820138, 1769872, 1720225, 1673480, 1630848, 1589003, 1546204, 1505549, 1468703, 1432558, 1395304, 1359593, 1326499, 1292567, 1256171, 1220783, 1188634, 1156962, 1123789, 1091660, 1062423, 1033938, 1005281, 979749, 959345, 941419, 923792, 908083, 894916, 881040, 864366, 847024, 830575, 813104, 793872, 775753, 760096]
58074G60096j5846j7097j4970j0971j0365j2716j2968j0690j0032j1377j1054
58063F22010q882q236q987p786n218n352q211r617q614q439j0000j0762j0190
58050E11716j0210j0280q028m645l786n249n482m041l774m933m945l872m308n982
58036D32181o003m425m043m928m621l482m260o586p371o525o801q184p951o206
58022C50795n757o608o067m259l949m885m074j830j705l955m814l042j605j934
58008B96311j937p92n56j715k046j013p16j402p38J479K482J448P50J343J375
57993B94273M17O47K626M091M055L946L844J825j882m369m775n415p110p634o027
57978B78512m370l906l263j881j384k204k471j531j075j662j631n65j89q65p87
$$ y = [760096, 744250, 727153, 712183, 701212, 690847, 678131, 665163, 654473, 644441, 633064, 622010, 613128, 604892, 595905, 588119, 582901, 577549, 569338, 559721, 551107, 542668, 532668, 521906, 511716, 501506, 491226, 483198, 478553, 474767, 469518, 464036, 459995, 456221, 451288, 446343, 442471, 438163, 432181, 426178, 421753, 417710, 412782, 408161, 404679, 400419, 393833, 386462, 379937, 373136, 364952, 357001, 350795, 345038, 338430, 332363, 328104, 324155, 319270, 315196, 313366, 311661, 307706, 302892, 299850, 298245, 296311, 294374, 293582, 293026, 291311, 289265, 288252, 287536, 286134, 285396, 286875, 289357, 290805, 291555, 292898, 294273, 294690, 295337, 297963, 302054, 306109, 310055, 313899, 315724, 313842, 309473, 304698, 299283, 292173, 284539, 278512, 274142, 270236, 266973, 265092, 263708, 261504, 259033, 257502, 256427, 254765, 253134, 252569, 252380, 251515, 250728]
57963B50728L04L78r21j311n7O95Mk73O67Q91n05j590j226j061k163k967k350
57946B39243j638j818j706n07N97R17J534K759L154K430K460M052N549N874O124
57931B69024O848O709N196L866L420K377J6k165l250m328n872o550o058o198p615
57916B55420q348p194n743n345m875l228j528r37n72O88K390L872N357O434N774
57901B42165L512J646J015K79j126j730q84n0J1N26J862K360J436R93K031K760
57885B56806J840O84O03M59p79j825j608j515k824m239m182l406l164k897j955
57870B31998j476k298k980k096o24J2L58J251J716Q68Q3Q73K241K509K266L058
57854B37759M505N124M961N108N492N220M347L480K456R92k52p47j189k124k685
$$ y = [250728, 251032, 251410, 250489, 249178, 249121, 249816, 249820, 249547, 250214, 251105, 250600, 249010, 247784, 246723, 244560, 241593, 239243, 237605, 235787, 234081, 233574, 234171, 235088, 236622, 239381, 242535, 244965, 247425, 251477, 257026, 262900, 269024, 275872, 282581, 287777, 291643, 295063, 297440, 297456, 295291, 292041, 287713, 281841, 275291, 269233, 263035, 255420, 247072, 239878, 234135, 228790, 223915, 220687, 219159, 218222, 217650, 218338, 220728, 224600, 229957, 236391, 242165, 245677, 247323, 248338, 248617, 247491, 245761, 244877, 244827, 244838, 245364, 247226, 249586, 251022, 252015, 254046, 256806, 258646, 259330, 259933, 260392, 259613, 257788, 256180, 254665, 251841, 247602, 243420, 240014, 236850, 233953, 231998, 230522, 228224, 225244, 223148, 222524, 222536, 222894, 224145, 225861, 226729, 226812, 227685, 229926, 232435, 234701, 237759, 242264, 247388, 252349, 257457, 262949, 268169, 272516, 275996, 278452, 279444, 279192, 278445, 277256, 275132, 272447]
57839B72447k184j677k310l358l539l145l171l413l150k741k925l323l137k510
57825B31864j990j423n72J15M38J135K488L418L019J931J019p4j890l867n301
57810B30310o473p682q250p621o396n343m394l530l300l651l508k455j478j202
57796A65027q55J37J070J358J483J698J412P01O77J508J900J476J599K829L719
57781A85739L354K926L425L948L799M041N302O194N669M867M834M498K893J234
57767B42723P26L01j217k728k889k692l546m552m220l321l413l961l510k442j993
57752B03266j783q06K08ko92l37O16O88J09J39N14J93k17O80K308K830K130J706
57734B11550J999K076J658J327J071O23P09J969L229L007K041K152L171L391K584
$$ y = [272447, 270263, 268586, 266276, 262918, 259379, 256234, 253063, 249650, 246500, 243759, 240834, 237511, 234374, 231864, 229874, 228451, 227879, 227994, 228432, 229567, 232055, 235473, 238492, 240423, 241442, 241368, 239478, 235611, 230310, 223837, 216155, 207905, 200284, 193888, 188545, 184151, 180621, 177321, 173670, 170162, 167707, 166229, 165027, 164172, 164309, 165379, 166737, 168220, 169918, 171330, 172031, 172708, 174216, 176116, 177592, 179191, 182020, 185739, 189093, 192019, 195444, 199392, 203191, 207232, 212534, 218728, 224397, 229264, 234098, 238596, 241489, 242723, 243449, 243750, 242533, 239805, 236916, 234224, 230678, 226126, 221906, 218585, 215172, 211211, 207701, 205259, 203266, 201483, 200677, 200885, 200883, 200191, 199854, 200470, 201158, 201267, 201406, 201920, 202113, 201896, 202576, 204884, 207714, 209844, 211550, 213549, 215625, 217283, 218610, 219681, 220304, 221013, 222982, 226211, 229218, 231259, 233411, 236582, 239973, 242557]
57719B42557K098K194J719M95k54j2L58K19k61j071k313l330l433l183l476l806
57703B28501l069j504j55R72K399L497L349K689K817L037J519j636m408n841o806
57688B25361p794q101p464o572n715m497l029j811n86J239L312N003O890R817
57674B06053J3074J5493J7897K2322K9134L7163M6225N6696O6184O9184O1191
57663F40616M2117J5800j1963l5141m9882n6359n7229n4372m8497m1165l4569
57652C09356k9125k3595j8011j4182j2721j1769r661o981n073m110l569l239k918
57639A64402k218j327r08q99n31K84P07L73j50l74k89K09R97J053m22k380l011
57622A55516k293j765j922j785j131j037j823k329j825r80m33k4J90k72j068j166
$$ y = [242557, 244655, 246849, 248568, 249063, 248809, 248797, 249155, 249374, 249113, 248042, 245729, 242399, 238966, 235783, 232307, 228501, 225432, 223928, 223773, 224745, 227144, 230641, 233990, 236679, 239496, 242533, 244052, 242416, 238008, 232167, 225361, 217567, 209466, 202002, 195430, 189715, 185218, 182189, 180378, 179792, 181031, 184343, 189346, 196236, 206053, 219127, 234620, 252517, 274839, 303973, 341136, 387361, 444057, 510241, 579425, 640616, 682733, 698533, 686570, 651429, 601547, 545188, 487959, 433587, 385090, 343925, 309356, 280231, 256636, 238625, 224443, 211722, 199953, 190292, 183311, 178238, 174128, 170559, 167320, 164402, 162184, 160857, 159949, 159050, 158519, 158803, 159510, 159883, 159733, 159359, 159070, 159279, 160276, 161329, 160907, 158527, 155516, 153223, 151458, 149536, 147751, 146620, 145583, 143760, 141431, 139606, 138626, 138193, 138169, 138359, 138087, 137019, 135853]
57606A35853n80m12q56q87k48K1n03r02p59r04j749k411k305k021j958j584p98
57589A16997n46j247j967j897j446j230j169j122j210j088j91Q43N23j281k839
57574A01130k883j979j152o33n69j390k709l258k634j846j568j235m69J47L29
57559G9281O15R90O31k99k78J143K258J726O57P91J941K595K117J052L4n19l09
57542I4426L45N65J90R8P31J303J175Q76R67R72L19o38j335j819k143j911j198
57525I2923q76j250j421p23K11O29Q43J367J897K063K211K611K717K152J524J421
57509A08299J436R90L28j07m16o66m08L67P70J75q29j509k029k716l172k963k438
57492I5112k071j754j412j501k140k534k033j029j97M11Q80R46O10M14N09L18
$$ y = [135853, 135273, 134861, 134005, 133118, 132870, 132891, 132388, 131486, 130727, 129823, 128074, 125663, 123358, 121337, 119379, 117795, 116997, 116451, 115204, 113237, 111340, 109894, 108664, 107495, 106373, 105163, 104075, 103884, 104727, 105250, 103969, 101130, 98247, 96268, 95116, 94483, 93914, 92524, 89815, 86557, 83923, 82077, 80509, 79274, 78805, 78952, 79281, 79896, 80886, 81517, 81218, 80940, 82083, 84341, 86067, 86724, 87515, 89456, 92051, 94168, 95220, 95254, 94735, 94426, 94771, 95336, 95526, 95624, 96355, 97658, 98833, 99709, 100676, 101648, 101967, 101329, 99994, 98175, 96032, 94121, 92923, 92047, 90797, 89376, 88653, 88864, 89493, 90336, 91703, 93600, 95663, 97874, 100485, 103202, 105354, 106878, 108299, 109735, 110725, 111053, 110946, 110530, 109864, 109456, 109823, 110593, 110768, 109939, 108430, 106401, 103685, 100513, 97550, 95112, 93041, 91287, 89875, 88374, 86234, 83700, 81667, 80638, 80441, 80852, 81732, 82678, 83288, 83702, 84211, 84529]
57476H4529l41p36m75k06m51p26o11n96j127j672j573r60j86P34J529J515P18
57459G9365J36K91N26L41K31M93N02k1l11N3K80j52n06j89J42k3K9P10R50l9j054
57438H1754n55R42J730J357P08L37K09M73J126J454R63L83O00J263J457J054L90
57421I5645n47j452j279K90J794J806R09M90N42K32j51L64J552K254K203K025
57405A06677J749Q48l89j003q13m67k79r2n3l53n00M7R17J500K074L051L734L200
57387A19848J935J241J415J901K647L802M494L709K109J364J742K048J837J906
57373A51998K395K256J040k79r08j222j633j640p78M37J188J344J254J154J106
57358A57712J107J072J062J377J980K105J294M01O09J710K416K290K122K361K338
$$ y = [84529, 84188, 83452, 82977, 82771, 82320, 81594, 80983, 80387, 79260, 77588, 76015, 75055, 74869, 75603, 77132, 78647, 79365, 79501, 79792, 80318, 80659, 80890, 81383, 81885, 81864, 81553, 81606, 81886, 81734, 81228, 81039, 81181, 81158, 81187, 81897, 82847, 82808, 81754, 81199, 82141, 83871, 85228, 85936, 86273, 86482, 86955, 88081, 89535, 90498, 90881, 91481, 92744, 94201, 95255, 95645, 95098, 93646, 92367, 92657, 94451, 96257, 97166, 97656, 98198, 98430, 98279, 98643, 100195, 102449, 104652, 106677, 108426, 109274, 108885, 107882, 107069, 106602, 106323, 106231, 106178, 105825, 105325, 105372, 106289, 107789, 109863, 112914, 116648, 119848, 121783, 123024, 124439, 126340, 128987, 132789, 137283, 140992, 143101, 144465, 146207, 148255, 150092, 151998, 154393, 156649, 157689, 157410, 156502, 155280, 153647, 152007, 151229, 151666, 152854, 154198, 155452, 156606, 157712, 158819, 159891, 160953, 162330, 164310, 166415, 167709, 168110, 168719, 170429, 172845, 175135, 177257, 179618, 181956]
57343A81956J406l0j063j185m28P50J584J533Q88M17M37P03R99J262J365J329
57327A91923J580K321K928K727K026J671J815J927J814J749J758J664J727K384
57313B20014L380L929L704L063K372J817J670K160L113M157N046N431M904L774
57299B68534L129L470L970L882L750M218M657M311L973M821O223O543N835N747
57285C33063O772P465O866N909N723N976N806N272N008N104N114M759M194L835
57271D10866M135N112O131O578O609O707O819O666O571P087P951Q355Q222Q248
57257E06057Q755R339R712J0014J0296J0440J0595J0991J1424J1610J1767J2121
57245F33121J2252J1751J1148J1178J1517J1384J0980J1089J1536J1451J0929
$$ y = [181956, 183362, 183332, 182269, 181084, 180656, 181406, 182990, 184523, 185411, 185828, 186265, 186968, 187967, 189229, 190594, 191923, 193503, 195824, 198752, 201479, 203505, 205176, 206991, 208918, 210732, 212481, 214239, 215903, 217630, 220014, 223394, 227323, 231027, 234090, 236462, 238279, 239949, 242109, 245222, 249379, 254425, 259856, 264760, 268534, 271663, 275133, 279103, 282985, 286735, 290953, 295610, 299921, 303894, 308715, 314938, 321481, 327316, 333063, 339835, 347300, 354166, 360075, 365798, 371774, 377580, 382852, 387860, 392964, 398078, 402837, 407031, 410866, 415001, 420113, 426244, 432822, 439431, 446138, 452957, 459623, 466194, 473281, 481232, 489587, 497809, 506057, 514812, 524151, 533863, 543877, 554173, 564613, 575208, 586199, 597623, 609233, 621000, 633121, 645373, 657124, 668272, 679450, 690967, 702351, 713331, 724420, 735956, 747407, 758336]
57234G58336J0969J1775J2472J2628J2779J3238J3680J4095J4900J5815J5922
57223I06609J5159J4619J4989J5707J6054J6082J6136J6361J6947J8001J9039
57212A085703J9464J9531J9835J9988J9121J7721J7458J8823K0352K0681K0102
57201A298779J9445J8742J7766J6883J6500J6396J6188J5853J5359J4528J3623
57190A480062J3312J3681J4073J4187J4561J5583J6912J8185J9461K0641K1365
57179A662023K1794K2641K3961K4858K4789K4267K3850K3325K2496K1812K1542
57168A917358K1082J9833J8230J7140J6621J5913J4558J3016J2166J2286J2555
57157B090758J1787R832P766O430N407M082K896K495K262J107p07j926k264k446
$$ y = [758336, 769305, 781080, 793552, 806180, 818959, 832197, 845877, 859972, 874872, 890687, 906609, 921768, 936387, 951376, 967083, 983137, 999219, 1015355, 1031716, 1048663, 1066664, 1085703, 1105167, 1124698, 1144533, 1164521, 1183642, 1201363, 1218821, 1237644, 1257996, 1278677, 1298779, 1318224, 1336966, 1354732, 1371615, 1388115, 1404511, 1420699, 1436552, 1451911, 1466439, 1480062, 1493374, 1507055, 1521128, 1535315, 1549876, 1565459, 1582371, 1600556, 1620017, 1640658, 1662023, 1683817, 1706458, 1730419, 1755277, 1780066, 1804333, 1828183, 1851508, 1874004, 1895816, 1917358, 1938440, 1958273, 1976503, 1993643, 2010264, 2026177, 2040735, 2053751, 2065917, 2078203, 2090758, 2102545, 2112377, 2120143, 2126573, 2131980, 2136062, 2138958, 2141453, 2143715, 2144822, 2144115, 2142189, 2139925, 2137479]
57143B137479k449j338R20L141M761O566R098J1683J3558J4747J5272J4783J3454
57130B241675J2115J0891Q870N652K126q36l432o116q675j0555j1234r996o483
57117B224002j796K168M799P034R309J0775J1158J1837J4172J8121K3286L0106
57105B364971L8844M8598N8629O9972Q4714J04306J29540J61641K02426K53611
57095C517252L16538L92375M82061N86113P04566Q36715R80778J133558J289193
57086A0239149J436751J558832J632638J632155J531745J316157R96704O19305
57078B0963436K49185o1147k94243m63822n94928p08297q15517r19184j014225
57069A6341258j091482j142357j161451j147282j102825j035001r51944q60541
$$ y = [2137479, 2135030, 2133692, 2134612, 2137753, 2142514, 2149080, 2158178, 2169861, 2183419, 2198166, 2213438, 2228221, 2241675, 2253790, 2264681, 2273551, 2279203, 2281329, 2280493, 2277061, 2270945, 2262270, 2251715, 2240481, 2230485, 2224002, 2222206, 2224374, 2229173, 2236207, 2245516, 2256291, 2267449, 2279286, 2293458, 2311579, 2334865, 2364971, 2403815, 2452413, 2511042, 2581014, 2665728, 2770034, 2899574, 3061215, 3263641, 3517252, 3833790, 4226165, 4708226, 5294339, 5998905, 6835620, 7816398, 8949956, 10239149, 11675900, 13234732, 14867370, 16499525, 18031270, 19347427, 20344131, 20963436, 21212621, 21151474, 20857231, 20393409, 19798481, 19090184, 18274667, 17355483, 16341258, 15249776, 14107419, 12945968, 11798686, 10695861, 9660860, 8708916, 7848375]
57061G848375p66526o75005n89146n09419m36086l71975l21344k86043k63638
57052C629193k48791k35868k21272k04651j87643j71193j54976j39392j26061
57043A939346j15306j05052r3714q2560p3596o6613o0031n3154m5829l7332k7614
57032A178545j8005q438M136K0960L5818L8139K3007l860l1394n1483o2064o5196
57020A060165o4095o1010n6537n0771m4770l9938l6271l2532k8182k3993k0654
57009F01412j7978j5651j3753j2327j1274j0709j0742j0953j0808j0378r969r424
56997D57446q574p825p480o977n825m643m160l839k715j061J85J192K990N681
56983D14395Q260R897J0163Q326L960j799o922j0406j2508j3413j3009j1800j0664
$$ y = [7848375, 7081849, 6406844, 5817698, 5308279, 4872193, 4500218, 4178874, 3892831, 3629193, 3380402, 3144534, 2923262, 2718611, 2530968, 2359775, 2204799, 2065407, 1939346, 1824040, 1718988, 1625274, 1542714, 1469118, 1402505, 1342474, 1289320, 1243491, 1206159, 1178545, 1160540, 1152102, 1156238, 1177198, 1213016, 1251155, 1274162, 1270302, 1238908, 1187425, 1125361, 1060165, 996070, 935060, 878523, 827752, 782982, 743044, 706773, 674241, 646059, 622066, 601412, 583434, 567783, 554030, 541703, 530429, 519720, 508978, 498025, 487217, 476839, 466870, 457446, 448872, 441047, 433567, 426590, 420765, 416122, 411962, 408123, 405408, 404347, 404532, 405724, 408714, 414395, 422655, 432552, 442715, 451041, 455001, 453202, 446280, 435874, 423366, 409953, 396944, 385144, 374480]
56970C74480r690q357o724n342m156k669r13P79K665N078P566R726J2316J5972
56956C90731J9236J9563J6096J0014K610n208j1850j5673j6903j7267j7507j6849
56944C56993j4986j2741j0487p703m546k154q18O20K955N664Q282J1386J5498
56931C47963K0070K3997K6014K4495J8279Q380k256j1193j7776k2060k4027k4200
56919C67686k3578k2383k0102j7084j4679j3277j1748r470p406o417n868m853
56907B10821l607k706j950j021l40l38o09n68l04j07K07Q72J722K607L676M883
56891B13238N929O951Q399J0129J1582J3041J5223J7287J6743J2336N784k66m943
56878C31433q732j1575j2811j2483j1345r778p639n005k282L73L100N923Q738
$$ y = [374480, 364790, 356433, 349709, 344367, 340211, 337542, 336629, 337408, 340073, 345151, 352717, 362443, 374759, 390731, 409967, 429530, 445626, 455640, 458250, 453042, 441192, 425519, 408616, 391349, 373842, 356993, 342007, 329266, 318779, 311076, 306530, 304376, 303558, 304178, 307133, 312797, 321079, 332465, 347963, 368033, 392030, 418044, 442539, 460818, 469198, 466942, 455749, 437973, 415913, 391886, 367686, 344108, 321725, 301623, 284539, 269860, 256583, 244835, 235365, 227959, 221542, 215674, 210821, 207214, 204508, 202558, 201537, 201197, 200859, 200250, 199682, 199378, 199271, 199478, 200350, 202072, 204679, 208355, 213238, 219167, 226118, 234517, 244646, 256228, 269269, 284492, 301779, 318522, 330858, 336642, 336376, 331433, 322701, 311126, 298315, 285832, 274487, 264709, 257070, 252065, 249783, 250156, 253256, 259179, 267917]
56865B67917J1577J4587J8015K2374K8177L5069M1390M4828M3440L6305K4047
56854E87726Q970n825j7879k5972k9773k9731k7179k3649j9861j5829j1733p837
56842C81428l709J418P472J3656J9859K6857L5125M4433N4660O5284P3544P4454
56830G94481O4169M3207J6164j1049l3642m9030n7013n8998n6765n1877m5729
56819E53918l9259l2580k5596j8834j2882p248q83O216J3122J9748K7257L6359
56807E19338M6042N3857N6521N0733L5464J3949q022k6309l9914m8755n2250n0857
56795E49797m6883m2328l7224l1098k4698j9102j4305r889o075k885P55N837J1881
56782C33783J7777K3138K7709L0110K8456K2022J1666q06j3022k2558k8134l0235
$$ y = [267917, 279494, 294081, 312096, 334470, 362647, 397716, 439106, 483934, 527374, 563679, 587726, 596696, 590871, 572992, 547020, 517247, 487516, 460337, 436688, 416827, 400998, 389265, 381428, 377719, 379137, 386609, 400265, 420124, 446981, 482106, 526539, 581199, 646483, 720027, 794481, 858650, 901857, 918021, 906972, 873330, 824300, 767287, 708289, 651524, 599647, 553918, 514659, 482079, 456483, 437649, 424767, 417519, 416636, 422852, 435974, 455722, 482979, 519338, 565380, 619237, 675758, 726491, 761955, 775904, 767882, 741573, 701659, 652904, 600654, 549797, 502914, 460586, 423362, 392264, 367566, 348464, 334159, 324270, 318195, 315310, 316065, 321902, 333783, 351560, 374698, 402407, 432517, 460973, 482995, 494661, 493855, 480833, 458275, 430141, 399906]
56770C99906l0089k8496k5957k3142k0533j8120j5864j3929j2151j0124q088o863
56758A86550o526o109n073m017l532l421l465l808m087l452k019j016q82o56O3
56743A38550J67r23j914j600p39n72p75m53L6p9k93K75J067R17J18o4N24R46R50
56724A36138J096J325R34M4l28K06R99J482J669J447N11p78j425r53L1O21N00
56707A43519J0k43O5N71N81L1l50m9N82J029J250J258Q47K10M1M70P04K78j84
56688A50620r2K18L98Q59J742K133J359K16j96q0k89p17o35n5L99N61P33R35J081
56669A59190J366J810J928J559J301J413J172J83o52n27j53n53j237r76K54J415
56653A67493J958K017J604P85J47J3k82j192j847j379n61o61j348j284l95J54
$$ y = [399906, 369817, 341321, 315364, 292222, 271689, 253569, 237705, 223776, 211625, 201501, 193413, 186550, 180024, 173915, 168842, 164825, 161293, 157872, 154407, 150599, 146512, 143060, 141041, 140025, 139143, 138487, 138550, 138717, 137794, 135880, 134280, 133541, 132969, 132194, 131741, 131777, 131698, 131405, 131680, 132747, 133664, 133782, 133718, 134242, 135188, 136138, 137234, 138559, 139493, 139537, 139209, 139415, 140414, 141896, 143565, 145012, 145523, 144745, 143320, 142367, 142398, 143019, 143519, 143529, 143286, 143351, 143922, 144503, 144534, 144184, 144135, 144717, 145746, 146996, 148254, 149101, 149311, 149352, 149822, 150526, 150804, 150620, 150528, 150746, 151144, 152003, 153745, 155878, 157237, 157453, 157257, 157177, 156888, 156171, 155536, 155481, 155880, 156441, 157174, 158109, 159190, 160556, 162366, 164294, 165853, 167154, 168567, 169739, 169922, 169270, 168743, 168590, 168037, 166800, 165824, 166078, 167493, 169451, 171468, 173072, 173857, 174004, 174017, 173735, 172543, 170696, 169317, 168756, 168095, 166747, 165463, 165068, 165222]
56637A65222q0m12m92o38p73l83L54O00J01n82j035j275j244r30p32q43o97M5
56619A56206N11k46j604k110j467n51J17N84N73k17j075r12J25Q87Q71M62k20
56602A51934j344k394k472j619p43k61J29M90N60M92O98J053J260J588K212K312
56586A53895J118n40j093l96L55N62O41O73K26m80n90L0O98J158J711K175K042
56569A62185J624J790K531L064L333M030N158N985O598Q020J0438J2492J2797
56556B40045J1200Q351N102K473J149P14J07r52j828k113k059j904j686j654k055
56541B54890k615k971l289l676l516k393j154q44j144j130j009j624k698l228
56527B23599l306l915m982n291m367l031k001j262q46q94r99p09m97r70j523j178
$$ y = [165222, 165142, 164730, 164238, 163600, 162827, 162444, 162798, 163398, 163499, 162917, 161882, 160607, 159363, 158433, 157701, 156858, 156161, 156206, 156717, 156471, 154867, 152757, 151290, 150739, 150856, 151440, 152013, 151796, 150721, 149809, 149934, 150821, 151692, 152154, 151934, 150590, 148196, 145724, 144105, 143362, 143101, 143230, 143720, 144280, 144772, 145470, 146523, 147783, 149371, 151583, 153895, 155013, 154473, 153380, 152984, 153339, 153901, 154542, 155215, 155441, 154961, 154371, 154401, 155099, 156257, 157968, 160143, 162185, 163809, 165599, 168130, 171194, 174527, 178557, 183715, 189700, 196298, 204318, 214756, 227248, 240045, 251245, 259596, 264698, 267171, 268320, 269034, 269141, 268189, 266361, 264248, 262189, 260285, 258599, 256945, 254890, 252275, 249304, 246015, 242339, 238823, 236430, 235276, 234432, 233288, 232158, 231149, 229525, 226827, 223599, 220293, 216378, 211396, 206105, 201738, 198707, 196706, 195444, 194598, 193704, 192705, 191996, 191499, 190529, 189006, 187828]
56511A87828m05m26j096j200o26l76n46k12O14Q19J40m48m57l38k03K29L83o21
56493A83059k096k407j473p13m70K75J422J403n6j140p75j65m58q92m25M56Q30
56476A76375Q25R32J007R00R80J295J248P00L11M18O67J022J776K436K099J213
56460A94204J259K409L171K801K198J937J344J86n86n75o44j096q94L49J373J224
56444B08660P11Q96J521J835J701J083j68j428j584p71l65p69q97l79l15j179
56428B08552j852j702j675k398k912k415j459n36P40K052K015N10n46o7N14k43
56412A98578j411j486p66k87O0O90R74L71k83j60J54j01m11j99q3n45o60L16J386
56393A96137J299N00Q9N8m7J68J075J901J902J637J825J984J467Q06P12Q33P00
$$ y = [187828, 187423, 186997, 185901, 184701, 184075, 183699, 183153, 182941, 183555, 184374, 184514, 184066, 183609, 183271, 183068, 183297, 183680, 183059, 180963, 178556, 177083, 176370, 175900, 176175, 177597, 179000, 178944, 177804, 177029, 176864, 176406, 175514, 175089, 175545, 176375, 177200, 178132, 179139, 180039, 181019, 182314, 183562, 184262, 184573, 184991, 185658, 186680, 188456, 190892, 192991, 194204, 195463, 197872, 201043, 203844, 206042, 207979, 209323, 209509, 208923, 208348, 207704, 206608, 205714, 206063, 207436, 208660, 209371, 210267, 211788, 213623, 215324, 216407, 216239, 214811, 213227, 212456, 212091, 211322, 210425, 210046, 209731, 208552, 206700, 204998, 203323, 200925, 198013, 195598, 194139, 193603, 194343, 196395, 198410, 198920, 198374, 198307, 198821, 198578, 197167, 195681, 194915, 194628, 194688, 195378, 196352, 196723, 196440, 196280, 196434, 196333, 195922, 195723, 195640, 195095, 194435, 194751, 196137, 197436, 197936, 198025, 198083, 198036, 198204, 199279, 201180, 203082, 204719, 206544, 208528, 209995, 210801, 211513, 212346, 213046]
56376B13046P18J078R19j26q52l29M93M03n3K51J047J409J454J755J982J615J147
56359B25957J245J516J317R46Q92Q35M77L28P37J061P96L50qo17j187o81O86J219
56341B35869M76K24J434K523K054J132J294K059K497L225M724N555M494K838K344
56326B72742K483K046J681K363K913J797Q1k07M64J62r85j208m29k54r37j023
56310B81689l0Q96J099J179J629K322L287M565N581O001O527P502P661N959L622
56295C39489K627K886K830J995J228R96J271K353M147N450N503N386O262P358
56281C89781P420O918O945P157O861P010Q821J1391J2801J2851J2731J3001J3712
56268E17400J5460J8139J9913J9583J8843K0010K2720K5180K7401L0653L4879
$$ y = [213046, 213764, 214842, 215761, 215635, 214783, 214454, 214947, 215350, 215297, 215548, 216595, 218004, 219458, 221213, 223195, 224810, 225957, 227202, 228718, 230035, 230981, 231873, 232708, 233185, 233513, 234250, 235311, 236107, 236457, 236449, 235832, 234645, 233964, 234650, 235869, 236345, 236569, 238003, 240526, 242580, 243712, 245006, 247065, 249562, 252787, 257511, 263066, 267560, 270398, 272742, 275225, 277271, 278952, 281315, 284228, 286025, 286106, 285899, 286363, 286525, 285540, 284332, 283903, 283649, 282712, 281689, 281659, 282555, 283654, 284833, 286462, 288784, 292071, 296636, 302217, 308218, 314745, 322247, 329908, 335867, 339489, 342116, 345002, 347832, 349827, 351055, 352051, 353322, 355675, 359822, 365272, 370775, 376161, 382423, 389781, 397201, 404119, 411064, 418221, 425082, 432092, 440913, 452304, 465105, 477956, 490687, 503688, 517400, 532860, 550999, 570912, 590495, 609338, 629348, 652068, 677248, 704649, 735302, 770181]
56257G70181L9212M4077N0231N6820O2925O9890P9296Q9840R9121J07448J16773
56246A585814J26731J34981J40874J45530J48709J48660J44845J37884J27203
56237B841231J11612R1932P0223M6780K0866o129l1222n3381p3549r1485j05608
56226B821270j15770j23232j27969j28976j27095j24486j21376j16309j09543
56217A726514j03153r7656r1621q4820p8786p3910o8810o2999n7525n2718m7802
56206I06714m2901l8956l5673l1981k8326k5960k4273k1619j8412j6474j5641
56195F06498j4072j1707j0234r722q600o898o218o381n460l423k415l037l566
56182E14765l235l157l517l035j666q84q66k21J160J924K038K719L583L073J861
$$ y = [770181, 809393, 853470, 903701, 960521, 1023446, 1093336, 1172632, 1262472, 1361593, 1469041, 1585814, 1712545, 1847526, 1988400, 2133930, 2282639, 2431299, 2576144, 2714028, 2841231, 2952843, 3044775, 3114998, 3161778, 3182644, 3176515, 3145293, 3091912, 3018363, 2926878, 2821270, 2705500, 2582268, 2454299, 2325323, 2198228, 2073742, 1952366, 1836057, 1726514, 1623361, 1525705, 1434084, 1349264, 1270478, 1196568, 1127758, 1064759, 1007234, 954516, 906714, 863813, 824857, 789184, 757203, 728877, 702917, 678644, 657025, 638613, 622139, 606498, 592426, 580719, 570485, 560763, 552163, 545265, 539047, 532666, 527206, 523783, 521368, 518331, 514765, 511530, 508373, 504856, 501821, 500155, 499271, 498405, 498184, 499344, 501268, 503306, 506025, 509608, 512681, 514542]
56167E14542K447N014P063P422P376P500O903N999O583Q474R406Q789Q362Q773
56153F14653Q814Q465R216J0985J2099J2764J4963J8623K1502K3432K6913L2967
56141H15396M0017M7394N6090O5362P2271P5332P5135P1146O2103N0169M0458
56130A470873L5442L3457L3011L4111L4774L1133K2589J2780M360l140r564j3107
56118A686719j4534j7894k5243l4547m3957n3876o3462o9609p1149p0104o7454
56107A154890o1829n3629m5951l9950l3638k6504k0856j7312j3683r595p364o982
56095H17597n357j965Pk97K57K723M023L002K764M655N736M767M838P260Q635
56080H58645P143O009P433Q694P795P411R465J1170J0319R431J0752J2129J1669
$$ y = [514542, 516989, 522003, 529066, 536488, 543864, 551364, 558267, 564266, 570849, 579323, 588729, 597518, 605880, 614653, 623467, 631932, 641148, 652133, 664232, 676996, 691959, 710582, 732084, 755516, 782429, 815396, 855413, 902807, 958897, 1024259, 1096530, 1171862, 1246997, 1318143, 1380246, 1430415, 1470873, 1506315, 1539772, 1572783, 1606894, 1641668, 1672801, 1695390, 1708170, 1712530, 1709390, 1699826, 1686719, 1672185, 1654291, 1629048, 1594501, 1550544, 1496668, 1433206, 1363597, 1292448, 1222344, 1154890, 1093061, 1039432, 993481, 953531, 919893, 893389, 872533, 855221, 841538, 831943, 824579, 817597, 812240, 810275, 810282, 809985, 810242, 812965, 816988, 819990, 822754, 827409, 833145, 837912, 842750, 850010, 858645, 865788, 871797, 879230, 887924, 895719, 903130, 912595, 923765, 934084, 943515, 954267, 966396, 978065]
56067I78065J1597J3640J5319J4693J4084J5437J6654J6115J6039J7775J8686
56056A148104J7198J6033J6909J7158J5108J3569J4356J4784J3247J2746J5115
56045A314327J7397J7661J8676K1929K4040K3098K2517K4539K6151K5496K5776
56034A561607K8472K9570K7147K5825K8819L2499L3740L5425L9484M1966M0598
56023A925152L9890M3018M6077M6103M6959N1263N4657N4339N5055N9986O4240
56012B486739O4238O4741O9391P3318P2933P3712P9899Q5977Q7089Q8476R5369
56001C341882J03063J06634J10819J20226J29521J33737J38486J49202J60357
55992D493927J66443J73178J86363K00326K09427K19799K37259K55350K68368
$$ y = [978065, 989662, 1003302, 1018621, 1033314, 1047398, 1062835, 1079489, 1095604, 1111643, 1129418, 1148104, 1165302, 1181335, 1198244, 1215402, 1230510, 1244079, 1258435, 1273219, 1286466, 1299212, 1314327, 1331724, 1349385, 1368061, 1389990, 1414030, 1437128, 1459645, 1484184, 1510335, 1535831, 1561607, 1590079, 1619649, 1646796, 1672621, 1701440, 1733939, 1767679, 1803104, 1842588, 1884554, 1925152, 1965042, 2008060, 2054137, 2100240, 2147199, 2198462, 2253119, 2307458, 2362513, 2422499, 2486739, 2550977, 2615718, 2685109, 2758427, 2831360, 2905072, 2984971, 3070948, 3158037, 3246513, 3341882, 3444945, 3551579, 3662398, 3782624, 3912145, 4045882, 4184368, 4333570, 4493927, 4660370, 4833548, 5019911, 5220237, 5429664, 5649463, 5886722, 6142072, 6410440]
55983F410440K83997L09134L36183L57942L82568M18070M56461M89969N28073
55974I972837N80447O38853O95157P60611Q46580R43857J043606J160138J309018
55965A7951104J483200J677593J915802K224386K605660L067435L650303M386564
55957C8962047N261887O261216P422539Q804624J0450485J2444325J4955274J8157220
55949A22719617K2164859K7073206L2769771L8277612M1284384L8930053K9753309
55942C52972811J5115475j376967j5949111k6374994l2238619l4228782l3432046
55935B24487767l0944720k7647761k4103989k0632309j7439210j4647882j2273206
55928G6798690j0265988q587932p213151o090134n156540m380355l749036l232944
$$ y = [6410440, 6694437, 7003571, 7339754, 7697696, 8080264, 8498334, 8954795, 9444764, 9972837, 10553284, 11192137, 11887294, 12647905, 13494485, 14438342, 15481948, 16642086, 17951104, 19434304, 21111897, 23027699, 25252085, 27857745, 30925180, 34575483, 38962047, 44223934, 50485150, 57907689, 66712313, 77162798, 89607123, 104562397, 122719617, 144884476, 171957682, 204727453, 243005065, 284289449, 323219502, 352972811, 368088286, 366711319, 350762208, 324387214, 292148595, 257919813, 224487767, 193543047, 165895286, 141791297, 121158988, 103719778, 89071896, 76798690, 66532702, 57944770, 50731619, 44641485, 39484945, 35104590, 31355554, 28122610]
55920B8122610k794685k421223k114027j858585j632646j433467j269236j132714
55912A3466027j008342q96229q05263p30418o59110n92507n39557m96757m53622
55903G284222m11764l79704l54576l26871k97983k76005k59099k39161k17480
55894D521579k01426j89774j75806j60819j50710j43152j31437j17325j07538
55885C143592j01468r4484q9175r0900r5893r5900r1348q8479q6940q1723p4278
55874B153004p0236o8736o4811n9715n8344n8953n5850m9998m6828m5851m2403
55863A531279l7549l6245l7498l6099l2558l1892l3853l3707l1411l1094l2306
55852A157067l0689k6579k4594k5164k4488k2263k1713k2548k1473j9105j9087
$$ y = [28122610, 25327925, 22906702, 20792675, 18934090, 17301444, 15867977, 14598741, 13466027, 12457685, 11561456, 10756193, 10025775, 9366665, 8774158, 8234601, 7737844, 7284222, 6872458, 6492754, 6138178, 5811307, 5513324, 5237319, 4978220, 4739059, 4521579, 4320153, 4130379, 3954573, 3793754, 3643044, 3499892, 3368455, 3251130, 3143592, 3042124, 2947640, 2858465, 2767565, 2671672, 2575772, 2484424, 2395945, 2309005, 2227282, 2153004, 2082768, 2014032, 1949221, 1889506, 1831162, 1772209, 1716359, 1666361, 1619533, 1573682, 1531279, 1493730, 1457485, 1419987, 1383888, 1351330, 1319438, 1285585, 1251878, 1220467, 1189373, 1157067, 1126378, 1099799, 1075205, 1050041, 1025553, 1003290, 981577, 959029, 937556, 918451, 899364]
55841H99364k0892k0635j8312j7327j7608j6164j3624j3273j4375j3285j0499
55830G23370r716j0625r524o550n432o446o370n198o083q750r665q782r547j2001
55816F08681j2400j0153q793r427r286p565o800p479o881m298k266j722p58J100
55802E21953K151K557M361P047P746O285N341N296L742N14j666k178l478o230
55788E53441p909p209n831n159m942n723q674j2600j4800j5147j5739j6574j5533
55775D17601j2590j0033q449o376l946k865k829j935n81r17k535k915j964j930
55761C57736k804k348p20n09j862k100p35l22j695k666k287k150k718k506j757
55746C30557k817n757p619p067o103o187o290n763n538n577m482k492j542j789
$$ y = [899364, 878472, 857837, 839525, 822198, 804590, 788426, 774802, 761529, 747154, 733869, 723370, 713654, 703029, 693505, 686955, 681523, 675077, 668707, 663509, 657426, 648676, 639011, 630229, 620682, 608681, 596281, 586128, 577335, 567908, 558622, 551057, 544257, 536778, 529897, 525599, 523333, 521611, 520853, 521953, 524104, 526661, 531022, 538069, 545815, 552100, 557441, 562737, 566479, 566993, 565327, 563149, 559671, 553441, 545532, 538323, 532492, 527333, 522391, 516668, 507994, 495394, 480594, 465447, 449708, 433134, 417601, 405011, 394978, 386529, 380153, 376207, 373342, 370513, 368578, 367997, 367080, 364545, 361630, 359666, 357736, 354932, 352584, 351864, 351355, 349493, 347393, 346658, 346336, 344641, 341975, 339688, 337538, 334820, 332314, 330557, 327740, 321983, 314364, 307297, 301194, 295007, 288717, 282954, 277416, 271839, 267357, 264865, 263323, 261534]
55732B61534j477n14n63j375j012lj021l785m825l231k177l417m642l998l048
55717B26446l257l316k102q88o75l58O42R74J40k56M54P17p1k24R63J659P84j40
55699B21492n1k83j810l310l644l620l838l395k129j465j695j145O78J907J608
55684A99300J324J974K159J152O29J649K661K338J742J897J782N63n68n99m34
55669B17569q03p17L86J172P12J07M03R98J331J881K303J195j089k071r15J88
55653B22650j54k63J228K696K342J056L84%p11r33l72o12k440m096m220m219n546
55636B06790o917o652n584n211m962l802k646k628k658j303M24O76j77m76q3L4
55620A64825o3K89O85L86k48o16j094j881k015j181r42k370l953l848k722k358
$$ y = [261534, 260057, 259543, 258980, 257605, 256593, 256590, 255569, 251784, 246959, 243728, 241551, 238134, 233492, 229494, 226446, 223189, 219873, 217771, 216883, 216208, 215850, 216492, 217466, 217606, 217350, 217804, 218521, 218450, 218226, 219189, 220848, 221632, 221492, 221441, 221158, 219348, 216038, 212394, 208774, 204936, 201541, 199412, 197947, 196252, 195107, 195785, 197692, 199300, 200624, 202598, 204757, 205909, 206538, 208187, 210848, 213186, 214928, 216825, 218607, 219170, 218602, 218003, 217569, 216766, 216049, 216435, 217607, 218319, 218426, 218829, 219827, 221158, 223039, 225342, 226537, 225448, 223377, 222462, 222650, 222496, 222233, 223461, 226157, 228499, 229555, 229939, 229939, 229228, 228295, 227923, 227311, 224871, 220775, 216555, 212336, 206790, 199873, 193221, 187637, 182426, 177464, 173662, 171016, 168388, 165730, 164427, 164851, 165527, 165350, 164874, 164791, 164825, 164762, 165051, 165736, 166122, 165874, 165258, 164164, 162283, 160268, 159087, 158145, 155775, 151822, 147974, 145252, 142894]
55604A42894k669k322j227l48J18N25N36j57p43m06K36K84K8nk42q89q63M62J797
55585A37009J793J100R66J151R91J148K409L918M535M885O114P689Q432Q770R934
55570B00844J1672J2599J2245J0985Q695N117J033k433n151p363q624q698q543
55557B22378q999r356q642p360o518n987n272m861n250n611m951l698k712j796
55543A41365o21M0l87q64l04N75O03K59N97J140P98l7k01J80J62k46m95q64j749
55524A39951k377j986j423j812k487k097j014p02j408k247k916l581l722k866
55510A09313j791j316p69N40J399L33j666k332j426n78m16j59K71R7m36k75M09
55493A01198L63n44j202j264j316j171L2J844K621J867P72J53m12j174j589j443
$$ y = [142894, 140225, 137903, 136676, 136328, 136446, 136971, 137507, 137350, 136607, 136201, 136437, 136721, 136749, 136744, 136502, 135613, 134750, 135212, 137009, 138802, 139902, 140868, 142019, 143010, 144158, 146567, 150485, 155020, 159905, 166019, 173708, 182140, 190910, 200844, 212516, 225115, 237360, 248345, 257040, 262157, 263190, 260757, 255606, 248243, 239619, 230921, 222378, 213379, 204023, 195381, 188021, 181503, 175516, 170244, 165383, 160133, 154522, 149571, 145873, 143161, 141365, 140744, 140784, 140397, 139533, 139229, 139804, 140407, 140666, 141263, 142403, 143201, 143164, 142963, 143143, 143305, 143059, 142564, 141700, 139951, 137574, 135588, 134165, 132353, 129866, 127769, 126755, 126053, 124645, 122398, 119482, 115901, 112179, 109313, 107522, 106206, 105437, 105977, 107376, 107709, 106043, 103711, 102285, 101707, 101291, 101132, 101403, 101500, 101064, 100789, 101198, 101561, 101017, 99815, 98551, 97235, 96064, 96096, 97940, 100561, 102428, 103200, 103353, 102941, 101767, 100178, 98735]
55477I8735j174q30k6Q99J047L78k11l29l74m94m47m81j025j611j351m09K08J97
55459I2702J05J43J57M19J124J367J85j606k113q87O83J378J219N42m24j041o90
55442I3263J70N12K31lj45o71j322j293o69k84k50Q4P69J162J098R95R36P44P06
55423I6033J075J272Q04M42J022J786J534Q07J055K060K257J325L82k89j453k805
55407A07307k913j699q39j124j388p77j55l59p43m77Q4K58J49O9q6k57M1P84J226
55388I9101J052Q17Q30O06j49r43j298j305j126p29l24l00o35j014j428j836j674
55371H9645o64K54J13n05m02J26j50j021r53L64J484J448P91M9r27j762j485k28
55353H6177N82L61R7M31O30J35l57k00J58K36L34O17N77R8j67k2j75q53j258r37
$$ y = [98735, 97561, 96731, 96705, 97604, 98651, 99029, 98818, 98489, 98115, 97621, 97174, 96693, 95668, 94057, 92706, 92297, 92505, 92702, 92807, 92950, 93107, 93526, 94650, 96017, 96202, 94596, 92483, 91596, 92279, 93657, 94876, 95418, 94994, 93953, 93263, 93433, 93945, 94176, 94173, 94028, 93357, 92035, 90742, 90073, 89789, 89539, 89623, 90392, 91554, 92652, 93647, 94583, 95327, 96033, 97108, 98380, 99184, 99626, 100648, 102434, 103968, 104775, 105830, 107890, 110147, 111472, 111854, 111565, 110112, 107307, 104394, 102695, 101856, 100732, 99344, 98567, 98412, 98053, 97310, 96833, 96917, 97175, 97324, 97393, 97307, 97050, 97091, 97875, 99101, 100153, 100970, 101800, 102406, 102257, 101314, 100016, 98711, 97585, 96856, 96532, 96232, 95597, 94583, 93155, 91319, 89645, 88981, 89235, 89348, 88843, 88441, 88567, 88417, 87396, 86443, 86807, 88291, 89739, 90530, 90579, 89652, 87890, 86405, 86177, 86759, 87120, 87217, 87648, 88278, 88413, 88056, 87856, 88014, 88250, 88584, 89201, 89778, 89876, 89709, 89687, 89512, 88659, 87401, 86464]
55333H6464m80l07l1M29M29p5j41N46J054Q41O68J029J125L56m41k90M43Q55Q50
55314I3324P23L51k80n90k43K16K40j6l47q89j357j029oN84K96P1N79J120R65
55295I3712N73N61O23M38M57Q36P79j00q31o21j43j69j16O51J166J79j624k397
55277I3974j645m91K12N74O66K39m87r09r56j071j222q33K34J372J962J924J485
55260I5028R24M81J63k35o93q29m78j8J96K56K98J49k00l58j50j4k76n52l48J54
55240I3498L60M2n21q77o93o6L23j49j154j672j294n79o5K58M77N09N27P48P53
55221I0425l2j079j096M5R92R03N29O90R72O84N1m51r57j557j619p08N02J059
55203H9353Q74M30Rk09j0L09O7o80r96n15p4k95o73o70n82n74q0R78J555J056
$$ y = [86464, 85984, 85677, 85646, 86075, 86504, 86429, 86288, 86834, 87888, 88729, 89397, 90426, 91551, 91907, 91466, 91176, 91619, 92474, 93324, 94047, 94398, 94118, 93528, 93285, 93501, 93741, 93725, 93378, 92489, 91132, 90103, 90097, 90681, 90977, 91048, 91627, 92747, 93712, 94285, 94846, 95469, 95907, 96364, 97200, 97979, 97879, 97048, 96427, 96284, 96115, 95999, 96650, 97816, 97995, 96371, 93974, 92329, 91838, 92050, 92624, 93290, 93529, 93042, 92133, 91177, 90106, 88884, 88051, 88285, 89657, 91619, 93543, 95028, 95952, 96433, 96596, 96361, 95668, 94839, 94361, 94343, 94539, 94795, 95093, 95242, 95042, 94684, 94534, 94520, 94244, 93692, 93344, 93498, 93858, 93900, 93379, 92502, 91809, 91743, 92066, 91917, 90763, 89091, 87797, 87218, 87153, 87411, 87888, 88397, 88924, 89672, 90425, 90393, 89314, 88218, 88263, 89255, 90158, 90687, 91377, 92349, 93033, 93084, 92633, 91676, 90119, 88500, 87792, 88294, 89353, 90227, 90657, 90666, 90457, 90447, 90756, 90823, 90143, 89147, 88632, 88558, 88263, 87590, 86920, 86338, 85764, 85684, 86662, 88217, 89273]
55183H9273M00N12Q50O03J82K53L57j05n07o3N82M05j70o3N03M96On7K17om84
55162I3184p8J196J928J410N43K60L26J16l33n56k71M04Q83M07r55j963j646o73
55144I4182l52o52m36N45J288J234R83J031R37K49o74j242j375j257q97k89L33
55127I3608O82N63j06j040j527j151m02p4k08k20R2L80M81O18Q02P34L82Q4K8
55108I3726Q1J98N05R29J165J028O04J02j14L37J315K003J707O48l95r58j015
55091A01866o46q5J73n5k57J60J031J714J880J593R27P6m81m57k06k73p18j262
55073A04980j641j507n43Q16J435Q79J50L04R59J048M97J21K08K60n8n73j121
55056A06214j582j624j029k11K78M61N84M17k82r69q83j90K65J65j08k54k99j55
$$ y = [89273, 89673, 90185, 91035, 91638, 91820, 92073, 92430, 92325, 91818, 91755, 92337, 92742, 92572, 92509, 93012, 93508, 93514, 93457, 93674, 93668, 93184, 93106, 94302, 96230, 97640, 98183, 98443, 98769, 98885, 98552, 97996, 97725, 98129, 99012, 99419, 98464, 96501, 94855, 94182, 93830, 93178, 92742, 93287, 94575, 95809, 96792, 97823, 98760, 99009, 98335, 97093, 95718, 94461, 93564, 93275, 93608, 94290, 94853, 94747, 93707, 92180, 91029, 90627, 90553, 90345, 90125, 90217, 90597, 91078, 91696, 92498, 93232, 93614, 93698, 93726, 93807, 94005, 94510, 95439, 96604, 97632, 98236, 98338, 98224, 98561, 99876, 101879, 103586, 104234, 103839, 102881, 101866, 101220, 101135, 101308, 101253, 100996, 101156, 102187, 103901, 105781, 107374, 108301, 108377, 107896, 107439, 107233, 106960, 106242, 104980, 103339, 101832, 101289, 102105, 103540, 104419, 104569, 104873, 105832, 106880, 107377, 107498, 107706, 107966, 107908, 107335, 106214, 104632, 103008, 101979, 101768, 102046, 102507, 103091, 103508, 103226, 102257, 101374, 101184, 101449, 101614, 101506, 101252, 100953, 100798]
55038A00798K34N19L93J75L44P19Q22O69M94K0j049k129k269j468n88j42N6J78
55020I7776J73J77M17P54R01Q92P79L03n08q91l73K78J11m94m67J76M15j04o77
55001I9638p49m76r0L48N95M56K50L22L71J08J19R70J943J921J147P95J005Q47
54983A09520J22k67J42Q04J255J490J250K38p68n66O20J286Q60K83J31k24j046
54966A15130j453r94n82r16j233n73O84J510J636J387Q55O7o14r05q92n76J70
54949A12701P98K85j290k344j725j80Q22R59Q34O62J82m83q49p38l51J38N28N04
54931A10453R1r6M81J615K678L285L404L180L017L398M308N136N404N243M980
54916A56577M666M189L420K174M33j352k675l658m674n434n273m383l781l859
$$ y = [100798, 101032, 101551, 101944, 102119, 102463, 103182, 104004, 104673, 105167, 105187, 104138, 102009, 99740, 98272, 97684, 97542, 97598, 97776, 97949, 98126, 98543, 99297, 100198, 101090, 101869, 102172, 101664, 100773, 100400, 100678, 100789, 100295, 99828, 100004, 100419, 100315, 99638, 98889, 98413, 98323, 98671, 99266, 99722, 99972, 100294, 100665, 100773, 100892, 101862, 103805, 105726, 106873, 107668, 108673, 109520, 109642, 109375, 109517, 110321, 111576, 113066, 114316, 114554, 113786, 113220, 113840, 115126, 115986, 116269, 116400, 116176, 115130, 113677, 112683, 112101, 111185, 109952, 109379, 110063, 111573, 113209, 114596, 115451, 115518, 114904, 113999, 113107, 112531, 112701, 113499, 113784, 112494, 110150, 108425, 108245, 109067, 110026, 110860, 111522, 111704, 111221, 110372, 109634, 109283, 109421, 109949, 110453, 110544, 110448, 110929, 112544, 115222, 118507, 121911, 125091, 128108, 131506, 135814, 140950, 146354, 151597, 156577, 161243, 165432, 168852, 171026, 171459, 170107, 167432, 163774, 159100, 153666, 148393, 144010, 140229, 136370]
54902A36370l943l547l020k611j942r57m01o53r75o63j21n0k78k34K2J15J45M19
54884A17676P69R10J133J898K985L752M014M102M270M540M942N375N418M714L436
54869A69934K026O12r39k560l886m553m563m379m527m811m232k309k53J02j420
54854A34242l090l530l147k898k730k085j134n74n98q54j151j500j694j449p88
54839A07020NO04N84l19j615k191j525l29L84M19J82q7l60m95m10k93k64j32J87
54820A01365M08L14Q7q1k78m79l58K37J016J706K241K390J810P96K05L05M24J37
54802A12245j0M30Q79O26J1j45J84M02L46L52M80M07J14j9K56P32R69O08l07j162
54782A17398j187k69R63J903K385K310J609P47N51J116J635J606J520J957K799
$$ y = [136370, 132427, 128880, 125860, 123249, 121307, 120350, 119949, 119296, 118321, 117658, 117537, 117487, 117209, 116975, 116997, 117112, 117257, 117676, 118445, 119355, 120488, 122386, 125371, 129123, 133137, 137239, 141509, 146049, 150991, 156366, 161784, 166498, 169934, 171960, 172572, 171633, 169073, 165187, 160634, 156071, 151692, 147165, 142354, 138122, 135813, 135560, 135662, 134242, 131152, 127622, 124475, 121577, 118847, 116762, 115628, 115054, 114456, 113602, 112451, 110951, 109257, 107808, 107020, 107025, 107629, 108213, 107894, 106279, 104088, 102563, 102234, 102618, 103037, 103219, 103132, 102772, 102277, 101867, 101574, 101310, 101178, 101365, 101773, 102087, 102174, 102093, 101815, 101336, 100978, 101215, 102231, 103937, 106178, 108568, 110378, 111174, 111379, 111684, 112108, 112245, 112235, 112665, 113544, 114170, 114181, 114036, 114220, 114622, 114968, 115320, 115800, 116207, 116321, 116302, 116558, 117290, 118259, 118867, 118560, 117398, 116211, 115942, 116905, 118808, 121193, 123503, 125112, 125859, 126410, 127526, 129161, 130767, 132287, 134244, 137043]
54767A37043L828N205O769P691P551O986O582N856M182J978N5j625l487n197o014
54752A77403n989n797n664n347m905m626m330l597k575j825j532j454j507j660
54738A26595j559q91m6L35K82L64Q16J360J764J984J941J648J459J669K167K805
54722A42693L704M671M941M113K934K335K108J341j62j717k806l448l690l537
54708A53480l286l308l503l557l484l440l282k882k527k389j957q32M09Q56N69
54693A20867K81J88q9m88n29l01m65j176j782j765j267o67k21j55m69p08m36R1
54675A10909L60M94R71J572J430K47j222j990j703o59M90J070Q96M49J84l3m28
54658A13037o32j95N67R25O92K27k11m94l45K31N77K62j16J96Q43R01L53r1k45
$$ y = [137043, 140871, 146076, 152845, 160536, 168087, 175073, 181655, 187511, 191693, 193671, 193726, 192101, 188614, 183417, 177403, 171414, 165617, 159953, 154606, 149701, 145075, 140745, 137148, 134573, 132748, 131216, 129762, 128255, 126595, 125036, 124145, 124099, 124434, 124716, 125080, 125896, 127256, 129020, 131004, 132945, 134593, 136052, 137721, 139888, 142693, 146397, 151068, 156009, 160122, 163056, 165391, 167499, 168840, 168678, 166961, 164155, 160707, 157017, 153480, 150194, 146886, 143383, 139826, 136342, 132902, 129620, 126738, 124211, 121822, 119865, 119033, 119442, 120298, 120867, 121148, 121336, 121247, 120759, 120230, 119929, 119464, 118288, 116506, 114741, 113474, 112807, 112586, 112431, 111962, 111254, 110818, 110909, 111269, 111763, 112734, 114306, 115736, 115983, 114761, 112771, 111068, 110409, 110899, 111969, 112865, 113314, 113498, 113465, 113037, 112405, 112210, 112777, 113702, 114394, 114621, 114410, 113916, 113571, 113802, 114379, 114641, 114525, 114721, 115564, 116465, 116818, 116727, 116482]
54639A16482m39n25j87L7n93j492j340j99M69J32j02M19P55J44n64k95M97O94
54621A13893K93J77O17J009Q27O3j014j889j889q93K31N26N1l35j31L61O29N60
54603A13086M01L69L69J34k99m55l3N13N15P0o6L98R20R78P03M32K03o7l17m91
54583A17363n70m24nL05Q5l45k16N50J090P46j52q79j121r26m18J83O34J010J502
54564A18412J816J349K06o62o21j35rl53o81o12j46M52P90O43K83J43J20k58q86
54545A19851r50k5J248J920J738J142O65O03Q30P67o0j263j886j594j002o72l97
54528A20915J52O80O67Q1o77j182j173o54p0Q4q6p1J66K06J40N92J469J672O50
54509A23561o14r55o52p25j209j226m90K55M15K20P1m6k30k80l7K17J13k24k42
$$ y = [116482, 116043, 115518, 115331, 115368, 114775, 113283, 111943, 111744, 112213, 112345, 112243, 112662, 113417, 113561, 112997, 112702, 113199, 113893, 114186, 114363, 114980, 115989, 116816, 116879, 115865, 113976, 112087, 111194, 111425, 111951, 112002, 111667, 111536, 111897, 112526, 113086, 113487, 113856, 114225, 114359, 114060, 113605, 113572, 114085, 114600, 114670, 114604, 115002, 115922, 116900, 117603, 118035, 118238, 118171, 117854, 117363, 116793, 116369, 116364, 116669, 116754, 116409, 116193, 116743, 117833, 118579, 118427, 117548, 116427, 115501, 115083, 115266, 115900, 116910, 118412, 120228, 121577, 121783, 121121, 120500, 120365, 120356, 120003, 119322, 118710, 118564, 119016, 119806, 120449, 120732, 120875, 120995, 120737, 119851, 118901, 118876, 120124, 122044, 123782, 124924, 125589, 126192, 127022, 127789, 127729, 126466, 124580, 122986, 121984, 121312, 120915, 121067, 121747, 122414, 122495, 121818, 120636, 119463, 118809, 118739, 118823, 118737, 118666, 118832, 119038, 119178, 119770, 121239, 122911, 123561, 122947, 121992, 121340, 120615, 119406, 118180, 117690, 117945, 118360, 118580, 118651, 118605, 118375, 118095, 118058, 118275, 118388, 118164, 117922]
54490A17922L52J182J561J236N15k21q59j252j066k94M49O26N33P36J039P86O5
54473A23310k47K28R00J227J363J488J301P24L70O97J225J200O88K91J37k24r43
54456A33735j513j360n35L33O19K83k29n64p63q58n58K09P80M78l65q18o90o09
54438A27575q16p96k97K03M03O31J053J201Q02L14J93K30J37J05L04M60L75L10
54420A32387L75K13k53m53j21J12l06q87q59l26N1N0p2r3J29P50J525J813J507
54401A35542J363J806K140J647P98N17Q04J010R63Q74N51k32r09p15O3L70j67
54384A46425r47j455j702j696j314p86n14l65J56R81J393R47j8q18q86M0J638
54367A41079K975L393L196K996K766K196J652J792K384K497J859J105O39J88l99
$$ y = [117922, 118274, 119456, 121017, 122253, 122768, 122547, 121688, 120436, 119370, 119076, 119525, 120151, 120684, 121420, 122459, 123245, 123310, 123063, 123291, 124191, 125418, 126781, 128269, 129570, 130294, 130664, 131361, 132586, 133786, 134474, 134765, 134902, 134678, 133735, 132222, 130862, 130327, 130660, 131279, 131562, 131333, 130769, 130006, 129148, 128590, 128799, 129579, 130057, 129692, 128874, 128184, 127575, 126759, 125963, 125666, 125869, 126272, 126903, 127956, 129157, 129959, 130273, 130466, 130696, 130833, 130938, 131242, 131702, 132077, 132387, 132762, 132975, 132722, 132269, 132148, 132260, 131954, 131067, 130208, 129882, 129933, 129983, 129911, 129818, 129947, 130697, 132222, 134035, 135542, 136905, 138711, 140851, 142498, 143296, 143813, 144617, 145627, 146590, 147464, 148015, 147783, 146874, 146159, 146222, 146592, 146425, 145478, 144023, 142321, 140625, 139311, 138525, 138011, 137646, 137802, 138783, 140176, 141123, 141105, 140287, 139401, 139441, 141079, 144054, 147447, 150643, 153639, 156405, 158601, 160253, 162045, 164429, 166926, 168785, 169890, 170529, 170717, 170318]
54352A70318q08r84j337j947k332k344k502l091l576l393k690j910j170n17k76
54337A41441o17j117j160n90K87J051J330R94M39K77N48O64L07r0j03K1j14k99
54319A43269j19J88Mo49j022o76j09o3n78j068j066o02k0K88K8o65j083n66N22
54300A36013R19k0j339j612p52M3O7j40kJ28k36o78m98K24Q56J160J276J103N02
54281A37014j30l04l33q81j629j347M08K477L357K768J589P18M00L63K05k29o61
54264A43785o83l37n4NK21Q57J519J598J148Q84J246J798J752R79J75p7p1m65
54246A54280j213j539r94k9O34P27L37l60r79j032o04l96p69j177j074p44o37
54229A44431m79R1N46J78n45n06K31L86n02j230o67N71J012K41q02j167q46m33
$$ y = [170318, 169510, 168526, 167189, 165242, 162910, 160566, 158064, 154973, 151397, 148004, 145314, 143404, 142234, 141717, 141441, 140824, 139707, 138547, 137957, 138244, 139295, 140625, 141619, 142058, 142335, 142883, 143547, 143854, 143764, 143661, 143682, 143568, 143269, 143150, 143338, 143342, 142693, 141671, 140995, 140886, 140823, 140245, 139177, 138111, 137509, 137489, 137777, 137805, 137140, 136057, 135491, 136013, 136932, 136912, 135573, 133961, 133209, 133252, 133319, 133179, 133177, 133305, 133069, 132391, 131893, 132117, 132973, 134133, 135409, 136512, 137014, 136884, 136580, 136247, 135366, 133737, 132390, 132798, 135275, 138632, 141400, 142989, 143707, 144107, 144470, 144675, 144446, 143785, 143102, 142765, 142711, 142716, 142937, 143794, 145313, 146911, 148059, 148943, 150189, 151987, 153739, 154718, 154893, 154816, 154745, 154280, 153067, 151528, 150534, 150505, 151139, 151866, 152203, 151843, 150864, 149832, 149228, 148832, 148063, 146886, 145812, 145068, 144431, 143952, 144043, 144589, 144767, 144222, 143716, 143947, 144333, 143831, 142601, 141934, 142505, 143517, 143758, 142956, 141789, 140943, 140510]
54211A40510l44m82n21l29j01RJ14K57J43l28n86l1Q97J063J61p82p00K45J079
54192A40274J168O52j6m83o22n04k42J48O12R05Q83Q03R52J108Q61L71J56J83
54174A47209r4o23n92K61R44N04n84j062n80Po7o35j063j025o17m0N08Q31P57
54155A44039K74l68p37n44J35R21J428J388O61n42j574j843j452r94o97k66L16
54138A40145M81m2n23q4R98J483P71l22n97J45J120J633J680J489J022J97o10
54121A48986p91k46M81Q65R57J071J209J087O48K37K45O65J026P96Ln95k95O13
54103A56962J098P02L4k35k65m06l04N50J706K154J709J211J308J855K659L952
54087A74690N683O910O530M356J241j617l371l853l585l248k967k402j544r79
$$ y = [140510, 140166, 139684, 139163, 138834, 138733, 138742, 138856, 139113, 139256, 138928, 138342, 138311, 139208, 140271, 140432, 139650, 138950, 139195, 140274, 141442, 142094, 142078, 141595, 140973, 140469, 140227, 140375, 140987, 141892, 142775, 143578, 144530, 145638, 146499, 146870, 147026, 147209, 147115, 146492, 145900, 146161, 147105, 147609, 147025, 145963, 145383, 145390, 145323, 144688, 143625, 142600, 141983, 141943, 142451, 143282, 144039, 144313, 143945, 143208, 142664, 142799, 143720, 145148, 146536, 147197, 146655, 145081, 143238, 141786, 140792, 140095, 139829, 140145, 140626, 140584, 140061, 139977, 140975, 142458, 143229, 142907, 142310, 142455, 143575, 145208, 146888, 148377, 149399, 149596, 148986, 148195, 147949, 148430, 149295, 150252, 151323, 152532, 153619, 154267, 154504, 154749, 155414, 156440, 157236, 157239, 156644, 156349, 156962, 158060, 158762, 158796, 158561, 158296, 157890, 157586, 158136, 159842, 161996, 163705, 164916, 166224, 168079, 170738, 174690, 180373, 187283, 193813, 198169, 199410, 197793, 194422, 190569, 186984, 183736, 180769, 178367, 176823, 175844]
54073A75844j137j600j529o24O22J458J486Q72J08m69r36j469j843j522l14J261
54057A70208K395K612K065J347J057J331J811K164K516L176M101M995N782O608
54043B12168P360P563O925N720M611M190M569N185N193M303L067K072J198J57
54029B74281o66o57r6N6m49q12m70Lj67q15j153r56q31j325k241k900l010l028
54011B54764l535m290m325l273k152k229l401m386m350l686l079k659k226j725
53997B09448j189p02n80j122k042k643k664k429k070j292j95M22M3p85j160r23
53981A90117o24p00j055j289j031k30P25J334J506J519J536J492J424J444J350
53966A97518Q23P9k32J31P71J392K207L385M674N774O635P190P384P590Q510J0507
$$ y = [175844, 174707, 173107, 171578, 170954, 171576, 173034, 174520, 175392, 175500, 175031, 174095, 172626, 170783, 169261, 168947, 170208, 172603, 175215, 177280, 178627, 179684, 181015, 182826, 184990, 187506, 190682, 194783, 199778, 205560, 212168, 219528, 227091, 234016, 239736, 244347, 248537, 253106, 258291, 263484, 267787, 270854, 272926, 274124, 274281, 273615, 272958, 272862, 272918, 272469, 271657, 271187, 271190, 271023, 270208, 269055, 268099, 267268, 265943, 263702, 260802, 257792, 254764, 251229, 246939, 242614, 239341, 237189, 234960, 231559, 227173, 222823, 219137, 216058, 213399, 211173, 209448, 208259, 207557, 206977, 205855, 203813, 201170, 198506, 196077, 194007, 192715, 192520, 192942, 192985, 192200, 191040, 190117, 189493, 188793, 187738, 186449, 185418, 185188, 185913, 187247, 188753, 190272, 191808, 193300, 194724, 196168, 197518, 198341, 198420, 198188, 198319, 199090, 200482, 202689, 206074, 210748, 216522, 223157, 230347, 237731, 245321, 253831, 264338]
53950B64338J3461J7181K1002K3029K0923J4205N066l487r686j3043j3602j2065
53938C27322r887q151o738n187l778l036k625j780n04M90P89N90K11j0M16J612
53922B89734K837L206K798K442K539K842L251M097N439O746P479P562P131O209
53908C54312M775K940Q72j184k823l589l346k500j792j698j967j951j585j733
53894C38731l039m815n784n850o064o801p074o184m945m490m756m950m895m867
53880B64217m683l936k890k229k100k146k305k803l514m031m224m138l560k386
53866B19272j176o81r46j486k106k846l426l456l064k608j940p95L15M99k01p24
53850A94631l73M21Q41N92n8o34p45m97n04j030j390q57J12L65k74p69m03L56
$$ y = [264338, 277799, 294980, 315982, 339011, 359934, 374139, 379205, 375718, 366032, 352989, 339387, 327322, 317435, 309284, 302546, 297359, 293581, 290545, 287920, 286140, 285636, 286126, 286915, 287505, 287716, 287706, 288122, 289734, 292571, 295777, 298575, 301017, 303556, 306398, 309649, 313746, 319185, 325931, 333410, 340972, 348103, 354312, 359087, 362027, 362899, 361715, 358892, 355303, 351957, 349457, 347665, 345967, 344000, 342049, 340464, 338731, 335692, 330877, 325093, 319243, 313179, 306378, 299304, 293120, 288175, 283685, 278929, 273979, 269084, 264217, 259534, 255598, 252708, 250479, 248379, 246233, 243928, 241125, 237611, 233580, 229356, 225218, 221658, 219272, 218096, 217415, 216469, 214983, 212877, 210031, 206605, 203149, 200085, 197477, 195537, 194742, 195057, 195556, 195355, 194631, 194258, 194679, 195520, 196112, 196054, 195420, 194675, 194178, 193674, 192644, 191254, 190397, 190509, 190874, 190600, 189831, 189428, 189784]
53832A89784O99M23k05q14q55Q3J539K346J926Q58l2n34o73k10Q93J974K273J828
53814B01303J273J006R79J107J441J855K010J777J549J939L111M463N116M806
53800B33735M151L902M080M099L572K712K055K016K572L167L024J949O35l7J45
53785B71777P70J364J514Q13p09k295l141l368l682m242m494m129l546l234l240
53770B40158l437l806m207m251l669k600j469p01n76j000j515j728j659j465j137
53755B06938q20j023j890k573k139r36k06l65n78k06L10L89K65M31O71L71m79
53738A98160j161r97P4J508K480K358J231j09q37p73l38L0K75O38J223J769J944
53721B07475J795J675J715J692J595J730K050J871Q20l99q05m08P3L61Q26J641
$$ y = [189784, 190483, 190906, 190701, 189887, 189032, 189115, 190654, 193000, 194926, 195784, 195752, 195218, 194545, 194335, 195228, 197202, 199475, 201303, 202576, 203582, 204561, 205668, 207109, 208964, 210974, 212751, 214300, 216239, 219350, 223813, 228929, 233735, 237886, 241788, 245868, 249967, 253539, 256251, 258306, 260322, 262894, 266061, 269085, 271034, 271669, 271632, 271777, 272547, 273911, 275425, 276238, 275529, 273234, 270093, 266725, 263043, 258801, 254307, 250178, 246632, 243398, 240158, 236721, 232915, 228708, 224457, 220788, 218188, 216719, 216018, 215442, 214442, 212927, 211199, 209540, 208075, 206938, 206118, 205095, 203205, 200632, 198493, 197557, 197351, 196986, 196408, 196202, 196512, 196901, 197166, 197597, 198268, 198639, 198160, 196999, 196002, 196076, 197584, 200064, 202422, 203653, 203544, 202707, 201934, 201596, 201626, 201901, 202539, 203762, 205531, 207475, 209270, 210945, 212660, 214352, 215947, 217677, 219727, 221598, 222418, 222019, 221214, 220806, 220879, 221240, 222066, 223707]
53705B23707K516L145L346K933K086J612K019K560K190J282J277K586L999M395
53691B59653L958L273K302R05m24j075j057p57m42l46o99j236j291o74RK73L72
53674B62744O33Q29O04L1o57j359j800j553p57k04k57l09J64P11O16m1p02j161
53656B57532j430j228m12M43O02J33k83l00r2J57L96M42J90m2K13R67J825K473
53638B61586K750K527J907J381J341J559J584J442J558K073K658K978L000K874
53624B91218K776K792K847K841K929L366L974M168L729L187L067L165K922K264
53610C35245J698J735K479L529M137L844L108K870L248L314K520J617J497J799
53596C72640J539P12J91K31J22n24j078q64j19L71K06m60j288j981k301k170j737
$$ y = [223707, 226223, 229368, 232714, 235647, 237733, 239345, 241364, 243924, 246114, 247396, 248673, 251259, 255258, 259653, 263611, 266884, 269186, 270091, 269667, 268592, 267535, 266778, 266336, 265990, 265291, 264055, 262764, 262090, 262099, 262372, 262744, 263377, 264206, 264810, 264841, 264184, 262825, 261025, 259472, 258715, 258511, 258254, 257945, 258109, 258820, 259436, 259395, 258693, 257532, 256102, 254874, 254462, 254905, 255507, 255640, 255357, 255057, 254965, 255122, 255518, 255960, 256150, 256108, 256321, 257288, 259113, 261586, 264336, 266863, 268770, 270151, 271492, 273051, 274635, 276077, 277635, 279708, 282366, 285344, 288344, 291218, 293994, 296786, 299633, 302474, 305403, 308769, 312743, 316911, 320640, 323827, 326894, 330059, 332981, 335245, 336943, 338678, 341157, 344686, 348823, 352667, 355775, 358645, 361893, 365207, 367727, 369344, 370841, 372640, 374179, 374891, 375082, 375313, 375435, 374911, 373833, 372969, 372850, 373221, 373427, 372967, 371679, 369698, 367397, 365227, 363490]
53579C63490j206p20m03l64n78q49r42q12o81q60j344j646j260l59K58J16l75
53562C51465n27k44K1P6K32P30J208J000j9j106j358p37r7J7Q3P72J708J883J128
53543C56235L73L28P37J209J914K974L851M027L865M155N110O294P279P884Q048
53528D14283P927P937Q349R043R851J0759J1567J1811J1465J1226J1636J2377
53516E38231J2901J3364J4316J5823J7480J9072K0656K2144K3295K4023K4333
53505G45638K4156K3533K2668K1595K0169J8666J7759J7497J7060J6052J5316
53494I60109J5628J6330J6294J5693J5615J6270J6779J6731J6649J6830J6825
53483A139753J6391J6020J6085J6292J6261J5991J5431J4323J2755J1204R693
$$ y = [363490, 362284, 361564, 361161, 360797, 360219, 359370, 358428, 357616, 356935, 356075, 354731, 353085, 351825, 351466, 351724, 351840, 351465, 350938, 350694, 350715, 350791, 351023, 351753, 352961, 353961, 353942, 352836, 351478, 350741, 350644, 350661, 350744, 351516, 353224, 355107, 356235, 356608, 356936, 357673, 358882, 360796, 363770, 367621, 371648, 375513, 379668, 384778, 391072, 398351, 406235, 414283, 422210, 430147, 438496, 447539, 457390, 468149, 479716, 491527, 502992, 514218, 525854, 538231, 551132, 564496, 578812, 594635, 612115, 631187, 651843, 673987, 697282, 721305, 745638, 769794, 793327, 815995, 837590, 857759, 876425, 894184, 911681, 928741, 944793, 960109, 975737, 992067, 1008361, 1024054, 1039669, 1055939, 1072718, 1089449, 1106098, 1122928, 1139753, 1156144, 1172164, 1188249, 1204541, 1220802, 1236793, 1252224, 1266547, 1279302, 1290506, 1300199]
53472A300199P584M694J885Qj296l120n856q797j1006j2142j2426j2214j1740
53459A235773j1201j0952j1409j2677j4373j6011j7394j8387j8652j8086j7327
53448A069304j7195j7554j7425j6343j5032j4404j4327j3854j2325r893p133m588
53436I09231k671j602j286j326j368j304j136p44J6J004J884K728M020N810P258
53421I20514P708P893R135J1424J3363J4262J5117J6955J9314K1199K2615K4081
53409A103580K5378K5956K6125K6709K7848K9184L0897L3390L6204L8449M0178
53398A443898M2134M4231M5576M6063M6597M7570M8369M8653M8864M9058M8543
53387A959556M7261M6266M6055M5595M3895M1550L9676L8165L6146L3496L0651
$$ y = [1300199, 1307783, 1312477, 1314362, 1314370, 1313074, 1309954, 1304098, 1295301, 1284295, 1272153, 1259727, 1247513, 1235773, 1224572, 1213620, 1202211, 1189534, 1175161, 1159150, 1141756, 1123369, 1104717, 1086631, 1069304, 1052109, 1034555, 1017130, 1000787, 985755, 971351, 957024, 943170, 930845, 920952, 913819, 909231, 906560, 904958, 903672, 902346, 900978, 899674, 898538, 897794, 897810, 898814, 900698, 903426, 907446, 913256, 920514, 928222, 936115, 945250, 956674, 970037, 984299, 999416, 1016371, 1035685, 1056884, 1079499, 1103580, 1128958, 1154914, 1181039, 1207748, 1235596, 1264780, 1295677, 1329067, 1365271, 1403720, 1443898, 1486032, 1530263, 1575839, 1621902, 1668499, 1716069, 1764438, 1813091, 1861955, 1911013, 1959556, 2006817, 2053083, 2099138, 2144733, 2188628, 2230178, 2269854, 2308019, 2344165, 2377661, 2408312]
53376B408312K7370K2937J7641J2843R388O659L435r39o358j2384j8534k4508
53364B445862l0273l5720m0246m3031m3845m3434m2961m3091m3609m3746m2878
53353A993028m0976l8474l5858l3542l1926l1315l1692l2776l4285l5853l6912
53342A609419l6993l6158l4765l2873l0327k7423k4937k3303k2217k1156j9844
53331A299423j8170j6141j4150j2842j2521j2984j3971j5336j6720j7602j7769
53320A131217j7289j6094j4213j2375j1453j1104r977p600n120l607k628j332
53308A018425K0O12O44J071K142L297M452O214Q679J1006J2484J3415J4503J6016
53294A112980J7839J9947K2306K4468K5690K5500K4163K2553K1399K0596J9391
$$ y = [2408312, 2435682, 2458619, 2476260, 2489103, 2498491, 2505150, 2508585, 2507646, 2501288, 2488904, 2470370, 2445862, 2415589, 2379869, 2339623, 2296592, 2252747, 2209313, 2166352, 2123261, 2079652, 2035906, 1993028, 1952052, 1913578, 1877720, 1844178, 1812252, 1780937, 1749245, 1716469, 1682184, 1646331, 1609419, 1572426, 1536268, 1501503, 1468630, 1438303, 1410880, 1385943, 1362640, 1340423, 1319267, 1299423, 1281253, 1265112, 1250962, 1238120, 1225599, 1212615, 1198644, 1183308, 1166588, 1148986, 1131217, 1113928, 1097834, 1083621, 1071246, 1059793, 1048689, 1038712, 1031112, 1025992, 1022385, 1019757, 1018425, 1018445, 1019057, 1019701, 1020772, 1022914, 1026211, 1030663, 1036877, 1045556, 1056562, 1069046, 1082461, 1096964, 1112980, 1130819, 1150766, 1173072, 1197540, 1223230, 1248730, 1272893, 1295446, 1316845, 1337441, 1356832]
53283A356832J7426J5306J3904J3295J2669J1191Q623N248J571j963n173q080
53271A440849j0549j2228j3106j3864j5247j7205j9040k0282k1079k1706k2163
53260A254380k2326k2278k2304k2653k3303k3879k3900k3260k2312k1430k0651
53249A006084j9901j9322j9134j9372j9939k0744k1554k1926k1607k0803j9874
53238G81908j8914j7949j7220j6877j6550j5621j3917j1872j0122r098q768q532
53226F16468p739o609o303p516r447j0751j1221j1726j2678j3538j3944j4262
53214D90734j4664j4549j3454j1876j0556r500q435p688p711p976p364n782m493
53201C66686m550n542o407o847p302p878q023p321o025m744l895l595l733l995
$$ y = [1356832, 1374258, 1389564, 1403468, 1416763, 1429432, 1440623, 1449246, 1454494, 1456065, 1454102, 1448929, 1440849, 1430300, 1418072, 1404966, 1391102, 1375855, 1358650, 1339610, 1319328, 1298249, 1276543, 1254380, 1232054, 1209776, 1187472, 1164819, 1141516, 1117637, 1093737, 1070477, 1048165, 1026735, 1006084, 986183, 966861, 947727, 928355, 908416, 887672, 866118, 844192, 822585, 801782, 781908, 762994, 745045, 727825, 710948, 694398, 678777, 664860, 652988, 642866, 633768, 625000, 616468, 608729, 602120, 595817, 588301, 578854, 568103, 556882, 545156, 532478, 518940, 504996, 490734, 476070, 461521, 448067, 436191, 425635, 416135, 407700, 400012, 392301, 384325, 376961, 371179, 366686, 362136, 356594, 350187, 343340, 336038, 328160, 320137, 312816, 306791, 302047, 298152, 294557, 290824, 286829]
53187B86829m067l921l730l493l045k481k190k293k390k104j510q81l37l7k59
53172B54091r08j349j173q10q48j141j194j130j436j994k174j891j705j795j701
53157B32842j266j001j193j390j174p61m32m2M44O24K98j07k33l17n19m29J42
53140B25486N75L79J39O08J351J346N80K8J37L63L01K21L20K84Oo3L48Q15Q63
53121B34087O75P67J303K004K510K546K082J456J094R73O53p3q81j444j788k063
53105B43901k282k529k939l221k677j176L24P49J73m44n97o73r98j164o98Q3M29
53088B26261J33k92l64j41P2J01j48o86j176j021j17P32O66j07n70k66J94J86
53070B23457j1J56N16L77m12j241j554j387j041o41k83k05n13q90q70l60K78O91
$$ y = [286829, 282762, 278841, 275111, 271618, 268573, 266092, 263902, 261609, 259219, 257115, 255605, 254724, 254387, 254350, 254091, 253183, 251834, 250661, 249851, 249003, 247862, 246668, 245538, 244102, 242108, 239934, 238043, 236338, 234543, 232842, 231576, 230575, 229382, 227992, 226818, 226057, 225625, 225583, 226027, 226651, 226949, 226842, 226609, 226292, 225773, 225344, 225486, 226061, 226440, 226579, 227187, 228538, 229884, 230464, 230492, 230629, 230992, 231293, 231514, 231834, 232118, 232124, 232061, 232409, 233224, 234087, 234762, 235529, 236832, 238836, 241346, 243892, 245974, 247430, 248524, 249497, 250150, 250077, 249196, 247752, 245964, 243901, 241619, 239090, 236151, 232930, 230253, 229077, 229401, 230150, 230323, 229879, 229282, 228609, 227611, 226447, 225749, 225832, 226261, 226394, 226102, 225738, 225597, 225669, 225770, 225622, 224936, 223760, 222739, 222622, 223354, 224020, 223913, 223343, 223077, 223271, 223457, 223446, 223602, 224118, 224495, 224083, 222842, 221288, 219901, 218860, 218219, 217936, 217731, 217218, 216328, 215458, 215098, 215376, 216067]
53052B16067Q69R65J010J023J197J653J982J493J10j292j833j634j444j470j196
53037B17500m07L29M53J86J08L21M83M49M39O11P83O24J2p99j308j146l53O83
53019B18968J541J926J692R76K52m8O6L68Q29J364J455O86l98p39j80L69L07J23
53001B29557L91Q07Q00M44J08k77q64j257q77K00J359K100K140J309l5q71n28
52984B34506M10Q10M25m5p3K35P03J347K039K475K637K766K880K707K131J343
52968B57296N34j99p59j112j352j406r57k9P20P06J73k89o02j027j482j685j787
52951B46743k068k266j908j159o00l16OK32o3o65q77o83p81j340j638j267p93
52934B30557p65r06p25l11J6K61M95M90Q7m46p81r17r17o67k23M7rJ5M74J075
$$ y = [216067, 216936, 217901, 218911, 219934, 221131, 222784, 224766, 226259, 226369, 225077, 223244, 221610, 220166, 218696, 217500, 217093, 217422, 217875, 218061, 218169, 218490, 218973, 219422, 219861, 220472, 221255, 221879, 221891, 221092, 219784, 218638, 218285, 218968, 220509, 222435, 224127, 225103, 225355, 225307, 225373, 225741, 226570, 227934, 229389, 230075, 229677, 228938, 228758, 229127, 229434, 229557, 229948, 230755, 231555, 231999, 232107, 231830, 230966, 229709, 228832, 229032, 230391, 232491, 234631, 235940, 235905, 235034, 234506, 234916, 235726, 236151, 236106, 236033, 236268, 236971, 238318, 240357, 242832, 245469, 248235, 251115, 253822, 255953, 257296, 257830, 257631, 256872, 255760, 254408, 253002, 252045, 252016, 252736, 253442, 253615, 253326, 252724, 251697, 250215, 248530, 246743, 244675, 242409, 240501, 239342, 238742, 238426, 238432, 238664, 238601, 237936, 237059, 236376, 235595, 234255, 232617, 231350, 230557, 229792, 228886, 228161, 227850, 227866, 228127, 228622, 229112, 229199, 228753, 227972, 227055, 226138, 225471, 225248, 225295, 225286, 225301, 225775, 226850]
52914B26850J243Q44K94L3J43K88j5q61j624j576q10j15R5K00N55Q59O96K15j40
52895B27174k69l84o14q99j096r22j29J053J906J937J368P31K60r6l13k55R4N19
52877B30065O57L07k32k54N41J499J728J284J005J237J432J178Q37Q26R40Q25
52861B43875N85M45K77p6m29o75j151k053k910l145k893k738k921l239l520l603
52845B15829l144j961o07k7n29j422j706r57L73J404J542R77M49M38Q03J126J131
52828B13719O21m57j644k143j733j103r14q92m48K35M76K72L90J099J617J237
52812B10332M49L68J260K193K203J326L09l78q22j157j262j082q10n70k20K48
52796B12387M39R3m05n26l80m27o41n76k04k4k51m59k57K57Q42J460K016K227
$$ y = [226850, 228093, 228937, 229231, 229264, 229407, 229695, 229680, 228819, 227195, 225619, 224809, 224694, 224789, 224989, 225544, 226403, 227099, 227314, 227174, 226905, 226521, 225907, 225008, 223912, 222990, 222861, 223914, 225820, 227757, 229125, 229856, 230116, 230020, 229707, 229452, 229546, 230065, 230722, 231029, 230797, 230543, 231084, 232583, 234311, 235595, 236600, 237837, 239269, 240447, 241284, 242110, 243050, 243875, 244460, 244905, 245182, 245106, 244677, 244002, 242851, 240798, 237888, 234743, 231850, 229112, 226191, 222952, 219432, 215829, 212685, 210724, 210117, 210090, 209561, 208139, 206433, 205476, 205849, 207253, 208795, 209772, 210221, 210659, 211462, 212588, 213719, 214340, 213883, 212239, 210096, 208363, 207260, 206346, 205454, 205006, 205241, 205717, 205989, 206379, 207478, 209095, 210332, 210781, 211149, 212409, 214602, 216805, 218131, 218440, 218062, 217240, 216083, 214821, 213739, 212929, 212359, 212139, 212387, 212826, 212919, 212514, 211988, 211608, 211181, 210540, 209964, 209760, 209736, 209485, 209026, 208769, 209026, 209868, 211328, 213344, 215571]
52778B15571J961J399P76K80J61M58O65K18o40j127j088j120j449j507r67l87
52762B13204l32n71o03m33k57L1N03Q45Q64Q76J119J251R05L57J31L70R56J792
52744B21008K583K823K509K272K415K405J859J296J207J105L49n95p24N6R54J463
52728B42985J619J346N27m04q67j041j573k418k833k540k063j794j456p81q4J08
52712B28731l90j285j907j541j48J279J597Q43J76M25J146J288M77n58p57O5R21
52695B30362Q51K41K48R43J042o9j208j129l69j83n07m33j17n79j710k113j143
52678B24127K28R00P99K53n11r92n84L40O50J10k44J48M48k2m64J70J415J939
52660B28710J415P79Q90J694K619L135L019K488J991J591R05j06q15p60l49k33
$$ y = [215571, 217532, 218931, 219707, 219987, 220148, 220606, 221271, 221489, 220849, 219722, 218634, 217514, 216065, 214558, 213591, 213204, 212872, 212301, 211698, 211265, 211008, 211039, 211542, 212387, 213251, 214127, 215246, 216497, 217402, 217759, 217890, 218260, 219216, 221008, 223591, 226414, 228923, 231195, 233610, 236015, 237874, 239170, 240377, 241482, 241831, 241236, 240512, 240568, 241522, 242985, 244604, 245950, 246477, 246073, 245206, 244165, 242592, 240174, 237341, 234801, 232738, 230944, 229488, 228707, 228623, 228731, 228341, 227056, 225149, 223608, 223460, 224739, 226336, 227179, 227355, 227780, 228926, 230214, 230691, 230133, 229376, 229441, 230362, 231213, 231454, 231702, 232645, 233687, 233618, 232410, 231281, 230912, 230729, 230222, 229789, 229672, 229093, 227383, 225270, 224127, 224355, 225255, 226054, 226307, 225796, 224804, 224220, 224560, 225210, 225320, 225076, 225224, 225672, 225650, 225186, 225356, 226771, 228710, 230125, 230904, 231794, 233488, 236107, 239242, 242261, 244749, 246740, 248331, 249236, 249130, 248315, 247555, 247206, 246973]
52644B46973m11n04n72j024j887k673k921k533j675o98N1N08R35J458J869J966
52628B38862J829J560J086M39j90p75j460k016j853r10l5l6p17j256j189o38M1
52611B32742M74M29J21O1L74O58P97J230K056K475J826O22j68l95n49p08n82l59
52593B41104n07q19n66L52J186J435J381J386J371J251J230J360J365J158R71
52578B53658P35N9q94j185l49P10P64j20p96o45k43l75j019j567j585j153o36
52561B45359l72l73l13K4L40J35n56j151j317j332j415j226m97L11N73M66O45
52544B39301J061R12n2r90j107o37k45ML75P28P96Q90J547K490K781K091J089
52527B51034M33j3n84j084j106p27m09l40k13K99J048J430J042J80l53q0P56J781
$$ y = [246973, 246562, 246058, 245486, 244462, 242575, 239902, 236981, 234448, 232773, 232075, 232126, 232634, 233569, 235027, 236896, 238862, 240691, 242251, 243337, 243776, 243586, 242811, 241351, 239335, 237482, 236572, 236537, 236501, 235784, 234528, 233339, 232701, 232742, 233216, 233645, 233766, 233827, 234201, 234859, 235656, 236886, 238942, 241417, 243243, 243865, 243697, 243302, 242753, 242045, 241463, 241104, 240597, 239778, 239212, 239564, 240750, 242185, 243566, 244952, 246323, 247574, 248804, 250164, 251529, 252687, 253658, 254393, 254452, 253558, 252373, 252024, 252734, 253498, 253378, 252582, 251937, 251694, 251319, 250300, 248733, 247148, 245995, 245359, 244987, 244614, 244301, 244325, 244665, 244800, 244244, 243093, 241776, 240444, 239029, 237803, 237306, 237617, 238190, 238656, 239301, 240362, 241274, 241222, 240232, 239125, 238488, 238243, 238247, 238622, 239350, 240146, 241036, 242583, 245073, 247854, 249945, 251034, 251467, 251454, 250870, 249786, 248680, 247953, 247544, 247204, 246991, 247290, 248338, 249768, 250810, 250990, 250637, 250557, 251313, 253094]
52509B53094L057M534N433M917L289J716O94l91j932l297l775l620l487l375k885
52494B53972k161j771j794j710j261q54r39j358j499r85n1O89Q70P50Q87J469
52478B44254K111K320J926J057O2m70q7R26J610J348N49O2J93O03R65J370K069
52461B60868L059L913M036L175J748M32n41j393k178k578k455k154k041k104k199
52446B59588k279k199j774j263j270j853k251j886j160p83p46n55j05K90N01O35
52430B42890O63N08L71M86O85O61N21N88Q30R55R44J053J310J527J690J974K386
52413B60042K786L196L773M586N710P342R438J1438J2699J2941J1908R067M318
52400C59244j156n602q215r389r619q994p825o828o303n745m667l296k151j344
$$ y = [253094, 256151, 260685, 266118, 271035, 274324, 276040, 276734, 276343, 274411, 271114, 267339, 263719, 260232, 256857, 253972, 251811, 250040, 248246, 246536, 245275, 244421, 243482, 242124, 240625, 239640, 239589, 240278, 241148, 241898, 242785, 244254, 246365, 248685, 250611, 251668, 251730, 251260, 251173, 252099, 253709, 255057, 255606, 255668, 255861, 256464, 257429, 258799, 260868, 263927, 267840, 271876, 275051, 276799, 277231, 276690, 275297, 273119, 270541, 268086, 265932, 263891, 261787, 259588, 257309, 255110, 253336, 252073, 250803, 248950, 246699, 244813, 243653, 242870, 242124, 241569, 241464, 241754, 242255, 242890, 243553, 244061, 244432, 244918, 245603, 246264, 246785, 247373, 248203, 249158, 250102, 251155, 252465, 253992, 255682, 257656, 260042, 262828, 266024, 269797, 274383, 280093, 287435, 296873, 308311, 321010, 333951, 345859, 354926, 359244, 358088, 352486, 344271, 334882, 325263, 316269, 308444, 301616, 295313, 289568, 284901, 281605, 279454, 278110]
52386B78110p20k78p3Q1M40R90J548K055K503K748K652K393K421L024M004M840
52370C06738N192N205N191N074M406K985J162n12j661j992j374l10K48ok58K96
52354C30384J313J921K007K012J852J099J13j37N09J173J370J726K776M011M656
52339C56785M801N074N670O317O884P546Q438R483J0439J1015J1292J1910J3404
52326D69058J5288J6509J6925J7511J8845K0193K0677K0524K0406K0206J9359
52315F75501J8037J7107J6998J7368J7763J7999J7923J7428J6704J6012J5299
52304H64139J4376J3416J2745J2322J1810J1048J0018Q532O464M154K009j53k720
52291I68160n382p297q251q946r885j0639j0509r463q048o700n474m193k614o32
$$ y = [278110, 277390, 277112, 277039, 277120, 277560, 278550, 280098, 282153, 284656, 287404, 290056, 292449, 294870, 297894, 301898, 306738, 311930, 317135, 322326, 327400, 331806, 334791, 335953, 335441, 333780, 331788, 330414, 330104, 330352, 330346, 330088, 330384, 331697, 333618, 335625, 337637, 339489, 340588, 340701, 340564, 341073, 342246, 343616, 345342, 348118, 352129, 356785, 361586, 366660, 372330, 378647, 385531, 393077, 401515, 410998, 421437, 432452, 443744, 455654, 469058, 484346, 500855, 517780, 535291, 554136, 574329, 595006, 615530, 635936, 656142, 675501, 693538, 710645, 727643, 745011, 762774, 780773, 798696, 816124, 832828, 848840, 864139, 878515, 891931, 904676, 916998, 928808, 939856, 949874, 958406, 964870, 969024, 971033, 970880, 968160, 962778, 955481, 947230, 938284, 928399, 917760, 907251, 897788, 889740, 883040, 877566, 873373, 870759, 870127]
52277H70127J468L189M390N486O942Q807J0807J2684J4157J4896J4747J3935J2898
52264I94533J2056J1739J2083J2834J3463J3617J3364J2917J2365J1740J1179
52253A131890J0776J0450J0045R351P997N640K527m80k679m195n557o864p806
52240A161095q352q947r860j0742j0987j0385r254q110p295o787o300n613m824
52227A053639m121l411k472j479r93j153j204k66J545L131L703L719M297N854
52213A060789P577Q296P745O804O490O873P120O562N458M625M563N099N744O071
52199A149816N922N525N399N824O415O564O238N975O087O243N989N194L810J773
52185A226774o05k605l935n158o747q188q744q730r130j0029j0376r518q072o938
$$ y = [870127, 871595, 874784, 879174, 884660, 891602, 900409, 911216, 923900, 938057, 952953, 967700, 981635, 994533, 1006589, 1018328, 1030411, 1043245, 1056708, 1070325, 1083689, 1096606, 1108971, 1120711, 1131890, 1142666, 1153116, 1163161, 1172512, 1180509, 1186149, 1188676, 1188196, 1185517, 1181322, 1175765, 1168901, 1161095, 1152743, 1143796, 1133936, 1123194, 1112207, 1101822, 1092568, 1084458, 1077163, 1070376, 1064076, 1058463, 1053639, 1049518, 1046107, 1043635, 1042156, 1041163, 1040010, 1038806, 1038540, 1040085, 1043216, 1046919, 1050638, 1054935, 1060789, 1068366, 1076662, 1084407, 1091211, 1097701, 1104574, 1111694, 1118256, 1123714, 1128339, 1132902, 1138001, 1143745, 1149816, 1155738, 1161263, 1166662, 1172486, 1178901, 1185465, 1191703, 1197678, 1203765, 1210008, 1215997, 1221191, 1225001, 1226774, 1226169, 1223564, 1219629, 1214471, 1207724, 1199536, 1190792, 1182062, 1172932, 1162903, 1152527, 1143009, 1134937, 1127999]
52171A127999o125n113l819k624j788j288j047q68m82Q6M55N60R74K058L099K976
52155A115053J564r7j073j421j684j995j995j407m73K13K95M4n0o9o45j918k975
52138A101367k883j930j193j023o49O30K603M647O486Q218J0092J2464J5558J8951
52124A173338K1803K3794K5436K7152K8581K9195K9124K8798K8204K7137K5879
52113A468441K4882K3940K2358K0028J7550J5245J2729R840P267N742M999M174
52101A637195K982J900J207M34r80k946m921o678q536j0908j3760j6603j8847
52088A559539k0106k0270j9434j7782j5566j3102j0695q512o462m370k247l16
52076A420677J337L030N230Q028J0996J3568J5481J6779J7549J7745J7307J6391
$$ y = [1127999, 1121874, 1116761, 1112942, 1110318, 1108530, 1107242, 1106195, 1105327, 1104845, 1104931, 1105386, 1105946, 1106920, 1108978, 1112077, 1115053, 1116617, 1116520, 1115447, 1114026, 1112342, 1110347, 1108352, 1106945, 1106472, 1106685, 1106980, 1107024, 1106974, 1106905, 1106260, 1104342, 1101367, 1098484, 1096554, 1095361, 1094338, 1093689, 1094319, 1096922, 1101569, 1108055, 1116273, 1126365, 1138829, 1154387, 1173338, 1195141, 1218935, 1244371, 1271523, 1300104, 1329299, 1358423, 1387221, 1415425, 1442562, 1468441, 1493323, 1517263, 1539621, 1559649, 1577199, 1592444, 1605173, 1615013, 1622280, 1628022, 1633021, 1637195, 1640177, 1642077, 1643284, 1643718, 1642738, 1639792, 1634871, 1628193, 1619657, 1608749, 1594989, 1578386, 1559539, 1539433, 1519163, 1499729, 1481947, 1466381, 1453279, 1442584, 1434072, 1427610, 1423240, 1420993, 1420677, 1422014, 1425044, 1430274, 1438302, 1449298, 1462866, 1478347, 1495126, 1512675, 1530420, 1547727, 1564118]
52064A564118J5401J4731J4389J3990J3206J2134J1090J0114Q969P551N941M078
52052A695712J743r98l755o410r321j2612j5679j7929j9649k1566k3696k5272
52040A540568k5780k5452k4684k3627k2445k1362k0140j8133j5304j2639j1081
52029A319921j0516j0312j0410j1099j2027j2302j1709j0964j0640j0420r825
52018A199697r066q672q666q662q623q954r816j0857j1704j2451j3424j4737j6244
52005A057821j7765j9154k0290k1171k1895k2354k2112k0900j9169j7689j6574
51994H38748j5193j3377j2106j2417j3870j4834j4336j3001j2034j1971j2677
51983F92932j3889j5215j5973j5733j4850j4017j3407j2667j1643j0601r708q719
$$ y = [1564118, 1579519, 1594250, 1608639, 1622629, 1635835, 1647969, 1659059, 1669173, 1678142, 1685693, 1691634, 1695712, 1697455, 1696457, 1692702, 1686292, 1676971, 1664359, 1648680, 1630751, 1611102, 1589536, 1565840, 1540568, 1514788, 1489336, 1464652, 1441025, 1418580, 1397218, 1377078, 1358945, 1343641, 1331002, 1319921, 1309405, 1299093, 1288683, 1277584, 1265557, 1253255, 1241546, 1230582, 1219942, 1209522, 1199697, 1190631, 1181959, 1173293, 1164631, 1156008, 1147054, 1137238, 1126381, 1114677, 1102226, 1088802, 1074065, 1057821, 1040056, 1020902, 1000612, 979441, 957546, 935192, 913080, 892180, 873011, 855322, 838748, 823555, 810178, 798072, 785655, 771785, 756951, 742615, 729614, 717580, 705609, 692932, 679043, 663828, 647855, 632122, 617272, 603255, 589848, 577181, 565538, 554937, 545229, 536510]
51971E36510p249n200k830n72J281K814M251N473O122O294O565O921O325L973
51957E70678O25k220m074n551o937p773p844p503o764n178k970j265n49K25K229
51942E15129N182P929R964J1525J2724J3459J3952J4415J4356J3002J0456P719
51930F49812N585M079K902J913J027J96m83j024j944l963p265j1332j5388j8689
51916F05426k0605k0952k0220j8988j7275j4881j2169r833p968o026l762j562
51904D51185L03K028L711M954N393N094M168K425k98l773p495j0833j2959j3262
51890D30641j2064j0500r286q034o134l836j989r66l93K85J389L028N045O956
51876C94142Q278Q930R122Q932Q278P130N511L373Q37j530l068l762m284n143
$$ y = [536510, 529261, 524061, 521231, 520659, 521940, 524754, 529005, 534478, 540600, 546894, 553459, 560380, 566705, 570678, 571303, 569083, 565009, 559458, 552521, 544748, 536904, 529401, 522637, 517459, 514489, 513224, 512675, 512900, 515129, 520311, 528240, 538204, 549729, 562453, 575912, 589864, 604279, 618635, 631637, 642093, 649812, 655397, 659476, 662378, 664291, 665318, 665514, 665031, 664007, 662063, 658100, 650835, 639503, 624115, 605426, 584821, 563869, 543649, 524661, 507386, 492505, 480336, 470503, 462535, 456509, 452747, 451185, 451488, 453516, 457227, 462181, 467574, 472668, 476836, 479261, 478963, 475190, 467695, 456862, 443903, 430641, 418577, 408077, 398791, 390757, 384623, 380787, 378798, 377832, 377439, 377724, 379113, 382141, 387186, 394142, 402420, 411350, 420472, 429404, 437682, 444812, 450323, 453696, 454533, 453003, 449935, 446173, 441889, 436746]
51862D36746n972n888m479k269j88J260K232L053L727M002L730K937J649j14k122
51847D38304l939n168n656n472m909m433m418m853n350n502n083m066k651j213
51833C75591J8J142K248L002K966K236J360N77l39j452k303k507k293k174k292
51818C75780k291j746n68P90J561J342O39L56P44J198J098M45m96j489k148k038
51802C73177j334q21q44q06j49P00R11L41n46j470k301k661k255j478r94q27n43
51785C58100j58o6k31k43j72n09j131j231m92M74J209K097L482M881N734O344
51769C78088P355Q660R653J0204J0574J0480R120O322K972pk594n198p660r237
51755D28732r518q949q363q133p949p339o293n209m410l839l273k639j947j133
$$ y = [436746, 430774, 424886, 420407, 418138, 417950, 419210, 421442, 424495, 428222, 432224, 435954, 438891, 440540, 440426, 438304, 434365, 429197, 423541, 418069, 413160, 408727, 404309, 399456, 394106, 388604, 383521, 379455, 376804, 375591, 375609, 376751, 378999, 382001, 384967, 387203, 388563, 389140, 388801, 387349, 385046, 382539, 380246, 378072, 375780, 373489, 371743, 371175, 371965, 373526, 374868, 375507, 375863, 376607, 377805, 378903, 379348, 378852, 377363, 375215, 373177, 371843, 371022, 370178, 369372, 369223, 369923, 370834, 371175, 370629, 369159, 366858, 364197, 361942, 360464, 359470, 358643, 358100, 357942, 357876, 357645, 357402, 357230, 356721, 355590, 354359, 353867, 354341, 355550, 357647, 361129, 366010, 371744, 378088, 385443, 394103, 403756, 413960, 424534, 435014, 444134, 450456, 453428, 453421, 450827, 445629, 437969, 428732, 419214, 410265, 401902, 393769, 385820, 378481, 372188, 366979, 362569, 358730, 355457, 352818, 350871, 349738]
51741C49738j19J058K349L846N587P272Q361Q443P419N471L082R86l00q55r85
51726D01353n46Q28K698L639K564m7k699m365n002m848m038k926k144j953j967
51711C80547j772j498j424j373r11P6J318K584L736M472M380L363J755J32r33
51696C94452j026k15Q87J603J739J410N39j042k959m303m501l909l298l007k824
51681C73546k495k079j796j664j375n84O19J615J812J206L26k04J50J785M523
51666C75385P283Q743Q541P430O148M601K403k48k591l968m123l083j065J629
51652D07085M758P965J0328J0534P900L154k160o802j0237j2261j2803j2122j0772
51639C84567r284p929o710n407l787k016o58l9K51Q77J960K995L511L409K772
$$ y = [349738, 349619, 350677, 353026, 356872, 362459, 369731, 378092, 386535, 393954, 399425, 402507, 403493, 403193, 402338, 401353, 400807, 401635, 404333, 407972, 410536, 410489, 407790, 403425, 398423, 393575, 389537, 386611, 384467, 382514, 380547, 378775, 377277, 375853, 374480, 373569, 373645, 374963, 377547, 381283, 385755, 390135, 393498, 395253, 395385, 394452, 393426, 393211, 394098, 395701, 397440, 398850, 399389, 398347, 395388, 391085, 386584, 382675, 379377, 376370, 373546, 371051, 368972, 367176, 365512, 364137, 363553, 364172, 365787, 367599, 368805, 369131, 368927, 369077, 370862, 375385, 382668, 391411, 399952, 407382, 413530, 418131, 420534, 420286, 417695, 413727, 409604, 406521, 405456, 407085, 411843, 419808, 430136, 440670, 448570, 451724, 449564, 442762, 432525, 420264, 407461, 395339, 384567, 375283, 367354, 360644, 355237, 351450, 349434, 348776, 348737, 348988, 349865, 351825, 354820, 358331, 361740, 364512]
51624C64512J700M03q14j757k371k614k544k447k605k949l190l206l082k758k046
51609C34232j050k95k32p24j155r48J4J350K479L092L411M005N331P414R736J1294
51593C77954J0952Q192L679j011m405o032o399o226n734m722l183j578k70J031
51579C62248K894N365P936J0193J1931J2712J2133J0841J0474J1907J4056J5043
51567D87733J4111J1859R233P226P109R695J4234J9116K3779K8919L4452L8405
51555G05871L8551L4607K8112K0785J3644P181J359m522j1051j7717k3242k6990
51543G66588k9482l1398l2657l2770l1609k9443k6568k3234j9827j6713j4017
51532D78870j1757j0035q732p311n314l077j420n65J6N43L93r02k675l872m386
$$ y = [364512, 366212, 366615, 365801, 364044, 361673, 359059, 356515, 354068, 351463, 348514, 345324, 342118, 339036, 336278, 334232, 333182, 332887, 332655, 331931, 330776, 329828, 329842, 331192, 333671, 336763, 340174, 344179, 349510, 356924, 366660, 377954, 388906, 397098, 400777, 399766, 395361, 389329, 382930, 376704, 370970, 366248, 363065, 361487, 361217, 362248, 365142, 370507, 378443, 388636, 400567, 413279, 425412, 436253, 446727, 458634, 472690, 487733, 501844, 513703, 522936, 530162, 537271, 546966, 561200, 580316, 604095, 633014, 667466, 705871, 744422, 779029, 807141, 827926, 841570, 848751, 850110, 845588, 834537, 816820, 793578, 766588, 737106, 705708, 673051, 640281, 608672, 579229, 552661, 529427, 509600, 492887, 478870, 467113, 457078, 448346, 441035, 435721, 432644, 431224, 430659, 430675, 431218, 431611, 430709, 428034, 424162, 419776]
51517D19776m857n385n444n040m943n324n260m140k837k641l553m488m752m427
51503C56685l611k273q70j99m22q62r57p84n35j43L12M26R5j27K73J095J715J806
51485C51624J427P46J3m61o54r87j752k593k890k577k181k132k377k713l037l127
51469C26329k579j379k81j68r97j821j943j622j392j172n83J87N41L87K36K95
51453C14038K28l8P3R20K075L070M096N550P349R303J1468J3459J3979J2024Q250
51438D05844M296J098j221k233j413M36J262j41k918n417o822p177o640n432m036
51423C69486k854j939j366j413k025k559k483j944j346p80k51j6k52o82q88p76
51407C47912m58j8L93N83O87J102J824K250J957J209M87ooR05K594M118M856N463
$$ y = [419776, 414919, 409534, 404090, 399050, 394107, 388783, 383523, 379383, 376546, 373905, 370352, 365864, 361112, 356685, 353074, 350801, 349931, 349732, 349310, 348448, 347491, 346707, 346172, 346029, 346341, 346767, 346862, 346735, 347008, 348103, 349818, 351624, 353051, 353797, 353810, 353349, 352695, 351708, 349956, 347363, 344473, 341896, 339715, 337583, 335206, 332493, 329456, 326329, 323750, 322371, 322090, 321922, 320925, 319104, 317161, 315539, 314147, 312975, 312392, 312579, 313120, 313507, 313743, 314038, 314266, 314228, 314301, 315221, 317296, 320366, 324462, 330012, 337361, 346664, 358132, 371591, 385570, 397594, 405844, 410140, 411238, 410017, 407784, 406371, 406807, 408069, 407928, 405010, 399593, 392771, 385594, 378954, 373522, 369486, 366632, 364693, 363327, 361914, 359889, 357330, 354847, 352903, 351557, 350777, 350526, 350510, 350258, 349576, 348688, 347912, 347454, 347436, 347829, 348412, 349099, 350201, 352025, 354275, 356232, 357441, 357928, 357922, 357916, 358821, 361415, 365533, 370389, 375852]
51389C75852O928R034J0629J1337J2113J3989J7005K0625K4558K8718L2866L6887
51377F00541M1208M6232N0993N2937M9835M2104L2685K4208J6724Q694l93r408
51365I56360j7354k4434l0997l6545m0478m3009m4499m4536m2585l9171l5544
51354E57208l2295k9094k5631k2075j8594j5181j2070r788q541p946p463o895
51342C61635o260n559m726l744k794k219k207k441k360j859j385j227j151r25
51328C22778p30o51l33L78R32P90L04K79Q85J620K065K098J597O53o3R1Q22J128
51310C34643M75p79k034k903l117k585j649q19k22K49M17Mp93j463j934k530l199
51293C11761l417k895j860o20N97J408J571J528K014L072M049M556M707M505L775
$$ y = [375852, 382780, 391814, 402443, 413780, 425893, 439882, 456887, 477512, 502070, 530788, 563654, 600541, 641749, 687981, 738974, 791911, 841746, 883850, 916535, 940743, 957467, 966161, 965768, 956360, 939006, 914572, 883575, 847030, 806552, 763543, 719044, 674508, 631923, 592752, 557208, 524913, 495819, 470188, 448113, 429519, 414338, 402268, 392480, 383939, 375993, 368530, 361635, 355375, 349816, 345090, 341346, 338552, 336333, 334126, 331685, 329325, 327466, 326081, 324854, 323703, 322778, 322048, 321397, 321064, 321442, 322374, 323164, 323468, 323747, 324632, 326252, 328317, 330415, 332012, 332665, 332602, 332693, 333515, 334643, 335118, 334339, 332305, 329402, 326285, 323700, 322051, 321232, 321010, 321259, 321676, 321680, 320887, 319424, 317490, 314960, 311761, 308344, 305449, 303589, 302969, 303566, 304974, 306545, 308073, 310087, 313159, 317208, 321764, 326471, 330976, 334751]
51278C34751K920K715L065K852J447l95j555j736j124J86J856L049L312L157L111
51263C57611K816J794M79l95r46j735k547k666k182j972k388k919l259l716m318
51248C33657m466l882l068k416j546j93R73J135M57k67p88j428k112k163j244
51233C12649J46J306J945K042J545N93k92o16m26j42l3mK03P58J565K197K158
51216C25594J487Q53Q41J225J273O91r8n15l15L91J288J885J864J505J438J851
51200C41258K246K124J548Q74K48k93o12o30n47n85p14p91p79o52l69q1RJ44Q74
51181C43272K050K616J904O85J81M48N70J95j14q4k40r05j522j462r52o12n09
51164C45521j01J013K635M133M828M458L382K175R58n52k292l588l944l649l320
$$ y = [334751, 337671, 340386, 343451, 346303, 347750, 347355, 345800, 344064, 342940, 343126, 344982, 348031, 351343, 354500, 357611, 360427, 362221, 362700, 362305, 361359, 359624, 357077, 354411, 352229, 350257, 347869, 344950, 341691, 337975, 333657, 329191, 325309, 322241, 319825, 318279, 318086, 319059, 320194, 320651, 320384, 319596, 318168, 316056, 313893, 312649, 312795, 314101, 316046, 318088, 319633, 320226, 319934, 319318, 318892, 318750, 318717, 318713, 318916, 319674, 321239, 323436, 325594, 327081, 327934, 328775, 330000, 331273, 331964, 331866, 331351, 331036, 331427, 332715, 334600, 336464, 337969, 339407, 341258, 343504, 345628, 347176, 348050, 348298, 348005, 347393, 346763, 346216, 345631, 344917, 344126, 343347, 342695, 342326, 342245, 342254, 342398, 343272, 345322, 347938, 349842, 350527, 350708, 351156, 351726, 351921, 351807, 351723, 351483, 350578, 349056, 347594, 346642, 346030, 345521, 345420, 346433, 349068, 353201, 358029, 362487, 365869, 368044, 369002, 368450, 366158, 362570, 358626, 354977, 351657]
51149C51657l104k742k172j676j448j355j192r56p92p16n20k4O00R05P29M09L00
51132C37903L02J73J00M17R70J347J646K337L284L643L003K012J493J504J613
51117C61747J599J448J121P69P86J218J506J280R27R00R32O45M18P80J239Q11
51101C78126l16p05L24J624J735P63k9n3O6k63o92n35K30J005J326J216Q69L94
51083C85085p4l14k96k34k16L3P12J465J719J456J207J328J696K217L018L924
51067D02726M349M150M116N085O912Q991J1415J4692J8217K0020J8522J4210R193
51054E42598N566M427N937R437J3389J5868J5709J3334J0315P952O086L393j099
51041F52912o787j1862j4781j5067j3038r459n740l717m446p261j0415j2576j3390
$$ y = [351657, 348553, 345811, 343639, 341963, 340515, 339160, 337968, 337012, 336220, 335504, 334984, 334960, 335560, 336465, 337194, 337603, 337903, 338205, 338378, 338478, 338895, 339865, 341212, 342858, 345195, 348479, 352122, 355125, 357137, 358630, 360134, 361747, 363346, 364794, 365915, 366684, 367470, 368688, 370194, 371474, 372401, 373301, 374233, 374878, 375296, 376076, 377315, 378126, 377810, 377105, 377429, 379053, 380788, 381551, 381522, 381469, 381535, 381272, 380580, 380045, 380275, 381280, 382606, 383822, 384691, 385085, 385011, 384697, 384401, 384167, 383951, 383984, 384696, 386161, 387880, 389336, 390543, 391871, 393567, 395784, 398802, 402726, 407075, 411225, 415341, 420426, 427338, 436329, 447744, 462436, 480653, 500673, 519195, 533405, 542598, 548164, 552591, 558528, 567965, 581354, 597222, 612931, 626265, 636580, 644532, 650618, 654011, 652912, 646125, 634263, 619482, 604415, 591377, 581918, 576178, 572461, 568015, 560754, 550339, 537763, 524373]
51028E24373j2920j1293q966o673m798l195j754o96MQ24J965K914L335L909N455
51013D92484P514Q689Q515Q035Q279R021R549R943J0813J2199J3446J4108J4403
51000F26998J4790J5552J6733J8089J9070J9149J8100J5775J1882O474N36m540
50988G78608q093j0349j1395j0660p677k915K465P358J0913J2520J2202J0917
50976G83894R947R891J0624J2145J4899J9037K3853K8416L2575L6868M1563M6310
50964A070022N0757N4982N8983O2314O4623O6137O7075O6933O5043O1588N7314
50953A745771N2400M6517M0065L4309K9921K6255K2592J9333J7300J6629J6928
50942B068020J7878J8876J8686J6511J3037R632O784M123J461j292m935j0427
$$ y = [524373, 511453, 500160, 491194, 484521, 479723, 476528, 474774, 474078, 474082, 474906, 476871, 479785, 483120, 487029, 492484, 499998, 508687, 517202, 525237, 533516, 542537, 552086, 562029, 572842, 585041, 598487, 612595, 626998, 641788, 657340, 674073, 692162, 711232, 730381, 748481, 764256, 776138, 782612, 783148, 778608, 770515, 760166, 748771, 738111, 730434, 727519, 729984, 737342, 748255, 760775, 772977, 783894, 793841, 803732, 814356, 826501, 841400, 860437, 884290, 912706, 945281, 982149, 1023712, 1070022, 1120779, 1175761, 1234744, 1297058, 1361681, 1427818, 1494893, 1561826, 1626869, 1688457, 1745771, 1798171, 1844688, 1884753, 1919062, 1948983, 1975238, 1997830, 2017163, 2034463, 2051092, 2068020, 2085898, 2104774, 2123460, 2139971, 2153008, 2162640, 2169424, 2173547, 2175008, 2173716, 2168781, 2158354]
50930B158354j7416k4346l0325l5953m2163m9022n5930o2158o6908o9615p0515
50919A634003p0399o9556o7664o4730o1307n7491n2653m6672m0688l5947l2420
50908A034476k9164k5708k2513k0244j8920j7808j6085j3783j1831j0866j0326
50897H37228r302p907o841n963m457k469j165r74j018p42p14j169j147K1J532
50882G94913K475L276M632N964O313O061O375P409Q342Q840R280R888J0711J2191
50868H96670J4493J6556J7173J6938J7841K0856K5040K9128L2843L6398L9883
50857A163819M3582M8072N3529N9660O6544P4720Q4140R3729J02408J10005J16936
50846B017144J23616J30385J37311J43696J48285J50263J49557J46016J38956
$$ y = [2158354, 2140938, 2116592, 2086267, 2050314, 2008151, 1959129, 1903199, 1841041, 1774133, 1704518, 1634003, 1563604, 1494048, 1426384, 1361654, 1300347, 1242856, 1190203, 1143531, 1102843, 1066896, 1034476, 1005312, 979604, 957091, 936847, 917927, 900119, 884034, 870251, 858420, 847554, 837228, 827926, 820019, 813178, 807215, 802758, 800289, 799124, 798150, 797132, 796390, 795676, 794507, 793360, 793381, 794913, 797388, 800664, 805296, 811260, 817573, 823634, 830009, 837418, 845760, 854600, 863880, 873768, 884479, 896670, 911163, 927719, 944892, 961830, 979671, 1000527, 1025567, 1054695, 1087538, 1123936, 1163819, 1207401, 1255473, 1309002, 1368662, 1435206, 1509926, 1594066, 1687795, 1790203, 1900208, 2017144, 2140760, 2271145, 2408456, 2552152, 2700437, 2850700, 3000257, 3146273, 3285229]
50837C285229J27885J13238R6120P7811N9742M3293K9184J7289P400k19n080o809
50825C845083m988O86R684K0345L0681L9232M4899M6436M2553L2559J6766l454
50813D120482k5993m8827p0879r2062j12430j31544j48573j62528j72327j77166
50803B978153j77172j73300j66412j56827j44945j31798j18470j05253r1920p8663
50793A633393o6312n5579m6435l8411l1285k5282k0587j6860j3479j0295p863
50782A301005o693o505o518o311o077o146o567p181p741q034q174q675r915j1593
50768A194875j3064j4113j5002j5883j6642j7240j7705j7781j7062j5576j3833
50757A020974j2242j0775r223p428n379l359j821o30J227M480Q321J1265J3155
$$ y = [3285229, 3413114, 3526352, 3622472, 3700283, 3760025, 3803318, 3832502, 3849791, 3857191, 3856972, 3851892, 3845083, 3840095, 3840781, 3850465, 3870810, 3901491, 3940723, 3985622, 4032058, 4074611, 4107170, 4123936, 4120482, 4094489, 4045662, 3974783, 3882721, 3770291, 3638747, 3490174, 3327646, 3155319, 2978153, 2800981, 2627681, 2461269, 2304442, 2159497, 2027699, 1909229, 1803976, 1712056, 1633393, 1567081, 1511502, 1465067, 1426656, 1395371, 1370089, 1349502, 1332642, 1319163, 1308868, 1301005, 1294312, 1287807, 1281289, 1274978, 1268901, 1262755, 1256188, 1249007, 1241266, 1233232, 1225058, 1216383, 1206468, 1194875, 1181811, 1167698, 1152696, 1136813, 1120171, 1102931, 1085226, 1067445, 1050383, 1034807, 1020974, 1008732, 997957, 988734, 981306, 975927, 972568, 970747, 970117, 971344, 975824, 984145, 995410, 1008565]
50744A008565J5402J9067K3724K8526L3302L8049M2299M5843M9387N3668N8343
50733A416175O2559O6116O9304P1856P3101P3041P2488P1978P1250O9952O8161
50722B185981O5863O2382N6801M8751L8499K6486J3174n01j2949k2490k8211l0113
50710B403673k8593k4047j7066q655R1Q374J5670K1599K6005K8816K9425K6572
50698B481864J9313P915o634k3524m1866n9916p5611q7893r6757j01987j02979
50687A911925r9960r4386q7645q0092p1773o3225n4963m6856l8650l0617k3131
50676A220627j6078r255k908K630P456J1737J5210J7533J8758J9058J8340J6659
50664A319767J4573J2685J1188J0224J0110J0618J0736R851Q809Q934J0333J1933
$$ y = [1008565, 1023967, 1043034, 1066758, 1095284, 1128586, 1166635, 1208934, 1254777, 1304164, 1357832, 1416175, 1478734, 1544850, 1614154, 1686010, 1759111, 1832152, 1904640, 1976618, 2047868, 2117820, 2185981, 2251844, 2314226, 2371027, 2419778, 2458277, 2484763, 2497937, 2497436, 2484487, 2461997, 2433786, 2403673, 2375080, 2351033, 2333967, 2325312, 2325403, 2333777, 2349447, 2371046, 2397051, 2425867, 2455292, 2481864, 2501177, 2509092, 2502458, 2478934, 2437068, 2377152, 2301541, 2213648, 2116891, 2014904, 1911925, 1811965, 1717579, 1629934, 1549842, 1478069, 1414844, 1359881, 1313025, 1274375, 1243758, 1220627, 1204549, 1195294, 1192386, 1195016, 1202472, 1214209, 1229419, 1246952, 1265710, 1284768, 1303108, 1319767, 1334340, 1347025, 1358213, 1368437, 1378547, 1389165, 1399901, 1409752, 1418561, 1427495, 1437828, 1449761]
50652A449761J3023J3823J4780J6104J8049K0865K4334K7909L1396L4996L8685
50641A703725M2082M4943M7192M8530M8588M7515M5829M3675M0879L7755L5248
50630B185961L4177L5000L8147M3175M6873M3479K8735M310k2509m3919n6339
50619B337090o0712n9506n4454m6647l7344k7885j9072j1150m271J334N528Q216
50607B031127R062P577L495l076j1732k1725l1969m1505m9982n7333o3163o6923
50595A703853o8565o8412o6498o2745n7851n3040m8794m4643m0556l7440l5647
50584A119662l3948l0991k7161k3959k1931k0181j7736j4489j0896p492m709k519
50572I03650k99K420N200P333Q919J0598J2369J3503J3690J3554J3852J4848J6556
$$ y = [1449761, 1462784, 1476607, 1491387, 1507491, 1525540, 1546405, 1570739, 1598648, 1630044, 1665040, 1703725, 1745807, 1790750, 1837942, 1886472, 1935060, 1982575, 2028404, 2072079, 2112958, 2150713, 2185961, 2220138, 2255138, 2293285, 2336460, 2383333, 2426812, 2455547, 2459857, 2437348, 2393429, 2337090, 2276378, 2216872, 2162418, 2115771, 2078427, 2050542, 2031470, 2020320, 2016049, 2017383, 2022911, 2031127, 2040189, 2047766, 2051261, 2048185, 2036453, 2014728, 1982759, 1941254, 1891272, 1833939, 1770776, 1703853, 1635288, 1566876, 1500378, 1437633, 1379782, 1326742, 1277948, 1233305, 1192749, 1155309, 1119662, 1085714, 1054723, 1027562, 1003603, 981672, 961491, 943755, 929266, 918370, 910878, 906169, 903650, 903351, 905771, 910971, 918304, 927223, 937821, 950190, 963693, 977383, 990937, 1004789, 1019637, 1036193]
50559A036193J8947K1692K4158K5914K6872K7020K6449K5589K4875K4052K2401
50548A304162J9794J7067J5201J4581J5140J6793J9460K3048K7509L2643L7861
50537A543259M2567M6888N1609N7250O3516O9727P5551Q1238Q7390R4428J02028
50526B315451J09142J14802J18682J20667J20349J17471J12538J06135R7873Q6829
50516C419939P2891N6869L9257J9913q02k1514m0890n8546p4484q8258r9139j06553
50504C118683j09992j08938j03406r4194q2280o8199n2272l5031j7195N44J7438
50493B465158L2773M6010N6445O2582O2510N5181M1009K1198k855k9276n5601
50482B755134p9540r9535j14530j23820j27487j26477j21856j14493j05567r6530
$$ y = [1036193, 1055140, 1076832, 1100990, 1126904, 1153776, 1180796, 1207245, 1232834, 1257709, 1281761, 1304162, 1323956, 1341023, 1356224, 1370805, 1385945, 1402738, 1422198, 1445246, 1472755, 1505398, 1543259, 1585826, 1632714, 1684323, 1741573, 1805089, 1874816, 1950367, 2031605, 2118995, 2213423, 2315451, 2424593, 2539395, 2658077, 2778744, 2899093, 3016564, 3129102, 3235237, 3333110, 3419939, 3492830, 3549699, 3588956, 3608869, 3608067, 3586553, 3545663, 3487117, 3412633, 3324375, 3225236, 3118683, 3008691, 2899753, 2796347, 2702153, 2619873, 2551674, 2499402, 2464371, 2447176, 2447720, 2465158, 2497931, 2543941, 2600386, 2662968, 2725478, 2780659, 2821668, 2842866, 2840011, 2810735, 2755134, 2675594, 2576059, 2461529, 2337709, 2210222, 2083745, 1961889, 1847396, 1741829, 1645299]
50472A645299q7996p9357p0099o0902n2881m6335m0915l6479l3011l0128k7417
50461A079779k4880k2388j9207j4900j0289o617l979j534J037L186M629N840P309
50448I97986R098J1201J3558J5665J7015J7948J9209K0383J9827J6710J2359Q884
50436A179843P039O064N155M291L746L471L196K798K444K470L033L860M481M824
50422A236715N404O781R033J1877J5165J9129K4145L0219L6592M2083M6203M9722
50410A533068N3710N8013O1331O2773O2667O1581N9293N5375N0187M4567L8778
50399B141343L2373K4903J6067N383p462k1762l5859m8295n8573o6586p1954p4216
50387A835362p3468p0366o5574n9336n1537m2147l1683k1152j1307k067O958J5407
$$ y = [1645299, 1557303, 1477946, 1407847, 1346945, 1294064, 1247729, 1206814, 1170335, 1137324, 1107196, 1079779, 1054899, 1032511, 1013304, 998404, 988115, 981498, 977519, 975985, 977022, 980208, 984837, 990677, 997986, 1007084, 1018285, 1031843, 1047508, 1064523, 1082471, 1101680, 1122063, 1141890, 1158600, 1170959, 1179843, 1186882, 1192946, 1198101, 1202392, 1206138, 1209609, 1212805, 1215603, 1218047, 1220517, 1223550, 1227410, 1231891, 1236715, 1242119, 1248900, 1257933, 1269810, 1284975, 1304104, 1328249, 1358468, 1395060, 1437143, 1483346, 1533068, 1586778, 1644791, 1706122, 1768895, 1831562, 1893143, 1952436, 2007811, 2057998, 2102565, 2141343, 2173716, 2198619, 2214686, 2220069, 2212607, 2190845, 2154986, 2106691, 2048118, 1981532, 1909578, 1835362, 1761894, 1691528, 1625954, 1566618, 1515081, 1472934, 1441251, 1420099, 1408792, 1406725, 1413683, 1429090]
50375A429090K2128K6342K8215K7950K4910J8223Q123l854j5960k7129l6953m5230
50363A455855n1611n5457n6216n4192n0718m7128m3729m0244l6900l4293l2202
50352I53165k9503k5540k0836j6055j1057n576k20L904O126O161L677j067o437
50339H56742j0319j1937j2054j1325r525o674l838k033r03O17K680M409N269N751
50325H06860O539P668Q795R760J0497J0739J0239R195Q008O725N118L278J719
50312I05140O85j91j210j913j566k12J299K321K914L304L406L269L390M182N419
50297I30237O701Q097R768J1295J2118J2539J3478J5238J7384K0033K4117K9365
50285A110370L2710L0060K0242O551n902j4071j8073j9314j8591j6154j2670r302
$$ y = [1429090, 1451218, 1477560, 1505775, 1533725, 1558635, 1576858, 1584981, 1581127, 1565167, 1538038, 1501085, 1455855, 1404244, 1348787, 1292571, 1238379, 1187661, 1140533, 1096804, 1056560, 1019660, 985367, 953165, 923662, 898122, 877286, 861231, 850174, 844598, 844378, 848282, 854408, 860569, 864246, 863179, 856742, 846423, 834486, 822432, 811107, 801582, 794908, 791070, 789037, 788134, 788751, 791431, 795840, 801109, 806860, 813399, 821067, 829862, 839622, 850119, 860858, 871097, 880292, 888300, 895025, 900143, 903421, 905140, 905825, 905634, 904424, 902511, 900945, 900733, 902032, 904353, 907267, 910571, 913977, 917246, 920636, 924818, 930237, 936938, 945035, 954803, 966098, 978216, 990755, 1004233, 1019471, 1036855, 1056888, 1081005, 1110370, 1143080, 1173140, 1193382, 1199933, 1194031, 1179960, 1161887, 1142573, 1123982, 1107828, 1095158, 1085856]
50273A085856o889n568n113n184n213m669l721l232l689m478m562l601j954R2
50259A028075K500N005P101Q642J0080J1931J4303J6979J9620K1736K2760K2430
50247A191162K1111J9715J9208K0037K1815K3616K4586K4130K1646J6756R987
50236A413769K704m208j1003j7889k3814k7351k8464k8316k7502k5649k2751j9750
50224A179776j7488j6233j6588j9617k5153l0958l4565l5470l4702l2912k9973
50213H86117k6143k2460j9744j7874j6160j4018j1342q675o857o085n537m388
50201G26834l010k462k959l577l534l048k766k909l338l914m451m656m483m370
50187F77357m746n436n837n646n234n199n696o278o378n799m754l582k607k092
$$ y = [1085856, 1078967, 1073399, 1068286, 1063102, 1057889, 1053220, 1049499, 1046267, 1042578, 1038100, 1033538, 1029937, 1027983, 1028075, 1030575, 1035580, 1042681, 1051323, 1061403, 1073334, 1087637, 1104616, 1124236, 1145972, 1168732, 1191162, 1212273, 1231988, 1251196, 1271233, 1293048, 1316664, 1341250, 1365380, 1387026, 1403782, 1413769, 1416473, 1412265, 1401262, 1383373, 1359559, 1332208, 1303744, 1275428, 1247926, 1222277, 1199526, 1179776, 1162288, 1146055, 1129467, 1109850, 1084697, 1053739, 1019174, 983704, 949002, 916090, 886117, 859974, 837514, 817770, 799896, 783736, 769718, 758376, 749701, 742844, 736759, 731222, 726834, 723824, 721362, 718403, 714826, 711292, 708244, 705478, 702569, 699231, 695317, 690866, 686210, 681727, 677357, 672611, 667175, 661338, 655692, 650458, 645259, 639563, 633285, 626907, 621108, 616354, 612772, 610165, 608073]
50173F08073j997j828j131k36jo17j089m07J135K320K514K237K259K708L283L882
50157F21105M673N774P104Q506R857J1023J1761J1786J0985R705Q633Q312Q797
50144G38021R819J1165J2804J4779J7245K0554K4984L0267L5505L9713M2450M3882
50132A041188M4275M3607M1929L9996L9062L9735M1350M2662M2908M1653L8071
50121A496436L1279K1490J0061j720j3301k4130l3155l9593m3675m6119m7276
50110A310297m7188m5973m3629l9942l5176l0438k6774k4240k2379k1154k0676
50099I52728k0463j9817j8754j7764j6697j4771j1637p822m054p78J675L226M480
50086H29552O256Q570J0560J1545J1619J1092J0097Q902P952P282O473N435M655
$$ y = [608073, 606076, 604248, 603117, 602881, 602880, 602263, 601174, 600767, 601902, 604222, 606736, 608973, 611232, 613940, 617223, 621105, 625778, 631552, 638656, 647162, 657019, 668042, 679803, 691589, 702574, 712279, 720912, 729224, 738021, 747840, 759005, 771809, 786588, 803833, 824387, 849371, 879638, 915143, 954856, 997306, 1041188, 1085463, 1129070, 1170999, 1210995, 1250057, 1289792, 1331142, 1373804, 1416712, 1458365, 1496436, 1527715, 1549205, 1559266, 1557546, 1544245, 1520115, 1486960, 1447367, 1403692, 1357573, 1310297, 1263109, 1217136, 1173507, 1133565, 1098389, 1067951, 1041177, 1016937, 994558, 973404, 952728, 932265, 912448, 893694, 875930, 859233, 844462, 832825, 825003, 820949, 820171, 821846, 825072, 829552, 835808, 844378, 854938, 866483, 878102, 889194, 899291, 908193, 916145, 923427, 929900, 935335, 939990]
50073I39990M337L924K872J407O4j083k219l209l808m221m913n928o901p574p950
50058I04788p939p405o588o040n956n845n065l558j796j58J396L012M585N956
50044H69387P326R116J1280J3127J4020J4115J4033J4043J3913J3483J2911J2268
50032A019022J1367J0141Q897P899O945N624L862K013N36k47j15J038L104N746
50018A085832Q532J1012J2638J2833J1482R384P839P470P657P534P300P960R822
50005A207295J1973J3423J3995J3662J1734P494J207o115j3713k1175k7848l2901
49993A179031l5937l7008l6250l4052l1388k9262k7867k6871k6235k6003k5564
49982H42594k4167k2136k0565j9656j8424j6300j3992j2254j0817r155p503o381
$$ y = [939990, 944327, 948251, 951123, 952530, 952594, 951511, 949292, 946083, 942275, 938054, 933141, 927213, 920312, 912738, 904788, 896849, 889444, 882856, 876816, 870860, 865015, 859950, 856392, 854596, 854438, 855834, 858846, 863431, 869387, 876713, 885829, 897109, 910236, 924256, 938371, 952404, 966447, 980360, 993843, 1006754, 1019022, 1030389, 1040530, 1049427, 1057326, 1064271, 1069895, 1073757, 1075770, 1076306, 1076059, 1075944, 1076982, 1080086, 1085832, 1094364, 1105376, 1118014, 1130847, 1142329, 1151713, 1159552, 1167022, 1174679, 1182213, 1189513, 1197473, 1207295, 1219268, 1232691, 1246686, 1260348, 1272082, 1279576, 1280783, 1274668, 1260955, 1239780, 1211932, 1179031, 1143094, 1106086, 1069836, 1035784, 1004396, 975134, 947267, 920396, 894161, 868158, 842594, 818427, 796291, 775726, 756070, 737646, 721346, 707354, 695100, 684283, 675128, 667625, 661244]
49970F61244n731n227m915m852m687m243m037m442m747l909j966LJ247J948K609
49955F18295L547M938O692Q224Q915Q821Q478Q017P020N363L627K468J938J633
49941F97976J189M50o41k087l894o116q714j1385j3705j5404j6368j6420j5353
49928E89528j3311j0895q800p311o186m997l639k405j475m63J090K826L719L370
49914E41051K635K493K802K821K573K876M053N485O586P524Q594R538J0041J0446
49900F19518J1310J2392J2680J1535R371P093N138L297J235j101l571o093q620
49887F74184j0947j2594j3071j2307j0920r961j0108j1067j1803j1556j0431r010
49875E40409p617o254n053m285l898l396k433j237k62M59J312K604M236N841P085
$$ y = [661244, 655513, 650286, 645371, 640519, 635832, 631589, 627552, 623110, 618363, 614454, 612488, 612491, 613738, 615686, 618295, 621842, 626780, 633472, 641696, 650611, 659432, 667910, 675927, 682947, 688310, 691937, 694405, 696343, 697976, 699165, 699615, 698974, 696887, 692993, 686877, 678163, 666778, 653073, 637669, 621301, 604881, 589528, 576217, 565322, 556522, 549211, 543025, 538028, 534389, 531984, 530509, 530046, 531136, 533962, 537681, 541051, 543686, 546179, 548981, 551802, 554375, 557251, 561304, 566789, 573375, 580899, 589493, 599031, 609072, 619518, 630828, 643220, 655900, 667435, 676806, 683899, 689037, 692334, 693569, 692468, 688897, 682804, 674184, 663237, 650643, 637572, 625265, 614345, 604384, 594276, 583209, 571406, 559850, 549419, 540409, 532792, 526538, 521485, 517200, 513302, 509906, 507473, 506236, 505974, 506433, 507745, 510349, 514585, 520426, 527511]
49860E27511P907Q571R473J0734J2030J2904J3181J2948J2162J0577Q221N775
49848F51994M111L384K769J453m33k168l618n365p593r527j0397j0427j0238r801
49834E94144q658o971n470m474l667k860k217j684q96K36J493K957M889O864P992
49819E81678Q285Q840J0132J1049J0426Q773P532P126O778N992N209M901M777
$$ y = [527511, 535418, 543989, 553462, 564196, 576226, 589130, 602311, 615259, 627421, 637998, 646219, 651994, 656105, 659489, 662258, 663711, 663278, 661110, 657492, 652127, 644534, 635007, 624610, 614183, 603945, 594144, 585486, 578515, 573045, 568571, 564904, 562044, 559827, 558143, 557247, 557483, 558976, 561933, 566822, 573686, 581678, 589963, 598803, 608935, 619984, 630410, 639183, 646715, 653841, 660619, 666611, 671820, 676721, 681498]
$$ [...]
##END NTUPLES=NMR SPECTRUM
##END=
