##TITLE=AC1751_05000195609115FOTR0001_9275067_Bt7wbmRs15
##JCAMPDX= 6.0         $$ Bruker NMR JCAMP-DX V2.0
##DATA TYPE= NMR SPECTRUM
##DATA CLASS= NTUPLES
##ORIGIN= BRUKER
##OWNER= Administrator
$$ 1.72 TOPSPIN		Version 2.1
$$ 2015-07-18 09:05:04.916 -0700  Administrator@X
$$ Compression mode = diff/dup
##.OBSERVE FREQUENCY= 400.02188249412
##.OBSERVE NUCLEUS= ^1H
##.ACQUISITION MODE= SIMULTANEOUS (DQD)
##.ACQUISITION SCHEME= undefined
##.AVERAGES= 8
##.DIGITISER RES= 22
##SPECTROMETER/DATA SYSTEM= spect
##.PULSE SEQUENCE= zg30
##.SOLVENT NAME= COFFEE_meoh
##.SHIFT REFERENCE= INTERNAL, COFFEE_meoh, 1, 14.98509
##AUDIT TRAIL= $$ (NUMBER, WHEN, WHO, WHERE, PROCESS, VERSION, WHAT)
$$ ##TITLE= Audit trail, TOPSPIN		Version 2.1
$$ ##JCAMPDX= 5.01
$$ ##ORIGIN= Bruker BioSpin GmbH
$$ ##OWNER= Administrator
$$ $$ E:\/data/COFFEE/nmr/AC1751_05000195609115FOTR0001_9275067_Bt7wbmRs15/10/pdata/1/auditp.txt
$$ ##AUDIT TRAIL=  $$ (NUMBER, WHEN, WHO, WHERE, PROCESS, VERSION, WHAT)
(   1,<2015-07-18 09:04:57.260 -0700>,<Administrator>,<X>,<go>,<TOPSPIN 2.1>,
      <created by zg
	started at 2015-07-18 09:03:51.588 -0700,
	POWCHK enabled, PULCHK disabled,
       configuration hash MD5:
       21 0F 79 D6 B3 7B B4 F6 88 20 88 DB 03 48 BD 9F
       data hash MD5: 64K
       95 17 D5 F0 AC C6 A6 08 9B F5 7A 9F 27 E4 B6 58>)
(   2,<2015-07-18 09:05:00.744 -0700>,<Administrator>,<X>,<proc1d>,<TOPSPIN 2.1>,
      <Start of raw data processing
       efp LB = 0 FT_mod = 6 PKNL = 1 PHC0 = 0 PHC1 = 0 SI = 32K 
       data hash MD5: 32K
       B2 B7 07 C5 62 64 AC B2 DE AA 80 F7 7A 78 F3 15>)
(   3,<2015-07-18 09:05:01.025 -0700>,<Administrator>,<X>,<proc1d>,<TOPSPIN 2.1>,
      <pk PHC0 = 91.70837 PHC1 = 0 
       data hash MD5: 32K
       AB B5 03 60 86 4A 31 1E 9B 1D 00 24 F0 E3 94 E7>)
(   4,<2015-07-18 09:05:01.135 -0700>,<Administrator>,<X>,<proc1d>,<TOPSPIN 2.1>,
      <abs ABSG = 1 
       data hash MD5: 32K
       CD F3 92 5F 49 29 D8 9D F0 00 2C 8E A1 59 A8 26>)
(   5,<2015-07-18 09:05:01.197 -0700>,<Administrator>,<X>,<proc1d>,<TOPSPIN 2.1>,
      <abs ABSG = 2 
       data hash MD5: 32K
       5D 2F F9 89 87 63 9A C6 8A 46 D2 79 B2 86 80 ED>)
(   6,<2015-07-18 09:05:01.260 -0700>,<Administrator>,<X>,<proc1d>,<TOPSPIN 2.1>,
      <abs ABSG = 3 
       data hash MD5: 32K
       CC 6B C1 84 D3 35 95 E4 04 5B D2 40 08 DF 05 05>)
(   7,<2015-07-18 09:05:01.322 -0700>,<Administrator>,<X>,<proc1d>,<TOPSPIN 2.1>,
      <abs ABSG = 4 
       data hash MD5: 32K
       4B 90 68 1B 57 4A A9 5B D8 A4 94 1F FF 7E 8E E3>)
(   8,<2015-07-18 09:05:01.369 -0700>,<Administrator>,<X>,<proc1d>,<TOPSPIN 2.1>,
      <abs ABSG = 5 
       data hash MD5: 32K
       0C E9 3F E5 B5 C3 02 CD BE 45 53 7B 60 82 F1 52>)
$$ ##END=
$$ 
$$ $$ hash MD5
$$ $$ B1 67 35 7D 7E 64 9A 1A 47 D8 7E 8B FA 5B 24 3E
##$RELAX= 
##$RELAX= 
##$RELAX= 
##$RELAX= 
##$RELAX= 
##$RELAX= 
##$RELAX= 
$$ Bruker specific parameters
$$ --------------------------
##$DU= <E:\>
##$EXPNO= 10
$$ [...]
150 150 150 150 150 150 150 150
##$TP07= 0
##$TPNAME0= <>
##$TPNAME1= <>
##$TPNAME2= <>
##$TPNAME3= <>
##$TPNAME4= <>
##$TPNAME5= <>
##$TPNAME6= <>
##$TPNAME7= <>
##$TPOAL= (0..7)
0.5 0.5 0.5 0.5 0.5 0.5 0.5 0.5
##$TPOFFS= (0..7)
0 0 0 0 0 0 0 0
##$TUNHIN= 0
##$TUNHOUT= 0
##$TUNXOUT= 0
##$USERA1= <user>
##$USERA2= <user>
##$USERA3= <user>
##$USERA4= <user>
##$USERA5= <user>
##$V9= 5
##$VALIST= <valist>
##$VCLIST= <CCCCCCCCCCCCCCC>
##$VD= 0
##$VDLIST= <DDDDDDDDDDDDDDD>
##$VPLIST= <PPPPPPPPPPPPPPP>
##$VTLIST= <TTTTTTTTTTTTTTT>
##$WBST= 2048
##$WBSW= 25
##$XGAIN= (0..3)
0 0 0 0
##$XL= 0
##$YL= 0
##$YMAX_a= 605227
##$YMIN_a= -509177
##$ZGOPTNS= <>
##$ZL1= 120
##$ZL2= 120
##$ZL3= 120
##$ZL4= 120
##$ABSF1= 14.98509
##$ABSF2= -5.573092
##$ABSG= 5
##$ABSL= 3
##$ALPHA= 0
##$AQORDER= 0
##$ASSFAC= 0
##$ASSFACI= 0
##$ASSFACX= 0
##$ASSWID= 0
##$AUNMP= <proc_prof1d_extract_pilot.lims>
##$AXLEFT= 0
##$AXNAME= <>
##$AXNUC= <1H>
##$AXRIGHT= 0
##$AXTYPE= 0
##$AXUNIT= <>
##$AZFE= 0.1
##$AZFW= 0.1
##$BCFW= 0
##$BC_mod= 0
##$BYTORDP= 0
##$COROFFS= 0
##$CY= 15
##$DATMOD= 1
##$DC= 0
##$DFILT= <>
##$DTYPP= 0
##$F1P= 0
##$F2P= 0
##$FCOR= 0.5
##$FTSIZE= 32768
##$FT_mod= 6
##$GAMMA= 0
##$GB= 0
##$INTBC= 1
##$INTSCL= 1
##$ISEN= 128
##$LB= 0
##$LEV0= 0
##$LPBIN= 0
##$MAXI= 10000
##$MC2= 0
##$MEAN= 0
##$ME_mod= 0
##$MI= 0
##$NCOEF= 0
##$NC_proc= -8
##$NLEV= 6
##$NOISF1= 0
##$NOISF2= 0
##$NSP= 0
##$NTH_PI= 0
##$NZP= 0
##$OFFSET= 14.98509
##$PC= 1
##$PHC0= 91.70837
##$PHC1= 0
##$PH_mod= 1
##$PKNL= yes
##$PPARMOD= 0
##$PPDIAG= 0
##$PPIPTYP= 0
##$PPMPNUM= 2147483647
##$PPRESOL= 1
##$PSCAL= 4
##$PSIGN= 0
##$PYNMP= <proc.py>
##$REVERSE= no
##$SF= 400.02
##$SI= 32768
##$SIGF1= 0
##$SIGF2= 0
##$SINO= 400
##$SIOLD= 32768
##$SPECTYP= <>
##$SREGLST= <1H.CDCl3>
##$SSB= 0
##$STSI= 32768
##$STSR= 0
##$SW_p= 8223.68421052631
##$SYMM= 0
##$S_DEV= 0
##$TDeff= 65536
##$TDoff= 0
##$TI= <>
##$TILT= no
##$TM1= 0
##$TM2= 0
##$TOPLEV= 0
##$USERP1= <user>
##$USERP2= <user>
##$USERP3= <user>
##$USERP4= <user>
##$USERP5= <user>
##$WDW= 1
##$XDIM= 32768
##$YMAX_p= 446793415
##$YMIN_p= -749594
##$CURPLOT= <Network HP LaserJet P1505>
##$CURPRIN= <$Network HP LaserJet P1505>
##$DFORMAT= <normdp>
##$LAYOUT= <+/1D_H.xwp>
##$LFORMAT= <normlp>
##$PFORMAT= <normpl>
##$SURQMSG= 1
$$ End of Bruker specific parameters
$$ ---------------------------------
##NTUPLES= NMR SPECTRUM
##VAR_NAME=  FREQUENCY,     SPECTRUM/REAL,   SPECTRUM/IMAG
##SYMBOL=    X,             R,               I
##VAR_TYPE=  INDEPENDENT,   DEPENDENT,       DEPENDENT
##VAR_FORM=  AFFN,          ASDF,            ASDF
##VAR_DIM=   32768,         32768,           32768
##UNITS=     HZ,            ARBITRARY UNITS, ARBITRARY UNITS
##FACTOR=    0.250966925370066, 1,           1
##FIRST=     8223.43324360094, -37455,       -178787
##LAST=      0,             2546,            -173710
##MIN=       0,             -749594,         0
##MAX=       8223.43324360094, 446793415,    0
$$ Real data points
##PAGE= N=1
##DATA TABLE= (X++(R..R)), XYDATA
$$ [...]
19512d3658k27130H1523K8785b83324E5232b7434C03350a88909A3562g8604j65816
19501b44420G9227B0920L0103K90728l8381A04164N6093a40038B75182a46560
19490A05178K5422a83281i1108j2913r8859C1012M9972C1540R897J10959G4508
19478H900i2484l0838C20699N6933A13153h1027n1887C35952A00752a85059r5460
19467b80519i228j68977A23710b506A03009J1180c6778F0179K9386a89158C42776
19455A34842i0425j01112j96012C9935b68510R8843A79498B3085L677b42707A27755
19443H0568A9109b16642j05157J45656J3964F343a14766l9002P1175j9089E3076
19431A9185b40559B8475a87126i903m3058C6780J20286a61975A46481l9615A5868
$$ y = [-43658, -270788, 81523, 110308, -283324, 55232, -27434, 303350, -188909, 13562, -78604, -244420, 79227, 20920, 51023, 341751, 303370, 104164, 160257, -140038, 275182, -146560, 105178, 130600, -183281, -91108, -104021, -202880, 31012, 80984, 31540, 41437, 152396, 74508, 8900, -92484, -123322, 320699, 377632, 113153, -81027, -132914, 335952, 100752, -185059, -280519, -9228, -178205, 123710, -2506, 103009, 114189, -36778, 60179, 89565, -189158, 342776, 134842, -90425, -191537, -387549, 39935, -268510, -169667, 179498, 23085, 26762, -242707, 127755, 80568, 19109, -216642, -321799, -176143, -162179, 6343, -114766, -153768, -82593, -101682, 53076, 19185, -240559, 28475, -187126, -9903, -52961, 36780, 157066, -161975, 146481, 106866, 15868]
19419F65126G2633J03219A7552a9113o5775o4081C4716g948p4255o5743G1590
19407B10298K4619j2634B3677J40795B6105a6646j56741r293C05321J2555c21443
19395e652l0246B44778c10141a04674e0367k35289A18609a40542q4659e2060j09712
19384a61772q7409p4464F5479c2783n09830a11065j05156N6958O2938a7190l05833
19373c23023J55183D8652M2834a11071m6402A25989c3743r24a787j43229C08387
19361a09873k9876e2970q1731G0401a46830E2869j823a19305c8193H0870L46315
19350D27185c6227m0780c7496j27366H3775L6863j2311i6817D1615J53702e3558
19338e6106j94147k1661E6668c0449j19978j4327B6767g2488b3127r8741B4806
$$ y = [665126, 72633, 175852, 17552, -19113, -84888, -148969, 34716, -7948, -82203, -147946, 71590, 210298, 234917, 222283, 23677, 164472, 26105, -16646, -173387, -182680, 305321, 317876, -321443, -5652, -35898, 244778, -310141, -104674, -50367, -285656, 118609, -140542, -225201, -52060, -161772, -249181, -323645, 65479, -32783, -542613, -111065, -216221, -159263, -96325, -17190, -323023, -167840, 48652, 91486, -111071, -157473, 125989, -33743, -34667, -1787, -145016, 308387, -109873, -139749, -52970, -134701, 70401, -146830, 52869, 51046, -119305, -38193, 80870, 427185, -36227, -77007, -37496, -164862, 83775, 120638, 108327, -96817, 41615, 195317, -53558, -56106, -250253, -271914, 56668, -30449, -150427, -164754, 26767, -72488, -23127, -121868, 24806]
19326E1042d4608R293j71184E4379b35145B30683b39619J02414D55794d2358A60330
19314b5737j30675I6146J60960f6764A8393a69893O6681A89438h3967k5031l93973
19303e02971J65552a57718H4014K32595D4568K11532b98454E4579e2183k22346
19293b74529A07116D35a15602j57053I8871h3594I461f7560B1595d7989A0014
19281A3021d0787r8627A93680a16853k1827k43386G5510K06064a33197O0749A15941
19269A82531G487c04481A24677a88311c6204H7213b3614r3738B39702a72023B19132
19257a67067b3500A70372c35112a05456c5190j66973A7680c34878A28930N5176
19247A84106b41135n9222J48857O5248C8096c33883F8377a55103f9522j09529
$$ y = [51042, -44608, -35315, -206499, 54379, -235145, 230683, -239619, -137205, 455794, -42358, 160330, -25737, -156412, 96146, 257106, -66764, 18393, -169893, -103212, 189438, -83967, -108998, -502971, -337419, -157718, 84014, 316609, 44568, 256100, -298454, 54579, -52183, -274529, 107116, 435, -115602, -272655, 98871, -83594, 9461, -67560, 21595, -47989, 10014, 13021, -40787, -139414, 193680, -116853, -138680, -382066, 75510, 281574, -133197, -72448, 115941, 182531, 7487, -304481, 124677, -188311, -36204, 87213, -23614, -117352, 239702, -172023, 219132, -167067, -23500, 170372, -335112, -105456, -35190, -202163, 17680, -334878, 128930, 184106, -241135, -300357, -151500, -86252, 38096, -333883, 68377, -155103, -69522, -179051]
19237a79051d4486D05730B1914a83841O0234H037c14884I0666a85855K0623I8111
19225a98050R2105c379l42389a19476M8555j24313j91207J15120K3802B46881
19214b50750F4304a0853G5458b2871C92015a56767d8328k11524f6494H4318h3135
19202A60730a0148l27211A0622d2169l24733J6425R4162i795n0633j61567N7540
19191a64455I4554J34300D3553O2421A789a29900c8742j53215m9091a5133k75277
19180b90410A79411J07432i0224n4643A90226b06605B84393E1402J06751a14029
19169c6260E3781J74427a42306A94218b60994A70593a14598g596m5397A02183
19158F5153a23564D4281c5124E2130c47218o157D5024c27788D6049a99091L403
$$ y = [-179051, -44486, 405730, 21914, -183841, -123607, 8037, -314884, 90666, -185855, -165232, 98111, -198050, -105945, -3379, -345768, -119476, -70921, -195234, -386441, -271321, -247519, 246881, -250750, 64304, -10853, 75458, -22871, 392015, -156767, -48328, -259852, -66494, 84318, -83135, 160730, -10148, -337359, 10622, -42169, -366902, -350477, -256315, -9795, -60428, -221995, -164455, 94554, 228854, 43553, 105974, 1789, -129900, -38742, -191957, -241048, -15133, -290410, 179411, 286843, -90224, -144867, 190226, -206605, 284393, 51402, 158153, -114029, -36260, 53781, 228208, -142306, 194218, -260994, 170593, -114598, -7596, -52993, 102183, 65153, -123564, 44281, -35124, 52130, -347218, -353375, 45024, -327788, 46049, -199091, -195688]
19147a95688N3029A58425a94390k25041a93093n8855B51442A08466J4617g6739
19136B11032e9630j71517H1491C4299a63692F3302e8735n0444k20580J23347k2813
19125b29225f0583F3907L21425f0059k78744Q6311R2918E7358c09794C0445J06148
19114A36593J8541c49950i1939k62072G9013k6441a66146C0458Q2082K3623M4157
19103A80320L1467d2908j93495a03212i303A84287h1547E8941d7301A18515L8574
19092A57089e8851m0549I3355l0660a12883H9095D268J09764b0255j31532l6951
19081a88738D1498b0334G0305a05760B69389m1908e9014I8897a6785B09169r4910
19070A14259K47074a05521j28908A21787C0875h0181n1280A96566H6842J42226
$$ y = [-195688, -142659, 158425, -194390, -419431, -193093, -251948, 251442, 108466, 123083, -76739, 211032, -59630, -231147, 81491, 34299, -163692, 63302, -58735, -109179, -329759, -206412, -229225, -60583, 63907, 385332, -60059, -338803, -252492, -159574, 57358, -309794, 30445, 136593, 155134, -349950, -91939, -354011, 79013, 52572, -166146, 30458, 112540, 136163, 180320, 211787, -42908, -236403, -103212, -9303, 184287, -81547, 58941, -47301, 118515, 157089, -58851, -99400, 93355, 62695, -112883, 89095, 4268, 114032, -20255, -151787, -188738, 41498, -20334, 70305, -105760, 269389, 227481, -59014, 98897, -16785, 209169, 114259, 361333, -105521, -234429, 121787, 30875, -80181, -131461, 196566, 86842, 229068]
19060B29068c64907f2333r6729P5615F5013J1302d36665A6425a44288C9303a26775
19048D4638K68441g5258K8695i064j40740j32098K1433h0597r9299c7248k16553
19037b53801j42291d1576j96650b8547E3567a33459E1611J21675b6145A49444
19026b60589B25692a37242K0603j46098A98244g6377J3861j40764a5179A76916
19015a81884g4764k315D771a15966E2928b41978A68361i4136D29575j61717a41807
19003A04037c52618B55938f2014m1024j74985c105j54702j66117b9654A46940
18992I3303j7104J6838N325J2843b55104I1872J12330A01156K1600a73174L7172
18981a36002A55268A8556a17502A2648a09402F594K4717c34039A1917f4476l17065
$$ y = [229068, -364907, -62333, -159062, -83447, 65013, 76315, -436665, 16425, -144288, 39303, -126775, 44638, 313079, -75258, -46563, -9064, -149804, -281902, -260469, -80597, -179896, -37248, -253801, -396092, -41576, -238226, -28547, 53567, -133459, 51611, 173286, -26145, 149444, -260589, 225692, -137242, -116639, -262737, 198244, -76377, -62516, -203280, -15179, 176916, -181884, -74764, -77079, 4771, -115966, 52928, -241978, 168361, -94136, 429575, 267858, -141807, 104037, -352618, 255938, -62014, -103038, -278023, -3105, -157807, -323924, -29654, 146940, 93303, 76199, 93037, 98362, 111205, -255104, 91872, 204202, 101156, 122756, -173174, -136002, 155268, 18556, -117502, 12648, -109402, 6594, 31311, -334039, 11917, -64476, -381541]
18970c81541A85431a35084l1195d0821k13816c4047A87677a95557n7340O7602
18960a85295q5095Q0135j19694a43699B12806A00111a18240D4745a02304C8900
18949a0679G7592h9816L9758j68358B5015K24393c24664G3043e4250A5715N3156
18938F8871J69863a74020Q0714j43433h928j63611A7588l131a2401q5804q7784
18927a85989B72707b27244B000L8118b78263a24204J4399d6847A37951a97874
18916E4523B385i9193A10395a17014B34267b7819k8460A54843a26740A76943A5100
18904a13657l8945A28469P8138i5641l09028O8105a41029A10686l7600Q2075b77575
18892E4424a26535A75520a61068c9350G7277e9055B0634a10765L3161j10862L780
$$ y = [-381541, 185431, -135084, -166279, -40821, -254637, -34047, 187677, -195557, -252897, -185295, -270390, -190255, -309949, -143699, 212806, 100111, -118240, 44745, -102304, 38900, -10679, 77592, -89816, -50058, -218416, 25015, 249408, -324664, 73043, -54250, 15715, 68871, 238734, -174020, -93306, -236739, -8928, -172539, 17588, 14457, -12401, -98205, -185989, 272707, -227244, 2000, 40118, -278263, -124204, -109805, -46847, 137951, -197874, 54523, 2385, -99193, 110395, -117014, 234267, -27819, -56279, 154843, -126740, 176943, 15100, -113657, -152602, 128469, 206607, -95641, -404669, -336564, -141029, 110686, 73086, 155161, -277575, 54424, -126535, 175520, -161068, -39350, 77277, -59055, 20634, -110765, -77604, -188466, -184686]
18881a84686A2922R609a38656I2218d2335A08470a54689J554B8111N2483d11793
18869E1689K13093I4265a45686m12208B12633a59418A89121e744k93504a15092
18858e19520J60596B35178d5076B1170J9401c4293k8018j70595D9704g2831j28732
18847b01563J4835A56438a7169k08761J06132j25294A27229l8733b2147G4591
18836E0967M0250e4688n9294j06134c3977A01523c11443M3209n9733I9458J05036
18825B04494a71920A3874d1097D8589L6848b02031d1790A81451c0773d078B97911
18813a05146A89843g9126I1215b54224h3601A48421h7262o3660j46589H2393K2906
18802A05299J02260g1571B86531a13058F8288J4091C7866Q2961h1083A06723a69897
$$ y = [-184686, 12922, 22531, -138656, 92218, -42335, 108470, -154689, -153135, 28111, 80594, -411793, 51689, 264782, 94265, -145686, -557894, 212633, -159418, 189121, -5744, -299248, -115092, -519520, -358924, 235178, -45076, 21170, 40571, -34293, -62311, -232906, 49704, -72831, -201563, -186728, 156438, -17169, -225930, -119798, -245092, 127229, 88496, -22147, 74591, 50967, 91217, -54688, -113982, -220116, -33977, 101523, -311443, -268234, -327967, 99458, 204494, -171920, 13874, -41097, 48589, 85437, -202031, -41790, 181451, -30773, -4078, 297911, -105146, 189843, -79126, 91215, -254224, -83601, 148421, -87262, -150922, -297511, 82393, 105299, 207559, -71571, 286531, -113058, 68288, 82379, 37866, 120827, -81083, 106723, -169897]
18790b9930r4968b3480j00913n9953Q1877A65173c2181n1486l17956J50059D2814
18778c9603A7523a19796k01569i7453l3484m1776B4032K68741b9421d524m1067
18767d5591A49448N067D0147b37760e5241H0283C5775d5664j04198a1006m1668
18756e2674o6173C961a52963m5733M2784O1324c5986m5379k25695b0989B35477
18744b6903e263j41035M3590j23246F25a37483k8905C11247a50744A8032c93563
18732c28292C04132a05782j42106E518a22843L4171k8574c3082H1292b52876j8083
18721b70959d9031F8379J94135h8771C94883B9791K36289b6983j17154O7188n6125
18710a33074G4186C4536d06766a74160j14303A5870a5042C50054a21606D0420
$$ y = [-29930, -124898, -23480, -124393, -184346, -102469, 165173, -32181, -83667, -401623, -251564, 42814, -39603, 17523, -119796, -321365, -97453, -130937, -172713, 24032, 292773, -29421, -4524, -45591, 149448, 154515, 40147, -237760, -55241, 80283, 35775, -45664, -149862, -11006, -52674, -118847, 3961, -152963, -198696, -155912, -94588, -35986, -81365, -307060, -20989, 235477, -26903, -5263, -146298, -102708, -225954, 625, -137483, -166388, 311247, -150744, 18032, -393563, -328292, 304132, -105782, -247888, 5518, -122843, -88672, -117246, -33082, 81292, -252876, -270959, -49031, 68379, 262514, -88771, 394883, 29791, 266080, -26983, -144137, -76949, -133074, 74186, 34536, -406766, -174160, -288463, 15870, -15042, 350054, -121606, 40420]
18699a01372M7476p5296A32237A5669d1326j137C2565i4198K4876B98638b20725
18687c1198k20999A9120E269e9119D4697b21727D3366a05132b0498q5133a2269
18675d13419I0264b73915b8950k76627J04315m706G0111b52051Q6775C1769K7694
18664E9463a6228m8503j3366A29040d6702J3131p13C09638a89607H7211b31296
18652f1089A83439a40341A221K14896A3281a18178A99124c05608E7607j5552b15437
18640h6622j14900B28263d1714q730j94252A0159b3984o8908n5042B21076J4586
18629B35662b83121M9659J02356H883K00867j02364b3439B00622I275g190l68575
18618c75765o5467a21373A68987p3891a70775o8297a03991a0342B25444a08114
$$ y = [-101372, -53896, -129192, 132237, 15669, -41326, -42463, 32565, -94198, -69322, 298638, -220725, -31198, -252197, 19120, 5269, -59119, 44697, -221727, 43366, -105132, -20498, -105631, -12269, -413419, 90264, -273915, -28950, -305577, -201262, -205968, 70111, -252051, -165276, 31769, 59463, -16228, -64731, -78097, 129040, -46702, -33571, -34284, 309638, -189607, 87211, -231296, -61089, 183439, -140341, 1221, 216117, 13281, -118178, 199124, -305608, 57607, 42055, -215437, -86622, -201522, 228263, -41714, -50444, -244696, 10159, -23984, -92892, -147934, 221076, 235662, -283121, -233462, -131106, 8883, 209750, 107386, -23439, 200622, 9275, -7190, -375765, -441232, -121373, 168987, 95096, -170775, -239072, -103991, -10342, 225444, -108114]
18607b26611e5138k24755i9215h644p853l83007d401k20372j53468a53728r8525
18596b52253f9773B02545A6152M0334J01305f0742E4995d6654l21393C66650f7395
18584a65828D5986L1494c5653A43508a37777a451F2659b21325P732G4868M8502
18573A23370a68647m8485d3155k10830C3458J18492p5750b06587j24377A90879
18562a65035d2242l53953a0280q8306J7116c4197I3230K784J03201H6606c4279
18550a64091a9685A89296a30269b4424l5964r4050A50621i0685e174j97776A17695
18538b24323d1667h873m6836k2633c7468G2004d90668F7234J776K37356e901B20066
18525A55386b9403k50036B11119b00423N6323e3425q7987A628Q7864g7210j2198
$$ y = [-226611, -55138, -279893, -99215, -8644, -16497, -399504, -4401, -224773, -378241, -153728, -252253, -69773, 202545, 16152, 56486, 157791, -60742, 54995, -46654, -368047, 366650, -67395, -165828, 45986, 77480, -35653, 143508, -137777, -1451, 62659, -221325, -213593, 74868, 123370, -168647, -217132, -43155, -253985, 33458, 151950, 76200, -206587, -330964, 190879, -165035, -42242, -396195, -10280, -98586, -81470, -34197, 93230, 96014, 199215, 86606, -34279, -164091, -19685, 189296, -130269, -24424, -60388, -154438, 150621, -90685, -5174, -202950, 117695, -224323, -41667, -8873, -55709, -78342, -37468, 72004, -490668, 67234, 69010, 306366, -5901, 220066, 155386, -29403, -279439, 211119, -200423, -144100, -53425, -141412, 1628, 89492, -77210, -89408]
18514h9408D3442a27362O1395F8118h7212d184j16297p4651l8015I0414L21660
18503D12074a80641C6712d57839F5427h9475K8938A74495a47217j17363B06697
18492b82212J01236b8679A66963C5208L3390L3081a59317o2957A7931J17544b5342
18480H6396i7618A72232p743f4757a3219D974d4792j57255E0025g2900j55877
18469b28777a0073G5891C741a42268j2032A02002c51591B7042R7249L4398d3160
18457c21650A23662b3905k0630j62410h3680m9637B02762b11692L1404q2861D4001
18445d6907k06805N1941I2306a35199M3406a3137F1228J72988A9256J4535d4902
18433c09206i376k09260A34908a79556L2012J8257r0507d0942F4415a57570N2210
$$ y = [-89408, 43442, -127362, -65967, 68118, -87212, -4184, -120481, -195132, -233147, 90414, 412074, -180641, 36712, -457839, 65427, -89475, -60537, 174495, -147217, -264580, 206697, -282212, -180976, -28679, 166963, 35208, 68598, 101679, -159317, -222274, 17931, 135475, -25342, 86396, -97618, 172232, 164489, -64757, -13219, 4974, -44792, -202047, 50025, -72900, -228777, -10073, 75891, 3741, -142268, -154300, 102002, -351591, 27042, 124291, 158689, -43160, -321650, 123662, -23905, -44535, -206945, -83680, -133317, 202762, -211692, -180288, -263149, 44001, -46907, -253712, -201771, 92306, -135199, -91793, -13137, 61228, 234216, 19256, 33791, -44902, -309206, -9376, -218636, 134908, -179556, -147544, -129287, -219794, -40942, 64415, -157570, -105360]
18422a05360k583e2270A35989E0708g0365A19353J79522a3918A65772o3788M2244
18411A44228B5660c03924P1528A66047P5824b38875A19953b51357e524l7106k1557
18400f4187B80025b09209B6707d4159j52930A83475c40699g595k41433Q5680A78205
18388d4247A66563b08796B00168a24147l1893j0046B6925b7869F0477O614O0539
18377A27630l0917d5567D7139a013j39398A66213a79573C5299K21894B9599b6124
18365a20920n3752h5026K2355j10905c2592k06031H9733b45746N5178b1087k28173
18354b49260E9821b47322B2729J04789l7480K4923A9325K4006M0284h7256j39101
18343b26357a09225H167J21109a04325K3548A19453a43215K0246c4281r9690K5136
$$ y = [-105360, -107943, -52270, 135989, 50708, -70365, 119353, 298875, -13918, 165772, 101984, 144228, 25660, -303924, -232396, 166047, 241871, -238875, 119953, -251357, -5524, -42630, -64187, 280025, -209209, 26707, -44159, -197089, 183475, -340699, -7595, -249028, -163348, 178205, -44247, 166563, -208796, 200168, -124147, -156040, -166086, 26925, -27869, 60477, 67091, 127630, 96713, -45567, 47139, -1013, -140411, 166213, -179573, 35299, 257193, 29599, -26124, -120920, -174672, -85026, -62671, -173576, -32592, -238623, 89733, -245746, -190568, -21087, -249260, 59821, -247322, 22729, 127518, 90038, 114961, 19325, 43331, 83615, -87256, -226357, -109225, 8167, 129276, -104325, -80777, 119453, -143215, -122969, -34281, -133971, -108835]
18332a08835K0769k4356c1703m4589G6753a43018C8258b05748J00319E8044a11181
18320a7077H3317b30502A24733b38957i4522l81j04732f511B05597a90844r3488
18309b84332f4888b6326k24501D97836a51899j91903B3725K73321b58951h1835
18298d4463A37218i4992l2273G4962A8886i2219A25849m12a77086P4666N0589
18287e1831F6816a96751A98977g975G1644C576b89348C35688A1760e8791A44182
18275I2187K26147B9762d8487k21633a07033k9210J1486B64902a02276M8121A92167
18263a11913A62563g7701l6249k23968A88587f5143E8949K1075j4308a22396o400
18252a28796C1827e0437l0828I8503p874b80480G2759d6136k52739E228K16949
$$ y = [-108835, -88066, -112422, -31703, -76292, 76753, -143018, 38258, -205748, -105429, 58044, -111181, -17077, 83317, -230502, 124733, -238957, -94522, -94903, -199635, -6511, 205597, -190844, -284332, -64888, -26326, -250827, 497836, -151899, -343802, 23725, 297046, -258951, -81835, -44463, 137218, -94992, -127265, 74962, 18886, -92219, 125849, 125437, -177086, -102420, -51831, 66816, -196751, 198977, -7975, 71644, 3576, -289348, 335688, 11760, -58791, 144182, 92187, 318334, 29762, -48487, -270120, -107033, -136243, -124757, 264902, -102276, -54155, 192167, -111913, 162563, -77701, -113950, -337918, 188587, -65143, 58949, 80024, 65716, -122396, -128796, 31827, -50437, -81265, 98503, 90629, -280480, 72759, -46136, -298875, 5228, 222177]
18241B22177a79178k53667I8905J6906a73051A48272c9550A98230a5099j39545
18231a54644k9480B05069L0371b2444l88171a82821A81424n9051A8286J16769
18221A35055h8024A09866c61703a7012k19885D64450B0438a69244H0471c7819
18210G5088j9694M9997b05329I8233i7004a835A73493a29774M9088F1522a91343
18198A8081b64991A14474c05162I8274b19079A36644d9586J0540k4223A2685J63485
18187A76170B3374A369Q2563a22077P977d4511k27046A97997F1395B0224e8020
18175a53208G632e9889A6033N3014b62484a6403l5804q9109A73387L5096c61370
18163B01673n2045k8978E746h4382A17582a59331k8009i0062G3960M2659a36286
$$ y = [222177, -179178, -432845, 98905, 115811, -173051, 148272, -39550, 198230, -15099, -154644, -184124, 205069, 235440, -22444, -410615, -182821, 181424, 122373, 18286, 135055, -88024, 109866, -361703, -17012, -236897, 464450, 20438, -169244, 80471, -37819, 75088, 55394, 105391, -205329, 98233, -97004, -1835, 173493, -129774, -80686, 61522, -191343, 18081, -264991, 114474, -305162, 98274, -219079, 136644, -49586, -39046, -63269, 12685, 176170, 23374, 1369, 83932, -122077, -114100, -44511, -271557, 197997, 61395, 20224, -58020, -153208, 7632, -59889, 16033, 69047, -262484, -16403, -52207, -141316, 173387, 208483, -361370, 201673, 149628, 120650, 5746, -84382, 117582, -159331, -187340, -90062, 73960, 116619, -136286]
18151C8797a57887l5876B78102r6110F3040e8017m2465F4701g5294A82629b31105
18139A45749L3207A6641L4570J26317c2524B8924K10318b23514A09243a32500
18128E1347A2870b6408r3691o9665P5214a0995J154j78706o7114E0504c52460
18116b04466I7166a5460p1905F7160a09072e1037C1539a24807j18874E0547J04815
18105A55362J15990c22429C71291a09477b0308B9027n318J65872e2093A31564
18094a05647A54143f7204L246j45407a03610j42605E4953J19641A5716N1942a01512
18082a64981C7089e3660B27818a45071j84916d1865B8458b3931D2589g0778A05567
18070A39973l9633i5101c6015A36577i881A03620J04091b9283I7978a8261A66819
$$ y = [38797, -157887, -193763, 278102, 181992, 63040, -58017, -100482, 64701, -75294, 182629, -231105, 145749, 178956, 16641, 51211, 177528, -32524, 28924, 239242, -223514, 109243, -132500, 51347, 12870, -26408, -120099, -189764, -114550, -10995, -9841, -188547, -255661, 50504, -352460, -204466, 97166, -15460, -87365, 67160, -109072, -51037, 31539, -124807, -243681, 50547, 155362, 271352, -322429, 371291, -109477, -20308, 29027, 23709, 189581, -52093, 131564, -105647, 154143, -67204, -63958, -209365, -103610, -246215, 54953, 174594, 15716, 67658, -101512, -164981, 37089, -53660, 227818, -145071, -329987, -41865, 28458, -23931, 42589, -70778, 105567, 139973, 100340, -95101, -36015, 136577, -9881, 103620, 207711, -29283, 97978, -18261, 166819]
18058d9883k4408Q143C5597l958j1340h6367j14153F9680c4405B55898q8797a47617
18045d3327r2014j81098A44467a63078A69725F3375G629a11205B93918c4013A4109
18033i1361l25385E9846a39341j64491R4935A82948M8082E8162j6173J57829a5467
18021G3057c2491j82567i1923k3361B58321I1800b45496R9928k03505A21922J16570
18010B38492L2025b9005r8657l10070B95965A46177B2067a55154d4200C98398
17999b20082E8007a820A56016o8821b06650I7335a6527A13474j8080N4357a4646
17987A81388h38j75407h0389K7218j22613B34589d6223m4761C3857b14954C60046
17975a62444d6524E4764J03586A7509d9360C5918L5352l3547d6621q1594Q939
$$ y = [-49883, -74291, -66148, 35597, 31639, 20299, -86367, -200520, 69680, -34405, 255898, 167101, -147617, -43327, -135341, -316439, 144467, -163078, 169725, 63375, 7629, -111205, 293918, -34013, 14109, -91361, -416746, 59846, -139341, -303832, -208897, 182948, 231030, 58162, 41989, 199818, -15467, 73057, -32491, -215058, -91923, -115284, 258321, 91800, -245496, -145568, -349073, 121922, 238492, 270517, -29005, -127662, -437732, 295965, 146177, 22067, -155154, -44200, 398398, -220082, 58007, -1820, 156016, 87195, -206650, 97335, -16527, 113474, 95394, 149751, -14646, 181388, -838, -176245, -80389, -53171, -175784, 234589, -46223, -90984, 33857, -214954, 360046, -162444, -46524, 54764, 158350, 17509, -49360, 35918, 71270, 37723, -46621, -128215, -119276]
17964a19276A63035E4541J86766A17212K2184a76156A88797k7943J71391D2291
17953B65506q4847b72237a02994B3387J22167p1799f8920m8098A33519c1493l12936
17942c44429e6076B13524I7980K86470b58226j0908K3444B7930J50964c9888j24661
17931a64549A3595b1308k64717A1131a60783F9135J84740k1992b4321B2378J22409
17920A44787i962D36953A84075J97732A78643i5620G0267a93880P7385l5543A8307
17908A11706e118C07436r2020C4806J23733d6897A17422i938B530O687J18605
17897A27822l1170k2016b2179C56499o1111e1027m1325k6523f334A57645p3428
17886H4217K05148c80375c4511j80114K8496A15386C7917a94035H2446a58157
$$ y = [-119276, 163035, 54541, 241307, 117212, 139396, -176156, 188797, 160854, 332245, 42291, 265506, 180659, -272237, -102994, 23387, 145554, 73755, -68920, -117018, 133519, -31493, -344429, -56076, 213524, 97980, 384450, -258226, -269134, -245690, 27930, 178894, -39888, -164549, 13595, -21308, -286025, 11131, -160783, 69135, 253875, 231883, -24321, 22378, 144787, -9962, 436953, 184075, 381807, 178643, -95620, 70267, -193880, -116495, -152038, 18307, 111706, -5118, 307436, 215416, 34806, 158539, -46897, 117422, -9938, 2530, 9217, 127822, 96652, 74636, -22179, 356499, 295388, -51027, -92352, -118875, -6334, 157645, 84217, 289365, -380375, -34511, -214625, -186129, 115386, 37917, -194035, 82446, -158157]
17875A50514e3917A81300e9305n6761A25368a48813e1474K164G2404J67249e7489
17863d8411j8286D9206b21432N6249A75672a83146c2407C9194J58068e9972a2368
17851B36773c13044G5043A8071b16369D2551j476O2743J13998K5943C2193f3638
17839E3646L22202A2395J75103B4608M11712a36813D08385a3969j2823q525E29
17827b08648D8730J10762G490J51420D1267N5994l5718a00526B70267a68696B0245
17815C9843J04973L3590C104R4112R3876a16271B12762B3196M6050J78240a39965
17803C16908a34318A20029d97303C2971h1534C4353a73674A03764K95337G1089
17792A35518h929m36286E4300L9669J82982B03b36821K2514l04549G0653a90461
$$ y = [150514, -53917, 181300, -59305, -116066, 125368, -148813, -51474, -49310, 72404, 239653, -57489, -48411, -66697, 49206, -221432, -165183, 175672, -183146, -32407, 39194, 197262, -59972, -12368, 236773, -313044, 75043, 18071, -216369, 42551, 41075, 103818, 217816, 243759, 32193, -63638, 53646, 375848, 12395, 187498, 24608, 436320, -136813, 408385, -13969, -26792, -35317, 529, -208648, 48730, 159492, 7490, 158910, 41267, 97261, 61543, -100526, 270267, -168696, 20245, 39843, 144816, 178406, 3104, 97216, 191092, -116271, 212762, 23196, 69246, 247486, -139965, 316908, -134318, 120029, -497303, 32971, -81534, 34353, -173674, 103764, 399101, 71089, 135518, -8929, -445215, 54300, 93969, 276951, 203, -236821, -214307, -518856, 70653, -190461]
17780A56479G6883a50137N5168H21f4210k48374B3747J7946N8828b8337D81571
17768B42778O9180i830A40568l5105J7082f6338D5460c33745A89441h1302E2504
17756D33254A01584P1446R1127i5259j01614K5299G0039a49680A58984i4867C69022
17744h5840B7056Q695j7473J01962m1706d1989H4625r553a34772M66r3429A4562
17731h5495B29058J1961a29243H933b0017C3835M0885A4452a78776C0027g9701
17719f1010B19131d4943B53557j14807a4923B30042E1087a20368L123C21729A28350
17707A48479J33545a08970k4533n1330c9378j77065D23248k10238g4776A93312
17696D0039L38652b7892B54908j01038M9579a5394l8358q4261D30837A95187l9860
$$ y = [156479, 76883, -150137, -94969, 821, -64210, -312584, 23747, 41693, 100521, -28337, 481571, 242778, 311958, -9830, 140568, 105463, 122545, -66338, 45460, -333745, 189441, -81302, 52504, 433254, 101584, 173030, 264157, -95259, -196873, -171574, 70039, -149680, 158984, -94867, 369022, -85840, 27056, 35751, 18278, 120240, 78534, -41989, 84625, 75072, -134772, -134306, -227735, 14562, -85495, 229058, 241019, -129243, 8933, -20017, 33835, 74720, 14452, -178776, 30027, -79701, -61010, 219131, -44943, 253557, 138750, -14923, 230042, 51087, -120368, -117245, 321729, 128350, 148479, 282024, -108970, -133503, -184833, -39378, -216443, 423248, 213010, -74776, 193312, 40039, 378691, -27892, 254908, 153870, 203449, -15394, -53752, -138013, 430837, 195187, 155327]
17685A55327b40023A01856k0209K0272a58655B38430a67137b8834j4439a7087
17674H999M7450f1721J2433B68099H0437L1695n1637K69952G0066M7086K5365
17663A42517a3407A74953F6216b4937D9186j0351K93005j22804P9927A09409g0658
17651E74a90175h3983A27229L0463J52110A33715g1633l3185j00377A57426j2881
17640A44545a26673J3425A07947J5566j5227b7628m4825F7143K52232b4319p2520
17629i6839B95885j00132q2251a4253A03440J63724a86797e1905A24071J00570
17619B24641a242B79151A21182D2858d8683A74329Q5621a55057F3552K33056F5822
17607a45470A86014I2733a13264k84351i2534A93618H7703e3885B76896a18459
$$ y = [155327, -240023, 101856, 81647, 101919, -158655, 238430, -167137, -28834, -43273, -17087, 8999, 56449, -61721, -49288, 268099, 80437, 112132, 60495, 330447, 70066, 117152, 142517, -13407, 174953, 66216, -24937, 49186, 38835, 331840, 209036, 288963, 109409, -70658, 574, -190175, -83983, 127229, 157692, 309802, 133715, -71633, -104818, -205195, 157426, 144545, -126673, -113248, 107947, 123513, 108286, -27628, -72453, 67143, 319375, -24319, -96839, 295885, 195753, 113502, -14253, 103440, 267164, -186797, -51905, 124071, 224641, -1242, 279151, 121182, 42858, -48683, 174329, 259950, -155057, 63552, 296608, 65822, -145470, 186014, 92733, -113264, -397615, -92534, 193618, 87703, -53885, 276896, -118459]
17596B76941j12276P4854r6006b10493A79316a30856a1277E6978H876K21923J14193
17585C44992I5559J62696o2462j8349D9036J96742i885F62541A29616a74720C37892
17573b3999D1690a20442c2576B82118A31106a37520C67853A81863b1603k2901
17563d4504q0772C52173I3504k8173J8885c0007H4532K1559e9503k7592C8988
17551g2105A99969J89680b5222B38829A03604J18578E9598a49931P441A45523
17540a77578E0998J52783A4818c7236B99206K4183O5892j05091b95387B07582
17529a32288F675J77018f2068A37590F2571b2627B50293k7023a48012B3427c8160
17517C32181A2736e1479B47573E8326P4455J19187C8421a3308C17353c4360B1876
$$ y = [276941, 164665, 239519, 143513, -210493, 179316, -130856, -11277, 56978, 8876, 230799, 344992, 95559, 258255, 195793, 177444, 49036, 245778, -9885, 662541, 129616, -174720, 337892, -23999, 41690, -120442, -32576, 282118, 131106, -137520, 367853, 181863, -21603, -44504, -125276, 352173, 93504, 65331, 84216, -30007, 84532, 106091, -59503, -87095, 38988, -72105, 199969, 389649, -25222, 238829, 103604, 222182, 59598, -149931, -142490, 145523, -177578, 50998, 203781, 14818, -37236, 299206, 323389, 389281, 284190, -295387, 207582, -132288, 6675, 183693, -62068, 137590, 62571, -22627, 250293, 223270, -148012, 23427, -38160, 332181, 12736, -51479, 247573, 58326, 132781, 251968, 38421, -13308, 317353, -34360, 21876]
17505a12260O025J3520D20484c41977D15594a31635C16649j37663k6105j6269
17495A36612Q3371J47063B3302J99998J98266j42902A08418M3584J9571J42161
17485C13734b39179E6761J43358A73J55704J03839I107K2315a3677A93835b9537
17473G3223a45093A78321q335J12845A33147R7305J91849C8892K83881C30N2427
17462E2757J5154J06941A7613M20270c7019A80683K18945A58142m4687b1975C40148
17450D21796I4877J70925L2487n7586K62238A07386M10495B44099J34788o0982
17440C17905m9474n8937j3362K12133l4286G0617L25942D7908L71477F9450P8521
17429A47971R8166b1006C14820j55217a57472F61213k74533l7230j51644e1561
$$ y = [-112260, -106235, -92715, 420484, -341977, 415594, -131635, 316649, 178986, 152881, 136612, 219983, 367046, 23302, 223300, 421566, 278664, 108418, 152002, 171573, 313734, -239179, 56761, 200119, 173, 155877, 259716, 9107, 31422, -13677, 193835, -29537, 73223, -145093, 178321, 169986, 282831, 133147, 230452, 422301, 38892, 322773, 330, 52757, 67911, 174852, 17613, 437883, -37019, 180683, 399628, 158142, 113455, -21975, 340148, 421796, 94877, 265802, 298289, 240703, 502941, 107386, 517881, 244099, 378887, 317905, 268431, 209494, 196132, 408265, 373979, 70617, 396559, 47908, 419385, 69450, 147971, 246137, -21006, 314820, 159603, -157472, 661213, 386680, 349450, 197806, -51561]
17418D30379p0433Q3444k21067Q7868r5495E885L65127k0710D8682K76863J13993
17407D39538A75111L50360H2187J00310K37164I9159Q6239e7256B12150k8666
17397A83484K47817m0352j46006L9877j09442N4440J02513P2225K6430k1679G9037
17385C59972A07682D2008J21097E1166K54527l9248a6499B96360l4809Q8322p2308
17374B77565e634A65649O0751j04480J89733p0206j07767J12555p4744K53593
17364D25084j92014N6006P8460j34289K41096B23329D6873L74263b4810A87245
17353C46218j19677O2411I5040J451Q5135D9263J04159O2822K61460A97136J79023
17342C76159b7907B77029b25644O0566E79280j39253I7220N7855M59841k59244
$$ y = [430379, 359946, 443390, 222323, 310191, 214696, 5885, 371012, 350302, 48682, 325545, 439538, 175111, 525471, 82187, 182497, 419661, 99159, 185398, -57256, 212150, 183484, 431301, 390949, 244943, 284820, 175378, 229818, 332331, 404556, 430986, 409307, 79037, 359972, 107682, 42008, 163105, 51166, 305693, 266445, -16499, 296360, 261551, 349873, 277565, -5634, 165649, 226400, 121920, 311653, 241447, 133680, 246235, 171491, 425084, 233070, 289076, 367536, 233247, 474343, 223329, 46873, 421136, -24810, 187245, 346218, 226541, 288952, 95040, 96491, 181626, 49263, 153422, 216244, 477704, 197136, 376159, -27907, 277029, -225644, -165078, 579280, 440027, 97220, 155075, 614916, 355672]
17332C55672Q620E0135c21905I8391J87162l1062D0033O5735Q0664k5937h6796
17320B05089J77007A54037L3533J6155J32450i4438B28412l0147H6708e6333B96965
17308a97676B17856m3660B4016J99122Q3458q9179K7541n6967o6384J7068J77272
17297C15947J4761K1987A49374K21688b346D98839j25510j11911A1694K34583
17287B46277M19188A41536P8386R9622J76220e0846C86714r4094N9459b5699B61008
17275C62727r7636A28576N62172A49839R611J17867Q1726H9307L3756J08360K53732
17264D85155J67394B13930L5917K625K04217n3398j23008L37271k67189d998D96404
17252b6377F3531b92204E75336L1689k93762K2349J68013j59478j11155Q3473
$$ y = [355672, 364292, 50135, -321905, 98391, 285553, 254491, 40033, 105768, 186432, 160495, -86796, 205089, 382096, 154037, 187570, 203725, 336175, -94438, 228412, 198265, 86708, -56333, 296965, -197676, 217856, 174196, 24016, 223138, 306596, 217417, 244958, 187991, 121607, 138675, 315947, 330708, 352695, 149374, 371062, -2346, 498839, 373329, 261418, 11694, 246277, 665465, 141536, 219922, 319544, 495764, -50846, 386714, 292620, 352079, -25699, 261008, 362727, 265091, 128576, 690748, 149839, 159450, 277317, 359043, 89307, 123063, 231423, 485155, 652549, 213930, 249847, 252472, 456689, 403291, 280283, 617554, 350365, -4998, 496404, -26377, 63531, -292204, 575336, 607025, 313263, 335612, 503625, 344147, 232992, 316465]
17242C16465b4883C36868j58026J06166J35119D4899M63449A31853N34295b4717
17231c1324D44778o6054A08118J89701C9872J21679K92548r2439J24915J80013
17221F66588A68075J33604J51285H6571K35585j54654L47331k3801B34735J18297
17211C53032K10300A93176K80775A92863R2121j03777K11058K11514j23740M5297
17201E25336B06142b7030I8238J77932A21543K15925Q2925B09152n3712L56889
17191E12329k50748L84380k45971L8492A44761J39699J81327j18936K1089o9514
17181B98426o296L7482J37535j49563K37155l4277j72515J52624j94811i4966
17170D59922L0775j55142k2009K28866k14157J99982j55237J34402l3058B11874
$$ y = [316465, -24883, 336868, 178842, 285008, 420127, 44899, 508348, 131853, 666148, -24717, -31324, 444778, 378724, 108118, 297819, 39872, 161551, 454099, 361660, 486575, 666588, 168075, 301679, 452964, 86571, 322156, 167502, 514833, 491032, 234735, 353032, 563332, 193176, 473951, 192863, 284984, 181207, 392265, 603779, 480039, 525336, 206142, -27030, 98238, 276170, 121543, 337468, 420393, 209152, 155440, 512329, 261581, 645961, 399990, 438482, 144761, 284460, 465787, 346851, 367940, 298426, 292130, 329612, 467147, 317584, 554739, 520462, 347947, 500571, 305760, -94966, 459922, 490697, 335555, 313546, 542412, 328255, 528237, 373000, 507402, 474344, 211874]
17159E06882j87332J89956L45215k86253j48546L4353J75094l5130A83006O7429
17149B50435K27383j48923K07828P517j54259J34113p6458j80530K54814M3140
17139E65060j47182L03728Q0067l54648j5261D9719J32459J29186L15001M0715
17129F67080C18185K07283m7376j32417O12348C58337L28547r2278k68436L26232
17119F52402B81497M17721j76385k876K34904j99495l3996J11693j84978K94890
17109G42975C05317P3786J71647j97875L77186p924k2459k41080r2661J1726N6690
17098D34353J45435K1969J82907q3682r0005B79272O4705J62326K6389j12114
17088D20578J58628k6613J32739j69000R6914M0471j49128K22790k27583J78989
$$ y = [506882, 319550, 509506, 854721, 568468, 419922, 454275, 629369, 594239, 183006, 250435, 477818, 328895, 536723, 544240, 389981, 524094, 447636, 267106, 521920, 565060, 417878, 721606, 801673, 447025, 431764, 49719, 182178, 311364, 626365, 667080, 318185, 525468, 478092, 345675, 958023, 358337, 686884, 594606, 326170, 652402, 281497, 699218, 522833, 519957, 754861, 555366, 521370, 633063, 448085, 742975, 305317, 379103, 550750, 352875, 730061, 722137, 699678, 458598, 365937, 377663, 434353, 579788, 601757, 784664, 700982, 610977, 279272, 343977, 506303, 532692, 420578, 579206, 552593, 685332, 516332, 613246, 653717, 504589, 727379, 499796, 678785]
17078F78785R0698N410j72546K83777J23019l28412J58563L6018C80087K89145
17068F69232P4895j26997J00845k4062o522n8311K64866j18616N7922p8877M9054
17057H03429o3380o8140K42942m22343J24347Q5286k13041M80388l75877M54024
17047A047635m67390j05085L74504p4805J42810l29665j05874M80193D34162N58254
17037I92416l80926N1526J68721n0817j98597O9516q2224L2611K80402j74573
17027G08055j00749L90848n9148q710m893l3279N1046J04872L4627l23540N60551
17016A319680m77829K15851k60647l7586L60964j24515j44355J57404j35088J01682
17006I75561K20009j30870k16886l1438L7528m8742q335L3171J88981J17209k14978
$$ y = [678785, 769483, 774893, 602347, 886124, 1009143, 680731, 839294, 875312, 380087, 669232, 744127, 617130, 717975, 693913, 687391, 629080, 893946, 775330, 833252, 754375, 803429, 740049, 671909, 914851, 492508, 616855, 702141, 489100, 969488, 593611, 1047635, 580245, 475160, 849664, 774859, 917669, 588004, 482130, 962323, 434162, 992416, 611490, 663016, 831737, 780920, 582323, 651839, 569615, 602226, 882628, 708055, 607306, 998154, 939006, 930296, 925403, 892124, 943170, 1048042, 1082669, 759129, 1319680, 841851, 1057702, 797055, 759469, 1120433, 995918, 851563, 1008967, 873879, 975561, 1195570, 1064700, 847814, 816376, 853904, 805162, 796827, 829998, 1018979, 1136188, 921210]
16995I21210K49760O250j07246J21183n7777j30880J45015K23454l37899K20706
16985A253776k37843J32211J6983k47406N94113k60161R8459n98295O10109m17259
16975I44687J32227P7845k67722L18317J04924N4373k62200L14772k74072K71000
16965A414151j6936J16160k7594p9385k58856J13483j17815J53583P7063K31169
16955A605023l30598K4971J79714r5013Q7078R2770r5329j85878J79210m53620
16945A008328L29955L12082j86945J73237k7654M3691j25164q7986k0731N41711
16935A960524m16001p8345K32927k31028K73392q9893l90590M30242j4756k6112
16925A650360p2686P4455k4489L78833j02802p8192K155j7637l4543p7040J43320
$$ y = [921210, 1170970, 1177220, 1069974, 1191157, 1133380, 1002500, 1147515, 1370969, 1033070, 1253776, 1015933, 1148144, 1165127, 917721, 1511834, 1251673, 1350132, 751837, 1361946, 944687, 1076914, 1154759, 887037, 1205354, 1310278, 1364651, 1102451, 1417223, 1143151, 1414151, 1397215, 1513375, 1485781, 1406396, 1147540, 1261023, 1143208, 1296791, 1373854, 1605023, 1274425, 1299396, 1479110, 1384097, 1471175, 1563945, 1468616, 1282738, 1461948, 1008328, 1338283, 1650365, 1463420, 1636657, 1609003, 1652694, 1527530, 1439544, 1418813, 1960524, 1544523, 1466178, 1699105, 1468077, 1741469, 1651576, 1260986, 1691228, 1676472, 1650360, 1577674, 1652129, 1627640, 2006473, 1903671, 1825479, 1827634, 1809997, 1775454, 1698414, 1841734]
16914A841734K84814l3811J15752j93356k48748M00265k76751L65224l63096L22481
16904B214508P8723K0921k12478J95804q5286J47199j65723o687K01355L4680
16894B423016K72718n5638r7816N000j57338K15258J18155n03491K49195J73633
16884B642692J90771l04416L39555m8587P9515j28752n451J19013J05848o6452
16874B923736Q7281N7151q6829Q7670J11967K85449k58292J12746j18764J13737
16864C315852k5267L3007K41865j20136J81329l5034R0403Q845L7927P0838J2513
16853C812142O0656O2202J13952o3250J17060p1318J35191R4497k05012J07812
16843D163932K34978K31991J62377O4482j83236L39631l43248K69117Q217K56363
$$ y = [1841734, 2126548, 2092737, 2208489, 2015133, 1766385, 2166650, 1889899, 2255123, 1892027, 2214508, 2293231, 2314152, 2101674, 2297478, 2212192, 2359391, 2193668, 2186981, 2388336, 2423016, 2695734, 2640096, 2542280, 2547280, 2389942, 2605200, 2723355, 2219864, 2469059, 2642692, 2833463, 2529047, 2868602, 2820015, 2899530, 2770778, 2765327, 2884340, 2990188, 2923736, 3011017, 3068168, 2981339, 3069009, 3180976, 3466425, 3208133, 3320879, 3202115, 3315852, 3290585, 3323592, 3565457, 3445321, 3626650, 3591616, 3682019, 3690864, 3728791, 3799629, 3812142, 3872798, 3935000, 4048952, 3985702, 4102762, 4031444, 4166635, 4261132, 4056120, 4163932, 4398910, 4630901, 4793278, 4857760, 4674524, 5014155, 4670907, 4940024, 4948241, 5204604]
16833E204604L3029J80890j52971N07829l67134K87865K4978P1364L47861l44507
16823E793808L45622L25577J53085l25990J73993j09362M18042J67575N178K25623
16813G173151J10144J0952L71621l2387L1155J74541L01034N09292j01473M76546
16803I024576l70262K57704J51970P6348J78217l1206P08306O005K60639M56672
16793A0718969k94730P76204K3927L76583o5600M52509N9881M32475L06299L67040
16783A3153557O48964L55718L0162N04200K91722O15881j02428P45669K82875
16774A6526320M91899O72331J09365O45026O43988M93275N64404O47466O86165
16765B1480239O38954M66263R29222N52833Q21414J137378M46182J123593J159216
$$ y = [5204604, 5237633, 5418523, 5265552, 5773381, 5406247, 5694112, 5719090, 5790454, 6138315, 5793808, 6139430, 6465007, 6618092, 6292102, 6466095, 6356733, 6774775, 6942350, 6947528, 7173151, 7283295, 7294247, 7665868, 7633481, 7664636, 7839177, 8140211, 8649503, 8548030, 9024576, 8654314, 8912018, 9063988, 9140336, 9318553, 9287347, 9995653, 10001658, 10262297, 10718969, 10424239, 11200443, 11224370, 11600953, 11535353, 11987862, 12047743, 12480218, 12786517, 13153557, 13802521, 14158239, 14188401, 14692601, 14984323, 15600204, 15497776, 16243445, 16526320, 17018219, 17690550, 17799915, 18444941, 19088929, 19582204, 20146608, 20794074, 21480239, 22119193, 22585456, 23514678, 24067511, 24888925, 26026303, 26472485, 27596078, 28755294]
16756B8755294P45111J180349Q23799J222276J282302M13886K103962J145988
16748C7672967J636571J500976J267951J962028J468774J787708J796761K210980
16740E1304716K004805K084301K679087K185999K717380K604487K899639K695264
16732G1175678K740831L321866K873092L646938L323040L666456L206968L853816
16724I7808685L590217L309088L630724K994432L547265K964340L160300K473309
16716A23478360K544694K159439J800762J432733P75282K24931j7423n11646j037262
16707A30849870j334357j528490k270110k405235k847811l031296l367436l388613
16699A10676522l306234l735617l318072l729272l839750l711180l438122l132244
$$ y = [28755294, 29500405, 30680754, 31504553, 32726829, 34009131, 34423017, 36526979, 37672967, 39309538, 40810514, 42078465, 44040493, 45509267, 47296975, 49093736, 51304716, 53309521, 55393822, 58072909, 60258908, 62976288, 65580775, 68480414, 71175678, 73916509, 77238375, 80111467, 83758405, 87081445, 90747901, 93954869, 97808685, 101398902, 104707990, 108338714, 111333146, 114880411, 117844751, 121005051, 123478360, 126023054, 128182493, 129983255, 131415988, 132191270, 132416201, 132398778, 131887132, 130849870, 129515513, 127987023, 125716913, 123311678, 120463867, 117432571, 114065135, 110676522, 107370288, 103634671, 100316599, 96587327, 92747577, 89036397, 85598275, 82466031]
16691H2466031l420488l181638l143633l190102k927656k594041k754584k932486
16683E8321403k081723k315922k601940k178540j464372k129020j745160j695397
16675D2109329j637637j485060j790330j280824j120671j295884j192932j422884
16667C0883107j365829m65282j239510j068313j235242o37082j000786q77844
16659B2993219o04006p00044m65001r73044k98701m29231r49090n94874m37624
16650A7541604n14780n24848m87611l32807n22440m89934k1572l23747m30955
16641A3892910o59196m09682j18207p37690j66701k34281J6537q24849j35465
16632A0623376l30056j91908o6939k66335p5501m43599m75101J33123k76876k26760
$$ y = [82466031, 79045543, 75863905, 72720272, 69530170, 66602514, 64008473, 61253889, 58321403, 56239680, 53923758, 51321818, 49143278, 47678906, 45549886, 43804726, 42109329, 40471692, 38986632, 37196302, 35915478, 34794807, 33498923, 32305991, 30883107, 29517278, 29051996, 27812486, 26744173, 25508931, 24871849, 23871063, 22993219, 22389213, 21689169, 21224168, 20251124, 19952423, 19523192, 18574102, 17979228, 17541604, 17026824, 16501976, 16014365, 15681558, 15159118, 14669184, 14647612, 14323865, 13892910, 13233714, 12824032, 12705825, 11968135, 11801434, 11567153, 11583690, 10758841, 10623376, 10293320, 10101412, 10034473, 9768138, 9692637, 9249038, 8773937, 8907060, 8630184, 8403424]
16622H403424k11941j53523k84801k8849M9248l84401j94895J74998n43987J70017
16612F995290l81544K09338k71603n9181m19329j38604L36421l74913l19030l20192
16602E256653K12802K10773l91406j28961k77906K28029q1718k61219L28567l90233
16592D705381o1822N397K6618j45807k92339j60566L68055n12426J17034k93126
16582C756399R5844j68450n388q4448J83203r1234J65118m44520j04998j33089
16572C168437L82986m05679M1402j86221J46419n2621M29328p07153K45446J344
16562C063688k23662l24648L08855J08188l15511M3673P1725r0427l64556L66734
16552B644059j68529j59153K19590j52629r1242k57038J14521O5791R9289j04888
$$ y = [8403424, 8191483, 8037960, 7753159, 7724310, 7773558, 7389157, 7194262, 7369260, 6825273, 6995290, 6613746, 6823084, 6551481, 6492300, 6072971, 5934367, 6270788, 5895875, 5576845, 5256653, 5469455, 5680228, 5288822, 5159861, 4881955, 5109984, 5028266, 4767047, 5095614, 4705381, 4643559, 4648956, 4675574, 4529767, 4237428, 4076862, 4444917, 3932491, 4049525, 3756399, 3852243, 3683793, 3678405, 3593957, 3777160, 3685926, 3851044, 3406524, 3301526, 3168437, 3551423, 3145744, 3187146, 3000925, 3147344, 3094723, 3524051, 2816898, 3062344, 3063688, 2840026, 2515378, 2824233, 2932421, 2616910, 2660583, 2732308, 2641881, 2277325, 2644059, 2475530, 2316377, 2535967, 2383338, 2292096, 2035058, 2149579, 2215370, 2314659, 2209771]
16542B209771j08578k11382M07541K0520m04891L00537j34964J04835J84213m93764
16532A873838Q0508k4135K91882l32548j6154P8938l13543L99255l42481K25094
16522A920654l76586K44582j22580P8461K01024m40953M55745j38395j60818k33202
16512A427932L19062l6466m2916l31471J17202K55871k22306P4129j95290P1258
16502A437005J5815N0550j71402Q0850R6275m8937o7609p545o42176R08433j54814
16491A496445j91178j43200K06031J24103n01528J88715L7495k97175M60958l76517
16481A004149Q4640J40744o6658j41488l09133L42525M545K27074l64141K98540
16471A220797k95434K4368K58016E24156N33715r3810j59608K518L32352j99510
$$ y = [2209771, 2101193, 1889811, 2297352, 2317872, 1912981, 2213518, 2078554, 2183389, 2367602, 1873838, 1954346, 1930211, 2222093, 1889545, 1873391, 1952329, 1638786, 2038041, 1695560, 1920654, 1544068, 1788650, 1666070, 1744531, 1945555, 1504602, 1960347, 1821952, 1661134, 1427932, 1746994, 1710528, 1667612, 1336141, 1453343, 1709214, 1486908, 1561037, 1365747, 1437005, 1452820, 1503370, 1331968, 1412818, 1509093, 1460156, 1392547, 1385002, 742826, 1651259, 1496445, 1305267, 1162067, 1368098, 1492201, 990673, 1179388, 1216883, 919708, 1380666, 1004149, 1088789, 1229533, 1162875, 1021387, 712254, 1054779, 1059324, 1286398, 922257, 1220797, 925363, 949731, 1207747, 524156, 1057871, 964061, 804453, 806971, 1139323, 939813]
16461I39813o3417P7375j82259J11704j60561J12294r1055r2646L30618n934l03970
16450F71962R6921K52999j67603M3080N8010k77361K25960N476L6837j54646Q2466
16439H74101j63683p2642J88531k39131J73967j10159L50349m94538J78543K17521
16429I02859l29875K64115l35205M59570D61389K98931k28052L16071l8067O3210
16419H73482M4075m23019L01166P7077C17441M50689L0029L0586k35371m8344
16409E45030P8002j99686J45783M0370O8890l28680J8413K50216m7085L4950p5440
16398E30763j5471p5932L89213C87716K62159q5397J02442k65978K83724l02187
16388C82479K16963N5973l6103j99054J32673Q5125j73551o7148R3023m3777j87543
$$ y = [939813, 876396, 953771, 771512, 883216, 722655, 834949, 743894, 651248, 981866, 975932, 671962, 768883, 1021882, 854279, 897359, 955369, 678008, 903968, 909444, 946281, 791635, 874101, 710418, 637776, 826307, 587176, 761143, 650984, 1001333, 506795, 685338, 902859, 572984, 837099, 501894, 961464, 461389, 760320, 532268, 848339, 810272, 873482, 917557, 494538, 795704, 872781, 317441, 768130, 798159, 828745, 593374, 545030, 623032, 423346, 569129, 609499, 678389, 349709, 368122, 618338, 571253, 606203, 530763, 515292, 439360, 828573, 387716, 649875, 564478, 666920, 400942, 684666, 382479, 599442, 655415, 619312, 420258, 552931, 638056, 464505, 397357, 490380, 446603, 259060]
16377B59060K76476j42738L44810A76886L85826n0781B52023J55331P0100P8650
16367E56104L8615k17181K13150R1835B95041O4400O4213m2393J48011j03299
16357D25973Q6442j88423k1153P7375A31905N4903l8283L01134A19861J79659
16347B99520K66390n576B53229K85445k33498A00995P8918J24424b552F20598
16336C08580J34497l2908j27678K26044m0756A98395J23049J51329A25344L04984
16326D30328B07015n8643l965M24486I7755P6491J45084K10425j25450C3340J85186
16315B18526F3963K18839n9500K2860C076N3096L64790r1524j37687E6015b0980
16303A99183K20264j56331J49150R3753a13356D1172J34238K29822e0052C53534
$$ y = [259060, 535536, 392798, 737608, 176886, 562712, 511931, 252023, 407354, 477454, 556104, 594719, 377538, 590688, 682523, 295041, 359441, 423654, 381261, 529272, 425973, 512415, 323992, 302839, 380214, 131905, 186808, 148525, 449659, 119861, 299520, 565910, 560334, 253229, 538674, 305176, 100995, 179913, 304337, -2552, 620598, 308580, 443077, 410169, 282491, 508535, 467779, 198395, 321444, 472773, 125344, 430328, 207015, 148372, 144407, 568893, 97755, 174246, 319330, 529755, 404305, 33340, 218526, 63963, 282802, 223302, 246162, 3076, 56172, 420962, 329438, 191751, 56015, -20980, 199183, 419447, 263116, 412266, 506019, -113356, 41172, 175410, 405232, -50052, 353534]
16292A95556J68605P089k8465b6825E64802k14944N2063K76652K84976k997l55106
16281F05446B77938L61549A00265h9046D82250j14119E7712a72914D41926j42310
16271B99616a8175A47080K95557A61501P3759J32635F3521K41972J09766A23081
16260D03857A34912L56027j71652L359b04017d3188E12329B16581I6613f4754
16249C20347J2447j63913D9989J40056a09533A12869M9868O6850K54271g5204
16238A08413J30275J22585j70627L69382d0995J7789j00675B85329J50496B1080
16227B06594o1942J3846l5948m0885J24646K52240B09265Q7210I7770k0721N156
16216H2205a3003A87733G3831Q6516K0457J66980J15034E4718J01994D982J65260
$$ y = [195556, 364161, 371250, 342785, -26825, 564802, 349858, 401921, 678573, 963549, 960552, 605446, 277938, 639487, 100265, -89046, 482250, 368131, 57712, -172914, 441926, 299616, -18175, 147080, 442637, 161501, 235260, 367895, 63521, 305493, 415259, 123081, 403857, 134912, 490939, 319287, 322646, -204017, -43188, 512329, 216581, 96613, -64754, 320347, 332794, 168881, 49989, 190045, -109533, 112869, 162737, 229587, 483858, -75204, 108413, 238688, 361273, 190646, 560028, -40995, -23206, -123881, 285329, 435825, 21080, 206594, 144652, 158498, 122550, 81665, 206311, 458551, 209265, 296475, 97770, 77049, 82205, -13003, 187733, 73831, 160347, 180804, 347784, 462818, 54718, 156712, 4982, 170242]
16205A70242J89675A08933a16768C99594j38515G3180D593L00796F2937L70555
16195D33492g0078C44005b61864B39907A11797a7738B90482k6725h6866B15169
16184A03105q151B2877J44640n8675A0354c711C52839h7777F4021L00485A05315
16172F1525N03102E1759A0923b88801B80153n7853L919G4282c65170i4089b3351
16160E2237L2008R7113R5996a32800N4338A17964l1346l7277J1230L94436F3886
16148d5673j04381E0370O293J39313C5965g4906A56187k0560j2380j0179K34357
16137C47425q7670A19364b87215g8798A18175N8235o6395R536O8911j5450a67733
16125a36901A51226b13714A71753h3522c9293A10669M2208m1226K38944c59G7805
$$ y = [170242, 359917, 108933, -116768, 399594, 261079, 73180, 4593, 305389, 62937, 433492, -70078, 344005, -261864, 239907, 111797, -17738, 290482, 263757, -86866, 215169, 103105, 94954, 22877, 167517, 108842, 10354, -3711, 352839, -87777, 64021, 364506, 105315, 61525, 564627, 51759, 10923, -288801, 280153, 222300, 226219, 74282, -365170, -94089, -23351, 52237, 84245, 181358, 277354, -132800, -78462, 117964, 86618, 49341, 60571, 455007, 63886, -45673, -150054, 50370, 56663, 195976, 35965, -74906, 156187, 135627, 123247, 113068, 347425, 259755, 119364, -287215, -78798, 118175, 176410, 110015, 119551, 188462, 173012, -167733, -136901, 151226, -213714, 171753, -83522, -39293, 110669, 152877, 111651, 350595, -359, 77805]
16113A52489J42981j12377J80676j00821m2585N2679j07247J02713O9072a4243
16102D11390A03377J75121A9109b23304D3332N8589c0782G1364B7931c5127A25964
16090f8708A04793b48031B39466r4796o9503i9201C59897j42522J08432o9356
16080B56451r0512J9196J98159q9474G9337J71789a56315k39A63228p9185J86704
16069B70747L2649D6673a12429A47197l7718l6286C5963j3022K82005c0938B08436
16057b3694B2503J13458g009B0786a16542N6015G0552d1526A99720J6496j2700
16046B03516L13814j71779F4225M7821i1781j60285B23680a73549p8410B5286
16035h0798B17923K41162B06423f1097C11035h1853A02716J87530r2982A4557
$$ y = [152489, 295470, 183093, 363769, 262948, 220363, 273042, 165795, 268508, 337580, -14243, 411390, 103377, 278498, 19109, -223304, 43332, 101921, -30782, 71364, 27931, -35127, 125964, -68708, 104793, -248031, 239466, 144670, 75167, -99201, 359897, 217375, 325807, 256451, 165939, 185135, 383294, 293820, 79337, 251126, -156315, -156554, 163228, 84043, 270747, 303396, 46673, -112429, 147197, 109479, 73193, 35963, 22941, 304946, -30938, 208436, -23694, 22503, 135961, -7009, 20786, -116542, -60527, 70552, -41526, 199720, 216216, 203516, 517330, 345551, 64225, 112046, -91781, -252066, 223680, -173549, -251959, 25286, -80798, 217923, 459085, 206423, -61097, 311035, -81853, 102716, 290246, 197264, 14557]
16024b24902K0261B46517n9450o5941k2251D0357d3432A60004b36712a9956A06161
16012b55084B80878a62681b5152r3259B65997f2286F8128b10097e9975A82416
16001G4688a57001B76144B3836m47a03383N1318F3149b67693P5686I7317J19687
15990B17004O123a71173B01003R7326a14120A3508a50629O9093n7967N5359I4427
15978g8256r7483A87005K16068C7862a00796A71134D4035P2616J47923g8212j75479
15967b53691B19246l7950b38687C32882d2630B11543a44160c8441j12839f8357
15956h5395I7960N6835f2653l16436D14363j60114l1211n1013h1362j98930G3078
15944f4153K9642B6964K7697K48588a46245j36549A01203b63584Q63j3878c0077
$$ y = [-224902, -204641, 246517, 187067, 121126, 98875, 40357, -43432, 160004, -236712, -19956, 106161, -255084, 280878, -162681, -25152, -118411, 265997, -62286, 68128, -210097, -59975, 182416, 74688, -157001, 276144, 23836, 23389, -103383, -52065, 63149, -267693, -192007, 97317, 217004, 223127, -171173, 201003, 298329, -114120, 13508, -150629, -81536, -139503, -84144, 94427, -78256, -175739, 187005, 403073, 37862, -100796, 171134, 44035, 116651, 264574, -78212, -253691, 219246, 181296, -238687, 332882, -42630, 211543, -144160, -38441, -151280, -68357, -85395, 97960, 154795, -62653, -379089, 414363, 254249, 223038, 172025, -81362, -280292, 73078, -64153, -34511, 26964, 54661, 303249, -146245, -282794, 101203, -263584, -262721, -276599, -30077]
15932D4565P5668g1646B10653o2495K26210c398B3557L906J59672C3111b54828
15920F489f4595E0173J59171I9928b4275Q138A15755b39977C595L55773j73490
15909A85878f3528A33334A6022b94095J23475A2664J93824E7017Q6457e5488j89842
15898b45330a0336C4757a39012k0421I9573B2086J8569J31807J59023j58293a7637
15886B9591R0687d0583m1585j03985a5191D8295a5660A4031d40296a49021C4458
15874a96832A16240h9703A38393a54621A62456O0939a19406K7708k6665N2174
15864f6189b53j95853f104o0584B4631a21780M882A48641m0094J26510c4090B20905
15851A0564L5149a6589c544m13j87612F6543b35312g8244j07413A41134a26237
$$ y = [44565, 120233, -71646, 210653, 148158, 374368, -3398, 23557, 27463, 187135, 33111, -254828, 6489, -64595, 50173, 209344, 99928, -24275, -16137, 115755, -239977, 3595, 359368, 185878, -63528, 133334, 16022, -294095, -170620, 12664, 206488, 57017, 143474, -55488, -245330, -10336, 34757, -139012, -159433, 99573, 22086, 40655, 172462, 331485, 173192, -17637, 29591, 120278, -40583, -82168, -186153, -15191, 48295, -15660, 14031, -440296, -149021, 34458, -196832, 116240, -89703, 138393, -154621, 162456, 223395, -119406, -91698, -118363, -66189, -253, -196106, -6104, -66688, 24631, -121780, -116898, 148641, 108547, 235057, -34090, 220905, 10564, 45713, -16589, -3544, -3957, -191569, 66543, -235312, -78244, -185657, 141134, -126237]
15839a79356A80325D3780J02833N852M3040n5655f7578B46141E3386O7533a85565
15827h3587E0812J48516a76418j5703A97545e2603k35008c3361C2824a03581d7967
15815A17872J68380p0601a59408B57985a12089L5681p6397B8221e9769J7769B36122
15803C27302e6297j14775A08816a26844n1159A27034D9021A272a77379A37164
15792a27593B51264G8806J4890B1565b57705H7296R3012c40987e6218j60691H0397
15780G3818a01158D4635c7047k33867A17265d8324a4641D69957D485K9151J05756
15769A39392h5073M0678A4699L0315Q3067a08168d162r5292j91952A15697h315
15757A13313J79376g8036j09144c8447A9022L38931A78806b72892e3131B44472
$$ y = [-179356, 180325, 43780, 146613, 152465, 195505, 139850, -67578, 246141, 53386, 120919, -185565, -83587, 50812, 199328, -176418, -192121, 197545, -52603, -287611, -33361, 32824, -103581, -47967, 117872, 286252, 215651, -159408, 257985, -112089, -76408, -152805, 28221, -59769, -42000, 236122, 327302, -56297, -171072, 108816, -126844, -178003, 127034, 49021, 1272, -177379, 137164, -127593, 251264, 78806, 93696, 21565, -257705, 87296, 180308, -340987, -56218, -216909, 80397, 73818, -101158, 44635, -37047, -270914, 117265, -48324, -14641, 469957, 4485, 33636, 139392, -85073, -44395, 14699, 45014, 128081, -108168, -4162, -99454, -291406, 115697, -8315, 113313, 292689, -78036, -187180, -38447, 19022, 357953, 178806, -272892, -53131, 244472]
15746A2639L3541j350d6844E4875l843b1710A08263g3728B4391O0240b0053k05456
15734b25509E4366f8041p2001A06207b623A61596p0385J38195P1505h3998I3903
15722b89418a26751f56q1722k72570A49654K3000a00488c0606j03923B05482e648
15710d3737E9348a54222g5870H4123K73671d05546D43695a46718K3020m3758C78941
15698A37123l668a18362C6232a63976G4851K89914q0568m0147H4425J95036A01755
15686B56901G4224P7015l9319L6439b59099M4465k2670B79727k3247r5213e366
15674B65674A3350f9639f580p0414p5614N4493n9156E939a24171e9180B18803
15662a43277f3789B5370N2278J55574a763A59139g5651A73538b81017R2858B4152
$$ y = [12639, 46180, 44830, -46844, 54875, 51032, -21710, 108263, -73728, 24391, 84631, -20053, -225509, 54366, -68041, -140042, 106207, -2623, 161596, 91211, 229406, 300911, -83998, 93903, -289418, -126751, -656, -82378, -354948, 149654, 172654, -100488, -30606, -134529, 205482, -5648, -43737, 59348, -154222, -75870, 84123, 357794, -405546, 443695, -146718, -123698, -167456, 378941, 137123, 133455, -118362, 36232, -163976, 74851, 364765, 284197, 244050, 84425, 279461, 101755, 256901, 74224, 151239, 111920, 148359, -259099, -214634, -237304, 279727, 256480, 161267, -5366, 265674, 13350, -69639, -6580, -76994, -152608, -98115, -157271, 5939, -124171, -59180, 218803, -143277, -63789, 25370, 77648, 233222, -1763, 159139, -75651, 173538, -281017, -188159, 24152]
15650A43587J0341L86549e7412E3654a32340e9169l8090I0460m3684J43837e4340
15638F0273L73294a06367B53100a14339k30318A10062a72392D954O2857g8774
15627b53567c2550A15928b7481B45317b04929a9843C81261b7635A68336F1849
15616G6072J47874a88321A62591a86475A78141e8169A98319a8373k2294B12258
15605i6354M0436D9831b12498G1656O762P9107n3638O3524q1522l3499k6184P3083
15593I9289a45702E9126J65624i757A76545M84756B08473J94685A41056N0298
15583A91354b8839q8415o7929A23330g758E51320A75967H2916j9070c46674a13717
15571a09544p1429K2508F2145b34829A49200R1485j03561E2760L78025A38302
$$ y = [143587, 153928, 540477, -57412, 53654, -132340, -59169, -97259, 90460, 46776, 190613, -54340, 60273, 433567, -106367, 253100, -114339, -344657, 110062, -172392, 4954, 67811, -78774, -253567, -32550, 115928, -27481, 245317, -204929, -19843, 381261, -27635, 168336, 61849, 76072, 223946, -188321, 162591, -186475, 178141, -58169, 198319, -18373, -40667, 212258, -96354, -55918, 49831, -212498, 71656, 78418, 157525, 103887, 167411, 85889, 52390, 26206, 99289, -145702, 59126, 224750, -9757, 176545, 661301, 208473, 403158, 141056, 191354, -28839, -117254, -185183, 123330, -7758, 551320, 175967, 82916, 63846, -346674, -113717, -109544, -180973, -158465, 62145, -234829, 149200, 240685, 137124, 52760, 430785, 138302]
15560D05958A30491a3051C2806P0209J38509A429J60836j2976Q8065g6216j03703
15549a79919H9876a3441j97079A03733A0065J15369R2270J18845Q6435H7138g9023
15537B40779E0012K13062h0233C13984i7142D5284e737b704A501d4615J8531G61
15524h2081l7944B22719a8146A48774N6388a93122D1004J63955m2683G9634K23556
15513C03190J31065I3937J08854M8189A23965N4178d5370A71288G8341b33194
15502A08887C7073O4721e5325b3300q324A77062a96977D7392K17529F2909L12496
15491C75405a88222E1413R502f98m9832B74894E7490A5033J30004b18442H3400
15479B37663I0873e3002B40484b2646C75766F8339d3677G3624L5029J71148c03998
$$ y = [405958, 130491, -13051, 32806, 103015, 241524, 1429, 162265, 149289, 237354, -76216, -179919, 89876, -13441, -210520, 103733, 10065, 125434, 217704, 336549, 422984, 87138, -79023, 240779, 50012, 263074, -80233, 313984, -97142, 45284, -5737, -2704, 1501, -44615, -26084, 761, -82081, -120025, 222719, -18146, 148774, 205162, -193122, 41004, 204959, 162276, 79634, 303190, 434255, 93937, 202791, 250980, 123965, 178143, -45370, 171288, 78341, -233194, 108887, 37073, 101794, -55325, -23300, -31624, 177062, -196977, 47392, 264921, 62909, 375405, -188222, 51413, 60915, -698, -50530, 274894, 57490, 15033, 145037, -218442, 83400, 237663, 90873, -53002, 240484, -22646, 375766, 68339, -43677, 73624, 108653, 279801, -303998]
15467a99614B00926b86687C27431A59390D7209K24688o4379B0952L58120E5014
15456a14179L2304A45700a59029d2170A6184K8888b9045j15967C4555j4395J71417
15445A91577a22162B05026c3264B23937E6938b77660F716d4295m2848B96418C2041
15433e748A0041a22848C24925h9353b4155A00722f8811D21633A49740P024b5889
15421b7426H7327c38857C57125j61301q6992P2297a72639A30176J4212E2020a6494
15409a74953A73744J5929p8146o292b51991A18020a35480D19931c8039C450O7340
15398G0790O7811K48417A74290J59202E0198J77445C9322b42876E8607N1972c8391
15386A31121m2341d0851A99246P2518A02295k5811A5364K39340q3862l24K47742
$$ y = [-199614, 200926, -286687, 327431, 159390, 47209, 271897, 207518, 20952, 379072, 55014, -114179, -81875, 145700, -159029, -42170, 16184, 45072, -29045, -145012, 34555, 20160, 191577, -122162, 205026, -33264, 223937, 56938, -277660, 6716, -44295, -87143, 296418, 32041, -5748, 10041, -122848, 324925, -89353, -24155, 100722, -68811, 421633, 149740, 156764, -25889, -27426, 87327, -338857, 357125, 195824, 108832, 181129, -172639, 130176, 144388, 52020, -16494, -174953, 173744, 189673, 111527, 105235, -251991, 118020, -135480, 419931, -38039, 3450, 70790, 138601, 387018, 174290, 333492, 50198, 227643, 39322, -242876, 58607, 110579, -38391, 131121, 88780, -40851, 199246, 271764, 102295, 76484, 15364, 254704, 170842, 170518, 418260]
15375D18260A80010R0813D3290g0490G6954h2137C56715A77823k006m2765K4843
15364A57895J30167K9343n7575A23124J21527A07974J05278l4811f8413B77831
15353B13871K32881D1362K26978r7091J67851b1046D02281a6655p9537D0719e2960
15341B21221n5599R3153Q9641A53548f0225A63089a18695E7632J63332r0720L12423
15330D42667A00831C2353J06835M00738I5026K25725g5524H1814J86269m5792
15320B22291J73610j29505O4726J76560k03425I9282b05260A14067J35427A366
15309C83772A05875J33340Q8803A61155K4884R0538E5349j2579g3797A27911J96257
15298C24168G0369B508a1045B72810r2336r447J21815g7942n104B04891K30540
$$ y = [418260, 180010, 270823, 43290, -70490, 76954, -82137, 356715, 177823, 175817, 133052, 157895, 288062, 317405, 259830, 123124, 244651, 107974, 213252, 178441, -68413, 277831, 213871, 446752, 41362, 268340, 171249, 339100, -21046, 402281, -16655, -96192, 40719, -52960, 221221, 165622, 258775, 348416, 153548, -60225, 163089, -118695, 57632, 220964, 130244, 442667, 100831, 32353, 139188, 539926, 95026, 320751, -75524, 81814, 268083, 222291, 395901, 266396, 331122, 507682, 304257, 99282, -205260, 114067, 249494, 1366, 383772, 105875, 239215, 328018, 161155, 186039, 276577, 55349, 42770, -73797, 127911, 324168, 70369, 2508, -11045, 272810, 180474, 171027, 292842, -77942, -83046, 204891, 435431]
15287D35431q3544a69012I8822J88686a3906A71891M44679E5342M5347a35340
15276f5183C47069e481A52370L48545B13998P4587a70771B26212M9721j4207A14034
15264B42984J50809A61665o2938j2798L25870f954A25391A3585J85359K48813
15254D47757j86645n4717J67807j8532P7013a59242H53516J28976P74876K76927
15244B034295p85736J095962j031062E93385k90296C2424L09554p1905M6656K6287
15234C43016A71396m6335j1664n6207K21834r5420K27875A08274m0214K24106
15224B92166K9875N3121A44047o0596J47689N4090b20254A42389k9889l1457K79759
15213C60802p2582G1124B9919K48014K4551l6422A21527a48731G3747i1458B75634
$$ y = [435431, 351887, -169012, 98822, 287508, -13906, 171891, 616570, 55342, 100689, -135340, -65183, 347069, -5481, 152370, 500915, 213998, 288585, -170771, 226212, 275933, 261726, 114034, 242984, 393793, 161665, 98727, 85929, 411799, -6954, 125391, 13585, 198944, 447757, 261112, 206395, 374202, 355670, 432683, -159242, 853516, 982492, 1757368, 2034295, 1248559, 2344521, 1313459, 593385, 303089, 32424, 341978, 270073, 316729, 343016, 171396, 125061, 113397, 57190, 279024, 183604, 411479, 108274, 68060, 292166, 322041, 375162, 144047, 83451, 231140, 285230, -220254, 142389, 112500, 81043, 360802, 288220, 71124, 29919, 277933, 302484, 266062, 121527, -148731, 73747, -91458, 275634]
15201A63220e1594n725C6645J54642A866R8778h4566A59853b18286B77485j08829
15190A68656J38032j42739b3183A10779J18278a19527I7631J61081A17904J79144
15180B97048A42912i0478B26996K33J4111H2166N0185g7691C02302J50276A98623
15168B14642K1865a89041C7384a31693D31861A99257c0431B25108J32930A23673
15157B06240b1851A51488L8634l6444E5208M43031k31476n2911L39395B14533
15146A24450J03441E7523k0921R9099i6160D03721G1341N727a16370A3692K20406
15135B34098I2989J42915l6836K52131C6227K63470K38128A38118K30557l465
15125C65210A50709R0134J38381A86515J98041H961O46964C15211A26363J10519
$$ y = [163220, -51594, -57319, 36645, 191287, 1866, 100644, -84566, 159853, -218286, 277485, 168656, 306688, 163949, -23183, 110779, 229057, -119527, 97631, 258712, 117904, 297048, 142912, -90478, 226996, 227229, 241340, 82166, 132351, -77691, 302302, 452578, 198623, 214642, 236507, -189041, 37384, -131693, 431861, 199257, -30431, 225108, 358038, 123673, 206240, -21851, 151488, 190122, 153678, 55208, 498239, 266763, 213852, 553247, 214533, 124450, 227891, 57523, 36602, 135701, -96160, 403721, 71341, 77068, -116370, 13692, 234098, 92989, 235904, 199068, 451199, 36227, 299697, 537825, 138118, 368675, 365210, 150709, 240843, 379224, 186515, 384556, 8961, 655925, 315211, 126363, 236882]
15115B36882K05564j15113r8704l085O4259J29939j50026A27552J33248A03004
15104B41712O1870l1128j05737J65220J90110j56142K55929j40227m6502p8327
15094C56778o7681n7215D8820K27868A02372J38194P3727r8156J93656j8097j49318
15083B42378n8030K45174J3405j19821J55211K0969B22418l7106K2026p0385j3894
15072A23059J19614j3804J16120A6381K45941J23289J79820B82177l9610J00923
15062C43490R8589j96732R2437q9499j04410R5973R1313L73607l05358J0047O7141
15051D76598J59867j55895J2301k10372K52157p8693K50051m8873n0347B68509
15040C43549J51754B13438J71398K1686J6974o7267M4473K19056l08381L6445
$$ y = [236882, 442446, 327333, 228629, 225544, 289803, 419742, 269716, 127552, 260800, 103004, 241712, 303582, 272454, 166717, 331937, 522047, 365905, 621834, 481607, 435105, 356778, 289097, 231882, 48820, 276688, 102372, 240566, 314293, 216137, 409793, 391696, 242378, 184348, 429522, 442927, 323106, 478317, 499286, 222418, 185312, 207338, 136953, 123059, 242673, 228869, 344989, 16381, 262322, 385611, 565431, 282177, 242567, 343490, 442079, 245347, 337784, 248285, 143875, 239848, 331161, 704768, 399410, 409457, 476598, 636465, 480570, 492871, 282499, 534656, 455963, 706014, 657141, 606794, 268509, 343549, 495303, 213438, 384836, 406522, 423496, 356229, 400702, 619758, 311377, 347822]
15030C47822A50703R8404K04145j90351p3548L43900A33501O5029K1956j09791
15020A10695J59289J05687l2552K54488k28902K16583L7903j32806r6377q3783
15010C10225d1407E43168B50521J26135J33670A72976P8414J84147B10621J09772
15000C20393Q6083F6372K80542K4062K29465k22894r2932L90155B70045O1942
14990C31987L38884p4064A69183K87232M389J798r5446L62482m6202k82344l4019
14979C67073J39203B17397L65813O9241k85006J21229j79200J83699J7802L05052
14969H16027r4308C53537J01805K26215C3194N00211j85997N5021N5405N3277
14959E11111n6681J77263K29032j0856j63576o3132J40242k82174l1944J72105
$$ y = [347822, 150703, 249107, 453252, 262901, 189353, 533253, 133501, 198530, 220486, 110695, 269984, 375671, 343119, 597607, 368705, 585288, 623191, 490385, 394008, 310225, -41407, 543168, 250521, 376656, 510326, 172976, 251390, 435537, 210621, 320393, 406476, 66372, 346914, 370976, 600441, 377547, 284615, 674770, 270045, 331987, 670871, 596807, 169183, 456415, 460804, 462602, 367156, 729638, 683436, 401092, 367073, 506276, 217397, 583210, 652451, 367445, 488674, 309474, 493173, 510975, 816027, 721719, 353537, 455342, 681557, 33194, 533405, 347408, 402429, 457834, 511111, 454430, 631693, 860725, 849869, 686293, 623161, 763403, 481229, 449285, 621390]
14949F21390j13064R5028M5457r897k62025L51718K8479k31408k43377P0608K80425
14938F33334j77516J39250k40966M00151j53203r2324l2150L0524j84487J51491
14928D74104Q9105A60874O8843J66030J45091k05106K23862j52234K09618k9330
14918E87648K13599C89299A44419N30198k13324J42873L08015k26601k35329q2817
14908C67434M60241C55246q636K51972j29173Q7692r7631q563A30810L69066n9287
14897D40589j57845L62519B54812K7692J46869J13267q8899L06742k12380p5858
14887D72245K12867M6174C57840J59627N9966Q5927k88377J27883A90256M83383
14877F73639A64291L55656A39862J50761N55801C4248M99965k7938J68057j55384
$$ y = [621390, 508326, 603354, 648811, 638914, 376889, 728607, 757086, 525678, 282301, 352909, 633334, 455818, 595068, 354102, 754253, 601050, 508726, 476576, 507100, 322613, 474104, 563209, 160874, 229717, 395747, 540838, 335732, 559594, 407360, 616978, 587648, 801247, 389299, 144419, 674617, 461293, 604166, 912181, 685580, 450251, 367434, 827675, 355246, 346610, 598582, 469409, 557101, 459470, 450907, 130810, 499876, 440589, 282744, 645263, 254812, 282504, 429373, 542640, 453741, 760483, 548103, 472245, 685112, 731286, 357840, 517467, 577433, 663360, 374983, 502866, 190256, 673639, 164291, 519947, 139862, 290623, 846424, 34248, 534213, 506275, 674332, 518948]
14867E18948j99861N51566j75040k02348K57074C35068K87484j58317j59708M98145
14857H02672j9617k42733j42890K78586N9641B32216M41137o8090J0443L2670
14847F48376j2036O7630K06213j54017j3259k58204K61670J61530k26024k08487
14837D73392j36513J22221K42665p9199J74941k98924K5512K09978K2573J71117
14827I27763k23997J02200J05874l87610M00245j06914q5339J144K47127l35949
14817F44544J39448P9410K9650l66303M18157k58383k07242o8170K60832r9600
14807E72343j86665M90905m30361K64263L80180k74252k83427L01302O5549C48934
14796G55113j80904Q9538M06972D58750L16159n0442K10072C98713L63991J48121
$$ y = [518948, 319087, 870653, 695613, 493265, 750339, 335068, 622552, 464235, 304527, 802672, 783055, 540322, 397432, 676018, 735659, 232216, 673353, 605263, 615706, 648376, 636340, 703970, 910183, 756166, 742907, 484703, 746373, 907903, 681879, 473392, 336879, 459100, 701765, 622566, 797507, 498583, 524095, 734073, 756646, 927763, 703766, 805966, 911840, 524230, 924475, 817561, 732222, 733366, 980493, 644544, 783992, 863402, 893052, 526749, 944906, 686523, 479281, 411111, 671943, 572343, 385678, 876583, 446222, 710485, 1090665, 816413, 532986, 834288, 899837, 348934, 755113, 574209, 663747, 1070719, 458750, 774909, 724467, 934539, 398713, 762704, 910825]
14786I10825q0754l96434L93722K93240q6727l2248k17098R004j33423K41155
14776I01262k0444l5838P7410j57109l8063L19552j99134J0776k23250L11202
14766I46364J02866l50550K27467l80265L79837j77115K95224l79110J16325j661
14756G79382j15006J33720j54455J11194j48772J65783n3892J26583J72857r1672
14746I25722K15666K10849m46646o8448K92022k98301k75103J79997q3716P7986
14736G30028M64998n7212m8114k90471J09159O5555K18312n4858k16238j70604
14726G50555K78251j81676M13058j78982k25986K5976K61323j20650J99772l26867
14716H94774J26574J74940k85177R9171j85332L68816l66005J77008q3111J0728
$$ y = [910825, 830071, 433637, 827359, 1120599, 1033872, 1001624, 784526, 793530, 660107, 901262, 880818, 844980, 922390, 765281, 727218, 1046770, 847636, 858412, 635162, 946364, 1049230, 698680, 926147, 545882, 925719, 748604, 1043828, 664718, 781043, 779382, 664376, 798096, 643641, 754835, 606063, 771846, 717954, 844537, 1017394, 925722, 1141388, 1352237, 905591, 837143, 1129165, 830864, 555761, 735758, 652042, 730028, 1195026, 1137814, 1089700, 799229, 908388, 973943, 1192255, 1137397, 921159, 750555, 1028806, 847130, 1260188, 1081206, 855220, 881196, 1142519, 1021869, 1221641, 894774, 1021348, 1196288, 911111, 1010282, 824950, 1193766, 827761, 1004769, 921658, 932386]
14706I32386K77727j04626n9075J15261k12407J79747q3768n0294k006k24926
14696G68019K18832M1006j94120o025Q6584Q9013K35206p5077J69530E84821L15899
14685I00720j02711L67786k50617r4735M43677k9462j26806k4738m22446L66942
14675A027610o1581J00368j71949P4554K79591j71001L16932n34914K07295M1419
14665A108324L0335l64880K19569K84161p6584l39866K41392K51102k40988q9241
14655A023324J53405Q5366j54845j12939K66231q5099j48126M28915l57938L64629
14645A462923k29505r2866j92J98669j43253j79979K48943N3035J21893N9508
14635A499176M5404l23825J11049J76844k65623K2118M1289m6653j27514N68974
$$ y = [932386, 1210113, 1105487, 1046412, 1161673, 949266, 1129013, 1045245, 994951, 992945, 768019, 986851, 1027857, 833737, 827712, 914296, 1003309, 1238515, 1163438, 1332968, 584821, 900720, 798009, 1165795, 915178, 820443, 1264120, 1234658, 1107852, 1083114, 660668, 1027610, 966029, 1066397, 894448, 969002, 1248593, 1077592, 1394524, 859610, 1066905, 1108324, 1138659, 773779, 993348, 1277509, 1200925, 861059, 1102451, 1353553, 1112565, 1023324, 1176729, 1262095, 1107250, 994311, 1260542, 1175443, 1027317, 1456232, 1098294, 1462923, 1233418, 1140552, 1140360, 1339029, 1195776, 1015797, 1264740, 1317775, 1439668, 1499176, 1544580, 1220755, 1331804, 1508648, 1243025, 1265143, 1306432, 1259779, 1132265, 1701239]
14625A701239o43011L47178q9857K75118l76761J86921O6529J5505k02948J5016
14615A294929J1064J70686Q9789j18713J44084l37863j85360L67209l5012J77312
14605A578125r2276J99444k02992J44441n9765q7145k77476K00207M739K63484
14595A670786L910k05950L99314j83639J18666l3687k04336M49036m10073Q3727
14585A687754L93076n19418L36623L1715n6508j64779J02839K09587L949l4230
14575A990608l7306L1028J83854l79220M1060L01846j92941j06142L44594K1907
14565B199288m2005J1586M36889n5389m81329J31691N11905j06224K62971J99142
14555C068525j58770J20139O31685j47560N82620Q06940J445793L606278J0725499
$$ y = [1701239, 1058228, 1405406, 1315549, 1590667, 1213906, 1400827, 1467356, 1482861, 1279913, 1294929, 1305993, 1476679, 1566468, 1447755, 1591839, 1253976, 1068616, 1435825, 1400813, 1578125, 1485849, 1685293, 1482301, 1626742, 1566977, 1479832, 1202356, 1402563, 1407302, 1670786, 1674696, 1468746, 1868060, 1684421, 1803087, 1769400, 1565064, 2014100, 1604027, 1687754, 2080830, 1561412, 1898035, 1929750, 1873242, 1708463, 1811302, 2020889, 2024838, 1990608, 1953302, 1984330, 2168184, 1788964, 1830024, 2131870, 1938929, 1832787, 2177381, 2199288, 2157283, 2168869, 2605758, 2550369, 2069040, 2200731, 2712636, 2606412, 2869383, 3068525, 2909755, 3029894, 3661579, 3514019, 4096639, 4903579, 6349372, 9955650, 20681149]
14546B0681149K3524612p51832A6470406G227238j171183q93749B451983n92345
14538A859638o2389o6946n5883J89095k67967L66751m76222M54313n356R3627
14528B028661k02599M59632k76226K24351K35056k90026k8063K06472j9549O0633
14518B398342J05945m92847J98758j78993N12766k05399O3468K0343L76464j15365
14508B683482m62977M58911N7315k84963K63552L13827l32149M5841r5616J36423
14498B783646J52062K0233K14039r5707l54260N91810J0087M0380j46424l49160
14488B866706N58825m99082N97655J24669j35081O5263k45953J90248J0232J85318
14478C718800j68549o9206R8838j01375J2541L32850l24071L69653L90554n74120
$$ y = [20681149, 44205761, 43453929, 16470406, 7227238, 6056055, 5162306, 2451983, 1859638, 1797249, 1730303, 1674420, 1863515, 1595548, 1962299, 1486077, 1940390, 1935034, 2028661, 1826062, 2285694, 2009468, 2233819, 2468875, 2178849, 2150786, 2357258, 2337709, 2398342, 2504287, 2011440, 2210198, 2031205, 2543971, 2338572, 2402040, 2422383, 2798847, 2683482, 2220505, 2679416, 2736731, 2451768, 2715320, 3029147, 2696998, 2742839, 2647223, 2783646, 2935708, 2955941, 3169980, 3074273, 2720013, 3311823, 3321910, 3362290, 3215866, 2866706, 3425531, 2926449, 3524104, 3648773, 3513692, 3578955, 3333002, 3523250, 3533482, 3718800, 3550251, 3481045, 3579883, 3478508, 3491049, 3823899, 3499828, 3869481, 4260035, 3685915]
14468C685915M21495q7536L3439n1598N5872P5563K11738q0465k1599K61070P5007
14457D578901q2196M7732J05499j94612J06071J52326M2572N72503k90318R8144
14447E136622p1164K33948p0853j1868J48981l45048N20116P897n8531K71237
14437E761337K52951j84145Q1645L65091o3629j46071J20633K7649K60338J06055
14427F581854K22433l67041K96796p7672M35197j84577L96912J48611m7895J05759
14417G510377j54652K60129J75104k33353L68683j22910P0275P2561M69631k24995
14407H190850N69025m5290J57272J00467m6110N10476l3160L13080J76361k5142
14397I867829K35279M13918K31525o0977J33807J14050K30654j46489R1396M03759
$$ y = [3685915, 4107410, 4019874, 4053313, 4001715, 4057587, 4133150, 4344888, 4264423, 4242824, 4503894, 4578901, 4496705, 4544437, 4649936, 4455324, 4561395, 4713721, 4756293, 5328796, 5038478, 5136622, 5065458, 5299406, 5228553, 5216685, 5365666, 5020618, 5540734, 5548631, 5490100, 5761337, 6014288, 5830143, 5911788, 6276879, 6213250, 6067179, 6187812, 6215461, 6475799, 6581854, 6804287, 6437246, 6734042, 6656370, 7091567, 6906990, 7303902, 7452513, 7404618, 7510377, 7355725, 7615854, 7790958, 7557605, 7926288, 7803378, 7873653, 7946214, 8415845, 8190850, 8759875, 8714585, 8871857, 8972324, 8926214, 9436690, 9403530, 9716610, 9892971, 9867829, 10103108, 10517026, 10748551, 10687574, 10821381, 10935431, 11166085, 11019596, 11110992, 11514751]
14387A1514751M10801J57696L26529j61283M51671L27139Q5137L58162K60029
14378A3730632J86490L06295K24972L70502J65874L74577K5085P45036K42654
14369A6372117L10851L10350K42588k06056R94678M46056J27422Q11912L11660
14360A9721578M51253J55303N47791N34219M80564L06136L48289P86824P05144
14351B4037101O34481J34894P93257N79932R09030P05958M71047J159441N58585
14342B9983726P26712R25492O47736R48572Q03965P73364J565738Q50551R11472
14333C8137328J523985O29440J621979J451245J041516J635576J243099J707689
14325D8991857J413473J658185J677238K031330J779430K291557K366299K282212
$$ y = [11514751, 11925552, 12083248, 12409777, 12248494, 12700165, 13027304, 13112441, 13470603, 13730632, 13917122, 14223417, 14448389, 14818891, 14984765, 15359342, 15384427, 16129463, 16372117, 16682968, 16993318, 17235906, 17029850, 18024528, 18470584, 18598006, 19409918, 19721578, 20172831, 20328134, 20875925, 21410144, 21890708, 22196844, 22545133, 23331957, 24037101, 24671582, 24806476, 25599733, 26179665, 27088695, 27794653, 28265700, 29425141, 29983726, 30710438, 31635930, 32283666, 33232238, 34036203, 34809567, 36375305, 37225856, 38137328, 39661313, 40290753, 41912732, 43363977, 44405493, 46041069, 47284168, 48991857, 50405330, 52063515, 53740753, 55772083, 57551513, 59843070, 62209369, 64491581]
14317F4491581K245829K322832K669502K898268K943907L006740L394988L409019
14309H7382666L627166M025938M224937M467611M219408N502538M772225O096534
14301A24319023N738047O326294O764114P092071P721795Q143274Q556560R085976
14293A83747154R737178J0197443J0776587J1354203J2186869J2653773J3222518
14286B63875725J3549501J4580661J4516076J4728844J5371152J4801100J4941910
14279C66364969J4636959J3836339J2811150J1816894J0155112Q229147O462280
14272D44312850K480565r26663k441664k448331l864096k480403o269649r537640
14264D18824969j0866110j2632554j4229055j4548398j5448760j5288059j5602913
$$ y = [64491581, 66737410, 69060242, 71729744, 74628012, 77571919, 80578659, 83973647, 87382666, 91009832, 95035770, 99260707, 103728318, 107947726, 113450264, 118222489, 124319023, 130057070, 136383364, 143147478, 150239549, 157961344, 166104618, 174661178, 183747154, 193484332, 203681775, 214458362, 225812565, 237999434, 250653207, 263875725, 277425226, 292005887, 306521963, 321250807, 336621959, 351423059, 366364969, 381001928, 394838267, 407649417, 419466311, 429621423, 437850570, 444312850, 446793415, 445866752, 443425088, 440976757, 437112661, 434632258, 428362609, 418824969, 407958859, 395326305, 381097250, 366548852, 351100092, 335812033, 320209120]
14257C20209120j5152374j4789520j4653515j3900087j3335632j1876746j1393484
14250B25107762j1313393j0999589j0457709r860697q970486q227336p797734
14243A57480818p734998p170798o670270o511292n662983n256965n241608n029214
14235A08202690m989629m434727l983561l850965k965095l474659m057226k706064
14227G7740764l247151k778820k912486k268505k750254k286291j687203k165390
14219E7644664j996325j851788j830979j897386j662678j206963r65982j803599
14211D4428964j592047j096947j498105n85702q83215j328538j226772j363490
14203C4854148p68830p66786o00189r25528q73904j108220q99351n87852o26150
$$ y = [320209120, 305056746, 290267226, 275613711, 261713624, 248377992, 236501246, 225107762, 213794369, 202794780, 192337071, 182476374, 173505888, 165278552, 157480818, 149745820, 142575022, 135904752, 129393460, 123730477, 118473512, 113231904, 108202690, 103213061, 98778334, 94794773, 90943808, 87978713, 84504054, 80446828, 77740764, 74493613, 71714793, 68802307, 66533802, 63783548, 61497257, 59810054, 57644664, 55648339, 53796551, 51965572, 50068186, 48405508, 47198545, 46232563, 44428964, 42836917, 41739970, 40241865, 39656163, 38772948, 37444410, 36217638, 34854148, 34085318, 33318532, 32718343, 31792815, 30918911, 29810691, 28911340, 28323488, 27697338]
14194B7697338m30602q79921p55878l97785o74420p57177l78839o06112p16530
14185B2100074O628o79441o80453k67233k75076q10720J45835q42556k40772m60969
14175A7995317l39070m99999q9063k59092n39831m1623m53036j07661k88253l57399
14165A5020290j93604n42014K3917n09638o7732l11315k94751j25582l65327k1489
14155A2612755r3388m70289m42783L65590n61780J43720m11966n1631l33105j80573
14145A0576550m45893K66503j94394m53757K30582k49871j45848p2885m79221
14136I031766q5170P590l55396k51246M3781k10035N4346o9556P7565l80070j19364
14125G744211n5022q4034j42886P6476k37384k80918J70903k74490J57561m85734
$$ y = [27697338, 27266736, 26386815, 25630937, 25233152, 24558732, 23801555, 23422716, 22816604, 22100074, 22106702, 21427261, 20746808, 20479575, 20204499, 19393779, 19539614, 18697058, 18456286, 17995317, 17656247, 17156248, 17067185, 16808093, 16268262, 16226639, 15773603, 15665942, 15377689, 15020290, 14826686, 14284672, 14308589, 13798951, 13731219, 13419904, 13125153, 12999571, 12634244, 12612755, 12519367, 12049078, 11606295, 11971885, 11410105, 11553825, 11141859, 11090228, 10757123, 10576550, 10130657, 10397160, 10202766, 9749009, 9979591, 9729720, 9583872, 9510987, 9031766, 8946596, 8954186, 8598790, 8347544, 8391325, 8181290, 8235636, 8166080, 8243645, 7863575, 7744211, 7689189, 7605155, 7462269, 7538745, 7301361, 7020443, 7191346, 6916856, 7074417, 6588683]
14115F588683J46541n9825P1229j5109n04256L13517k12020l0335n06469K01558
14105E993514j02009j58634R2247j71270R261K70502m35729N3018l07651K87746
14095E530995l08502M0819M3318k06948J52347j28958k01799K73337p7513k47794
14085D869302m2102k91377J11753Q9011k68262R2606M4694j35805k09667r9770
14075D160383j2661K58342m78858M10340k49777j56669L02291j10133l22596N80475
14065D381137k38278r6236l29129N2205L23550j83752J073k13209J1893j52502
14055C556752P5480k98163M1735J1969j71936M71529j37207k94878K7348l15988
14045B966641J13115J66915j37798j29788p6025L37659j14176j31943p5523J09296
$$ y = [6588683, 6735224, 6675399, 6746628, 6731519, 6227263, 6540780, 6328760, 6298425, 5791956, 5993514, 5891505, 5732871, 5825118, 5653848, 5663109, 5933611, 5497882, 5550900, 5243249, 5530995, 5222493, 5263312, 5306630, 5099682, 5252029, 5123071, 4921272, 5194609, 5117096, 4869302, 4827200, 4535823, 4647576, 4736587, 4468325, 4560931, 4605625, 4469820, 4260153, 4160383, 4147722, 4406064, 3927206, 4337546, 4087769, 3931100, 4233391, 4123258, 3800662, 4381137, 4142859, 4046623, 3717494, 3769699, 4093249, 3909497, 3910570, 3697361, 3709254, 3556752, 3632232, 3334069, 3375804, 3387773, 3215837, 3687366, 3550159, 3255281, 3282629, 2966641, 3079756, 3246671, 3108873, 2979085, 2903060, 3240719, 3126543, 2994600, 2919077, 3028373]
14035C028373M9244l08199L16044j83799k29543Q9913j48406m0694J53896J28696
14025B855525l52748K2977j84652J17122J54728m9600K56725j55096k92270J682
14015B374393m1425q7957l35364L28957P1977k3328j67814p1374K16706j98871
14005B065900j67628J07505l9777n9859K50040N2250n68052K08247M05189k24188
13995B029627l06710O0003P5480M9644K28597l84727J114885J489982P404239
13986A1761020K2023035J6271609B4652341A1932746m908296j761988j222938
13979D039524n40710k77227m50348J48421q5829l02732q7891J32774l51263M1299
13969B266018k89173L37728j06509j05696J60973k01366L70633o18546J33374
$$ y = [3028373, 3077617, 2769418, 3085462, 2901663, 2672120, 2762033, 2613627, 2572933, 2726829, 2855525, 2502777, 2525754, 2341102, 2458224, 2612952, 2563352, 2820077, 2664981, 2372711, 2374393, 2332968, 2245011, 1909647, 2238604, 2310581, 2287253, 2119439, 2048065, 2264771, 2065900, 1898272, 2005777, 1966000, 1906141, 2156181, 2208431, 1640379, 1848626, 2253815, 2029627, 1722917, 1782920, 1858400, 1908044, 2136641, 1751914, 2866799, 4356781, 11761020, 33784055, 50055664, 24652341, 11932746, 7024450, 5262462, 4039524, 3498814, 3221587, 2771239, 2919660, 2833831, 2531099, 2443208, 2575982, 2224719, 2266018, 1976845, 2314573, 2208064, 2102368, 2263341, 2061975, 2432608, 1814062, 1947436]
13960A947436n9197K08240l27684J11871L2801J14660J9150m22084l3036r0280
13950A501877M69312m2379m30089J86861j95692K53453K32474k49058l1680J49290
13940A844369Q5708k98324m6304K77619l20977J47287k32649K07664J19854l59532
13930A424715J4316R0094l0678j45542M4003q0008K22175j90937P4842k07816
13920A215164J50733o5784R9561m0952K32776l43300K54759j64985L41135l40332
13910A338775M0495r7468K43029p016j9584j93944R9597q6047L1370K0820l90911
13899I79116K65471q7718R584R6348J31403l82411K97115q4965j64727K22761
13889A281977j54687R5801k28336J68401L02871l73902O7306K6624j70762N4732
$$ y = [1947436, 1888239, 2096479, 1768795, 1880666, 1913467, 2028127, 2047277, 1625193, 1592157, 1501877, 1971189, 1928810, 1498721, 1685582, 1489890, 1743343, 1975817, 1726759, 1695079, 1844369, 1930077, 1631753, 1585449, 1863068, 1542091, 1689378, 1456729, 1664393, 1784247, 1424715, 1439031, 1529125, 1498447, 1352905, 1396908, 1316900, 1539075, 1348138, 1422980, 1215164, 1365897, 1300113, 1399674, 1358722, 1591498, 1248198, 1502957, 1337972, 1679107, 1338775, 1379270, 1281802, 1524831, 1517815, 1498231, 1304287, 1403884, 1317837, 1349207, 1370027, 979116, 1244587, 1156869, 1166453, 1262801, 1394204, 1011793, 1308908, 1223943, 1059216, 1281977, 1127290, 1223091, 994755, 1163156, 1466027, 1092125, 1159431, 1186055, 1015293, 1070025]
13879A070025M42202l76460K75860q8590O7782o83485L87441n6672N7548Q0k01278
13868H94453N24747l63709j55480k37915L61528N1591j01456r8857M95491n93447
13858G76946R3424O3312K14281l76612M58683k32849k9938l72253N03687o4365
13848A034316l74369J21337M22153o2966j71845j41490J64258l33956M08604l09994
13838G56048K14588L50916m19619j5992J15674J31737j50027k31577N0166O8472
13828H70386J4576R9303j56128P0129m10601M48723D48065N73336l28266K34968
13818I28103m6365q6647j9644K91078j62225k22895K43186l82582N6854J47255
13808G46118k5916k4736J65431o0013J3848j1215k33908L21121N0040k7593Q1516
$$ y = [1070025, 1512227, 1135767, 1411627, 1323037, 1390819, 707334, 1094775, 1038103, 1095651, 1095731, 894453, 1419200, 1055491, 900011, 662096, 1023624, 1075215, 973759, 874902, 1370393, 776946, 870370, 933682, 1147963, 771351, 1230034, 997185, 967247, 594994, 1098681, 1034316, 659947, 781284, 1203437, 1140471, 968626, 827136, 991394, 657438, 1066042, 756048, 970636, 1321552, 901933, 885941, 1001615, 1133352, 983325, 751748, 801914, 870386, 884962, 984265, 828137, 898266, 487665, 936388, 448065, 1021401, 693135, 928103, 881738, 795091, 775447, 1066525, 904300, 681405, 924591, 542009, 598863, 746118, 720202, 695466, 860897, 800884, 814732, 803517, 569609, 890730, 940770, 913177, 994693]
13797I94693j86005M162r9124j812j72435K55592p4090N3055J2651O9157k38076
13786F17768J84171p5387K20240M4667k35798l39821M54616C15082J79691K37253
13776G32026l758r4933K2779p7274l9438Q5781r9567R5356k89562K84246j37668
13765D77988N45258B72600K94336K37657K51243m76938L77268k85090J52211K5427
13755H48714j14780j78062k8579j67789K32561r2981B31371J89740J45511K03982
13745G70604C26381L02108j64810J58059k47466M2556J22725j75746K3409L66202
13735G53418j15977j7634j03165J7985J1980k0574Q1252J57421C46122K64927
13725F11049j86890j99556N95856C05146K02395K24559j65895j5023P1194j76915
$$ y = [994693, 808688, 812850, 713726, 711914, 539479, 795071, 720981, 774036, 786687, 855844, 617768, 801939, 726552, 946792, 991459, 755661, 415840, 870456, 315082, 494773, 732026, 728268, 633335, 656114, 578840, 539402, 625183, 525616, 620972, 331410, 615656, 477988, 1023246, 272600, 566936, 804593, 1055836, 578898, 956166, 671076, 823287, 848714, 733934, 555872, 527293, 359504, 592065, 499084, 231371, 421111, 566622, 770604, 326381, 628489, 463679, 621738, 374272, 416828, 539553, 363807, 387216, 753418, 637441, 619807, 516642, 534627, 546607, 526033, 607285, 764706, 346122, 611049, 424159, 224603, 820459, 305146, 507541, 732100, 566205, 551182, 622376, 445461]
13715D45461J64405A82070J44479J56479k37834L85047k7249j99785L41779C41998
13704C97636j06290O5585R7217B24666J89825r5537J98916A24363N30003A48124
13693C54544M16108j72383k41759K83042j19539R1302B17893L51299k69290J7312
13683C17214L11030B88578R5034K73796j43305m1003O366B37260L68195k88353
13673C17102J09959K92628l38619M3430J41051j86844n3323R2958p9150L21847
13663F61039j23487j51184J25458p9634J39859k78810J861K14585A54150L91143
13653E45293l9059B6375K42455L31188j86772o29A20003O11186B11095J28919
13643C40014K81253k39440K96537C12574j17477M6444R7948R6903B11031K84088
$$ y = [445461, 609866, 182070, 326549, 483028, 245194, 630241, 602992, 403207, 744986, 341998, 397636, 291346, 356931, 454148, 224666, 414491, 318954, 517870, 124363, 654366, 148124, 354544, 770652, 598269, 356510, 639552, 520013, 611315, 217893, 569192, 299902, 317214, 628244, 288578, 383612, 657408, 514103, 473100, 479466, 237260, 605455, 317102, 427061, 719689, 381070, 424500, 565551, 378707, 325384, 418342, 339192, 661039, 537552, 386368, 511826, 432192, 572051, 293241, 295102, 509687, 154150, 545293, 506234, 26375, 268830, 600018, 413246, 412617, 120003, 731189, 211095, 340014, 621267, 381827, 678364, 312574, 195097, 241541, 339489, 436392, 211031, 495119]
13633D95119j57750J37778B10597M50810j13662J29470k85726O9989j72173K60354
13623E49659A86846P0118K37517q7488K0220A81085L83924j68236M8305J29852
13613E74930J22826B82870M58274l36172O9742j67383q3450q9365L97833B23641
13602C45597M7932N1758j98145K50117b1588E25833A36964L88333I9248D8256
13591A44144n8655L51278N5636j56790j11328q6038m1408L73793A38998L69046
13581E08044j32331l5188j57719J09110p5733J44880r2154o1572L7134l9885L0132
13570B34718J32702F7644L84459J41545j90049A57447J17405j32606K56930j66447
13560B32729a3073A46758F3428Q8583J08794e0136C42203J11306A6896O8603a12507
$$ y = [495119, 337369, 475147, 210597, 661407, 547745, 677215, 391489, 461478, 289305, 549659, 186846, 256964, 494481, 406993, 427213, 181085, 565009, 396773, 445078, 574930, 697756, 282870, 741144, 404972, 474714, 307331, 223881, 134516, 532349, 223641, 345597, 393529, 445287, 247142, 497259, -21588, 525833, 136964, 525297, 99248, 48256, 144144, 85489, 436767, 492403, 335613, 224285, 138247, 96839, 470632, 138998, 508044, 375713, 340525, 182806, 291916, 216183, 361063, 268909, 207337, 244471, 204586, 234718, 367420, 67644, 452103, 593648, 403599, 157447, 274852, 142246, 399176, 232729, -13073, 146758, 63428, 152011, 260805, -50136, 342203, 453509, 16896, 85499, -112507]
13548B13359J64302P6983k6274R0256B13613J86948q1174b8570B06259J83683
13538C89942A89039K03199j45393K11585B12166J43785o7677E0751J30880M63630
13528F45261B43094q4462J33284p3951M6518f5195C65862J89877I9544M01170
13518E00714k39183J9844p7053P509J84399k8952A08202a4520G6515C0694J08291
13507A38985j2662J75463m6411K1680A402L46940A22848L05344J23693B28898
13496h522B93835E4831O4120K85557H3193J40680M5269G2269A8863L25705f4539
13484B03250M20244B00107M4778l5497M76J9186j1560o8221K06597r9799p7797
13473A78270O055p230N5569b3647A40963a15664A14106m1849K27246a1317D17787
$$ y = [213359, 377661, 454644, 428370, 518626, 213613, 400561, 319387, -28570, 206259, 389942, 189039, 392238, 246845, 458430, 212166, 355951, 288274, 50751, 181631, 645261, 243094, 158632, 291916, 217965, 264483, -65195, 365862, 555739, 99544, 500714, 261531, 281375, 204322, 211831, 396230, 367278, 108202, -14520, 76515, 30694, 138985, 126323, 301786, 255375, 277055, 1402, 348342, 122848, 428192, 551885, 228898, -8522, 293835, 54831, 118951, 404508, 83193, 223873, 269142, 72269, 18863, 344568, -64539, 203250, 623494, 200107, 244885, 209388, 209864, 229050, 217490, 149269, 355866, 256067, 178270, 184325, 177095, 232664, -23647, 140963, -115664, 114106, 72257, 299503, -11317, 417787]
13461D76088A57524J50422A31932R4087I7849N2571L6363G3828K14280H5687m154
13450H1533J23401R1259A23210A1745L50129J0977R1403A18944K21416i5174B18979
13438D00577A19996Q2282L09046F4276N3737J83938i1194H671L42469c1133A33923
13426C66124j62456m2163J5306o5869J91244j10882J20777m7205L3615K27472
13416E25963j73021i823A58832E5504B3594M56495k36980K12152P4592f6080B35269
13404B67064l2227o7531K2408Q4381q6985J06041E5461K11132K1813A31645q932
13393A22713J50152P6822A32355j4012J4402d036D11033A17817h453A69584J89172
13382C58756E7193b9897A94902D676K1320J61644j0985l5603K64120L3896I8111
$$ y = [476088, 157524, 307946, 131932, 226019, 97849, 150420, 186783, 73828, 288108, 85687, 81533, 204934, 296193, 123210, 11745, 361874, 372851, 464254, 118944, 340360, -95174, 218979, 400577, 119996, 202278, 511324, 64276, 118013, 301951, -91194, 8671, 351140, -31133, 133923, 366124, 203668, 161505, 176811, 110942, 302186, 191304, 312081, 264876, 298491, 525963, 352942, -9823, 158832, 55504, 23594, 480089, 243109, 455261, 529853, -66080, 235269, 267064, 234837, 167306, 189714, 274095, 187110, 293151, 55461, 266593, 288406, 131645, 122713, 272865, 349687, 132355, 118343, 132745, -4036, 411033, 117817, -8453, 169584, 358756, 57193, -29897, 194902, 4676, 25996, 187640, 176655, 141052, 405172, 439068, 98111]
13370A30938P6054K0061J91552B1168a2046E7678J04858J57651j30789I2857N6002
13359A48859A0645Q3068M0036L6361d101B63205N408A22285k2034k517K20921
13348C18655C8343J95870G3648R0775m4594K05111a07742A54492K28970L0786
13338D14248j27382B615K75578k1768o4582k8007J07382G5435P4293n7910R3532
13327A85350R5260J23217a62764B76412A6465J95300P1693p6231g8580C10635
13316D48911d2431A10829L14761G4156J77229A22303K72002H4930K14382j16698
13306A82614d3875j27522F6321g4792B55404c8366B63395N3452E9784J81945N7145
13295B98874B1109J7009O6047K4021e9292B13499C2951g3115A28163B2790N1425
$$ y = [130938, 206992, 227053, 418605, 21168, -12046, 57678, 162536, 320187, 189398, 92857, 148859, 10645, 93713, 133749, 170110, -4101, 263205, 268613, 122285, 100251, 97734, 318655, 38343, 234213, 73648, 164423, 119829, 324940, -107742, 154492, 383462, 414248, 286866, 2615, 278193, 256425, 191843, 163836, 271218, 75435, 149728, 91818, 185350, 280610, 403827, -162764, 276412, 16465, 211765, 283458, 207227, -78580, 310635, 448911, -42431, 110829, 425590, 74156, 251385, 122303, 394305, 84930, 299312, 182614, -43875, -171397, 66321, -74792, 255404, -38366, 263395, 316847, 59784, 241729, 298874, 21109, 38118, 104165, 128186, -59292, 213499, 32951, -73115, 128163, 22790, 74215]
13284G4215j3398i3871D04735b08273B45977C1153O3649b0884A91687H2067K67338
13273C49405A57724F6086P4547c94014a34552B87246B4260f7663C91665j79582
13263B12083I1961K4081K04759g5076A06209J75049A16411J86296D1434J29566
13253A71000b5517j28524A55600E7819d5329k5082Q939A71828A247K88740j07110
13242A82877J01106A07645J21736A05528c056l2739j8662D6201i7104A02689K17150
13231C19839C7403J66377B0057M31482H8675M39123A69178c5652A20805b6143
13220H3789a21013e4289A99205p4827a87580A11057a40897H2048L26510A15087
13209B4582K9719Q9554K04376j58315l5993a4527A32055m5193J51150f5418a8733
$$ y = [74215, 60817, -93871, 404735, -208273, 245977, 31153, 94802, -20884, 191687, 82067, 349405, 157724, 66086, 140633, -394014, -134552, 287246, 24260, -67663, 391665, 212083, 91961, 116042, 320801, -75076, 106209, 281258, 116411, 302707, 41434, 171000, -25517, -154041, 155600, 57819, -45329, -70411, -61472, 171828, 1247, 289987, 182877, 283983, 107645, 229381, 105528, -3056, -35795, -54457, 46201, -97104, 102689, 319839, 37403, 203780, 20057, 451539, 88675, 527798, 169178, -35652, 120805, -26143, 83789, -121013, -54289, 199205, 124378, -187580, 111057, -140897, 82048, 408558, 115087, 24582, 54301, 143855, 348231, 189916, 153923, -14527, 132055, 86862, 238012, -65418, -18733]
13197C71974a12536A77021D7497K150N0902D704M14017a69148h3109K4392I7144
13185A53172h9021A65757g2861E2427J22309K8424H3261K824J93048G0862J68680
13174B39542B3157J03797a32931P170A84055C0743b888j52114A41538g4271b1791
13162A89792D4767J039i8108A32864h9423A33153a83294E2521J54963E7037g3774
13150C6968g4971B39881K4943A11069a1491l22836B2226P2441d2760p3557A032
13138a11233A25R0040m1463e2815B53933b291B14532a3403A66399J9492K14593
13127D00484f8661a3785B78339j6267i1627C15258A56595P8602a01035C80308
13116a06552A20933k8564a928k2348l4158O751m4253C11510d9294N967A00589
$$ y = [371974, -112536, 177021, 47497, 49647, 100549, 4704, 418721, -169148, -83109, -58717, 97144, 153172, -89021, 165757, -72861, 52427, 174736, 203160, 83261, 86085, 279133, 70862, 239542, 23157, 126954, -132931, -125761, 184055, 30743, -2888, -155002, 141538, -74271, -21791, 189792, 44767, 45806, -98108, 132864, -89423, 133153, -183294, 52521, 207484, 57037, -73774, 36968, -74971, 239881, 264824, 111069, -11491, -334327, 22226, 94667, -42760, -116317, 1032, -111233, 125, 90165, 48702, -52815, 253933, -2291, 214532, -13403, 166399, 185891, 400484, -68661, -13785, 278339, 262072, -91627, 315258, 156595, 235197, -101035, 380308, -106552, 120933, 92369, -1928, -24276, -58434, -51683, -95936, 311510, -49294, -43327, 100589]
13104C56782A72647A8964J52035F5642O4111C3158a10262j15755i5706C42214
13093D21611A35390O2186b02705A1829J19157n5280k0280c8772n9786D14820E229
13081E4519e0795j2430j56393f1165C44087E814L72173A6209a21542r9588A10834
13069b7451m5376B18596a85827C46170F7235O7498P1160O4739l7399E888J66070
13058A71958p695b66586B59506D2207J01063L14523c49270f7793A63355L43324
13048E06679e7557j26551A93332J68022f5440H4508J20869a27449F9446M529K69430
13037C43405G9887a0157B010R765J82565b1199A26085j5757M073N4190a12579
13025B05574a34998G4619J40427F1610R5482j7157B9499N8414K54260D5205b62143
$$ y = [356782, 172647, 18964, 170999, 65642, 129753, 33158, -110262, -226017, -95706, 342214, 421611, 135390, 197576, -202705, 11829, 130986, 75706, 55426, -38772, -98558, 414820, 5229, 54519, -50795, -63225, -219618, -61165, 344087, 5814, 377987, 16209, -121542, -221130, 110834, -27451, -72827, 218596, -185827, 346170, 67235, 134733, 205893, 270632, 233233, 5888, 171958, 164263, -266586, 259506, 42207, 143270, 457793, -349270, -67793, 163355, 506679, -57557, -184108, 193332, 361354, -65440, 84508, 205377, -127449, 69446, 73975, 343405, 79887, -10157, 2010, 11775, 194340, -21199, 126085, 110328, 114401, 168591, -112579, 205574, -134998, 74619, 215046, 61610, 157092, 139935, 29499, 87913, 342173, 45205, -262143]
13013a12865a2892A30986a448B11664m1082o1649a87067O3620J3174d2563B31461
13001A55328a16729B49576D037i6797A73075a66622A14013Q8415c4427a3491A53753
12989e7125B97893i7510F5694K36146a09054o1864j445B84957a97772C13069g6536
12977B12363i5270A15234a22693M1224A22809J2839i057k06201g2278C71595D5247
12965H9112J76019G9156R636a89963B28115b3981C6454J77605g4972G5122K9134
12954A04256J18096J19432d5012A80532o1774f1909B54631A2511K7980a7868A85068
12942a84093A30658a25408P107l5738G5332q285M5866A6574P1683m3265L8971
12931H3963d1687B25235D7725L5226a35105j40224A20977R0368a21982L1740l01905
$$ y = [-112865, -12892, 130986, -1448, 211664, 170582, 108933, -187067, -123447, -110273, -42563, 231461, 155328, -116729, 249576, 4037, -96797, 173075, -166622, 114013, 202428, -34427, -13491, 153753, -57125, 297893, -97510, 65694, 301840, -109054, -170918, -172363, 284957, -197772, 313069, -76536, 212363, -95270, 115234, -122693, -81469, 122809, 135648, -9057, -215258, -72278, 371595, 45247, 89112, 265131, 79156, 88792, -189963, 228115, -23981, 36454, 214059, -74972, 75122, 104256, 222352, 341784, -45012, 180532, 118758, -61909, 254631, 12511, 40491, -17868, 185068, -184093, 130658, -125408, -118301, -154039, 75332, 67047, 112913, 16574, 88257, 44992, 83963, -41687, 225235, 47725, 82951, -135105, -275329, 120977, 211345, -121982, -90242, -392147]
12920c92147f3431K8660k8345I737i5608n8015d9481l6571C3413a59709d5207
12908A1580a28438C5413K11349Q398b48574a15475M3642a4853F3639J81013j11122
12897A33530b3392B25211m7469k1985h4558B94537b6184A19453O3491N6057h9130
12885e041k95865A63839J71049h7901E8882B672a75529R798j5453B52216b26151
12873A16876j2174L0988k9306D5586K44307l8847a89698B4510g9015G6001f2115
12861a56768B50531i1964o8692D2257q32b12564J6188A72172N5759e2678l229
12850e5907k4158p4397B68739F9297c4027H2989K20782l6743b60693N6764g854
12838e9940k813A04224a26201b9677n9251a5582C6515N00a30474A05103m4436
$$ y = [-392147, -63431, -34771, -63116, 9737, -95608, -153623, -49481, -86052, 33413, -159709, -45207, 11580, -128438, 35413, 246762, 255160, -248574, -115475, -71833, -14853, 63639, 244652, 133530, -23392, 225211, 177742, 155757, -84558, 294537, -26184, 119453, 182944, 239001, -89130, -5041, -300906, 163839, 334888, -87901, 58882, 2672, -175529, -165731, -181184, 252216, -226151, 116876, 104702, 135690, 106384, 45586, 289893, 251046, -189698, 24510, -79015, 76001, -62115, -156768, 250531, -91964, -160656, 42257, 41425, -212564, -196376, 172172, 227931, -52678, -55907, -80065, -154462, 268739, 69297, -34027, 82989, 303771, 267028, -260693, -203929, -7854, -59940, -62753, 104224, -126201, -29677, -88928, -15582, 36515, 37015, -130474, 105103, 60667]
12827F0667a55830A44319d401F5179d3520p9786A34540O8667R5835h6315A23583
12815G690L23122c4461B3025c75789J05351J12066F5780J66635k6862b55000a26727
12803e7329k99244a21824c449A06469L8735b4870I3849a30248j9736B291b18016
12791E0851J31196d7344K854a1509B13017a37293B95054m7855r0592h820B2083
12779c42p9886b3841j04461f374B75236a5480I5214A5770J37374b5201B77683
12767B53442L05930A7277a55764A09904h3699A11741e2567A44489d845n7381q744
12756g0970p6657F9791A4742d06891A59281a99389g727r4816A25859K9236m2114
12745A12981M8078j7509n2373R0164C5571b10172B16305M3175A10241J15877b03397
$$ y = [60667, -155830, 144319, -4401, 65179, -43520, -123306, 134540, 203207, 299042, -86315, 123583, 7690, 330812, -34461, 23025, -375789, -270438, -158372, 65780, 232415, 205553, -255000, -126727, -57329, -356573, -121824, -3449, 106469, 145204, -24870, 93849, -130248, -149984, 2291, -218016, 50851, 182047, -47344, -44490, -11509, 213017, -137293, 295054, 247199, 156607, -8820, 22083, -342, -80228, -23841, -128302, -6374, 275236, -15480, 95214, 15770, 153144, -25201, 277683, 253442, 559372, 17277, -155764, 109904, -83699, 111741, -52567, 144489, -4845, -62226, -70970, -147627, 69791, 14742, -406891, 159281, -199389, -7727, -102543, 125859, 155095, 112981, 161059, 143550, 91177, 181341, 35571, -210172, 216305, 259480, 110241, 226118, -203397]
12733B03286D5595L6275a46859c9416A85525H2149c50451I6942c8641A60841K28464
12722C89305A51262c7696A17191g0493A98396l7205p271d688D0694N7487J92017
12711B90198e9349K7335A05769b90619A75582H1586B9722a718E8221O5491M6304
12700A70016k8810a55866G2767O5748a97967A95082I0698N63a73875A42943K11293
12689C54236A47217b18112O0911l378g7012H756L24547e7677A99703a87001R1931
12678i5070J2448B41380C6006L26241A26515k2481b78550A22942k2173l9561e7505
12666i735j42084A31352o0047K44987M7515H8511r75K22547a50647b9182D17400
12654C45454j39454a20081d8493C26772I4663N8136P5367i517k86519a6812A20351
$$ y = [203286, 45595, 81870, -146859, -39416, 185525, 82149, -350451, 96942, -38641, 160841, 389305, 151262, -37696, 117191, -70493, 198396, 161191, 153920, -4688, 40694, 98181, 290198, -59349, -32014, 105769, -290619, 175582, 81586, 29722, -1718, 58221, 123712, 170016, 141206, -155866, 72767, 138515, -197967, 195082, 90698, 91261, -173875, 142943, 354236, 147217, -218112, -157201, -160579, -77012, 8756, 333303, -57677, 199703, -187001, -95070, -82622, 241380, 36006, 362247, 126515, 104034, -278550, 122942, 100769, 61208, -57505, -9735, -151819, 131352, 71305, 316292, 363807, 88511, 87536, 310083, -150647, -29182, 417400, 345454, 206000, -120081, -48493, 326772, 94663, 152799, 228166, -9517, -296036, -16812, 120351]
12642c67093F9561a25341C53807A39502E838b64E46207b10820a5906k4808B8806
12630C29040J25012I377K91467N0342B5372J1825b56523A66909J04671k4705H570
12618H705M2645K42130a18026j30033A99422b6865k89704B33880J5836H3349h7008
12606a80009Q9792N486A57321p0201a35093L7760K7730A65996L9509l2051d3855
12594a95805E6274b23681J07863A5257a51008C49489b01712d8990A81043d14248
12583c5381C5996g6451k3126C03126F9539J99030B3252a69070j84009A04292d1050
12571a88019B03350I8665M8872b508I21J02705N8569G7793a08395B7875J40717
12560A68592a24032B41718a42428B12599j02708a29724c0880B61370p7071a10930
$$ y = [-367093, 69561, -125341, 353807, 139502, 5838, -264, 546207, -210820, -15906, -40714, 28806, 329040, 454052, 9377, 300844, 351186, 25372, 37197, -256523, 166909, 271580, 246875, 8570, 8705, 51350, 293480, -118026, -248059, 199422, -26865, -316569, 233880, 249716, 83349, -87008, -180009, -90217, -84731, 157321, 87120, -135093, -97333, -69603, 165996, 205505, 173454, -43855, -195805, 56274, -223681, -115818, 15257, -151008, 349489, -201712, -48990, 181043, -414248, -35381, 35996, -76451, -99577, 303126, 69539, 268569, 23252, -169070, -353079, 104292, -41050, -188019, 203350, 98665, 147537, -2508, 921, 103626, 162195, 77793, -108395, 27875, 168592, -124032, 241718, -142428, 212599, 109891, -129724, -30880, 261370, 184299, -110930]
12549a36644r7633F7311d2929l36638H3662a66291c5255q806C3377b61613C1515
12537a87342E2008J54531K4001Q5137H780K40290b49014B44696A08177a97440
12526A80078C171g0524A24593D534e8570A9114i2893C03300b29257A47387P7188
12515B24575p1503j2169f2172A69691m9327G413J16482J57682E8639L2655J8700
12504A09994a57644G9800J84645b7731A4425J46775d1335m9303B31923b58630
12493B47343j19944f0550A30832b97440B4915J56048m2205M299N7473b00133Q3562
12482a16571m5108J1425C23922e8775j12490g8462F8501a17575O087J6648H3457
12470c5648k2029C4051M360a42518b1821j31960H6701e7416A65212B2775M8515
$$ y = [-136644, -234277, 67311, -42929, -379567, 83662, -166291, -35255, -44061, 33377, -261613, 31515, -187342, 52008, 206539, 230540, 315677, 8780, 249070, -249014, 244696, 108177, -197440, 180078, 3171, -70524, 124593, 4534, -58570, 19114, -92893, 303300, -229257, 147387, 224575, 153072, 140903, -62172, 169691, 120364, 7413, 123895, 281577, 58639, 91294, 109994, -157644, 79800, 264445, -27731, 14425, 161200, -41335, -90638, 231923, -258630, 247343, 127399, -60550, 130832, -297440, 24915, 180963, 138758, 143057, 200530, -200133, -116571, -161679, -150254, 323922, -58775, -171265, -78462, 68501, -117575, -111488, -94840, 83457, -35648, -57677, 34051, 38411, -142518, -21821, -153781, 86701, -57416, 165212, 22775, 71290]
12459G1290O496n317A1656J45873f4475C2583N3088J4720l5618e7511E7880q962
12447D8918J44382i8319B46729j237e4662E291J24653d87p5932a8244C9326b7185
12434C8596j7783K21159r4274j2c6319k11108g4812k95277b4871F1153d0490l26686
12422c67176C25123j01017r4099J57512A41071f1598B3481a12435B01859B0247
12411B89807e9988J2111R90B16427E0237c0841l42159A40076F4702Q2449F8741
12399H3101b44564Q7950F9917b10232c3918C3462K18787B7532J0772c74328C6593
12387f3029e599G081a11265j25110g3496j11212A7527J32283n9100b77779e5802
12375b4454A56318h7797a1328p8911A4613P9019J48615M0306a16789A44802J3696
$$ y = [71290, 77786, 72469, 11656, 157529, -64475, 32583, 85671, 100391, 64773, -57511, 57880, 48918, 193300, -98319, 246729, 245492, -54662, 5291, 129944, -487, -76419, -18244, 39326, -27185, 38596, 20813, 241972, 147698, 147686, -36319, -247427, -74812, -370089, -24871, 61153, -40490, -367176, 325123, 224106, 130007, 287519, 141071, -61598, 23481, -112435, 201859, 20247, 289807, -59988, -47877, -46887, 216427, 50237, -30841, -373000, 140076, 64702, 147151, 68741, 83101, -244564, -156614, 69917, -210232, -33918, 33462, 252249, 27532, 38304, -374328, 36593, -63029, -5599, 7081, -111265, -236375, -73496, -184708, 17527, 149810, 90710, -277779, -55802, -24454, 156318, -87797, -11328, -90239, 14613, 93632, 242247, 282553, -116789, 144802, 158498]
12364A58498c8076A80994H7824a9295A59062J46574G2224d08856J96640K4995
12354a87221I5948J05570d9502j06335f7176l13042A64849n9263a2305D50307
12343E5331K88221j62144H3144j0157g7680B80632N4884e7120A95925J7267a92190
12331c10617J36872A90054a69956f7260Q019D9327J91883o7123a13935k49962
12321c63897a3355I1113d7515B4198K4981K1583i3686G2801a5779G240J75523
12310A82763N5367J6980j25652b49352b7968A76357J69257a40774e8180m25983
12300d84163A93170e5936k3819p417j94265l3689A4977b54151J18908j41606m6667
12289c23516A53880F8440b65266B21151g2005b2150B29064d7274A93048O6693
$$ y = [158498, -38076, 180994, 87824, -19295, 159062, 305636, 72224, -408856, -212216, -187221, 95948, 201518, -49502, -155837, -67176, -380218, 164849, 105586, -12305, 450307, 55331, 343552, 181408, 83144, 72987, -77680, 280632, 335516, -57120, 195925, 213192, -192190, -310617, -173745, 190054, -169956, -67260, -59241, 49327, 241210, 174087, -113935, -363897, -13355, 91113, -47515, 24198, 49179, 70762, -93686, 72801, -15779, 7240, 182763, 238130, 255110, 129458, -249352, -27968, 176357, 345614, -140774, -58180, -484163, 193170, -55936, -79755, -87172, -281437, -315126, 14977, -254151, -135243, -276849, -323516, 153880, 68440, -265266, 221151, -72005, -22150, 229064, -47274, 193048, 259741]
12279B59741J310e804B48830d270A5314O3279J02949i6176B10282a64865j1209
12268a76074k30234C1397P1145J64918d0976P029B26419G7068K39964j984a42395
12256C98624g2896C9008A7597J99496a03569a3708k8140P298j1532k2228L1031
12245c7279m2180A74579M4381a05070I2111R1341a22308q0093c7207B23014o9954
12234A53060B4761J61679a3726A16150f6003k13346c7373B18647b9528J3793C28140
12222C1017K77331J04045F0344J89091j16871B0691J51758K120J25840B0911c2047
12210c629A96527D8355a8336B10295H1348k929b97077h0189K0526C29751A32092
12198a16953A42161J6401h1222r434B36090E9706L5941J11689H2685a05558C11746
$$ y = [259741, 261051, -5804, 248830, -4270, 15314, 78593, 181542, -96176, 210282, -164865, -176074, -406308, 31397, 102542, 267460, -40976, -33947, 226419, 77068, 317032, 315048, -142395, 398624, -72896, 39008, 17597, 217093, -103569, -13708, -41848, -34550, -46082, -68310, -37279, -79459, 174579, 218960, -105070, 92111, 183452, -122308, -202401, -37207, 223014, 153060, 24761, 186440, -13726, 116150, -66003, -279349, -37373, 218647, -29528, -15735, 328140, 31017, 308348, 412393, 60344, 249435, 132564, 20691, 172449, 174569, 300409, 20911, -32047, -3629, 196527, 48355, -18336, 210295, 81348, 78419, -297077, -80189, -59663, 329751, 132092, -116953, 142161, 158562, -81222, -90656, 236090, 59706, 95647, 207336, 82685, -105558, 311746]
12186A25681K11301A13325J60166j00816g2714l0400i430A80902N230L8791D5021
12174B64960K1049R5951a87058A75746o5050a5827D09786A55224J22052d7726
12163f0733D2042a76354B09018g9951H8615O841J16758d0374I0420K08341A44674
12151H1410J89939b686m2713G7921O4089b1999D0717a71262D6744K4571J13637
12140A84952j0072m4755L3643p1925J11826G9201c29159E8335d9637A88854k4644
12129A64210n9089b07869I309K0628J06442J69484j28008a12455j1320A65470
12118B23009A7205K06041a35066M571j77183N7078c6629G7362a56688A32155f1743
12106H4502f296q0291r6571q1721f9164A15076g3894K335I0874a90569F9683b5858
$$ y = [125681, 336982, 113325, 273491, 172675, -72714, -103114, -9430, 180902, 186132, 224923, 45021, 264960, 286009, 381960, -187058, 175746, 110696, -15827, 409786, 155224, 277276, -47726, -60733, 42042, -176354, 209018, -79951, 88615, 95456, 212214, -40374, 90420, 298761, 144674, 81410, 271349, -2686, -45399, 77921, 142010, -21999, 40717, -171262, 46744, 71315, 184952, 174880, 130125, 163768, 91843, 203669, 79201, -329159, 58335, -49637, 188854, 164210, 105121, -207869, 9309, 29937, 136379, 305863, 177855, -112455, -123775, 165470, 223009, 17205, 223246, -135066, -130495, -307678, -250600, -36629, 77362, -156688, 132155, -61743, 84502, -6296, -86587, -183158, -264879, -69164, 115076, -73894, -71559, 90874, -190569, 69683, -25858]
12093H273b4055j95276a3661C9647J19071b37998A05606B2465J16463d0632A30890
12081b11518B34002a86248E3046a35239e4816q1035A46444a39219B26532A06464
12070f3047E0972J51097R2633N99678k00709k89279b41562H5545R7019g3463G8689
12058A44236b4350E9978e49A62171K15135g6113A9442a68310e2621B03796o1506
12047A42290a14854R288o1172A59344K5434G6611J77792a80761D0570e8971j77537
12036b36508A60082d7212j74662j47252a03630E1107K90410A27063c777F3438
12025d0747k7328o6502A02099b82228A4696R286a10422d082k65449J11990q0185
12014b37726K0461A15376c38923A81758a13059A78366F8048a69471n2726j86422
$$ y = [8273, -24055, -219331, -13661, 39647, 158718, -237998, 105606, 22465, 138928, -40632, 130890, -211518, 234002, -186248, 53046, -135239, -54816, -135851, 146444, -139219, 226532, 106464, -63047, 50972, 202069, 294702, 894380, 693671, 404392, -241562, 85545, 182564, -73463, 78689, 144236, -24350, 59978, -549, 162171, 377306, -76113, 19442, -168310, -52621, 203796, 142290, -114854, -105566, -166738, 159344, 184778, 76611, 254403, -180761, 40570, -58971, -236508, 160082, -47212, -221874, -369126, -103630, 51107, 341517, 127063, -3777, 63438, -40747, -68075, -134577, 102099, -282228, 14696, 23982, -110422, -4082, -269531, -157541, -237726, -217265, 115376, -338923, 181758, -113059, 178366, 68048, -169471, -222197, -408619]
12004d08619b7053k9551j65017J06293p4373C9943b59127a20974I6711a96671
11993a92320m5830j40180J59086B43743l7796d9953G1630Q2248k0950J59314c56512
11981a62270M8225l8690b1109j97019j60606b3443B3289J240I64e7687b0481k28382
11969b48863j24544f9885e311l2195L225E6372a42318N0988j85335A9266J59953
11958A79219a52308B188P5215a0636l4646j81525r4157a41112B61162I3548b02166
11946A44697c7737b087A06233b2603k04208n5877J20322n0221M1764A38174Q0085
11935B18259E5791P2355D1250N5438K60906i3371G3908l6646a92596D87734b72671
11923h749p7342g951j61278A79004L4541F4396J63543I9877c725j20927D0542
$$ y = [-408619, -27053, -56604, -221621, -115328, -189701, 39943, -259127, -120974, 96711, -196671, -192320, -238150, -378330, -219244, 243743, 205947, -49953, 71630, 153878, 132928, 292242, -356512, -162270, -114045, -152735, -21109, -218128, -378734, -23443, 23289, 24529, 964, -57687, -20481, -248863, -373407, -69885, -5311, -37506, -34281, 56372, -142318, -91330, -276665, 19266, 179219, -152308, 2188, 77403, -10636, -45282, -226807, -320964, -141112, 261162, 93548, -202166, 144697, -37737, -2087, 106233, -22603, -226811, -282688, -162366, -212587, -170823, 138174, 218259, 55791, 128146, 41250, 96688, 357594, -93371, 73908, 37262, -192596, 487734, -272671, -8749, -86091, -7951, -169229, 179004, 213545, 64396, 227939, 99877, -3725, -124652, 40542]
11911c42353A7009a10342A62959g8771q6973D419J25970J43375b6063D7759i872
11899F221c30217A15163a33519b7092H6493M7685m4690C1147J32015k6107a44532
11887B39987a03797k30901a2616j41281H5640B1128J53283f2021A36147e5163
11876a75301J7510K1336q0120G8040b41756B8577a78342j2854D03143G285a82415
11864A61231F3122b19127h2479B62823j20822F9518b4811k73905I215f4117m0338
11853a04455A64980b96484L0278E6362b67142E06e8911b8180j178A28283B173
11841f649j29537M8042l4562O0073j67861H7660f7860p1513K5752j8272K2885
11830a09008L403B40653C829g9320e998A21685a54003l74217A100f3453j11023
$$ y = [-342353, 17009, -110342, 162959, -78771, -165744, 4419, 130389, 273764, -26063, 47759, -9872, 6221, -330217, 115163, -133519, -27092, 86493, 134178, 89488, 31147, 163162, 137055, -144532, 239987, -103797, -334698, -12616, -153897, 85640, 21128, 174411, -62021, 136147, -55163, -175301, -157791, -136455, -216575, 78040, -241756, 28577, -178342, -191196, 403143, 7285, -182415, 161231, 63122, -219127, -82479, 262823, 142001, 69518, -24811, -298716, 9215, -64117, -104455, 164980, -296484, -266206, 56362, -267142, 506, -58911, -28180, -29358, 128283, 2173, -6649, -136186, -88144, -122706, -62633, -230494, 87660, -67860, -139373, -113621, -131893, -109008, -105605, 240653, 3829, -79320, -5998, 121685, -154003, -528220, 1100, -63453, -174476]
11819a74476a876k37305B06645a77756B36752b2048g507A32485b15866j26457
11809c42323b2480p7175c5769k30509A11989M3574b57249a1694A50795d16381
11798i1691E8814J54759a86168e4950j01802k71190A67805L87377p7031I0629
11787d98962I4586L3077D2972J65837a3064A35581F5473f9246j87810A78179G6978
11775h0766B05599a17345D2516b4202B76557J62171a09644G1414a90572i5181
11764d427H4644B3322b72167k4822A40974f0651q6343c2718j94491R9727j69224
11753b96706h3861F0789b6662m2122k21680A30688a8599B31998r0969c17173a34276
11741d7545A37059a07486d3710j27200l7585J01671c3689A52343k0533g3121B58411
$$ y = [-174476, -1876, -239181, 206645, -177756, 236752, -22048, -7507, 132485, -215866, -342323, -22480, -99655, -35769, -266278, 111989, 155563, -257249, -11694, 150795, -416381, -91691, 58814, 213573, -186168, -54950, -156752, -427942, 167805, 555182, 478151, 90629, -498962, 94586, 127663, 42972, 208809, -13064, 135581, 65473, -69246, -257056, 178179, 76978, -80766, 205599, -117345, 42516, -24202, 276557, 438728, -109644, 71414, -190572, -95181, -4427, 84644, 23322, -272167, -296989, 140974, -60651, -146994, -32718, -227209, -127482, -296706, -83861, 60789, -26662, -68784, -290464, 130688, -18599, 231998, 141029, -317173, -134276, -47545, 137059, -107486, -43710, -170910, -208495, -106824, -33689, 152343, 131810, -73121, 258411]
11729e9620k7620h46l1300j74536P5342J6517k72717E843a64020j54355a20219
11717I6947a4380j4587k17405j4466A72434A5145b76054I3161J3033g8411o5001
11706a43412J391A08360k5354a64101p5514c101j00400A17505J27900j18694J02672
11695B29383b45792A9956f406A06162Q154L3138a42328d9079A01973a51099j16893
11684b67992J13573m5259K876j21885Q3090g7150j06970N0081A10408a21092n2944
11673a74036B75725c8780j62757G2769h7475j19021c0243B3833a06591B26982
11662a85757O9251m2288B5262c29974g2142l05513A94189b24759R3589M8655c6775
11650i8733j72272B64558a9991r2407p6388d8596j54601c3248K531I2542b97468
$$ y = [-59620, -87240, -846, -32146, -206682, -131340, -114823, -387540, 5843, -164020, -318375, -120219, 96947, -14380, -28967, -246372, -260838, 172434, 15145, -276054, 93161, 106194, -78411, -143412, -142021, 108360, 83006, -164101, -239615, -3101, -103501, 117505, 245405, 126711, 229383, -245792, 19956, -6406, 106162, 114316, 147454, -142328, -49079, 101973, -151099, -267992, -154419, -199678, -196802, -318687, -235597, -77150, -184120, -134039, 110408, -121092, -174036, 275725, -38780, -201537, 72769, -87475, -206496, -30243, 23833, -106591, 226982, -185757, -116506, -158794, 25262, -329974, -72142, -377655, 194189, -224759, -131170, -82515, -36775, -98733, -271005, 264558, -19991, -112398, -188786, -48596, -203197, -33248, -30717, 92542, -297468]
11638I8130a1159C93254D6261L9511a46258A73304i5044k40890I8023J06867b22163
11626D8525N1001b53273Q5340o3417A85049N0039i71A5894J91855a6595B14287
11614b78762I4396D4660d04810A19982b28458C12081a569l69271k3989B23996
11603A44447C3652c26363C3607K8544j2028j0697A0604O0855l5122h9716c3047
11591H8948J9489c50974g2750o61m478j80201O1377A3883J43629D2881L3273J40292
11579B16446a13287G847O5952M1465C0325M8428i6944m4991C09119j6129c5688
11567A58998g0581a3596p5879a2174j42663k60320a03809B6207K7727a81282A9116
11555c90066B8039f3130j91340d1354D55903e4642p2651p0774b337D5739d5425
$$ y = [98130, -11159, 393254, 46261, 85772, -146258, 173304, -95044, -335934, 98023, 204890, -222163, 48525, 99526, -253273, -167933, -231350, 185049, 235088, -971, 15894, 207749, -16595, 214287, -278762, 94396, 44660, -404810, 119982, -228458, 312081, -1569, -370840, -394829, 223996, 144447, 33652, -326363, 33607, 62151, 50123, 39426, 10604, 71459, 36337, -89716, -33047, 88948, 108437, -350974, -72750, -73411, -77889, -258090, -196713, 13883, 157512, 42881, 76154, 216446, -113287, 7847, 73799, 115264, 30325, 78753, -96944, -141935, 309119, 292990, -35688, 158998, -70581, -13596, -89475, -12174, -154837, -415157, -103809, 26207, 53934, -181282, 19116, -390066, 28039, -63130, -254470, -41354, 455903, -54642, -127293, -198067, -2337, 45739, -45425]
11543e1341B95471b07491o479A91493E996b5146A82090a4382p3705K3857A6708
11531B31701B8511J47463E5810e0745j8096l1370B12122d1127H3743l1123B0910
11519B707O2132a19613N3691I063d9917A14631b0645l4767b780j78079f494E6114
11506H9043H414a92495B46416G9241a61218L4392k9559k31379a58302r9869A45636
11494a54811C01916F7866a76243d4472B96274a40936M6076o5807M0750H9707f7349
11482H48a27800A09028N3212J5752a19476a7156G591M08624A34823P4576D617
11470a41395j3807C0383b74048a28144b1405j53964e956A33376E2352J17833o5926
11459A04259k2853L07517A40315A3590J72788b9212C6923K40326I3922h579A27594
$$ y = [-51341, 295471, -207491, -213970, 191493, 5996, -25146, 182090, -14382, -88087, -64230, 16708, 231701, 28511, 175974, 55810, -50745, -68841, -100211, 212122, -41127, 83743, 52620, 20910, 2707, 64839, -119613, -65922, 9063, -49917, 114631, -20645, -55412, -2780, -180859, -6494, 56114, 89043, 8414, -192495, 246416, 79241, -161218, -126826, -156385, -387764, -158302, -258171, 145636, -154811, 301916, 67866, -176243, -44472, 296274, -140936, -94860, -160667, -119917, 89707, -67349, 848, -127800, 109028, 162240, 177992, -119476, -17156, 7591, 416215, 134823, 209399, 4617, -141395, -155202, 30383, -274048, -128144, -21405, -175369, -5956, 133376, 52352, 170185, 104259, 81406, 388923, 140315, 13590, 186378, -29212, 36923, 277249, 93922, -8579, 127594]
11447a23868b9423C5231J53164R8076j26290B6972J76913a12292E2075M1368f9510
11435B634a62850L9441A57184c9644B48476b28957J07822b3978E0477g2485A12610
11423F0516C440J49269a41547G9128K0645a84412Q6236J6366j0795l31036A8549
11411A85713p2423J719D256J29991L15111h4661A63223a24030A33798g8173E6879
11399d86911A51664d1960l15546a62929A76819K7260F7347a68280K9837M8908
11389h9535G3337b3172k8989p1054j774A09914m1462J17873a60263q9377H3540
11377C44681b84502d0634l18409J37414J03496A09490J1518b03438a3528C9862
11366E843a672j6201m3667D9924J84564A0620e6557J7691B35813d39416a32562
$$ y = [-123868, -29423, 35231, 188395, 286471, 160181, 26972, 203885, -112292, 52075, 93443, -69510, 2634, -162850, -123409, 157184, -39644, 248476, -228957, -121135, -23978, 50477, -72485, 112610, 60516, 3440, 152709, -141547, 79128, 99773, -184412, -98176, -81810, -92605, -423641, 18549, 185713, 113290, 115009, 4256, 134247, 449358, -84661, 163223, -124030, 133798, -78173, 56879, -486911, 151664, -41960, -357506, -162929, 176819, 204079, 67347, -168280, -138443, -89535, 73337, -23172, -52161, -123215, -124989, 109914, 68452, 186325, -160263, -249640, 83540, 344681, -284502, -40634, -359043, -221629, -118133, 109490, 121008, -203438, -13528, 39862, 5843, -1672, -17873, -61540, 49924, 234488, 10620, -56557, -38866, 235813, -439416, -132562]
11354b1835A20148a39073m4799A9945c13921A16286l6814j5929J16862F7074E186
11342D1649j2957J50481D9991K15536F5917a97708a8445B6961b33674M0876k43706
11331d36504C1684h7792f042A1400d03873a22428J865L9684A22150J99418g6665
11319F3492B8362J40570q1617b5050H3231a28098o9374g2923A92911b00907k6314
11308b27221E9154c5084l14604J61067b8044p4008d2295J6233A15558a89353A49075
11296a20591M5862j8702k077A01329a1436k60926j3288J07276e7479b2321a0608
11284A22083a46891A75205d11A9411b09522A11914i0423B81872I5300j0125a26313
11272g4961B84183c92125A52085j7504Q2394h0802m9832q0725E9993a41191b049
$$ y = [-21835, 120148, -139073, -183872, 19945, -313921, 116286, 79472, 63543, 180405, 67074, 5186, 41649, 28692, 179173, 49991, 265527, 65917, -197708, -18445, 26961, -233674, -192798, -436504, 31684, -87792, -6042, 11400, -403873, -122428, -120563, -80879, 122150, 321568, -76665, 63492, 28362, 168932, 87315, -25050, 83231, -128098, -197472, -72923, 192911, -200907, -227221, 59154, -35084, -349688, -188621, -28044, -102052, -42295, -26062, 115558, -189353, 149075, -120591, -74729, -93431, -95508, 101329, -11436, -272362, -285650, -178374, -57479, -22321, -10608, 122083, -146891, 175205, -411, 19411, -209522, 111914, -90423, 281872, 95300, 85175, -126313, -74961, 284183, -392125, 152085, 134581, 216975, -80802, -130634, -211359, 59993, -141191, -2049]
11260a7847j52065A21515D3271c19546B0743d5007k0106n15225a93704R5784J2156
11249h5764K7882D7646n908o641a59458C4861Q1797c0643j83882A59352l0526
11238A28826J20753a9345p8194q467A0124J56798F7573c67617A14048a9104B20429
11226b11869B89674C4157g4090r7170G5251b23252m5013N1327H5709d5299b1256
11214h4877B29068a03668A90289g781k42102g324B95531j17876a92902p5839J6549
11203b52192a4943B24188A7442J76098a52097c4555A29659a46691K7742A5638
11192C52695a72244k52984A48987a05563m6481d1634A43402K09853d0346k31827
11182b72173K4941l0625j9694J8199A37278i5524A5612b46097E8654a01490B42975
$$ y = [-17847, -169912, 121515, 43271, -319546, 20743, -45007, -65113, -580338, -193704, -97920, -85764, -57882, 47646, 41738, 35097, -159458, 34861, 116658, -30643, -214525, 159352, 128826, 249579, -19345, -97539, -106006, 10124, 166922, 67573, -367617, 114048, -19104, 220429, -211869, 289674, 34157, -74090, -171260, 75251, -223252, -268265, -216938, 85709, -45299, -21256, -84877, 229068, -103668, 190289, -7781, -249883, -7324, 295531, 177655, -192902, -268741, -252192, -14943, 224188, 17442, 193540, -152097, -34555, 129659, -146691, -118949, 15638, 352695, -172244, -425228, 148987, -105563, -152044, -41634, 143402, 353255, -40346, -272173, -247232, -277857, -297551, -279352, 137278, -95524, 15612, -246097, 58654, -101490, 242975]
11170I5277B5224b34398J10056M7400G5459a75519E6056R7681A622J24718M4560
11159A70900a30905K8626J5169j00840F8356d8622j21793A28203b37021o15F0991
11147C38810j01625A6513e2331k52319j57063a94333L0753c596k80902i5784a8818
11135H2663c58245d618j19656k9602C13266b4135H017K37417E8085B5199J47353
11124A72552a40242A985a06693j19232L1222B40204K78062B36768p0770L9849
11114B05847I1108q855i1278A12521N389j8557B6660L10544g3724B25011F993
11102C9457A7263M9078a79946C51735F2339a88052C9662d7843m5214C1151j630
11091B9521c1366r6431N5310F3209J47221m8506k7005R659k1314K77577A3908
$$ y = [95277, 25224, -234398, -124342, -76942, 75459, -175519, 56056, 153737, 1622, 126340, 170900, -130905, -102279, -87110, -187950, 68356, -48622, -170415, 128203, -237021, -237636, 60991, 338810, 237185, 16513, -52331, -304650, -461713, -194333, -163580, -3596, -284498, -95784, -18818, 82663, -358245, -4618, -124274, -153876, 313266, -24135, 8017, 245434, 58085, 25199, 172552, -140242, 1985, -106693, -225925, -194703, 240204, 518266, 236768, 165998, 205847, 91108, 82253, -91278, 112521, 117910, 99353, 26660, 337204, -73724, 225011, 6993, 39457, 17263, 66341, -179946, 351735, 62339, -188052, 39662, -47843, -93057, 31151, 29521, -31366, -127797, -72487, 63209, 210430, 161924, 134919, 144578, 123264, 400841, 13908]
11079A88523b93407B90815A09403a90119A56903J88695j41885J07711J17618F6894
11068A45163b3073C5735K89525m9855n0524L6004f1534D72911A03437J6881O733
11057A27051K4226J07214M0651n2918P1561J38560j15071K15973A01007L79905
11047D80912N6816j61591P2357N8224K91068K1963j27688B12295L59631P5293
11037F47219k47193P5728J01140K59147l26820N7281J1999j0238O3144j98786
11027D32621n5650l0378N9185J77674k6451J31525j34705D2233K95648j02906
11017B34975J58086O9259J90597k59104k9978j1650A49917K28533K22251k98748
11007C01953L66138l3798B09308K85889j79425k168J62223j72610M98341q2620
$$ y = [188523, -293407, 290815, 109403, -190119, 156903, 345598, 203713, 311424, 429042, 66894, 145163, -23073, 35735, 325260, 275405, 224881, 260885, -61534, 472911, 103437, 120318, 127051, 151277, 258491, 299142, 246224, 317785, 456345, 341274, 557247, 101007, 480912, 537728, 376137, 448494, 506718, 797786, 819749, 692061, 212295, 571926, 647219, 400026, 475754, 576894, 836041, 509221, 566502, 578501, 568263, 631407, 432621, 376971, 346593, 405778, 583452, 557001, 688526, 553821, 42233, 337881, 234975, 393061, 462320, 652917, 393813, 363835, 352185, 149917, 378450, 600701, 301953, 668091, 634293, 209308, 495197, 315772, 313604, 475827, 303217, 801558, 718938]
10997G18938C16792R4563O2487k3480I8977M82780F9325K40666n8171J94845K8731
10986D75396O4683B04641M90205j9053k18560J56770R0897j38123L19694K08376
10976A094847k30040J52209P8117J69447k73370N11993n0848O64016k03695J67026
10966B079702m9297J06931l08052M3430o06282Q527n51674J81119j53449j05486
10956F45469m8278J27665n9387J09169K3294A23867M47187n0054A30781M41867
10946E72648k17330e5612G594K59051b37232B93640f9831A41698J6479O1330m5706
10935A73801M22929D0883J02648B838a0640C18822j24604r2422K10131n4277e7563
10923b52492i7259k02237A8312h0818q5966O2439j97731B39880C8888J5165a94494
$$ y = [718938, 316792, 411355, 473842, 450362, 98977, 581757, 69325, 309991, 251820, 446665, 475396, 540079, 204641, 694846, 675793, 457233, 614003, 704900, 566777, 886471, 1094847, 864807, 1017016, 1095133, 1264580, 991210, 1503203, 1452355, 2116371, 1912676, 2079702, 2030405, 2137336, 1829284, 1872714, 1266432, 1274959, 723285, 904404, 750955, 645469, 597191, 724856, 665469, 774638, 797932, 123867, 571054, 521000, 130781, 572648, 355318, -55612, 7594, 266645, -237232, 293640, -69831, 141698, 158177, 219507, 173801, 596730, 40883, 143531, 2838, -10640, 318822, 194218, 101796, 311927, 257650, -57563, -252492, -97259, -299496, 18312, -80818, -166784, -104345, -302076, 239880, 38888, 54053, -194494]
10911B15208c6725k96022f7506q1745A0223J14767f6555B74231d22055a37893
10900A95876f0015A49948b5692q3611l94672H4819O7253d05010L4903B02368B9482
10888b93110i5637m21j26042F3447J14579b28200a2859m12095C3664e957j35913
10877a41870A70505c83347J77482M0803c492k23635F9540c7512D177L1886a91380
10865a64813A22075a34072j5726F0910k3436J57125I3575B0111o541J18619c29123
10853B17759b7233A46600J04034C1737R1316h2494F9200a78601m19607B30417
10842B58298F3981c03219E1514J08420a60694r0372A56365f7748B9755a52771
10831d7297j01708k4059j66036a19631A0238a57187c4118j12504A32707N8373
$$ y = [215208, -36725, -332747, -67506, -149251, 10223, 124990, -66555, 274231, -422055, -137893, 195876, -60015, 149948, -25692, -109303, -503975, 84819, 152072, -405010, -370107, 202368, 29482, -293110, -95637, -96058, -222100, 63447, 178026, -228200, -12859, -424954, 33664, -5957, -141870, 170505, -383347, -205865, -165062, -3492, -227127, 69540, -37512, 4177, 36063, -191380, -164813, 122075, -134072, -149798, 60910, 37474, 194599, 93575, 20111, 13570, 132189, -329123, 217759, -27233, 146600, 250634, 31737, 123053, -82494, 69200, -178601, -598208, 230417, 258298, 63981, -303219, 51514, 159934, -160694, -251066, 156365, -67748, 29755, -152771, -47297, -149005, -173064, -339100, -119631, 10238, -157187, -34118, -146622, 132707, 191080]
10821A91080Q4010d687A1140b90090P1632B4352g0016k45806A54722b9559C8104
10809a0051A64642G4338J29737i3070A78179c08010a35208J8195A06724b78370
10798A16162b57014p0257b0735B33321J5779D7571e691j68590R365a2873j24324
10787a37197B67854b95208A0314b73177P4157h4019c1026A95062A8778i6263p417
10776a03680k92821a51408o0942j4677B51432C9859a79813A41754m8178j1786
10766H1790c5333A43822a65136n3500A27774b10250E6972b94621e71j83169H2381
10754A12765N2559d0527k22088c2403k9160A57444f0775I5147D3386p322J15383
10743A51447C9403J5187e928k17690c1623q3715D6747J50121g0900n9492A67134
$$ y = [191080, 275090, -4687, 11140, -290090, -218458, 24352, -70016, -315822, 154722, -29559, 38104, -10051, 164642, 74338, 204075, -93070, 178179, -308010, -135208, -117013, 106724, -278370, 116162, -257014, -327271, -20735, 233321, 249100, 47571, -5691, -174281, -164916, -12873, -137197, 267854, -295208, 10314, -273177, -199020, -84019, -31026, 195062, 18778, -96263, -103680, -396501, -151408, -212350, -227027, 251432, 39859, -179813, 141754, 93576, 81790, -35333, 143822, -165136, -218636, 127774, -210250, 56972, -294621, -571, -183740, 82381, 112765, 165324, -40527, -262615, -32403, -61563, 157444, -60775, 95147, 43386, 36064, 151447, 39403, 54590, -5928, -223618, -31623, -115338, 46747, 196868, -70900, -130392, 167134]
10731b5765I9614a61797m4246K7007h2273k31858a43563A29142c1599k87569a21814
10719a25796J2750q9553G746K00615b95397G554Q6493C7177M0778Q5178C2358
10707iB17594g1178G9587a31685D2372a62428L0120k1310H1840c4371C4511b69814
10694g3714r0980g1459r9811c6681k31949A30623n6137c12421A40559a18235K6905
10683i1330q2356p8368i7571o2131a9039k85294L7355a18956k74657G4790h4521
10671E0327B3457J09126D5602a64603b6028n0098A5160a48500k4712c2833C3549
10659a3378F8569A3274b01196d8550D9369b4166j50491l22751a62898H7073a14401
10647A70102b12924G5492L5115k8128a64051A47617C9965b53857a4693n4704I5554
$$ y = [-25765, 99614, -161797, -206043, -179036, -82273, -314131, -143563, 129142, -31599, -319168, -121814, -125796, -113046, -202599, 7746, 208361, -295397, 7554, 94047, 37177, 77955, 163133, 32358, -9, 217594, -71178, 79587, -131685, 42372, -162428, -132308, -153618, 81840, -34371, 34511, -269814, -73714, -164694, -71459, -171270, -36681, -268630, 130623, 74486, -312421, 140559, -118235, -91330, -173686, -252054, -97571, -159702, -19039, -304333, -266978, -118956, -393613, 74790, -84521, 50327, 23457, 132583, 45602, -164603, -26028, -76126, 15160, -148500, -173212, -32833, 33549, -13378, 68569, 13274, -201196, -48550, 49369, -24166, -174657, -497408, -162898, 87073, -114401, 170102, -212924, 75492, 110607, 82479, -164051, 147617, 39965, -253857, -14693, -69397, 95554]
10635A20283E68J38238c25816a53166j48419A58514a6898F068f1864j13466M2172
10624a33158H7484K53055H2917b10226C9847a66272f988C64373A67052h6152B11114
10612a14732j9217K2955j76935J19256a537k16977j11927B11786E3084d28676
10601g1089b4498B02036I1108a42645M7882C4328a1943k74805G2388l2779j4075
10590B5534J90311h1747j6398B3864i7831j34797a06633q2640j46825J46504A01875
10578b31362I1273d9036j38122c039A52938q642a55764j25509f4364k63967I8137
10566B03394i3248j61164H2234a67442j24327M979E9381L99386I4633e8027k1316
10555g9343A19085D6100b61972B05040g5165A96872q4731b46587A01177C9796
$$ y = [120283, 568, 138806, -325816, -153166, -301585, 158514, -16898, 6068, -61864, -175330, -133158, 87484, 340539, 82917, -210226, 39847, -166272, -6988, 364373, 167052, -86152, 211114, -114732, -133949, -110994, -287929, -168673, -1537, -218514, -330441, 211786, 53084, -428676, -71089, -24498, 202036, 91108, -142645, -94763, 34328, -11943, -286748, 72388, 39609, 25534, 215845, -81747, -98145, 23864, -97831, -232628, -106633, -189273, -336098, -189594, 101875, -231362, 91273, -49036, -187158, -3039, 152938, 144296, -155764, -281273, -64364, -328331, 98137, 203394, -93248, -254412, 82234, -167442, -291769, -286790, 59381, 458767, 94633, -58027, -79343, 119085, 46100, -261972, 205040, -75165, 196872, 112141, -246587, 101177, 39796]
10544b27744Q6687A38687A3350M19389a6984B84401P2285c71573a02265j89569
10534b91834A11762a52437A61989c4321l5255j8807B81184d8312k07887k45087
10524e01286J61923a273A2459a85171K1360B34479I6380b06782J02562F8308L4195
10513A02503M8537a98459B1581K72928b4265B77364b7709r3942e8291j25880R1762
10502i2409R371J6912C1730L22425b29570n3429J08708K944g125B2514a49549
10490B0782J73923a1071o1433b6614o7868a0287q2600n7190A85433g6738B3715
10478d9056k1772k23090A49636b13220K0610B43695A12236Q6641F3542b73277
10467a44126A50316C132J31326b64161A37763c6359D3743N7082Q8552b79189J37555
$$ y = [-227744, -141057, 138687, 13350, 432739, -16984, 284401, 356686, -371573, -102265, -291834, 111762, -152437, 161989, -34321, -69576, -88383, 281184, -48312, -256199, -501286, -339363, -1273, 12459, -185171, -163811, 234479, 96380, -206782, -104220, 68308, 102503, 151040, -198459, 21581, 294509, -24265, 277364, -27709, -121651, -58291, -184171, -92409, -83038, -66126, 31730, 354155, -229570, -282999, -174291, -171347, -7125, 22514, -149549, 20782, 194705, -11071, -72504, -26614, -94482, -10287, -92887, -150077, 185433, -76738, 23715, -49056, -70828, -293918, 149636, -213220, -192610, 243695, 112236, 198877, 63542, -273277, -144126, 150316, 3132, 134458, -264161, 137763, -36359, 43743, 100825, 189377, -279189, -141634]
10456a41634b0733B47157a55907I1114B6381f4723j79389A13094B7037b29928
10445G9211j4988h2761A22482f2629b8134E7771c73041A30992o0138a27418l1513
10434a58931o0313d146I0108e7402k7954D094c17916a47819N9872j4015F7362
10422a8971G0278e8688j6887B02451B0500J08533j9013a54279l1013Q4846b6832
10410f7658j37419B71181C6713O8063a16677N1005B7417a1502E0524J49526g0435
10398c30319a59220O5815F5707c0271B9851J28906L2781J57141B1953N36291A11370
10386A0462O85774a70768g5053B4290L51132e8277C3873J48004a25178C85171
10375b7339A61784q0237L3145a59028A92687J17378e6586C72958b0505C3224M87870
$$ y = [-141634, -20733, 247157, -155907, 91114, 26381, -64723, -244112, 113094, 27037, -229928, 79211, 64223, -82761, 122482, -62629, -28134, 57771, -373041, 130992, 70854, -127418, -158931, -219244, -4146, 90108, -57402, -85356, 4094, -317916, -147819, -87947, -101962, 67362, -18971, 70278, -58688, -75575, 202451, 20500, 129033, 110020, -154279, -185292, -100446, -26832, -67658, -205077, 271181, 36713, 104776, -116677, -65672, 27417, -11502, 50524, 200050, -70435, -330319, -159220, -93405, 65707, -30271, 29851, 158757, 191538, 348679, 21953, 558244, 111370, 10462, 696236, -170768, -75053, 24290, 375422, -58277, 33873, 181877, -125178, 385171, -27339, 161784, 81547, 114692, -159028, 192687, 310065, -56586, 372958, -20505, 33224, 521094]
10364E21094j64614L264A39067O5031c4791B82669j14142J11003i1050A96037
10353A93430j2267L74847A50707a19395B97980J11390J32662B32987F3237M3869
10343A07106J44097C2955J15931G4271b72972E0667B4748p574K27910K6562G3893
10331B11261J6623R2312A23209a53570d4985B49413e8498Q359H7214N9521a27238
10319B42866o3666K48831j41900A6244a648q7913a4395C8078J85595r9050a62360
10307b9921B49342P716B4987N3096h9235k17767A59157b74962d8172E2073b0031
10295A20534a71169F518N6465K30667e2070j8540m1548c66j52253j24421j56509
10284d33549A33836b08722f4497B22182a20729E7432b91970a23560j52521E83660
$$ y = [521094, 356480, 359744, 139067, 204098, -34791, 282669, 168527, 279530, -91050, 196037, 193430, 181163, 556010, 150707, -119395, 297980, 409370, 542032, 232987, 63237, 107106, 251203, 32955, 148886, 74271, -272972, 50667, 24748, 17174, 245084, 271646, 73893, 211261, 227884, 320196, 123209, -153570, -44985, 249413, -58498, -50139, 87214, 146735, -127238, 242866, 179200, 428031, 286131, 16244, -1648, -89561, -14395, 38078, 223673, 124623, -162360, -29921, 249342, 257058, 24987, 78083, -89235, -307002, 159157, -274962, -48172, 52073, -20031, 120534, -171169, 6518, 62983, 293650, -52070, -70610, -112158, -366, -152619, -277040, -433549, 133836, -208722, -64497, 222182, -120729, 57432, -291970, -123560, -276081, 583660]
10273h9912k40764A48392a37374C9497J06226b43942E6635i5198L2716k01097
10263b63579K593d5646C2565J13604O9816p2494E958M7300L171a8343j78617E8458
10250A15183b54866A41689d4251B20453a4231C51997b00120i3337B24844a79090
10239H8734O4933m6268a36920q6986B91593c09754B6175a72134c8258G8337e360
10227A4372g2945B77392d72314A65715E6288B2127a80153e5891A59237K89295
10217D48532a43975c7518m7584B56362a40404D195a60800F7227a31833j27738
10207b59571O6455c5490j89680A45881A1243D402d03600D0718a23591K9167G0621
10195a10909B8241b48983P1150c9995H5031J29910O7674a64120g4371F5996M1482
$$ y = [-89912, -330676, 148392, -137374, 39497, 145723, -243942, 56635, -95198, -62482, -263579, -260986, -45646, 32565, 146169, 215985, 143491, 5958, 53258, 56429, -18343, -196960, 58458, 115183, -254866, 141689, -44251, 220453, -14231, 351997, -200120, -93337, 224844, -179090, 88734, 153667, 107399, -136920, -223906, 291593, -309754, 26175, -172134, -38258, 78337, -5360, 14372, -72945, 277392, -472314, 165715, 56288, 22127, -180153, -55891, 159237, 448532, -143975, -37518, -85102, 256362, -140404, 4195, -160800, 67227, -131833, -259571, -193116, -35490, -225170, 145881, 11243, 4402, -403600, 40718, -123591, -94424, 70621, -110909, 28241, -248983, -177833, -39995, 85031, 214941, 282615, -164120, -74371, 65996, 107478]
10184A07478a61967O2382K2220E1191L933a10587j40795e4534m30723A04177c2617
10172E3683b04143C02320h4527j3646B01337a34525l2055q6600L0154q4412g0072
10160i8317A19140g714H0037a90767J0220l1693J5059o0203A19565D3345f203
10148b18413E9939a98118k606b388j22024A53781h3852j7261q8802C24067D733
10136a10795F9890j605c17205D797Q1028c2984j30174G5180a91576r7366b1144
10124d17545B90513a83964a5330j81312k53533f405A500J64495D1660a63929A51457
10112b84714C32041e9760A41909b11563F261a6331A93239d239D5321b35712A8120
10100a66863B63372b02440G1822b95811D4165b73090A697J50025A4988K64712
$$ y = [107478, -161967, -99585, -77365, 51191, 55124, -110587, -251382, -54534, -485257, 104177, -32617, 53683, -204143, 302320, -84527, -98173, 201337, -134525, -166580, -253180, -223026, -307438, -70072, -98317, 119140, -7714, 80037, -190767, -180547, -212240, -197181, -257384, 119565, 43345, -6203, -218413, 59939, -198118, -200724, -2388, -124412, 153781, -83852, -101113, -189915, 324067, 4733, -110795, 69890, 68285, -317205, 4797, 85825, -32984, -163158, 75180, -191576, -288942, -21144, -417545, 290513, -183964, -15330, -196642, -450175, -6405, 1500, 165995, 41660, -163929, 151457, -284714, 332041, -59760, 141909, -211563, 6261, -16331, 193239, -4239, 45321, -235712, 18120, -166863, 263372, -202440, 71822, -295811, 44165, -273090, 1697, 151722, 14988, 279700]
10090B79700H1462d34836B57708a75788e1467D77513a03979r501C65915a78729
10079A73169e9913p1646o1167A19312g9990k52391c1971p9788q3537G8971b78936
10067f4666D01256d6233k09951E9754a36465e354m770l465n1905j18463l5142
10056b19099O2984L9563j48205m2272a47767A22295P7182b28994A49114Q836K5395
10045A83345b5849l12388F7045h4976k6234L6043k47041J47286j04726a10433
10034a4663j18432B6631B159K65048a35318q5786R0455d4718l614m8257p5447
10023a72036k6489A77163b64150L5780e6027m2460A07606b28861A9070a70007
10012B59687a92480A46753a72673A22445a79736n8635j7309A2272a40263j5084
$$ y = [279700, 81462, -434836, 257708, -175788, -51467, 477513, -103979, -113480, 365915, -178729, 173169, -59913, -131559, -192726, 119312, -79990, -332381, -31971, -111759, -195296, 78971, -278936, -64666, 401256, -46233, -256184, 59754, -136465, -5354, -10124, -13589, -65494, -183957, -219099, -156115, -116552, -264757, -307029, -147767, 122295, 199477, -228994, 149114, 157950, 183345, -25849, -338237, 67045, -84976, -111210, -75167, -322208, -174922, -279648, -110433, -14663, -133095, 26631, 2159, 267207, -135318, -221104, -130649, -44718, -48332, -96589, -172036, -198525, 177163, -264150, -228370, -56027, -98487, 107606, -228861, 19070, -170007, 259687, -192480, 146753, -172673, 122445, -179736, -238371, -255680, 12272, -140263, -155347]
10002a55347L752A44866b13548p64d6321j40753O7016A7704f4284J5989l8830
9991h7125j27956O2261d3410o4651A02115a92534L8770n4370d834E4953b87448
9979b67257c8571G1872k7472G052d55086A37936d2776k48567G2846k1892c7053
9967f3478q5662b2169e53n7408A1836a25509A14666g8693j98439B57962A6894
9955A08345m3905a15690A96130e5223A4132a93696H304c14295a29708m9812G777
9943b00575g000B1022d89j49123A21406c22587A06343O4147b2290H321a72854
9931b63984C1136R0992l5761b4843F694h153o8049L1730E3066K68251C9064a85093
9918a17366F0873J02452A5687e6391j12032e3547E8983Q9269K03655i126A19662
$$ y = [-155347, -151595, 144866, -213548, -214312, -46321, -187074, -120058, 17704, -64284, -48295, -87125, -215081, -152820, -43410, -108061, 102115, -192534, -153764, -208134, -4834, 54953, -287448, -267257, -38571, 71872, 44400, 7052, -455086, 137936, -42776, -291343, 72846, 50954, -37053, -63478, -149140, -22169, -553, -57961, 11836, -125509, 114666, -78693, -277132, 257962, 16894, 108345, 64440, -115690, 196130, -55223, 14132, -193696, 8304, -314295, -129708, -179520, 7777, -200575, -7000, 21022, -489, -149612, 121406, -322587, 106343, 170490, -22290, 8321, -172854, -263984, 31136, 122128, 86367, -24843, 6694, -8153, -76202, -44472, 53066, 321317, 39064, -185093, -117366, 60873, 163325, 15687, -56391, -168423, -53547, 58983, 148252, 351907, -9126, 119662]
9906A91297m7774b31181g6548k5367J5584P873l67832j0546c3321B66288b96138
9894d542o151q4017k88480N2135a55254j20971O2858F3533a69760O9670k02943
9883c03033M5785A85983k5882B1424b77816g7820p0855I1389b3519a0068k97233
9872c07301R4599F2651j3545E060a68097j06788c3861k76993O2699a10827j44214
9861b55041J04086C90386a41569n765l01119B16757B8755a06974b0432j86371
9851b06803h579G2471J44863D0243a27643e473k87949c8374j21638J9305b6705
9839F8866A5080a16880G4480b35922B7638J84372b09515B8888b52090j21969A19680
9827C14293a78865n6044B20228e1674j99231M6409i0285A08115D2968b08941j93467
$$ y = [191297, 143523, -231181, -76548, -101915, -86331, -78458, -446290, -456836, -33321, 266288, -296138, -4542, -10693, -94710, -383190, -331055, -155254, -276225, -213367, 63533, -169760, -100090, -303033, -257248, 185983, 160101, 21424, -277816, -77820, -148675, 91389, -23519, -10068, -307301, -212702, 62651, 49106, 5060, -168097, -274885, -33861, -310854, -248155, -110827, -255041, -150955, 390386, -141569, -147334, -448453, 216757, 28755, -106974, -20432, -206803, -8579, 72471, 217334, 40243, -127643, -5473, -293422, -38374, -160012, -140707, -26705, 68866, 15080, -116880, 74480, -235922, 27638, 212010, -209515, 28888, -252090, -374059, 119680, 314293, -178865, -234909, 220228, -51674, -250905, -204496, -90285, 108115, 42968, -208941, -402408]
9816d02408B43819b10019Q3170K8321d4493n1100j32524L855A57901d4217A82486
9804h0768k11262A50813b57911k33237J05645D0484O6177b81282k2467G1785b83573
9792I2762a55313N5975M4580D5828f3030j23184G4587b80931I408c81056A7423
9780f03357K96262b3765F922c60412l5882e3304p2903n5662d9496j87588B9020
9768a77534E0705d940A16096b99506G077R0041a05770f750B4104c54344A29508
9756a64392A44868b84719O6364O6597H8114a2887k52516A11173n3400M4056i7736
9744a85229K9876j97523A77019A2448b68499J20614A93814a3913A7798R7154a4239
9732a78764P0971M2308k07924P9976L2008B07321a7182j6186l81970o71d9871
$$ y = [-402408, 243819, -210019, -126849, -98528, -44493, -95593, -228117, -224262, 157901, -44217, 182486, -80768, -292030, 150813, -257911, -491148, -385503, 40484, 106661, -281282, -303749, 71785, -283573, 92762, -155313, -99338, -54758, 45828, -63030, -186214, 74587, -280931, 9408, -381056, 17423, -603357, -307095, -23765, 6922, -360412, -396294, -53304, -126207, -181869, -49496, -237084, 29020, -177534, 50705, -4940, 116096, -299506, 7077, 97118, -105770, -6750, 24104, -354344, 129508, -164392, 144868, -284719, -218355, -151758, 88114, -12887, -265403, 111173, 57773, 101829, -97736, -185229, -155353, -352876, 177019, 12448, -268499, -147885, 193814, -13913, 17798, 114952, -14239, -178764, -107793, -65485, -273409, -193433, -161425, 207321, -17182, -33368, -415338, -416009, -49871]
9720A93827c8216q8396C3828b99886a1746j00065j2551a745j04265A31241a50927
9708a22319A1461a02748I5558b04679A28449K9994M5487c17936B41100a56403
9697d4013D685M9924A4618a19895A59061g1428A19499h7828f004r5004J5574k8997
9685a14431A78614f6250A49881p0754M8469a98409P161g214H388J15591a11084
9673a81163q9104b0560p5235p4735B21617q5827e4664j4199A62060A0901L1597
9662D2498K52781H3987b77628d1658l95951B26293b85570b3390k4118k41140b7941
9650A20430f7855A10805c3914k13056l2567G7184c6662F4412L15634b02865c0261
9638C5291L9172a80348f3876k46027b6072m6644r7183c2232m07556A10232b20660
$$ y = [193827, -38216, -126612, 33828, -299886, -11746, -111811, -124362, -1745, -106010, 131241, -150927, -122319, 11461, -102748, 95558, -204679, 128449, 158443, 203930, -317936, 241100, -156403, -44013, 4685, 54609, 14618, -119895, 159061, -71428, 119499, -87828, -6004, -101008, -85434, -114431, 178614, -66250, 149881, 79127, 127596, -198409, -191248, -7214, 8388, 123979, -111084, -181163, -270267, -20560, -95795, -170530, 221617, 135790, -54664, -68863, 162060, 10901, 42498, 295279, 83987, -277628, -41658, -437609, 226293, -285570, -23390, -47508, -288648, -27941, 120430, -67855, 110805, -33914, -246970, -279537, 77184, -36662, 64412, 380046, -202865, -30261, 35291, 74463, -180348, -63876, -309903, -26072, -72716, -169899, -32232, -439788, 110232, -220660]
9626b66168h295k48352b7674j46063f0450j39786N0868B29952a07755B44264h9749
9614A70642a40239m6152D1001Q1826e0461p9279K5788L7319j28398A37772a47130
9602a80140F1500J75693b05758i0839k95338n0383H0078a22409o3919j8436k3222
9591b27986A06063D0794K9312M9536J4425h6720E9722c40170P1451H5515c04029
9579C7962b07227j51994a08571k50912e0562m08855B53439d06760c0320m3628
9569g3948m46549E020R1574a98284G8349B0831g1412n029a5455j72711I795d4276
9556f3237J522a0615H2305K5536b5572j34957k9303h49j14733A32341e0634A59565
9543b30064L8581c9682l78346a97159G8624b19308J7337E5749b72327A6706O2300
$$ y = [-266168, -8295, -256647, -27674, -173737, -60450, -200236, -149368, 229952, -107755, 244264, -89749, 170642, -140239, -186391, 41001, 122827, -50461, -129740, -103952, -66633, -195031, 137772, -147130, -180140, 61500, 237193, -205758, -90839, -386177, -436560, 80078, -122409, -186328, -204764, -227986, 106063, 40794, 70106, 119642, 134067, -86720, 59722, -340170, -268719, 85515, -304029, 37962, -207227, -359221, -108571, -359483, -50562, -459417, 253439, -406760, -30320, -73948, -520497, 5020, 96594, -198284, 78349, 20831, -71412, -76441, -15455, -188166, 9795, -44276, -63237, -61715, -10615, 82305, 107841, -25572, -160529, -189832, -849, -115582, 132341, -50634, 159565, -230064, -191483, -39682, -418028, -197159, 78624, -219308, -201971, 55749, -272327, 16706, 79006]
9532G9006c05506A8778b40422F4325c10357A91086M0615a41668j47119E781b43147
9520c7695F4974a21013B04840b00887j6059D6818k0170j1234e5887B5774g6021
9508f5653D88L5615d2044c39l4019B36248b8809A1083b92082J3375j24481A11289
9495C2352H864O2489M6091f7400A74622a80532A29165a51397l634B35071a0306
9483B2105b62860a08691F7475e6169j18106l29406a2897j58514r1266b4203j79906
9472b04109e3968l38976A85099c0289k07693L4799m4652A41595b13541Q5308N4072
9461g4161I3926a25584n4415C74147b79731i951j19495F2427e42096A3157b58720
9449a09662j10832I5054L15233a85599a1735I8008a62158A1661J56678m2748J99934
$$ y = [79006, -305506, 18778, -240422, 64325, -310357, 191086, 231701, -141668, -288787, 5781, -243147, -37695, 64974, -121013, 204840, -200887, -216946, 46818, 26648, 15414, -55887, 25774, -76021, -65653, 488, 36103, -42044, -339, -34358, 236248, -28809, 11083, -292082, -278707, -403188, 111289, 32352, 8864, 71353, 117444, -67400, 174622, -180532, 129165, -151397, -155031, 235071, -10306, 22105, -262860, -108691, 67475, -56169, -174275, -503681, -12897, -171411, -262677, -24203, -204109, -53968, -392944, 185099, -30289, -237982, -203183, -247835, 141595, -213541, -128233, -74161, 93926, -125584, -179999, 374147, -279731, -9951, -129446, 62427, -542096, 13157, -258720, -109662, -220494, 95054, 410287, -185599, -11735, 98008, -162158, 11661, 168339, 125591, 325525]
9438C25525L362a50325m1330O2334d4762j2520J0783F1616c38417J67773C12492
9426f6647A0619J8501c70950a70299D9322d8693A98449c8987D2018j6437a08556
9414a10415k7931B6187a54782A61691a22306E0064L9006M8842a69384l3624h6448
9402b57555R4972P0575k97126P4515A9828G695H50c5976m9579A42269d1428k41720
9390b83148o0942A02171f2557j12166k399n0888G8179K50026f4687b6175A26397
9378C7363c96767a34169G441P328A461K9767J49037b05537D4547L2105a88752
9366d27166D4783b98328a5441j47147K0567e9217b4095F5330a42733A25161d62647
9354A21109b2061A77165a60345c7996o2475D6961h4735B19769a45114O599F688
$$ y = [325525, 328887, -150325, -191655, -129321, -44762, -57282, -46499, 61616, -338417, -170644, 312492, -66647, 10619, 29120, -370950, -170299, 49322, -48693, 198449, -38987, 42018, 25581, -108556, -110415, -138346, 26187, -154782, 161691, -122306, 50064, 89070, 137912, -169384, -203008, -86448, -257555, -162583, -92008, -389134, -314619, 19828, 7695, 850, -35976, -85555, 142269, -41428, -283148, -344090, 102171, -62557, -174723, -177122, -228010, 78179, 328205, -64687, -26175, 126397, 37363, -396767, -134169, 7441, 14769, 1461, 31228, 180265, -205537, 44547, 76652, -188752, -427166, 44783, -298328, -15441, -162588, -142021, -59217, -24095, 65330, -142733, 125161, -462647, 121109, -22061, 177165, -160345, -37996, -100471, 46961, -84735, 219769, -145114, -138515, 6688]
9342a43592O4628k47006a57982H3361c72706G4017L9948M4659i7819i949A78561
9330a70708B34411C4767K15294a25937j32025B314L05258a73447e9289C18821
9319I6665c2302I9024L6141m0404c2849B4001J406a9322D41485A13762Q2607I4132
9306a90926H0619R041b70073i9285A07670e26165i8080A33475D2438a39503K0459
9295a19044d2227p0312e533E9302L5159a09261K3195c5151h007A30464N7305a19078
9282f160B0207O3798b06945j09002E5141g0243B04529a18729j16925b6511j6193
9271d2704p4130L0003B20840c61149D1006e68736b62995k01606a72981A57832
9260c5725C6919a75421k37518I5117j1065B4042c25628A20806a38599d2658A53372
$$ y = [-143592, -78964, -325970, -157982, 83361, -372706, 74017, 113965, 158624, -97819, -9949, 178561, -170708, 234411, 34767, 250061, -125937, -257962, 2314, 307572, -173447, -59289, 318821, 96665, -32302, 99024, 135165, 94761, -32849, 24001, 25407, -19322, 441485, 113762, 196369, 94132, -190926, 80619, 89660, -270073, -99285, 107670, -526165, -98080, 133475, 42438, -139503, -119044, -42227, -112539, -5533, 59302, 94461, -109261, -86066, -35151, -8007, 130464, 187769, -119078, -6160, 20207, 84005, -206945, -315947, 55141, -70243, 204529, -118729, -235654, -26511, -42704, -116834, -86831, 220840, -361149, 41006, -568736, -262995, -464601, -172981, 157832, -35725, 36919, -175421, -412939, 95117, 84052, 24042, -325628, 120806, -138599, -42658, 153372]
9248A10368i2692a215A70957a15452O667F5384a58343O2653j21296M4754N7941
9237a14291k52701D1389b99964A31736b512j86766A55068b14867j53971J15167
9227b53671I117N1530a74560O9977I5241c78659B7171a86031j09203A17837c25717
9215b21295A15729B1097b09207l6145a6470l3584A0217J17268B5689b96026A63132
9203c530j49298F8709M8542L7322b85453i0606E0293K7489a06135k77550h0073
9191a19682A5172a01770I0292d1206j73998M9579B61905a42092H2126b52825G7032
9179b14003A28324b38999J9432h5535m63150a00903G8533i1827B85706c81881
9168b6555A4770a56605k0470f097k89552A28220J5401c99368P14a81878J100C7703
$$ y = [110368, -92692, -1215, 170957, -115452, -108785, 65384, -158343, -95690, -216986, -172232, -114291, -366992, 41389, -299964, 131736, -2512, -189278, 155068, -214867, -368838, -253671, 9117, 60647, -174560, -104583, 95241, -378659, 27171, -186031, -295234, 117837, -325717, -221295, 115729, 21097, -209207, -245352, -16470, -50054, 10217, 127485, 25689, -296026, 163132, -3530, -152828, 68709, 117251, 154573, -285453, -90606, 50293, 77782, -106135, -383685, -80073, -119682, 15172, -101770, 90292, -41206, -215204, -165625, 261905, -142092, 82126, -252825, 77032, -214003, 128324, -238999, -219567, -85535, -548685, -100903, 78533, -91827, 285706, -381881, -26555, 14770, -156605, -177075, -6097, -295649, 128220, 143621, -399368, -398654, -181878, -180778, 37703]
9155a375j4620r7893B6915J7438b19382p2296J09878B09101i3111o2497e124A94274
9142F1800c26311A28698J46763A0148b58839N5504J9977K0347F6448r031b4970
9130B7629b59391A00583h8590m8307C84074A9081J18567d07445e8987p2532A4841
9118c8181l153k14857J7674h1176L7455k28339C07916A6577a58208j4853B0409
9106c14051p6719b3856j4465m25391a85395B86119H3605d4597k8623o3915f2836
9094b9550l20031A81922f5058A55652B171J74121b08764a1742H3107c01816B88057
9082g4849A08786b2520H9252c17324C5147P4077L9213a5930k7746j40975C7960
9070a22095l0855h661H3493a75633A05739b56810f3978O529k14599Q4956Q2918
$$ y = [-1375, -15995, -113888, 26915, 44353, -219382, -291678, -181800, 209101, -93111, -155608, -5124, 194274, 61800, -326311, 128698, 275461, 10148, -258839, -203335, -183358, -163011, 66448, 57417, -24970, 27629, -259391, 100583, -88590, -136897, 384074, 19081, 137648, -407445, -58987, -131519, 14841, -38181, -41334, -256191, -238517, -81176, -43721, -272060, 307916, 16577, -158208, -173061, 20409, -314051, -390770, -23856, -38321, -463712, -185395, 286119, 83605, -44597, -73220, -137135, -62836, -29550, -349581, 181922, -65058, 155652, 2171, 176292, -208764, -11742, 83107, -301816, 288057, -74849, 108786, -22520, 89252, -317324, 35147, 109224, 148437, -15930, -43676, -184651, 37960, -122095, -152950, -8661, 83493, -175633, 105739, -256810, -63978, -57449, -272048, -187092, -104174]
9059a04174B6896K44958j31370b40938q843C1699J9933J62075a78408A37985e3744
9047a95822L8631D52386A58091b09659E0178K07372b11776a0032H4886a49411
9036a78744A81254C3188b17520A40965b15896D29204B499J09333k7360c20632
9025b36641P5362h932A06757e6942k24838i9944A54094c79628a34920d0565B830
9013c49798A19591c7041A6967d9143P946m7054L7321A03537J17837a45319A59261
9001B21727b22669F2891J376b63194g6674A92198a37097c3201F8558e9204l906
8990f3110F7504D775K35562b02481I354h3821j8625A99655a16566B23191a90167
8978g523E7740J82512e3681A74824l5809i859k687j90318C9821a39604a6520j23049
$$ y = [-104174, 26896, 271854, 140484, -240938, -249781, 31699, 51632, 213707, -178408, 137985, -53744, -195822, -157191, 452386, 158091, -209659, 50178, 257550, -211776, -10032, 84886, -149411, -178744, 181254, 33188, -217520, 140965, -215896, 429204, 2499, 111832, 84472, -320632, -236641, -161279, -8932, 106757, -56942, -281780, -99944, 154094, -379628, -134920, -40565, 2830, -349798, 119591, -37041, 16967, -49143, -41197, -88251, -50930, 103537, 221374, -145319, 159261, 221727, -222669, 62891, 64267, -263194, -76674, 192198, -137097, -33201, 68558, -59204, -63110, 67504, 4775, 240337, -202481, 9354, -83821, -102446, 199655, -116566, 223191, -190167, -7523, 57740, 240252, -53681, 174824, 139015, -9859, -12546, -202864, 39821, -139604, -16520, -139569]
8966a39569N3815B57138c9989j01001k7871H9017d88465b4287B4494J37318b62415
8954B52079a93768J2839e4769p1063a1530B47614K52825A2151a09287l9353H8070
8942a56292P1386G9080Q2360a90673J402B10070m0326b17605e2350A666c7648
8930A77802e1016b4260j97250A00940J29201a23641B46218d38441c6396C6690
8919E29463N366A61274f2025o3357B48889o2081b5106k858A06936c21881a48716
8907i8808o6195L6626A60374i1663J5807j03039a6778k56795G6610d03544a68486
8895a97912I3348i9473a3230B4500J67775a10939A6988J60402i1131Q425B4027
8883b39528a8r3503A99163n7636m1594a87698N7153G3876j3965c77958b0659A85253
$$ y = [-139569, -85754, 257138, -39989, -140990, -168861, 89017, -488465, -24287, 24494, 161812, -262415, 252079, -193768, -180929, -54769, -125832, -11530, 247614, 500439, 12151, -109287, -148640, 88070, -156292, -84906, 79080, 161440, -190673, -189271, 210070, 169744, -217605, -52350, 1666, -37648, 177802, -51016, -24260, -221510, 100940, 230141, -123641, 246218, -438441, -36396, 36690, 529463, 534829, 161274, -62025, -125382, 248889, 186808, -25106, -27964, 106936, -321881, -148716, -98808, -165003, -128377, 160374, -91663, -75856, -178895, -16778, -273573, 76610, -403544, -168486, -197912, 93348, -99473, -13230, 24500, 192275, -110939, 16988, 177390, -91131, -82706, 24027, -239528, -18, -93521, 199163, 141527, 99933, -187698, -130545, 73876, 59911, -377958, -20659, 185253]
8870g5924H0529b54713a07730I7059O8478b36161j36423i4193H8263e988j44357
8859a50345o5133p4364C46525a03844c3735G5632d1363j69637M5926B15972a57397
8847b07588j39260g2384r8586E857N9140b57839B32620b49469A8209J20796a29058
8835d17797e5781k00277f2124c52j08173q337j47699i2051j39983k4600a7443
8823g9906e419k27976L8576c6688A9920a44483k31112g7140k72284g9403A38887
8811F80J35969a65814j9842C26584A2781b39943J638p6359f6408A08484e00340
$$ y = [-75924, 80529, -254713, -107730, 97059, 165537, -236161, -372584, -94193, 88263, -5988, -150345, -215478, -289842, 346525, -103844, -33735, 75632, -41363, -211000, -165074, 215972, -157397, -207588, -346848, -72384, -170970, 5857, 64997, -257839, 232620, -249469, 18209, 139005, -129058, -417797, -55781, -256058, -62124, -352, -108525, -116862, -264561, -92051, -232034, -256634, -17443, -79906, -5419, -233395, -194819, -36688, 19920, -144483, -375595, -77140, -349424, -79403, 138887, 680, 136649, -165814, -185656, 326584, 12781, -239943, -238305, -314664, -66408, 108484, -500340]
$$ [...]
##END NTUPLES=NMR SPECTRUM
##END=
