##TITLE=AC1751_05000195609115FOTR0001_9275067_Bt7wbmRs15
##JCAMPDX= 6.0         $$ Bruker NMR JCAMP-DX V2.0
##DATA TYPE= NMR SPECTRUM
##DATA CLASS= NTUPLES
##ORIGIN= BRUKER
##OWNER= Administrator
$$ 1.72 TOPSPIN		Version 2.1
$$ 2015-07-18 09:18:10.275 -0700  Administrator@X
$$ Compression mode = diff/dup
##.OBSERVE FREQUENCY= 400.02188249412
##.OBSERVE NUCLEUS= ^1H
##.ACQUISITION MODE= SIMULTANEOUS (DQD)
##.ACQUISITION SCHEME= undefined
##.AVERAGES= 64
##.DIGITISER RES= 22
##SPECTROMETER/DATA SYSTEM= spect
##.PULSE SEQUENCE= noesygpps1d.comp
##.SOLVENT NAME= COFFEE_meoh
##.SHIFT REFERENCE= INTERNAL, COFFEE_meoh, 1, 14.96199
##AUDIT TRAIL= $$ (NUMBER, WHEN, WHO, WHERE, PROCESS, VERSION, WHAT)
$$ ##TITLE= Audit trail, TOPSPIN		Version 2.1
$$ ##JCAMPDX= 5.01
$$ ##ORIGIN= Bruker BioSpin GmbH
$$ ##OWNER= Administrator
$$ $$ E:\/data/COFFEE/nmr/AC1751_05000195609115FOTR0001_9275067_Bt7wbmRs15/12/pdata/1/auditp.txt
$$ ##AUDIT TRAIL=  $$ (NUMBER, WHEN, WHO, WHERE, PROCESS, VERSION, WHAT)
(   1,<2015-07-18 09:18:04.447 -0700>,<Administrator>,<X>,<go>,<TOPSPIN 2.1>,
      <created by zg
	started at 2015-07-18 09:06:34.494 -0700,
	POWCHK enabled, PULCHK disabled,
       configuration hash MD5:
       21 0F 79 D6 B3 7B B4 F6 88 20 88 DB 03 48 BD 9F
       data hash MD5: 64K
       56 21 76 CC 3C 57 F9 56 5F 76 D3 04 FD B8 EA DD>)
(   2,<2015-07-18 09:18:08.088 -0700>,<Administrator>,<X>,<proc1d>,<TOPSPIN 2.1>,
      <Start of raw data processing
       efp LB = 0.3 FT_mod = 6 PKNL = 1 PHC0 = 0 PHC1 = 0 SI = 128K 
       data hash MD5: 128K
       72 4D C6 13 D0 00 3D A0 84 BD CE E8 AC 7E 63 79>)
(   3,<2015-07-18 09:18:08.994 -0700>,<Administrator>,<X>,<proc1d>,<TOPSPIN 2.1>,
      <pk PHC0 = -86.08887 PHC1 = 0 
       data hash MD5: 128K
       23 23 47 51 86 71 C7 A1 92 CC 36 09 73 6C AB 81>)
(   4,<2015-07-18 09:18:09.416 -0700>,<Administrator>,<X>,<proc1d>,<TOPSPIN 2.1>,
      <abs ABSG = 1 
       data hash MD5: 128K
       58 0C A8 1D 6E 49 4C F5 78 57 11 6B 72 BA 3E 26>)
(   5,<2015-07-18 09:18:09.510 -0700>,<Administrator>,<X>,<proc1d>,<TOPSPIN 2.1>,
      <abs ABSG = 2 
       data hash MD5: 128K
       49 AD 9A 69 82 02 11 64 7A B6 78 7F A9 9D D3 DA>)
(   6,<2015-07-18 09:18:09.588 -0700>,<Administrator>,<X>,<proc1d>,<TOPSPIN 2.1>,
      <abs ABSG = 3 
       data hash MD5: 128K
       8A E7 33 B2 CE 58 33 88 CF 44 BE 50 8E 7C 1E 91>)
(   7,<2015-07-18 09:18:09.682 -0700>,<Administrator>,<X>,<proc1d>,<TOPSPIN 2.1>,
      <abs ABSG = 4 
       data hash MD5: 128K
       9B 55 1F 16 F0 DC C5 D8 E6 46 DC 76 41 C8 9D 31>)
(   8,<2015-07-18 09:18:09.807 -0700>,<Administrator>,<X>,<proc1d>,<TOPSPIN 2.1>,
      <abs ABSG = 5 
       data hash MD5: 128K
       7C 33 06 D8 8E 95 3F 82 A7 E7 C7 59 6C 7B 7C 32>)
$$ ##END=
$$ 
$$ $$ hash MD5
$$ $$ 69 A8 A0 D2 75 1D 3C 34 22 70 AC 0C B8 61 9F A2
##$RELAX= 
##$RELAX= 
##$RELAX= 
##$RELAX= 
##$RELAX= 
##$RELAX= 
##$RELAX= 
##$RELAX= 
$$ Bruker specific parameters
$$ --------------------------
##$DU= <E:\>
$$ [...]
##$TP07= 0
##$TPNAME0= <>
##$TPNAME1= <>
##$TPNAME2= <>
##$TPNAME3= <>
##$TPNAME4= <>
##$TPNAME5= <>
##$TPNAME6= <>
##$TPNAME7= <>
##$TPOAL= (0..7)
0.5 0.5 0.5 0.5 0.5 0.5 0.5 0.5
##$TPOFFS= (0..7)
0 0 0 0 0 0 0 0
##$TUNHIN= 0
##$TUNHOUT= 0
##$TUNXOUT= 0
##$USERA1= <user>
##$USERA2= <user>
##$USERA3= <user>
##$USERA4= <user>
##$USERA5= <user>
##$V9= 5
##$VALIST= <valist>
##$VCLIST= <CCCCCCCCCCCCCCC>
##$VD= 0
##$VDLIST= <DDDDDDDDDDDDDDD>
##$VPLIST= <PPPPPPPPPPPPPPP>
##$VTLIST= <TTTTTTTTTTTTTTT>
##$WBST= 2048
##$WBSW= 25
##$XGAIN= (0..3)
0 0 0 0
##$XL= 0
##$YL= 0
##$YMAX_a= 6844613
##$YMIN_a= -17151161
##$ZGOPTNS= <>
##$ZL1= 120
##$ZL2= 120
##$ZL3= 120
##$ZL4= 120
##$ABSF1= 14.96199
##$ABSF2= -5.596191
##$ABSG= 5
##$ABSL= 3
##$ALPHA= 0
##$AQORDER= 0
##$ASSFAC= 0
##$ASSFACI= 0
##$ASSFACX= 0
##$ASSWID= 0
##$AUNMP= <proc_prof1d_extract.lims>
##$AXLEFT= 0
##$AXNAME= <>
##$AXNUC= <1H>
##$AXRIGHT= 0
##$AXTYPE= 0
##$AXUNIT= <>
##$AZFE= 0.1
##$AZFW= 0.1
##$BCFW= 0
##$BC_mod= 0
##$BYTORDP= 0
##$COROFFS= 0
##$CY= 15
##$DATMOD= 1
##$DC= 0
##$DFILT= <>
##$DTYPP= 0
##$F1P= 0
##$F2P= 0
##$FCOR= 0.5
##$FTSIZE= 131072
##$FT_mod= 6
##$GAMMA= 0
##$GB= 0
##$INTBC= 1
##$INTSCL= 1
##$ISEN= 128
##$LB= 0.3
##$LEV0= 0
##$LPBIN= 0
##$MAXI= 10000
##$MC2= 0
##$MEAN= 0
##$ME_mod= 0
##$MI= 0
##$NCOEF= 0
##$NC_proc= -2
##$NLEV= 6
##$NOISF1= 0
##$NOISF2= 0
##$NSP= 0
##$NTH_PI= 0
##$NZP= 0
##$OFFSET= 14.96199
##$PC= 1
##$PHC0= -86.08887
##$PHC1= 0
##$PH_mod= 1
##$PKNL= yes
##$PPARMOD= 0
##$PPDIAG= 0
##$PPIPTYP= 0
##$PPMPNUM= 2147483647
##$PPRESOL= 1
##$PSCAL= 4
##$PSIGN= 0
##$PYNMP= <proc.py>
##$REVERSE= no
##$SF= 400.020009242147
##$SI= 131072
##$SIGF1= 0
##$SIGF2= 0
##$SINO= 400
##$SIOLD= 131072
##$SPECTYP= <>
##$SREGLST= <1H.CDCl3>
##$SSB= 0
##$STSI= 131072
##$STSR= 0
##$SW_p= 8223.68421052631
##$SYMM= 0
##$S_DEV= 0
##$TDeff= 65536
##$TDoff= 0
##$TI= <>
##$TILT= no
##$TM1= 0
##$TM2= 0
##$TOPLEV= 0
##$USERP1= <user>
##$USERP2= <user>
##$USERP3= <user>
##$USERP4= <user>
##$USERP5= <user>
##$WDW= 1
##$XDIM= 131072
##$YMAX_p= 438925162
##$YMIN_p= -11794
##$CURPLOT= <Network HP LaserJet P1505>
##$CURPRIN= <$Network HP LaserJet P1505>
##$DFORMAT= <normdp>
##$LAYOUT= <+/1D_H.xwp>
##$LFORMAT= <normlp>
##$PFORMAT= <normpl>
##$SURQMSG= 1
$$ End of Bruker specific parameters
$$ ---------------------------------
##NTUPLES= NMR SPECTRUM
##VAR_NAME=  FREQUENCY,     SPECTRUM/REAL,   SPECTRUM/IMAG
##SYMBOL=    X,             R,               I
##VAR_TYPE=  INDEPENDENT,   DEPENDENT,       DEPENDENT
##VAR_FORM=  AFFN,          ASDF,            ASDF
##VAR_DIM=   131072,        131072,          131072
##UNITS=     HZ,            ARBITRARY UNITS, ARBITRARY UNITS
##FACTOR=    0.0627417313425164, 1,          1
##FIRST=     8223.62146879497, 1845,         -48643
##LAST=      0,             2887,            -48136
##MIN=       0,             -11794,          0
##MAX=       8223.62146879497, 438925162,    0
$$ Real data points
##PAGE= N=1
##DATA TABLE= (X++(R..R)), XYDATA
$$ [...]
60975C2225400M65876L02191j84605q98308j639799k216811k534978k608034k505977
60966B0404955k301480k048267j782136j525274j289204j079199q98011p45740
60958H735644o19010n13407m26644l57949l05208k64422k31702k04441j81030
60949E631831j60905j44606j32381j22812j13907j05099r7015q9727q2781p6641
60939D505957p2380o9845o7607o4913o2249n9804n6807n2770m8129m3236l7873
60928C870344l2142k6654k1573j6593j2153r435q626q430p887p609q597j0767
60916C699878j3329j5658j7269j7692j7027j5848j4244j1778q736o436n754o242
60904C549865p128q257r449r895q904o605l500o0K891M503N117O163Q252J0307
$$ y = [32225400, 32691276, 32993467, 32808862, 31910554, 30270755, 28053944, 25518966, 22910932, 20404955, 18103475, 16055208, 14273072, 12747798, 11458594, 10379395, 9481384, 8735644, 8116634, 7603227, 7176583, 6818634, 6513426, 6249004, 6017302, 5812861, 5631831, 5470926, 5326320, 5193939, 5071127, 4957220, 4852121, 4755106, 4665379, 4582598, 4505957, 4433577, 4363732, 4296125, 4231212, 4168963, 4109159, 4052352, 3999582, 3951453, 3908217, 3870344, 3838202, 3811548, 3789975, 3773382, 3761229, 3751794, 3743168, 3734738, 3726851, 3719242, 3710645, 3699878, 3686549, 3670891, 3653622, 3635930, 3618903, 3603055, 3588811, 3577033, 3568297, 3561861, 3556107, 3549865, 3542737, 3534480, 3525031, 3515136, 3506232, 3499627, 3496127, 3496067, 3498958, 3503461, 3508578, 3514741, 3522993, 3533300]
60890C533300J1231J1352J1471J1636J1811J2787J5239J8583K1843K5156K9288
60879C713697L4094L8355M0959M1461L9761L5933L0306K3297J5427P685J322l021
60867D019276n465o045m589j734J055L082N120P825J0506J2249J3307J4350J5125
60854D084062J4983J4044J2796J1066Q389M999J495k037n800r587j3166j6885
60842D104359k1111k5554k9865l4285l8743m2023m2974m2100m0833l9559l7505
60831C709807l4418l1163k8581k6679k4996k3126k0917j8744j7489j7653j8610
60820C447431j9257j9177j8733j8382j8411j8938j9628j9816j9354j8793j8265
60809C238677j7051j4866j2667j1243r955q015o092n244m909l679j620j82R0L9
$$ y = [3533300, 3544531, 3555883, 3567354, 3578990, 3590801, 3603588, 3618827, 3637410, 3659253, 3684409, 3713697, 3747791, 3786146, 3827105, 3868566, 3908327, 3944260, 3974566, 3997863, 4013290, 4020975, 4022297, 4019276, 4013811, 4007766, 4003177, 4001443, 4002498, 4005580, 4010700, 4018525, 4029031, 4041280, 4054587, 4068937, 4084062, 4099045, 4113089, 4125885, 4136951, 4145340, 4150339, 4151834, 4149797, 4143997, 4134410, 4121244, 4104359, 4083248, 4057694, 4027829, 3993544, 3954801, 3912778, 3869804, 3827704, 3786871, 3747312, 3709807, 3675389, 3644226, 3615645, 3588966, 3563970, 3540844, 3519927, 3501183, 3483694, 3466041, 3447431, 3428174, 3408997, 3390264, 3371882, 3353471, 3334533, 3314905, 3295089, 3275735, 3256942, 3238677, 3221626, 3206760, 3194093, 3182850, 3172895, 3164880, 3158788, 3153544, 3148635, 3144956, 3143336, 3143154, 3143244, 3143283]
60795C143283K5p82k814n271p434r578j1959j3879j4593j4415j4250j4557j5191
60782C018585j5817j6059j5610j4517j3009j1001q235m995k108K1J868M085O788
60769B929996R748J2766J5580J7797J9258K0316K1480K2805K3722K3407K1425
60758C138300J8046J3852R104L735j905o820j0128j1748j2105j1615j0720r922
60746C108074r371q775q096p850q395r401j0362j1031j1059r945p958o312n742
60733B993777n536m756l634k926k539j874r56j79O82K126L948N621P356R692J2357
60718C013159J4605J6456J8485K0595K2123K3063K4035K4988K5108K4139K2824
60707C249580K1769K0731J9231J7237J5180J3870J4333J6997K1186K6026L1524
$$ y = [3143283, 3143308, 3142526, 3139712, 3134441, 3127007, 3117429, 3105470, 3091591, 3076998, 3062583, 3048333, 3033776, 3018585, 3002768, 2986709, 2971099, 2956582, 2943573, 2932572, 2924337, 2919342, 2917234, 2917255, 2919123, 2923208, 2929996, 2939744, 2952510, 2968090, 2985887, 3005145, 3025461, 3046941, 3069746, 3093468, 3116875, 3138300, 3156346, 3170198, 3179302, 3183037, 3181132, 3174312, 3164184, 3152436, 3140331, 3128716, 3117996, 3108074, 3098703, 3089928, 3081832, 3073982, 3065587, 3056186, 3045824, 3034793, 3023734, 3013789, 3005831, 2999519, 2993777, 2988241, 2983485, 2979851, 2976925, 2974386, 2972512, 2971556, 2971377, 2972059, 2974185, 2978133, 2983754, 2991110, 3000802, 3013159, 3027764, 3044220, 3062705, 3083300, 3105423, 3128486, 3152521, 3177509, 3202617, 3226756, 3249580, 3271349, 3292080, 3311311, 3328548, 3343728, 3357598, 3371931, 3388928, 3410114, 3436140, 3467664]
60696C467664L8045M5021N1207N5863N8624N8471N4130M5527L3881K0516O703
60685C935652n581j4389j9538k2378k3531k2283j8536j3899j0079p376n542n075
60673C767445o607r704j3184j6249j8629k0079k0368j9496j7452j4108r713n102
60661C596754r39K940P061J1347J5020J7328J8245J8567J9342K1250K4476K9128
60649C780519L5316M2636N0167N7466O4981P2861P9878Q4151Q4530Q0394P0856
60638D503755N5462L5593J4014o999k6128m1938n2747n7924n8304n5106m9330
60627D260348m2292l5593l0150k5994k3233k2352k3344k5436k7989l0969l4387
60616C938609l7983m1673m5517m9155n1920n3570n4186n3503n1247m7988m4547
$$ y = [3467664, 3505709, 3550730, 3601937, 3657800, 3716424, 3774895, 3829025, 3874552, 3908433, 3928949, 3935652, 3930071, 3915682, 3896144, 3873766, 3850235, 3827952, 3809416, 3795517, 3785438, 3778062, 3772520, 3767445, 3760838, 3751134, 3737950, 3721701, 3703072, 3682993, 3662625, 3643129, 3625677, 3611569, 3601856, 3596754, 3595815, 3598755, 3605816, 3617163, 3632183, 3649511, 3667756, 3686323, 3705665, 3726915, 3751391, 3780519, 3815835, 3858471, 3908638, 3966104, 4031085, 4103946, 4183824, 4267975, 4352505, 4432899, 4503755, 4559217, 4594810, 4608824, 4601825, 4575697, 4533759, 4481012, 4423088, 4364784, 4309678, 4260348, 4218056, 4182463, 4152313, 4126319, 4103086, 4080734, 4057390, 4031954, 4003965, 3972996, 3938609, 3900626, 3858953, 3813436, 3764281, 3712361, 3658791, 3604605, 3551102, 3499855, 3451867, 3407320]
60605C407320m0685l5573k9536k4073j9870j6127j2158q393n403l177j763j414
60593C209148j546q51J054L168M859O784R439J2119J4206J6294J9047K1912K3918
60580C339551K4894K5023K4060K2013J9755J7988J6319J4247J2321J1294J0925
60569C538390J0649J0780J1793J3062J3561J3417J3431J3272J1463P385K193k481
60557C656915n966q489j0357j1657j2362j2529j2438j2452j2526j2080j0599q170
60545C527290n131j509K886Q037J3720J9740K6007L2505L9297M6109N1805N4775
60533C815531N4143N0146M3232L3440K1129P623n431j6954k6278l2604l5389l4998
60521C873590l2448k8566k3745j8177j1987n283J567P882J3142J7360K0768K3382
$$ y = [3407320, 3366635, 3331062, 3301526, 3277453, 3257583, 3241456, 3229298, 3220905, 3215502, 3212325, 3210562, 3209148, 3207602, 3206751, 3207805, 3210973, 3215832, 3222616, 3232055, 3244174, 3258380, 3274674, 3293721, 3315633, 3339551, 3364445, 3389468, 3413528, 3435541, 3455296, 3473284, 3489603, 3503850, 3516171, 3527465, 3538390, 3549039, 3559819, 3571612, 3584674, 3598235, 3611652, 3625083, 3638355, 3649818, 3657203, 3659396, 3656915, 3650949, 3642460, 3632103, 3620446, 3608084, 3595555, 3583117, 3570665, 3558139, 3546059, 3535460, 3527290, 3522159, 3520650, 3523536, 3531573, 3545293, 3565033, 3591040, 3623545, 3662842, 3708951, 3760756, 3815531, 3869674, 3919820, 3963052, 3996492, 4017621, 4025244, 4019813, 4002859, 3976581, 3943977, 3908588, 3873590, 3841142, 3812576, 3788831, 3770654, 3758667, 3753384, 3754951, 3762833, 3775975, 3793335, 3814103, 3837485]
60509C837485K5033K5592K5025K3463K1348J9204J7369J6172J6196J7815K0565
60498D065267K3650K6992L1149L6154M1314M6157N0775N5144N8957O2254O5147
60487D562960O6632O4787N8694M9230L7427K3097N869j3225l2170m9445o4274
60476D709582p5880q3473q6938q7052q4986q1694p7429p1730o4314n6030m8278
60465C891778m1479l4937k8391k2638j8230j4527j0709o839l278J71L809P406
60453C722136J0698J3906J7084J9562K0769K1093K1255K1300K0820J9728J8255
60442C926606J6579J4916J3627J2835J2429J2601J3646J5006J5433J4470J2880
60431D081028J1064Q242L834j333o117j0416j4466j7619j8897j8187j6002j2643
$$ y = [3837485, 3862518, 3888110, 3913135, 3936598, 3957946, 3977150, 3994519, 4010691, 4026887, 4044702, 4065267, 4088917, 4115909, 4147058, 4183212, 4224526, 4270683, 4321458, 4376602, 4435559, 4497813, 4562960, 4629592, 4694379, 4753073, 4802303, 4839730, 4862827, 4868696, 4855471, 4823301, 4773856, 4709582, 4633702, 4550229, 4463291, 4376239, 4291253, 4209559, 4132130, 4060400, 3996086, 3940056, 3891778, 3850299, 3815362, 3786971, 3764333, 3746103, 3731576, 3720867, 3714028, 3710750, 3710921, 3714730, 3722136, 3732834, 3746740, 3763824, 3783386, 3804155, 3825248, 3846503, 3867803, 3888623, 3908351, 3926606, 3943185, 3958101, 3971728, 3984563, 3996992, 4009593, 4023239, 4038245, 4053678, 4068148, 4081028, 4092092, 4100334, 4104168, 4102835, 4096718, 4086302, 4071836, 4054217, 4035320, 4017133, 4001131, 3988488]
60419C988488q469m314o49L031O983J0194J1739J2667J5204K0305K7169L4923
60407D117271M3543N3143O3510P4697Q7193J01129J15686J29483J41302J50469
60397E077426J56640J59000J55748J44998J26504J01965P3587M3227J3215j3320
60387F038990l4035m8615n7691o1381n9757n4036m6174l7700k9756k3573j9928
60376E566344j8470j8431j9573k1672k3635k4062k2309j8446j2745n887J100P756
60364E389970J4190J9398K0761J6285O471p068k3520m1859n9207p2331q0340q4240
60352E098510q4458q0896p5026o9559o5690o2465n9136n6375n4629n2982n0459
60341D386835m7224m3878m0589l7447l4662l1929k8492k4276k0175j6881j4205
$$ y = [3988488, 3980019, 3975705, 3975056, 3978087, 3985070, 3995264, 4007003, 4019670, 4034874, 4055179, 4082348, 4117271, 4160814, 4213957, 4277467, 4352164, 4439357, 4540486, 4656172, 4785655, 4926957, 5077426, 5234066, 5393066, 5548814, 5693812, 5820316, 5922281, 5995868, 6039095, 6052310, 6038990, 6004955, 5956340, 5898649, 5837268, 5777511, 5723475, 5677301, 5639601, 5609845, 5586272, 5566344, 5547874, 5529443, 5509870, 5488198, 5464563, 5440501, 5418192, 5399746, 5387001, 5381114, 5382214, 5389970, 5404160, 5423558, 5444319, 5460604, 5467075, 5460007, 5436487, 5394628, 5335421, 5263090, 5182750, 5098510, 5014052, 4933156, 4858130, 4788571, 4722881, 4660416, 4601280, 4544905, 4490276, 4437294, 4386835, 4339611, 4295733, 4255144, 4217697, 4183035, 4151106, 4122614, 4098338, 4078163, 4061282, 4047077]
60330D047077j1775r561p494n354l293j741o79L05J201J753K304L479M942N578
60316D026742N161M665M632M347L179J684P10J73n05j274j465o69Q20K239K872
60301D053311K729K804M251P070R946J1431J0992R031O287L257k05m598r708j4068
60287D092530j6087j5547j3459j0745p699m459j165K321O189J0117J3476J5926
60275D071398J7282J7150J5382J2640R735O842L984J916J442K186L029L558M151
60262D170695M925N698O731Q364J0035J0867J1118J1913J3535J5221J6595J8056
60250D303753J9616K0612K0773K0488J9884J8725J7336J6420J5857J5009J4312
60239D502785J5123J7646K0541K3031K5969L0023L4333L7882M1104M5030M9754
$$ y = [4047077, 4035302, 4025741, 4018247, 4012893, 4009600, 4007859, 4007180, 4007485, 4008686, 4010439, 4012743, 4016222, 4021164, 4026742, 4031903, 4036568, 4041200, 4045547, 4048726, 4050410, 4051120, 4051293, 4050788, 4049514, 4048049, 4047380, 4048200, 4050439, 4053311, 4056040, 4058844, 4063095, 4070165, 4080111, 4091542, 4102534, 4111565, 4117852, 4121109, 4120904, 4116306, 4106598, 4092530, 4076443, 4060896, 4047437, 4036692, 4028993, 4024534, 4023369, 4025690, 4031879, 4041996, 4055472, 4071398, 4088680, 4105830, 4121212, 4133852, 4143587, 4150429, 4154413, 4156329, 4157771, 4159957, 4162986, 4166544, 4170695, 4175620, 4181318, 4188049, 4196413, 4206448, 4217315, 4228433, 4240346, 4253881, 4269102, 4285697, 4303753, 4323369, 4343981, 4364754, 4385242, 4405126, 4423851, 4441187, 4457607, 4473464, 4488473, 4502785, 4517908, 4535554, 4556095, 4579126, 4605095, 4635118, 4669451, 4707333, 4748437, 4793467, 4843221]
60228D843221N4808O0212O6088P1719P6046P8874Q0959Q3167Q6060Q9885R4425
60217E685464R9041J03257J07156J11164J15896J22166J30543J40614J51271J61700
60207F928272J71284J78476J80838J76787J66677J51942J33985J14226R4248P5096
60197H371831N6964L9947K4477J0631k193j4367k5429l4865m2829m9493n4274
60186H280400n6463n6188n4279n1447m7948m3593l7796l0152k1541j4172j0061
60175G856760r824j3310k0804l2902m9389o8857q9334j08927j26024j39337j48039
60164G050013j51922j51548j48017j42268j34496j24469j12270r8504q3915o9146
60154E833458n4683m0708k7168j4423l481M792J0308J3227J3311J0568N957O15
$$ y = [4843221, 4898029, 4958241, 5024329, 5096048, 5172094, 5250968, 5331927, 5415094, 5501154, 5591039, 5685464, 5784505, 5887762, 5994918, 6106082, 6221978, 6344144, 6474687, 6615301, 6766572, 6928272, 7099556, 7278032, 7458870, 7635657, 7802334, 7954276, 8088261, 8202487, 8296735, 8371831, 8428795, 8468742, 8493219, 8503850, 8501657, 8487290, 8461861, 8426996, 8384167, 8334674, 8280400, 8223937, 8167749, 8113470, 8062023, 8014075, 7970482, 7932686, 7902534, 7880993, 7866821, 7856760, 7846936, 7833626, 7812822, 7779920, 7730531, 7661674, 7572340, 7463413, 7337389, 7198052, 7050013, 6898091, 6746543, 6598526, 6456258, 6321762, 6197293, 6085023, 5986519, 5902604, 5833458, 5778775, 5738067, 5710899, 5696476, 5692995, 5697787, 5708095, 5721322, 5734633, 5745201, 5751158, 5751773]
60142E751773n146j1140j6255j9329k0857k2528k5306k8979l3274l7956m2190
60131E488813m5320m8254n2396n7217o0586o1680o1693o1313n9460n5259m9475
60120D876160m3057l5878k8045k0923j5568j1226o531j215M392J0444J6989K3285
60108D768827K8772L3845L8564M1623M1969M0512L8735L6149L0687K1488R926
60097E131097k121j3839k5083l5289m3212m7643m8381m6657m4183m1613l8405
60086D744671l4426l0768k8420k6901k5002k2527k0512j9963k0952k2667k4072
60075D468461k4754k5267k6186k6802k5526k1795j6646j1189n477O18O583J2011
60063D304031J7251K2510K7106L0506L3379L6716M0519M4046M6766M8399M8559
$$ y = [5751773, 5746627, 5735487, 5719232, 5699903, 5679046, 5656518, 5631212, 5602233, 5568959, 5531003, 5488813, 5443493, 5395239, 5342843, 5285626, 5225040, 5163360, 5101667, 5040354, 4980894, 4925635, 4876160, 4833103, 4797225, 4769180, 4748257, 4732689, 4721463, 4714932, 4713717, 4718109, 4728553, 4745542, 4768827, 4797599, 4831444, 4870008, 4911631, 4953600, 4994112, 5032847, 5068996, 5099683, 5121171, 5131097, 5128976, 5115137, 5090054, 5054765, 5011553, 4963910, 4915529, 4868872, 4824689, 4783076, 4744671, 4710245, 4679477, 4651057, 4624156, 4599154, 4576627, 4556115, 4536152, 4515200, 4492533, 4468461, 4443707, 4418440, 4392254, 4365452, 4339926, 4318131, 4301485, 4290296, 4284819, 4285437, 4292020, 4304031, 4321282, 4343792, 4370898, 4401404, 4434783, 4471499, 4512018, 4556064, 4602830, 4651229, 4699788]
60052D699788M7119M4402M0420L4578K6663J7469P869j874j1309j9283k5113k9405
60040D831324l2742l4441l3688l1074k7792k3893j8615j2089n479L96N478R586
60028D626971J1948J1713Q466K494m912j1912j7430k1625k4642k5755k4544k2082
60016D508690j9852j8044j6053j4102j3057j2817j2200j0492q188o055m267k623
60004D370940r82O12J898K525K504K300K141J653O17m57r63r82q53m72M69K028
59988D382978M306P577J1671J5862J9939K4691L0670L7355M4329N2326O2033P2605
59976D766342Q2476R0959R7816J01825J01209R5250Q4396O9167N0219K9215Q357
59965E577231j0985k8234m2542n3041n9991o4478o6846o6573o3658n8976n3000
$$ y = [4699788, 4746907, 4791309, 4831729, 4866307, 4892970, 4910439, 4918308, 4916434, 4905125, 4885842, 4860729, 4831324, 4798582, 4764141, 4730453, 4699379, 4671587, 4647694, 4629079, 4616990, 4611511, 4611907, 4617385, 4626971, 4638919, 4650632, 4659098, 4661592, 4656680, 4644768, 4627338, 4605713, 4581071, 4555316, 4530772, 4508690, 4488838, 4470794, 4454741, 4440639, 4427582, 4414765, 4402565, 4392073, 4383885, 4377830, 4373563, 4370940, 4369958, 4370570, 4372468, 4374993, 4377497, 4379797, 4381938, 4383591, 4384208, 4383751, 4382788, 4381806, 4380953, 4380481, 4380950, 4382978, 4387284, 4394861, 4406532, 4422394, 4442333, 4467024, 4497694, 4535049, 4579378, 4631704, 4693737, 4766342, 4848818, 4939777, 5037593, 5139418, 5240627, 5335877, 5420273, 5489440, 5539659, 5568874, 5577231, 5566246, 5538012, 5495470, 5442429, 5382438, 5317960, 5251114, 5184541, 5120883, 5061907, 5008907]
59954E008907m5302l5655k4731j3328j591J0649K3360L6355M9393O2139P4382
59943E144578Q6263R7860J08726J18302J26610J33815J39286J41623J39568J32383
59933F369014J19641J01413P8633N2860K5734q88k4900m4837o0538p2319p9843
59922F463970q2644q1396p7595p2142o5232n7595n0688m5386m1359l8062l5631
59911E816240l4335l3738l2854l1008k8285k5297k2523j9832j6636j2479p193
59900E552060n34P840J7765K8395L8899M8819N7578O4342O8740P1055P1388O9476
59888F095823O5719O1340N6780N0906M2818L3610K5374J9314J6052J6937K3383
59877F508056L5040M9701O4733P7264Q3331P8597O0888L1648m826m2882p6691
$$ y = [5008907, 4963605, 4927950, 4903219, 4889891, 4888300, 4898949, 4922309, 4958664, 5008057, 5070196, 5144578, 5230841, 5328701, 5437427, 5555729, 5682339, 5816154, 5955440, 6097063, 6236631, 6369014, 6488655, 6590068, 6668701, 6721561, 6747295, 6746407, 6721507, 6676670, 6616132, 6543813, 6463970, 6381326, 6299930, 6222335, 6150193, 6084961, 6027366, 5976678, 5931292, 5889933, 5851871, 5816240, 5781905, 5748167, 5715313, 5684305, 5656020, 5630723, 5608200, 5588368, 5571732, 5559253, 5552060, 5551526, 5559366, 5577131, 5605526, 5644425, 5693244, 5750822, 5815164, 5883904, 5954959, 6026347, 6095823, 6161542, 6222882, 6279662, 6330568, 6373386, 6406996, 6432370, 6451684, 6467736, 6484673, 6508056, 6543096, 6592797, 6657530, 6734794, 6818125, 6896722, 6957610, 6989258, 6984432, 6941550, 6864859]
59866F864859j01676j15937j20357j17366j09585r9036q6829p3548o0100m7561
59856E932864l5966k4099j1165K163J5130K8333M2780N8364P4438R1067J08189
59845F282098J24306J37653J48444J58524J69150J80713J94445K12291K34417
59836G842041K58057K79155K94030K99107K90706K66443K26862J75539J17920
59827A0049860N9908O508l8932p4513r9373j13919j19943j19914j16469j12795
59817I320418j12279j16437j23521j30199j34261j35098j32676j27728j22339
59808H185880j18581j16493j14687j12715j11453j11260j11286j10664j09099
59799G169642j06170j01447r5473q9466q3907p8412p2882o7423o1152n2459m0698
$$ y = [6864859, 6763183, 6647246, 6526889, 6409523, 6299938, 6200902, 6114073, 6040525, 5980425, 5932864, 5896898, 5872799, 5861634, 5863797, 5878927, 5907260, 5950040, 6008404, 6082842, 6173909, 6282098, 6406404, 6544057, 6692501, 6851025, 7020175, 7200888, 7395333, 7607624, 7842041, 8100098, 8379253, 8673283, 8972390, 9263096, 9529539, 9756401, 9931940, 10049860, 10109768, 10116276, 10077344, 10002831, 9903458, 9789539, 9669596, 9549682, 9433213, 9320418, 9208139, 9091702, 8968181, 8837982, 8703721, 8568623, 8435947, 8308219, 8185880, 8067299, 7950806, 7836119, 7723404, 7611951, 7500691, 7389405, 7278741, 7169642, 7063472, 6962025, 6866552, 6777086, 6693179, 6614767, 6541885, 6474462, 6413310, 6360851, 6320153]
59788F320153k6478j0207Q336K8742M9588O9738Q8944J06776J21907J32855J38750
59777G029104J39278J34799J26580J16145J04422R2223Q0905P1240O1758M9621
59767H006075L3130J2425j1671l7530o1493p8875q7068q6551p8609o3781m3089
59756G502963j9119N392K9078N1293P0669Q5061R2404R1358Q1880O5421M3887
59745H100287J8254j1077m2658p3739j01697j24897j42421j54273j61905j67156
59735G138718j70390j70780j68475j65006j61351j56956j51107j44057j36392
59726E714204j28369j20224j12075j03415r3766q3942p5327o7876o0299n2282
59716D816629m4874l8293l1196k2703j3649n057L223J1630J9942K7952L5828M3237
$$ y = [6320153, 6293675, 6283468, 6291804, 6320546, 6370134, 6439872, 6528816, 6635592, 6757499, 6890354, 7029104, 7168382, 7303181, 7429761, 7545906, 7650328, 7742551, 7823456, 7894696, 7956454, 8006075, 8039205, 8051630, 8039959, 8002429, 7940936, 7862061, 7774993, 7688442, 7609833, 7546052, 7502963, 7483844, 7489236, 7518314, 7569607, 7640276, 7725337, 7817741, 7909099, 7990979, 8056400, 8100287, 8118541, 8107464, 8064806, 7991067, 7889370, 7764473, 7622052, 7467779, 7305874, 7138718, 6968328, 6797548, 6629073, 6464067, 6302716, 6145760, 5994653, 5850596, 5714204, 5585835, 5465611, 5353536, 5250121, 5156355, 5072413, 4997086, 4929210, 4868911, 4816629, 4771755, 4733462, 4702266, 4679563, 4665914, 4660857, 4664080, 4675710, 4695652, 4723604, 4759432, 4802669]
59704D802669M9284N3933N8214O2590O6479O9845P3618P7797Q0737Q1453Q1179
59693E557798Q1708Q3366Q5610Q8235R0780R1847R0188Q5763P8919O9710N9044
59682F462968M9306M2535L8595L5975L3465L0111K4685J6571O720l287j2594k0707
59670F704343k6663k9662l0135k9355k8338k7689k7939k9303l1538l4454l7995
59659F371272m1527m3871m4426m3510m1297l7423l2041k6176k0483j4739r103
59648F016676m741k561k293l403n800r026j2119j5135j9641k6731l5565m4686
59636E834975n3727o2676p0471p5492p6869p4500o8547n9738m9515l9055k8663
59625E175722j8480r000m84P082J3032J6169J6389J4926J2490Q611L466j227m213
$$ y = [4802669, 4851953, 4905886, 4964100, 5026690, 5093169, 5163014, 5236632, 5314429, 5395166, 5476619, 5557798, 5639506, 5722872, 5808482, 5896717, 5987497, 6079344, 6169532, 6255295, 6334214, 6403924, 6462968, 6512274, 6554809, 6593404, 6629379, 6662844, 6692955, 6717640, 6734211, 6740931, 6737644, 6725050, 6704343, 6677680, 6648018, 6617883, 6588528, 6560190, 6532501, 6504562, 6475259, 6443721, 6409267, 6371272, 6329745, 6285874, 6241448, 6197938, 6156641, 6119218, 6087177, 6061001, 6040518, 6025779, 6016676, 6011935, 6009374, 6007081, 6003678, 5997878, 5988852, 5976733, 5961598, 5941957, 5915226, 5879661, 5834975, 5781248, 5718572, 5648101, 5572609, 5495740, 5421240, 5352693, 5292955, 5243440, 5204385, 5175722, 5157242, 5148242, 5147758, 5154840, 5167872, 5184041, 5200430, 5215356, 5227846, 5236457, 5239923, 5238696, 5234483]
59612E234483o137p928r166r308r162r677j0394j0427r928r221p552m308o49J639
59598E132265K308K369K224J402l38k769n626q395j0143j0412r603p950n089j405
59584E078838J448K409K193J582j68l898q748j3341j7646k2119k5901k7578k7010
59571D940061k4883k1116j5296q113q20O271J3451K0366K6458L1965L7167M1115
59559E046626M2561M1605L9205L5752L1433K7160K3589J9853J4803Q995L952K07
59547E335741k402l205j329K521O744J0960J5782K0707K3956K4167K0695J2658
59535E466995j15j5060k7790l5736l9774m2246m4734m7953n2135n6701o0485o2706
59523D981560o3183o1676n8054n3029m7727m2445l6650l0202k3668j7484j1700
$$ y = [5234483, 5228346, 5220418, 5211252, 5201944, 5192782, 5183105, 5172711, 5162284, 5152356, 5143135, 5135583, 5131275, 5130626, 5132265, 5134573, 5136942, 5139166, 5140568, 5140230, 5137461, 5131835, 5123440, 5113297, 5102885, 5093282, 5085332, 5080243, 5078838, 5080286, 5082695, 5084888, 5086470, 5086302, 5082404, 5073656, 5060315, 5042669, 5020550, 4994649, 4967071, 4940061, 4915178, 4894062, 4878766, 4870653, 4869833, 4876104, 4889555, 4909921, 4936379, 4968344, 5005511, 5046626, 5089187, 5130792, 5169997, 5205749, 5237182, 5264342, 5287931, 5307784, 5322587, 5331582, 5335534, 5335741, 5333339, 5330134, 5328805, 5331326, 5338070, 5349030, 5364812, 5385519, 5409475, 5433642, 5454337, 5466995, 5466880, 5451820, 5424030, 5388294, 5348520, 5306274, 5261540, 5213587, 5161452, 5104751, 5044266, 4981560, 4918377, 4856701, 4798647, 4745618, 4697891, 4655446, 4618796, 4588594, 4564926, 4547442, 4535742]
59512D535742o474j950K167O118R275J0671J0219Q716O934N342M257L485K281
59499D596783M69r59j144n09L27J927N068R181J3193J7274K2252K7834L2986L7760
59485D762442M3049M8684N3408N6761N9630O2668O5433O7168O7514O6400O4200
59474E417357O1877O0148N8722N7128N5683N4561N2503M7874M0667L2152K2849
59463E961521J2302P55j0352j9609k6427l0628l2299l1817k9265k4095j6365p893
59451E745828j311J605Q5o086j5851k6576l5840m2977m7894m9590m7407m2706
59439E431280l7462l1938k5586j9272j4433j0641o202r57L636O862R180J0568
59427E315035J0528R562Q701P770O117M708N402Q453J2876J8862K7509L8621N1116
$$ y = [4535742, 4529268, 4527318, 4529485, 4535603, 4544878, 4555549, 4565768, 4574484, 4581418, 4586760, 4591017, 4594502, 4596783, 4597252, 4596293, 4595149, 4594640, 4594967, 4596894, 4601962, 4611143, 4624336, 4641610, 4663862, 4691696, 4724682, 4762442, 4805491, 4854175, 4907583, 4964344, 5023974, 5086642, 5152075, 5219243, 5286757, 5353157, 5417357, 5479234, 5539382, 5598104, 5655232, 5710915, 5765476, 5817979, 5865853, 5906520, 5938672, 5961521, 5973823, 5974578, 5964226, 5944617, 5918190, 5887562, 5855263, 5823446, 5794181, 5770086, 5753721, 5745828, 5744517, 5746122, 5746207, 5740121, 5724270, 5697694, 5661854, 5618877, 5570983, 5521393, 5473986, 5431280, 5393818, 5361880, 5336294, 5317022, 5302589, 5291948, 5285746, 5284789, 5288425, 5295287, 5304467, 5315035, 5325563, 5335125, 5343826, 5351596, 5357713, 5362421, 5367823, 5376276, 5389152, 5408014, 5435523, 5474144, 5525260]
59414E525260O4485P6202P8457O2845L0635n065k9707l7783l2124j7002M897L1330
59402E752430O0317R0149J16582J31112J26008J02457P1943M8282L8479M0522
59392F578281M8042N5857O1941O5856O6966O4627N9238N1930M3421L4124K5087
59381G155370J7540J1386N201k266j1606k3438l7895n3140o5847p3848p7302p7224
59369F766931p4305o9439o3885n8197n2119m5959m0795l6935l3522l0188k7789
59358F233798k6777k6201k5052k3617k2741k2798k3977k6547l0115l3487l5917
59347E936569l7727l9306m0343m0458l9662l7845l4592k9933k4489j8733j2938
59336E580543p739l634J24M842J0476J5641J9511K2189K3048K0485J3993N018
$$ y = [5525260, 5589745, 5665947, 5744404, 5807249, 5837884, 5832819, 5803112, 5765329, 5733205, 5716203, 5721100, 5752430, 5812747, 5902896, 6019478, 6150590, 6276598, 6379055, 6450998, 6499280, 6537759, 6578281, 6626323, 6682180, 6744121, 6809977, 6876943, 6941570, 7000808, 7052738, 7096159, 7130283, 7155370, 7172910, 7184296, 7189497, 7187231, 7175625, 7152187, 7114292, 7061152, 6995305, 6921457, 6844155, 6766931, 6692626, 6623187, 6559302, 6501105, 6448986, 6403027, 6362232, 6325297, 6291775, 6261587, 6233798, 6207021, 6180820, 6155768, 6132151, 6109410, 6086612, 6062635, 6036088, 6005973, 5972486, 5936569, 5898842, 5859536, 5819193, 5778735, 5739073, 5701228, 5666636, 5636703, 5612214, 5593481, 5580543, 5572804, 5569170, 5569294, 5574136, 5584612, 5600253, 5619764, 5641953, 5665001, 5685486, 5699479, 5704497]
59324E704497m728j4462k3293k9599l2319l1760k8577k3130j6313r491k875M782
59312E492732J4185K4490L4980M6316N9213P3113Q7155J01287J15406J28290J38371
59301F315538J44717J46494J42337J31311J14039R2264O7861M2756J9099j094
59291G215322j6099k4208k4157j6155j962J5992L4946N1855O4606P3300P8979
59280G452419Q1127P7781O8194N3705L5740J4617r198l4369n9782q4934j08534
59269G486766j28049j41469j48550j50122j47353j41899j35298j27798j18976
59260F247252j09456j00498r1936q2518p2392o3202n5330m7220l8088k9154k1516
59249E535942j4976r851p639q723j1343j4084j7518k2291k7501l2147l6332l9825
$$ y = [5704497, 5699769, 5685307, 5662014, 5632415, 5600096, 5568336, 5539759, 5516629, 5500316, 5490825, 5487950, 5492732, 5506917, 5531407, 5566387, 5612703, 5671916, 5745029, 5832184, 5933471, 6048877, 6177167, 6315538, 6460255, 6606749, 6749086, 6880397, 6994436, 7086700, 7154561, 7197317, 7216416, 7215322, 7199223, 7175015, 7150858, 7134703, 7132741, 7148733, 7183679, 7235534, 7300140, 7373440, 7452419, 7533546, 7611327, 7679521, 7733226, 7768966, 7783583, 7774385, 7740016, 7680234, 7595300, 7486766, 7358717, 7217248, 7068698, 6918576, 6771223, 6629324, 6494026, 6366228, 6247252, 6137796, 6037298, 5945362, 5862844, 5790452, 5727250, 5671920, 5624700, 5586612, 5557458, 5535942, 5520966, 5511115, 5503476, 5494753, 5483410, 5469326, 5451808, 5429517, 5402016, 5369869, 5333537, 5293712]
59237E293712m1406m0924m0022l9392l7264l2274k5965k0622j6320j1916p448
59226D980159l537K27M541Q981J2974J7091K1960K7088L2029L7447M3548M8926
59214E231434N2451N4931N7342N8957N8905N8164N8081N8246N7768N7446N8632
59203E862357O1021O3536O6433P0441P4461P6135P4167O8511N9048M5846L0127
59192F552083J3432l651k0557l5535m6825n4270n8226n7966n2850m4166l3939
59181F157530k2655r797M203J8346L2575M7086O0875P2810Q3355R3249J01049
59170F638626J03946J00543R0991P5066N2595K5792q07k3195l9395m8581n0626
59159F924955m6688l8689k7937j5194j912J0047J9859K7788L3900L7725L9073
$$ y = [5293712, 5252306, 5211382, 5171360, 5131968, 5094704, 5062430, 5036465, 5015843, 4999523, 4987607, 4980159, 4976622, 4976849, 4981390, 4990371, 5003345, 5020436, 5042396, 5069484, 5101513, 5138960, 5182508, 5231434, 5283885, 5338816, 5396158, 5455115, 5514020, 5572184, 5630265, 5688511, 5746279, 5803725, 5862357, 5923378, 5986914, 6053347, 6123788, 6198249, 6274384, 6348551, 6417062, 6476110, 6521956, 6552083, 6565515, 6561864, 6541307, 6505772, 6458947, 6404677, 6346451, 6288485, 6235635, 6191469, 6157530, 6134875, 6125078, 6129281, 6147627, 6180202, 6227288, 6288163, 6360973, 6444328, 6537577, 6638626, 6742572, 6843115, 6934106, 7009172, 7061767, 7087559, 7086752, 7063557, 7024162, 6975581, 6924955, 6878267, 6839578, 6811641, 6796447, 6794535, 6804582, 6824441, 6852229, 6886129, 6923854, 6962927]
59148F962927L8384L6751L6482M0831N1855O8909R0107J14428J41042J67429J89866
59137G939011K05704K14129K15387K10515K01158J88095J70150J45690J14765
59128I604604P8941M0053M56l6326o7168r1447j10632j26444j40443j54188j67915
59117H829491j79505j86292j87529j83920j75658j62689j46331j28833j11538
59108G367196r4844p9590o6952n7197m9816m4592m1492m0075m0035m1651m4557
59097F766395m6987m7581m6997m6390m5415m3308m0762l8766l6533l2549k6995
59086F314112k1073j4631o606K773J2217K1344L0267L7613M1125M0249L6314L0427
59074F524131K3055J5285Q388K116m622j1425j6442j8712j8573j5908r934j155
$$ y = [6962927, 7001311, 7038062, 7074544, 7115375, 7167230, 7236139, 7326246, 7440674, 7581716, 7749145, 7939011, 8144715, 8358844, 8574231, 8784746, 8985904, 9173999, 9344149, 9489839, 9604604, 9683545, 9723598, 9724054, 9687728, 9620560, 9529113, 9418481, 9292037, 9151594, 8997406, 8829491, 8649986, 8463694, 8276165, 8092245, 7916587, 7753898, 7607567, 7478734, 7367196, 7272352, 7192762, 7125810, 7068613, 7018797, 6974205, 6932713, 6892638, 6852603, 6810952, 6766395, 6719408, 6671827, 6624830, 6578440, 6533025, 6489717, 6448955, 6410189, 6373656, 6341107, 6314112, 6293039, 6278408, 6271802, 6274575, 6286792, 6308136, 6338403, 6376016, 6417141, 6457390, 6493704, 6524131, 6547186, 6562471, 6570859, 6572975, 6568353, 6556928, 6540486, 6521774, 6503201, 6487293, 6477359, 6476204]
59062F476204Q109J5376J8944J7366R657l623k0580l9199n7494p3149q4501r1640
59050F175470r5371r5791r3231q9502q6353q3222p8524p2482o6733o1657n6252
59039E296352n0366m4846l9712l4243k8826k4648k1592j8297j4293j0251o283
59028E002995j887K558O110Q975J2055J5038J6870J7929J9634K1981K3496K3697
59016E169451K3644K4099K5049K6914L0210L3999L6772L8968M2570M8281N5101
59005E555058O2682P1810Q2424R3423J04775J17750J32655J48216J63515J78596
58995F710904J92889K04936K13839K19054K18709K10318J93603J70769J43802
58986H478823J13443Q0925M8425J7299j2311l9892o4614q7221j09678j32449j53819
$$ y = [6476204, 6484313, 6499689, 6518633, 6535999, 6545656, 6542033, 6521453, 6482254, 6424760, 6351611, 6267110, 6175470, 6080099, 5984308, 5891077, 5801575, 5715222, 5632000, 5553476, 5480994, 5414261, 5352604, 5296352, 5245986, 5201140, 5161428, 5127185, 5098359, 5073711, 5052119, 5033822, 5019529, 5009278, 5002995, 5001108, 5003666, 5009776, 5018751, 5030806, 5045844, 5062714, 5080643, 5100277, 5122258, 5145754, 5169451, 5193095, 5217194, 5242243, 5269157, 5299367, 5333366, 5370138, 5409106, 5451676, 5499957, 5555058, 5617740, 5689550, 5771974, 5865397, 5970172, 6087922, 6220577, 6368793, 6532308, 6710904, 6903793, 7108729, 7322568, 7541622, 7760331, 7970649, 8164252, 8335021, 8478823, 8592266, 8673191, 8721616, 8738915, 8726604, 8686712, 8622098, 8534877, 8425199, 8292750, 8138931]
58975H138931j71917j85296j91560j88115j75106j55674j32930j08709q5328o5873
58965F678423n1848m2711l8372l9881m6918n6879o7498p8326q8916r7652j03448
58954E965974j06724j07723j05535r9525r0132p7738o2645m6426l1193j6922j796
58943E219615J4184K8346L8912M6939N3587N7873N8703N7096N4907N2981N1877
58932E735020N2716N5857O0100O4199O7720O9462O6760N7719M2995K4643M713
58921F301904j4267k9258l8529m2585m2728l9956l5549l0872k5771j8785r530
58910E974074Q30J1950K5116M0820N7593P4150R0806J07701J23506J37078J48728
58899F792352J58700J65773J68326J65219J54983J35897J08084P4188L7409M04
$$ y = [8138931, 7967014, 7781718, 7590158, 7402043, 7226937, 7071263, 6938333, 6829624, 6744296, 6678423, 6626575, 6583864, 6545492, 6505611, 6458693, 6401814, 6334316, 6255990, 6167074, 6069422, 5965974, 5859250, 5751527, 5645992, 5546467, 5456335, 5378597, 5315952, 5269526, 5238333, 5221411, 5219615, 5233799, 5262145, 5301057, 5347996, 5401583, 5459456, 5518159, 5575255, 5630162, 5683143, 5735020, 5787736, 5843593, 5903693, 5967892, 6035612, 6105074, 6171834, 6229553, 6272548, 6297191, 6301904, 6287637, 6258379, 6219850, 6177265, 6134537, 6094581, 6059032, 6028160, 6002389, 5983604, 5974074, 5974904, 5986854, 6011970, 6052790, 6110383, 6184533, 6275339, 6383040, 6506546, 6643624, 6792352, 6951052, 7116825, 7285151, 7450370, 7605353, 7741250, 7849334, 7923522, 7960931, 7961335]
58889G961335l3601o1088q0945r5202j06122j14136j19174j21765j21673j17519
58879F990110j09054r8088q6088p2771n8171m4306l3423k6293k3232k4956l1110
58868F382618l9622m8726n8179o7712p6122q2890q8774r3781r6491r6526r5649
58857E538146r5246r4594r2824r0541q8155q4607p9270p3243o7504o1545n5113
58846D655504m9301m4596l9876l4713l0634k8523k6836k3980k0583j7781j5255
58835D323426j2634j0794r935q219m301N25M548Q348J3466J9947K6945L4185M1013
58822D426520M5537M6466M4362L9628L1127J8561M419q369j9052k7718l3268l4946
58810D533267l4171l2586k9661k4312j7422j0601l742L978J1844J8518K4204K9958
$$ y = [7961335, 7927734, 7866646, 7785701, 7690499, 7584377, 7470241, 7351067, 7229302, 7107629, 6990110, 6881056, 6782968, 6696880, 6624109, 6565938, 6521632, 6488209, 6461916, 6438684, 6413728, 6382618, 6342996, 6294270, 6236091, 6168379, 6092257, 6009367, 5920593, 5826812, 5730321, 5633795, 5538146, 5442900, 5348306, 5255482, 5164941, 5076786, 4992179, 4912909, 4839666, 4772162, 4710617, 4655504, 4606203, 4561607, 4521731, 4487018, 4456384, 4427861, 4401025, 4377045, 4356462, 4338681, 4323426, 4310792, 4299998, 4290063, 4281844, 4277543, 4278068, 4282616, 4290964, 4304430, 4324377, 4351322, 4385507, 4426520, 4472057, 4518523, 4562885, 4602513, 4633640, 4652201, 4656620, 4648251, 4629199, 4601481, 4568213, 4533267, 4499096, 4466510, 4436849, 4412537, 4395115, 4384514, 4380772, 4384750, 4396594, 4415112, 4439316, 4469274]
58798D469274L5715M0693M4756M7727M8511M6548M3096L9605L5952L1713K7693
58787D911283K4703K2279K0293K0328K3716K9518L6012M2689M9267N4452N7518
58776E292058N9459O0775N9736N4748M6771L7524K6938J4449J072j2057k5563
58765E615910m0070n3951o5085p3426p9835q3924q5371q5740q6471q6464q3997
58754D791576p9737p5401p0801o4757n7705n0800m3546l4927k5868j8069j1160
58743D258805l605M436J1487J7329K2959K8676L4348M0732M8439N6337O2988O8681
58731D651612P3937P7037P5211O7501N4533L6626J4504r071l0754m9202o4502
58720D897432p6158q3694q8137r0726r1046q8424q3929p8912p2755o4347n4524
$$ y = [4469274, 4504989, 4545682, 4590438, 4638165, 4686676, 4733224, 4776320, 4815925, 4851877, 4883590, 4911283, 4935986, 4958265, 4978558, 4998886, 5022602, 5052120, 5088132, 5130821, 5180088, 5234540, 5292058, 5351517, 5412292, 5472028, 5526776, 5573547, 5611071, 5638009, 5652458, 5653530, 5641473, 5615910, 5575840, 5521889, 5456804, 5383378, 5303543, 5219619, 5134248, 5048508, 4962037, 4875573, 4791576, 4711839, 4636438, 4565637, 4500880, 4443175, 4392375, 4348829, 4313902, 4288034, 4269965, 4258805, 4255200, 4259636, 4271123, 4288452, 4311411, 4340087, 4374435, 4415167, 4463606, 4519943, 4582931, 4651612, 4725549, 4802586, 4877797, 4945298, 4999831, 5036457, 5050961, 5041890, 5011136, 4961934, 4897432, 4821274, 4737580, 4649443, 4558717, 4467671, 4379247, 4295318, 4216406, 4143651, 4079304, 4024780]
58709D024780m4779l4680k3034j0435J741J3812K6657L9142M8962N5129N7182
58698D154477N3183M1240K2544O39k1517m1793n7547o6812p0102o8891o3283n3178
58686C828960m0444k7442j4626j913R147J7228K3760L0663L6808L9701L9515L8337
58674C979694L6406L2229K5618J7575P935l895j6461k7408l6343m3974m9466n1731
58662C870179n2263n3528n5284n5539n4335n3270n2047m8971m4383m0384l7379
58651C322796l3942k9732k5605k1398j6542j2229r927q397n446j826j11l26k40
58638C157075M83J47j313k127k166l097m967n962n690n433n178l625j129N39J515
58623C119072L584O547Q127P649O673N782L958J482K53Q13J860K997N088P818
$$ y = [4024780, 3980001, 3945321, 3922287, 3911852, 3913593, 3927405, 3954062, 3993204, 4042166, 4097295, 4154477, 4207660, 4248900, 4271444, 4272083, 4250566, 4208773, 4151226, 4084414, 4014312, 3945421, 3882138, 3828960, 3788516, 3761074, 3746448, 3744535, 3753682, 3770910, 3794670, 3825333, 3862141, 3901842, 3941357, 3979694, 4016100, 4048329, 4073947, 4091522, 4099457, 4095562, 4079101, 4051693, 4015350, 3971376, 3921910, 3870179, 3817916, 3764388, 3709104, 3653565, 3599230, 3545960, 3493913, 3444942, 3400559, 3360175, 3322796, 3288854, 3259122, 3233517, 3212119, 3195577, 3183348, 3173421, 3165024, 3159578, 3157752, 3157641, 3157315, 3157075, 3157558, 3157705, 3156392, 3154265, 3152099, 3149002, 3144035, 3138073, 3132383, 3126950, 3121772, 3118147, 3117018, 3117557, 3119072, 3122656, 3129203, 3137330, 3144979, 3151652, 3157434, 3161392, 3162874, 3163127, 3163940, 3165800, 3168797, 3173885, 3181703]
58609C181703R718J0821J2513J4680J5708J5319J4641J3746J1955J0257J0436
58598C321497J2161J3913J6228K0778K6732L1609L5276L9511M3810M5623M4595
58587C651733M2830M0837L7198L2476K9473K9012K9159K9110L0192L2453L3918
58576D018391L3882L3498L2549K9056K2547J4314M094r739k6083m0861n1595n8848
58564D001205o2802o2209n7455n1059m4232l6331k8194k2371j9342j7088j5089
58553C585033j5218j8130k2410k7876l5752m4760n1033n3069n3057n2382m9577
58542C161769m3913l7284l1097k4621j7578j1170n579M04O439J0557J2638J4591
58530C035156J6629J6912J5333J3767J2130Q253K397k264m581o769r919j2312
$$ y = [3181703, 3191421, 3202242, 3214755, 3229435, 3245143, 3260462, 3275103, 3288849, 3300804, 3311061, 3321497, 3333658, 3347571, 3363799, 3384577, 3411309, 3442918, 3478194, 3517705, 3561515, 3607138, 3651733, 3694563, 3735400, 3772598, 3805074, 3834547, 3863559, 3892718, 3921828, 3952020, 3984473, 4018391, 4052273, 4085771, 4118320, 4147376, 4169923, 4184237, 4188331, 4178592, 4152509, 4111648, 4060053, 4001205, 3938403, 3876194, 3818739, 3767680, 3723448, 3687117, 3658923, 3636552, 3617210, 3600122, 3585033, 3569815, 3551685, 3529275, 3501399, 3465647, 3420887, 3369854, 3316785, 3263728, 3211346, 3161769, 3117856, 3080572, 3049475, 3024854, 3007276, 2996106, 2990527, 2990931, 2997370, 3007927, 3020565, 3035156, 3051785, 3068697, 3084030, 3097797, 3109927, 3118180, 3120577, 3118313, 3113732, 3106963, 3097044, 3084732]
58518C084732j3170j3963j4906j4203j1870j0182r357o986k647J253M203Q506
58506C001410J4288J8324J9230J9066J8350J4449O936k22m046n692o221l932J761
58493C093701Q105J3095J7770K2283K3859K0872J4926O949m451j8539l0876l8667
58481C129027m3636m7406m8396m5900m2768m1126l9187l5011k9747k4799j9601
58470B711450j4416j1371j0426q381m027j36J793M135Q039J0434Q923N214J026
58457B702257m984j3180k0380k4448k7352l0683l2447l1310k9740k9777k9767
58446B428189k8276k6937k6417k3948j8125j1849p305k448M222J0039J2845J4895
58434B324885J8218K0418J8893J5291J1971Q021K560j995l667m315n838o731n684
$$ y = [3084732, 3071562, 3057599, 3042693, 3028490, 3016620, 3006438, 2997081, 2990095, 2987448, 2988701, 2992904, 3001410, 3015698, 3034022, 3053252, 3072318, 3090668, 3105117, 3112053, 3111831, 3107785, 3102093, 3095872, 3091940, 3093701, 3101806, 3114901, 3132671, 3154954, 3178813, 3199685, 3214611, 3221560, 3217109, 3198570, 3167694, 3129027, 3085391, 3037985, 2989589, 2943689, 2900921, 2859795, 2820608, 2785597, 2755850, 2731051, 2711450, 2697034, 2685663, 2675237, 2666856, 2662829, 2662693, 2664486, 2668621, 2676660, 2687094, 2696017, 2701231, 2702257, 2697273, 2684093, 2663713, 2639265, 2611913, 2581230, 2548783, 2517473, 2487733, 2457956, 2428189, 2399913, 2372976, 2346559, 2322611, 2304486, 2292637, 2285332, 2282884, 2287106, 2297145, 2309990, 2324885, 2343103, 2363521, 2382414, 2397705, 2409676, 2417697, 2420257, 2418262, 2414595, 2410280, 2404442, 2397711, 2392027]
58421B392027m696n270n509m069k916l202l079k560n428j2651j9181k1121k1015
58408B281330k1938k1838j8345j4075j2075j0689p819n652o161o584m423k448
58396B149283l552n113l737j243n63j6K882N953O224N419O241P034N334K989K556
58381B179691K492J005N89L565P112P962P889R329R864O653K163j94j999n808
58367B230313r423r876r106j0013j0829r077o909o944p038m809k858l738m406
58354B135287j695J490J585J117L668P053Q095R254J3533J7678J7616J5893J6498
58341B247072J7127J4103J0186R622J0030P211L571L606N364M576L189N486R693
58328B350836J1624J2732J6378K0156K0111J8565J9499K0484J7516J3345J2243
$$ y = [2392027, 2387331, 2382061, 2376552, 2372483, 2369567, 2366365, 2363286, 2360726, 2355298, 2342647, 2323466, 2302345, 2281330, 2259392, 2237554, 2219209, 2205134, 2193059, 2182370, 2174551, 2168899, 2162738, 2156154, 2151731, 2149283, 2145731, 2140618, 2136881, 2135638, 2135075, 2135059, 2137941, 2143894, 2150118, 2155537, 2161778, 2168812, 2174146, 2177135, 2179691, 2182183, 2183188, 2183777, 2187342, 2194454, 2202416, 2210305, 2219634, 2229498, 2236151, 2238314, 2238120, 2236121, 2230313, 2220890, 2211014, 2201908, 2191895, 2181066, 2171989, 2165080, 2158136, 2151098, 2146289, 2143431, 2139693, 2135287, 2133592, 2135082, 2136667, 2137784, 2141452, 2148505, 2156600, 2165854, 2179387, 2197065, 2214681, 2230574, 2247072, 2264199, 2278302, 2288488, 2298110, 2308140, 2315351, 2318922, 2322528, 2327892, 2332468, 2335657, 2341143, 2350836, 2362460, 2375192, 2391570, 2411726, 2431837, 2450402, 2469901, 2490385, 2507901, 2521246, 2533489]
58317B533489J1108M853l793r149j2706j8853k4962k5751k3501k3803k4990k1936
58305B360006j6563j4344j3894j0284n192l410k886J374O995Q167O357O886Q642
58292B331854P698O905J1053J6562J7138J5401J7543K1129K0199J7911K1370K8117
58280B532880L0734L0926L5677M3201M6306M6271M9641N4498N3721M8728M6148
58269C018731M4250L6636K6096K0529J8488J3193P106P665J2343J3254J2649J8076
58257C249016K6330K8649K7694L2386M0081M1653M0098M5481N5288N8901N7999
58246C703576O2770P1429P3865P2378P7813Q8156R2400R2609J00043J12421J17934
58235D665394J18910J27781J42436J50128J52991J64179J81410J91028J95714
$$ y = [2533489, 2544597, 2549450, 2545657, 2536508, 2523802, 2504949, 2479987, 2454236, 2430735, 2406932, 2381942, 2360006, 2343443, 2329099, 2315205, 2304921, 2299729, 2296319, 2293433, 2294807, 2301802, 2309969, 2316326, 2323212, 2331854, 2339552, 2346457, 2357510, 2374072, 2391210, 2406611, 2424154, 2445283, 2465482, 2483393, 2504763, 2532880, 2563614, 2594540, 2630217, 2673418, 2719724, 2765995, 2815636, 2870134, 2923855, 2972583, 3018731, 3062981, 3099617, 3125713, 3146242, 3164730, 3177923, 3185029, 3192694, 3205037, 3218291, 3230940, 3249016, 3275346, 3303995, 3331689, 3364075, 3404156, 3445809, 3485907, 3531388, 3586676, 3645577, 3703576, 3766346, 3837775, 3911640, 3984018, 4061831, 4149987, 4242387, 4334996, 4435039, 4547460, 4665394, 4784304, 4912085, 5054521, 5204649, 5357640, 5521819, 5703229, 5894257, 6089971]
58226F089971K10479K33513K49826K61495K84145L15749L40403L60903L94518
58217H741002M38647M75523N08907N59226O24383O84592P44217Q27197R32826
58208A4536520J040692J157938J313804J508996J722349J966781K283217K681498
58200B8211795L150457L727013M489295N484430O739235Q337752J0398232J2975779
58192H3513988J6089970J9840991K4364853K9650096L5462225M1238520M5595863
58185B95756506M5916696L9243032K4599436M710825j5033758k9790816l7732962
58178C27668959l9880157l8269642l4568327k9854778k4850783j9997955j5499274
58171A24748043j1502434q255648o063941n114404n308215o200967p153743p664665
$$ y = [6089971, 6300450, 6533963, 6783789, 7045284, 7329429, 7645178, 7985581, 8346484, 8741002, 9179649, 9655172, 10164079, 10723305, 11347688, 12032280, 12776497, 13603694, 14536520, 15577212, 16735150, 18048954, 19557950, 21280299, 23247080, 25530297, 28211795, 31362252, 35089265, 39578560, 45062990, 51802225, 60139977, 70538209, 83513988, 99603958, 119444949, 143809802, 173459898, 208922123, 250160643, 295756506, 341673202, 380916234, 405515670, 410226495, 395192737, 365401921, 327668959, 287788802, 249519160, 214950833, 185096055, 160245272, 140247317, 124748043, 113245609, 104989961, 98926020, 93811616, 88503401, 82302434, 75148691, 67484026]
58163F7484026p607920p150909o493168n741859m969321m252468l625766l071512
58155B4571103k581407k176113j855727j586351j349130j155967j006855q76714
58147A1982839p55525o60153n95297n40343m85013m42502m17211l92586l60946
58138G333263l34504l17467k96215k66109k40488k24495k06054j80855j61129
58129E105947j51652j41138j25264j15307j16213j17938j15739j17795j25690
58120C979211j28076j20973j14704j13790j09218r7378q7839q5200q1202p1925
58110B968906o5425o5333o3623n6588n1882n2917n1954m5490m1212m2797m2513
58099B389172l5717k8618k5040j9297q947j304l93o7L555N018J113k493k421l799
$$ y = [67484026, 59876106, 52725197, 46232029, 40490170, 35520849, 31268381, 27642615, 24571103, 21989696, 19813583, 17957856, 16371505, 15022375, 13866408, 12859553, 11982839, 11227314, 10567161, 9971864, 9431521, 8946508, 8504006, 8086795, 7694209, 7333263, 6998759, 6681292, 6385077, 6118968, 5878480, 5653985, 5447931, 5267076, 5105947, 4954295, 4813157, 4687893, 4572586, 4456373, 4338435, 4222696, 4104901, 3979211, 3851135, 3730162, 3615458, 3501668, 3392450, 3295072, 3207233, 3122033, 3040831, 2968906, 2903481, 2838148, 2774525, 2717937, 2666055, 2613138, 2561184, 2515694, 2474482, 2431685, 2389172, 2353455, 2324837, 2299797, 2280500, 2271553, 2270249, 2269856, 2269789, 2273344, 2278362, 2279475, 2276982, 2274561, 2270762]
58085B270762r457j4077j4863j6857k2175k4897k2343k0549k2969k4438k1937
58074B056200k0778k4225k7174k6063k5269k7784k9091k6137k3248k3474k2903
58063A780054j9017j5984j6258j5509j1197p783q227q692o722o301r587j1876
58051A642901j0127q515j0253j1738j0027q419r315r148n724l273m840o717n547
58038A539258m029m506l901j79K916K660K258M100M847K222L5J310K864J872J403
58023A553130M214P171P190O795Q564R895Q466P226Q784J0359R408Q764J1127
58010A661093J3828J4199J4823J8333K2160K3573K4928K8792L2838L4699L6972
57999A926238M2207M7765N0903N4307O1156O9155P4987Q0474Q8775R8142J04747
$$ y = [2270762, 2261305, 2247228, 2232365, 2215508, 2193333, 2168436, 2146093, 2125544, 2102575, 2078137, 2056200, 2035422, 2011197, 1984023, 1957960, 1932691, 1904907, 1875816, 1849679, 1826431, 1802957, 1780054, 1761037, 1745053, 1728795, 1713286, 1702089, 1694306, 1686079, 1677387, 1670665, 1664364, 1654777, 1642901, 1632774, 1624259, 1614006, 1602268, 1592241, 1583822, 1574507, 1565359, 1559635, 1556362, 1551522, 1544805, 1539258, 1535229, 1530723, 1526822, 1526643, 1529559, 1532219, 1534477, 1538577, 1543424, 1545646, 1545681, 1546991, 1549855, 1551727, 1553130, 1557344, 1564515, 1571705, 1578500, 1587064, 1596959, 1605425, 1612651, 1621435, 1631794, 1641202, 1649966, 1661093, 1674921, 1689120, 1703943, 1722276, 1744436, 1768009, 1792937, 1821729, 1854567, 1889266, 1926238, 1968445, 2016210, 2067113, 2121420, 2182576, 2251731, 2326718, 2407192, 2495967, 2594109, 2698856]
57988B698856J08197J09327J05979R6070Q1780O6337M9988L3335K0871J6473J8558
57977C405771K3930L2717M5019N6152O0019N4430L9306J3486k1785n9474r1700
57966C557871j15912j32661j40882j39844j32695j23362j12217r8569q4458p2114
57956B405157o0529m8479l7928l0580k4146j6110q203l037O67N278R691J1821
57944B203602J2898J4941J6568J5637J3656J3307J3982J3952J4544J8059K3607
57933B374753K9209L5849M5357N6179O5135P1522P5637P5208O7013N0563K7151
57922B973576k340l5310o5677q8206j02912j12054j15381j11879j03681r3987
57912B142149q3201p0849n9147n0608m3976l6558k8914k3515k0392j7938j6338
$$ y = [2698856, 2807053, 2916380, 3022359, 3118429, 3200209, 3266546, 3316534, 3349869, 3370740, 3387213, 3405771, 3429701, 3462418, 3507437, 3563589, 3623608, 3678038, 3717344, 3730830, 3709045, 3649571, 3557871, 3441959, 3309298, 3168416, 3028572, 2895877, 2772515, 2660298, 2561729, 2477271, 2405157, 2344628, 2296149, 2258221, 2227641, 2203495, 2187385, 2179182, 2176145, 2176812, 2182090, 2191781, 2203602, 2216500, 2231441, 2248009, 2263646, 2277302, 2290609, 2304591, 2318543, 2333087, 2351146, 2374753, 2403962, 2439811, 2485168, 2541347, 2606482, 2678004, 2753641, 2828849, 2895862, 2946425, 2973576, 2971236, 2935926, 2870249, 2782043, 2679131, 2567077, 2451696, 2339817, 2236136, 2142149, 2058948, 1988099, 1928952, 1878344, 1834368, 1797810, 1768896, 1745381, 1724989, 1707051, 1690713]
57901A690713j6529j7099j5764j2664r166n103j43M043O167P854J0701J3096J3144
57888A669250J2353J2774J2935J0492O615L785J311k746p228r772j1243j4014
57876A684512j7453j9366k0428k2770k5481k5939k4608k4192k4919k4845k4075
57865A430436k4502k5838k5947k4763k4201k4509k4185k3099k2370k1614j9647
57854A169761j7365j6681j7091j6379j4226j2160j0599q837p161o181m963k604
57842A035514m40J09M37K399M714N115M556N474P229P295N927N630O701P280P182
57827A105122P863Q993Q883P908P977Q957R106Q468Q338Q082O228L987L881N354
57813A209147N777N312O656J0104J3222J5550J9384K5394L1510L6945M3578N2402
$$ y = [1690713, 1674184, 1657085, 1641321, 1628657, 1619491, 1614388, 1614245, 1618288, 1624455, 1632309, 1643010, 1656106, 1669250, 1681603, 1694377, 1707312, 1717804, 1724419, 1728204, 1729515, 1726769, 1719541, 1709769, 1698526, 1684512, 1667059, 1647693, 1627265, 1604495, 1579014, 1553075, 1528467, 1504275, 1479356, 1454511, 1430436, 1405934, 1380096, 1354149, 1329386, 1305185, 1280676, 1256491, 1233392, 1211022, 1189408, 1169761, 1152396, 1135715, 1118624, 1102245, 1088019, 1075859, 1065260, 1056423, 1049262, 1043081, 1038118, 1035514, 1035074, 1035183, 1035620, 1038019, 1042733, 1047848, 1052404, 1057878, 1065107, 1072402, 1078329, 1083959, 1090660, 1097940, 1105122, 1112985, 1121978, 1130861, 1138769, 1146746, 1155703, 1164809, 1173277, 1181615, 1189697, 1195925, 1199912, 1203793, 1209147, 1214924, 1220236, 1226892, 1236996, 1250218, 1265768, 1285152, 1310546, 1342056, 1379001, 1422579, 1474981]
57801A474981O2063P1744Q2231R2999J01017J03205R7669Q2634N7481K5576o866
57790B244734l5410n8674p5471q4202q5633q2972p8337p1711o3778n6751n1689
57779A500106m7582m3743m0632l8047l5067l2063l0179k8826k6448k3691k2667
57768A131161k3031k2112j9352j7168j6769j6452j5023j3667j3288j2897j1907
57757I49495j1324j1409j0712q627o538n341m124k303p78P8J387L755O351Q850
57743I08760J2097J5933J8441J8347J6322J3195Q775L127k756q291j3525j7638
57731I72787j9217j8418j6969j5621j3646j1039q979p684n958l475j338J8J396
57718H51857K911L656L753M532O262P776Q729J0065J1940J3449J4759J7108K0305
$$ y = [1474981, 1537044, 1608788, 1691019, 1784018, 1885035, 1988240, 2085909, 2168543, 2226024, 2251600, 2244734, 2209324, 2150650, 2075179, 1990977, 1905344, 1822372, 1744035, 1672324, 1608546, 1551795, 1500106, 1452524, 1408781, 1368149, 1330102, 1295035, 1262972, 1232793, 1203967, 1177519, 1153828, 1131161, 1108130, 1086018, 1066666, 1049498, 1032729, 1016277, 1001254, 987587, 974299, 961402, 949495, 938171, 926762, 916050, 907423, 900885, 895544, 891420, 889117, 888339, 888417, 889804, 893559, 899910, 908760, 920857, 936790, 955231, 973578, 989900, 1003095, 1011870, 1014997, 1012241, 1003950, 990425, 972787, 953570, 935152, 918183, 902562, 888916, 877877, 868898, 861214, 855256, 851781, 850443, 850461, 851857, 854768, 858424, 862177, 866709, 872971, 880747, 889476, 899541, 911481, 924930, 939689, 956797, 977102]
57705I77102K2594K3366K3620K3348K1219J7399J3970J1756R250N481J429k226
57693A148308o241j0731j4436j6963j9429k1977k3064k2243k1164k0705j9454
57682I51901j6203j1754p071j777M333J0353J6012K2505L0567L9587M9329O0302
57670A148084P1420P9147P9867P1332N1957K1902j3896m6665o9799q2454q6812
57659A224083q4643p7829o9340o1204n3094m4427l6231k9637k4307j9651j5893
57648G07827j2960j0046p329o114o352o133m639l386l466l882l808m064m976n165
57634F25507m036l136l455l661k688j809k269l052k915k637l255l992l898l748
57620E80956m324m569l476k173k142k814k880k525k541k562j970j240q46k30P08
$$ y = [977102, 999696, 1023062, 1046682, 1070030, 1091249, 1108648, 1122618, 1134374, 1143624, 1149105, 1150534, 1148308, 1142067, 1131336, 1116900, 1099937, 1080508, 1058531, 1035467, 1013224, 992060, 971355, 951901, 935698, 923944, 916873, 915096, 919429, 929782, 945794, 968299, 998866, 1038453, 1087782, 1148084, 1219504, 1298651, 1378518, 1449850, 1501807, 1523709, 1509813, 1463148, 1393349, 1310895, 1224083, 1139440, 1061611, 992271, 931067, 877973, 833546, 797315, 767678, 743371, 723720, 707827, 694867, 684821, 677492, 671378, 665026, 658893, 654254, 650868, 647402, 643520, 639712, 635648, 630672, 625507, 621471, 618335, 614880, 611219, 608531, 606722, 604453, 601401, 598486, 595849, 592594, 588602, 584704, 580956, 576632, 572063, 568587, 566414, 564272, 561458, 558578, 556053, 553512, 550950, 548980, 547740, 546894, 546664, 547372]
57605E47372P18n57j290j29J567J903J271J048J221J199J523K664L620L556L461
57590E69147M257M797L759K005J032M63q08k333l062l328l772l590k012j71O26
57575E67010J211K859M595M598L129J628K5k497m943n403l993k490j569o62m4
57560E63454n75j766k342k512l463m799m706k695k55J305K019K316K536L214M462
57545E56193N208M483L016K233K156J739O46q04k747n226p098p256o442o247o774
57530E33080o920o397n781n056l804k419j595r96mQ52P70L30O10J292J427J474
57514E06863K596M413N390N172M690M253L381K415K398L350M161M190L550K077
57500E58899m35l149m788n226n274n222m782m021l053j474P32K434K821K746L238
$$ y = [547372, 548090, 547533, 546243, 546114, 547681, 549584, 550855, 551903, 553124, 554323, 555846, 558510, 562130, 565686, 569147, 573404, 578201, 581960, 583965, 584997, 585460, 584652, 582319, 579257, 575929, 572157, 568567, 566555, 566384, 567010, 568221, 571080, 575675, 580273, 583402, 585030, 585055, 582558, 577615, 572212, 568219, 565729, 564160, 563498, 563454, 562879, 561113, 558771, 556259, 552796, 547997, 543291, 540596, 540341, 541646, 543665, 545981, 548517, 551731, 556193, 561401, 565884, 568900, 571133, 573289, 575028, 575674, 574870, 572123, 566897, 559799, 552543, 546101, 539854, 533080, 526160, 519763, 513982, 508926, 505122, 502703, 501108, 500112, 500108, 500960, 501730, 502060, 502670, 503962, 505389, 506863, 509459, 513872, 519262, 524434, 529124, 533377, 536758, 539173, 541571, 544921, 549082, 553272, 556822, 558899, 558464, 555315, 550527, 545301, 540027, 534805, 530023, 526002, 522949, 521475, 522207, 524641, 527462, 530208, 533446]
57485E33446L751L492L238L942M701M315L678M281N285M750K993J916J645Q23
57471E82256j40Q10L857O918R122J1825J5562J8674J9638J8393J4719P899r90
57458G08543q652j2669j3458j2557j0800q772p061n195k021K186N726Q089J0784
57445F54143J4907J9824K4736K9372L2154K9891K0893P117p781k1078l0980l5994
57433G37204l6036l3091k9395k5604k1551j7678j4618j2157r587o629l470l85
57421E27003K338M739P497J1206J5596K0363K6334L4395M3690N2461O0119O6105
57409H71846O6900N7249L5732P281k0711m3183n7931o4299o3429n8348n1898m5095
57397F34114l8191l2004k7067k2742j8415j4548j1646r244o882n059m174l578
$$ y = [533446, 537197, 540689, 543927, 547869, 552570, 556885, 560563, 564844, 570129, 574879, 577872, 579788, 581433, 582256, 582116, 582926, 586783, 593701, 602823, 614648, 630210, 648884, 668522, 686915, 701634, 709533, 708543, 699891, 687222, 673764, 661207, 650407, 641635, 634574, 629379, 627358, 629544, 635270, 643359, 654143, 669050, 688874, 713610, 742982, 775136, 805027, 825920, 833037, 825256, 804178, 773198, 737204, 701168, 668077, 638682, 613078, 591527, 573849, 559231, 547074, 537487, 530858, 527388, 527003, 529341, 534080, 541577, 552783, 568379, 588742, 615076, 649471, 693161, 745622, 805741, 871846, 938746, 995995, 1031727, 1039008, 1018297, 975114, 917183, 852884, 789455, 731107, 679209, 634114, 595923, 563919, 536852, 514110, 495695, 481147, 469501, 460257, 453375, 448316, 444142, 440564]
57385D40564k595j563j009p70p19j246k222k569j842j094j281j870k004j942k324
57370D15514k918l120k923k562k020j652k292l934n335n764o002o746p275o810
57356C56161n983n621n128l551j386J80J200K674M689O262O743O261N050L439
57342C70990K329K561L859N120N671N566M925L711K014J8k072l782m439l977l232
57327C89262k992l178l296l166k828k353k075k361k808k448j148N1M23M61P82
57312C62326J127J117J070J347J700J995K618L492L604K461J067N39N50K29k71
57297C84971k38K42N44O40Q42Q61J61r96j882k382k830l095k735j920j348j327
57281C69508j560j729j797j975k672m119n633n900m506k602j503j257j168r98
$$ y = [440564, 437969, 436406, 435397, 434627, 433908, 432662, 430440, 427871, 426029, 424935, 423654, 421784, 419780, 417838, 415514, 412596, 409476, 406553, 403991, 401971, 400319, 398027, 394093, 388758, 382994, 376992, 370246, 362971, 356161, 350178, 344557, 339429, 335878, 334492, 334672, 335872, 338546, 343235, 349497, 356240, 362501, 367551, 370990, 373319, 375880, 379739, 384859, 390530, 396096, 401021, 404732, 406746, 406764, 404692, 400910, 396471, 392494, 389262, 386270, 383092, 379796, 376630, 373802, 371449, 369374, 367013, 364205, 361757, 360609, 360660, 361083, 361544, 362326, 363453, 364570, 365640, 366987, 368687, 370682, 373300, 376792, 380396, 382857, 383924, 384463, 385013, 385242, 384971, 384733, 384975, 385519, 386159, 387001, 387862, 388023, 387027, 385145, 382763, 379933, 376838, 374103, 372183, 370835, 369508, 367948, 366219, 364422, 362447, 359775, 355656, 350023, 344123, 339617, 337015, 335512, 334255, 333087, 332089]
57267C32089q40m79K52Q92J016J016J534K412K958K902K481J933J514J590K196
57252C53466K891L498M348N395N870N482N180N886P116P773P703P620P957Q663
57238D38848R675J0798J1465J1414J1150J1092J0733R396P254M819K011j389m826
57225E32440p465r188j0263j0504r623q070o580n211l660k225j483j227o03P33
57211D57071K342L732M752N356N557N559N521N457N573O224P235P859P810P682
57197E37730P887Q011P824P966Q805R448Q899P531O441O012O119P027Q946J1150
57183F49796J2768J4102J6009J8397K0469K2166K4150K6491K8477K9693L0258
57172H92776L0017K8597K6326K4165K2500K0762J8524J6308J5042J5056J5785
$$ y = [332089, 331249, 330770, 331022, 331914, 332930, 333946, 335480, 337892, 340850, 343752, 346233, 348166, 349680, 351270, 353466, 356357, 359855, 364203, 369598, 375468, 380950, 386130, 392016, 399132, 406905, 414608, 422228, 430185, 438848, 448523, 459321, 470786, 482200, 493350, 504442, 515175, 524571, 531825, 536644, 538655, 537266, 532440, 524975, 515787, 505524, 495020, 485397, 477327, 470747, 465536, 461876, 459651, 458168, 456941, 456338, 457071, 459413, 463145, 467897, 473253, 478810, 484369, 489890, 495347, 500920, 507144, 514379, 522238, 530048, 537730, 545617, 553628, 561452, 569418, 578223, 587671, 596570, 604101, 610542, 616554, 622673, 629700, 638646, 649796, 662564, 676666, 692675, 711072, 731541, 753707, 777857, 804348, 832825, 862518, 892776, 922793, 951390, 977716, 1001881, 1024381, 1045143, 1063667, 1079975, 1095017, 1110073, 1125858]
57161A125858J6315J6285J6377J7564J9886K2463K4844K7512L0649L3420L5114
57150A386287L6203L7404L8498L9021L9494M0838M2955M4935M6461M8050N0040
57139A850186N2080N3628N4473N4847N5381N6643N8480O0265O1926O4069O6771
57128B488749O9281P1333P3809P7395Q1473Q5132Q8418R1755R4913R7505R9931
57117C419694J03206J08412J16897J30165J48617J70682J93597K14740K32744
57108D838754K48784K67111K92920L29090L75985M34288N06370N94971P03078
57099H591351Q36170J002833J212612J475205J802037K205507K694491L270860
57091B3091066L928871M653669N419582O194101O946191P649355Q278069Q805495
$$ y = [1125858, 1142173, 1158458, 1174835, 1192399, 1212285, 1234748, 1259592, 1287104, 1317753, 1351173, 1386287, 1422490, 1459894, 1498392, 1537413, 1576907, 1617745, 1660700, 1705635, 1752096, 1800146, 1850186, 1902266, 1955894, 2010367, 2065214, 2120595, 2177238, 2235718, 2295983, 2357909, 2421978, 2488749, 2558030, 2629363, 2703172, 2780567, 2862040, 2947172, 3035590, 3127345, 3222258, 3319763, 3419694, 3522900, 3631312, 3748209, 3878374, 4026991, 4197673, 4391270, 4606010, 4838754, 5087538, 5354649, 5647569, 5976659, 6352644, 6786932, 7293302, 7888273, 8591351, 9427521, 10430354, 11642966, 13118171, 14920208, 17125715, 19820206, 23091066, 27019937, 31673606, 37093188, 43287289, 50233480, 57882835, 66160904, 74966399]
57083G4966399R200440R412018R350751Q899758P967631O543251M705132K588583
57075A33633963L50153j853109l883130n641557p073472q151549q864293r220608
57067H9296398r253439r009326q537571p892605p137949o336923n538902m777502
57059C0812181m077222l454771k915667k456130k069504j748418j483292j264049
57051A1343128j083638r36969q17418p17691o33416n62739n03036m50927m04808
57042E232486l64457l28698k96022k66784k42053k20846k00994j82095j65216
57033B965321j50266j36230j23309j12384j02896r3533q4496p6605o8937n9852
57023A956813m9845m0636l1843k1230q012O785K3176M2587O5288Q9852J14690
$$ y = [74966399, 84166839, 93578857, 102929608, 111829366, 119796997, 126340248, 131045380, 133633963, 133984116, 132131007, 128247877, 122606320, 115532848, 107381299, 98517006, 89296398, 80042959, 71033633, 62496062, 54603457, 47465508, 41128585, 35589683, 30812181, 26734959, 23280188, 20364521, 17908391, 15838887, 14090469, 12607177, 11343128, 10259490, 9322521, 8505103, 7787412, 7153996, 6591257, 6088221, 5637294, 5232486, 4868029, 4539331, 4243309, 3976525, 3734472, 3513626, 3312632, 3130537, 2965321, 2815055, 2678825, 2555516, 2443132, 2340236, 2246703, 2162207, 2085602, 2016665, 1956813, 1906968, 1866332, 1834489, 1813259, 1805247, 1812032, 1835208, 1877795, 1943083, 2032935, 2147625]
57012B147625J36381J45861J30731Q5318J7969n3083j10841j47094j62445j62436
57002B027986j53628j41039j27378j13747j00700q8678p8012o8676o0096n1565
56992A044467m3211l5934l0002k4397j8244j2068o698j679L986R958J4319J4944
56980I15441J0474R64j1280k2205k8747l0856l0127k7521k3489j9141j5418j1740
56968G06355p264k800K78K491N666J0117J4504J8371K2840K8535L4665M0343M4834
56955I18935M5942M0366K7112R554o996j9172k6566l0101l0656k8988k5960k2337
56943H51133j8416j3937q653k944K506P781J3843K1257K9566L8283M7558N7248
56931A025225O6095P2286P3653O7057M9692K2881o719l1688m9061n9901o5444
$$ y = [2147625, 2284006, 2429867, 2560598, 2645916, 2663885, 2610802, 2499961, 2352867, 2190422, 2027986, 1874358, 1733319, 1605941, 1492194, 1391494, 1302816, 1224804, 1156128, 1096032, 1044467, 1001256, 965322, 935320, 910923, 892679, 880611, 873913, 872234, 876220, 886178, 900497, 915441, 925915, 926879, 915599, 893394, 864647, 833791, 803664, 776143, 752654, 733513, 718095, 706355, 699091, 696291, 696569, 699060, 704726, 714843, 729347, 747718, 770558, 799093, 833758, 874101, 918935, 964877, 1005243, 1032355, 1041909, 1034913, 1015741, 989175, 959074, 928418, 899430, 873470, 851133, 832717, 818780, 810127, 807183, 809689, 817470, 831313, 852570, 882136, 920419, 967977, 1025225, 1091320, 1163606, 1237259, 1304316, 1354008, 1376889, 1370170, 1338482, 1289421, 1229520, 1164076]
56920A164076o6152o3531n9793n5455m9501m2138l5242k9692k4295j8003j1449
56909G08825n590l57M595Q928J2172J4218J4862J3636J0465N803K13n463r847
56896G72460j2007j2499j2388j1619r587o806m355j891K068P798J3798J8410K0337
56883G63719J7851R767k137j3485k1020k4753k6146k5825k3820k0653j7089j3542
56871F02867j0209o935k871K701R054J4685J9465K4699L0956L7390M3614N0503
56859H15919N7854O2334N9031M5136K2204m313k7705m3394n0760n1855m8810m3000
56847G92641l5705k7964j9899j1467l557L079R597J8009K8536L9723N1068O3591
56835I07652P7690R2199J05268J13607J10900R0618N2780O550l5565o5424q1393
$$ y = [1164076, 1097924, 1034393, 974600, 919145, 869644, 827506, 792264, 762572, 738277, 720274, 708825, 703235, 702878, 707473, 716401, 728573, 742791, 757653, 771289, 781754, 787557, 787770, 782307, 772460, 760453, 747954, 735566, 723947, 714360, 707554, 703199, 701308, 703376, 711174, 724972, 743382, 763719, 781570, 791337, 789200, 775715, 754695, 729942, 703796, 677971, 654151, 633498, 616409, 602867, 592658, 585723, 582852, 585553, 594607, 609292, 628757, 653456, 684412, 721802, 765416, 815919, 873773, 936107, 995138, 1040274, 1062478, 1058165, 1030460, 987066, 936306, 884451, 835641, 792641, 756936, 728972, 709073, 697606, 694049, 697128, 706725, 724734, 753270, 792993, 844061, 907652, 985342, 1077541, 1182809, 1296416, 1407316, 1497934, 1550714, 1557264, 1521699, 1456275, 1374882]
56824A374882q5635q1537p2430o0614m7238l3446k0760r813J86J0040J9578K8547
56812A021760L7398M6529N5885O5724P6440Q6649R2387Q8965P3432M5905J0426
56801A701500k5193n2673o8031p2742p0375o3614n4530m5074l5938k6459j6692
56790A170179q011q66O155J3838K0802K5846L0078L5043M0215M3993M5668M4500
56778A467440L8206K4844O041j3410k9117l9358m4676m6818m7781m8541m8659
56767A218171m7661m6184m5079m4164m2772m0792l8390l5449l2139k9241k7030
56756G89270k4673k1564j8390j6037j4307j2602j0975r671q448p224o496o389
56744F32494o225n730n545n854n719m713l830l814l844l070k044j445p14O37J660
$$ y = [1374882, 1289247, 1207710, 1135280, 1074666, 1027428, 993982, 973222, 963409, 963595, 973635, 993213, 1021760, 1059158, 1105687, 1161572, 1227296, 1303736, 1390385, 1482772, 1571737, 1645169, 1691074, 1701500, 1676307, 1623634, 1555603, 1482861, 1412486, 1348872, 1294342, 1249268, 1213330, 1186871, 1170179, 1162168, 1161302, 1167457, 1181295, 1202097, 1227943, 1258021, 1293064, 1333279, 1377272, 1422940, 1467440, 1505646, 1530490, 1536531, 1523121, 1494004, 1454646, 1409970, 1363152, 1315371, 1266830, 1218171, 1170510, 1124326, 1079247, 1035083, 992311, 951519, 913129, 877680, 845541, 816300, 789270, 764597, 743033, 724643, 708606, 694299, 681697, 670722, 661051, 652603, 645379, 638883, 632494, 626269, 620539, 614994, 609140, 603421, 598708, 594878, 591064, 587220, 584150, 582106, 580661, 579947, 580584, 582244]
56729E82244J438P18N91O34L7m77K88J804K549K363K465L452M884O433Q071R382
56713F26876J0010J0411J1206J2226J3161J4482J6687J9353K2033K5315K9813
56702H11573L5016M0332M6377N3844O1927O9274P5694Q1507Q5881Q7355Q5342
56691A534122P9873P0614N7804M3386K9759J7876P976J220j261m06J436L021M534
56678A849954N959O859P564R024J1461J4363J7492K0707K3086K3555K2121J9348
56666B031493J5061Q747P73q038j7553k7871l8236m7573n5457o1463o4361o3401
56654A672121n9620n4525m8200m0171l1350k3409j6867j1380p261n117m529m700
56642A364992n676p340q037o137k294J797O231J2299J9566K5828K9901L2354L3405
$$ y = [582244, 583682, 584400, 584991, 585625, 585662, 585185, 585473, 587277, 589826, 592189, 594654, 598106, 602990, 609423, 617494, 626876, 636886, 647297, 658503, 670729, 683890, 698372, 715059, 734412, 756445, 781760, 811573, 846589, 886921, 933298, 987142, 1049069, 1118343, 1194037, 1275544, 1361425, 1448780, 1534122, 1613995, 1684609, 1742413, 1785799, 1815558, 1833434, 1841410, 1842630, 1841369, 1840963, 1842399, 1845420, 1849954, 1855913, 1862772, 1870336, 1879360, 1890821, 1905184, 1922676, 1943383, 1966469, 1990024, 2012145, 2031493, 2046554, 2055301, 2056074, 2048036, 2030483, 2002612, 1964376, 1916803, 1861346, 1799883, 1735522, 1672121, 1612501, 1557976, 1509776, 1469605, 1438255, 1414846, 1397979, 1386599, 1379338, 1374221, 1369692, 1364992, 1359316, 1351976, 1343939, 1337802, 1335508, 1337305, 1343536, 1355835, 1375401, 1401229, 1431130, 1463484, 1496889]
56629A496889L2115K7767K0545J0884k05j0383j7352k1002k2695k2923k1414j9161
56617A453065j8087j8655j9729k0819k2533k4667k5846k5324k3491k0459j5807
56606A217648r945m048J661P975J4961K1566K7025L1205L3688L3968L2578L0377
56594A438659K7125K2226J6691J2350R318O112K239j166l255m122l645j643Q19
56581A521708K249K951M411O451P054N189J858j855n680q942j0610j1013j1521
56568A502250j2126j1341q838o137m206k390k94J248J618J025q90n187j1730j8900
56554A424102k5626l2092l8113m2706m5720m7975m9444m9215m7603m6174m5189
56543I54245m3146l9542l5864l3131l0587k7745k5565k4556k3563k1649j9457
$$ y = [1496889, 1529004, 1556771, 1577316, 1588200, 1587995, 1577612, 1560260, 1539258, 1516563, 1493640, 1472226, 1453065, 1434978, 1416323, 1396594, 1375775, 1353242, 1328575, 1302729, 1277405, 1253914, 1233455, 1217648, 1207703, 1203655, 1205316, 1213291, 1228252, 1249818, 1276843, 1308048, 1341736, 1375704, 1408282, 1438659, 1465784, 1488010, 1504701, 1517051, 1526369, 1532481, 1534720, 1533554, 1530299, 1526177, 1522532, 1520889, 1521708, 1523957, 1526908, 1531319, 1537770, 1544824, 1550013, 1551871, 1550016, 1544336, 1535394, 1524784, 1513771, 1502250, 1490124, 1478783, 1469945, 1463808, 1459602, 1457212, 1456918, 1458166, 1459784, 1460809, 1459919, 1454732, 1443002, 1424102, 1398476, 1366384, 1328271, 1285565, 1239845, 1191870, 1142426, 1093211, 1045608, 999434, 954245, 911099, 871557, 835693, 802562, 771975, 744230, 718665, 694109, 670546, 648897, 629440]
56532F29440j7691j5886j3629j1548j0102q845p554o682o068m873l331k842l614
56519E16775m067l279k263k046k215k229k401k747k583j992k035k752k811j843
56505D81512j189j494j543n45L91K39l05l71m41j116j820j888j635j381p66J88
56489D67836P59Q87J355K098K092J398J408K415K985K455J938K012J670M90l67
56474D91431m41j015k579l556k923k006k104k381j681n61O2N16J136J194N42M87
56458D76121J613K539K321K166L165M278M337M181M894N650N295M518M459M490
56444E30027L374J464p6j145k220l049l418m084n472o544o298n315m527l684k316
56429D86717r96m31l74m14o82r66o01J43K36LR61K877L485K133R72J203J032p82
$$ y = [629440, 611749, 595863, 582234, 570686, 560584, 551739, 544185, 537503, 531435, 526562, 523231, 520389, 516775, 512708, 509429, 507166, 505120, 502905, 500676, 498275, 495528, 492945, 490953, 488918, 486166, 483355, 481512, 480323, 478829, 477286, 476741, 477132, 477371, 477066, 476695, 476254, 475138, 473318, 471430, 469795, 468414, 467648, 467836, 468595, 469482, 470837, 472935, 475027, 476425, 477833, 480248, 483233, 485688, 487626, 489638, 491308, 491798, 491431, 490990, 489975, 487396, 483840, 480917, 478911, 476807, 474426, 472745, 472184, 472246, 472762, 473898, 475092, 475634, 476121, 477734, 480273, 482594, 484760, 487925, 492203, 496540, 500721, 505615, 511265, 516560, 521078, 525537, 530027, 533401, 534865, 534789, 533644, 531424, 528375, 524957, 520873, 515401, 508857, 502559, 497244, 492717, 489033, 486717, 485721, 485290, 484916, 484502, 483820, 482854, 482253, 482396, 482632, 482635, 483596, 486473, 489958, 492091, 493063, 494266, 495298, 494516]
56411D94516k274j538o7j39j064q55J28J09q52j202n49K98R67J335Q40l23o39
56394D88691M16J101J26j122j009l95q29j719j657r62o90n74j27k15j352k040
56378D77643j075J51r5r64q48l43q03j443o96P91J228O70L85L52j06k94P69K218
56360D77540K643K426K648K846K192J607K336L611M035L968M290M293L278K650
56346E20363L775N261N117M115M112M505L511J656P44M35q73k569k619j239n57
56331E45737j081j419j206j411j979j804r00l07j49J31K73l1K36J877L629L979
56315E45575L626L841L866K573J204J590K869L013K390K775L949M409M491N586
56301E91757P109P310O304N337L996J202j949l451l599l912l954k396k24N35L84
$$ y = [494516, 492242, 490704, 490637, 490498, 489434, 488579, 488707, 488816, 487964, 486762, 486213, 486511, 487478, 488813, 489653, 489330, 488691, 489107, 490208, 490334, 489212, 488203, 487808, 486979, 485260, 483603, 482641, 481951, 481377, 481250, 481035, 479683, 477643, 476568, 476719, 476624, 475660, 474812, 474469, 473666, 472223, 471527, 472318, 473546, 474216, 474601, 474953, 474847, 474553, 475322, 477540, 480183, 482609, 485257, 488103, 490295, 491902, 494238, 497849, 501884, 505852, 510142, 514435, 517713, 520363, 524138, 529399, 534516, 538631, 542743, 547248, 550759, 552415, 553159, 553594, 552721, 550152, 547533, 546294, 545737, 544656, 543237, 542031, 540620, 538641, 536837, 535937, 535630, 535481, 535612, 535885, 535854, 536090, 537967, 541596, 545575, 549201, 553042, 556908, 559481, 560685, 562275, 565144, 568157, 570547, 573322, 577271, 581680, 586171, 591757, 598866, 606176, 612480, 617817, 621813, 623015, 621066, 617615, 614016, 610104, 606150, 603754, 603530, 604065, 604449]
56286F04449J302L041L838L925M836N939N292L355K387K700K857K902L971N361
56272F56155N499N116O006P394P195O052O292P606P746O849P013Q018P709O322
56258G50972O255P653Q368Q258R352J1615J2690J2109J1799J2116J1342R402Q260
56245H80191Q129O996M405K050L41k109n264p443q521r914j1361j1324j0490j1151
56231H24535j3064j3808j3248j3674j5378j6044j4833j3214j1522q572m886k438
56219F83854j064J125L744M590M002M555O323O725N250L960L153R55k446m565
56205G20161n043n850o823n547k162L21J067K233M209M744L497K878L556L634
56191G20875K914L400M910M836K929J746J753P46j282j737m76k51j279o61J913
$$ y = [604449, 605751, 608792, 612630, 616555, 621391, 627330, 632622, 635977, 638364, 641064, 643921, 646823, 650794, 656155, 661654, 666770, 672776, 680170, 687365, 693417, 699709, 707315, 715061, 721910, 728923, 736941, 744650, 750972, 757227, 764880, 773248, 781506, 790858, 802473, 815163, 827272, 839071, 851187, 862529, 871931, 880191, 888320, 895316, 899721, 901771, 902112, 900003, 894739, 887296, 878775, 868861, 857500, 846176, 835686, 824535, 811471, 797663, 784415, 770741, 755363, 739319, 724486, 711272, 699750, 691178, 686292, 683854, 682790, 683915, 687659, 692249, 696251, 700806, 707129, 713854, 719104, 723064, 726217, 727172, 724726, 720161, 715118, 709268, 702445, 696898, 694736, 695057, 696124, 698357, 702566, 707310, 710807, 713685, 717241, 720875, 723789, 727189, 732099, 736935, 739864, 741610, 743363, 744109, 742827, 741090, 740614, 740363, 739084, 738423, 740336]
56176G40336L226K292J833K794K836J464J305K841L232J871J720L600M618L896
56162G77864M399P112Q950Q477Q413J0333J2010J2133J2629J4261J4962J4441
56150I05984J5422J8393K0202J9769K0041K2560K5279K7517L1745L8643M5856
56139A191411N3277O3860P7380Q9094R6408J00995J02789R8474Q8165P7156O8540
56128B107549O0325N1976M6897M5529M2754L5401K6149J7194O739n143j4043j8296
56116B403031k2238k9094l6943m4760n5523o9563q1578q8214r2104r4873r3071
56105A695070q5106p5313o6813n7045m4600l3677k7195k2082j5862j1316j0157
56094A245904q830n308l293n023o605n234m248o186p723o372n288o485o314k735
$$ y = [740336, 743562, 745854, 747687, 750481, 753317, 754781, 756086, 758927, 762159, 764030, 765750, 769350, 773968, 777864, 782263, 789375, 798325, 806802, 815215, 825548, 837558, 849691, 862320, 876581, 891543, 905984, 921406, 939799, 960001, 979770, 999811, 1022371, 1047650, 1075167, 1106912, 1145555, 1191411, 1244688, 1308548, 1385928, 1475022, 1571430, 1672425, 1775214, 1873688, 1961853, 2039009, 2107549, 2167874, 2219850, 2266747, 2312276, 2355030, 2390431, 2416580, 2433774, 2440513, 2435370, 2421327, 2403031, 2380793, 2351699, 2314756, 2269996, 2214473, 2144910, 2063332, 1975118, 1883014, 1788141, 1695070, 1609964, 1534651, 1467838, 1410793, 1366193, 1332516, 1305321, 1283239, 1267377, 1256061, 1245904, 1237074, 1231766, 1228473, 1223450, 1216845, 1211611, 1207363, 1201177, 1193454, 1187082, 1181794, 1175309, 1168995, 1166260]
56080A166260K9p65j234J372L225J603M67K756M665L350K676N442P599O265N649
56065A209359Q763J1209R686Q617J1567J4206J2721J1186J3379J5386J3625J2100
56053A351804J4215J5652J2940J0867J3556J6534J5495J4369J6711J7930J4513
56042A514586J2083J5476J9644J9320J8716K2541K6575K6619K7582L3911M0136
56031A777189M0743M0157M3038M4443L9951L5564L6898L8550L5093L2228L5709
56020B199563L9849L8766L8194M3897M9521M8643M7570N3005N8523N7118N5427
56009B730076O1235O8584O9939P0951P8112Q4395Q2989Q2330R0957J00738J02346
55998C622652J03580J14129J26286J30096J33373J46362J61002J66556J71275
$$ y = [1166260, 1166289, 1165524, 1164290, 1165662, 1168887, 1170490, 1170957, 1173713, 1178378, 1181728, 1184404, 1189846, 1197445, 1203710, 1209359, 1218122, 1229331, 1239017, 1247634, 1259201, 1273407, 1286128, 1297314, 1310693, 1326079, 1339704, 1351804, 1366019, 1381671, 1394611, 1405478, 1419034, 1435568, 1451063, 1465432, 1482143, 1500073, 1514586, 1526669, 1542145, 1561789, 1581109, 1599825, 1622366, 1648941, 1675560, 1703142, 1737053, 1777189, 1817932, 1858089, 1901127, 1945570, 1985521, 2021085, 2057983, 2096533, 2131626, 2163854, 2199563, 2239412, 2278178, 2316372, 2360269, 2409790, 2458433, 2506003, 2559008, 2617531, 2674649, 2730076, 2791311, 2859895, 2929834, 3000785, 3078897, 3163292, 3246281, 3328611, 3419568, 3520306, 3622652, 3726232, 3840361, 3966647, 4096743, 4230116, 4376478, 4537480, 4704036, 4875311]
55989D875311J86476K04014K12472K20477K39946K61964K74358K87052L13729
55980G075799L45018L67392L91126M30562M75136N10619N49748O09304O77358
55971A1432062P38036Q07020R05207J020452J135741J270765J452001J668187
55963B0429471J903260K185562K553490L004657L537953M214069N113117O271747
55955D9213326P732275R607141J2011112J4981520J8559895K2883513K8066068
55948A63054850L4020837M0410141M6401462N0029498M8084336L7734108J9189930
55941D38925162l269192k3511906l7207000m3617701m4510465m2078883l7904040
55934B06825975l3019247k8116663k3560706j9480457j5952674j3032346j0670168
$$ y = [4875311, 5061787, 5265801, 5478273, 5698750, 5938696, 6200660, 6475018, 6762070, 7075799, 7420817, 7788209, 8179335, 8609897, 9085033, 9595652, 10145400, 10754704, 11432062, 12170098, 12977118, 13882325, 14902777, 16038518, 17309283, 18761284, 20429471, 22332731, 24518293, 27071783, 30076440, 33614393, 37828462, 42941579, 49213326, 56945601, 66552742, 78563854, 93545374, 112105269, 134988782, 163054850, 197075687, 237485828, 283887290, 333916788, 382001124, 419735232, 438925162, 435655970, 412144064, 374937064, 331319363, 286808898, 244730015, 206825975, 173806728, 145690065, 122129359, 102648902, 86696228, 73663882, 62993714]
55927F2993714q745144p179919n943321m970463m172545l511125k987723k574488
55919B2908986k221112j914906j671777j479302j303763j141683j012660r11157
55911A1252626q12583p17361o44395n89504n31713m72581m30116m01146l66809
55902F286418l28397l02475k86751k64452k36843k19280k10103j94147j72448
55893D071522j59166j53236j41221j24395j15862j14167j05858r1234q2562p9468
55883B904353p0243n5109m4933l8951k6226p292P266J7853L4333N5134O8124P0836
55871B915145P0254O4237M3098Q999k5089n5074q6498j16813j35426j41352j43535
55860B397946j43629j35128j19350j05587r5006q0391o2302m9841m4707l9471
$$ y = [62993714, 54248570, 47068651, 41125330, 36154867, 31982322, 28471197, 25483474, 22908986, 20687874, 18772968, 17101191, 15621889, 14318126, 13176443, 12163783, 11252626, 10440043, 9722682, 9078287, 8488783, 7957070, 7484489, 7054373, 6653227, 6286418, 5958021, 5655546, 5368795, 5104343, 4867500, 4648220, 4438117, 4243970, 4071522, 3912356, 3759120, 3617899, 3493504, 3377642, 3263475, 3157617, 3066383, 2983821, 2904353, 2834110, 2779001, 2734068, 2695117, 2668891, 2661599, 2668865, 2686718, 2721051, 2776185, 2844309, 2915145, 2985399, 3049636, 3092734, 3101733, 3076644, 3021570, 2935072, 2818259, 2682833, 2541481, 2397946, 2254317, 2119189, 1999839, 1894252, 1799246, 1718855, 1656553, 1606712, 1562005, 1522534]
55850A522534l2496k9938l2088l1943k8393k7420k9320k7707k1955j8042j6593
55839A226639j2431o182l977n348l736Q87J977r01j595K71j354o787r811r633
55825A168019j1859j6862j8849j7318j7995k1344k1503j7758j6001j7502j7042
55814I73986j3532j1794j2417j0417n437l065m349m038p25J111N93K170O367Q471
55800I26924P883R318J3195J4344J1813J0570J1879J1445Q723Q721J2619J5839
55788A063273J7416K2170L1449M0720M8578N9231P3704Q7248R8143J10761J27309
55777A780002J44546J60856J78202J94400K01426J94225J74030J41467R4895L8218
55767C302267j8079o7029j09234j44672j68684j79410j81564j79170j71259j57784
$$ y = [1522534, 1490038, 1460100, 1428012, 1396069, 1367676, 1340256, 1310936, 1283229, 1261274, 1243232, 1226639, 1214208, 1208026, 1204049, 1198701, 1194965, 1195852, 1197829, 1196928, 1195333, 1195604, 1194250, 1187463, 1177652, 1168019, 1156160, 1139298, 1120449, 1103131, 1085136, 1063792, 1042289, 1024531, 1008530, 991028, 973986, 960454, 948660, 936243, 925826, 920389, 917324, 912975, 908937, 908212, 909323, 909916, 912086, 918453, 926924, 934807, 944125, 957320, 971664, 983477, 994047, 1005926, 1017371, 1026094, 1034815, 1047434, 1063273, 1080689, 1102859, 1134308, 1175028, 1223606, 1282837, 1356541, 1443789, 1541932, 1652693, 1780002, 1924548, 2085404, 2263606, 2458006, 2659432, 2853657, 3027687, 3169154, 3264049, 3302267, 3284188, 3217159, 3107925, 2963253, 2794569, 2615159, 2433595, 2254425, 2083166, 1925382]
55757A925382j42953j29414j15390j00511q8112p9102o9885n9142n0396m5417
55747A045060m1357l6849l4432l4392l2772k8231k4477k3141k0715j5454j0887
55736G42353r333q176n747m792o704q126o795n285n799o433n691n485o698o975
55722F50314n658n658p752q380n961l918m476m910l035j102j026p95J054K302
55708F00999J620J491L393M739L724K659L414M028K870J696J732J136p03r01J905
55693F33802M705N180N297P022Q820R398J0569J3274J4898J3554J1184R663P863
55680G55229N247M064N179N871M643M061N953Q007Q196Q505J1136J4795J7769
55667H58655K0951K4987K8194L0086L3166L8610M4211M9246N7205P0583Q7030
$$ y = [1925382, 1782429, 1653015, 1537625, 1437114, 1349002, 1269900, 1200015, 1140873, 1090477, 1045060, 1003703, 966854, 932422, 898030, 865258, 837027, 812550, 789409, 768694, 753240, 742353, 733020, 724844, 719097, 714305, 707601, 699475, 692680, 687395, 681596, 675163, 669472, 663987, 657289, 650314, 644656, 638998, 631246, 622866, 616905, 612987, 608511, 603601, 600566, 599464, 598438, 597643, 598697, 600999, 602619, 604110, 607503, 612242, 615966, 618625, 622039, 626067, 628937, 630633, 632365, 633501, 632798, 631897, 633802, 638507, 643687, 648984, 656006, 664826, 674224, 684793, 698067, 712965, 726519, 737703, 747366, 755229, 760476, 764540, 769719, 775590, 780233, 784294, 790247, 798254, 806450, 814955, 826091, 840886, 858655, 879606, 904593, 932787, 962873, 996039, 1034649, 1078860, 1128106, 1185311, 1255894, 1342924]
55656A342924J03748J21732J42399J63786J83357K00840K14932K20592K12970
55647B907280J91272J56609J10188N6596M744l8106p0445r2445j02091r8659q5915
55636B939028o7997m5342j7976J0529L5935N7004P2984Q0600P6846O1838L6069
55625C239518j513m9132r8978j42095j74269j94792k03144k00334j90360j76712
55615A808189j59828j40489j22281j07622r4714q1650p0200o2226n5812m8590
55605H64777m1762l7201l3620k9249k5249k2965k0725j7066j3980j3360j3204
55594E96396j1189q928q789r391q449p195p746q686p614n674n303n696m807l655
55580D93274m329n658n166l582l193l473k460q87q50j691j296j18q3p38k64Q71
$$ y = [1342924, 1446672, 1568404, 1710803, 1874589, 2057946, 2258786, 2473718, 2694310, 2907280, 3098552, 3255161, 3365349, 3421945, 3426689, 3388583, 3318138, 3225693, 3123602, 3024943, 2939028, 2871031, 2825689, 2807713, 2818242, 2854177, 2911181, 2984165, 3064765, 3141611, 3203449, 3239518, 3238005, 3188873, 3089895, 2947800, 2773531, 2578739, 2375595, 2175261, 1984901, 1808189, 1648361, 1507872, 1385591, 1277969, 1183255, 1101605, 1031405, 969179, 913367, 864777, 823015, 785814, 752194, 722945, 697696, 674731, 654006, 636940, 622960, 609600, 596396, 585207, 576279, 567490, 558099, 549650, 542455, 534709, 526023, 518409, 512735, 507432, 501736, 496929, 493274, 488945, 483287, 478121, 474539, 471346, 467873, 465413, 464526, 463676, 461985, 460689, 460571, 460488, 459750, 459486, 460357]
55564D60357R66N58J318K604K656K022K368L061K363Q44K38R7j015k194j508L90
55548D75125J293J103J325J884J587Q40Q44J105O16L60J715L579M027L597M001
55533E03001M954N307N926Q229J1099J2526J3147J4954J7668J9571K1007K3761
55521F61150K7913L2305L7282M4012N2045O0376O9772Q1325R3933J06118J18767
55510A384998J32969J46505J55857J60292J60518J54520J38497J11236P4305K9178
55500B648875k1998p3454j17578j49982j70336j79228j77483j67948j54507j39157
55490A297204j22465j06062r1886p9778o8596n8860n1520m5269l8222l1238k6454
55479E76854k3530k0579j7727j6335j5594j3566j0837r628r805r270p787o924
$$ y = [460357, 461323, 461881, 463199, 465803, 468459, 470481, 472849, 475910, 478273, 479117, 479355, 479452, 478437, 476243, 474735, 475125, 476418, 477521, 478846, 480730, 482317, 483157, 484001, 485106, 485722, 486082, 487797, 491376, 495403, 499000, 503001, 507955, 513262, 519188, 527417, 538516, 551042, 564189, 579143, 596811, 616382, 637389, 661150, 689063, 721368, 758650, 802662, 854707, 915083, 984855, 1066180, 1160113, 1266231, 1384998, 1517967, 1664472, 1820329, 1980621, 2141139, 2295659, 2434156, 2545392, 2619697, 2648875, 2626877, 2553423, 2435845, 2285863, 2115527, 1936299, 1758816, 1590868, 1436361, 1297204, 1174739, 1068677, 976791, 897013, 828417, 769557, 718037, 672768, 634546, 603308, 576854, 553324, 532745, 515018, 498683, 483089, 469523, 458686, 449058, 439253, 429983, 422196, 415272]
55467D15272o618n423l794l618m590m514l104k147k062j524m91l87j264j836k231
55452C71669l632n355n456m091l168k923k035r19j448l333m183l369k678k876
55438C26203k779k008j667j888j549o71l96n77j49K94o92k254k135n76lp58o35
55421C07760R79K029J512R18J195J346R34J124K284L143L087K908K777J907N66
55406C34469p3k80j410l071l477k680k556l370l397k339j923k591k664j513n92
55391C02533n60k86M95M26p63j531j352j563k565k882j909r94r01o60J87O63M20
55374B88758M05P68N50r2J17R00M69j181j905j014k74n58m32P99J600R92K17K52
55356B90371K65k78m06K07L19m52o10N61J618J401O77K28m34j335j282r2O22M4
$$ y = [415272, 408654, 403231, 399437, 395819, 391229, 386715, 383611, 381464, 379402, 377878, 377387, 377000, 375736, 373900, 371669, 368037, 362682, 357226, 353135, 349967, 347044, 345009, 344090, 342642, 339309, 335126, 331757, 329079, 326203, 323424, 321416, 319749, 317861, 316312, 315641, 315245, 314668, 314519, 314813, 314121, 311867, 309732, 309156, 309153, 308395, 307760, 308739, 310768, 312280, 313198, 314393, 315739, 316673, 317797, 320081, 323224, 326311, 329219, 331996, 333903, 334469, 334396, 334116, 332706, 329635, 326158, 323478, 320922, 317552, 314155, 311816, 309893, 307302, 304638, 303125, 302533, 301973, 301687, 302182, 302608, 301845, 300314, 298962, 297399, 294834, 291952, 290043, 289049, 288148, 287488, 287675, 288338, 288758, 289163, 289931, 290481, 290389, 290506, 291406, 291875, 290694, 288789, 287775, 287501, 286943, 286511, 287310, 288910, 289902, 290119, 290371, 290636, 290358, 289952, 290159, 290478, 290026, 289416, 289977, 291595, 292996, 293673, 293901, 293467, 292132, 290850, 290758, 291380, 291424]
55338B91424n32l7P34Q50N87J87p29j688j502m99l42j030o57J085K014J056r5
55321B90826j30r5p61q25M68J477Q23l82p72r73j804k261j329L4M69K51J75L7
55303B85228l69l43K72L98l15n99J66P49L53J00Q84J671J420P79M90j9r64j097
55285B88804K06J525J615J229J282J125J93m20J31P87M22k22j48K1n99j404j524
55268B93023j321j295r54j87o0q51j105j10N57l60j529j262k73p2k82L22J286
55251B85527J264L20m56q48j296j509r74j31K73K74J96n1k89R1P86N61o05j078
55233B82055k51K80n10j262p54o7l60n12P48K176J934P03L36O65K25p27o13N37
55215B84603J041L37k81J48J001J220N32n15j006l59Q46J317P51J33l0m21j195
$$ y = [291424, 290892, 290855, 291589, 292439, 293026, 293213, 292484, 290796, 289294, 288795, 288453, 287423, 286766, 287851, 289865, 290921, 290826, 290696, 290601, 289840, 289015, 289483, 290960, 291783, 291401, 290629, 289656, 287852, 285591, 284262, 284296, 284765, 285016, 285191, 285228, 284859, 284516, 284788, 285186, 284871, 284272, 284438, 285187, 285540, 285640, 286524, 288195, 289615, 290394, 290884, 290865, 289901, 288804, 289010, 290535, 292150, 293379, 294661, 295786, 295979, 295559, 295690, 296477, 296899, 296677, 296529, 296550, 295951, 294547, 293023, 291702, 290407, 289453, 289266, 289206, 288355, 287250, 287140, 287697, 287337, 285808, 284546, 284273, 284201, 283919, 284241, 285527, 286791, 287111, 286655, 285807, 284511, 283002, 282028, 281897, 282170, 282444, 282640, 282589, 282300, 282391, 283177, 283738, 283133, 282055, 281804, 282084, 281574, 280312, 279558, 279491, 279131, 278619, 279367, 281543, 283477, 284180, 284516, 285181, 285406, 284679, 284066, 284603, 285644, 285981, 285700, 285848, 286849, 288069, 288601, 288086, 287080, 286721, 287567, 288884, 289635, 289768, 289738, 289317, 288122]
55198B88122j243j41P68M60j92j56K1l75o47r8M49J43l14j10Q1m69q95k89N06
55179B85621L94l0K14N94L08L5N42Q98J09p41j44J193J615J329J644K322K070
55162B97973J043N53P04N33M5J71Q98J340J324J231P63m21j382r99Q2L38k45m68
55144C03483j71l10j108j788k038k171k064j391o03l63m11k12j14n12o20L50J475
55127B91432J345L83J72Q92J222N74k51n36l37J74P73Q51K02k86J62Q89Q58L15
55109B98834O9n5o01j041n57L22M84N3l3K16R5l51n38n54p37o64Q2Q30Q90Q86
55089B97630J488J804Q27m10j51J291K100J743J171O67l28j495j752j151p96r22
55073C01716p98l88l68n61j16P59Q70n3j036j434j408r94j15N91L62l47m58Q8
$$ y = [288122, 286879, 286738, 287506, 287966, 287774, 287618, 287639, 287264, 286617, 286519, 286968, 287111, 286797, 286687, 286768, 286299, 285404, 285115, 285621, 286015, 285985, 286199, 286793, 287101, 287136, 287678, 288576, 288685, 287944, 287800, 288993, 290608, 291937, 293581, 295903, 297973, 299016, 299569, 300273, 300806, 300851, 301022, 301920, 303260, 304584, 305815, 306578, 306157, 304775, 303776, 303858, 304196, 303951, 303483, 303312, 303002, 301894, 300106, 298068, 295897, 293833, 292442, 291839, 291476, 291065, 290853, 290739, 290227, 289607, 289957, 291432, 292777, 293160, 293332, 294224, 295446, 296020, 295769, 295233, 294896, 295070, 295843, 296694, 296896, 296610, 296772, 297661, 298519, 298834, 298903, 298848, 298247, 297206, 296649, 296971, 297455, 297508, 297475, 297691, 297786, 297435, 296897, 296343, 295606, 294942, 295024, 295854, 296744, 297630, 299118, 300922, 301749, 301339, 301188, 302479, 304579, 306322, 307493, 308160, 307832, 306337, 304585, 303434, 302638, 301716, 300918, 300530, 300162, 299601, 299485, 300244, 301114, 301061, 300025, 298591, 297183, 296189, 296074, 296665, 297027, 296680, 296222, 296310]
55055B96310N28P23J033J185P12J07J29L69O2l11J91J081J113L97O6K50J85o1
55037C04069J95O37M23n0L04J173J305P42O36R93O68m10j036p98m54j99N11J339
55019C10048J204K01m09k89k88n12j33P30Q56Rn94k81K62M80O29O84K41k81P8
55000C12635J082J409O70k68r93j849k463j864l88L93j9m84k88jP8N09J334J757
54982C11250J619J623J757J213J41k58K35N09J65J21O89R38N08K87N74M48l58
54965C21461o42L44J723K501K771K744K199J568K026L708N256N871O307P210P994
54950C73041Q171Q248Q437P881O058L743J720k04k247m061n659p564r389r772
54936C78403q457o886n991m999l335j988j815k003j580j087j348j796j463o57
$$ y = [296310, 296838, 297561, 298594, 299779, 300491, 300598, 300727, 301096, 301158, 300847, 301038, 302119, 303232, 303629, 303695, 303945, 304130, 304069, 304264, 304901, 305324, 305274, 305578, 306751, 308056, 308798, 309434, 310427, 311095, 310685, 309649, 308851, 308397, 308198, 308709, 310048, 311252, 311453, 311044, 310755, 310467, 309955, 309822, 310552, 311408, 311417, 310823, 310542, 310804, 311284, 311913, 312597, 312838, 312557, 312635, 313717, 315126, 315796, 315528, 314535, 312686, 310223, 308359, 307971, 308364, 308345, 307861, 307573, 307572, 307650, 308159, 309493, 311250, 312869, 314492, 316249, 317462, 317603, 317345, 317580, 318089, 318254, 318375, 319064, 320002, 320510, 320797, 321371, 321819, 321461, 320819, 321163, 322886, 325387, 328158, 330902, 333101, 334669, 336695, 340403, 345659, 351530, 357837, 365047, 373041, 381212, 389460, 397897, 405778, 411836, 415579, 417299, 417095, 414848, 410787, 405128, 397564, 388175, 378403, 369946, 363060, 357069, 352070, 348735, 346747, 344932, 342929, 341349, 340262, 338914, 337118, 335655, 334998]
54922C34998l09l44q8M12P11J077K044L280L949L973M042M585N378O061O480O743
54906C82992P102P549P509O445M670K918J186j028l500n360o456p411q193p985
54892C80438o745n586n130m768m007l307k981k538j798j482j966k444k167j561
54878C33958j423j730j931j734j139l59J0m69j211j214n64l20o97o93J76J006
54862C21666R36K54l94q16p90QJ097J280J86j153j694j441q30j12L89M45N22J125
54844C20678J620R97k23m70L66P57J13l74l5J16n63j054n22J84P3l71k84J59N21
54825C21688J040J754J876J095L76N17R84J135J342J927K114J238k6o01l80K19
54809C36298J070J968K378K318K549L286L790L759L932M687N437N928O709P648
$$ y = [334998, 334689, 334345, 334257, 334669, 335380, 336457, 338501, 341781, 345730, 349703, 353745, 358330, 363708, 369769, 376249, 382992, 390094, 397643, 405152, 411597, 416267, 419185, 420371, 419343, 415843, 410483, 404027, 396616, 388423, 380438, 373693, 368107, 362977, 358209, 354202, 350895, 347914, 345376, 343578, 342096, 340130, 337686, 335519, 333958, 332535, 330805, 328874, 327140, 326001, 325642, 325652, 325183, 323972, 322758, 322194, 321874, 321177, 320484, 320660, 321666, 322602, 322856, 322462, 321646, 320856, 320864, 321961, 323241, 323427, 322274, 320580, 319139, 318309, 318197, 318586, 319031, 319553, 320678, 322298, 323295, 323072, 322602, 322968, 323725, 323838, 323464, 323429, 323545, 322982, 321928, 321406, 321590, 321663, 321292, 321008, 321167, 321688, 322728, 324482, 326358, 327453, 327829, 328346, 329330, 330465, 331807, 333734, 335848, 337086, 337060, 336459, 336079, 336298, 337368, 339336, 341714, 344032, 346581, 349867, 353657, 357416, 361348, 366035, 371472, 377400, 384109, 391757]
54795C91757P592O348N373N495N535M241K031k00k426m502n530n473n768o955
54781C97518p430o051m286l941m428m174l342k981k741j691l95rj7R21K422K778
54765C62153J644M37J73O42J541K853M198N124N895O861P447O953N924N447N548
54750D22840N542N381N344M811K813m53l817o548q538r535r424q810q268p485
54736C83853o169n046m815m809m011k726j898j466q45m08q59j627j533p58n47
54721C46336j197j827j943j821j421m52N55N99k77j019j063p49l28K49O67M63
54705C36772l0l6M15N34Lp10j081q83n6R38J078J8j129j166m44q9k05p6L33M42
54685C34628K48K40L22O3k04J88R05R19R2o83q18m76J71J091J878K046J746J427
$$ y = [391757, 399349, 405697, 411070, 416565, 422100, 426341, 428372, 428172, 425746, 421244, 415714, 410241, 404473, 397518, 390088, 384037, 379751, 375810, 371382, 367208, 363866, 360885, 358144, 356453, 356058, 356049, 356032, 356953, 359375, 362153, 363797, 364234, 364407, 365049, 366590, 369443, 373641, 378765, 384660, 391521, 398968, 405921, 411845, 417292, 422840, 428382, 433763, 439107, 443918, 446731, 446278, 442461, 435913, 427375, 417840, 408416, 399606, 391338, 383853, 377684, 372638, 367823, 363014, 359003, 356277, 354379, 352913, 352068, 351660, 350801, 349174, 347641, 346883, 346336, 345139, 343312, 341369, 339548, 338127, 337675, 338230, 338829, 338552, 337533, 336470, 335721, 335393, 335642, 336309, 336772, 336742, 336706, 337121, 337655, 337658, 336948, 335867, 334984, 334928, 335866, 336944, 336962, 335833, 334667, 334223, 334134, 333929, 333853, 334186, 334628, 334876, 335116, 335438, 335501, 335297, 335485, 336390, 337309, 337401, 336718, 335900, 335424, 335595, 336686, 338564, 340610, 342356, 343783]
54667C43783J034L43l06m84m47n37l49M65J175R52L11K91O87N34p6j84L02M86
54649C47980J32o7J59K35j50o32r69j267j407j126o06j60L91J203J674J232M13
54632C47035Q2L8l96q80n49L40O74K89J09N75J172J505J659J557J128R43J531
54615C56812K241J988R26J38j39o11j372j713j465j273j394j384j047o21p1P14
54599C51729J168O88r6j6R01J545J496J294J076L62p20j355j255q44k92M58Q98
54582C57037N13M0O30J868K177J256M84O67R95O88J40r7k38n08n80k54J20K75
54564C65213K57k7o28r73m45M97Q18M21O2L6J12N04J452K135J558L96K43J047
54546C72678J180J59o25k90L30M44M81P79P61K53J59R01J531J186L84l7j51m23
$$ y = [343783, 344817, 345160, 344854, 344370, 343923, 343386, 343037, 343502, 344677, 345629, 345940, 346231, 346918, 347452, 347376, 347192, 347494, 347980, 348112, 348045, 348204, 348439, 348289, 347657, 346688, 345421, 344014, 342888, 342282, 342122, 342513, 343716, 345390, 346622, 347035, 347117, 347155, 346759, 345879, 345330, 345670, 346344, 346633, 346742, 347317, 348489, 349994, 351653, 353210, 354338, 355281, 356812, 359053, 361041, 361967, 362105, 361966, 361355, 359983, 358270, 356805, 355532, 354138, 352754, 351707, 351086, 351015, 351729, 352897, 353585, 353489, 353473, 354374, 355919, 357415, 358709, 359785, 360147, 359427, 358072, 356817, 355973, 355681, 356139, 357037, 357550, 357590, 358220, 360088, 362265, 363521, 364005, 364672, 365667, 366355, 366495, 366398, 366160, 365652, 365072, 364818, 364938, 365213, 365470, 365443, 364815, 363842, 363397, 363894, 364712, 365133, 365195, 365231, 365343, 365847, 367299, 369434, 370992, 371388, 371631, 372678, 373858, 374017, 373392, 373102, 373432, 373876, 374357, 375136, 375897, 376150, 376309, 377210, 378741, 379927, 380311, 380274, 380123, 379700]
54528C79700q42j202j441j332p07j33k95o95k62O93P78r2m11L45P95Q8o19j51
54510C74217Q47J239J142J083P56q5n95k8J007J570J840K365K822K705K453K711
54494C96049L063K713J878J460J691K114K549L256M314N479O522P247P531P537
54480D53403P487P038N561L231J067l64j472k686l820m703n481o011n872n261
54466D42117m933m915m395l186k136j756j639j603k071k788k717j785j321j934
54452D04938k514k270k140k975l728l020j345j62K55N37O37J11n10k07Q54J414
54436C89875P79n78j832k358j783m43N24L38m37p08k62L52Q20J127J084N59p5
54419C86982l69l47j32M15J175J462Q87jn19o88p15m14J73L57j83o29j71O99R49
$$ y = [379700, 378858, 377656, 376215, 374883, 374176, 374043, 373748, 373053, 372791, 373484, 374262, 374170, 373759, 374104, 374899, 374987, 374368, 374217, 375064, 376303, 377445, 378528, 379284, 379199, 378604, 378576, 379583, 381153, 382993, 385358, 388180, 390885, 393338, 396049, 399112, 401825, 403703, 405163, 406854, 408968, 411517, 414773, 419087, 424566, 431088, 438335, 445866, 453403, 460890, 467928, 473489, 476720, 477787, 477423, 475951, 473265, 469445, 464742, 459261, 453250, 447378, 442117, 437184, 432269, 427874, 424688, 422552, 420796, 419157, 417554, 415483, 412695, 409978, 408193, 406872, 404938, 402424, 400154, 398014, 395039, 391311, 388291, 386946, 386784, 387039, 387576, 388213, 388324, 387814, 387607, 388461, 389875, 390654, 390076, 388244, 385886, 384103, 383660, 384184, 384522, 384085, 383377, 383115, 383467, 384287, 385414, 386498, 387057, 386982, 386613, 386266, 386134, 386549, 387724, 389186, 390073, 390072, 389553, 388865, 388150, 387736, 387909, 388266, 388083, 387454, 387283, 387982, 388931]
54400C88931M60j00l36k50J92P96R21L33k23kO82J192J632K311K828K653K208
54383D04228K239K555K449K075K362L550M816N358N246N072N236N567N394M306
54369D60453K869K081J879R93j296m057o000p006p632p851p237n875m314k931
54355D14076j928j405r57O8J406J861J059J49n0l62j595k733k334q93j52o15j330
54338D04265j742k097k202j461k36K74k26p83p81o57p49o41r9K60j63j072j714
54321C90176j761j453j169j072r59n22J14L76R1j26K43P90Q23M63L54P11J273
54304C88352J863K307K143J168Qn77o21n98n39k86k14p79j636k017j777j306p75
54287C84716k34j39p60j388j147m06l04j038j643j498r74n45j78J89M16N87R30
$$ y = [388931, 389391, 389291, 388955, 388705, 388897, 389693, 390614, 390947, 390724, 390722, 391404, 392596, 394228, 396539, 399367, 402020, 404228, 406467, 409022, 411471, 413546, 415908, 419458, 424274, 429632, 434878, 439950, 445186, 450753, 456147, 460453, 463322, 465403, 467282, 468275, 466979, 462922, 456922, 449916, 442284, 434433, 427196, 421321, 417007, 414076, 412148, 410743, 409786, 409854, 411260, 413121, 414180, 414329, 414279, 413917, 412322, 409589, 407255, 406362, 406210, 405595, 404265, 402523, 400426, 398224, 396763, 396527, 396801, 396575, 395792, 395011, 394354, 393605, 392964, 392865, 393125, 392962, 391890, 390176, 388415, 386962, 385793, 384721, 383762, 383240, 383354, 383730, 383821, 383695, 383938, 384728, 385551, 386014, 386368, 387079, 388352, 390215, 392522, 394665, 395833, 395841, 395264, 394643, 394045, 393506, 393220, 393006, 392227, 390591, 388574, 386797, 385491, 384716, 384482, 384343, 383583, 382195, 381048, 380642, 380338, 379300, 377657, 376159, 375185, 374640, 374462, 374651, 375067, 375654, 376584]
54270C76584J192Q37on09k21M47R89J425J913K268K156J516O80J80K79N20J56
54253C90406p81j356j149r50j386j641o88Q37J326N02m19p45r42j106l88J393
54237C82913K847K670J279o7r78j729j922p18J555L015K104n60k758k963j662
54222C83026l23L77Q23J327J545J216P39N43M46J16k74l98l96n09m23L69J661
54205C89865K680L015K960K920L016L271L724M332N037N921O943P646P458O266
54191D55054M482K603Q99n66j830k878l623m090m579n254n758n691n308n166n135
54176D13160m574l504k689k406k141j738j794k404k611j787o88l44p05j085j201
54161C83489j065n80jk8p10j033l59N12N60O5k1M64J010J370J548J377R65R53
$$ y = [376584, 377776, 378613, 378607, 378098, 377877, 378324, 379313, 380738, 382651, 384919, 387075, 388591, 389271, 389451, 389730, 390250, 390406, 389625, 388269, 387120, 386170, 384784, 383143, 382455, 383292, 384618, 385120, 384701, 383956, 383014, 381908, 381520, 382913, 385760, 388430, 389709, 389642, 388664, 386935, 385013, 384295, 385850, 388865, 390969, 390409, 387651, 384688, 383026, 382703, 383080, 383903, 385230, 386775, 387991, 388730, 389273, 389719, 389835, 389561, 389163, 388767, 388258, 387835, 388204, 389865, 392545, 395560, 398520, 401440, 404456, 407727, 411451, 415783, 420820, 426741, 433684, 441330, 448788, 455054, 459536, 462139, 463038, 462472, 460642, 457764, 454141, 450051, 445472, 440218, 434460, 428769, 423461, 418295, 413160, 408586, 405082, 402393, 399987, 397846, 396108, 394314, 391910, 389299, 387512, 386824, 386480, 385775, 384690, 383489, 382424, 381844, 381843, 381815, 381105, 380072, 379713, 380225, 380785, 380850, 380829, 381293, 382303, 383673, 385221, 386598, 387563, 388516]
54143C88516J523J836J256L71M2K60O80J363J986J486l42j892j681l69M95P03
54127C96233R04Q53pr41p01M88J374J577J514R97k62j283p99O99J685J958K411
54110D06700K880K394J400J425K387K491J172J2J48P66Q65O69N75L95L96J504
54094D26179L619N309N946O700Q508J0563J1729J2206J2732J3277J3580J4075
54082E44423J5308J7180J9404K1933K4298K5379K4395K1283J5766P247l669j4533
54070G18414k2864k7883l0110l0176k8724k6571k4133k1214j7820j4463j1434
54059D63022q529n897m143l276k520j597j094j171j034l14J44l27j113j340j126
54044D29685r62o93J3Q15J176J153J084J010R60J201J752K191K274K195J968J355
$$ y = [388516, 390039, 391875, 393131, 393502, 393544, 393804, 394484, 395847, 397833, 399319, 398977, 397085, 395404, 395035, 395530, 396233, 397137, 397990, 397983, 397042, 396341, 396829, 398203, 399780, 401294, 402291, 402029, 400746, 399947, 400646, 402331, 404289, 406700, 409580, 411974, 413374, 414799, 417186, 419677, 420849, 420861, 421009, 421775, 422640, 423309, 423884, 424279, 424675, 426179, 429798, 435107, 441053, 447753, 456261, 466824, 478553, 490759, 503491, 516768, 530348, 544423, 559731, 576911, 596315, 618248, 642546, 667925, 692320, 713603, 729369, 736616, 732947, 718414, 695550, 667667, 637557, 607381, 578657, 552086, 527953, 506739, 488919, 474456, 463022, 454493, 448596, 444453, 441177, 438657, 437060, 435966, 434795, 433761, 433447, 433591, 433264, 432151, 430811, 429685, 428723, 428030, 428043, 428858, 430034, 431187, 432271, 433281, 434241, 435442, 437194, 439385, 441659, 443854, 445822, 447177]
54028D47177O95P57J500J900J513J105J259J495J353J236J383J121J07p11m09
54013D61481M55P61M98M72R17J444J907K366K518K093J532J472J705J308k14k362
53997D78353m092m665m303m024m434m824m183k924k434k880k928k001j356k008
53983D31297l026k963j929j017n70k89l11r09j587j640j267j134j168p88nO53
53967D13347J016J251J261R47P38J070J570J543J004N17K83J20J11N01J093J430
53951D27802J465J488J589J721K091K862L634L773L135K112J078J45o84j433k010
53936D48768k040j289k83P0l32o15k16M59J001J703K715L357L077K466K578L666
53920D65085N260O977Q558R688J0492J1793J4195J7182J9634K0752K0073J7222
$$ y = [447177, 447872, 448629, 450129, 452029, 453542, 454647, 455906, 457401, 458754, 459990, 461373, 462494, 462601, 461890, 461481, 461936, 462697, 463195, 463667, 464584, 466028, 467935, 470301, 472819, 474912, 476444, 477916, 479621, 480929, 480715, 478353, 474261, 469596, 465293, 461269, 456835, 452011, 447828, 444904, 442470, 439590, 436662, 434661, 433305, 431297, 428271, 425308, 423379, 422362, 421792, 421503, 421192, 420283, 418696, 417056, 415789, 414655, 413487, 412699, 412694, 413347, 414363, 415614, 416875, 417822, 418560, 419630, 421200, 422743, 423747, 424264, 424547, 424667, 424778, 425279, 426372, 427802, 429267, 430755, 432344, 434065, 436156, 439018, 442652, 446425, 449560, 451672, 452750, 452895, 452211, 450778, 448768, 446728, 445439, 445156, 445226, 444894, 444279, 444063, 444522, 445523, 447226, 449941, 453298, 456375, 458841, 461419, 465085, 470345, 477322, 485880, 495568, 506060, 517853, 532048, 549230, 568864, 589616, 609689, 626911]
53908F26911J2319O262kn959j0923j3801j4188j3109j1886j0836r681q552p674
53895E38881o721n374m089l428l107k584k161k539l583m430m605m277l640k815
53881D85528k136j815j539j041p49j229k203k828k738k184j459p89n18q22j384
53866D62094j831k165k457k527k381k446k821k930k391j701j405j313j122j134
53852D33470j530j656r06J90O55M01J5k40l90k32K57N12K30J08P14J288Q01l09
53834D33378o96j41K78j1l62o9O70J240J345J093Q80J101J609J744J282Q89J103
53817D45333J540J746K163L267M442M771M405M055L634K651J463Q08L60q13k471
53802D77354l283k819k094j897j750r68J63Q73Q88N60L97O91J282J709J755J724
$$ y = [626911, 639230, 645492, 645490, 639531, 628608, 614807, 600619, 587510, 575624, 564788, 555107, 546555, 538881, 532160, 526786, 522697, 519269, 516162, 513578, 511417, 508878, 505295, 500865, 496260, 491983, 488343, 485528, 483392, 481577, 480038, 478997, 478248, 477019, 474816, 471988, 469250, 467066, 465607, 464818, 464300, 463478, 462094, 460263, 458098, 455641, 453114, 450733, 448287, 445466, 442536, 440145, 438444, 437039, 435726, 434604, 433470, 431940, 430284, 429378, 429568, 430223, 430624, 430639, 430399, 430009, 429777, 430034, 430546, 430776, 430884, 431598, 432886, 433687, 433378, 432682, 432541, 432819, 432808, 432446, 432377, 433047, 434287, 435632, 436725, 437605, 438706, 440315, 442059, 443341, 444230, 445333, 446873, 448619, 450782, 454049, 458491, 463262, 467667, 471722, 475356, 478007, 479470, 480278, 480638, 479825, 477354, 474071, 471252, 469158, 467261, 465511, 464543, 464706, 465579, 466467, 467027, 467424, 468115, 469397, 471106, 472861, 474585]
53786D74585J847J956K041K523L344L601K846K007K005K165J209p30k367l126
53772D93906l490l831m106m444m809m456k957j388j147j908k230j849j739k116
53758D53436k167j757j653j874j557p73o74j366j429k13J059J320J223J681K228
53743D47484K044J455J241J272R39L03j75m89q24r83q18p42j041j151l29J222
53727D49408K534K940K570K072K148L074M412N463O012O245O077N237L936K681
53713E04809J415k34j874k622k648l174m470n161m239k656j973k268k465k077
53699D70363j526j095n33L48J332K079K306J856R04p0p03r29p01QQ61J369J609
53682D77478K096K749K747J773O70L27N27M33j85p78p63k5J050J767J666R90L11
$$ y = [474585, 476432, 478388, 480429, 482952, 486296, 489897, 492743, 494750, 496755, 498920, 500129, 499399, 497032, 493906, 490416, 486585, 482479, 478035, 473226, 468770, 465813, 464425, 463278, 461370, 459140, 457291, 455552, 453436, 451269, 449512, 447859, 445985, 444428, 443655, 442981, 441615, 440186, 439973, 441032, 442352, 443575, 445256, 447484, 449528, 450983, 452224, 453496, 454435, 454738, 454563, 454074, 453250, 452267, 451449, 450707, 449666, 448515, 448186, 449408, 451942, 454882, 457452, 459524, 461672, 464746, 469158, 474621, 480633, 486878, 492955, 498192, 502128, 504809, 506224, 505990, 504116, 501494, 498846, 495672, 491202, 486041, 481802, 479146, 477173, 474905, 472440, 470363, 468837, 467742, 467209, 467557, 468889, 470968, 473274, 475130, 476034, 475964, 475261, 474332, 473631, 473639, 474500, 475869, 477478, 479574, 482323, 485070, 486843, 487513, 487840, 488367, 488800, 488615, 487837, 487074, 487049, 488099, 489866, 491532, 492522, 492833]
53665D92833k39q17j062l88Q12J342R24P45J602K564K252Q10m76r14q91r50j194
53648D96953j481j540j073k51J68j95o35k50O91J002J62j015j448j023n27o57
53632D88881j252j554j172n36k22q3M57J349J851J596J043O63L69J07K96J138
53616D92931K003K168J792J599J870K216K197J725J070P19J013J645J890J545
53602E16383J246J514K015K243K399K927L527L479K829K471K915L580L627K991
53588E54146K318K159K537L172L724L908L626L213L252L916M601M547L737K789
53574F01645J947P62j024k844m088m943n885o689o622n504l911k446j391r64j255
53559E56788j804j832j090j45K32k35j111j513q96J71N02o9k88O77J835J792Q61
$$ y = [492833, 492594, 491777, 490715, 490327, 491139, 492481, 493405, 494150, 495752, 498316, 500568, 501378, 500902, 499988, 499097, 498147, 496953, 495472, 493932, 492859, 492608, 492776, 492581, 491946, 491696, 492387, 493389, 493551, 492536, 491088, 490065, 489538, 488881, 487629, 486075, 484903, 484367, 484145, 484062, 484519, 485868, 487719, 489315, 490358, 491021, 491390, 491497, 491793, 492931, 494934, 497102, 498894, 500493, 502363, 504579, 506776, 508501, 509571, 510290, 511303, 512948, 514838, 516383, 517629, 519143, 521158, 523401, 525800, 528727, 532254, 535733, 538562, 541033, 543948, 547528, 551155, 554146, 556464, 558623, 561160, 564332, 568056, 571964, 575590, 578803, 582055, 585971, 590572, 595119, 598856, 601645, 603592, 604354, 603330, 600486, 596398, 591455, 585570, 578881, 572259, 566755, 562844, 560398, 559007, 558043, 556788, 554984, 553152, 552062, 551917, 552149, 551914, 550803, 549290, 548394, 548565, 549067, 548998, 548710, 549387, 551222, 553014, 553875]
53542E53875M33P29P09Q1k03M09J333K102K987M057M823N324O261P587Q159P448
53526F06114O375N796N265M202L158K851K861K350J535J352K036K985L740M347
53512F54967M953N640O522P550Q412Q968R441J0031J0718J1627J3002J4598J5782
53499G82211J6441J7121J8021J8614J8612J8477J8576J8671J8653J8902J9367
53488I83666J9254J8289J7443J7612J8399J8971J9382K0085K0759K0604J9533
53477A193997J8210J7188J6512J5887J4799J2966J1018J0088J0296J0477R960
53466A341398R669J0591J1997J2292J1019Q979O846M757K863J276m24k692n226
53453A413345p401r232j1139j2979j4144j4451j4359j4391j4875j5923j7166j7854
$$ y = [553875, 554308, 555037, 555746, 555827, 555624, 556033, 557366, 559468, 562455, 566512, 571335, 576659, 582920, 590507, 598666, 606114, 612489, 618285, 623550, 627752, 630910, 633761, 636622, 638972, 640507, 641859, 643895, 646880, 650620, 654967, 659920, 665560, 672082, 679632, 688044, 697012, 706453, 716484, 727202, 738829, 751831, 766429, 782211, 798652, 815773, 833794, 852408, 871020, 889497, 908073, 926744, 945397, 964299, 983666, 1002920, 1021209, 1038652, 1056264, 1074663, 1093634, 1113016, 1133101, 1153860, 1174464, 1193997, 1212207, 1229395, 1245907, 1261794, 1276593, 1289559, 1300577, 1310665, 1320961, 1331438, 1341398, 1351067, 1361658, 1373655, 1385947, 1396966, 1405945, 1412791, 1417548, 1420411, 1421687, 1421263, 1418571, 1413345, 1405944, 1396712, 1385573, 1372594, 1358450, 1343999, 1329640, 1315249, 1300374, 1284451, 1267285, 1249431]
53441A249431j7791j7692j8015j8080j7110j5514j4250j3419j2598j2113j2785
53430A080064j4516j6205j7114j7342j7020j5995j4449j2934j1559r887p782n700
53418I19561l981k402o38J330L402N472P267Q496R299J0210J1559J3137J4501
53405I97213J5457J6278J7553J9514K1531K2624K2668K2645K3395K4690K5926
53394A229494K7127K8751L0902L3329L5863L8438M0918M3218M5202M6347M6175
53383A645764M5310M5193M6310M7511M7738M7440M7496M7688M7316M6504M5691
53372B159961M4398M1841L8360L5057L2298K9681K7140K4878K2470J9308J5805
53361B491197J2993J0977Q853O010K416k262q490j5747k2815k9323l5876m2385
$$ y = [1249431, 1231640, 1213948, 1195933, 1177853, 1160743, 1145229, 1130979, 1117560, 1104962, 1092849, 1080064, 1065548, 1049343, 1032229, 1014887, 997867, 981872, 967423, 954489, 942930, 933043, 925261, 919561, 915580, 913178, 912540, 913870, 917272, 922744, 930011, 938507, 947806, 958016, 969575, 982712, 997213, 1012670, 1028948, 1046501, 1066015, 1087546, 1110170, 1132838, 1155483, 1178878, 1203568, 1229494, 1256621, 1285372, 1316274, 1349603, 1385466, 1423904, 1464822, 1508040, 1553242, 1599589, 1645764, 1691074, 1736267, 1782577, 1830088, 1877826, 1925266, 1972762, 2020450, 2067766, 2114270, 2159961, 2204359, 2246200, 2284560, 2319617, 2351915, 2381596, 2408736, 2433614, 2456084, 2475392, 2491197, 2504190, 2515167, 2524020, 2530030, 2532446, 2530184, 2521694, 2505947, 2483132, 2453809, 2417933, 2375548]
53349B375548m7613n0803n2659n4182n5410n6001n6145n6202n5908n4661n2340
53338A783624m9503m6958m5323m4663m4446m4103m3557m2853m1633l9660l7607
53327A303318l6436l5964l4920l2657k9857k7359k5104k2715k0390j8525j6923
53316A002468j4976j2441r714p383n777m775l923k854j622n58J65O52J104J756
53302I42122K777M057N192O005O753P685Q667R571J0625J1921J3112J4006J5027
53289A057520J6433J7671J8229J8687J9955K1852K3354K4127K4735K5482K6010
53278A294055K6178K6305K6374K5770K4187K2186K0560J9609J9106J8546J7431
53267A540307J5714J3917J2327J0365P416L998J246p11k904o012r498j2535j4991
$$ y = [2375548, 2327935, 2277132, 2224473, 2170291, 2114881, 2058880, 2002735, 1946533, 1890625, 1835964, 1783624, 1734121, 1687163, 1641840, 1597177, 1552731, 1508628, 1465071, 1422218, 1380585, 1340925, 1303318, 1266882, 1230918, 1195998, 1163341, 1133484, 1106125, 1081021, 1058306, 1037916, 1019391, 1002468, 987492, 975051, 965337, 957954, 952177, 947402, 943479, 940625, 939003, 938445, 938610, 939262, 940366, 942122, 944899, 948956, 954148, 960153, 966906, 974591, 983258, 992829, 1003454, 1015375, 1028487, 1042493, 1057520, 1073953, 1091624, 1109853, 1128540, 1148495, 1170347, 1193701, 1217828, 1242563, 1268045, 1294055, 1320233, 1346538, 1372912, 1398682, 1422869, 1445055, 1465615, 1485224, 1504330, 1522876, 1540307, 1556021, 1569938, 1582265, 1592630, 1600046, 1604044, 1605290, 1604579, 1601675, 1595663, 1586165, 1573630, 1558639]
53254A558639j7279j9803k2793k6124k9019l0522l0487k9864k9750l0407l1221
53243A261370l1402l0749k9880k9461k9144k7879k5514k3339k2441k2360k2203
53232I66998k2252k3222k4558k4943k4260k3551k3127k2138k0271j8407j7141
53221G23128j5881j3954j1717r919q712p851p202o654n980n178m582m405m548
53208F16545m840n052m793l926k951k493k560k887l536m383m566l530k209j968
53194E66851k583k654j790r65o46j96N55P48P2n05k61J92Q8k85k92n2m9l91r16
53175E56921j508j871j690j250j163j316j024l61k23p80j137r06r14j729k704
53160E38345l181l465l848l721k685j594j508k264k978l253l113k488j634j394
$$ y = [1558639, 1541360, 1521557, 1498764, 1472640, 1443621, 1413099, 1382612, 1352748, 1322998, 1292591, 1261370, 1229968, 1199219, 1169339, 1139878, 1110734, 1082855, 1057341, 1034002, 1011561, 989201, 966998, 944746, 921524, 896966, 872023, 847763, 824212, 801085, 778947, 758676, 740269, 723128, 707247, 693293, 681576, 671657, 662945, 655094, 647892, 641238, 635258, 630080, 625498, 621093, 616545, 611705, 606653, 601860, 597934, 594983, 592490, 589930, 587043, 583507, 579124, 574558, 571028, 568819, 566851, 564268, 561614, 559824, 558859, 558213, 558017, 558572, 559320, 559392, 558887, 558626, 558818, 558906, 558621, 558329, 558277, 558228, 557837, 556921, 555413, 553542, 551852, 550602, 549439, 548123, 547099, 546738, 546515, 545735, 544598, 543692, 542778, 541049, 538345, 535164, 531699, 527851, 524130, 521445, 519851, 518343, 516079, 513101, 509848, 506735, 504247, 502613, 501219]
53146E01219k089k708k125o71L40K73l34p61p65n09k90k54j80J90N70M33k0L7
53128D92356P72J409J493J542K019K616L014L518M290M822M729M255L561K387
53114E32783R68J73R7l64j827l317l812l718l764l560k524j369j193j664j533
53099E05376n82K12K06l68j157j896k092j433m60Pj10l73o94j114j207n71L37
53082D94081Q05R51J333J795J675R57K81k8j27MN05J080J235R79O54L15q8k27
53064E06180O5J41o86k029k858k886k637k393j997j556j459j708j918j958j871
53049D80430j486p86l83p47j262r94j79R3m40r38q83o52n46k98J17J46m21j023
53031D69748j184j164j343j546j390r24m12J13P50J345J501J030K88k6M22J089
$$ y = [501219, 499130, 496422, 494297, 493626, 493966, 494239, 493905, 493144, 492379, 491870, 491580, 491326, 491146, 491336, 491906, 492339, 492319, 492356, 493128, 494537, 496030, 497572, 499591, 502207, 505221, 508739, 513029, 517851, 522580, 526835, 530396, 532783, 533751, 533924, 534021, 533657, 531830, 528513, 524701, 520983, 517219, 513659, 511135, 509766, 508573, 506909, 505376, 504794, 505006, 505212, 504844, 503687, 501791, 499699, 498266, 497806, 497813, 497703, 497330, 496636, 495522, 494315, 493744, 494081, 494886, 495837, 497170, 498965, 500640, 501597, 501878, 501850, 501723, 501727, 502232, 503312, 504547, 505526, 506180, 506495, 506407, 506180, 506245, 506386, 505700, 503671, 500813, 497927, 495290, 492897, 490900, 489344, 487885, 486177, 484259, 482301, 480430, 478944, 478158, 477775, 477028, 475766, 474772, 474593, 474686, 474246, 473308, 472425, 471773, 471227, 470929, 471046, 471192, 470771, 469748, 468564, 467400, 466057, 464511, 463121, 462197, 461785, 461898, 462648, 463993, 465494, 466524, 466812, 466786, 467208, 468297]
53015D68297J123M55r7l1J79j4l87n56p51j220j432q00J84M93k1o26r24j038q36
52996D61998%J107J621J388J088J102J033N96J60J26L70O15Q30J048J202J310
52980D75594J454J603J774K154K676K771K152J511J664K226K086J029q8p62j335
52965D96509j875j741p40K12J81n98j300j652j912k121k004j530j029p99p46n09
52949D78346J24Q79J189Q84M41K47j02j166k531l066k344j162m65l66m60n36n21
52932D69391j61P13J705K045J371J59o81o68j39K55L26L67M93M13km31n97n83
52914D73976l47M59J778K836L102L051L258L343K591J266K54k54q09j521j839
52899D91144j566j201j079r82p38n19m05k54j71m31q57q65l42J77L38L54L78J06
$$ y = [468297, 469420, 469875, 469778, 469747, 469926, 469912, 469525, 468969, 468218, 466998, 465566, 464766, 464950, 465443, 465422, 464796, 463872, 462834, 461998, 461998, 463105, 464726, 466114, 467202, 468304, 469337, 469933, 470093, 470219, 470589, 471204, 472034, 473082, 474284, 475594, 477048, 478651, 480425, 482579, 485255, 488026, 490178, 491689, 493353, 495579, 497665, 498694, 498606, 497844, 496509, 494634, 492893, 492153, 492365, 492546, 491948, 490648, 488996, 487084, 484963, 482959, 481429, 480400, 479601, 478855, 478346, 478470, 479349, 480538, 481422, 481863, 482110, 482008, 480842, 478311, 475245, 472901, 471739, 471274, 470908, 470448, 469912, 469391, 469230, 469943, 471648, 473693, 475064, 475223, 474542, 473874, 473735, 473990, 474316, 474683, 475176, 475589, 475587, 475156, 474559, 473976, 473629, 474088, 475866, 478702, 481804, 484855, 488113, 491456, 494047, 495313, 495567, 495313, 494504, 492983, 491144, 489578, 488377, 487298, 486316, 485578, 485059, 484654, 484400, 484229, 483798, 482941, 482076, 481734, 481911, 482249, 482603, 482981, 483087]
52881D83087o13j256j101RJ501K589K842K507K145J928J528R23P07J254K002K281
52865E02333K321K636K855K204Q65j90o71j194k031k683k944l245l678l640k894
52850D90044k125j938k045j881j424r18m09PM4k13j65M87J218J446J393J721K547
52833D87789L377L814M013M442N434O918Q488R768J0529J0388Q736N387J057l152
52819E66988o589q955r808q940p090n538m888m800m739m343l270j610l11l35j332
52804D94440k049k039j960k083j709n38N67P80M33K62K79J32k4J95O70R87J087
52787D89430J127R97N13r3l72k03J83N71Q96J101J140J005N94k53j423k367k479
52770D90367j623l53M19K15m26m76K60Q48N87N3J23N30L79l39q19q55r97j315
$$ y = [483087, 482474, 481218, 480117, 480126, 481627, 484216, 487058, 489565, 491710, 493638, 495166, 496089, 496796, 498050, 500052, 502333, 504654, 507290, 510145, 512349, 513214, 513024, 512353, 511159, 509128, 506445, 503501, 500256, 496578, 492938, 490044, 487919, 485981, 483936, 482055, 480631, 479713, 479304, 479311, 479355, 479142, 478977, 479464, 480682, 482128, 483521, 485242, 487789, 491166, 494980, 498993, 503435, 508869, 515787, 524275, 534043, 544572, 554960, 563696, 569083, 570140, 566988, 560399, 551444, 541636, 532696, 525606, 520068, 515180, 510380, 505641, 501298, 498028, 496418, 496107, 495772, 494440, 492391, 490352, 488392, 486309, 484600, 484062, 484629, 485409, 485842, 486104, 486383, 486515, 486491, 486686, 487356, 488343, 489430, 490557, 491554, 492067, 491974, 491602, 491399, 491582, 492153, 493049, 494150, 495290, 496295, 496889, 496636, 495213, 492846, 490367, 488744, 488391, 488810, 489025, 488599, 488123, 488383, 489231, 489818, 489871, 489994, 490524, 490903, 490564, 489745, 488890, 487893, 486578]
52752D86578j189n05P7K65M65P22M84k06m23J89P43N62K50N44R89P45N3j04N99
52733D90838J530K014J829J117K95j15KK41K64K24L27M95O75R44J134Q51J82k97
52715E02550m24o74j174j299p78l00m77q61p68l80k85m47l89k6M01Q33J212J156
52697D97870N12j77k92O5M97J042J751K031J316J61k27M87J457J849J665J276
52681E11283Q60M72J83o8m05o68m79J70O56L55o05j396j317m95L05N33L89M67
52663E10240J069J970K658K677J972J180J145J816K061J082l97j102r67r48j327
52648E23129j265j94J355K617L511M389N470O670P468O918M510J067j960l976
52634E59709n280n903n531m587m049l964l386k117j160j026r13k01N29O49M74
$$ y = [486578, 485389, 484884, 484961, 485226, 485691, 486413, 486897, 486691, 486268, 486457, 487200, 487762, 488012, 488556, 489545, 490290, 490343, 490239, 490838, 492368, 494382, 496211, 497328, 497623, 497508, 497510, 497751, 498015, 498239, 498566, 499061, 499736, 500680, 501814, 502665, 502847, 502550, 502126, 501452, 500278, 498979, 498201, 497901, 497424, 496563, 495795, 495415, 495130, 494683, 494294, 494268, 494669, 495502, 496714, 497870, 498382, 498205, 497913, 497978, 498475, 499517, 501268, 503299, 504615, 504776, 504549, 505036, 506493, 508342, 510007, 511283, 512143, 512615, 512798, 512730, 512325, 511657, 511178, 511348, 512004, 512359, 511754, 510358, 509041, 508546, 508851, 509384, 509773, 510240, 511309, 513279, 515937, 518614, 520586, 521766, 522911, 524727, 526788, 527870, 527473, 526371, 525404, 524456, 523129, 521864, 521670, 523025, 525642, 529153, 533542, 539012, 545682, 553150, 560068, 564578, 565645, 563685, 559709, 554429, 548526, 542995, 538408, 534359, 530395, 527009, 524892, 523732, 522706, 521793, 521592, 522121, 522770, 523244]
52619E23244L41j36j023j431q91k96n00r89r60p62j062j420r94l7M80L14k6k18
52601E13634k39ML08K6r10j441p87K93O32L68M54J002J279R70M06j48n70n55n2
52582E14674M17N73R58J883K565K252J437R91P52J29o13q84r62j325j438n98N50
52565E21361P95K99K23P77J083Q69P51R15R32Q68J222J717J477N47q0pK01K48
52547E34198M36O81M51m8P5R38J621J603J407J485J570J462J472J768K092K361
52531E53572K724K919K401J268J55p06j460j723q75P06J908K523L422M882N973
52516E77689N953N173M128K741J032m87j623k852m350n521n903n763n418m665
52502E60134l338j846p81m38p70j282j118M3J285J512R54O21N88J29n72l91Q05
$$ y = [523244, 523585, 523449, 522426, 520995, 520104, 519808, 519308, 518319, 517359, 516597, 515535, 514115, 513121, 513084, 513564, 513878, 513852, 513634, 513395, 513399, 513707, 513733, 512823, 511382, 510595, 510888, 511520, 511888, 512342, 513344, 514623, 515593, 515999, 515851, 515281, 514726, 514674, 515091, 515664, 516622, 518505, 521070, 523322, 524759, 525750, 526502, 526631, 526018, 525134, 524172, 522847, 521409, 520811, 521361, 522156, 522455, 522678, 523455, 524538, 525407, 526158, 527073, 528005, 528873, 530095, 531812, 533289, 533836, 533756, 533749, 533950, 534198, 534634, 535315, 535766, 535718, 535793, 536731, 538352, 539955, 541362, 542847, 544417, 545879, 547351, 549119, 551211, 553572, 556296, 559215, 561616, 562884, 563039, 562333, 560873, 559150, 558275, 558981, 560889, 563412, 566834, 571716, 577689, 583642, 588815, 592943, 595684, 596716, 596229, 594606, 591754, 587404, 581883, 575980, 570217, 564799, 560134, 556796, 554950, 554169, 553731, 552961, 551679, 550561, 550604, 551889, 553401, 554355, 554976, 555564, 555693, 555121, 554730, 555535]
52485E55535J724J540R39P56Q70R58J140J363J316J389K567M780O612P145O871
52470E95505O296N078L227J714Q92l20k594m804n615n431n477n883n925n473m975
52455E66215m494l820l026k147r78J77L54n72j252o36M82Q23N00L43K33m02j081
52438E50719q51Q8P26R78J588K548K984K617K062J660J176O98P38J270J671J780
52422E72452K043K520K601J965J016L19J38N60J354J852J735J754K803M383N064
52407F02559M525M065M724N815N774L850O31k585m638n308n455n963o545o167
52393E95282m643l023k207j961j582q29K27J591L079M143M519M677N151N727N799
52378F15950N316M803M408L531J541j311l998n603n946n397m375l234k429k339
$$ y = [555535, 557259, 558799, 559738, 560494, 561364, 562322, 563462, 564825, 566141, 567530, 570097, 574877, 581489, 588634, 595505, 601801, 606879, 610106, 611820, 612712, 612392, 609798, 604994, 599379, 593948, 588471, 582588, 576663, 571190, 566215, 561721, 557901, 554875, 552728, 551750, 551927, 552281, 551709, 550457, 549821, 550303, 551126, 551626, 551969, 552202, 551800, 550719, 549868, 549956, 550682, 551660, 553248, 555796, 558780, 561397, 563459, 565119, 566295, 566993, 567731, 569001, 570672, 572452, 574495, 577015, 579616, 581581, 582597, 582916, 583054, 583614, 584968, 586820, 588555, 590309, 593112, 597495, 602559, 607084, 611149, 615873, 621688, 627462, 631312, 631943, 629358, 624720, 619412, 613957, 607994, 601449, 595282, 590639, 587616, 585409, 583448, 581866, 581037, 581264, 582855, 585934, 590077, 594596, 599273, 604424, 610151, 615950, 621266, 626069, 630477, 634008, 635549, 634238, 630240, 624637, 618691, 613294, 608919, 605685, 603256, 600917]
52364F00917k839l326l326k866k209j605j395j910k883l371k619q77R34K089K384
52349E77098J967J283R01R88J153J125J316K190L381M016L843L462L470L842M253
52334F14288M613N113N852O556O590N535L738K041Q24k26j274j833j572j017q41
52319F48387q61l56Q65K392L927N415O671P516Q128Q645Q643P784O690O370O771
52304G26987O750N534L457J156j067k883l793l775l425l086k395j122J38O24L35
52289G23435j54m83o05l94L35J385K226K492K269J932J810K038K536L077L365
52274G45264L130K388J696J806K746L543L274K285J743K148K902L443M049N211
52260G85628O706P839Q143P494N842L332N63j699l084l766m075m197m126l739
$$ y = [600917, 598078, 594752, 591426, 588560, 586351, 584746, 583351, 581441, 578558, 575187, 572568, 571691, 572625, 574714, 577098, 579065, 580348, 581249, 582237, 583390, 584515, 585831, 588021, 591402, 595418, 599261, 602723, 606193, 610035, 614288, 618901, 624014, 629866, 636422, 643012, 648547, 652285, 654326, 655150, 654924, 653650, 651817, 650245, 649228, 648387, 647526, 647170, 648035, 650427, 654354, 659769, 666440, 673956, 682084, 690729, 699372, 707156, 713846, 720216, 726987, 733737, 739271, 742728, 743884, 742817, 739934, 736141, 732366, 728941, 725855, 723460, 722338, 722476, 723100, 723435, 723281, 722798, 722193, 721799, 722134, 723519, 725745, 728237, 730506, 732438, 734248, 736286, 738822, 741899, 745264, 748394, 750782, 752478, 754284, 757030, 760573, 763847, 766132, 767875, 770023, 772925, 776368, 780417, 785628, 792334, 800173, 808316, 815810, 821652, 824984, 825547, 823848, 820764, 816998, 812923, 808726, 804600, 800861]
52246H00861k975k040j307r18o64l37l0J35L24P93J461K011K382K892L763M683
52230H11034N127N082N185N955P091P814P872P798Q066Q525Q944R602J0772J2051
52216I20918J2868J3425J4276J5036J4523J2438R925P959O072L348R1k548m196
52203A024135n449o620p246p025o347n613m752l750k934k297j215N24K041K364
52189I75816J780J360J444J545J561K009K893L388L107K830L269L912L875L309
52175A012098L037L168L138K948L318M472N670O226O149N513M079K028L43k30
52161A061957j02q9k09J23R70J758K107K180K161J956J433N20q87k685m203m643
52145A062347l999l154k890l142l304k917j888m10J095K250L165M415O263Q097
$$ y = [800861, 797886, 795846, 794539, 793621, 792957, 792620, 792590, 792725, 793049, 793842, 795303, 797314, 799696, 802588, 806351, 811034, 816161, 821243, 826428, 832383, 839474, 847288, 855160, 862958, 871024, 879549, 888493, 898095, 908867, 920918, 933786, 947211, 961487, 976523, 991046, 1003484, 1013409, 1021368, 1027440, 1030788, 1030879, 1028331, 1024135, 1018686, 1012066, 1004820, 997795, 991448, 985835, 981083, 977333, 974399, 972102, 970887, 971411, 973452, 975816, 977596, 978956, 980400, 981945, 983506, 985515, 988408, 991796, 994903, 997733, 1001002, 1004914, 1008789, 1012098, 1015135, 1018303, 1021441, 1024389, 1027707, 1032179, 1037849, 1044075, 1050224, 1055737, 1059816, 1061844, 1062187, 1061957, 1061855, 1061766, 1061557, 1061680, 1062650, 1064408, 1066515, 1068695, 1070856, 1072812, 1074245, 1074765, 1073878, 1071193, 1066990, 1062347, 1058348, 1055194, 1052304, 1049162, 1045858, 1042941, 1041053, 1040643, 1041738, 1043988, 1047153, 1051568, 1057831, 1065928]
52131A065928Q950Q606P954Q163R676J1925J3937J5085J5410J5325J5009J3979
52119A209947J1284O312n12p769j3977j8482k1526k3488k4342k3832k2058j9574
52107A051983j6921j4166j1141p999n287l302j623M24K921N377P495R428J1164
52094A028353J2213J2258J1658J0872R755P937N618L379J502Q0m18M92K407M277
52080A110383N598O741P989Q973R233Q692P374N293K840O33j300l448n744p299
52066A155958p628p334p036o383m847k801j021L50J515K190K050J741K384M082
52052A133220N750O494O429O059N577N053M605M123L208J817O93P50K083L732
52038A189593M444L756K321J172O96M87J20m07r91j627j998j517k01J025J589
$$ y = [1065928, 1074878, 1083484, 1091438, 1099601, 1109277, 1121202, 1135139, 1150224, 1165634, 1180959, 1195968, 1209947, 1221231, 1227543, 1227031, 1219262, 1205285, 1186803, 1165277, 1141789, 1117447, 1093615, 1071557, 1051983, 1035062, 1020896, 1009755, 1001756, 996469, 993167, 991544, 991968, 994889, 1000266, 1007761, 1017189, 1028353, 1040566, 1052824, 1064482, 1075354, 1085109, 1093046, 1098664, 1102043, 1103545, 1103625, 1103207, 1103699, 1106106, 1110383, 1115981, 1122722, 1130711, 1139684, 1148917, 1157609, 1164983, 1170276, 1173116, 1173749, 1172449, 1169001, 1163257, 1155958, 1148330, 1140996, 1133960, 1127577, 1122730, 1119929, 1118908, 1119258, 1120773, 1122963, 1125013, 1126754, 1129138, 1133220, 1138970, 1145464, 1151893, 1157952, 1163529, 1168582, 1173187, 1177310, 1180518, 1182335, 1183028, 1183778, 1185861, 1189593, 1194037, 1197793, 1200114, 1201286, 1201982, 1202469, 1202589, 1202182, 1201191, 1199564, 1197566, 1196049, 1195848, 1196873, 1198462]
52023A198462K342M599Q347J2240J5284J7739K0154K2206K2867K1426J8131J4004
52011A377801J0009O280K318j923n508p525q231q650r280r878j0304j0868j1717
51998A312524j2613j3515j4778j6538j8299j9388j9484j8546j6597j3845j0742
51987A138179p821n573m470m821o462q870j1614j4606j7867k1196k3937k5102
51975I85840k4038k1226j8075j5583j3514j1260q996p359o330n238l780k280r64
51962H47197L06J516K477L389M703O218P021O632N613M662L713K311M84j265k553
51947H92424l302l562l485l304l074k557j560l16O75J139J314J850L397O080R348
51932H95067J2442J4929J6749J7931J8505J8463J7455J4806J0291M768n45n312
$$ y = [1198462, 1200804, 1205403, 1213750, 1225990, 1241274, 1259013, 1279167, 1301373, 1324240, 1345666, 1363797, 1377801, 1387810, 1394090, 1396408, 1394485, 1388977, 1381452, 1373221, 1364571, 1355291, 1345413, 1335109, 1324241, 1312524, 1299911, 1286396, 1271618, 1255080, 1236781, 1217393, 1197909, 1179363, 1162766, 1148921, 1138179, 1130358, 1124785, 1120315, 1115494, 1109032, 1100162, 1088548, 1073942, 1056075, 1034879, 1010942, 985840, 961802, 940576, 922501, 906918, 893404, 882144, 873148, 865789, 859459, 854221, 850441, 848161, 847197, 847503, 849019, 851496, 854885, 859588, 865806, 872827, 879459, 885072, 889734, 893447, 895758, 896242, 894977, 892424, 889122, 885560, 882075, 878771, 875697, 873140, 871580, 871264, 871939, 873078, 874392, 876242, 879639, 885719, 895067, 907509, 922438, 939187, 957118, 975623, 994086, 1011541, 1026347, 1036638, 1041406, 1040861, 1035549]
51920A035549r996j4568j8015j9466j9226j8278j7163j5690j3477j0518p321m708
51908H67123l317l064l153k760j623l6J667L453N519P832R902J1160J1626J1794
51894I16123J1835J1460J0819J0930J2746J6194K0661K5893L1701L7230M1450
51883A147042M4028M4773M2485L5493K3641Q886o143j9439k9634l5983l8835l9318
51871A176996l8093l5057l0483k5634k1733j9012j7197j6272j6290j6943j7765
51860I22517j8457j8732j8409j7779j7246j6420j4391j1170p983n636l506q28
51848G71960J908L724M656N515O624P722Q757R808J0403R845Q167N978L456L11
51834H58834l191o014p472q038q653r604j0346j0202r076p521o152n041l880k735
$$ y = [1035549, 1025553, 1010985, 992970, 973504, 954278, 936000, 918837, 903147, 889670, 879152, 871831, 867123, 863806, 860742, 857589, 854829, 853206, 853170, 854837, 858290, 863809, 871641, 881543, 892703, 904329, 916123, 927958, 939418, 950237, 961167, 973913, 990107, 1010768, 1036661, 1068362, 1105592, 1147042, 1191070, 1235843, 1278328, 1313821, 1337462, 1346348, 1340205, 1320766, 1291132, 1255149, 1216314, 1176996, 1138903, 1103846, 1073363, 1047729, 1025996, 1006984, 989787, 973515, 957225, 940282, 922517, 904060, 885328, 866919, 849140, 831894, 815474, 801083, 789913, 781930, 776294, 772788, 771960, 773868, 777592, 782248, 787763, 794387, 802109, 810866, 820674, 831077, 840922, 849089, 855067, 858523, 858834, 855643, 849629, 842157, 834119, 825466, 815862, 805516, 795314, 786238, 778717, 772565, 767524, 763644, 760909]
51820G60909k163k316k398j556l2J173J656K021K933M286N469O027N882N234M432
51805G91557L801L402L017K389J533Q54R96K342M529O617P936Q651R385J0448
51791H57457J1613J2349J2015R932N811K32n468j0031j3043j4963j6334j7072
51779H32498j6596j4770j2383j0476r314q431p473o511n605m651l721k999k234
51766G27334r37P37K042K810L788N233O037N065K868J084M13J61l40q28r27r24
51750G53616j152j166j99J646L221L484K531J275L59k83p50o69K86J695K805L467
51734G70166M074M616M549L839L387L997N507P313R286J1494J3408J4022J2802
51721H68460J0151P120M877M159M908O545Q650J0948J2530J1888Q353L008k279
$$ y = [760909, 758746, 756430, 754032, 752476, 752444, 753617, 755273, 757294, 760227, 764513, 769982, 776009, 781891, 787125, 791557, 795358, 798760, 801777, 804166, 805699, 806553, 807549, 809891, 814420, 821037, 828973, 837624, 847009, 857457, 869070, 881419, 893434, 903366, 909177, 909409, 903941, 893910, 880867, 865904, 849570, 832498, 815902, 801132, 788749, 778273, 768959, 760528, 753055, 746544, 740939, 736288, 732567, 729568, 727334, 726397, 727134, 729176, 731986, 735774, 741007, 747044, 752109, 754977, 756061, 756474, 756635, 756295, 755467, 754540, 753616, 752464, 751298, 751099, 752745, 755966, 759450, 761981, 763256, 763615, 763332, 762582, 761913, 762199, 763894, 766699, 770166, 774240, 778856, 783405, 787244, 790631, 794628, 800135, 807448, 816734, 828228, 841636, 855658, 868460, 878611, 885731, 890608, 894767, 899675, 906220, 914870, 925818, 938348, 950236, 958589, 961597, 959318]
51708I59318o221q069p117l442J363N373Q085R850R729N562l172j3791k2573k7788
51694I07107k9978l0012k8135k4658k0469j6517j3285j0898r263p998o626n115
51682G04153l862l019k167r38M18J498K490L940N811P418Q454R470J1022J2794
51668G57482J4046J4497J4269J3279J1294Q486N262J737k054n527p831q842r094
51655H07004q787p578n530l380j509M54K636M251M504L401J162k355o859j0845
51641G76569j2642j2004j0068q046o593n964n841n238l471j128N75J320J859K788
51627G12116L839M427M208L131J524J43m07k88N2P45K161L880M920N084N212N846
51611G56593O421O121M836K924O73j458k579k046j81K125M362O667R252J1894
$$ y = [959318, 953097, 945028, 937911, 934469, 935832, 941205, 949290, 959140, 968869, 974431, 971259, 957468, 934895, 907107, 877129, 847117, 818982, 794324, 773855, 757338, 744053, 733155, 723892, 715894, 709268, 704153, 700291, 697272, 695105, 694167, 694585, 696083, 698573, 702513, 708324, 715742, 724196, 733666, 744688, 757482, 771528, 786025, 800294, 813573, 824867, 833353, 838615, 840352, 838298, 832771, 824940, 816098, 807004, 798217, 790639, 785109, 781729, 780220, 780674, 783310, 787561, 792065, 795466, 796628, 794273, 787414, 776569, 763927, 751923, 741855, 733809, 727216, 721252, 715411, 710173, 706702, 705574, 706149, 707469, 709328, 712116, 715955, 720382, 724590, 727721, 729245, 729388, 728981, 728693, 728745, 729490, 731651, 735531, 740451, 745535, 750747, 756593, 763014, 769135, 773971, 776895, 777568, 776110, 773531, 771485, 771304, 773429, 777791, 784458, 793710, 805604]
51597H05604J3942J4677J3796J1634Q937O507N148N689Q448J2665J6936K0389
51585I44372K2995K4714K4944K3321K0647J8477J7602J7186J5211R916J277q370
51573A132292j5385j7121j3511o443K281J2113K3009L3974M2869M7834M8846M7791
51561A338549M7013M7687M9291N0294M9130M4911L7574K7621J5710K491j1291
51550A698980k4830l7474m8737n8016o4627o8383o9752o9201o6534o1426n4466
51539A075534m7140m0648l5103l0026k5271k1084j7573j4509j1793r710q505p800
51527H06372o851n400m006l258k958k444j528o16L2N86J085J184P41J65j86n12
51511G82406j108j743j917j479o81J50O31M21k95o23K07J938L532M178L822K961
$$ y = [805604, 819546, 834223, 848019, 859653, 868590, 875097, 880245, 885934, 894382, 907047, 923983, 944372, 967367, 992081, 1017025, 1040346, 1060993, 1079470, 1097072, 1114258, 1129469, 1139385, 1140662, 1132292, 1116907, 1099786, 1086275, 1079832, 1082113, 1094226, 1117235, 1151209, 1194078, 1241912, 1290758, 1338549, 1385562, 1433249, 1482540, 1532834, 1581964, 1626875, 1664449, 1692070, 1707780, 1710271, 1698980, 1674150, 1636676, 1587939, 1529923, 1465296, 1396913, 1327161, 1257960, 1191426, 1130000, 1075534, 1028394, 987746, 952643, 922617, 897346, 876262, 858689, 844180, 832387, 822677, 814172, 806372, 799521, 794121, 790115, 786857, 783899, 781455, 779927, 779311, 779343, 779929, 781014, 782198, 782939, 783104, 782918, 782406, 781298, 779555, 777638, 776159, 775478, 775628, 776259, 776680, 776385, 775762, 775969, 777907, 781439, 785617, 789439, 792400]
51495G92400K304K445L393M591N588O494P527Q447Q872Q733Q016O345L465q3l367
51480H65170o055q478j0752j2348j2558j1200q990p326p244q199q422p024n120
51467G51454m208m085l446k120j255j272j045M17K693M991P509J0832J4624J7884
51453G92973K0287K2347K4085K4170K0953J4401O818J394j57J400L928N542N101
51440I43242K026l437r876j5406j8878k0051j8984j5974j2036q480n771l424j141
51427H11810N93J292J084K25j309l331n120o104o477o702o760o352n489m435l302
51412G59623k151j290j022j153j114n66L50J329K216K966L541L948M367N122O420
51397G82586Q051R542J0752J2158J4332J7304K0579K3775K6968L0636L5402M1654
$$ y = [792400, 794704, 797149, 800542, 805133, 810721, 817215, 824742, 833189, 842061, 850794, 858810, 865155, 868620, 868537, 865170, 859115, 850637, 839885, 827537, 814979, 803779, 794789, 787463, 780219, 772020, 763598, 756574, 751454, 747246, 743161, 739715, 737595, 736340, 735068, 734023, 734440, 737133, 742124, 749633, 760465, 775089, 792973, 813260, 835607, 859692, 883862, 904815, 919216, 926034, 927428, 927271, 928671, 932599, 938141, 943242, 945268, 941831, 931955, 916549, 897671, 877620, 858636, 842662, 830626, 822146, 816375, 812951, 811810, 812403, 813695, 814779, 815004, 813695, 810364, 805244, 799140, 792663, 785961, 779201, 772849, 767360, 762925, 759623, 757472, 756182, 755160, 754007, 752893, 752327, 752677, 754006, 756222, 759188, 762729, 766677, 771044, 776166, 782586, 790637, 800179, 810931, 823089, 837421, 854725, 875304, 899079, 926047, 956683, 992085, 1033739]
51385A033739M9112N6924O4411P1484P8108Q3802Q8058R0738R1314Q8145P9599
51374A875434O6039M9866L3343J6958O6j7515l5002n1176o4994p5867q3587q8083
51362A625482q9323q7629q3759p8339p1497o3518n5445m8367m2349l6792l1582
51351I36882k6997k2736j8161j3546j0026q027o803n672m709l838k448m97R19
51338H14341R03n8r12j297j283o65N82J694J929J732K210L590M994N646N660N661
51322H44727O145P288Q965J0926J3211J6216K0035K3784K5695K3864J7122O005
51310A023983o756j7385k3544k5655k5599k4589k2761k0226j7498j4869j2184
51299H12917r428p060n420m210k814j021P84K163L235M579O432Q257R366R874
$$ y = [1033739, 1082851, 1139775, 1204186, 1275670, 1353778, 1437580, 1525638, 1616376, 1707690, 1795835, 1875434, 1941473, 1991339, 2024682, 2041640, 2041706, 2024191, 1989189, 1938013, 1873019, 1797152, 1713565, 1625482, 1536159, 1448530, 1364771, 1286432, 1214935, 1151417, 1095972, 1047605, 1005256, 968464, 936882, 909885, 887149, 868988, 855442, 845416, 837389, 830586, 824914, 820205, 816367, 813919, 813422, 814341, 815244, 815186, 814274, 812977, 811694, 811029, 811611, 813305, 815234, 816966, 819176, 822766, 827760, 833406, 839066, 844727, 850872, 858160, 867125, 878051, 891262, 907478, 927513, 951297, 976992, 1000856, 1017978, 1023983, 1017227, 999842, 976298, 950643, 925044, 900455, 877694, 857468, 839970, 825101, 812917, 803489, 796429, 791009, 786799, 783985, 782964, 783748, 785911, 789146, 793725, 800157, 808414, 817780, 827654]
51285H27654J0475J1276J1328R590N980J284l515p569j0314j1673j1977j1403
51273H21136r776p072l829p62J754L660M970N684N610M244J342k195m698n402
51259H14666n186n241n616n638n227m943m921m650l856k925k226j527l94J091
51245G63407K338K946L219L720M372M308K939Q88o73j465k191l188l790l403k430
51230G70997j567p64M22J897L063L623L722L432K706J770J007L72o55k318m082
51215G83625n048m760l536k093r88l92k91o37j156j302p72N6N35N35M61O43J125
51198G66005J944L132M465N700P010Q677J0385J1464J1825J1971J2036J1464R794
51185H75872P147L894M78k471m560o304q507j0899j2234j1934j0728r510q546
$$ y = [827654, 838129, 849405, 860733, 870323, 876303, 877587, 874072, 866503, 856189, 844516, 832539, 821136, 811360, 804288, 800459, 799697, 801451, 805111, 810081, 815765, 821375, 825619, 826961, 824766, 820068, 814666, 809480, 804239, 798623, 792985, 787758, 782815, 777894, 773244, 769388, 766463, 764237, 762710, 762316, 763407, 765745, 768691, 771910, 775630, 780002, 784310, 787249, 788137, 787464, 785999, 783808, 780620, 776830, 773427, 770997, 769430, 768666, 769088, 770985, 774048, 777671, 781393, 784825, 787531, 789301, 790308, 790680, 790025, 787707, 783625, 778577, 773817, 770281, 768188, 767200, 766808, 766517, 765880, 764724, 763422, 762650, 762706, 763241, 763776, 764237, 764880, 766005, 767949, 771081, 775546, 781246, 788256, 796933, 807318, 818782, 830607, 842578, 854614, 866078, 875872, 883019, 886913, 887391, 884920, 880360, 874056, 865549, 854650, 842416, 830482, 819754, 810244, 801698]
51172H01698p961p893p728o468m303k710k321j955o31Q09J157Q15R45J504J618
51157G66576J322J529K458L404L951M348M701M686M087K934J274n68j794j959
51143G96949j653j667j847j486m62Q22K210L722N099O227P571R270J0211R122
51129H44088O267L074L09k294m837o860q154q930r159q595p526o579n857n040
51115G79907m276m056m172l805k717j541p48j77K69L16q1m22k68L16R52J292J234
51098G62023J163J658K571K883K154J472K110L706M810M812M194L211J676n9j164
51083G97220j468j455j198l96N25O83K19J82Q16J169P62L34M90Q02Q04P80R22
51066H01191P40l1p78q90n37m7P22J926L294M648O170P745Q823R279R735J0614
$$ y = [801698, 793737, 785844, 778116, 771648, 767345, 764635, 762314, 760359, 759728, 760537, 761694, 762509, 763454, 764958, 766576, 767898, 769427, 771885, 775289, 779240, 783588, 788289, 792975, 797062, 799996, 801270, 800702, 798908, 796949, 795296, 793629, 791782, 790296, 789834, 790656, 792866, 796588, 801687, 807914, 815485, 824755, 834966, 844088, 850355, 853429, 853738, 851444, 846607, 839747, 831593, 822663, 813504, 804909, 797383, 790804, 784947, 779907, 775631, 771575, 767403, 763598, 760881, 759340, 758592, 758415, 758684, 759000, 758919, 758497, 758229, 758545, 759497, 760789, 762023, 763186, 764844, 767415, 770298, 772452, 773924, 776034, 779740, 784550, 789362, 793556, 796767, 798443, 798384, 797220, 795752, 794297, 793099, 792703, 793228, 793911, 794130, 794312, 795128, 796297, 797059, 797393, 797883, 798685, 799489, 800269, 801191, 801931, 801900, 801122, 800232, 799695, 799648, 800370, 802296, 805590, 810238, 816408, 824153, 832976, 842255, 851990, 862604]
51050H62604J1740J3164J5399J8154J9841J9228J6902J4342J2034R346N733J393
51038A019880k999o579q676r402r667j0146j0639j0714j0434j0031r324q095o645
51025I06529n400m300k973j311N01K270L850N156O412Q038J0100J2213J4097J5799
51011I70981J7255J8156J8459J8435J8078J7059J5385J3506J1573R393P379O602
50999A142261P414Q764R488R461Q963P762N653L253J298l36k102l779m900n871
50985A187329p610j0231j2948j5248j7267j8966j9811j9587j8822j8014j6894
50974A011931j4826j1674p863l886r0L038M925N463N252M928M367L060J261O1
50960A005947RL44K21M8Q21K559M422O192Q474J1469J4589J7479K0447K3665K6721
$$ y = [862604, 874344, 887508, 902907, 921061, 940902, 960130, 977032, 991374, 1003408, 1012754, 1018487, 1019880, 1016881, 1010302, 1001626, 992224, 982557, 972411, 961772, 951058, 940624, 930593, 921269, 913174, 906529, 901129, 896829, 893856, 892545, 893046, 895316, 899166, 904322, 910734, 918772, 928872, 941085, 955182, 970981, 988236, 1006392, 1024851, 1043286, 1061364, 1078423, 1093808, 1107314, 1118887, 1128280, 1135659, 1142261, 1149675, 1158439, 1167927, 1177388, 1186351, 1194113, 1199766, 1203019, 1204317, 1203981, 1201879, 1198100, 1193200, 1187329, 1179719, 1169488, 1156540, 1141292, 1124025, 1105059, 1085248, 1065661, 1046839, 1028825, 1011931, 997105, 985431, 977568, 973682, 973592, 976630, 981555, 987018, 992270, 997198, 1001565, 1004625, 1005886, 1005947, 1005956, 1006300, 1006521, 1006569, 1007390, 1009949, 1014371, 1020563, 1029037, 1040506, 1055095, 1072574, 1093021, 1116686, 1143407]
50945A143407K9173L0541K9654K5195J7511Q961J877l126o469q422r253r671j0092
50932A239286j0155r650r367j0170j1748j3092j3819j4351j5066j5917j6649j6849
50920A082453j6162j4766j3237j1679r657p363n913n831o054n338l964l115l073
50907I76301l137k909k665k547k340j907j184P4J798L137L320K798K685L155L205
50892I79784K105K90j315k284k829l426m372n406n834n363m661m616n196n549
50878I31328n025l687j884R4J932L327M164M477M307L861L519L391L093K370J647
50863I56914J539K092K854L556M217M807N263N783O654P880R269J0742J2248J3549
50849A047367J4351J4585J4343J3794J3269J3122J3331J3499J3401J3188J2970
$$ y = [1143407, 1172580, 1203121, 1232775, 1257970, 1275481, 1284442, 1286319, 1283193, 1276724, 1268302, 1259049, 1249378, 1239286, 1229131, 1219481, 1210114, 1199944, 1188196, 1175104, 1161285, 1146934, 1131868, 1115951, 1099302, 1082453, 1066291, 1051525, 1038288, 1026609, 1016952, 1009589, 1003676, 997845, 991791, 986453, 982489, 979374, 976301, 973164, 970255, 967590, 965043, 962703, 960796, 959612, 959686, 961484, 964621, 967941, 970739, 973424, 976579, 979784, 981889, 982179, 980864, 978580, 975751, 972325, 967953, 962547, 956713, 951350, 946689, 942073, 936877, 931328, 926303, 922616, 920732, 920826, 922758, 926085, 930249, 934726, 939033, 942894, 946413, 949804, 952897, 955267, 956914, 958453, 960545, 963399, 966955, 971172, 975979, 981242, 987025, 993679, 1001559, 1010828, 1021570, 1033818, 1047367, 1061718, 1076303, 1090646, 1104440, 1117709, 1130831, 1144162, 1157661, 1171062, 1184250, 1197220]
50838A197220J2717J2701J3371J4580J5651J6485J7858K0157K2653K4560K6117
50827A394070K7945K9996L1832L3278L4098L3664L1786K9200K6460K2899J7624
50816A712852J1003M283j818p207j1619j4863j7537k0436k3298k5036k5148k4086
50804A557090k2411k0398j8285j6223j4079j1786r655p634m891q66L710P773J1307
50791A453652J4808J7944K0017K1369K2821K3947K3345K0678J7141J3663J0019
50780A659404N978K129r51l374n372o962q493j0685j3687j6855j9780k2854k6424
50767A532074l0041l2858l4306l4212l2873l1068k9433k7726k5280k2123j9022
50756A213132j6461j4318j2408j0587q396n554k805j294j035r27l23L94R20J627
$$ y = [1197220, 1209937, 1222638, 1236009, 1250589, 1266240, 1282725, 1300583, 1320740, 1343393, 1367953, 1394070, 1422015, 1452011, 1483843, 1517121, 1551219, 1584883, 1616669, 1645869, 1672329, 1695228, 1712852, 1723855, 1728138, 1726320, 1719113, 1707494, 1692631, 1675094, 1654658, 1631360, 1606324, 1581176, 1557090, 1534679, 1514281, 1495996, 1479773, 1465694, 1453908, 1444253, 1436619, 1431728, 1430862, 1434572, 1442345, 1453652, 1468460, 1486404, 1506421, 1527790, 1550611, 1574558, 1597903, 1618581, 1635722, 1649385, 1659404, 1665382, 1667511, 1666560, 1663186, 1657814, 1650852, 1642359, 1631674, 1617987, 1601132, 1581352, 1558498, 1532074, 1502033, 1469175, 1434869, 1400657, 1367784, 1336716, 1307283, 1279557, 1254277, 1232154, 1213132, 1196671, 1182353, 1169945, 1159358, 1150962, 1145408, 1142603, 1141309, 1140274, 1139347, 1139024, 1139418, 1140338, 1141965]
50742A141965K821M376O384R194J2556J5582J7871J9804K1625K3119K4310K5464
50730A325071K6175K5613K3877K1971K0153J7667J4444J1611R624P328L810r4
50718A507250l185n586p819r212q681o487l878j452J041L651O197Q968J2354J5778
50704A508939J8040J8649J8142J7141J5861J4477J3175J1885J0445R081Q259Q215
50692A672309Q937J0412J2382J4186J5274J5645J5470J4655J3332J2249J2043
50681A816894J2492J3163J4368J6717K0084K3856K7970L2852L8374M3718M8247
50670B108735N1673N3436N2810M9984M6183M2362L8340L3572K8286K3246J8861
50659B547488J4967J1294P716L944m65n648j1084j5945j9733k2443k4060k4155
$$ y = [1141965, 1144786, 1149162, 1155546, 1164740, 1177296, 1192878, 1210749, 1230553, 1252178, 1275297, 1299607, 1325071, 1351246, 1376859, 1400736, 1422707, 1442860, 1460527, 1474971, 1486582, 1496206, 1503534, 1507344, 1507250, 1504065, 1498479, 1490660, 1481448, 1472767, 1466280, 1462402, 1460950, 1461991, 1465642, 1471839, 1480807, 1493161, 1508939, 1526979, 1545628, 1563770, 1580911, 1596772, 1611249, 1624424, 1636309, 1646754, 1655835, 1664094, 1672309, 1681246, 1691658, 1704040, 1718226, 1733500, 1749145, 1764615, 1779270, 1792602, 1804851, 1816894, 1829386, 1842549, 1856917, 1873634, 1893718, 1917574, 1945544, 1978396, 2016770, 2060488, 2108735, 2160408, 2213844, 2266654, 2316638, 2362821, 2405183, 2443523, 2477095, 2505381, 2528627, 2547488, 2562455, 2573749, 2581465, 2585409, 2584944, 2579296, 2568212, 2552267, 2532534, 2510091, 2486031, 2461876]
50647B461876k2286j8651j3960q729k958L404J0049J6497K2394K7436L1279L3655
50635B540006L4391L3343L0632K7061K3780K1352J9566J8330J7932J7770J5149
50624B799312O510r580l0587n1177o6292p3595p3674o8498n9906m9316l8119k7568
50612B257510j8248j0136l233K252O328R247J0958J1026R191N561J93o901j5171
50599B258577k3572l1406l8551m4592m8467m9468m8015m5088m1414l7572l4118
50588A816314l1009k7468k3023j8229j3806r728n850k763j106m77p6J4q01k113
50574A679879k623j854o92O2P62K026L544M466M632M841N980Q130J0565J2515
50560A732233J4005J5846J8668K2096K5328K8332L1899L6392M0981M4424M6266
$$ y = [2461876, 2439590, 2420939, 2406979, 2398250, 2395292, 2398696, 2408745, 2425242, 2447636, 2475072, 2506351, 2540006, 2574397, 2607740, 2638372, 2665433, 2689213, 2710565, 2730131, 2748461, 2766393, 2784163, 2799312, 2805822, 2796242, 2765655, 2714478, 2648186, 2574591, 2500917, 2432419, 2372513, 2323197, 2285078, 2257510, 2239262, 2229126, 2225893, 2228145, 2234473, 2243720, 2254678, 2265704, 2274895, 2280456, 2280649, 2273748, 2258577, 2235005, 2203599, 2165048, 2120456, 2071989, 2022521, 1974506, 1929418, 1888004, 1850432, 1816314, 1785305, 1757837, 1734814, 1716585, 1702779, 1693051, 1687201, 1684438, 1683332, 1682855, 1682779, 1682793, 1681992, 1679879, 1677256, 1675402, 1674710, 1674772, 1675534, 1677560, 1681104, 1685570, 1690202, 1695043, 1701023, 1709153, 1719718, 1732233, 1746238, 1762084, 1780752, 1802848, 1828176, 1856508, 1888407, 1924799, 1965780, 2010204, 2056470]
50549B056470M6934M6899M6176M4713M2991M2068M2897M5427M8305M9597M8062
50538B560539M3911L8548L3657L0411K9299L0371L3495L8449M4990N2850O1518
50527B998038O9994P7128Q2470Q6432Q9365R0668Q9330Q4983P7848O7940N5175
50516C869371M0224K4310P961r201k7130m4740o1061p6111q9865j01124j08452
50505C424182j11784j12072j09581j03552r3706q1231o7904n4703m1556k8111
50495B619982j4418j014J1496K2855L3002M1545M7664N0574M9795M4864L5320
50484B941665K1432M572j3505l1519m8549o3519p5389q3694q8543r0336q9784
50473B382831q7876q5266q1861p7361p1940o6004n9742n3400m7599m2774l8516
$$ y = [2056470, 2103404, 2150303, 2196479, 2241192, 2284183, 2326251, 2369148, 2414575, 2462880, 2512477, 2560539, 2604450, 2642998, 2676655, 2707066, 2736365, 2766736, 2800231, 2838680, 2883670, 2936520, 2998038, 3068032, 3145160, 3227630, 3314062, 3403427, 3494095, 3583425, 3668408, 3746256, 3814196, 3869371, 3909595, 3933905, 3941866, 3932665, 3905535, 3860795, 3799734, 3723623, 3633758, 3532634, 3424182, 3312398, 3200326, 3090745, 2987193, 2893487, 2812256, 2744352, 2689649, 2648093, 2619982, 2605564, 2604550, 2616046, 2638901, 2671903, 2713448, 2761112, 2811686, 2861481, 2906345, 2941665, 2963097, 2967669, 2954164, 2922645, 2874096, 2810577, 2735188, 2651494, 2562951, 2472615, 2382831, 2294955, 2209689, 2127828, 2050467, 1978527, 1912523, 1852781, 1799381, 1751782, 1709008, 1670492]
50462A670492l4163k9818k6180k3463k1197j8953j6664j4206j1418q518n955l694
50450A456263j188J913N437R060J2537J5462J7228J7346J5510J1557N832l77n323
50437A561257p804p575n052j217K515N177P186R791J3462J7417K0794K3600K6253
50424A665804K8780L0900L2420L3234L3259L2713L2158L2052L2460L3363L4854
50413B021997L6934L9362M1871M4185M5821M6316M5832M5001M3903M1807L8224
50402B491253L3717K9042K3848J6941P747l053j4314k5326l5813m5505n4046o1063
50390B363428o6079o8540o8196o5516o1416n6491n0582m3260l4672k5711j7332
50379A805633r872l072L426R733J5663K0712K4215K5746K5341K3178J9120J2914
$$ y = [1670492, 1636329, 1606511, 1580331, 1556868, 1535671, 1516718, 1500054, 1485848, 1474430, 1465912, 1459957, 1456263, 1455075, 1456988, 1462425, 1471485, 1484022, 1499484, 1516712, 1534058, 1549568, 1561125, 1566957, 1566580, 1561257, 1553453, 1545878, 1540826, 1539609, 1542124, 1547301, 1554487, 1564278, 1577740, 1595157, 1615951, 1639551, 1665804, 1694584, 1725484, 1757904, 1791138, 1824397, 1857110, 1889268, 1921320, 1953780, 1987143, 2021997, 2058931, 2098293, 2140164, 2184349, 2230170, 2276486, 2322318, 2367319, 2411222, 2453029, 2491253, 2524970, 2554012, 2577860, 2594801, 2602548, 2599495, 2585181, 2559855, 2524042, 2478537, 2424491, 2363428, 2297349, 2228809, 2160613, 2095097, 2033681, 1977190, 1926608, 1883348, 1848676, 1822965, 1805633, 1795761, 1792689, 1796115, 1805848, 1821511, 1842223, 1866438, 1892184, 1917525, 1940703, 1959823, 1972737]
50367A972737M819m240j3304k1965l0148l7489m3226m6778m8300m8502m7987m6940
50355A588677m5436m3734m1997l9936l7130l3699l0314k7520k5244k3045k0562
50344A220060j7762j5072j3252j2653j2535j1622r494o941m819l143j645n26m2
50331A110554J44N57J103J318J207J238J644K254L006M020N225O410P631R249
50317A155560J1477J4229J7290K0260K2316K2492K0296J6009J0536N087P12k254
50305A314010m140n198n304m704m370m946n711n402l871k139r87l15P4oo28j507
50289A264856k481l630m728n159m661l549k015N6K371M015M600M963O189Q223
50275A269050J0121J1429J2621J4195J5826J6590J5785J3452J0299P221M727K793
$$ y = [1972737, 1977556, 1973316, 1960012, 1938047, 1907899, 1870410, 1827184, 1780406, 1732106, 1683604, 1635617, 1588677, 1543241, 1499507, 1457510, 1417574, 1380444, 1346745, 1316431, 1288911, 1263667, 1240622, 1220060, 1202298, 1187226, 1173974, 1161321, 1148786, 1137164, 1127670, 1120729, 1115910, 1112767, 1111122, 1110596, 1110554, 1110698, 1111255, 1112358, 1113676, 1114883, 1116121, 1117765, 1120019, 1123025, 1127045, 1132270, 1138680, 1146311, 1155560, 1167037, 1181266, 1198556, 1218816, 1241132, 1263624, 1283920, 1299929, 1310465, 1315552, 1316264, 1314010, 1309870, 1304672, 1299368, 1294664, 1290294, 1285348, 1279637, 1274235, 1270364, 1268225, 1267238, 1266923, 1266997, 1266991, 1266363, 1264856, 1262375, 1258745, 1254017, 1248858, 1244197, 1240648, 1238633, 1238689, 1241060, 1245075, 1249675, 1254638, 1260827, 1269050, 1279171, 1290600, 1303221, 1317416, 1333242, 1349832, 1365617, 1379069, 1389368, 1396589, 1401316, 1404109]
50263A404109J189j05r34j337j809l062n423q476j1348j3337j4205j3954j2697
50250A318611j0848r048p636o398n043l648k337q44J090L083M393M817M928N431
50236A296551O577Q156R759J1136J2569J4852J8555K3366K8473L3420L8213M2770
50224A544397M6717M9767N1839N2683N1775M8695M3568L7265L1190K6602K3789
50213B008287K2097K0832J9705J8126J4751Q540j42j0119k0751l1841m2452n0847
50201A956186n5768n7176n5724n2232m7623m2538l6824l0086k2895j6819j3110
50190A525391j1957j2970j5596j8818k1218k1825k0590j7996j4719j1692r626
50179A348384q275o750m853l325k633k265j702j319j699k568l082k860k229j678
$$ y = [1404109, 1405298, 1405193, 1404259, 1402922, 1401113, 1398051, 1392628, 1384152, 1372804, 1359467, 1345262, 1331308, 1318611, 1307763, 1298715, 1291079, 1284681, 1279638, 1275990, 1273653, 1272809, 1273899, 1276982, 1281375, 1286192, 1291120, 1296551, 1303128, 1311284, 1321043, 1332179, 1344748, 1359600, 1378155, 1401521, 1429994, 1463414, 1501627, 1544397, 1591114, 1640881, 1692720, 1745403, 1797178, 1845873, 1889441, 1926706, 1957896, 1984498, 2008287, 2030384, 2051216, 2070921, 2089047, 2103798, 2112338, 2112196, 2102077, 2081326, 2049485, 2007033, 1956186, 1900418, 1843242, 1787518, 1735286, 1687663, 1645125, 1608301, 1578215, 1555320, 1538501, 1525391, 1513434, 1500464, 1484868, 1466050, 1444832, 1423007, 1402417, 1384421, 1369702, 1358010, 1348384, 1340109, 1333359, 1328506, 1325181, 1322548, 1320283, 1318581, 1317262, 1315563, 1312995, 1309913, 1307053, 1304824, 1303146]
50165A303146j468j564j637j230n4J941M781Q366J2134J5229J7140J7847J7398
50152A392029J5808J3398J0675P785M554J114k132n119q034j0586j2020j2008
50140A395464j0888q986o490l975k145r00L82J463J377K50l11O63K209L102L622
50125A374837M640N954O878P715R329J1763J4570J8038K2789K8387L3709L8629
50113A577238M4064N0262N6327O1697O6935P2680P8681Q4278Q8937R1783R1466
50102B364348Q7335Q0477P3095O6983O2798O0237N8486N6570N3606M8650M0464
50091C053049K7915J0991q883k9726m9948o8331q3673r5067j02469j06495j07612
50080B439751j05877j01502r5256q8007q0077p1470o2535n4021m6414l9686l3888
$$ y = [1303146, 1301678, 1300114, 1298477, 1297247, 1297193, 1299134, 1303915, 1312281, 1324415, 1339644, 1356784, 1374631, 1392029, 1407837, 1421235, 1431910, 1439695, 1444249, 1445363, 1443231, 1438112, 1430078, 1419492, 1407472, 1395464, 1384576, 1375590, 1369100, 1365125, 1362980, 1362080, 1362462, 1363925, 1365302, 1365552, 1365241, 1365904, 1368113, 1371215, 1374837, 1379477, 1385431, 1392309, 1400024, 1409353, 1421116, 1435686, 1453724, 1476513, 1504900, 1538609, 1577238, 1621302, 1671564, 1727891, 1789588, 1856523, 1929203, 2007884, 2092162, 2181099, 2272882, 2364348, 2451683, 2532160, 2605255, 2672238, 2735036, 2795273, 2853759, 2910329, 2963935, 3012585, 3053049, 3080964, 3091955, 3083072, 3053346, 3003398, 2935067, 2851394, 2756327, 2653858, 2547363, 2439751, 2333874, 2232372, 2137116, 2049109, 1969032, 1897562, 1835027, 1781006, 1734592, 1694906, 1661018]
50069A661018k9502k6826k5347k4193k2926k1462j9472j6642j3362j0424p984
50058A442878n570l180j473o37J08J337K587L292L815M751N715N853N299N185
50044A469960O043O967O606M542J569r70j987j152R41L116M257L877K339N59p22
50029A505945j417j753j533k06K294N305Q210J0892J3187J4475J4387J3462J2560
50016A595808J1840J0887R624Q476P643O721N121K587p22m402p946j0842j2592
50003A622203j2778j1351q876o184l696j403N77J924K782L903N908Q781J2353
49990A614143J6694K1766K7224L2912L9010M5217N0332N3222N3867N3057N1471
49979B058915M9603M8081M7362M7354M7757M8545M9454M9253M5991L7965K4514
$$ y = [1661018, 1631516, 1604690, 1579343, 1555150, 1532224, 1510762, 1491290, 1474648, 1461286, 1450862, 1442878, 1437308, 1434128, 1432655, 1432018, 1432126, 1433463, 1436050, 1439342, 1443157, 1447908, 1453623, 1459476, 1464775, 1469960, 1476003, 1482970, 1489576, 1494118, 1495687, 1494717, 1492730, 1491578, 1492519, 1495635, 1499892, 1503769, 1506108, 1506667, 1505945, 1504528, 1502775, 1501242, 1501036, 1503330, 1508635, 1516845, 1527737, 1540924, 1555399, 1569786, 1583248, 1595808, 1607648, 1618535, 1628159, 1636635, 1644278, 1650999, 1656120, 1658707, 1657985, 1653583, 1645637, 1634795, 1622203, 1609425, 1598074, 1589198, 1583014, 1579318, 1577915, 1578492, 1580416, 1583198, 1587101, 1593009, 1601790, 1614143, 1630837, 1652603, 1679827, 1712739, 1751749, 1796966, 1847298, 1900520, 1954387, 2007444, 2058915, 2108518, 2156599, 2203961, 2251315, 2299072, 2347617, 2397071, 2446324, 2492315, 2530280, 2554794]
49968B554794O510j3419l1822m6380n6834o3844o7711o8871o8769o9033o9910
49957B004711p0312o9218o6329o1737n5872m9680m3985l8724l3480k8508k4411
49946A462455k0992j7439j3647j0498q733q301q842r990j1063j1234j0349q955
49934A322412p447n765l957k252l71K435O218R874J2317J3731J5173J7191J9270
49921A398829K0553K0684J9816J8005J5001J1007P307N335M910M295K402L7j776
$$ y = [2554794, 2561304, 2547885, 2516063, 2469683, 2412849, 2349005, 2281294, 2212423, 2143654, 2074621, 2004711, 1934399, 1865181, 1798852, 1737115, 1681243, 1631563, 1587578, 1548854, 1515374, 1486866, 1462455, 1441463, 1424024, 1410377, 1399879, 1391146, 1382845, 1374003, 1364013, 1352950, 1341716, 1331367, 1322412, 1314965, 1309200, 1305243, 1302991, 1302620, 1305055, 1311273, 1321147, 1333464, 1347195, 1362368, 1379559, 1398829, 1419382, 1440066, 1459882, 1477887, 1492888, 1503895, 1511202, 1516537, 1521447, 1525742, 1528144, 1528181, 1526405]
$$ [...]
##END NTUPLES=NMR SPECTRUM
##END=
