##TITLE=AC1751_05000195609115FOTR0001_9275067_Bt7wbmRs15
##JCAMPDX= 6.0         $$ Bruker NMR JCAMP-DX V2.0
##DATA TYPE= NMR SPECTRUM
##DATA CLASS= NTUPLES
##ORIGIN= BRUKER
##OWNER= Administrator
$$ 1.72 TOPSPIN		Version 2.1
$$ 2015-07-18 09:42:09.744 -0700  Administrator@X
$$ Compression mode = diff/dup
##.OBSERVE FREQUENCY= 400.02188249412
##.OBSERVE NUCLEUS= ^1H
##.ACQUISITION MODE= SIMULTANEOUS (DQD)
##.ACQUISITION SCHEME= undefined
##.AVERAGES= 8
##.DIGITISER RES= 22
##SPECTROMETER/DATA SYSTEM= spect
##.PULSE SEQUENCE= zg30
##.SOLVENT NAME= COFFEE_meoh
##.SHIFT REFERENCE= INTERNAL, COFFEE_meoh, 1, 14.98509
##AUDIT TRAIL= $$ (NUMBER, WHEN, WHO, WHERE, PROCESS, VERSION, WHAT)
$$ ##TITLE= Audit trail, TOPSPIN		Version 2.1
$$ ##JCAMPDX= 5.01
$$ ##ORIGIN= Bruker BioSpin GmbH
$$ ##OWNER= Administrator
$$ $$ E:\/data/COFFEE/nmr/AC1751_05000195609115FOTR0001_9275067_Bt7wbmRs15/20/pdata/1/auditp.txt
$$ ##AUDIT TRAIL=  $$ (NUMBER, WHEN, WHO, WHERE, PROCESS, VERSION, WHAT)
(   1,<2015-07-18 09:42:02.385 -0700>,<Administrator>,<X>,<go>,<TOPSPIN 2.1>,
      <created by zg
	started at 2015-07-18 09:40:55.994 -0700,
	POWCHK enabled, PULCHK disabled,
       configuration hash MD5:
       21 0F 79 D6 B3 7B B4 F6 88 20 88 DB 03 48 BD 9F
       data hash MD5: 64K
       39 6B 7B 16 14 BD 84 F8 05 5E 0B BB C6 75 12 15>)
(   2,<2015-07-18 09:42:05.557 -0700>,<Administrator>,<X>,<proc1d>,<TOPSPIN 2.1>,
      <Start of raw data processing
       efp LB = 0 FT_mod = 6 PKNL = 1 PHC0 = 0 PHC1 = 0 SI = 32K 
       data hash MD5: 32K
       00 C1 C7 93 4F D8 DD 0B 0E 62 81 1D AA 5E 96 38>)
(   3,<2015-07-18 09:42:05.838 -0700>,<Administrator>,<X>,<proc1d>,<TOPSPIN 2.1>,
      <pk PHC0 = 92.76855 PHC1 = 0 
       data hash MD5: 32K
       26 E1 55 F6 10 D3 F2 1B 74 89 13 B1 17 1F EA D6>)
(   4,<2015-07-18 09:42:05.963 -0700>,<Administrator>,<X>,<proc1d>,<TOPSPIN 2.1>,
      <abs ABSG = 1 
       data hash MD5: 32K
       E9 C3 0C 44 A7 F2 AB D6 C7 56 9F 2E 6E 52 34 7B>)
(   5,<2015-07-18 09:42:06.025 -0700>,<Administrator>,<X>,<proc1d>,<TOPSPIN 2.1>,
      <abs ABSG = 2 
       data hash MD5: 32K
       7C 6E 6A 58 93 83 40 B4 3A 1C 40 5F 47 A7 E1 07>)
(   6,<2015-07-18 09:42:06.104 -0700>,<Administrator>,<X>,<proc1d>,<TOPSPIN 2.1>,
      <abs ABSG = 3 
       data hash MD5: 32K
       DE C1 CE 5B 6C 1E 88 86 75 9D BE 1E 26 29 57 C6>)
(   7,<2015-07-18 09:42:06.150 -0700>,<Administrator>,<X>,<proc1d>,<TOPSPIN 2.1>,
      <abs ABSG = 4 
       data hash MD5: 32K
       55 9A 99 05 11 02 85 38 0A D9 B2 B2 72 31 A1 E8>)
(   8,<2015-07-18 09:42:06.213 -0700>,<Administrator>,<X>,<proc1d>,<TOPSPIN 2.1>,
      <abs ABSG = 5 
       data hash MD5: 32K
       C5 A5 6C 04 34 EE 76 96 CB 89 35 35 67 29 E2 40>)
$$ ##END=
$$ 
$$ $$ hash MD5
$$ $$ 5B 2B E3 10 A8 11 00 15 BC A0 38 30 06 00 36 AB
##$RELAX= 
##$RELAX= 
##$RELAX= 
##$RELAX= 
##$RELAX= 
##$RELAX= 
##$RELAX= 
$$ Bruker specific parameters
$$ --------------------------
##$DU= <E:\>
##$EXPNO= 20
$$ [...]
150 150 150 150 150 150 150 150
##$TP07= 0
##$TPNAME0= <>
##$TPNAME1= <>
##$TPNAME2= <>
##$TPNAME3= <>
##$TPNAME4= <>
##$TPNAME5= <>
##$TPNAME6= <>
##$TPNAME7= <>
##$TPOAL= (0..7)
0.5 0.5 0.5 0.5 0.5 0.5 0.5 0.5
##$TPOFFS= (0..7)
0 0 0 0 0 0 0 0
##$TUNHIN= 0
##$TUNHOUT= 0
##$TUNXOUT= 0
##$USERA1= <user>
##$USERA2= <user>
##$USERA3= <user>
##$USERA4= <user>
##$USERA5= <user>
##$V9= 5
##$VALIST= <valist>
##$VCLIST= <CCCCCCCCCCCCCCC>
##$VD= 0
##$VDLIST= <DDDDDDDDDDDDDDD>
##$VPLIST= <PPPPPPPPPPPPPPP>
##$VTLIST= <TTTTTTTTTTTTTTT>
##$WBST= 2048
##$WBSW= 25
##$XGAIN= (0..3)
0 0 0 0
##$XL= 0
##$YL= 0
##$YMAX_a= 610109
##$YMIN_a= -511427
##$ZGOPTNS= <>
##$ZL1= 120
##$ZL2= 120
##$ZL3= 120
##$ZL4= 120
##$ABSF1= 14.98509
##$ABSF2= -5.573092
##$ABSG= 5
##$ABSL= 3
##$ALPHA= 0
##$AQORDER= 0
##$ASSFAC= 0
##$ASSFACI= 0
##$ASSFACX= 0
##$ASSWID= 0
##$AUNMP= <proc_prof1d_extract_pilot.lims>
##$AXLEFT= 0
##$AXNAME= <>
##$AXNUC= <1H>
##$AXRIGHT= 0
##$AXTYPE= 0
##$AXUNIT= <>
##$AZFE= 0.1
##$AZFW= 0.1
##$BCFW= 0
##$BC_mod= 0
##$BYTORDP= 0
##$COROFFS= 0
##$CY= 15
##$DATMOD= 1
##$DC= 0
##$DFILT= <>
##$DTYPP= 0
##$F1P= 0
##$F2P= 0
##$FCOR= 0.5
##$FTSIZE= 32768
##$FT_mod= 6
##$GAMMA= 0
##$GB= 0
##$INTBC= 1
##$INTSCL= 1
##$ISEN= 128
##$LB= 0
##$LEV0= 0
##$LPBIN= 0
##$MAXI= 10000
##$MC2= 0
##$MEAN= 0
##$ME_mod= 0
##$MI= 0
##$NCOEF= 0
##$NC_proc= -8
##$NLEV= 6
##$NOISF1= 0
##$NOISF2= 0
##$NSP= 0
##$NTH_PI= 0
##$NZP= 0
##$OFFSET= 14.98509
##$PC= 1
##$PHC0= 92.76855
##$PHC1= 0
##$PH_mod= 1
##$PKNL= yes
##$PPARMOD= 0
##$PPDIAG= 0
##$PPIPTYP= 0
##$PPMPNUM= 2147483647
##$PPRESOL= 1
##$PSCAL= 4
##$PSIGN= 0
##$PYNMP= <proc.py>
##$REVERSE= no
##$SF= 400.02
##$SI= 32768
##$SIGF1= 0
##$SIGF2= 0
##$SINO= 400
##$SIOLD= 32768
##$SPECTYP= <>
##$SREGLST= <1H.CDCl3>
##$SSB= 0
##$STSI= 32768
##$STSR= 0
##$SW_p= 8223.68421052631
##$SYMM= 0
##$S_DEV= 0
##$TDeff= 65536
##$TDoff= 0
##$TI= <>
##$TILT= no
##$TM1= 0
##$TM2= 0
##$TOPLEV= 0
##$USERP1= <user>
##$USERP2= <user>
##$USERP3= <user>
##$USERP4= <user>
##$USERP5= <user>
##$WDW= 1
##$XDIM= 32768
##$YMAX_p= 442935282
##$YMIN_p= -697412
##$CURPLOT= <Network HP LaserJet P1505>
##$CURPRIN= <$Network HP LaserJet P1505>
##$DFORMAT= <normdp>
##$LAYOUT= <+/1D_H.xwp>
##$LFORMAT= <normlp>
##$PFORMAT= <normpl>
##$SURQMSG= 1
$$ End of Bruker specific parameters
$$ ---------------------------------
##NTUPLES= NMR SPECTRUM
##VAR_NAME=  FREQUENCY,     SPECTRUM/REAL,   SPECTRUM/IMAG
##SYMBOL=    X,             R,               I
##VAR_TYPE=  INDEPENDENT,   DEPENDENT,       DEPENDENT
##VAR_FORM=  AFFN,          ASDF,            ASDF
##VAR_DIM=   32768,         32768,           32768
##UNITS=     HZ,            ARBITRARY UNITS, ARBITRARY UNITS
##FACTOR=    0.250966925370066, 1,           1
##FIRST=     8223.43324360094, -240700,      65003
##LAST=      0,             35478,           -205350
##MIN=       0,             -697412,         0
##MAX=       8223.43324360094, 442935282,    0
$$ Real data points
##PAGE= N=1
##DATA TABLE= (X++(R..R)), XYDATA
$$ [...]
19518a49540N8205r1750A2563a56424I6276a66555B58086a48401B07626p0984
19508A36642b54416a6606B0962b64547E4534a05512K0817A54890m2472b22896
19497G1944h8783B5610F215a01285K2311j82216h2247J7637b7400A73379c7289
19485A22901A3562b89986Q7809i1182a5522B75547e8485k00884k83144A65236
19474A8276a21218C9255d02072A02589M0521n5734g223o1390L3445o0329A96842
19462c93335a11613N5654A1873c94914a2622k72190a16103p9410j25499A31193
19451a28998k03667j21226h4586d0458A36335a12767K7603A30491a52317k47923
19441d00240A67331b19928A0387a20561k8777A96897H391b07074j07713I3128
$$ plain form
19518 -149540 -91335 -183085 12563 -156424 96276 -166555 258086 -148401 207626 136642
19508 136642 -254416 -16606 20962 -264547 54534 -105512 -84695 154890 112418 -222896
19497 71944 -88783 25610 6215 -101285 -78974 -261190 -82247 -64610 -27400 173379 -37289
19485 122901 13562 -289986 -202177 -91182 -15522 275547 -58485 -259369 -542513 165236
19474 18276 -121218 39255 -402072 102589 143110 87376 -7223 -68613 -35168 -95497 196842
19462 -393335 -111613 -55959 11873 -394914 -12622 -284812 -116103 -195513 -321012 131193
19451 -128998 -332665 -453891 -84586 -40458 136335 -112767 -85164 130491 -152317 -400240
19441 -400240 167331 -219928 10387 -120561 -149338 196897 8391 -207074 -314787 93128
19430A68299b3994k2290k76469h3621j98252d2964B50321a33859A17621b7841
19419E21020B2924b77026a26833d6258b496p6469n3246p8039e7829k1045H5234
19407A20122g4068O303B93587O4472I7375g7323k1708k2074m2771B1049a77232
19395i3990k34590B81830C3148L0636a87182E8431a93281e6091B09334k8556c1846
19383e64926O4622g9110l66567A87627a68451n6185j1085b1842C95349A92627
19372c9944j6857j26247a5069E3883b93305C34162A15905b36817A49923i5848
19361c4321I4859c21625g3713I5995f9270A68432e8441D1126d3296j33991B50026
19349d1999j38920B16042b17186D1454J68444e9523o8666q63L5160j75446C41104
$$ plain form
19430 168299 -23994 -46284 -322753 -83621 -281873 -42964 250321 -133859 117621 -27841
19419 521020 22924 -277026 -126833 -46258 -2496 -78965 -132211 -210250 -57829 -78874 85234
19407 120122 -74068 -67765 293587 358059 97375 -77323 -99031 -121105 -163876 21049 -177232
19395 -93990 -328580 281830 33148 63784 -187182 58431 -193281 -56091 209334 180778 -31846
19383 -564926 -500304 -79110 -445677 187627 -168451 -224636 -235721 -21842 395349 192627
19372 -39944 -56801 -183048 -15069 53883 -293305 334162 115905 -236817 149923 -95848
19361 -34321 94859 -321625 -73713 95995 -69270 168432 -58441 41126 -43296 -177287 250026
19349 -41999 -180919 216042 -217186 41454 209898 -59523 -128189 -129052 -93892 -269338 341104
19337a20221j35987b6402F0865J84394H0341N5512e30423A42804h7221n8073l61165
19326e06459K27334D3820a24927B31462b4029C87541G2738K0378c4524A8336J00914
19315A19250M0231G888a14029j6713B9249N973e5846r8314F9060a27049D9497
19303c5109k619j49318j1222G733J57309j3835a41760j17708O5497p3660O7100
19292b00531B27332a98339i3982k11710A38058b97202J20713B29666a22490A9902
19281a23101J5626B82377h1094l9177m950F6660P093I033b40044f8984k2932E9412
19268A19649d3066p6340M4973j90237L9301A13800J33089b4407l12111J49183
19258a87335H623A874d9632Q773j30930j74467a682A36153f3199A79877H0124
$$ plain form
19337 -120221 -256208 -26402 60865 245259 80341 135853 -530423 142804 -87221 -145294 -506459
19326 -506459 -279125 43820 -124927 231462 -24029 387541 72738 93116 -34524 18336 119250
19315 119250 159481 7888 -114029 -130742 29249 35222 -55846 -154160 69060 -127049 49497
19303 -35109 -37728 -187046 -198268 7733 165042 151207 -141760 -259468 -193971 -267631 -200531
19292 -200531 227332 -198339 -93982 -305692 138058 -297202 -176489 229666 -122490 19902
19281 -123101 -107475 282377 -81094 -120271 -125221 66660 73753 9033 -240044 -68984 -91916 59412
19268 119649 -43066 -119406 -74433 -264670 -225369 113800 246889 -24407 -336518 -187335
19258 -187335 8623 1874 -49632 -40859 -171789 -346256 -1682 136153 -63199 179877 80124
19246a66582F6691b77401O0224A4530b72895F3797K02701a00058B70a23059c0330
19234C92448E9440a52775D032a5992E2957b7947q5740l3946p0535Q6604G3676
19222b1327J174A27527a78858Q7707l80264a81387A9371J47934b53145A7758f9565
19210B84317b21608e1056A50177d896r4234O680d4915B38879a67201d2319o8575
19199a10894A32463e987r1008f256j08888m3620E2824b87549h3218P715A42917
19187h2593a7687B6920e2176C875K23165d8395h034j03435j63341a6246A0178
19175D0662b3079F8893b14116K6284j19309M4068b3914C29026E4875i5150L1145
19164f4005A05308c3304n5776j620C1000O2445a00977j43159A02927C5020b04085
$$ plain form
19246 -166582 66691 -277401 -217177 14530 -272895 63797 266498 -100058 270 -123059 -30330
19234 392448 59440 -152775 4032 -15992 52957 -27947 -113687 -147633 -218168 -131564 73676
19222 -21327 -20153 127527 -178858 -91151 -471415 -181387 19371 167305 -253145 17758 -69565
19210 284317 -221608 -51056 150177 -4896 -99130 -92450 -44915 238879 -167201 -42319 -110894
19199 -110894 132463 -5987 -96995 -6256 -115144 -158764 52824 -287549 -83218 -75503 142917
19187 -82593 -17687 26920 -52176 3875 227040 -48395 -8034 -111469 -274810 -16246 10178
19175 40662 -23079 68893 -214116 -187832 -307141 -263073 -23914 329026 54875 -95150 -64005
19164 -64005 105308 -33304 -89080 -90700 31000 93445 -100977 -244136 102927 35020 -204085
19152a49176P974k9961j79460a07423a1479j30904q5225B2005a7161k7635m4436
19141h9232o9691f4313H7947l9266M2599e5866k12705A27933h5579A9065Q7072
19130A06137a07050A1725d14787J47802A6812P9521l7681a58383c4080J6866m3747
19119f0961E7654h9856B01183E0435b07252F3576c2332j43234A73454a90406l4707
19108b25113c4363A71665c5899a7060A08931a17192l5931N1458n4777A53997h7615
19096B5820p222G009a36090e9470B09318g1732I686a44595B28596b09260R1686
19085a17574d9324A0167a66328G0186j0743d0351D8770a09736k87199i4963l4256
19074a29219L5123l5271C7346a87817B0907i5121j51131P5655D35K4652a71282
$$ plain form
19152 -149176 -141202 -171163 -350623 -107423 -11479 -142383 -227608 22005 -17161 -44796 -89232
19141 -89232 -158923 -64313 87947 48681 91280 -55866 -268571 127933 -85579 19065 106137
19130 106137 -107050 11725 -414787 -266985 16812 96333 58652 -158383 -34080 -17214 -60961
19119 -60961 57654 -89856 201183 50435 -207252 63576 -32332 -175566 173454 -190406 -225113
19108 -225113 -34363 171665 -35899 -17060 108931 -117192 -153123 -101665 -156442 153997 -87615
19096 25820 18598 7009 -136090 -59470 209318 -71732 9686 -144595 228596 -209260 -117574
19085 -117574 -49324 10167 -166328 70186 59443 -40351 48770 -109736 -396935 -94963 -129219
19074 -129219 -94096 -129367 37346 -187817 20907 -95121 -246252 -170597 435 25087 -171282
19062g9804j25659A45649a07308A65718p6482k6744a6418k43F3159a71386N4987
19051a16399B51833a2497k4730l91935B4378a13051A77543H7171g7779D1303m984
19040C6319A5263a95727M1269L7648k3120C25298j26823o5917g7785J7849A00681
19028e0879J510k83271n7311N3251G4445J43451a1545j58176A4102J83635j0498
19017A87239b58991M1597h3216a2010j46619F3252b6039C128e9786D6158c75415
19005C36741a27292c6788j01555G0253J87538a74854N7213A0300c2041j56788
18995a88829F2796c566D2880a02163G1723f4171O005k40965J45977B89503G6570
18983h4971l2041j09923E2490a85016J2489j84436b1718A71651K9238e7349r7588
$$ plain form
19062 -79804 -205463 145649 -107308 165718 89236 62492 -16418 -16661 63159 -171386 -116399
19051 -116399 251833 -12497 -37227 -429162 24378 -113051 177543 87171 -77779 41303 36319
19040 36319 15263 -195727 -154458 -116810 -139930 325298 198475 132558 -77785 -59936 100681
19028 -50879 -49369 -332640 -389951 -336700 74445 217896 -11545 -169721 14102 197737 187239
19017 187239 -258991 -217394 -83216 -12010 -158629 63252 -26039 3128 -59786 46158 -375415
19005 336741 -127292 -36788 -138343 70253 257791 -174854 -117641 10300 -32041 -188829
18995 -188829 62796 -3566 42880 -102163 71723 -64171 -58166 -299131 -153154 289503 76570
18983 -84971 -117012 -226935 52490 -185016 -172527 -356963 -21718 171651 200889 -57349 -154937
18972a54937A4754a41426e8047j01822f8197m2159b9249C29880j18077j4988A5078
18960i5054J199p7255f8682B36023o5522g3494K5102O135F7091Q2776M1430A1739
18947i5411b8616p0844G6064A7918K25570q2526B0376Q7294b284r6073A12909
18935A53933c22209p9674J89215C7607h0437a38j05352I230J08645n4033a80686
18923I7121a15846A29008K67556a9202B34151h0344o9207n7415A5492a78919j31035
18912c09954f0302m3582o2651A3838a53142O8707k37555d3474m0492J9105H6980
18900a3971j3970H0241b01742i3215a4137B03871g3964k66728G7164K55872c36460
18888d1699B2022b50083G9153f3538l31789a1004l18679R8444h025j2697G4500
$$ plain form
18972 -154937 14754 -141426 -58047 -159869 -68197 -110356 -29249 329880 211803 196815 15078
18960 -95054 -93855 -171110 -68682 236023 170501 -73494 -48392 -42257 67091 149867 191297 11739
18947 -95411 -28616 -99460 76064 17918 243488 160962 20376 107670 -2284 -98357 112909
18935 153933 -322209 -401883 -212668 37607 -80437 -138 -105490 9230 117875 63842 -180686
18923 97121 -115846 129008 396564 -19202 234151 -80344 -149551 -206966 15492 -178919 -309954
18912 -309954 -60302 -103884 -166535 13838 -153142 -84435 -321990 -43474 -83966 -64861 86980
18900 -13971 -27941 80241 -201742 -93215 -14137 203871 -73964 -340692 77164 333036 -336460
18888 -41699 22022 -250083 79153 -63538 -395327 -11004 -329683 -231239 -8025 -20722 74500
18876D6630J12858l7212e1501m4013L2643J5142b0307B7840O3854d26034a13337
18864A08293b77486a21504d9012A69760b88712B2486b50634B40600d09853a70722
18853a35555A27935b06439R5331G7220b27124l228A41343M9421b30710h1908A60395
18841A75431c47207a54912c1901o0632j29642K4103j32878a27568K1706a0683
18830A78072p9178a02131C69478f2727k08603A8174K19303Q7649a0648j05399
18820a16047A633a0230B64437d0525o4419j2670M5761J5869A46110a3274j85714
18809a98988G8781K62469f1026A5311J54679q4022g0684L3854j78525P8690c8736
18797B8508P8232i1491C6633b31829O4692d425n3214a9066A6126O0131b72712
$$ plain form
18876 46630 159488 122276 -51501 -95514 -62871 -47729 -20307 27840 91694 -426034 -113337
18864 108293 -277486 -121504 -49012 169760 -288712 22486 -250634 240600 -409853 -170722
18853 -135555 127935 -206439 -111108 77220 -227124 -230352 141343 190764 -230710 -81908 160395
18841 175431 -347207 -154912 -31901 -92533 -222175 -198072 -330950 -127568 -105862 -10683
18830 178072 98894 -102131 369478 -62727 -271330 18174 237477 325126 -10648 -116047
18820 -116047 1633 -10230 264437 -40525 -104944 -117614 -71853 -55984 146110 -13274 -198988
18809 -198988 78781 341250 -61026 15311 169990 85968 -70684 -36830 -215355 -136665 -38736
18797 28508 106740 -91491 36633 -231829 -167137 -4425 -57639 -19066 16126 76257 -272712
18785b86196O6959A14822a40177G7139i5382B13408b2723A09663a73289P1951
18775a01338l9362j71295F4200a11654b7393B09026a58074k8513E5555B5197L7357
18764F2554b0921C68682G7751a88818F6142C675J53296b9883A98427e43365A00155
18752a4031k46295a0671j59172k6626O2710r3721A26352i8027A89276b60294J17366
18741a42928A5460b08433h7922k4281G3692K51234A28052e9359q8272l395K1564
18730a29462l8995K6294D1771b26235A50054a70570P591e5450C9677O4961a25461
18718h3402l06426J19303b8271l28341J09870R5480N7649D0807L7357d2531j07679
18707a50210J3546A88937B4187K43570p1907j3855a47241e4883k5376A88716a95201
$$ plain form
18785 -286196 -219237 114822 -140177 77139 -95382 213408 -22723 109663 -173289 -101338
18775 -101338 -140700 -311995 64200 -111654 -27393 209026 -158074 -186587 55555 25197 62554
18764 62554 -20921 368682 77751 -188818 66142 3675 156971 -29883 198427 -543365 100155
18752 -14031 -260326 -10671 -169843 -196469 -133759 -227480 126352 -98027 189276 -260294 -142928
18741 -142928 15460 -208433 -87922 -112203 73692 324926 128052 -59359 -147631 -151026 -129462
18730 -129462 -168457 -142163 41771 -226235 150054 -170570 -162979 -55450 39677 104638 -125461
18718 -83402 -389828 -270525 -28271 -356612 -246742 -151262 -93613 40807 78164 -42531 -150210
18707 -150210 -136664 188937 24187 267757 195850 181995 -147241 -54883 -80259 188716 -195201
18695b23778R2732c736A40585M3888c72011g3536m7003N5767A51157b05898B7890
18683C3287i3949B19636K1303b17694A01550N4449G6010a8603A12561E3298O7790
18672A21088b31563a7762m43290B32683I3384a32430b9029A78195c41576J31298
18662b10278K4770A24454L4209c1786H5031b46632I7394a79228f1826C4721c5478
18650A7957b39721A5993L3411L6544a1287A56940B0924M5222a58644H9290i1311
18638H4842i543A3152Q6557L1182C1999a93155j21637a46633N9291B4213c1604
18626i6111j77A26410d6861A22240a7783l2234A1118J84665G3415e7829A26776
18614D71523j54849A20497d6297n4308j62583K5815B96820a76115K0649O9466
$$ plain form
18695 -223778 -131046 -3736 140585 184473 -372011 -73536 -120539 -64772 151157 -205898 27890
18683 33287 -93949 219636 240939 -217694 101550 155999 76010 -18603 112561 53298 121088
18672 121088 -231563 -17762 -461052 232683 93384 -132430 -29029 178195 -341576 -210278
18662 -210278 -185508 124454 158663 -31786 85031 -246632 97394 -179228 -61826 34721 -35478
18650 17957 -239721 15993 49404 85948 -11287 156940 20924 66146 -158644 89290 -91311
18638 84842 -9543 13152 99709 130891 31999 -193155 -314792 -146633 -87342 24213 -31604
18626 -96111 -96288 126410 -46861 122240 -17783 -50017 11118 195783 73415 -57829 126776
18614 471523 316674 120497 -46297 -100605 -263188 -237373 296820 -176115 -155466 -86000
18604h6000A7869J28850a43796j25546A72241b14317J2130g6317l0891B8632a31606
18592g284k9145k1316m3491A07721J16672F5018b4447k7919A28918b37350B1637
18580c112l5057j00402n0626q8721l6059a42553C8025J89786a06399G3809a38998
18568a2430k02056E1446d40015R6027b8844A67112A3526c42595A28068a93554
18557A7971K01393A1657b99539A76064c64377a54564M2372A74593L4380a06656
18546d18103c5479A66744h7948I3944a55906i284j10589A25201b25888F4452J01922
18535A66374p8719a93835k6321A42869b94874e6699D5061a01788B5434b10745
18524f1189D0753J70248d3876j16798n8191E7891a61439c4518B50296E1822h4062
$$ plain form
18604 -86000 17869 146719 -143796 -269342 172241 -214317 -202187 -76317 -107208 28632 -131606
18592 -7284 -36429 -57745 -101236 107721 224393 65018 -24447 -52366 128918 -237350 21637
18580 -3112 -38169 -138571 -189197 -277918 -313977 -142553 38025 227811 -106399 73809 -138998
18568 -12430 -214486 51446 -440015 -343988 -28844 167112 13526 -342595 128068 -193554
18557 17971 219364 11657 -299539 176064 -364377 -154564 -112192 174593 208973 -106656
18546 -418103 -35479 166744 -87948 93944 -155906 -9284 -119873 125201 -225888 64452 166374
18535 166374 87655 -193835 -220156 142869 -294874 -56699 45061 -101788 25434 -210745
18524 -61189 40753 211001 -43876 -160674 -218865 57891 -161439 -34518 250296 51822 -84062
18512h3175I8018G834O5290e9525B79182d11977a99407B00321a26145A9408b41951
18500b44453D9872K28734c26726A28250a84906h2155j06908A52935e2160l02424
18490c54584i8967B28585I0068i0801j77357A00430h2993m1932o6844m3605h4371
18478a08671K8908I6899m6408K9355i708q2292o2974r848B28893l9809b37605
18466a27328l49102b975j996A12517c19885B80718b85342J41257A24273C1579
18455b62676g6604A19133g8340C9168q912M93868H7561c57351D2002J08622A4688
18443c01593B3485K76107b77155a06231A00780a10837C8761b86888g809l6582
18433d4391k0579j41436D0437b9453p6244F9662A1026a66397M7143E7752a15749
$$ plain form
18512 -83175 98018 7834 73124 -59525 279182 -411977 -199407 200321 -126145 19408 -241951
18500 -244453 49872 278606 -326726 128250 -184906 -82155 -189063 152935 -52160 -354584
18490 -354584 -98967 228585 90068 -90801 -268158 100430 -82993 -124925 -191769 -235374 -84371
18478 -108671 -79763 96899 50491 79846 -9708 -92000 -154974 -164822 228893 189084 -237605
18466 -127328 -476430 -2975 -4971 112517 -319885 280718 -285342 -144085 124273 31579
18455 -262676 -76604 119133 -78340 39168 30256 524124 87561 -357351 42002 150624 14688
18443 -301593 23485 299592 -277155 -106231 100780 -110837 38761 -286888 -7809 -44391
18433 -44391 -64970 -206406 40437 -29453 -105697 69662 11026 -166397 -119254 57752 -115749
18421A78712b75865c9503m4916d0865k81127J06186N5356M8668b3251o1254q3344
18410a67849O7974p3225N4959e8516a7661B76626r5981b47770g9886L3584B13403
18398c4550j4002E3373a89400A36613c43048I5026B8661a97790f8735B6811f1605
18386A33228D2238b58104c6428l3800q0653K2677A49135N838D6249a71607Q483
18375a63124M7904d351n1451k63927C7343J15623D0127b06821j28261B9494K9574
18364E9068c11292I3777c09798D5587j4264f1853g555I3032f5323D37626a57808
18352i5206b4998F0612f2178K8302j70988i3695j34383M5859j35347C8658a35827
18340E679M47175c6675E8606R0991J4332e3849A96236H6742b01916l1623C82686
$$ plain form
18421 178712 -275865 -39503 -84419 -40865 -321992 -215806 -160450 -111782 -23251 -84505 -167849
18410 -167849 -99875 -173100 -118141 -58516 -17661 276626 180645 -247770 -79886 -46302 213403
18398 -34550 -48552 53373 -189400 136613 -343048 95026 28661 -197790 -68735 26811 -61605
18386 133228 42238 -258104 -36428 -70228 -150881 -128204 149135 154973 46249 -171607 -163124
18375 -163124 -115220 -4351 -55802 -319729 37343 152966 40127 -206821 -335082 29494 59068
18364 59068 -311292 93777 -309798 45587 31323 -61853 -7555 93032 -65323 437626 -157808
18352 -95206 -24998 60612 -62178 -33876 -204864 -93695 -228078 -182219 -317566 38658 -135827
18340 5679 452854 -36675 58606 149597 163929 -53849 196236 86742 -201916 -233539 382686
18328I9582l2676D256a89850d5750H9843c04140r6292A19627d89222f2189j90829
18317b53018A63613E2485K7800a08252J1786C1267b3981q2560B15505a49131B40990
18305c38662a09235B98541m8561C7449i4118G5381a02317M9640q3044c004j89529
18294a92533i0793G1830J4335a64999A9451g2887q0785A37514a57757b4551A37119
18282A16518b6539B6581a06942C2819a42280C02450K2859h0286E5497N4281J62819
18271B72597j05176c3873A03045L7390a61174H298N6235a52631J5050L8892k2420
18260a21109b1684k16647C8297b1355k49436a07166l5778f2073C02650p9796H2052
18248a25885A64519F404J70117b91910l7261G1518J08029a55061C83471E6182
$$ plain form
18328 99582 66906 4256 -189850 -45750 89843 -304140 -400432 119627 -489222 -62189 -253018
18317 -253018 163613 52485 80285 -108252 -96466 31267 -23981 -106541 215505 -149131 240990
18305 -338662 -109235 298541 249980 37449 -94118 75381 -102317 -52677 -135721 -3004 -192533
18294 -192533 -90793 71830 86165 -164999 19451 -72887 -153672 137514 -157757 -24551 137119
18282 116518 -26539 26581 -106942 32819 -142280 302450 325309 -80286 55497 109778 272597
18271 272597 167421 -33873 103045 140435 -161174 8298 64533 -152631 -137581 -98689 -121109
18260 -121109 -21684 -238331 38297 -21355 -270791 -107166 -142944 -62073 302650 222854 82052
18248 -125885 164519 6404 176521 -291910 -329171 71518 179547 -155061 383471 56182
18237A60873C6357a61982j7498N4812l6510a7198G6597J01031E0958a79045M3513
18226a35532d4444j8813C88441j43840A10132L46832d33431a06706B9263j1529
18216A7734h7576i462m4976A62693p9282e165j37466A87845a03524j19964N4242
18205a69246r210L8262N3274r2024k7144A24778b29767c8200B75294a37778F94
18193E1054b87445a00662k39183g5002F5387a11547H074J36927o5937b26601b2612
18181A75845G9673e6135A61609J11167b22375h7790j36330b7912C04033b58093
18170a69637o795A53337h7431E2860N7288j7200J07438i5716B57078h7600K6603
18159f0997H2760J46423c17895k19374a4153A3894J17763a00256B90550i1144
$$ plain form
18237 160873 36357 -161982 -179480 -124668 -161178 -17198 76597 177628 50958 -179045 -135532
18226 -135532 -44444 -63257 388441 244601 110132 456964 -433431 -106706 29263 17734
18216 17734 -87576 -9462 -54438 162693 83411 -5165 -142631 187845 -103524 -223488 -169246
18205 -169246 -178456 -140194 -86920 -178944 -206088 124778 -229767 -38200 275294 -137778 694
18193 51054 -287445 -100662 -339845 -75002 65387 -111547 8074 145001 79064 -226601 -22612
18181 175845 79673 -56135 161609 272776 -222375 -87790 -224120 -27912 304033 -258093
18170 -169637 -176432 153337 -87431 52860 110148 92948 200386 -95716 257078 -87600 -60997
18159 -60997 82760 229183 -317895 -537269 -14153 13894 131657 -100256 290550 -91144
18148A03822B1006N934j2503b1847o0121E1668L37388a80106H4622b39636Q6713
18137a52923e8054j76965f9513p7572A17624B8651K20099a30941A60137b28398
18126C9939J70192m9759h6759o9930o5102B02265o2416k6277D8037L8462g2988
18114a17176j04593C7059a06810B51834g6488G5438l2650k0314a95905A43478
18103I9136J73041A17548n3101f826j35027O0887G1268b05748g4746j16871A15777
18091f9404k11897A39935a46957H6880K2654b38328O4518M1163l05018f230H4459
18079a83996a2684C701J32059g0160I8731N5824a6996j20419K8511E2669a6398
18067C9865j3811J219Q9589a07362M3958A24772l5350A2140b36509D8419A6156
$$ plain form
18148 103822 21006 26940 14437 -21847 -81968 51668 389056 -180106 84622 -239636 -152923
18137 -152923 -58054 -235019 -69513 -147085 117624 28651 248750 -130941 160137 -228398
18126 39939 210131 160372 -86759 -156689 -221791 202265 139849 113572 48037 86499 -72988
18114 -117176 -221769 37059 -106810 251834 -76488 75438 42788 22474 -195905 143478
18103 99136 272177 117548 64447 -6826 -141853 -80966 71268 -205748 -74746 -191617 115777
18091 -69404 -281301 139935 -146957 86880 109534 -238328 -173810 -132647 -437665 -6230 84459
18079 -183996 -12684 3701 135760 -70160 98731 154555 -16996 -137415 -108904 52669 -16398
18067 39865 26054 27273 116862 -107362 -63404 124772 89422 12140 -236509 48419 16156
18055e1928k63784e2015q367B90180A05688a35527C04102d8310n5583p1076k5244
18044b00213C74305j12861H264a53703f7896K9854D9104a89317A98739p7189A3857
18032a63477M8993c6329B3828L45855A22136M5517e2031A25702O8561L2665g3404
18020a03862D4507l284a84356B38372i5459E1704J12697a2261j01248c4301B74007
18008B76069k1047H1878j8267A3839b02996a0093D133i6332A04620c13148a19530
17996A3108a31722c228D15805j93542b5048j3905B10298c4606D6262c40875c1790
17984A70264b29836B59753A27291f25125e9248A69662d4473H6962a35694J7099
17974a18595L2769I7740f3416C963R2769a763A59782a62723P0487G9230K98186
$$ plain form
18055 -51928 -315712 -52015 -60382 290180 105688 -135527 304102 -48310 -103893 -174969 -200213
18044 -200213 374305 261444 8264 -153703 -67896 -38042 49104 -189317 198739 121550 13857
18032 -163477 -114484 -36329 23828 369683 122136 167653 -52031 125702 194263 226928 -73404
18020 -103862 44507 41223 -184356 238372 -95459 51704 164401 -12261 -113509 -34301 274007
18008 276069 255022 81878 63611 13839 -202996 -10093 4133 -96332 104620 -313148 -119530
17996 13108 -131722 -3228 415805 222263 -25048 -38953 210298 -34606 46262 -340875 -31790
17984 170264 -229836 259753 127291 -625125 -59248 169662 -44473 86962 -135694 -118595
17974 -118595 -85826 97740 -63416 3963 96732 -1763 159782 -162723 -92236 79230 377416
17963C77416A3519K7831a92454C24159c56517e9787m0096F7054J93079j8284j15940
17952A25909R4628d1426n8457c1078I0632b1786m3343j8093J2313b9445k02645
17941b32090G2664i0305A26851A8267c4079j97653H1082b89631a4233I8510B4738
17929a38344N8266k50319B05924q3342J45780q5591a35535b2113B30408h3187
17918c7781p1164j04892D34164a7139A36265a40201B63241j09672B6918K8529
17908E5447J52706N8122d4175o1756E5715a49739l0959B04405K26913G9940l6089
17897D3851c36685B0850I204N8399b73032a03949A36061a44530C13165b96181
17886a94440K8112J3715f3763A03600L2058N1774q9959a2129A73370K7633p0312
$$ plain form
17963 377416 13519 41350 -192454 324159 -356517 -59787 -99883 67054 260133 241849 125909
17952 125909 220537 -41426 -99883 -31078 90632 -21786 -65129 -83222 -70909 -29445 -232090
17941 -232090 72664 -90305 126851 18267 -34079 -231732 81082 -289631 -14233 98510 24738
17929 -138344 -80078 -330397 205924 122582 268362 182771 -135535 -22113 230408 -83187
17918 -37781 -108945 -213837 434164 -17139 136265 -140201 263241 153569 26918 55447
17908 55447 208153 266275 -44175 -105931 55715 -149739 -180698 204405 431318 79940 43851
17897 43851 -336685 20850 9204 67603 -273032 -103949 136061 -144530 313165 -296181
17886 -194440 -166328 -152613 -63763 103600 135658 187432 97473 -12129 173370 201003 130691
17875A30691M1392a5407A746i5684A57089a66465A2974e3697J9285q8108A1997
17863b12178A14552b90096A30296A1698b09j93195D29062b37607A80937a44573
17852a29124A82080j9399P598l0098l490b07505F5059J26365e5284G0300R2339
17841A62639c43397A30096h0006A94600K35574F4865K03743o0864p3114J74021
17831C08651G8140h1220j63370h6425k6092A21761f2372k4865A30968i3824D58
17819D7787h0757Q845A73167D4799b31438B04240C7535N3462h9598G9428a65014
17807a16592A46779J09943j764c58920D610N914i0288j08835e1780j49366e4491
17795B7155J09186P280J30261a10569A67459a4616H2050a26744b6044A67393G7253
$$ plain form
17875 130691 172083 -15407 1746 -95684 157089 -166465 12974 -53697 -34412 -122520 11997
17863 -212178 114552 -290096 130296 11698 -209 -193404 429062 -237607 180937 -144573
17852 -129124 182080 162681 170279 140181 136691 -207505 65059 191424 -55284 70300 162639
17841 162639 -343397 130096 -80006 194600 430174 64865 268608 207744 134630 308651
17831 308651 78140 -81220 -244590 -86425 -112517 121761 -62372 -87237 130968 -93824 458
17819 47787 -80757 -71912 173167 44799 -231438 204240 37535 90997 -89598 79428 -165014
17807 -116592 146779 256722 254958 -358920 4610 10524 -90288 -199123 -51780 -201146 -54491
17795 27155 136341 143621 273882 -110569 167459 -14616 82050 -126744 -26044 167393 77253
17783G2015g0988b8480l4666B74086n2950a77370g6946A0085e7865H8477J4786
17772A03263g0264A50044m0775m604B0212R1532k3656f3099J9557o4838C23349
17760D4332P195i2046J7596F2035l522a50392d9579p7695A86671a13095B64785
17748C83485j44484L12900A18528b94582a36351C7320j5218i6907n0402B59534
17737A26745c4623E27330H3484K6323M8141j6640e6992A45210A712b92713Q3719
17726b08994B16923E8496d37961I1116a95615Q2632E0857a32872K5315l9920e2556
17714C62906a63044g1920B08836i9459c3780H2768J50869a61990B71375q4224
17704A87151d8281C86911A28261l895J05960n243l3840N0373a15186B99748A13667
$$ plain form
17783 72015 -70988 -28480 -63146 274086 221136 -177370 -76946 10085 -57865 88477 103263
17772 103263 -70264 150044 109269 104665 20212 111744 88088 -63099 -43542 -108380 323349
17760 44332 51527 -92046 -74450 62035 58513 -150392 -49579 -127274 186671 -113095 264785
17748 383485 239001 551901 118528 -294582 -136351 37320 22102 -96907 -147309 259534
17737 126745 -34623 527330 83484 109807 157948 141308 -56992 145210 1712 -292713 -208994
17726 -208994 216923 58496 -437961 91116 -195615 -112983 50857 -132872 -107557 -147477 -52556
17714 362906 -163044 -71920 208836 -99459 -33780 82768 233637 -161990 271375 187151
17704 187151 -48281 386911 128261 124366 230326 225083 191243 241616 -115186 299748 113667
17692B95440r5134P1778q3355a22857B7350c89309A53345j1702g3061m7365M2852
17681g7574A04688a97107Q8051n3474A06653h1456K1618a3675j17507c0031A84705
17669I0816A049J23128j7175F445b36732a03A35050k6520a40190D1694K96607
17658C38301b92167G6167a34992l4745B44917E2707J31567G3695i6972A39989
17647C24475D3280O5173o089C554J24985l1489j9882J61844O9863n1924E1114
17635C12754F6921d5342A49539F9910K55098H8585a17027j37140B91537f7398
17624a77964a2286l23279B52018G2841C572e5572C17264h2135L4752j82680R6586
17613a33477A01512J33897i2504F3886H257J90265A4071Q5289D7402j5184d0384
$$ plain form
17692 295440 200306 272084 188729 -122857 27350 -389309 153345 141643 -73061 -120426 -77574
17681 -77574 104688 -197107 -109056 -162530 106653 -81456 -59838 -13675 -131182 -30031 184705
17669 90816 1049 124177 107002 6445 -236732 -103 135050 108530 -140190 41694 338301
17658 338301 -292167 76167 -134992 -169737 244917 52707 184274 73695 -96972 139989
17647 324475 43280 108453 102364 3554 128539 97050 77168 239012 308875 256951 51114
17635 312754 66921 -45342 149539 69910 325008 88585 -117027 -254167 291537 -67398
17624 -177964 -12286 -335565 252018 72841 3572 -55572 317264 -82135 -47383 -230063 -133477
17613 -133477 101512 235409 -92504 63886 8257 198522 14071 99360 47402 32218 -40384
17601B10426q8815O0601o5251K4665a62418A83351a76301A29974n4589d1501B71926
17589A18731D3749i2304A09689K05087a99259g7834D18160A57257b78B92504F1592
17577C5642g1087m5974C97888A50331b4411j66544b5314F0880J32398L2381o7082
17566A58577D0810b5854l0124K0303o1949A67017j7272j4141k7471a20538E7925
17554B69695R2327j75355o4516B5235K4708R9537C641K84112a07823B99607B7216
17542D7173f4590E0717f6372A36119c8005A72468A1016J09725J23818P8745E4296
17530d02475D58289a4168H9110M2857M29263A70455p6347K63673a22623A3402
17519B5537J07781I021g6800A85759J10083l1060b13798C2259J55077g1283I7684
$$ plain form
17601 210426 121611 182212 116961 141626 -162418 183351 -176301 129974 75385 -41501 271926
17589 118731 43749 -92304 109689 314776 -199259 -77834 418160 157257 -278 292504 61592
17577 35642 -71087 -117061 397888 150331 -24411 -190955 -25314 60880 193278 225659 158577
17566 158577 40810 -25854 -55978 -35675 -97624 167017 149745 135604 108133 -120538 57925
17554 269695 362022 186667 122151 25235 49943 149480 3641 287753 -107823 299607 27216
17542 47173 -64590 50717 -66372 136119 -38005 172468 11016 120741 244559 323304 54296
17530 -402475 458289 -14168 89110 131967 561230 170455 94108 357781 -122623 13402
17519 25537 133318 9021 -76800 185759 295842 264782 -213798 32259 187336 -71283 97684
17507C25389r3741a08343K7869m3230C7369M9923L5373N6636J58977a33405d5969
17495D15379F9263l3208M6458J41299r7015N5415n5456B4865J75660J35380a93590
17483C7005A6989M25677A49396G276K36480L02381A13848b05666B84061i2600
17472B80672L38798c4914E77003B06079M30728k98678A00735j3614K26032p1031
17462B42122j6403I7720K42151C0270c5010D73776L9423F3969K40717B4383M25310
17451D49693A8908K24934Q1262A04654a4603E86266k51220O5032j10285J60025
17441D49818B03028q7966l7040J26266J55N0364r4759J7021J59254b7258C98226
17429a3722F8222g8425B42751C0120b5557B87105j40694L7761J07382C8618J43115
$$ plain form
17507 325389 231648 -108343 -80474 -123704 37369 87292 122665 179301 338278 -133405 -45969
17495 415379 69263 36055 82513 223812 126797 182212 126756 24865 200525 335905 -193590
17483 37005 16989 442666 149396 7276 243756 546137 113848 -205666 284061 -92600
17472 280672 619470 -34914 577003 206079 636807 338129 100735 87121 313153 242122
17462 242122 225719 97720 339871 30270 -35010 473776 513199 63969 304686 24383 449693
17451 449693 18908 243842 325104 104654 -14603 586266 335046 400078 289793 449818
17441 449818 203028 115062 78022 204288 204443 254807 160048 177069 336323 -27258 398226
17429 -13722 68222 -78425 242751 30120 -25557 287105 146411 184172 291554 38618 181733
17418A81733J66694M5806M824j91464N2800P1348m2976p0950J76624j04669o0026
17407B29744K771I547J8102K18413D1881O9835M6038J00126m8245H41M4936J64066
17395B09843a35800B04471R1990n0083j1025o9865j7164K86653D4259N00127B4412
17383D77562F0208b4739D19533j39611j7587q0054N1793h0180A98813k4314b62508
17371D90809j77111q700o2767G0350O0257K63461j13591c879j2369A10721R5518
17360B06239E5406a57754B39048F3892g8017A45405K11476Q5068r8183p1642a61449
17348B8989j1424J27403a4732A7169N0951M886M35368A94469R9112K17184A82050
17336E32144A96876K7508K19083j75744C6925J71057O7882R1206j67366J74585
$$ plain form
17418 181733 348427 394233 399057 207593 260393 331741 288765 217815 394439 289770 229744
17407 229744 232515 9547 27649 246062 41881 111716 157754 257880 209635 841 45777 209843
17395 209843 -135800 204471 296461 246378 235353 165488 148324 434977 44259 544386 24412
17383 477562 60208 -24739 419533 279922 262335 182281 234074 -80180 198813 174499 -262508
17371 490809 313698 304998 242231 70350 130607 394068 280477 -3879 -16248 110721 206239
17360 206239 55406 -157754 239048 63892 -78017 145405 356881 441949 343766 272124 -161449
17348 28989 17565 144968 -14732 17169 68120 73006 508374 194469 293581 510765 182050
17336 532144 196876 224384 443467 267723 36925 207982 275864 367070 199704 374289
17326C74289E0159K25905b0653A88404J53960H5898R3480M0654J31521A25745
17315D84086k2727G8273M9790K0591l8244K96996B01613m7068G4334l5504R2727
17304A31557J65453J3367a30218C98418a1707A72723F2445j3613K6071J37567
17294B12470b5306G0443N5591K11602l7251j33288Q7486m1852I5853J97144H6961
17282D07581A13032J65835A11964N7608Q2442J95038m2380j22310L15142B1355
17271E46836a9781G75252C52990p0697N3422G7303a9177A31562c6530A43212J64274
17260C07486J11576l3117o072j0717J99264A13906a50218A6111M41692A13181
17249A46081J18180J73300j35266M1696j57629J18481C5380K40310A25492n8763
$$ plain form
17326 374289 50159 276064 -20653 188404 342364 85898 179378 220032 351553 125745
17315 484086 461359 78273 128063 148654 110410 407406 201613 154545 74334 38830 131557
17304 131557 297010 310377 -130218 398418 -11707 172723 62445 48832 74903 212470
17294 212470 -25306 70443 126034 337636 300385 167097 254583 212731 95853 292997 86961
17282 407581 113032 278867 111964 169572 252014 447052 404672 282362 597504 21355
17271 546836 -19781 775252 352990 282293 335715 77303 -19177 131562 -36530 143212 307486
17260 307486 419062 385945 379873 369156 568420 113906 -150218 16111 457803 113181
17249 146081 264261 437561 302295 343991 186362 304843 35380 275690 125492 66729
17239F6729M53195j65062A17004J90288J87960B35495K01725j70972K20836p3694
17229D13390b1680D17399m1651A41034k4876J45068n5145F2607L9137P3482F7213
17217B78146L89016A24107K06411J86480A81745J74548J9865j66434l079J01002
17207C07647A3300J857J20965K06959A34881J54016M0722J7804m8926J8379K33477
17196E50353j18007n8013L4926j79440K55227g120D87180A96444K03763j46636
17186B53571L96432e8453B64710j2748L78055k20062j30459K07859k8115A80202
17175A48398M11148k11902J86142j02307J81963B86759L07993j11012M63021C22638
17164C79930I6682K26992J94952l1895A31485K94912N0655K22713j175D9532K70937
$$ plain form
17239 66729 519924 354862 117004 307292 495252 235495 437220 266248 487084 413390
17229 413390 -21680 417399 375748 141034 116158 261226 206081 62607 101744 175226 67213
17217 278146 667162 124107 330518 516998 181745 356293 376158 209724 206645 307647
17207 307647 13300 15157 136122 343081 134881 288897 329619 347423 298497 316876 550353
17196 550353 432346 374333 409259 229819 485046 -7120 487180 196444 400207 253571
17186 253571 650003 -58453 264710 251962 630017 409955 279496 487355 459240 180202
17175 148398 559546 347644 533786 431479 613442 286759 594752 483740 946761 322638
17164 379930 96682 323674 518626 486731 131485 426397 477052 699765 698590 49532 320469
17153C20469L85230j96249j24253N0746R2281K54032k46326j76880Q8618k06935
17143B40733M62496A70938R2004L05765j53640A49526M9267N20626k54818K01810
17133F66411l2618B59384m4502K37205J57211j10809j63207j8534n164J79181
17123D90765r1682M7761J96914k16252N5294N9234o6673A08735l7439L22952J74937
17112E69185J65286K6010k44348K89930j57614l0288j6739M0699Q8873k00807
17102E30187j01105K30311J90623k60393j97805K43277k09677J60290j62338K54955
17092F78325q8198K43042l37393n7185j41849M40486l31776N69356m04248P1092
17082F41652r1255O6144J48810j15646R2736J02898K20747j33758K13689l6116
$$ plain form
17153 320469 705699 509450 385197 435943 528224 782256 535930 359050 447668 240733
17143 240733 703229 170938 262942 568707 415067 149526 198793 719419 464601 666411
17133 666411 633793 259384 214882 452087 609298 498489 335282 316748 311584 490765
17123 490765 399083 446844 643758 427506 482800 542034 475361 108735 71296 394248 569185
17112 569185 734471 760481 516133 806063 648449 618161 601422 642121 730994 530187
17102 530187 429082 659393 850016 589623 391818 635095 425418 585708 423370 678325
17092 678325 590127 833169 495776 438591 296742 737228 405452 974808 570560 641652
17082 641652 550397 616541 765351 649705 742441 845339 1066086 932328 1146017 1109901
17072A109901m27769O5221J39464k27124J09091P5277j78065l14882L07172l3884
17062F24402O3560O3567J16771k11562L66548k89765C59735P85657E38029j84383
17052C53646L31297J7343l22206L60960j94853M90776q8254j58705J6966J89774
17042I96744k73763j19116j00382N06178l37420J31837L51083m64467M04243k97544
17032G97393j91250k2448J2388K72772p2681j41852J50469r9018K32814C83047
17021F54396J6682K49747n6629J45148k21350j18386K63844J28018j38392K51595
17011A174673k55813Q8964k78262K2263N0732K44107j41445j57034P2910k57353
17001E63742P42157l77981o0678K9828k697J74061k53015L28618j4284j10057
$$ plain form
17072 1109901 682132 747353 886817 659693 768784 844061 665996 351114 658286 624402
17062 624402 687962 751529 868300 656738 1023286 733521 359735 1145392 538029 353646
17052 353646 684943 702286 380080 741040 546187 1036963 948709 790004 806970 996744
17042 996744 722981 603865 503483 1009661 672241 804078 1155161 690694 1094937 797393
17032 797393 606143 583695 596083 868855 796174 654322 804791 705773 938587 383047
17021 654396 671078 920825 864196 1009344 787994 669608 933452 1061470 923078 1174673
17011 1174673 918860 1007824 729562 751825 802557 1046664 905219 748185 821095 563742
17001 563742 1305899 927918 867240 897068 894371 1068432 815417 1144035 1129751 1019694
16991A019694k0749j03328R8499l0244M62945n00213K75538k18700K24889m50674
16981G57657L01050L2206Q9634J262J8158j40811L46503l26099K31717j83667
16971A127610J19290j56727k84951M47000M6578j65121J3070M5112k11463J96462
16961A176860l009M46191l76173p5194J88211K95479k96994L7264l52590M19029
16951A459074k62454J22264j48686M85284N553j76554p2557R5598Q3692r6553
16941A494661p8717J57303J52923n5214k03877O9843j88405L59819J08600L3834
16931A850770j20218r0656K38440j85229N19952n08857q9320O3471K4389r741
16921A693001p5895L15917k5946m45901K68132N8393L35284l19147K1210J62662
$$ plain form
16991 1019694 998945 895617 994116 963872 1426817 926604 1202142 983442 1208331 757657
16981 757657 1058707 1090913 1180547 1181809 1199967 1059156 1405659 1079560 1311277 1127610
16971 1127610 1246900 1090173 805222 1252222 1298800 1133679 1146749 1191861 980398 1176860
16961 1176860 1173851 1620042 1243869 1168675 1356886 1652365 1355371 1392635 1040045 1459074
16951 1459074 1196620 1318884 1170198 1655482 1661035 1484481 1411924 1507522 1591214 1494661
16941 1494661 1415944 1573247 1726170 1670956 1467079 1536922 1348517 1708336 1816936 1850770
16931 1850770 1730552 1639896 1878336 1693107 2213059 1704202 1614882 1678353 1702742 1693001
16921 1693001 1617106 1933023 1907077 1461176 1729308 1787701 2122985 1803838 1825048 1987710
16911A987710K5273J10813j89621r2342J18905K72548l29393K12845N562p1631
16901B050669k07324J00622P9241N48645l04318J23645R8604k86137R9493j73058
16891B130082K22357k6751K63857p6860o0307K73251l8815j96618J33672J93008
16881B816876k53644K0914P8702J56681k79675O48444l05362q795J2625L36422
16871C223188j31612N4465m1048K3678l8634J08419l483J9814N9898L718J0837
16860C289240L21260J55230Q2939j85298M40133k28550k75087K17009M32658l70415
16850C879119J17905n2702P2657J78840M0095j27372J45851K79224P1803j61024
16840D444396Q9408m5289K56177j3891P8044O1663j12716K69499K41425j70799
$$ plain form
16911 1987710 2012983 2123796 1934175 1841833 1960738 2233286 1903893 2116738 2122300 2050669
16901 2050669 1843345 1943967 2023208 2571853 2267535 2391180 2489784 2203647 2303140 2130082
16891 2130082 2352439 2325688 2589545 2512685 2452378 2725629 2686814 2490196 2623868 2816876
16881 2816876 2563232 2584146 2662848 2819529 2539854 3188298 2882936 2874141 2886766 3223188
16871 3223188 3091576 3146041 3104993 3128671 3090037 3198456 3194973 3214787 3274685 3278403 3289240
16860 3289240 3610500 3765730 3848669 3663371 4103504 3874954 3599867 3816876 4249534 3879119
16850 3879119 3997024 3944322 4016979 4195819 4235914 4108542 4254393 4533617 4605420 4444396
16840 4444396 4533804 4488515 4744692 4730801 4808845 4870508 4757792 5027291 5268716 5097917
16830E097917M17494O461R4842M8986q2910K89839J67941p5001j16997J40883
16820E989455L48151O4612R3332m2523M29561j21158J10651L6912L67863K9268
16810G306124K60909m9864M68525J21788j39685K13435r1389N98144K17454j1296
16800H894145P7708K4245O5792N16329N99938p9524Q730L27827K96546K99466
16790A1031202L10238J02465K14309O70737L33250r6179L46018L85422J73587
16781A3471049N68699K04321M98463J24510N78633K40540M58151Q79614q720O10995
16771A7626255O50965L85548N96929M38607O77006K65000Q05474O68228O05609
16762B2719621Q63498J084051N58961P06108P70089J072494R51498J090288J162477
$$ plain form
16830 5097917 5515411 5521872 5616714 5665700 5582790 5872629 6040570 5965569 5848572 5989455
16820 5989455 6337606 6402218 6495550 6453027 6882588 6761430 6872081 6908993 7276856 7306124
16810 7306124 7567033 7517169 7985694 8107482 7967797 8181232 8089843 8687987 8905441 8894145
16800 8894145 8971853 8996098 9061890 9578219 10178157 10098633 10107363 10435190 10731736 11031202
16790 11031202 11341440 11443905 11658214 12328951 12662201 12566022 12912040 13297462 13471049
16781 13471049 14039748 14244069 14742532 14867042 15445675 15686215 16144366 17023980 17015260 17626255
16771 17626255 18277220 18662768 19259697 19698304 20375310 20640310 21445784 22114012 22719621
16762 22719621 23583119 24667170 25226131 25932239 26702328 27774822 28726320 29816608 30979085
16753C0979085Q46562J310223J024088J441268J446556J203986J391985J601866
16745D1245619J585884J767877J685168J812403K278825J840249K169935K257863
16737E6643823K324514K584726K582351K621054K714294K972441L241548L121467
16729G8806218K831344L932002L223551L437424L709640L726525L599415L443322
16721A06709441L640886L407940K941041L502282K880998K340259K362962K365820
16713A30151629J385943J250688O66416K89496l93558m91663j380934j220506
16705A30257511j983356k602000k591285k940850k766447l100662l673627l771498
16697A06827786l528262l697987l748391l518477l782627l804897l067618l374528
$$ plain form
16753 30979085 31825647 33135870 34159958 35601226 37047782 38251768 39643753 41245619
16745 41245619 42831503 44599380 46284548 48096951 50375776 52216025 54385960 56643823
16737 56643823 58968337 61553063 64135414 66756468 69470762 72443203 75684751 78806218
16729 78806218 81637562 85569564 88793115 92230539 95940179 99666704 103266119 106709441
16721 106709441 110350327 113758267 116699308 120201590 123082588 125422847 127785809 130151629
16713 130151629 131537572 132788260 133454676 133744172 133350614 132858951 131478017 130257511
16705 130257511 128274155 125672155 123080870 120140020 117373573 114272911 110599284 106827786
16697 106827786 103299524 99601537 95853146 92334669 88552042 84747145 81679527 78304999
16689G8304999l364344l278362k936686k801176k789913k325253k760501k489702
16681E5559062k277555k436093k079972j696111j918401j907149j787356j573171
16673C9883254j323526j734395j083337j635758j145625j413866j012121r15541
16665B9619085j210314j266828o67712r10190p17551q29007j029688n55753o73802
16656B1758240q49011m33173n72916q85662l51043m07721r64330n08783k94449
16647A6491152o63569j89858n71831l78157m10306l55729m04644k24577l47217
16638A2945264l98447m55877k88496l50190k00576k93176j63052n72994K20487
16629A0442943o05013R2170p92105J42007l77091P7897m49092k4013k66403m24229
$$ plain form
16689 78304999 74940655 71662293 68725607 65924431 63134518 60809265 58048764 55559062
16681 55559062 53281507 50845414 48765442 47069331 45150930 43243781 41456425 39883254
16673 39883254 38559728 36825333 35741996 34106238 32960613 31546747 30534626 29619085
16665 29619085 28408771 27141943 26474231 25564041 24846490 24017483 22987795 22432042 21758240
16656 21758240 20909229 20476056 19903140 19017478 18666435 18258714 17294384 16785601 16491152
16647 16491152 15827583 15637725 15065894 14687737 14277431 13921702 13517058 13292481 12945264
16638 12945264 12546817 12090940 11802444 11452254 11251678 10958502 10795450 10222456 10442943
16629 10442943 9837930 9930100 9137995 9280002 8902911 8980808 8531716 8507703 8241300 7817071
16619G817071R0113J20533m96582j26294j73004j28040j23097M9176m44515p2553
16609F512808K52235l92050j22505k33550l23289P8084K814j19595l18721K41987
16599E578218j79692J12449m38625J77168r4017k63946m0268o7902k55137N8365
16589D586613J43665m99159K37161j70827j54367O8401j67791m3896L7662k81467
16579C755995K3608j99967R5931J9372l56310j40293J53790M35234m64481J1977
16569C334856m9942k01794J23947p6076L1605k74091K20386n1165j08702R9324
16559C048348k18382J73815k96172j28231Q6033l53953L31388j17485P5209k01051
16549B399519o4928L63655p8991k47216J28971l03936j08845L64047m35773o6716
$$ plain form
16619 7817071 7907184 8027717 7531135 7404841 7231837 7103797 6980700 7029876 6585361 6512808
16609 6512808 6765043 6372993 6250488 6016938 5693649 5771733 5774547 5654952 5336231 5578218
16599 5578218 5398526 5510975 5072350 5249518 5155501 4891555 4851287 4783385 4528248 4586613
16589 4586613 4730278 4231119 4468280 4297453 4143086 4211487 4043696 3999800 4037462 3755995
16579 3755995 3779603 3579636 3675567 3694939 3338629 3198336 3352126 3787360 3322879 3334856
16569 3334856 3284914 3083120 3207067 3130991 3162596 2888505 3108891 3057726 2949024 3048348
16559 3048348 2829966 3003781 2707609 2579378 2665411 2311458 2642846 2525361 2600570 2399519
16549 2399519 2334591 2698246 2619255 2372039 2501010 2197074 2088229 2452276 2016503 1949787
16539A949787N64035n21463K23735l64048K11655r9919j05380N3209J42826k92399
16529A762038K33603L9014l5321n4941k51000K69255m4413l53941M79376j08249
16519A935421m52982L16507l56346l8058L05962l26172J06516L05502n2438n3985
16509A689927k39017M4285K27231j49742o5400J4039k88546J51615q2368J66965
16499A468989l58865P6798K74798l8271j864j44264o8488O6185J44682l02774
16489A116926L67268l96542J10717j59764K42265M8127j12936J49895P109k47866
16479A125199j40641N43772l85385j91010J94518m37380N93759m92615K06546
16470A016763J84224n6836K03454m84946m2937J12611L82981m53325M03810l27714
$$ plain form
16539 1949787 2513822 1992359 2216094 1852046 2063701 1963782 1858402 1911611 2054437 1762038
16529 1762038 1995641 2034655 1999334 1944393 1693393 1962648 1918235 1564294 2043670 1935421
16519 1935421 1482439 1798946 1442600 1404542 1710504 1384332 1490848 1796350 1743912 1689927
16509 1689927 1450910 1495195 1722426 1572684 1507284 1521323 1232777 1384392 1302024 1468989
16499 1468989 1110124 1186922 1461720 1423449 1421585 1277321 1208833 1275018 1419700 1116926
16489 1116926 1484194 1087652 1198369 1038605 1280870 1328997 1216061 1365956 1373065 1125199
16479 1125199 984558 1528330 1142945 951935 1146453 709073 1302832 810217 1016763
16470 1016763 1200987 1144151 1347605 862659 819722 932333 1315314 861989 1265799 938085
16460I38085j55120j7895k9794L59472j45117j69973J33539k14345j99134J78624
16450F78342M54678m15250J66088J01952k44181J06364M3574k30969M71765J36327
16440A268690E86730L38273j85836K6542q7452P7442Q0547K27194l95719k60495
16430D07226J57695J26438J54275D03473J79061R2636K49274j91009M8930j51833
16420F30532j37564J21416m7471J21640J2443J53287k36083L1064p3068j98075
16410C78121L87618k96766n1116K82306K3789O403C51841J32546K30694j11336
16400F03745j42990Q8543H3881N95774R1323j80532k47379O4503M61178l55870
16390E12878L54548k65462B94337L44125J78465k27841j69217M7693N8834J06767
$$ plain form
16460 938085 782965 765070 735276 1094748 949631 779658 913197 698852 499718 678342
16450 678342 1133020 717770 883858 985810 741629 847993 891567 660598 1132363 1268690
16440 1268690 586730 925003 739167 765709 678257 755699 836246 1063440 667721 407226
16430 407226 564921 691359 845634 403473 582534 675170 924444 733435 782365 630532
16420 630532 492968 614384 566913 688553 700996 854283 618200 649264 576196 378121
16410 378121 765739 468973 417857 700163 723952 730355 351841 484387 715081 603745
16400 603745 460755 549298 83881 679655 770978 590446 343067 407570 868748 512878
16390 512878 867426 601964 294337 638462 816927 589086 419869 467562 526396 633163
16380F33163K55831l28162L1623H5901N01190n7111j128j86924K22989j92741
16370C72176L2733q2671L2979j58335L41062J77479A47232M00892k25858N3019
16360C75285r3940J66690M1021m8078j50787P7191k525O2286J280P6955L5337
16349E40715k08841h6293C69015J39330B10683K00214A41265J18522L27065B18504
16338A84900J29193K8631O274J37796j03032g5254C54371j35013M7340N0434o4294
16327B52838K67891g9691E46728A84895G8374K48161j04504J63281J00724j04131
16317C81905H1788J93978a25963D70379n9073A79165L18017L8469A36961J35738
16307B72699A20531Q5416L66086j77995A14986C4541J29166l0909Q0573J59833
$$ plain form
16380 633163 888994 560832 592455 85901 587091 529980 528852 341928 564917 372176
16370 372176 404909 322238 355217 196882 537944 715423 147232 548124 322266 375285
16360 375285 281345 448035 489056 440978 290191 367382 364857 427143 428423 505378 540715
16349 540715 331874 -86293 369015 508345 210683 410897 141265 259787 586852 218504
16338 184900 314093 342724 348998 486794 383762 -75254 354371 219358 266698 317132 252838
16327 252838 520729 -79691 546728 184895 78374 326535 222031 385312 486036 381905
16317 381905 81788 275766 -125963 470379 411306 179165 497182 535651 136961 272699
16307 272699 120531 205947 572033 394038 114986 34541 163707 132798 213371 373204
16297C73204e5119B22614J08284J6871j47370L49787j54076b8426D64470A70815
16286C58078J77654Q2254k621J46527j95503j49081j28918N6526p1671l4639A16499
16274A67608o3724m8090K45883J3912G8093J46641j649H4374K11650O0862j66770
16263A90116I2688b0035k8451B69202a59898D07917e7850I4570J76675j20192
16253A51053P0465J71768H3513O9994F8776b36416B98708K15529B19974P5108
16243B95082n806D4825i9038C69644A22108K6545M76719E1620M0177L93042B05767
16231B93004j09957g6088C79728p5105j44213R1068g7624A95055J44324j31518
16221B07861L8184m3113C1978Q8156J74189A1611L75298j30521K64536F2304j4816
$$ plain form
16297 373204 -55119 222614 330898 347769 200399 550186 396110 -28426 464470 170815
16286 358078 535732 617986 615365 761892 566389 417308 288390 344916 273245 238606 116499
16274 167608 103884 55794 301677 315589 78093 224734 223085 84374 296024 356886 190116
16263 190116 92688 -20035 -48486 269202 -159898 407917 -57850 94570 271245 151053
16253 151053 221518 393286 83513 153507 68776 -236416 298708 514237 219974 295082
16243 295082 289276 44825 -99038 369644 122108 148653 625372 51620 91797 484839 205767
16231 293004 183047 -76088 379728 304623 160410 251478 -77624 195055 339379 207861
16221 207861 246045 202932 31978 120134 294323 11611 386909 256388 520924 62304 47488
16210D7488f8571k9842E69884I8764O4997p5382J70881Q8661o70A58153p3181
16199H4972l2958c1621A65472b8567A37854N1571Q1877j2984r5429N4153A3856
16187F9017L89774P3966B01749J37043d3058A03919K6890a81207B62374H9235
16176D52351A44155n8349K95288Q5933B7583J94839J18329H5179L3903j8202J29214
16165B30094o3021n8951A3453a3877A14334L00467c0512A99738c75305a45490
16154i2423D28217r4997A51685c9746B41118P8087A52998a31957N0577A99012
16143b9538B58675D3429R3440m1641f0660B02101E5347J28280G3783J29010J508
16132B04301m8928A3775a41130C10942A00036c9873A76887l8466C3047a30021
$$ plain form
16210 47488 -68571 -98413 569884 98764 163761 88379 259260 347921 347251 158153 84972
16199 84972 52014 -31621 165472 -28567 137854 189425 271302 258318 162889 217042 13856
16187 69017 458791 532757 201749 338792 -43058 103919 130809 -181207 262374 89235
16176 452351 144155 85806 381094 467027 27583 222422 340751 85179 119082 100880 230094
16165 230094 167073 108122 13453 -13877 114334 414801 -30512 199738 -375305 -145490
16154 -92423 428217 333220 151685 -39746 241118 319205 152998 -131957 -81380 199012
16143 -29538 258675 43429 136869 95228 -60660 202101 55347 183627 73783 202793 204301
16132 204301 155373 13775 -141130 310942 100036 -39873 176887 138421 33047 -130021
16121c1423m5639I2963b19728B30170b09294R8301D6996K64380C4771K7858k847
16110E9782K2008a44576A86598o3553B6051a98847D05039L49027c069A42242B8369
16098E15607A35133e6886G1553K04770o1424K4413b92161A38909c8608L838C5590
16086b13756c4567A67899b89853d8757D71302G1138P5913h1180A03938J83519
16076B87457J41858B00543H5293P9163b62412A87677J509F5620K40048a07504
16065A08820Q2198q8296a51226B38867E3418O6517J44595b53815F0167K3312J19047
16054B02526l6421K30211I2283L5939d28071D7977e1524A98017J61343m3628j8937
16043B96795q7360c242B13389j5797a8097j97338Q9853h025k23931A22298J6466
$$ plain form
16121 -31423 -77062 92963 -219728 230170 -209294 -110993 46996 311376 34771 62629 59782
16110 59782 81790 -144576 186598 123045 26051 -198847 405039 754066 -3069 142242 28369
16098 515607 135133 -56886 71553 276323 214899 239312 -292161 138909 -38608 -34770 35590
16086 -213756 -34567 167899 -289853 -48757 471302 71138 147051 -81180 103938 287457
16076 287457 429315 200543 85293 164456 -262412 187677 189186 65620 305668 -107504
16065 108820 191018 102722 -151226 238867 53418 119935 264530 -253815 60167 83479 202526
16054 202526 166105 396316 92283 128222 -428071 47977 -51524 198017 359360 315732 296795
16043 296795 209435 -3242 213389 197592 -18097 -215435 -125582 -8025 -231956 122298 138764
16032A38764k9865Q2196c6710l1574F6270f3934I1959a09198j07048A05186J70436
16021B75622g5015H0650i70B71870e0620a1759A62852J89485E9583a3136I3998
16009C0595b44127i9597M429A33099C3216a19291d8753b1913E5995f5324j24459
15998a89783J8892m7299G8980J48955h1466r3796C08541L7384A21466b3313E5864
15986f2087A66205H986K11494b5425F2572J19987A2241K29842g8140A4324J50265
15975A64589d9774L924q7880I0208g3754a0793A10858i7061F1302e7053C88994
15963A11087L8960K80373A6655J4965c70518A27143a27455c8446l83143a18988
15952c3785b412j5757m009C9601M3305a44391b7972A44814e4498C1586J20884
$$ plain form
16032 138764 108899 191095 -36710 -68284 66270 -63934 91959 -109198 -216246 105186 275622
16021 275622 -75015 80650 -970 271870 -50620 -11759 162852 352337 59583 -13136 93998
16009 30595 -244127 -99597 -95168 133099 33216 -119291 -48753 -21913 55995 -65324 -189783
15998 -189783 -170891 -218190 78980 227935 -81466 -175262 308541 345925 121466 -23313 55864
15986 -62087 166205 8986 220480 -25425 62572 182559 12241 242083 -78140 14324 164589
15975 164589 -49774 -45850 -133730 90208 -73754 -10793 110858 -97061 61302 -57053 388994
15963 111087 150047 430420 16655 31620 -370518 127143 -127455 -38446 -421589 -118988
15952 -33785 -2412 -18169 -22178 39601 82906 -144391 -27972 144814 -54498 31586 152470
15941A52470K75883j08391j49737d0219p3855B27857g5576a2229k31035h6864
15930b6862l34567B37573a57988A48184J76903A12333Q7166b46164a3948k10699
15920b24647J03820G4368e7887A79183J26560A09395j7442a14858A85549b05627
15909A67736a8631k62219b3670j17771e1988j12070M1279E70792b75669C87125
15898B75355d6502A624L7262h3167C73427A46770C7752K56593K0912r5580J22257
15887C41934f8656H8131g5921A36737c4015P799m0439A0478J62122a0342A50593
15875a71385F4841M550K22489H7364h8161j51970C49329f2535H8713f9051G8235
15863b47928A16949l3365J00225F3384Q8180f393B33227p5737a89708e636l6520
$$ plain form
15941 152470 428353 319962 170225 -40219 -114074 227857 -75576 -12229 -243264 -86864
15930 -26862 -361429 237573 -157988 148184 325087 112333 199499 -246164 -13948 -224647
15920 -224647 -120827 74368 -57887 179183 305743 109395 91953 -114858 185549 -205627
15909 167736 -18631 -280850 -23670 -141441 -51988 -164058 -122779 570792 -275669 387125
15898 275355 -46502 1624 38886 -83167 373427 146770 37752 294345 315257 219677 341934
15887 341934 -68656 88131 -75921 136737 -34015 -26216 -66655 10478 172600 -10342 150593
15875 -171385 64841 69391 291880 87364 -88161 -240131 349329 -62535 88713 -69051 78235
15863 -247928 116949 83584 183809 63384 151564 -6393 233227 157490 -189708 -5636 -42156
15852d2156G7871k8277d557j18467q7949p3882a5830j2097E8019P9876L6574a73778
15839c22105N2317E5459b15098F169d5883H3740b35926J895a05568A33152h1329
15827D0308a26779d3449I0378J53745g1370C58502h7768a7952j39086P3248c0501
15815e1959A60651a05631j24820f123l8854m6092b728j60310N5293K8423d626
15803C9616J58463f0965C97351A84005M2760a20677B2151J9145c55816c3041l77330
15792d10371J67441q61a18683B17508d08284d3234j60769A12568e3617C66878
15781F0297N7881M6679D3866e9924b8799j93257A32470F3182K5806b8045k45360
15770b73405a8545O281G8852d0558B4205N6787J42929E1357a22876A02854L0297
$$ plain form
15852 -42156 77871 49594 -4557 -123024 -210973 -284855 -15830 -27927 58019 137895 174469 -173778
15839 -322105 -269788 55459 -215098 6169 -45883 83740 -235926 -234031 -105568 133152 -81329
15827 40308 -126779 -43449 90378 244123 -71370 358502 -87768 -17952 -157038 -83790 -30501
15815 -51959 160651 -105631 -230451 -6123 -44977 -91069 -2728 -163038 -107745 -79322 -4626
15803 39616 198079 -60965 397351 184005 226765 -120677 22151 41296 -355816 -33041 -410371
15792 -410371 -242930 -243791 -118683 217508 -408284 -43234 -204003 112568 -53617 366878
15781 60297 118178 164857 43866 -59924 -28799 -222056 132470 63182 88988 -28045 -273405
15770 -273405 -18545 -12264 78852 -40558 24205 80992 223921 51357 -122876 102854 133151
15759A33151J34828C1172f7485B7467a22135A81423n3093m1047k7097J44285a33171
15747b08597A88813g9720F0874J53557B116J45389d1126I5668a05803A28302J7440
15736A45742C5461i8290A90596b51543B11698q8141K21666F627i537C0769a04982
15724E5947B344L8007j1929J574J09017F911b15630b5434B83830I857O7928a20116
15711B56498j13075m1412a98044D6374J27576K4460l9948i9120c3139p6822B6641
15699d50p9753B67517a34797p0155p8142A44042h5837b0037n829k4808B01441
15687a04357F1930k8309j4023E81J92969c95191B24082a16348A21767k3398e3466
15675c7189B98654p7335a7484n48C81356C4434K46855a50733F9329B0749b9856
$$ plain form
15759 133151 267979 31172 -67485 27467 -122135 181423 128330 87283 60186 204471 -133171
15747 -208597 188813 -79720 60874 214431 2116 147505 -41126 95668 -105803 128302 145742
15736 145742 35461 -98290 190596 -251543 211698 123557 345223 6627 -9537 30769 -104982
15724 55947 2344 40351 28422 29996 139013 6911 -215630 -25434 283830 9857 77785 -120116
15711 256498 143423 102011 -198044 46374 173950 198410 158462 -99120 -33139 -109961 26641
15699 -450 -80203 267517 -134797 -204952 -283094 144042 -85837 -20037 -25866 -50674 201441
15687 -104357 61930 33621 19598 581 193550 -395191 224082 -116348 121767 98369 -53466
15675 -37189 298654 221319 -17484 -18032 381356 34434 281289 -150733 69329 20749 -29856
15663b35027C56661f4324A01599a5957B58797g3643C9676a14988B24999B7826
15652I3657J24489R7019i4889A06932A6493b76715A99349a49347j04541A49432
15641A54563a46206B75973j06870d0482B36277b17144O9635F661e8957j17408
15631a76365j2642Q4300c674j54176K1899A22040M6107a10228B5331a5062A65873
15619i3715A1487a46011k3993H9833i3571G9099f1742j38580M5974A06701h5555
15607B15J58537l1556K1928b12044E0726c16735A82494a82186o2003b1046A67105
15595c11553g2784B99602B0371a27956A62500J74494A31303J25131r5843B0005
15584f5076I6297h7415E4809b2679H9581A7885J315K08449a19503E3756k3109
$$ plain form
15663 -235027 356661 -64324 101599 -15957 258797 -73643 39676 -114988 224999 27826
15652 93657 218146 315165 -94889 106932 16493 -276715 199349 -149347 -253888 149432
15641 154563 -146206 275973 169103 -40482 236277 -217144 -147509 6661 -58957 -176365
15631 -176365 -189007 -104707 -3674 -157850 -135951 122040 168147 -110228 25331 -15062 165873
15619 -93715 11487 -146011 -170004 89833 -93571 79099 -61742 -200322 -154348 106701 -85555
15607 215 158752 127196 149124 -212044 50726 -316735 182494 -182186 -244189 -21046 167105
15595 -311553 -72784 299602 20371 -127956 162500 336994 131303 256434 160591 20005
15584 -65076 96297 -87415 54809 -22679 89581 17885 19200 227649 -119503 53756 30647
15573C0647L57235q0835b8194j30320D1976a50430G3339a51114L3460E1426a18560
15561E19222a7362A89524d9193D7014e6660G6077h1134B77703r0380C0656P9977
15550A10633D4814K23156A24336h6281d1474G9082L3055J83576c9815B04826l9500
15539A65326D9146A4678J12949d3451C21824f6469C58524E6566J16936q3359K2046
15528A12189a96018A0030K97787A3653Q8837B5818g0709q0786C41952J7854A51383
15516I997M5583Q7637h0257m6735A16504K9134c4595I7307D0013a89730A62883
15504h762j70539o6610g5616K7724B1149b27496C05439M5686c4119l2698B19129
15492F6005L2612K07705A32623l5856J12899g0989j89702D11043H7180L635i7953
$$ plain form
15573 30647 387882 307047 -28194 -158514 41976 -150430 73339 -151114 -117654 51426 -118560
15561 519222 -17362 189524 -49193 47014 -56660 76077 -81134 277703 187323 30656 110633
15550 110633 44814 267970 124336 -86281 -41474 79082 112137 295713 -39815 204826 165326
15539 165326 49146 14678 127627 -43451 321824 -66469 358524 56566 173502 90143 112189
15528 112189 -196018 10030 307817 13653 102490 25818 -70709 -151495 341952 359806 151383
15516 9997 55580 143217 -80257 -126992 116504 145638 -34595 97307 40013 -189730 162883
15504 -8762 -179301 -245911 -75616 -47892 21149 -227496 305439 351125 -34119 -66817 219129
15492 66005 98617 306322 132623 96767 209666 -70989 -260691 411043 87180 90815 -97953
15480A63100n474L4643m6215d1626A5844L70979j45269l4468a1221A35105n4907
15469H0198h2911E5315b10830P3133m83B36116K6142E9647a70601A44259L11420
15458D55679j53998B3281N7373a82979L6305A21219l078c7454C54796H1102Q567
15447H9669b2769A2562J09273E6154J89930H5476a23895A74299A2267a69226L9909
15436a29317B20146q6063f6751E9051f5703A65757e13902K42263d1516A97481
15425C0469g6185C69703C9290K38854A14287O0708J6302C4481K11385c7791C73599
15413c8317A06370N5786J67453I7559J20439g5214E240a09483C50309j10640r2946
15402A46723L01590A10062B2920J41972J12910N4140a5427j35915D4414a30789
$$ plain form
15480 163100 157626 192269 146054 -41626 15844 386823 241554 207086 -11221 135105 80198
15469 80198 -82911 55315 -210830 -137697 -138180 236116 262258 59647 -170601 144259 455679
15458 455679 301681 23281 80654 -182979 -146674 121219 118141 -37454 354796 81102 89669
15447 89669 -22769 12562 121835 56154 246084 85476 -123895 174299 12267 -169226 -129317
15436 -129317 220146 134083 -66751 59051 -65703 165757 -513902 -271639 -41516 197481
15425 30469 -76185 369703 39290 278144 114287 174995 191297 34481 245866 -37791 373599
15413 -38317 106370 162156 329609 97559 217998 -75214 5240 -109483 350309 239669 146723
15402 146723 448313 110062 22920 164892 277802 331942 -15427 -151342 44414 -130789
15391A9642L97263A07608J55964A5452K06999m208a57762B2368L44427a1863A33219
15379B64555A03423a15428A87779a89891C35488A42609J27751P5579A21696k9922
15369I1774A6800K52901r3263O4605J48346I0429a21618H1136J16563p7240M6029
15358A66488c5365l2944I2103J11823k8713a07526B95515o1137l690m9472g3823
15346A45755P2324l2027d1213D5721P0206M269h434n9534E0339J55611j4517C517
15333C32090A8716a97247B52114C1531N5642G053J97009N2597d61761A6956b40766
15321B6152J13058a64176a6258F2151K40384A15661J01917a6126j70486A06520
15310E9234j9259J27149H611b38857A84901H4501J91112c9236D15364h1353H5890
$$ plain form
15391 19642 416905 107608 263572 15452 222451 218243 -157762 22368 366795 -11863 133219
15379 264555 103423 -115428 187779 -189891 335488 142609 270360 345939 121696 91774
15369 91774 16800 269701 176438 241043 389389 90429 -121618 81136 197699 120459 166488
15358 166488 -35365 -68309 92103 203926 175213 -107526 295515 234378 230688 181216 -73823
15346 145755 218079 186052 -41213 45721 115927 120196 -8434 -67968 50339 205950 191433 3517
15333 332090 18716 -197247 252114 31531 87173 7053 204062 256659 -461761 16956 -240766
15321 26152 139210 -164176 -16258 62151 302535 115661 217578 -16126 -186612 106520
15310 59234 39975 167124 8611 -238857 184901 84501 275613 -39236 415364 -81353 85890
15298A47590F7282K20170F6632J88661I0413l0464a38723A47203J59781j0787
15288B96197r5092n9602D1372K83795j51188M44640A59794K48174E8099J91876
15278B49975K25596k9969A12438J62469k9539l7683J45738A3738L48053j06523
15268B55268j19178M5087C3873L77153A13741D5929N9506l1751K64229A65466
15257B42690E4483O6341m3005J0413K55968A61484M26143k31967L042k9122O75016
15246A004596P05893j98401L58501l29366o67202B71475B5583K95427F4436L70560
15236D34996j06443A22296J15699J13714C1885L16182K9819E2192i5443A89081
15225A38535J185J37673q8862K1287n2714c1804G5644J92178a14156A64158E8142
$$ plain form
15298 147590 67282 287452 66632 255293 90413 59949 -138723 147203 306984 296197
15288 296197 201105 141503 41372 325167 173979 618619 159794 407968 58099 249975
15278 249975 475571 445602 112438 274907 245368 207685 353423 13738 361791 255268
15268 255268 136090 181177 33873 411026 113741 45929 105435 73684 337913 165466
15257 242690 54483 120824 77819 88232 344200 161484 587627 355660 358702 329580 1004596
15246 1004596 1710489 1512088 1870589 1541223 874021 271475 25583 321010 64436 434996
15236 434996 328553 122296 237995 351709 31885 348067 377886 52192 -95443 189081
15225 138535 139720 277393 188531 209818 157104 -31804 75644 267822 -114156 164158 58142
15213C50228I9972Q0246M1417n9466e0417A12550N34745B16953l2976K89796B05583
15201A87975G9745J97398j731J29461R0312h663A86077o6066L6288o9297L73097
15190D60099B24851J14455j33512M2177a52358D43627a35100A18863M32120b88610
15179A11750j8007J17486F8922Q6198c10355A30695Q6830O8190I2565J35928a486
15167A94140K5972K24818j76196B5235d526B46508P6359l2264J3127L1840J17719
15156D53289k12291F463J77713M4669q9510a4593A84000H8269K54816g9869C35098
15144D14041c364B52749f1795g080B85374b80076c4501A38035K02946A68469b61908
15132C53129J05185g2261B27361l4122J32020N1126j03728K80104e1845B68721
$$ plain form
15213 350228 99972 180218 221635 162169 -50417 112550 647295 216953 183977 473773 205583
15201 187975 79745 277143 275412 404873 495185 -8663 186077 120011 156299 87002 460099
15190 460099 224851 339306 205794 247971 -152358 443627 -135100 118863 550983 -288610
15179 111750 93743 211229 68922 155120 -310355 130695 217525 285715 92565 228493 -1486
15167 194140 220112 444930 268734 25235 -4526 246508 322867 290603 303730 335570 453289
15156 453289 240998 6463 184176 228845 139335 -14593 184000 88269 343085 -79869 335098
15144 414041 -3364 252749 -61795 -7080 285374 -280076 -34501 138035 340981 168469 -261908
15132 353129 458314 -72261 227361 193239 325259 376385 272657 552761 -51845 268721
15121D40488A97753P4398G3618J35318b14800a2551B113P662J11429a36545B10025
15109D73184A33416K65331j73984K71640f3835B54072c46765B9086J56569J86533
15099C72188L29085A51472N31875j63938q7124A27776R1041a20372B18285J86020
15089D04305j57804J78554C5235M07961j2745A64873D8717J31440o200j9003K01205
15078C56159g294F9079J35174H0302L40945R89P3059n6717E679L95685j41663
15067B59701P0243M3817M6524j99238n1922q4112J17587P7237c0895B80786K47510
15056E28296A36565J91295j02579M11552j33509m7247j37503p5948K30972j2188
15046D61410K93886B41480M08107j28286q6740M9789p9264j1241A26658J24249
$$ plain form
15121 440488 197753 272151 73618 208936 -214800 -12551 2113 9775 121204 -136545 210025
15109 473184 133416 398747 224763 496403 -63835 254072 -346765 29086 185655 372188
15099 372188 701273 151472 683347 519409 432285 127776 218817 -120372 218285 404305
15089 404305 246501 425055 35235 443196 430451 164873 48717 180157 173957 154954 356159
15078 356159 -7294 69079 204253 80302 421247 422236 495295 438578 5679 401364 259701
15067 259701 329944 373761 420285 221047 169125 85013 202600 279837 -30895 280786 528296
15056 528296 136565 327860 225281 636833 503324 456077 318574 242626 473598 461410
15046 461410 755296 241480 649587 521301 434561 484350 405086 393845 126658 250907
15036B50907q9741J07021G1073L08322A65309J81803A68015n3875M36491B69083
15025C29423M2609J88703A61480J80220K15511j64605j24928M34822k74767N849
15015D33582N4489J00958A20263J95381K69263B31372L29442j64377j36727M7863
15005C07573J08107j17232q4101J73141Q2599J60864k15922J38940j55998q7753
14995C10218P0724A85928K87820k28005H7350K22690J39774H1812Q0605L99532
14985E61949B49494L76239l3135B48632K90644j65677M51857C17051K06087L1076
14975E54214A80844J9072L2859K17903K4308J3102j63627l9304j30807L79613
14965E33963k14435N5577L17708k35431p7594q6873A39892K28223K0647L03884
$$ plain form
15036 250907 161166 268187 71073 379395 165309 347112 168015 114140 550631 269083
15025 329423 372032 560735 161480 341700 557211 392606 267678 702500 427733 433582
15015 433582 488071 589029 120263 315644 584907 231372 560814 396437 259710 307573
15005 307573 415680 298448 214347 387488 470087 630951 415029 553969 397971 310218
14995 310218 380942 185928 473748 245743 87350 310040 449814 81812 162417 561949
14985 561949 249494 625733 592598 248632 539276 373599 825456 317051 523138 554214
14975 554214 180844 199916 232775 450678 474986 488088 324461 285157 154350 533963
14965 533963 319528 375105 692813 457382 379788 292915 139892 368115 388762 692646
14955F92646m1358K34919B95338K90590A05916M02951K0128j1724o2854J408m8514
14944D07311q6929L49356o3917p207M3893k18693q323J25500J38460j20112A31195
14932C35018n7241L55795l11559J99139q5277K05338p3097J58456l24105p0269
14922C32198J55590J88990l14940J7060j2982L50910k97106K8197J66251k91779
14912C22389L36084B10368K35774A90631K31582r6775L31998j19287j07985O5111
14902D95275N4355J02811l23353J79875L6686m5002j12908p4733M89036l04445
14892D97597K63593j57917j03467J15085k97322R9495B03134M00172q1137M7793
14882E69962m554M9212j95253K23030k68945M76302l12429j20327J46643j35722
$$ plain form
14955 692646 651288 886207 295338 585928 105916 508867 528995 517271 454417 455825 407311
14944 407311 320382 669738 605821 598614 642507 423814 415491 540991 679451 559339 131195
14932 335018 277777 633572 322013 521152 435875 641213 568116 726572 402467 332198
14922 332198 487788 676778 361838 378898 365916 716826 419720 447917 614168 322389
14912 322389 658473 210368 446142 190631 422213 325438 657436 538149 430164 495275
14902 495275 549630 652441 329088 508963 545649 500647 387739 313006 802042 497597
14892 497597 761190 603273 499806 614891 317569 417064 203134 603306 522169 569962
14882 569962 565408 614620 419367 642397 373452 849754 537325 416998 563641 427919
14872D27919j3705L73409l6937l69160J25908M837R8017L99829C05327J63495
14862D68822H7604O43556C57732K08201k72704K20960L26803l20071l7674J1687
14852D94934R5577r8276J70177J23061n1071K6012j11661n8950j99416M02099
14842G92486j78902j55431K57561k61105K41726O28Q2567C62560R3364k5467P71839
14831A202296j74714D53452j19361J44881K07967J19302j10724m954J09312j63155
14821F36720j17478J74429r5168n9504L1743K33890l46394J66393J31003j07644
14811F47990k29713M37956Q2278J7500H0980L08902K93848r8435o9262J02554
14801F18587m3193J6510J21047j2945k3931k70484K5403K73666n6816L16621l17800
$$ plain form
14872 427919 414214 787623 750686 381526 507434 512271 610288 1010117 305327 468822
14862 468822 87604 731160 357732 565933 293229 514189 840992 520921 483247 494934
14852 494934 590511 492235 662412 785473 734402 760414 648753 589803 390387 792486
14842 792486 613584 458153 715714 454609 696335 696963 779530 362560 455924 430457 1202296
14831 1202296 1027582 453452 334091 478972 686939 806241 695517 690563 799875 636720
14821 636720 519242 693671 598503 538999 570742 804632 458238 624631 755634 647990
14811 647990 418277 856233 938511 956011 80980 389882 683730 585295 516033 618587
14801 618587 575394 591904 712951 700006 676075 405591 430994 704660 647844 964465 646665
14790F46665K086Q3837J61828l96164K20830n2459P0970N8241l7045L45955m28026
14779F76718K61030k92500J95953j81732P2270J11030j60353L248j0991j71537
14769E03136L28618K7220p5962k3002N349K9034r6226J87219o9751l689j8644
14758G93302l3086L03521l72164K78200k00984j4555k60700P0621L26676K52074
14748A142905k92057K7704p9186p5134K84926j27379L4554l84889K83381K24338
14738A039163l29677L04151j61187J41159j46602K17057n4556M3429k202K35269
14728A286004n47705L12072m48051K78063L7620K5999o4832O7906P9484P7176
14718A103736o6770j13447O2806j80188J24072J04032j55556l16641M42886j45933
$$ plain form
14790 646665 648751 732588 894416 498252 719082 666623 737593 795834 758789 1104744 676718
14779 676718 937748 645248 841201 659469 731739 842769 682416 685664 674673 503136
14769 503136 831754 858974 783012 760010 765359 794393 698167 885386 815635 811946 793302
14758 793302 760216 1063737 691573 969773 768789 754234 493534 564155 890831 1142905
14748 1142905 850848 878552 799366 724232 1009158 881779 916333 531444 814825 1039163
14738 1039163 709486 1013637 852450 993609 847007 1064064 1009508 1052937 1050735 1286004
14728 1286004 738299 1050371 602320 880383 918003 944002 879170 947076 1026560 1103736
14718 1103736 1036966 923519 986325 806137 930209 1034241 878685 562044 1004930 858997
14708H58997O6200j51506J50740L98039k89953l1353j28164l05877J76937o3352
14698F80708N49476m63667K23270k22966J00329K79498J58329l14674Q0399j81998
14688H88704m07r756Q2052j19670r1168J77789J71288L1813n2050l35197K47106
14677I90504N1449k67948N04790l69183j60268K91923l8701N0710K26651l90184
14667H89743J45372p2261j61502q8743L30502J7510m2867k018L4640r6095M23478
14656A377759k48751J30613l81973K94939j04105K70559l42443L4839K63139o417
14646A288159k80544K48707j93573J27163r3940K29363k14021K76625J07259m7213
14636A447985j91884Q9477r9359J72484P4428k06146J7889o3114n2825J41284
$$ plain form
14708 858997 925197 773691 924431 1322470 1032517 1001164 873000 567123 744060 680708
14698 680708 1230184 766517 989787 766821 867150 1146648 1304977 990303 1070702 888704
14688 888704 888297 878541 960593 840923 749755 927544 1098832 1130645 1078595 743398 990504
14677 990504 1041953 774005 1278795 909612 749344 1041267 1002566 1053276 1279927 889743
14667 889743 1035115 962854 801352 712609 1043111 1060621 1017754 1015736 1050376 954281 1377759
14656 1377759 1129008 1259621 877648 1172587 1068482 1339041 996598 1031437 1294576 1288159
14646 1288159 1007615 1256322 1062749 1189912 1095972 1325335 1111314 1387939 1495198 1447985
14636 1447985 1256101 1345578 1246219 1418703 1493131 1286985 1304874 1241760 1188935 1330219
14626A330219k13111L96812k68208j44462K89300o2411L0611o4430j78254K32617
14616A348683r4697K83027P9569k48925L95316n79690J70814r6319J9437J14322
14606A391537J59752L111O3509j67646M0884j2077j80360K47904k19199L86568
14596A713983P6416l29131R7635l79987P64489m97804K09978k44016M9085L8497
14586A499145M6902L85598J54513n04246K97215j77219j894P6168l267K30156
14576B003071l59510J31678J1927o3168K74672j29990L07059j51398l37919M05995
14566B092417J79840k30684J66685Q8342K18199L2089k52759J09446L36161j39336
14556B600400L27170O7438j49674N57601J90867J10942J515472K230005M003584
$$ plain form
14626 1330219 1117108 1513920 1245712 1101250 1390550 1328139 1358750 1294320 1116066 1348683
14616 1348683 1253986 1537013 1616582 1367657 1762973 1183283 1354097 1257778 1277215 1391537
14606 1391537 1551289 1554400 1617909 1450263 1491147 1479070 1298710 1546614 1327415 1713983
14596 1713983 1790399 1461268 1558903 1178916 1943405 1445601 1655579 1411563 1460648 1499145
14586 1499145 1546047 1931645 2086158 1581912 1879127 1701908 1700014 1776182 1772915 2003071
14576 2003071 1643561 1775239 1787166 1723998 1998670 1868680 2175739 2024341 1686422 2092417
14566 2092417 2272257 2041573 2208258 2296600 2514799 2546888 2294129 2403575 2739736 2600400
14556 2600400 2927570 2995008 2845334 3402935 3593802 3704744 5220216 7450221 11453805
14547A1453805R416262J9884408M89545A8751172G892988j287152k283129j712257
14539B610450n20075j94985l2874J09289l69347N26582j50044r279O009k00203
14529A775523P0404M39831j09922j61073J22989J39064N7952l43323M23064l44900
14519B069609J90672J19742m7836K31727p5627K01511n13608K69474j94265L383
14509B254782k599L59665K56475n0238k46863J61863J43432q7820l05592M36221
14499B919326O4198K44752k15560J56154K25923k90529J60185R1482m89l90739
14489B964703L25233n06964M97036j43131K97020J4321J75949j28884l0880J30791
14479C595194L46739j42949l3709m08934L03689j09999K32485r5992J06729J88510
$$ plain form
14547 11453805 20870067 40754475 41244020 18751172 7892988 6605836 4322707 2610450
14539 2610450 2090375 1895390 1862516 1971805 1602458 2129040 1978996 1969717 1975726 1775523
14529 1775523 1845927 2285758 2175836 2014763 2137752 2276816 2334768 1991445 2414509 2069609
14519 2069609 2260281 2380023 2332187 2563914 2488287 2689798 2176190 2445664 2251399 2254782
14509 2254782 2252183 2611848 2868323 2818085 2571222 2733085 2876517 2788697 2483105 2919326
14499 2919326 2983524 3228276 3012716 3168870 3394793 3104264 3264449 3355931 3355442 2964703
14489 2964703 3289936 2782972 3280008 3136877 3433897 3448218 3624167 3495283 3464403 3595194
14479 3595194 3941933 3798984 3765275 3356341 3660030 3550031 3782516 3686524 3793253 3981763
14469C981763j20689l6659l844J29506M05701J5798J13724l69323K04556p973
14459D312560R4387K53917k76461Q8013N10836l21430n3083J63830K56612J0827
14449E040008J30844k25379K53004q1804J49887L7920K66882P2779k28132K43319
14439E659328j45907J65897j15927M328M01840K30201k06320j76347L53898K56349
14429F427340J053m5564j00377K43501J63089M7309J53157k11202K12447J72590
14419G063343L48008J6068J83076n8362L0712K52061J38347q4709K72558M04571
14409H565673n74181O10694K3008m0147N74306r825N1121J20819j5412R9502L13225
14398I718783K99962K69707l64686O18382l4452O18942k87129L17886O4636r6174
$$ plain form
14469 3981763 3861074 3824415 3820571 3950077 4355778 4371576 4485300 4115977 4320533 4312560
14459 4312560 4406947 4660864 4384403 4472416 4983252 4661822 4608739 4772569 5029181 5040008
14449 5040008 5170852 4945473 5198477 5116673 5266560 5304480 5571362 5644141 5416009 5659328
14439 5659328 5513421 5679318 5563391 5567719 5969559 6199760 5993440 5817093 6170991 6427340
14429 6427340 6428393 6382829 6282452 6525953 6689042 6736351 6889508 6678306 6890753 7063343
14419 7063343 7411351 7427419 7610495 7552133 7582845 7834906 7973253 7888544 8161102 8565673
14409 8565673 7991492 8602186 8625194 8585047 9159353 9149528 9200649 9321468 9306056 9405558 9718783
14398 9718783 10018745 10288452 9923766 10542148 10507696 11126638 10839509 11157395 11222031 11125857
14388A1125857R41150n66349N15779K55435O6737K12710O7783O19323K09885J47586
14378A3595896J21176N16327J35376N70287M1601L51549l1098O01304M77672J20925
14368A6501015K70280M87086L14732K17243O84813L63175K15700O78353N5473
14359A9787870M44496P96879M65510L01006M03005O45354M60320R31882M9435
14350B4285757O59649M70284P03300O19006Q75818P57716M87733O43045J239671
14341C0741979O38774P60405R87412Q47397J122258Q84659R75769J518502Q00385
14332C9277540J056755J185577J381571J511825J351081J640376J493015J578427
14324E0476167J484072K083673J690619K084682J869449K259727K327749K291213
$$ plain form
14388 11125857 12067007 11500658 12016437 12271872 12338609 12551319 12619102 13238425 13448310 13595896
14378 13595896 13717072 14233399 14368775 14939062 14980663 15332212 15301114 15902418 16380090 16501015
14368 16501015 16771295 17258381 17573113 17790356 18475169 18838344 19054044 19732397 19787870
14359 19787870 20232366 21029245 21494755 21795761 22198766 22844120 23304440 24236322 24285757
14350 24285757 24945406 25415690 26118990 26737996 27613814 28371530 28859263 29502308 30741979
14341 30741979 31380753 32141158 33128570 33975967 35098225 35982884 36958653 38477155 39277540
14332 39277540 40334295 41519872 42901443 44413268 45764349 47404725 48897740 50476167
14324 50476167 51960239 54043912 55734531 57819213 59688662 61948389 64276138 66567351
14316F6567351K564091K659099K708409K807633L181054L462453L372843L692245
14308I1015178L896090M297626M368887M705457N019076N021725N718972O057787
14300A30100798O368085O748365O997803P615596Q529000Q072421R017850R736393
14292A93186311J0510483J0499573J1317438J1938624J2544996J3370808J3358607
14285B76726840J3987008J4715677J4408584J4866659J5222546J4820191J4645533
14278C79393038J4256169J3363601J2001336J0701161Q375391M086990L63024
14271D42540710J51146K43426j674760m72747l172667o045506q685083j0706094
14263D12178425j2893512j3352638j4055996j4855789j5468043j5781036j5232419
$$ plain form
14316 66567351 69131442 71790541 74498950 77306583 80487637 83950090 87322933 91015178
14308 91015178 94911268 99208894 103577781 108283238 113302314 118324039 124043011 130100798
14300 130100798 136468883 143217248 150215051 157830647 166359647 174432068 183449918 193186311
14292 193186311 203696794 214196367 225513805 237452429 249997425 263368233 276726840
14285 276726840 290713848 305429525 319838109 334704768 349927314 364747505 379393038
14278 379393038 393649207 407012808 419014144 429715305 438090696 442177686 442540710
14271 442540710 442691856 442935282 441260522 440787775 437615108 431569602 422884519 412178425
14263 412178425 399284913 385932275 371876279 357020490 341552447 325771411 310538992
14256C10538992j5369655j4741985j4432049j3199158j2026347j2044702j1588807
14249B17136289j1142994j0289270j0216787r146939q530186p924768p833067
14242A52052278p438826o686868o439035o240175n042095n236750n201512n453296
14234A04313721m124302m280975l427134l667619l506398l679253l406071l067314
14226G5154655k649145k632819k352145k926960k082387j891581k248496j789709
14218E6581413j996378j825810j930054j742014r90640j750383j208541j654010
14210D3483583j244465j400284p61021p53026j225552j608665l42109j962747
14202C4185714p28818n88508n80506q28891j316315n28596q02251p01389n59015
$$ plain form
14256 310538992 295169337 280427352 265995303 252796145 240769798 228725096 217136289
14249 217136289 205993295 195704025 185487238 176340299 167810113 159885345 152052278
14242 152052278 144613452 137926584 131487549 125247374 120205279 114968529 109767017 104313721
14234 104313721 100189419 95908444 92481310 88813691 85307293 81628040 78221969 75154655
14226 75154655 72505510 69872691 67520546 64593586 62511199 60619618 58371122 56581413
14218 56581413 54585035 52759225 50829171 49087157 48096517 46346134 45137593 43483583
14210 43483583 42239118 40838834 40077813 39324787 38099235 36490570 36148461 34185714
14202 34185714 33456896 32868388 32287882 31458991 30142676 29614080 28811829 28110440 27551425
14193B7551425l76390p32068j021123n59172p85511m49108k72498p03532o11678
14184B2040345k65859m47518o00424l76462m11678l43892o91722L8701n43107
14175A8398384o33967M7749o35920O8975m63480k22500p68551m47583m4646l61119
14165A4937342j35317j85522l04654k06560l87439k73445r0931l20002j28796
14156A2904676R6517l61505l98621j01445k66211j4931m11395j47488k65886m549
14146A1029162l13107J83694l96583j04884q8410j08503n17317l13420K32983
14137I603615l51570P4961k35404J82721l85447k18671K57816o08466P2964j45486
14127H247033j05085l48183k74095P57025m67167l27661J92089p8197j95040k71225
$$ plain form
14193 27551425 27175035 26442967 25421844 24862672 24077161 23628053 23355555 22652023 22040345
14184 22040345 21774486 21326968 20726544 20350082 19938404 19594512 18902790 18941491 18398384
14175 18398384 17764417 17812166 17176246 17245221 16781741 16559241 15790690 15343107 15298461 14937342
14165 14937342 14802025 14616503 14311849 14105289 13717850 13444405 13353474 13033472 12904676
14156 12904676 13001193 12639688 12241067 12139622 11873411 11858480 11447085 11299597 11033711 11029162
14146 11029162 10716055 10899749 10503166 10398282 10309872 10201369 9684052 9370632 9603615
14137 9603615 9252045 9327006 9091602 9274323 8888876 8670205 8928021 8319555 8392519 8247033
14127 8247033 8141948 7793765 7519670 8276695 7809528 7481867 7673956 7595759 7400719 7129494
14117G129494L2854R4969l22795k21426K76514j74647k21491j15388l24520L7882
14107F191446J1199K22135P4058o45554M3051L9830j99007k042l51572M59891
14097E843435k71063m1154l24278n3372P8684J05970o9980k21549K28264Q539
14087E283496k62093m6306k834j19653p1413J17268m23884M6745j30502k46344
14077D144480J73637O7267j46686M5362K0431r1330p4871j08576K04131J7552
14067D251397j78915j52236J25402J36097m24044L38482m49941J3432J30538j1672
14057C778540o4433m12607M50049m73003M88306m29567P2793J0208j54149J94608
14047C460745j39779K64048l08836m3426j14930k90325K54064L849n34367O13089
$$ plain form
14117 7129494 7162348 7257317 6934522 6713096 6989610 6814963 6593472 6478084 6153564 6191446
14107 6191446 6202645 6424780 6498838 5853284 5896335 5936165 5737158 5735116 5383544 5843435
14097 5843435 5572372 5531218 5206940 5153568 5232252 5338222 5268242 5046693 5274957 5283496
14087 5283496 5021403 4975097 4972263 4852610 4781197 4898465 4474581 4521326 4390824 4144480
14077 4144480 4318117 4385384 4238698 4284060 4304491 4213161 4138290 4029714 4233845 4251397
14067 4251397 4072482 3920246 4045648 4181745 3757701 4096183 3646242 3659674 3790212 3778540
14057 3778540 3714107 3301500 3751549 3278546 3766852 3337285 3410078 3420286 3266137 3460745
14047 3460745 3320966 3585014 3276178 3232752 3117822 2827497 3081561 3085410 2551043 3164132
14037C164132j91423k75384J92120m644L07982j56806l11595M84287m20528L02390
14027C090531l13869K30046j7353L9573m90495Q4459o7862N1126j41048n791q4246
14016B375071k64377L73771k4241k63124P2507K43090p7500k08417q3875L67133
14006B510038n64231j30842L57641j02083r0379M3600K542Q7246R0157k7030J17924
13995B294583n46885K11994r7868j21828j55868P18632Q59532L076388P240520
13986A3479200J9254097J1146591j7531921A2170858n434432j491820q36061n88135
13978C820410j71084m86139k53152k18241J02810j16222n0125k75109J12528n1801
13968B413875m9447J6419k9760m89660K87223J07366j45989q333l55678J99346
$$ plain form
14037 3164132 2972709 2697325 2889445 2884801 3192783 3035977 2724382 3208669 2788141 3090531
14027 3090531 2776662 3006708 2989355 3028928 2538433 2622892 2555030 2606156 2465108 2459317 2375071
14016 2375071 2110694 2484465 2460224 2197100 2269607 2512697 2435197 2226780 2142905 2510038
14006 2510038 1945807 1814965 2172606 2070523 1980144 2023744 2026286 2113532 2203689 2176659 2294583
13995 2294583 1747698 1959692 1861824 1739996 1584128 2302760 3162292 6238680 13479200
13986 13479200 32733297 43879888 26347967 12170858 6736426 5244606 4408545 3820410
13978 3820410 3649326 3163187 2910035 2691794 2794604 2678382 2628257 2353148 2465676 2413875
13968 2413875 2364428 2380847 2351087 1861427 2148650 2256016 2110027 2101694 1746016 1945362
13958A945362N2267j30630j88488N61201j07017k56669l8068l52153K83827j83080
13948A586552J43778j98312K56631p8877j17333L64750j42338J9611Q1338j99131
13938A716669j32310K76456k95018M51431l75230m97970M60219m7649k329K0812
13928A575081q9710P8523o8890J26134L09851n37740n2952P63Q7521N4263l1216
13917A451628j67843j5540K37650J10213m33417j7624K97288j16552K21437l9893
13907A527347K3420K22659j87486n07930K81951l9030n4866m5498N4829J25604
13897A401000m00763N47067p7957k03959K21338l13608J21039k16067J61955j05952
13887A134093n6305K25311n836M619j35529Q3759J48248j30015N7963J09119n48085
$$ plain form
13958 1945362 1997629 1866999 1678511 2239712 2132695 1876026 1837958 1485805 1769632 1586552
13948 1586552 1730330 1532018 1788649 1709772 1592439 1957189 1814851 1834462 1915800 1716669
13938 1716669 1584359 1860815 1565797 2017228 1641998 1144028 1604247 1556598 1554269 1575081
13928 1575081 1485371 1563894 1495004 1621138 1930989 1393249 1340297 1341060 1428581 1482844 1451628
13917 1451628 1283785 1268245 1505895 1616108 1182691 1165067 1462355 1345803 1567240 1527347
13907 1527347 1550767 1773426 1585940 1078010 1359961 1320931 1266065 1220567 1275396 1401000
13897 1401000 1000237 1547304 1469347 1265388 1486726 1173118 1294157 1078090 1240045 1134093
13887 1134093 1077788 1303099 1297263 1301882 1166353 1250112 1398360 1268345 1326308 1435427 887342
13876H87342L97774M2347q8867J97826k16122l14686K47321l73169K56012J75842
13866A211620j39729R9376r375j39242l2770J32214r1629j57206J83147j24333
13856I32073j6926M3344K96100k86844m4114r5903j63041K02604L12215j46833
13846A032675r7138k90983K82615J43231k58658J69291l07257K23955Q5277j89910
13836G93098j69792L71690J22970m76730P3621M00779j51909l41149K13480K8960
13826H65018k53559O1301L23071k24980L0312J71185m29003K79967Q8031m37829
13816D73514M35588j65959J94920j39195k8227J4232j62661R6327K65144k3376
13806I60307l28176J17148p4746l5737L81060m49338J8227M27679j02486r4259
$$ plain form
13876 887342 1285116 1327463 1238596 1436422 1220300 905614 1152935 779766 1035778 1211620
13866 1211620 1071891 1171267 1161892 1022650 989880 1122094 1030465 873259 1056406 932073
13856 932073 915147 958491 1254591 967747 923633 827730 664689 867293 1179508 1032675
13846 1032675 935537 644554 927169 1070400 811742 981033 673776 897731 983008 793098
13836 793098 623306 994996 1117966 641236 714857 1115636 963727 622578 836058 865018
13826 865018 611459 672760 995831 770851 801163 972348 543345 823312 911343 473514
13816 473514 909102 743143 938063 798868 770641 784873 622212 718539 983683 960307
13806 960307 632131 749279 674533 638796 1019856 570518 588745 1016424 913938 819679
13796H19679j76272O125p874K11920k520j76878K36027o3745J46846k79848J17149
13785H30609j32311L6916p0405J54833j92821k91257P19838l52450J27399B00878
13774H23084j78847J51045l39745j68178L09963J57050n4861j80796j02981J30524
13764E46258L25489j57951q7623J00697J16778j18069k66855J25115L66946k82530
13754F68255k38218J29448P886r4019L35172C72700M79723J11622m65674R6240
13744E94611j32182J88078K12114j85421l09099K63126K75353l17935o9237K34497
13734G53905j4787m7622j43874k8631j71451K67244k67506K14778J4379J4035
13724E90470m3065M03976l38056r9514K61447m3761j74964j19151O7141k26606
$$ plain form
13796 819679 643407 649532 641658 853578 851058 674180 910207 846462 993308 713460 830609
13785 830609 698298 735214 664809 819642 626821 335564 1055402 702952 830351 200878
13774 823084 644237 795282 455537 287359 597322 754372 699511 518715 415734 546258
13764 546258 871747 713796 626173 726870 843648 725579 458724 583839 950785 668255
13754 668255 430037 559485 567371 473352 808524 372700 852423 964045 498371 594611
13744 594611 462429 650507 862621 677200 368101 631227 906580 588645 519408 753905
13734 753905 739118 691496 547622 518991 347540 614784 347278 562056 576435 590470
13724 590470 547405 951381 613325 513811 775258 731497 556533 437382 504523 277917
13714B77917L92474j18800K22775l86452J2820J60674J65964j71848j66140J98638
13704E88022n9391k40201N67796j83140q3887l884P3801j59985j6644j96476K03041
13693D89052o3376K59878j82590J07865m7642j53645K08661j80772J75395k32439
13683C80387K20837p3120n726j81093O1129J945N3111K10113j46200B08564p9502
13672A29062K10641J33055j14218M92855m00034K2272j80239q6486K21181B07404
13661F59061k47712J37524B72382j28745J11402J43791A61523L73455B15465K53260
13651D68725j49740j278l8731K31346O7065k07207J010A26666M18697J71572j80457
13640E36478J65939B81399J94692q8688A72512M33107R4586l08394k811A62370
$$ plain form
13714 277917 670391 551591 774366 387914 400734 561408 727372 555524 389384 588022
13704 588022 528631 288430 856226 673086 589199 585315 659116 499131 482487 286011 489052
13693 489052 425676 685554 502964 610829 563187 409542 618203 437431 612826 380387
13683 380387 601224 528104 522378 341285 402414 404359 457470 667583 521383 208564 129062
13672 129062 339703 472758 358540 851395 451361 473633 293394 206908 428089 207404
13661 659061 411349 548873 272382 143637 255039 398830 161523 534978 215465 468725
13651 468725 318985 317707 278976 510322 577387 370180 371190 126666 545363 716935 536478
13640 536478 702417 281399 476091 387403 172512 605619 700205 391811 389000 162370
13629H26946I7617L87329B41524N9228J9237J54947j14874l9410j17426J7244
13619B20470l4262K20390J95862k44880Q2218H447M9231L67835j79308K08042
13609D54247k9468R2771m6965A89201K51659r0252A51652K51073j08242j05658
13599A88825K30173A43553K00857A52791O0756J23300M7429o3552O2682j29208
13589B54198Q4548m7905L8554j9346H7083D1402J36513m3081a02472D10632A68286
13577B43568K78918B11811j1331P5924L30457k31678j37416p294f0406D30422
13566D13551C3999M43132J74066A78725K59918j86494P4730K6147M14022B76216
13555A23644K95263a07912C18770a2812A75922K01189j561i3003D49530j64956
$$ plain form
13629 826946 97617 484946 241524 300752 319989 474936 360062 320652 203226 220470
13619 220470 186208 406598 602460 357580 439798 8447 57678 425513 246205 454247
13609 454247 424779 517550 470585 189201 440860 350608 151652 402725 294483 188825
13599 188825 418998 143553 344410 152791 213547 336847 384276 320724 383406 254198
13589 254198 338746 290841 329395 310049 87083 41402 177915 134834 -102472 410632 168286
13577 243568 522486 211811 200480 276404 606861 375183 237767 230473 -60406 430422
13566 413551 33999 477131 651197 178725 438643 252149 326879 353026 767048 276216
13555 123644 418907 -107912 318770 -12812 175922 377111 375550 -93003 449530 284574
13545B84574m6160J81713j51220l1724M0742j26316M81157B51961q1399n0354
13535A20208D8341O7626L13919d3437D8850J69659h2048D77850B12518k8517K4355
13524B08356J22947J32146J4157A6381N64061k23467M7141I4088J71587E6067
13513A38964M54758j20390k00148L33340A32950J50506j32038G2569M2290Q6078
13503B00937J37514L7396j76923J56273r0281m9700J23615j43207L9993J7943
13493B53560J22841p2298F8168Q1263i3152B77657J33530k03774A8103L73048
13483C91151A56370c048C01251A27590J03058a36027A5802J47042J41477F6059
13472A62971J68037K0529a45001D43379o260G4907N6992J96294n2204K36833A98872
$$ plain form
13545 284574 238414 420127 268907 237183 277925 151609 632766 251961 170562 120208
13535 120208 48341 115967 429886 -43437 48850 218509 -82048 477850 212518 184001 208356
13524 208356 331303 463449 477606 16381 580442 356975 404116 94088 265675 56067
13513 138964 593722 473332 273184 606524 132950 283456 151418 72569 114859 200937
13503 200937 338451 375847 198924 355197 264916 215216 338831 195624 235617 253560
13493 253560 376401 304103 68168 149431 -93152 277657 411187 207413 18103 391151
13483 391151 156370 -3048 301251 127590 230648 -136027 15802 162844 304321 66059
13472 162971 331008 351537 -145001 443379 437119 74907 131899 328193 275989 512822 198872
13460H1404K88602J8554N0749G129L89210q4457m1643K24906A75479O9656J5688
13449B60823j936b9239A89630J24322R5168j17148K34964b3717B4820J61680J80877
13438C67377a58726C42694j9110k0325P1566h7450B54892p9509H523K06670R5217
13427C10410M24663l18420B274K80564G4623a2256D35848A8978P5113J83796l6238
13416B41649A320R9944D1895J89097A07638J13842J5019J1048J49016n8678M09489
13405G47374A65586E1650K17800J18158j52107K08681A42336K80933j44947R0422
13395C68744o8414o9096q9602J5593f5471A69903N3155J28704j12310J50790b14482
13383C74444J44782F2531J28745j8622B8959J54381b58630A57097d7308C81890
$$ plain form
13460 81404 370006 388560 439309 7129 396339 311882 270239 495145 175479 245135 260823
13449 260823 258887 -29239 189630 313952 409120 291972 526936 -23717 24820 186500 367377
13438 367377 -158726 342694 323584 303259 374825 -87450 254892 175383 8523 215193 310410
13427 310410 735073 416653 2274 282838 74623 -12256 435848 18978 94091 277887 241649
13416 241649 1320 101264 41895 230992 107638 221480 236499 247547 396563 337885 747374
13405 747374 165586 51650 269450 387608 235501 444182 142336 423269 278322 368744
13395 368744 300330 231234 141632 157225 -65471 169903 223058 351762 239452 390242 -214482
13383 374444 519226 62531 191276 172654 28959 183340 -258630 157097 -47308 381890
13372A50902k1069N3980m6877j4149J81689g7108b706F5496k0359q438L75759
13361D12458n064A64930L43542F0673a36827B88571l7894I3074j8915L06950p8703
13350C02406A35084J96683m6749A24781Q4592I2933J20692H004K75553K2698K596
13339C08851K29076E0712L51626j68961K904q9214n8962L4248l0426K27377i6602
13327f213C89090j32341a32019C83374A22516P607K29656J63813g7482g57D33425
13315b83457C8917K37788b13131B27439a45867A97745E2914P8041O0303E2276
13304A73335b16232D66376G3606M47658a66065b5228A11868b57399d3997C30395
13293C27365j15928a19461D10448j51254d9293D99564k17071j18041j8687p1807
$$ plain form
13372 150902 129833 183813 136936 122787 304476 -77108 -2706 65496 45137 36699 412458
13361 412458 407394 164930 508472 60673 -136827 288571 250677 93074 74159 381109 302406
13350 302406 135084 331767 285018 124781 209373 92933 213625 8004 283557 306255 308851
13339 308851 537927 50712 402338 233377 236281 147067 88105 122353 91927 319304 -96602
13327 -6213 389090 256749 -132019 383374 122516 130123 359779 523592 -77482 -757 433425
13315 -283457 38917 276705 -213131 227439 -145867 197745 52914 130955 191258 52276
13304 173335 -216232 466376 73606 521264 -166065 -25228 111868 -257399 -43997 330395
13293 327365 211437 -119461 410448 259194 -49293 499564 282493 164452 145765 73958
13283G3958C283h153A2918N5425a83458j0644A47361N0780Q65J7193l9718J40278
13271C16759I0785b8293h624A96648j9530E9719j6375L20880j10316F5720K82973
13260C48693A57977B3578a67136H4523K70609j34682j09636K62143h5550B21868
13249A16691a9076B67642k9689F6165M2335K74769a45356A86862O8268L019a3660
13237B74797j13989p6235j3987P1057K10577q0637m1923q8353A5455K79261a90087
13225c36480A27024K37370I8027M3765j5724M1208h457A89641q0157h5522A77601
13213I8465f4481C9553J27410J54402A36641O4915J50827b6729I5301d022B42005
13201I7177i1937B15482m8428b3917D4819N8014O395j8000M5868a39249c1222
$$ plain form
13283 73958 3283 -8153 12918 68343 -183458 -194102 147361 198141 199006 216199 176481 316759
13271 316759 90785 -28293 -8624 196648 177118 59719 43344 364224 253908 65720 348693
13260 348693 157977 23578 -167136 84523 355132 220450 110814 372957 -85550 221868
13249 116691 -19076 267642 237953 66165 108500 383269 -145356 186862 255130 258149 -13660
13237 274797 160808 84573 70586 141643 352220 271583 229660 141307 15455 294716 -190087
13225 -336480 127024 364394 98027 141792 126068 167276 -8457 189641 109484 -85522 177601
13213 98465 -64481 39553 166963 321365 136641 201556 352383 -26729 95301 -4022 242005
13201 97177 -91937 215482 167054 -23917 44819 102833 109228 91228 137096 -139249 -31222
13189B30670F7450L6292K43011c0267H832K34379J02452I0296M7426J37838a49723
13177A78958d5118r0094f5996j15055A79459b75095E5322e2811c127B70354H2211
13165a65808g7857A41264C2523i1582k7567A89929I2215P7231K9554D1434b22288
13153b00542B05066A00391a62049K7851c8811C51962a02130r4038O2479A70107
13142D1611K21868N1292j15873e2701A12539K34786r7173a42277C0318J54947
13132A85265K07644A9855J04063R3903A5407K7648J62555a00128A57001l1692
13122A25309i9840B21058J39214B4568a5042C46875A47830a39900A57416a48608
13111D2654M9504P3018m5446L05117j84758r0890a92226h3608n4255p1126e992
$$ plain form
13189 230670 67450 103742 346753 -30267 8832 243211 345663 90296 137722 275560 -149723
13177 178958 -45118 -135212 -65996 -181051 179459 -275095 55322 -52811 -3127 270354 82211
13165 -165808 -77857 141264 32523 -91582 -119149 189929 92215 169446 199000 41434 -222288
13153 -200542 205066 100391 -162049 -134198 -38811 351962 -102130 -196168 -133689 170107
13142 41611 263479 314771 198898 -52701 112539 347325 250152 -142277 30318 185265
13132 185265 392909 19855 123918 217821 15407 43055 205610 -100128 157001 125309
13122 125309 -99840 221058 360272 24568 -15042 346875 147830 -139900 157416 -148608
13111 42654 92158 165176 119730 424847 240089 149199 -192226 -83608 -137863 -208989 -5992
13099A72119K5036I3102P3573K6176k9177g9389A55061K35780G3551c2637G7560
13087A12569C0238N8501l0976a2800B20981C0395f3769j131o263A53188G2181
13075d9442n0863F1317J04803m5025n6164K16679i6052l05146J30650H7378h548
13063C7061h4945A19377k1292C1917J04888N7723c9897D26253D6917J36584B3116
13051C35194A42026o6235b9463A55570d0145B07017Q2752N59G8503a49828D1767
13039H5880b04911a110F7720K65446a3363A91831O6325a76513B4174J53517b3085
13027D0496g1696A32300b35188D14506A46401j5944J25532r6234b6404B96153
13016g2715B24666m1462P498F8327k8740l730J92531G7092a80095M2388B55654
$$ plain form
13099 172119 197155 93102 166675 192851 163674 -79389 155061 390841 73551 -32637 77560
13087 112569 30238 88739 57763 -12800 220981 30395 -63769 -64900 -71163 153188 72181
13075 -49442 -100305 61317 166120 121095 64931 281610 -96052 -401198 -270548 87378 -8548
13063 37061 -84945 119377 98085 31917 136805 194528 -39897 426253 46917 183501 23116
13051 335194 142026 75791 -29463 155570 -40145 207017 289769 290328 78503 -149828 41767
13039 85880 -204911 -1110 67720 333166 -13363 191831 258156 -176513 24174 177691 -23085
13027 40496 -71696 132300 -235188 414506 146401 130457 255989 159755 -26404 296153
13016 -72715 224666 183204 190702 68327 39587 35857 228388 77092 -180095 -137707 255654
13004B62009b736A6603L4266J48670H9238m1792J93263d1548B24889p3648i715
12992C63478a6709B961d9723J2928a3250H7929k286r140i0467B21057C6022L83630
12980D19652E2578i9410B63506P0460D85J99729a18685e8099a2615E3485i4771
12968C41251j31785a72720B64715b4528A61234b54991B25621J45944a71070B22117
12957A16464B0932m269b94814E8529O4173D6341j0102Q8884L3608D1844a17453
12945i8996A31587A3741b5618j76629B2370r560O0142K591b5175L34k31269i0072
12932B23102I1524K16731M6156A62004b45132B62835E4620c75688A68035P932
12922A75967E8427B9022J86994n1426E116a21823e8156A10541l0212a07605A5855
$$ plain form
13004 262009 -2736 16603 50869 199539 89238 47446 240709 -41548 224889 151241 -9715
12992 363478 -16709 2961 -49723 -36795 -13250 87929 85643 76503 -90467 221057 36022 419652
12980 419652 52578 -99410 263506 333966 485 200214 -118685 -58099 -12615 53485 -94771
12968 341251 209466 -172720 264715 -24528 161234 -254991 225621 371565 -171070 222117
12957 116464 20932 16663 -294814 58529 122702 46341 36239 125123 158731 41844 -117453
12945 -98996 131587 13741 -25618 -202247 22370 12810 72952 75543 -25175 -24841 -256110 -90072
12932 223102 91524 308255 354411 162004 -245132 262835 54620 -375688 168035 175967
12922 175967 58427 29022 216016 164590 5116 -121823 -58156 110541 80329 -107605 15855
12910a40692l9596B8602L0147a62451c466n6486A57710k9976J11123a35073N1457
12899h3616B24022c9533i322j29446r75N3114A94867r4243D8097J65178p9955
12888A33320b5550A8149b58511A65462J03974E0813a83723p4876A44985J28376
12878B73361I7991C8420J31101E3943J03830h245A12679a53989g2119F5965a34450
12866B19152q4704E4264b78840C58798E2836a61929a122A12077J72294j9292N8508
12855C23587G5516J93962A06948E2249r541O9949m3273Q400J73158E4248O1533
12844A15781a81450A60389J35032H5328A9589h6279M616A44735l3126a09458A77262
12832A16917J51683k7123a43847C41071a05206M9176j75115B8566e5731B70514
$$ plain form
12910 -140692 -180288 28602 58749 -162451 -3466 -59952 157710 127734 238857 -135073 -83616
12899 -83616 224022 -39533 -9322 -138768 -139743 -86629 194867 100624 48097 213275 133320
12888 133320 -25550 18149 -258511 165462 269436 50813 -183723 -258599 144985 273361
12878 273361 97991 38420 169521 53943 157773 -8245 112679 -153989 -72119 65965 -134450
12866 219152 134448 54264 -278840 358798 52836 -161929 -1122 112077 284371 265079 323587
12855 323587 75516 269478 106948 52249 42708 112657 69384 77784 250942 54248 115781
12844 115781 -181450 160389 295421 85328 19589 -86279 -81663 144735 111609 -109458 177262
12832 116917 268600 241477 -143847 341071 -105206 -56030 -231145 28566 -55731 270514
12821d2282j28776b6201C00405A43018F5627a21310o3119b2169j97370A3646J1608
12810B5254f2609A6690b00037A18406M062n3273J08535b4942p2042B46912M6969
12799B93881i9088B09678a8593A36492O4208D9091N4745K45808q0878E6100a99301
12787A19103n8018i4513b1004B59738A1401P079a70338F3080h4294k37584A25243
12775a03951K8260a6496n5218L345c2692O759C00629c46059g5791k55334A15132
12763b66120G503d4474A96554M2947F8594P1357k439F551M5701J03325J45152
12752C00729J41985F7265K0355A4309Q6853K5352B8744J52285B6720J71329k7929
12741A70120J06215i9061k42493A09775c54386A17669a54057e5227D8748J14794
$$ plain form
12821 -42282 -171058 -26201 300405 143018 65627 -121310 -184429 -22169 -219539 13646 25254
12810 25254 -62609 16690 -200037 118406 122468 69195 177730 -24942 -96984 246912 293881
12799 293881 -99088 209678 -18593 136492 200700 49091 103836 349644 268766 56100 -199301
12787 119103 61085 -94513 -21004 259738 11401 18480 -170338 63080 -84294 -321878 125243
12775 -103951 -75691 -16496 -71714 -68369 -32692 -25933 300629 -346059 -75791 -331125 115132
12763 -266120 7503 -44474 196554 239501 68594 139951 137512 6551 52252 155577 300729
12752 300729 442714 67265 87620 14309 101162 126514 28744 181029 26720 198049 170120
12741 170120 276335 -99061 -341554 109775 -354386 117669 -154057 -55227 48748 163542
12731A63542n0284K16088n4655c02519m3723E7415i6854A50230o9196R0925P4635
12720B46594f5362a8024q9526d8625p624H3406J8006e65574A94160M2022e0934
12708A57780p1645i2505B9426O9836C4215a87153A29290c4552B6068b59746D8947
12696C3598b37873c4481k0536A59854L0650i0672j48503i0819j05862A22213a25937
12684A77174b69508a00724L2410B49185d4648A66027L2047L2952C0036K82127
12674C12163F8280a03946K4242L7725B3014a03039A05927J28331p0510p0088K0384
12663A14044e7091j7217F989J2992O4851N250f4494E8013K74066j53354J16643
12652B95368G1983J23468q1680m1660N9577E4116e3484F0730J50449a30008A4865
$$ plain form
12731 163542 113258 329346 274691 -302519 -346242 57415 -96854 150230 81034 171959 246594
12720 246594 -65362 -18024 -107550 -48625 -56249 83406 101412 -565574 194160 236182 -50934
12708 157780 86135 -92505 29426 99262 34215 -187153 129290 -34552 26068 -259746 48947
12696 33598 -237873 -34481 -55017 159854 190504 -90672 -239175 -90819 -196681 122213 -125937
12684 177174 -269508 -100724 -68314 249185 -44648 166027 198074 231026 30036 312163
12674 312163 68280 -103946 -79704 -41979 23014 -103039 105927 234258 163748 93660 114044
12663 114044 -57091 -74308 6989 19981 84832 90082 -64494 58013 332079 178725 295368
12652 295368 71983 195451 113771 72111 131688 54116 -53484 60730 211179 -130008 14865
12640a89204B63091d1183j20380A97453I2721J46486m6464J8844F0334J47510
12630B07844k8525J44322a4103A52837J51355m0211G116R8714J34070n3109e9849
12618f35j13534n7750A50784j5256M4523G791Q517a22537B39136a54295O3717
12607i0578b6163k16867H9514a76001B24906m7959n7783J60785d1121l12688B53186
12595E9641a5095B4923i8205n0852C45084I8548L7706a45399C3366a16100B26586
12583a30310J6948A09948a66386F0079i5103A70792h5722A04936b821l57728h9624
12571B24478A09637K59400A19778P5264P9251a15768j34705C4513a47239B00552
12560A85974c2611l99407b0623K13A85022a94653C89642C5306J18394f2409B17652
$$ plain form
12640 -189204 263091 -41183 -161563 197453 92721 239207 192743 211587 60334 207844
12630 207844 179319 323641 -14103 152837 304192 263981 7116 105830 239900 186791 -59849
12618 -635 -114169 -171919 150784 135528 180051 7791 16308 -122537 239136 -154295 -90578
12607 -90578 -26163 -243030 89514 -176001 224906 176947 119164 279949 -41121 -353809 253186
12595 59641 -15095 24923 -98205 -149057 345084 98548 136254 -145399 33366 -116100 226586
12583 -130310 -113362 109948 -166386 60079 -95103 170792 -85722 104936 -2821 -360549 -89624
12571 224478 109637 369037 119778 195042 274293 -115768 -250473 34513 -147239 200552
12560 185974 -32611 -432018 -20623 -20410 185022 -194653 389642 35306 153700 -62409 217652
12548c0027J0839k2675A2843c90674A85072c12132E2163i5574B7316a53554C57020
12536f3479A5049Q6346J10204b3913A99666l0846r255f5483A57259b5351D42257
12524A9037K07370J24251C3351L63767I9622i2149L9423B23648q7343m8619P6908
12513A64594b37047B12415E3691b43452i6582m9431C16020o8664J7639n450o4301
12502A95244a79637B88661A28552b95026D15282e8145d176q7998A56724R9257
12492B55981j26376J9759E8620J26521C7198J83730a42456k2247B0052b94512
12481a11339d8469p5738H3103g6953A93293o9915K9079F0186J1261Q2712J17900
12470B72059M7091a08383c7303h024A63080h8668H6107b01294C5213Q804a3422
$$ plain form
12548 -30027 -19188 -41863 12843 -390674 185072 -312132 52163 -95574 27316 -153554 357020
12536 -63479 15049 101395 211599 -23913 199666 168820 159565 -65483 157259 -25351 442257
12524 19037 226407 350658 33351 397118 99622 -92149 -52726 223648 136305 87686 164594
12513 164594 -237047 212415 53691 -243452 -96582 -146013 316020 247356 264995 259545 195244
12502 195244 -179637 288661 128552 -295026 415282 -58145 -4176 -92174 156724 255981
12492 255981 129605 149364 58620 185141 37198 220928 -142456 -164703 20052 -294512
12481 -111339 -48469 -124207 83103 -76953 193293 123378 152457 60186 71447 154159 272059
12470 272059 319150 -108383 -37303 -8024 163080 -88668 86107 -201294 35213 44017 -13422
12458F0786J04815J44907e6909R146A20297a45059l6271A16923K00242b00807
12447G3493J89763l8812k5093H1271K9736A6429M13367a03387j20142J10736j80952
12436b93745d0298k59676e606A47749j284h399J22q6375c2658j40198a8008j15576
12424a33584c1177A54302a45267D43923C6488J6510R0802P3633a97045B70475
12413a693j2815A51415j8384C3462c20506B90292C1616L1319o262L7823m1533
12402E2963A8651a73553c6273C5350K33720b43451J11516K8239K5597C48929A8261
12390c24223B46866L1239b0310C22512d3969E8616P816K9932b2248B71697A9977
12378A27346A5562B414d9684I6183a47597k49816a21242N2972j00383D2335b34255
$$ plain form
12458 60786 165601 310508 -56909 -47763 120297 -145059 -181330 116923 317165 -200807
12447 73493 263256 224444 199351 81271 111007 16429 429796 -103387 -223529 -112793 -293745
12436 -293745 -40298 -299974 -5606 147749 146465 -8399 -8277 -94652 -32658 -172856 -18008 -133584
12424 -133584 -31177 154302 -145267 443923 36488 52998 143800 217433 -197045 270475
12413 -1693 -14508 151415 133031 33462 -320506 290292 31616 62935 56673 94496 52963
12402 52963 18651 -173553 -36273 35350 269070 -243451 -131935 -103696 -78099 348929 18261
12390 -324223 246866 278105 -20310 322512 -43969 58616 66432 96364 -22248 271697 19977
12378 127346 15562 2414 -49684 96183 -147597 -397413 -121242 -68270 -168653 42335 -234255
12366d4717B9317J38033K9236p7456l2430j8452E382K47680f4523C81413F0794
12354b21551i9833b9545l6776J6388B47566a86550A92215b67275d7100B1296d14798
12342a55575C11520j226I3245D3365J86643n3907j4642h1117A50247L038A9075
12330D7249J48043c1063l63331a93216O9263p6681D940J18021J28238p3641a04844
12318H446a68462c1763o1476N01D9111Q8177a87939e9822j8975A51451a63129
12306b21859A35055a9722H8398A9417c68920C27685c2610H8121c16273a33284
12295H2380a00805E0142a94281A80934J90643E130b60364G7710C334M41905a52299
12283a35860E7775o375O1873J7726c2952D37281e0586A07640h1787a793j34527
$$ plain form
12366 -44717 29317 167350 196586 119130 86700 68248 5382 253062 -64523 381413 60794
12354 -221551 -99833 -29545 -66321 -49933 247566 -186550 192215 -267275 -47100 21296 -414798
12342 -155575 311520 310294 93245 43365 230008 176101 161459 -81117 150247 153285 19075
12330 47249 195292 -31063 -394394 -193216 -123953 -200634 4940 122961 251199 177558 -104844
12318 8446 -168462 -31763 -93239 -92738 49111 137288 -187939 -59822 -78797 151451 -163129
12306 -221859 135055 -19722 88398 19417 -368920 327685 -32610 88121 -316273 -133284
12295 82380 -100805 50142 -194281 180934 371577 5130 -260364 77710 3334 445239 -152299
12283 -135860 57775 51400 113273 130999 -32952 437281 -50586 107640 -81787 -1793 -136320
12272a36320j9614c6604a1113o0452q8527b3348A32383b56532i6585A81566h6220
12260B03979j3018L48039b5264A15999a39968A60480a87085B18158A02301J32695
12250B34996j05831a4096m78287a28015c2650A2019J89609a62056e5858j2177
12240f8035k6982C70597D0042N64288A9284J02741a04556C2612L22466G1435i2000
12228b08942B30932Q2908c0922B5622J58855F5488L27199A02487A6698J85306
12218B02004d8565D80815A53573K40749j04097F6078c1779A69580J49811C3062
12207I1677j3074j7577J03698Q0377E5838J85433E2431K98203e0181I4264a06745
12195B23433E6900a4490B52604p5740J21191a27887b7178B06118a00898k2806
$$ plain form
12272 -136320 -155934 -36604 -11113 -71565 -160092 -23348 132383 -256532 -96585 181566 -86220
12260 203979 190961 539000 -25264 115999 -139968 160480 -187085 218158 102301 234996
12250 234996 129165 -14096 -492383 -128015 -32650 12019 201628 -162056 -55858 -68035
12240 -68035 -95017 370597 40042 604330 19284 122025 -104556 32612 355078 71435 -92000
12228 -208942 230932 313840 -30922 25622 184477 65488 392687 102487 16698 202004
12218 202004 -48565 480815 153573 394322 290225 66078 -31779 169580 319391 33062
12207 91677 78603 61026 164724 245101 55838 241271 52431 350634 -50181 94264 -106745
12195 223433 56900 -14490 252604 176864 298055 -127887 -27178 206118 -100898 -123704
12185a23704n6636F2562K14963h8708B67324C5341c68128H7170b52942A66840
12174B94301a10676B85683E351K32146k9607F5802J67273L4519m513K28093d4607
12162A30773e1201A44876f3401A55301R6274f4941I5720e5164B52540I0877J63154
12151B54031A9015b3377A32609c49405J68150D5022L5785K32146A53401o6844
12141H6557k8979J25160c0036j01155D3775A1168c560k3425I350a79269n104N9519
12129a24854A07304c8279A25379a66964D4364K9910K37580o8029n1123a18166
12118C04240A27947C0614J56888f3894B53208j14387B8286J60407H2475a37587
12107A44221d2112k20946H1379e5148l2257j24359p0525C43301A55537L0800b00926
$$ plain form
12185 -123704 -180340 62562 277525 -88708 267324 35341 -368128 87170 -252942 166840
12174 294301 -110676 285683 5351 237497 207890 65802 233075 267594 263081 491174 -44607
12162 130773 -51201 144876 -63401 155301 251575 -64941 95720 -55164 252540 90877 254031
12151 254031 19015 -23377 132609 -349405 -181255 45022 80807 312953 153401 86557
12141 86557 57578 182738 -30036 -131191 43775 11168 -3560 -26985 9350 -179269 -184373 -124854
12129 -124854 107304 -38279 125379 -166964 44364 74274 311854 243825 192702 -118166
12118 304240 127947 30614 187502 -63894 253208 138821 28286 188693 82475 -137587
12107 144221 -42112 -263058 81379 -55148 -87405 -211764 -282289 343301 155537 186337 -200926
12095a18723n0803O3202k84932d2565H9706K36243A49402g9091L7745J2813n5185
12084h3718C19693A06243O6041b20544C45786j26760L2070j11332c64193A94134
12073D0681b73319B79792c88605i7978A05700L20246O78455m2014C88192A4154
12062A95417J49318J68344I8319J26190a40096C2034a73050j3668Q3429A53525
12051b43264N7721e8161k143l7585E5245M6747J59204m2706b14597C7522Q0205
12040A17727b74713J10997m9501m5216F2480O7175J1216c17741D6562e5590C9618
12028c07770J23779B0534O2752C6757M1128K18733a37343j28945J13071j40183
12018b93400J09378B29900j05769B9239a39047a1508r9134C48144b01458B47304
$$ plain form
12095 -118723 -169526 -106324 -391256 -42565 89706 325949 149402 -79091 -41346 -28533 -83718
12084 -83718 319693 106243 172284 -220544 345786 219026 251096 139764 -364193 194134
12073 40681 -273319 279792 -388605 -97978 105700 425946 1104401 1062387 388192 14154
12062 195417 344735 513079 98319 224509 -140096 32034 -173050 -186718 -103289 153525
12051 -243264 -185543 -58161 -60304 -97889 55245 101992 261196 218490 -214597 37522 117727
12040 117727 -274713 -163716 -213217 -258433 62480 129655 140871 -317741 46562 -55590 39618
12028 -307770 -183991 20534 83286 36757 77885 296618 -137343 -266288 -153217 -293400
12018 -293400 -184022 229900 124131 29239 -139047 -11508 -110642 348144 -201458 247304
12007a14969A99158J00735d11841A32894Q1843q4664a6317B84242a17841B04072
11996a30233F0886b34436a2443C1642J24849d59059G6659a31611j35476m3722
11986c10809A66248J04946a64683c8770G982g8974C9009c932o5087q7764A25402
11974b10351Q5086m5164a8692j42263b2243A52193a06482K1800A09530A2001L61474
11963C73475b454A32095d9765I173a50425j81537J835h9277c7720B45268n7513
11952A87755A0220J09789b75117i0987n4916F139J62184e4795A1850a41632j21836
11941b63468M7560A71508e3973i576j22436k06451G2329b22267b5479A26348J78243
11930C04591A26520j5313c7323a7189j62349J705g9634A33440E9144J94068A18474
$$ plain form
12007 -114969 199158 299893 -411841 132894 214737 130073 -16317 284242 -117841 204072
11996 -130233 60886 -234436 -12443 31642 156491 -459059 76659 -131611 -267087 -310809
11986 -310809 166248 271194 -164683 -38770 7982 -78974 39009 -3932 -69019 -156783 125402
11974 -210351 -125265 -170429 -18692 -160955 -22243 152193 -106482 -84682 109530 12001 373475
11963 373475 -2454 132095 -49765 9173 -150425 -331962 -330127 -89277 -37720 245268 187755
11952 187755 10220 120009 -275117 -90987 -145903 6139 168323 -54795 11850 -141632 -263468
11941 -263468 -215908 171508 -53973 -9576 -132012 -338463 72329 -222267 -25479 126348 304591
11930 304591 126520 111207 -37323 -17189 -179538 -177833 -79634 133440 59144 253212 118474
11918B07533a09080I3227a52247C21355a90252A34158a63613A5695a44221m0488
11908a84709B15443m2012a1266o0156A45095m3134k0709e383A29169B8051e9852
11896D578J86808b56540E8219K53932j0770a78948G4401L9701J7817b5571D7383
11884A35388K11380a73885G3649j5402a75778j26801A51308i7536b8342j86530
11874b14872A33491b18263P0133P879K5463A67516f1433r5195a2037k19460i1732
11862a9407I4081A9457J96673B0331a03808b4855j56588A69551a90939m9618O2946
11851a77611K9641B41499a55364d1565A17189E4396f0687E829b52645A22596A6761
11839b1970j30904K5432A34156f4910f647j14472A45341a02069a8217k22509C63622
$$ plain form
11918 207533 -109080 93227 -152247 321355 -190252 134158 -163613 15695 -144221 -184709
11908 -184709 215443 173431 -11266 -71422 145095 101961 81252 -5383 129169 28051 -59852
11896 4578 191386 -256540 58219 312151 301381 -178948 74401 114102 131919 -25571 47383
11884 135388 346768 -173885 73649 58247 -175778 -302579 151308 -97536 -28342 -214872
11874 -214872 133491 -218263 -148130 -140251 -114788 167516 -61433 -156628 -12037 -231497 -91732
11862 -19407 94081 19457 216130 20331 -103808 -24855 -181443 169551 -190939 -240557 -177611
11851 -177611 -147970 241499 -155364 -41565 117189 54396 -60687 5829 -252645 122596 16761
11839 -21970 -152874 -127442 134156 -64910 -6647 -121119 145341 -102069 -18217 -240726 363622
11827h6462E4896b0939F4059O9546d24689b3975A47841C268J67583f5730B8266
11815a33500j61587C15868a78506B80082c78543J80762D40070b22200A94536h3169
11804a43624N8767A79555G4971d8917B6750b6833k88432B9359a41442B7748a42962
11792a65505A67138b06968i4796A26945g4102A32795a34453J3164B8654K8570
11782E7224a26545M7842C8881a81348A6674D515b30356L8336L1449K1085l6476
11771a75962G0251a14156A6858J49812o4063C2536J69445b27776D0140b4803B30655
11759E7016a82496A51787i8935l91468a54251b1382F8079B580a35694A08272b26232
11747H1464f0016A62040b90011a04789k4103k49042F377b96973P9092A63042i7959
$$ plain form
11827 -86462 54896 -20939 64059 133605 -424689 -23975 147841 3268 170851 -65730 28266
11815 -133500 -295087 315868 -178506 280082 -378543 -197781 440070 -222200 194536 -83169
11804 -143624 -84857 179555 74971 -48917 26750 -26833 -315265 29359 -141442 27748 -142962
11792 -165505 167138 -206968 -94796 126945 -74102 132795 -134453 -121289 28654 57224
11782 57224 -126545 -78703 38881 -181348 16674 4515 -230356 -192020 -160571 -139486 -175962
11771 -175962 70251 -114156 16858 166670 102607 32536 201981 -227776 40140 -24803 230655
11759 57016 -182496 151787 -98935 -490403 -154251 -21382 68079 2580 -135694 108272 -226232
11747 81464 -60016 162040 -290011 -104789 -128892 -377934 6377 -296973 -217881 163042 -97959
11735a24849a0003C9831c48985Q3846a28498q4845f9758k28063k5454h4308m00505
11724d84813b02944B99572c16872d728A00895D7459c4062G9677a47510O6605K2696
11713e8209j8099n2481a0849B0653a06062B67914G2987b53750d8192A23369J28502
11702B51871c0396j2727B7861J15856a21840A50881L01495f7303q5930b086r9243
11691a01329A93746C2941D886P0251K1905J13302p2610k1380a6391I4681K7600
11680A22281A2686a08975j02379i2519F5135K67923D6999a13420j12131M0947
11670a84604H1038i3569m9102A35829o1749n297c9457a3313q6636j79008B31486
11658F9060g8999m12220B01785b11197i1970a365B0826c64743e9833B27567F4778
$$ plain form
11735 -124849 -10003 39831 -348985 -265139 -128498 -213343 -69758 -297821 -323275 -84308 -484813
11724 -484813 -202944 299572 -316872 -4728 100895 47459 -34062 79677 -147510 -80905 -58209
11713 -58209 -76308 -128789 -10849 20653 -106062 267914 72987 -253750 -48192 123369 251871
11702 251871 -30396 -43123 27861 143717 -121840 150881 452376 -67303 -153233 -2086 -101329
11691 -101329 193746 32941 4886 75137 97042 210344 137734 116354 -16391 94681 122281
11680 122281 12686 -108975 -211354 -92519 65135 333058 46999 -113420 -225551 -184604
11670 -184604 81038 -93569 -142671 135829 74080 68783 -39457 -13313 -99949 -278957 231486
11658 69060 -78999 -491219 201785 -211197 -91970 -1365 20826 -364743 -59833 227567 64778
11646i4029D9523a9650n7531A40897a05221b3725j6981A19445B4536O8585f9765
11634b66849h1894B42171g9345k34504a21214j39304A26161e1181n3581l53112
11624d57874B34912e8509A3582K5081a86139O7598a5526j99980d4522B04885F5322
11612b05084A72446a44106J8278C3766J95500a65932B80538j12170a79085E0194
11601b70218A12784g9536J8608A42893a74976j4507H3490K946Q4316Q4991a57471
11589d44313A28871a27395d0155E8905K7369a23898D9745J50308i9054M3499a3026
11577C4933a09354b0629k62706c39j33898A05464a36203e1346E0577f7815K8299
11566c9516B1825h2804H0301L2169a16565C646J71321D4784b14834I4077e3496
$$ plain form
11646 -94029 49523 -19650 -77181 140897 -105221 -23725 -40706 119445 24536 93121 -69765
11634 -266849 -81894 242171 -79345 -313849 -121214 -260518 126161 -51181 -104762 -457874
11624 -457874 234912 -58509 13582 38663 -186139 -118541 -15526 -215506 -44522 204885 65322
11612 -205084 172446 -144106 -125828 33766 229266 -165932 280538 168368 -179085 50194
11601 -270218 112784 -79536 -60928 142893 -174976 -189483 83490 86436 170752 255743 -157471
11589 -444313 128871 -127395 -40155 58905 86274 -123898 49745 200053 -99054 -55555 -13026
11577 34933 -109354 -20629 -283335 -339 -134237 105464 -136203 -51346 50577 -67815 -39516
11566 -39516 21825 -82804 80301 112470 -116565 3646 174967 44784 -214834 94077 -53496
11554a79345A36258a93002h6846A93985h3999C24880b04839d4632j53348P9826
11544a18154k08057A16168m5636M60605a53685L5017B58969e8471A81788c2402
11533a67198D03082G7639d4710j04627D07148a42571A6855a20211A87146p4129
11523A13017d8140A80218d28018D22155e615F9315b84678A07726c9699o3057M7203
11512e5553k1680G432b17289B5312i3429A1167b43884A67314a86877F9888c437
11500a03857H4133k9966O0375e4953C5771K51785j21504J9245N2695g6599B35963
11488g889r520A11131K69676A12866B9418J35305M269C2973g2371B91632A30083
11476b00967a9498B02392c8040A12622R906a48983A68973B8668a6067E9179K79092
$$ plain form
11554 -179345 136258 -193002 -86846 193985 -83999 324880 -204839 -44632 -197980 -118154
11544 -118154 -326211 116168 70532 531137 -153685 -118668 258969 -58471 181788 -32402
11533 -167198 403082 77639 -44710 -149337 407148 -142571 16855 -120211 187146 113017
11523 113017 -48140 180218 -428018 422155 -5615 69315 -284678 107726 -39699 -102756 -55553
11512 -55553 -77233 7432 -217289 25312 -93429 11167 -243884 167314 -186877 69888 -3437
11500 -103857 84133 54167 114542 -54953 35771 287556 166052 185297 237992 -76599 235963
11488 -7889 -17409 111131 380807 112866 29418 164723 168992 32973 -72371 291632 130083
11476 -200967 -19498 202392 -38040 112622 122528 -148983 168973 28668 -16067 59179 338271
11465C38271j51591m115C6274R8397C0522b95902d0016B43948a50099d2673A00881
11453F6742c1412p3851A19043a41346B52283a52262C7425a19656A28082O036a47367
11441a38142F7289a84368A14868K1118J31101b58541B33152e3937p5540B018K01709
11430B03727e3756o7699B60424q2141b42426f9917B5425a03556n0403I4660d43
11418a49843B20518i231B54491a48818A04703R8550a00924A06866a44540E6251
11407A90285B2853h8617o737A17604a27913a7552F4215o273a91174h417G3871
11395B1601P2731L98470B5696j2630M310J96954m9601A6330b21874B02493I962
11383e60776A89719b64859A15556a9432o6889I5692B9467N9226a09631K1704A8937
$$ plain form
11465 338271 186680 182565 36274 134671 30522 -295902 -40016 243948 -150099 -42673 100881
11453 66742 -31412 -105263 119043 -141346 252283 -152262 37425 -119656 128082 134118 -147367
11441 -138142 67289 -184368 114868 135986 267087 -258541 233152 -53937 -129477 2018 203727
11430 203727 -53756 -121455 260424 178283 -242426 -69917 25425 -103556 -153959 94660 -443
11418 -149843 220518 -9231 254491 -148818 104703 203253 -100924 106866 -144540 56251
11407 190285 22853 -88617 -95354 117604 -127913 -17552 64215 57942 -191174 -8417 73871
11395 21601 94332 492802 25696 13066 17376 214330 164729 16330 -221874 202493 9962
11383 -560776 189719 -264859 115556 -19432 -86321 95692 29467 88693 -109631 -87927 18937
11371g1617j76833B18363a22445B02768a01765m4486q9190B4396c09300f6817
11360a94264b1501B99861l8002a19898j26043K5664A3061N798a40011E712O6305
11349G2017e4316A12858b7149A05587c2090C86682A51995O3916L0026a82293j2944
11338a95237I1754l0276c50407F5954a10549j15436R5426k26790e2439A83838
11327a25954a3481j01127j2361e0876A16468b71532a33262O2647A11975c55632
11316a31944A47909c43152J20616a08461c5268k32696a9128k26162C8806J65530
11306B04336b87887O1124I8338a6348B3838P3086a4252D9470J16849A5482K42617
11295B58099a8744A58436a51407j35176g7121j86062j17995a51005p263A02544
$$ plain form
11371 -71617 -248450 218363 -122445 202768 -101765 -146251 -235441 24396 -309300 -66817
11360 -194264 -21501 299861 261859 -119898 -245941 -220277 13061 18859 -140011 5712 72017
11349 72017 -54316 112858 -27149 105587 -32090 386682 151995 215911 245937 -182293 -195237
11338 -195237 91754 61478 -350407 65954 -110549 -225985 -130559 -357349 -52439 183838
11327 -125954 -13481 -114608 -126969 -50876 116468 -271532 -133262 -70615 111975 -355632
11316 -131944 147909 -343152 -222536 -108461 -35268 -267964 -19128 -245290 38806 204336
11306 204336 -287887 -226763 98338 -16348 23838 96924 -14252 49470 166319 15482 258099
11295 258099 -18744 158436 -151407 -286583 -77121 -263183 -381178 -151005 -158268 102544
11284A0358K24711b94229N0849e5076k53937J21427L8798j34680A20034c0628
11273i5431j39329C61787A2732f0001B36023j01027b08059o4654M5491A40820
11262b60343R2836A36387B0118i2153I0997b3267q4557C2177a48846l15441F688
11250a4377j3332m1203A55771c7369k14005k5381A88369a06426l50420B5124b71138
11238A83201c70984b6015A0834K29782c80652A60967J4693k3495a45860M3562
11228a02298j0965H3464R3876I498b15728A24897c7504G0243J84616A14437a5029
11216a19496E8601O2112g5111l9750B6533M34358e014H64b51262h1245A4746J49847
11204A64593k4481O6523a02529K8172H3514P808j859b29809i9596E1649b70477
$$ plain form
11284 10358 235069 -294229 -243380 -55076 -309013 -187586 -148788 -283468 120034 -30628
11273 -95431 -234760 361787 12732 -60001 236023 134996 -208059 -272713 -227222 140820
11262 -260343 -167507 136387 20118 -92153 90997 -23267 -107824 32177 -148846 -464287 6688
11250 -14377 -27709 -68912 155771 -37369 -251374 -276755 188369 -106426 -456846 25124 -271138
11238 183201 -370984 -26015 10834 240616 -380652 160967 175660 152165 -145860 -102298
11228 -102298 -113263 83464 177340 9498 -215728 124897 -37504 70243 254859 114437 -15029
11216 -119496 58601 120713 -75111 -114861 26533 460891 -5014 864 -251262 -81245 14746 164593
11204 164593 140112 206635 -102529 -74357 83514 91322 89463 -229809 -99596 51649 -270477
11192e0606l0123A62627K18591j24103R91A19999A3382b76757i2398j81483I9018
11180a82154Q9398d143j7396H4008b9943A54352i6789E824a08359o332A05114
11168A77890c45216c0436n971A15818a18620K3884j14462H8920i1095J3087k8863
11157a06871j23140F1614Q2863B8116J47000a66018F4646b35006d4104o9136A95388
11145C3862a81818e1790A7912a61247O0849H5424l0219a28138D888L8797O5965
11134A09650i932p0709d0037A96455n907C3870a99972e0995A84741J73696q2867
11123B75570A06725O0618a86722A29618b14391N4073j02912P3669A54176f7740
11112a00988F7561b05637A62376a77643F1956M1440a01884B4640a48726F6861
$$ plain form
11192 -50606 -80729 162627 381218 257115 258106 119999 13382 -276757 -92398 -273881 99018
11180 -182154 -92756 -4143 -21539 84008 -29943 154352 -96789 5824 -108359 -114691 105114
11168 177890 -345216 -30436 -36407 115818 -118620 -94736 -209198 88920 -91095 -78008 -106871
11157 -106871 -230011 61614 144477 28116 175116 -166018 64646 -235006 -44104 -113240 195388
11145 33862 -181818 -51790 17912 -161247 -100398 85424 55205 -128138 4888 43685 109650
11134 109650 -9932 -80641 -40037 196455 190548 33870 -199972 -50995 184741 358437 275570
11123 275570 106725 167343 -186722 129618 -214391 -160318 -263230 -189561 154176 -67740
11112 -100988 67561 -205637 162376 -177643 61956 103396 -101884 24640 -148726 66861
11101A18570J95130j26704a69498b8280F2273K39224j14001p2512j1674h893A40366
11089C69270A10618L7833F0324b12841d6541j36435B32088r8982l5331J00836
11079A98611A128J90961J67031A08647B2167D700L71055H5926i9716A96380o754
11068A89626a32851A57671J93145A66867F7868L20402J5440j1728j09285j3930
11058B68767L38903k26641G4159M49551k18873q817J1872K21564K05419B77843
11047C34286J39224o6321P3268L51982l99560j56048N8928K72481l01435K68099
11037E74904k61363K33551J35811l06297m4701M40543B53133L68263J30574k68772
11027D83198J878B18572J4106L82150r7467G7702K46206j0968A38498K10873m6347
$$ plain form
11101 118570 313700 186996 -169498 -28280 62273 301497 187496 114984 103310 -8893 140366
11089 369270 110618 148451 60324 -212841 -46541 -182976 232088 133106 97775 198611
11079 198611 1128 192089 359120 108647 22167 4700 375755 85926 -99716 196380 189626
11068 189626 -132851 157671 350816 166867 67868 388270 403710 391982 282697 268767
11058 268767 607670 381029 74159 523710 304837 296020 307892 529456 734875 277843
11047 334286 473510 407189 480457 832439 432879 276831 335759 608240 306805 574904
11037 574904 313541 547092 682903 376606 331905 772448 253133 621396 751970 483198
11027 483198 485076 218572 232678 614828 517361 77702 323908 312940 138498 349371 303024
11016C03024r5677C0377K89180M9127A69634K50551j84790K37949O7493Q0639
11006F21476A61708m952L07290J45098B99640j252J71658J00274k39233O0575
10996C91662J89904p3967N8409j13986K34961j47365j30913R4289j25053j9981
10986C57960K49002p3005K7370j04119L64399J43638r9232C37999N26234L2599
10976H96832J28378j74978K31262K36606j725L60219N6017k159L64154k35379
10966A859227K01426l75158J73153j40647k90170l18573m12761N3619k8832r2751
10956F28533L35501C43898J31061K82334k59337J563A89226K49138k01915F6283
10945a63051A04286b1962B78640p1784J42787A20381J40547C0496J44437e6031
$$ plain form
11016 303024 207347 30377 319557 368684 169634 420185 235395 473344 540837 621476
11006 621476 161708 156756 464046 609144 299640 298388 470046 570320 331087 391662
10996 391662 581566 507599 566008 452022 686983 539618 408705 502994 377941 357960
10986 357960 606962 533957 561327 457208 821607 965245 866013 337999 864233 896832
10976 896832 1025210 850232 1081494 1318100 1316375 1676594 1732611 1730452 2094606 1859227
10966 1859227 2060653 1685495 1858648 1718001 1427831 1109258 696497 750116 721284 628533
10956 628533 964034 343898 474959 757293 497956 499519 189226 438364 236449 66283
10945 -163051 104286 -21962 278640 206856 349643 120381 260928 30496 174933 -56031
10934A14705a56225f3731B12608a6518i96C0744f4348B45669P2172C6708a68742
10922a07154B59724j0869k3579b93865C75698a10688p6137e7329B28227c8894
10911d8871j44325a6048n0573d159D9305J35818e6550B88702a56676F8295e0925
10899C4913b63040A3968a61367A59194b61429F1098a19156n7940C5993a56496
10888F4809b5978j07831j52151A76948i2609k85457a25009l771C4042N0387K9961
10877A14390k7892d35466F1781M8713k980b75638k2631Q0396m8765a01094i278
10865D9865a16484A28568a04870e0120j44384r1393C46089H3369C2458j3029L7929
10854E7358K33524f2655B28009d03116a08500A39630n3651a64635A8609Q1554
$$ plain form
10934 114705 -156225 -63731 212608 -16518 -996 30744 -64348 245669 317841 36708 -168742
10922 -107154 259724 248855 225276 -293865 375698 -110688 -186825 -57329 228227 -38894
10911 -48871 -193196 -16048 -66621 -4159 49305 185123 -56550 288702 -156676 68295 -50925
10899 34913 -263040 13968 -161367 159194 -261429 61098 -119156 -177096 35993 -156496
10888 64809 -25978 -133809 -285960 176948 -92609 -378066 -125009 -128780 34042 84429 114390
10877 114390 86498 -435466 61781 110494 107514 -275638 -298269 -217873 -266638 -101094 -9278
10865 49865 -116484 128568 -104870 -50120 -194504 -285897 346089 83369 32458 19429 57358
10854 57358 290882 -62655 228009 -403116 -108500 139630 85979 -164635 18609 100163
10844A00163d816H7491e60252A59267e0978A34479b08004e3457k89284F592a56509
10832C4872a01348c0751C7894N1338c0444r9152A48178b09941a00397n1518A9821
10820h7745j7362e2292B04463B4463P4909e7551C0815h2086B004K62926a50854
10808b7254A7932a8863j25296b6093m7920K5144j26447A06057B6676b43119l6769
10797b79888a08893d278k54934A18829b47828l3632p0838I9973a88307e4950j7152
10786g2102B39926a73722l99479b76217A23873K9748d7022j49822j131m2009A75412
10774a1343G874J53805G9435g7373l0927B94114i4804M0802F0636b2238H8794
10762c25459f7105r2434c7843G9972b77084C0878c07490b3850j3551A11353a05050
$$ plain form
10844 100163 -4816 87491 -560252 159267 -50978 134479 -208004 -53457 -342741 6592 -156509
10832 34872 -101348 -30751 37894 89232 -30444 -129596 148178 -209941 -100397 -151915 19821
10820 -87745 -105107 -52292 204463 24463 99372 -57551 30815 -82086 2004 264930 -150854
10808 -27254 17932 -18863 -144159 -26093 -74013 -48869 -175316 106057 26676 -243119 -279888
10797 -279888 -108893 -4278 -259212 118829 -247828 -281460 -352298 99973 -188307 -54950 -72102
10786 -72102 239926 -173722 -573201 -276217 123873 153621 -47022 -196844 -197975 -239984 175412
10774 -11343 7874 161679 79435 -77373 -108300 294114 -94804 -54002 60636 -22238 88794
10762 -325459 -67105 -159539 -37843 79972 -277084 30878 -307490 -23850 -37401 111353 -105050
10750e51047a72588B17404a1271E9736b31533O5127K4609A39258d6935G2116j484
10739G0632a93767B01881h3303m5828C3864c68666a7345m6907k83955O9299B30994
10727a93350K1893e3185j7727k9852H7448N0710J06511D5912g993B63743a52696
10715a18767n1637A74062a0091m62082a976j71458a1860B908L60705a66188m6352
10704b12540c9824A01507c4587H904a1114G4469a61637A1612P6189a31693D8422
10692f4029j9256A21808J30476c50591C8329b83990a32274A05287a38812A92524
10681A00008a48259p5905E763b08881d5087m61844b5375m1959A86532H4674j8670
10670F6004a06578M0417k2127j11073f0981A55301h0166b4548j68718l6680k8712
$$ plain form
10750 -551047 -172588 217404 -11271 59736 -231533 -166406 -141797 139258 -46935 72116 70632
10739 70632 -193767 201881 -83303 -129131 33864 -368666 -17345 -64252 -348207 -278908 230994
10727 -193350 -171457 -53185 -70912 -100764 87448 138158 244669 45912 -7993 263743 -152696
10715 -118767 -170404 174062 -10091 -472173 -1976 -173434 -11860 2908 363613 -166188 -212540
10704 -212540 -39824 101507 -34587 8904 -11114 74469 -161637 11612 87801 -131693 48422
10692 -64029 -83285 121808 252284 -350591 38329 -283990 -132274 105287 -138812 192524
10681 100008 -148259 -224164 5763 -208881 -45087 -506931 -25375 -67334 186532 84674 66004
10670 66004 -106578 -66161 -88288 -199361 -60981 155301 -80166 -24548 -193266 -229946 -258658
10659b58658J5838C35767a27918A34909c14086a3706m668A2635J7627R1769b19940
10647a6040I2481b45403f0184A41926l8238B1531K06644E1014O0165R0259a43696
10635i5297F94g0247l13243e568k50235A4098K59258a5823H0654C5683a71445
10623B83834a96352b7284C10055j38448h0919j29017k10380g580k30131h8527
10612c04017j06081J34211J21051E5325K84237d7100K0619j6174E0747c09301
10601c2574C0563N0254d776A13254e4767G8941a43170C1773a91788a8257j17090
10590a35347A72506a87914M9708k15473d8783C9075b11904D3397a04522A77694
10579A72922a41653A90360b43823a16429j741n3830g5517b5621j93349h9263G8691
$$ plain form
10659 -258658 -242820 335767 -127918 134909 -314086 -13706 -18374 12635 30262 122031 -219940
10647 -16040 92481 -245403 -60184 141926 103688 21531 228175 51014 111179 201438 -143696
10635 -95297 694 -70247 -383490 -5568 -255803 14098 273356 -15823 80654 35683 -171445
10623 283834 -196352 -27284 310055 171607 -80919 -209936 -420316 -7580 -237711 -88527
10612 -304017 -410098 -275887 -154836 55325 339562 -47100 -26481 -42655 50747 -309301
10601 -32574 30563 80817 -4776 113254 -54767 78941 -143170 31773 -191788 -18257 -135347
10590 -135347 172506 -187914 -138206 -353679 -48783 39075 -211904 43397 -104522 177694
10579 172922 -141653 190360 -243823 -116429 -118170 -172000 -75517 -25621 -218970 -89263 78691
10567a52520B02313D5291a98975O6306D3755K53257b67504a27937B98803I6156
10556a06701k15945Q7758i5305m7905b8406j51099O8374F9909k749b20854d2320
10544b36636f7954B00555I1938K8809a71859L4099I2232b79552a20944A84697
10533a5846A14057L18291b46260A41111g3859L6347B25741F8110c5413B89632
10522B63717h715j23179n58D121b53413f9226B5683c3996B35718b66207L5226
10511b30981i1079A9862b07354K6606o9878J01513j3072j29905O5835L6743P8329
10500a11183K3207j11962A4191g4098N550j28065g2419B41801a28804D9079a85502
10488a22419e7185p2812b7791p3248A35024c07969N3222a25559J7770j55723J7817
$$ plain form
10567 -152520 202313 45291 -198975 -132669 43755 297012 -267504 -127937 298803 96156
10556 -106701 -322646 -234888 -95305 -143210 -28406 -179505 -111131 69909 67160 -220854 -42320
10544 -236636 -67954 200555 91938 120747 -171859 -137760 92232 -279552 -120944 184697
10533 -15846 114057 432348 -246260 141111 -73859 -37512 225741 68110 -35413 289632
10522 263717 -8715 -131894 -132452 4121 -253413 -69226 25683 -33996 235718 -266207 -230981
10511 -230981 -91079 19862 -207354 -180748 -250626 -149113 -162185 -292090 -226255 -189512 -111183
10500 -111183 -87976 -199938 14191 -74098 -68548 -196613 -72419 241801 -128804 49079 -185502
10488 -122419 -57185 -129997 -27791 -101039 135024 -307969 -254747 -125559 -107789 -263512 -245695
10477b45695a6024k5903B09681K5164g7433j19566B66704a18167I813K01663J59356
10466C70832B8097a42542A7019M02286e1183J4235j59955b6705j39018E452c9696
10454G0351a27629k9858g8242A9860c53144B42681f2486A69164e3354F403b28599
10442b96113O3525f2949A5592a50180C4871P9496b37478A16573D6859b79342a31512
10430d9231j25390p3834B49666a23900I3156K4763a29317C67542a96245f4744
10419f6200r981k09047H1627K2771J17387a0951k122l3429H586R9766J77625A75
10406F462J43081n4295m040b33492C88419f8700j5399G8044a45391F4258K05912
10395B70170b5988A69244D6864a04312j38524F0651J64120I5008c14776C9035
$$ plain form
10477 -245695 -16024 -41927 209681 234845 -77433 -196999 266704 -118167 9813 211476 370832
10466 370832 28097 -142542 17019 419305 -51183 -36948 -196903 -26705 -165723 5452 -39696
10454 70351 -127629 -157487 -78242 19860 -353144 242681 -62486 169164 -53354 6403 -228599
10442 -296113 -232588 -62949 15592 -150180 34871 114367 -237478 116573 46859 -279342 -131512
10430 -49231 -174621 -248455 249666 -123900 93156 117919 -129317 367542 -196245 -64744
10419 -66200 -76181 -285228 81627 104398 221785 -10951 -13073 -46502 8586 108352 285977 175
10406 6462 149543 95248 91208 -233492 388419 -68700 -84099 78044 -145391 64258 270170
10395 270170 -25988 169244 46864 -104312 -242836 60651 224771 95008 -314776 39035
10384B68185G1576c74985h9392C86531F0257M3273a54n0411H4560J59319r0057
10373A53822J66437j37623J20983j10504m1153J10199N473K7799R9799j95441
10363A99791J81600K6664j54510O4723B5018c5567D17579A72027D6381L58355
10353D04736G3898R5331L22498o5031j45433Q9161K37538j19422A99429M896i3749
10341A60656b44027H9845K07335G4661J5061N3181g5846K663b5531A46503B1358
10329B40818j18330g7057A25973M5460N3438f3083p6831a8237A90019q8773J14957
10318B16203o2506i7058C18248A21852J79109A41714O290k1851e5130A53006a39528
10306F6206l1672a56776B52472B9945a38433n6195i6253A2322j737K7618a1602
$$ plain form
10384 268185 71576 -374985 -89392 386531 60257 103530 -154 -50565 84560 243879 153822
10373 153822 320259 182636 303619 193115 151962 262161 267634 295433 395232 199791
10363 199791 381391 408055 253545 318268 25018 -35567 417579 172027 46381 404736
10353 404736 73898 169229 491727 426696 281263 370424 607962 488540 199429 204325 -93749
10341 160656 -244027 89845 297180 74661 89722 142903 -75846 -73183 -25531 146503 21358
10329 240818 122488 -77057 125973 171433 224871 -63083 -139914 -18237 190019 101246 216203
10318 216203 153697 -97058 318248 121852 300961 141714 148004 126153 -55130 153006 -139528
10306 66206 34534 -156776 252472 29945 -138433 -194628 -96253 12322 10585 38203 -11602
10294i8537B2912h1826E4559f1033A74514a81778A09732g9688a0603r152l2918
10283e2673k89160J17074p2512b8014F1651b88256D7966P2077b33274n8992O2178
10272b30088P8157A7847e4301l12004F4246b02142j23695J05499D4196R6127a57704
10260a07832E1241K21908c8266A21288g2021k17435B04849r1955B6999J53269
10250A80268a12382k3659F7444b24183N9730N482A65617d93805A28514c18801
10239A56225a06686M7047D72846i9311l1932N1073C684O8563c63536P7014a603
10227A76651O8619e6031C56235j49153c06399f8168F8828R6873c58069J53403
10217b04666Q5193D3395b35269c2209o7318r9077D2975J43136F5086b51455R2804
$$ plain form
10294 -98537 22912 -81826 54559 -61033 174514 -181778 109732 -79688 -10603 -19755 -52673
10283 -52673 -341833 -224759 -297271 -28014 61651 -288256 47966 120043 -233274 -292266 -230088
10272 -230088 -151931 17847 -54301 -366305 64246 -202142 -325837 -220338 44196 140323 -157704
10260 -107832 51241 273149 -38266 121288 -72021 -289456 204849 112894 26999 180268
10250 180268 -112382 -136041 67444 -224183 -164453 -158971 165617 -493805 128514 -318801
10239 156225 -106686 -59639 472846 -99311 -131243 -80170 3684 72247 -363536 -286522 -1603
10227 176651 245270 -56031 356235 207082 -306399 -68168 68828 165701 -358069 -204666
10217 -204666 -119473 43395 -235269 -32209 -99527 -198604 42975 186111 65086 -251455 -158651
10206a58651C71630I9544a84091j03326B2671b88144J34644a7348D4035b62097
10195a99144F3076B2585h8447a7843A08692J2192a4064E8515i4976c5426P418
10184b8008B08856c67988h9643J7088j26107q37L943P7895I3556i7437O959q467
10172i8945M1688E9590k0442c51327a6394E3423a12279j10554j46969B1549b33145
10160a60247m3272Q6704d6654j22668b7965A8260c44845g9985C693A217g576j43778
10148a51354m5790k2249B8113i1172M5476k76650a0911A15055b22150g1223A63383
10136A42650a09800d4388k47709J21355d8846q7565J2418o6507F7039L8614a71742
10124c48887C02866d5265O384A58495b6261k197l36421H5610e7557D1442a04761
$$ plain form
10206 -158651 371630 99544 -184091 -287417 22671 -288144 -153500 -17348 44035 -262097
10195 -199144 63076 22585 -88447 -17843 108692 120884 -14064 58515 -94976 -35426 -28008
10184 -28008 208856 -367988 -89643 -72555 -198662 -199499 -195556 -117661 93556 -97437 -90478 -98945
10172 -98945 -57257 59590 39148 -351327 -16394 53423 -112279 -222833 -369802 21549 -233145
10160 -160247 -203519 -116815 -46654 -169322 -27965 18260 -344845 -79985 3693 1217 -7576 -151354
10148 -151354 -197144 -219393 28113 -91172 -45696 -322346 -10911 115055 -222150 -71223 163383
10136 142650 -109800 -44388 -292097 -170742 -48846 -136411 -123993 -190500 67039 105653 -171742
10124 -348887 302866 -45265 -38881 158495 -26261 -28458 -364879 85610 -57557 41442 -104761
10112b8578b309j67635B65855e6767H6543C3866A5424f8301j54672A74961g922
10100H6013e9855l4942B2909a68299j7675B99622e9571j02527A81061b77313j37857
10089d15170a67420B46414j06031i6539j25772B7726J40864E3898B3538d00214
10078a73048A40828C318a35386j79906a5523j35284N4686F837b5156I1392a29842
10066A70165A8982a54930j0653B4908b7232A23709A562f8170A005K81121d87164
10054e8028p8792k51548g4046j78737g5595H8239a95323d6466p2199j93705a02585
10042a06240g448l08809q5566c263k11510k4308i448l43364J15429J18677l3656
10031a52362O9966n1881O2322f597H0860a37206j3030j93527n096A71934O3674
$$ plain form
10112 -28578 -2309 -169944 265855 -56767 86543 33866 15424 -68301 -222973 174961 -7922
10100 86013 -59855 -94797 22909 -168299 -185974 299622 -59571 -162098 181061 -277313 -415170
10089 -415170 -167420 246414 140383 -96539 -222311 27726 168590 53898 23538 -400214
10078 -173048 140828 3318 -135386 -315292 -15523 -150807 -96121 6837 -25156 91392 -129842
10066 170165 18982 -154930 -165583 24908 -27232 123709 1562 -68170 1005 282126 -487164
10054 -58028 -136820 -388368 -74046 -252783 -75595 88239 -195323 -46466 -118665 -312370 -102585
10042 -106240 -7448 -316257 -401823 -3263 -214773 -239081 -9448 -352812 -237383 -118706 -152362
10031 -152362 -82396 -134277 -71955 -6597 80860 -137206 -150236 -343763 -348859 171934 235608
10020B35608J7178h978H082b08477J542A56003G2652a4414D197J28591a64304
10008b60247B07788r1864m461i0379B00146n5135P3248a84469D758K6735a39838
9996a94423F6541a3181m6545k32816G8583b92753A52245g9832j18460j04738A36422
9984B84541a31004j07247J7170k01648C04489G6122d9810m891l16502F8668g388
9972F6126b82173i9133n2757G7236o55a82058L8186B98917e298l42224a53124
9960d2828k83141N7187F3644M1938a48231a4028o9133A568L19835a55112j64554
9949c19666J06445c0692B2514a1405j83362j669C2897J18456b5989G5524H964
9937A46991b76624C7324c9427F1469a22920N9573j68857J09378E1085K44838b10992
$$ plain form
10020 235608 252786 -8978 8082 -208477 -206935 156003 72652 -14414 4197 132788 -164304
10008 -260247 207788 115924 111463 -90379 200146 145011 218259 -184469 4758 31493 -139838
9996 -194423 66541 -13181 -59726 -292542 78583 -292753 152245 -79832 -198292 -303030 136422
9984 284541 -131004 -238251 -221081 -422729 304489 76122 -49810 -54701 -371203 68668 -7388
9972 66126 -282173 -99133 -151890 77236 76581 -182058 -143872 298917 -5298 -347522 -153124
9960 -42828 -325969 -268782 63644 105582 -148231 -14028 -83161 1568 321403 -155112 -319666
9949 -319666 -213221 -30692 22514 -11405 -194767 -196436 32897 151353 -25989 75524 8964
9937 146991 -276624 37324 -39427 61469 -122920 -63347 -232204 -122826 51085 295923 -210992
9925g9502j22581A1744b8680m20797C5296a97520a9490B3468a93153q4882Q2624
9914a95411H6072h6874c6953k8623k46512e7003r7030M2801B7795b0466l09368
9903c29834c6445j55785C03801Q8945h9770j34654J10601n11381A07757m5178
9893F2579a20992J7373j58569A58034b59344J15207R615B2327c03079F1548c44550
9881d42418B6524Q7133b747j56167I1023a51997D7438a60861A20123p825J20949
9870B33247a67813E7657g2791p1248j12125a22002J6219m348j1582j68935b5411
9858G4363b68628B25739i4023d3702C92312f2725C6054J30341k5757b68765e9786
9846b72494e3394R028c316q2970k65411h9998h263r6354n3504l90345a71856k94128
$$ plain form
9925 -79502 -202083 11744 -28680 -449477 35296 -197520 -19490 23468 -193153 -278035 -195411
9914 -195411 86072 -86874 -36953 -65576 -312088 -57003 -154033 -111232 27795 -20466 -329834
9903 -329834 -36445 -192230 303801 392746 -89770 -224424 -113823 -625204 107757 62579
9893 62579 -120992 -103619 -262188 158034 -259344 -144137 -134522 22327 -303079 61548 -344550
9881 -442418 26524 113657 -2747 -158914 91023 -151997 47438 -160861 120123 112298 233247
9870 233247 -167813 57657 -72791 -144039 -256164 -122002 -105783 -110131 -121713 -290648 -25411
9858 74363 -268628 225739 -94023 -43702 392312 -62725 36054 166395 140638 -268765 -59786
9846 -272494 -53394 -44366 -3316 -86286 -351697 -89998 -8263 -104617 -158121 -548466 -171856 -465984
9834d65984d1251j15332b3908p4220k09913l6921J40896A69479b72149D6128J0021
9823E6149e7360F3739i6820A41264d1757H9455b49253C37b21915L409k7381A52429
9810A18408a36611b9669C1170c354j44733C0408c11685a34633A75476b74779B81351
9798a09498k27930K0055M3393h8639G7321c56852F2251A5388b86617a29760k25732
9787c55492J05993f1605A41483a452j55310k00505B45964j3433a43228B82321
9776b76311m4571a03075A10001d8645j33290A78494l2381b57042O1480a135A1842
9764a75935j16262m4089C9463c9063l5310r4069j7814r0379B6572d19106g5692
9752a82613Q9536K1426k29561E8238c1954j00896G779b90361P9254h2599A69811
$$ plain form
9834 -465984 -41251 -156583 -23908 -98128 -308041 -344962 -204066 169479 -272149 46128 56149
9823 56149 -57360 63739 -96820 141264 -41757 89455 -249253 337 -221915 -218506 -245887 152429
9810 118408 -136611 -29669 31170 -3354 -148087 30408 -311685 -134633 175476 -274779 281351
9798 -109498 -337428 -317373 -273980 -88639 77321 -356852 62251 15388 -286617 -129760 -355492
9787 -355492 -249499 -61605 141483 -1452 -156762 -357267 245964 232531 -143228 282321
9776 -276311 -320882 -103075 110001 -48645 -181935 178494 146113 -257042 -195562 -1135 11842
9764 -175935 -292197 -336286 39463 -39063 -74373 -168442 -186256 -276635 26572 -419106 -75692
9752 -182613 -93077 -71651 -301212 58238 -31954 -132850 7779 -290361 -211107 -82599 169811
9740h6556j02160e4576j29283l1650D4700b2575k75918J39526a3780k53348A62727
9728a14867N4892F6393f7373I068a436A82060m2736b69299O0423c762k7018k25584
9716b56364E7647b5609C66198I6424h636l37771H0442b31019J04779e1614A8637
9704a97081A48520a47228K3880A80247a64975C15267A3157L57053b27137G3152
9693E0972a66927C0031g9515L1026C8479a01620G6999a53429B2647g2196j49118
9682b21314a00519j9993B690J0835b64150J17200A04348i1472A29298n6481g6605
9670A42296c01722a13359D33432g8964B53003F7802b0122j03154H6394P6302D6598
9658h467A87446E3737b85583H6926g1159j99297d2582j85603I3239F237P053L41668
$$ plain form
9740 -86556 -188716 -54576 -183859 -215509 44700 -22575 -298493 -158967 -13780 -267128 162727
9728 -114867 -59975 66393 -67373 9068 -1436 182060 139324 -269299 -208876 -3762 -30780 -256364
9716 -256364 57647 -25609 366198 96424 -8636 -346407 80442 -231019 -126240 -51614 18637
9704 -197081 148520 -147228 -123348 180247 -164975 315267 13157 370210 -227137 73152
9693 50972 -166927 30031 -79515 -48489 38479 -101620 76999 -153429 22647 -72196 -221314
9682 -221314 -100519 -120512 2690 13525 -264150 -146950 104348 -91472 129298 72817 -76605
9670 142296 -301722 -113359 433432 -78964 253003 67802 -20122 -123276 86394 162696 46598
9658 -8467 187446 53737 -285583 86926 -71159 -270456 -42582 -228185 93239 6237 13290 354958
9646C54958b70471Q8059C02807q0054E8985b98815h2333a2548j41338m8480j38048
9635c40414f4433j17904A97385b59737a08893A68612J47153d13593e7568A09916
9624a78571C71129b70148C2908a97874i5832q5794l43216b37912J17102i567m74
9613a0041k06922J08203H718P6080M20593c20426C1966f6676J428F7926Q9432
9602A57358p6450e1730A27024F3315c58797A31719a90933A69552g8814k7669k2864
9591a29347a1815A05097a9150j46048L0656N5302n6270c3142A01904a40476B36599
9579a04226j10356O9333C3197Q2739J41980b30182F369a17308j18634p0783A49574
9567f0412j62763B6787a97785J0838r3741e7850j02845D9285c12784k0775G7193
$$ plain form
9646 354958 -270471 -182412 302807 222753 58985 -298815 -82333 -12548 -153886 -202366 -340414
9635 -340414 -64433 -182337 197385 -259737 -108893 168612 315765 -413593 -57568 109916
9624 -178571 371129 -270148 32908 -197874 -95832 -181626 -524842 -237912 -120810 -9567 -10041
9613 -10041 -216963 -108760 8718 84798 505391 -320426 31966 -66676 -65248 67926 157358
9602 157358 80908 -51730 127024 63315 -358797 131719 -190933 169552 -78814 -106483 -129347
9591 -129347 -11815 105097 -19150 -165198 -134542 -79240 -135510 -33142 101904 -140476 236599
9579 -104226 -214582 -145249 33197 115936 257916 -230182 6369 -117308 -235942 -306725 149574
9567 -60412 -223175 26787 -197785 -186947 -280688 -57850 -160695 49285 -312784 -333559 77193
9555b1334E8366R3312b33173A58528a42624B71619c44106q8059f8824j68933m845
9544b42602A00814q738a56441m6033I2281M5494a78315m0583i8659f28o6619H7315
9531c45217A59516j4354a47956B3398b56503a01024m8931N7615L0067C10843a86239
9519B03360J06530a66919B9264b6571A7076J36964C866L45179A10364A013O8926
9508F9939P9767L5577b822j85402N8629M0565A14639a92800D67192a41800F3236
9496B52593b10320R6318j28158B51002L0982i5346j58202G2752a82621J1952f3608
9484A02754c04758P0084k08911A34245a95765g0716D24940a24437b670A37634
9473f7437n4219j5089j65841c5521r8790j26598N2530A44649C1411c61457A17124
$$ plain form
9555 -21334 58366 151678 -233173 158528 -142624 271619 -344106 -432165 -68824 -237757 -242602
9544 -242602 100814 92076 -156441 -202474 92281 137775 -178315 -218898 -98659 -628 -67247 87315
9531 -345217 159516 145162 -147956 23398 -256503 -101024 -149955 -92340 -62273 310843 -186239
9519 203360 309890 -166919 29264 -26571 17076 154040 3866 349045 110364 1013 69939
9508 69939 149706 185283 -2822 -188224 -129595 -89030 114639 -192800 467192 -141800 63236
9496 252593 -210320 -114002 -242160 251002 281984 -95346 -253548 72752 -182621 -170669 -63608
9484 102754 -304758 -234674 -443585 134245 -195765 -70716 424940 -124437 -2670 137634
9473 -67437 -121656 -136745 -302586 -35521 -134311 -260909 -208379 144649 31411 -361457 117124
9461B7700Q5464b67359f5557E8873a67804o5935N2822A80359a55434E6821a56744
9449H3142i6558r464D485c90062I1351c96710a4424j46998L9233a5743k26594
9438b42337A18207b13884k2119B2561J19404c58096b6641n8136a3193E07883a09673
9426A04194a95268A85229L1258g7251j11129m5064B6180P6749H206c74732Q5968
9415b88764f2129C039a24561c5016A19884Q2276a99606g8149C7629K3377a2480
9403b05302O7890J8492L2709m4487m5487B5312a91741g8859A01172K9906l0295
9392A00783c78140L0392J26837J07577j37696C1033A453d6864A15775h4723c3924
9380A38601c47851J12205J17310e1925l35473a67993B17809a86375B56529b73869
$$ plain form
9461 27700 113164 -267359 -65557 58873 -167804 -233739 -180917 180359 -155434 56821 -156744
9449 83142 -96558 -106022 4485 -390062 91351 -396710 -14424 -161422 -122189 -15743 -242337
9438 -242337 118207 -213884 -236003 22561 141965 -358096 -26641 -84777 -13193 507883 -109673
9426 104194 -195268 185229 216487 -77251 -188380 -233444 26180 102929 8206 -374732 -288764
9415 -288764 -62129 3039 -124561 -35016 119884 202160 -199606 -78149 37629 61006 -12480
9403 -205302 -137412 -118920 -86211 -130698 -176185 25312 -191741 -78859 101172 131078 100783
9392 100783 -378140 -347748 -220911 -113334 -251030 31033 1453 -46864 115775 -84723 -33924
9380 138601 -347851 -235646 -118336 -51925 -387398 -167993 217809 -186375 256529 -273869
9369c05354b0490C03376d070H5215K1046Q107a30591A4627a90126j45059G5552
9357a11235E30950A65771p4794C7588h9444j76877A60852e3698n6245o4911N2414
9346a22440H6484H287b36550I9600C8694a83561Q2276I2877b50521E4879b2249
9334b37819I9350g1207j58522H2913C0108a4690A84756f8774d105l39253j30850
9323d74208b26046c321k6109H372b23317A18545a65151Q789g6250j02132A49441
9311a23403c4102l37531h4542m2403j03481E9231b20258j12718h4470A34184f9480
9299C5823K0384i1455J1446A86555C4319a34655B24604a73012m699B60829A00508
9287i6545a9650k40809D0297b64142R8044O6686j73403a12249p6538g0378a8075
$$ plain form
9369 -305354 -20490 303376 -4070 85215 106261 114368 -130591 14627 -190126 -335185 75552
9357 -111235 530950 165771 90977 37588 -89444 -266321 160852 -53698 -109943 -174854 -122440
9346 -122440 86484 8287 -236550 99600 38694 -183561 -101285 92877 -250521 54879 -22249
9334 -237819 99350 -71207 -229729 82913 30108 -14690 184756 -68774 -4105 -343358 -474208
9323 -474208 -226046 -3321 -29430 8372 -223317 118545 -165151 -156362 -76250 -178382 149441
9311 -123403 -34102 -371633 -84542 -126945 -230426 59231 -220258 -332976 -84470 134184 -69480
9299 35823 56207 -91455 -80009 186555 34319 -134655 224604 -173012 -177711 260829 100508
9287 -96545 -19650 -260459 40297 -264142 -166098 -99412 -272815 -112249 -188787 -70378 -18075
9275a38917c6433n2509A876b59511e1501D5367o926P0348b6983A25171Q6134c0780
9262g03l05769B03191a53819P6467j46550j57562A97715g8421I3143Q616L3946
9251A35705b72152a24363p380n7566A01530J13551C1227c68336C02656a67657
9240a09183L1763j9599a4184k22440H4583b56609M7767h3300D9119a17303F5733
9228D567f0193l9256k33434d8425n1065l9839q645H7485a59165B49535I6196e5388
9215A78905a07201K0133r3164f5393j65844B69436E154c30303a40674K6640f208
9203A26097J27037F3279g2149l69520c5511G6172b5444j74937j88026a23259B42423
9191a51227A8418K1785h353A38733a95850A56348b29295C3864b13941L4020L6621
$$ plain form
9275 -138917 -36433 -88942 1876 -259511 -51501 45367 38441 108789 -26983 125171 211305 -30780
9262 -703 -306472 203191 -153819 -77352 -223902 -381464 197715 -78421 93143 101759 135705
9251 135705 -272152 -124363 -131743 -189309 101530 215081 31227 -368336 302656 -167657
9240 -109183 -77420 -97019 -14184 -236624 84583 -256609 -208842 -83300 49119 -117303 65733
9228 4567 -60193 -99449 -332883 -48425 -99490 -139329 -147974 87485 -159165 249535 96196 -55388
9215 178905 -107201 -87068 -180232 -65393 -231237 269436 5154 -330303 -140674 -114034 -6208
9203 126097 253134 63279 -72149 -441669 -35511 76172 -25444 -200381 -388407 -123259 242423
9191 -151227 18418 40203 -8353 138733 -195850 156348 -229295 33864 -213941 -179921 -143300
9180a43300f5826G7249J06594b55395a2576o5938j11681I7409c06862b4613D437
9168A5946a50924C7431d76366f2950E6238h9496A217b59593a24164B2459M574
9157B7033J74663b91947R8580e401j00407a7442F3589a40333n2379N1997B20527
9145B8100J23227c8103B70222e2044j34980M2527O1414m38662H8705a5984o3729
9134g9713A8743J25813F8462a50184j48572G500R6249d2801I7497A9193G887a5131
9121A16960b41720j168A47556d14771l611g849A46015a54079o231A52854e7609
9109b03464A13881a18427k9577A61019k761c9543J7358A9660b10552j7967b8944
9097e8422A87e5080j31683Q496l9422a04801B0968a37555L1563j67530C48712
$$ plain form
9180 -143300 -65826 77249 183843 -255395 -12576 -78514 -190195 97409 -306862 -24613 4437
9168 15946 -150924 37431 -476366 -62950 56238 -89496 1217 -259593 -124164 22459 27033
9157 27033 201696 -291947 -193367 -5401 -105808 -17442 63589 -140333 -192712 -140715 220527
9145 28100 151327 -38103 270222 -52044 -187024 -144497 -83083 -521745 88705 -15984 -79713
9134 -79713 18743 144556 68462 -150184 -298756 7500 103749 -42801 97497 19193 7887 -15131
9121 116960 -241720 -242888 147556 -414771 -418382 -7849 146015 -154079 -160310 152854 -57609
9109 -203464 113881 -118427 -148004 161019 158258 -39543 -22185 19660 -210552 -228519 -28944
9097 -58422 187 -55080 -186763 -178267 -217689 -104801 20968 -137555 -105992 -273522 348712
9085f889k73709J18928a4261K485o6267A63460a88385m104C2634e8981j40170
9074a99151A18273A5841i0198A45232a14926j19394J2671h3926a4202k93038N876
9063c01364m0828C13605b0013r7134e627r7209A8953J5199j4869a52666b0935
9051C9937e6337r1045O0351j09163a8810A98540M8880b37912D44146a78220A28873
9039c72377a67834B07984f1998F1135b90532D9019d52264h8046p7211B11006o3964
9028A47042a96929a5261j11280K1762K8095r7693B09758a11631A71624a72261
9017c89755a00261E8650M675M8596b69450K2842o5544e6698a3279M483o1392l77012
9005d47200N1179E9872a38252H6228c11538m7636q6989a26175e5650A06342J71571
$$ plain form
9085 -6889 -280598 -161670 -14261 -11776 -78043 163460 -188385 -192489 32634 -58981 -199151
9074 -199151 118273 15841 -90198 145232 -114926 -234320 -221649 -83926 -14202 -307240 -301364
9063 -301364 -342192 313605 -20013 -117147 -5627 -102836 18953 34152 19283 -152666 -20935
9051 39937 -56337 -147382 -87031 -196194 -18810 198540 247420 -237912 444146 -178220 128873
9039 -372377 -167834 207984 -61998 61135 -290532 49019 -452264 -88046 -165257 211006 147042
9028 147042 -196929 -15261 -126541 -104779 -76684 -174377 209758 -111631 171624 -172261
9017 -389755 -100261 58650 63325 111921 -269450 -246608 -312152 -56698 -13279 -8796 -70188 -447200
9005 -447200 -396021 59872 -138252 86228 -311538 -359174 -446163 -126175 -55650 106342 277913
8994B77913o4340L0742c4176D7953g9238B73631D04K06821b38924e2562C72462
8982A59555e5555C3521L3564O112c4238E21215f079j80572C714K46268r9738a48820
8969a43326l16113b27163A83835p2267e4003r3891j22692D3692f1009j25567E5359
8957a67812q6076I3645B1803a14616q2109M3109g0650j45032A2629a17728A36536
8945A12437a34777M530A4137K98397a93062P3623k71688A8304P2078L69874A68334
8933a34945j91911C42325a02642m3674P2997m1194N776G3452A4190b9366F6027
8921a17983C4733L93459A97574H0484M43728a10344F1408J459a16704c8873o4698
8910a03571q2001A37043a06784q3618P0484b5054A46917a25353K0989L4323c3640
$$ plain form
8994 277913 213573 244315 -34176 47953 -79238 273631 404 207225 -238924 -52562 372462
8982 159555 -55555 33521 67085 73197 -34238 521215 -6079 -186651 3714 249982 150244 -148820
8969 -143326 -459439 -227163 183835 111568 -54003 -147894 -270586 43692 -61009 -186576 55359
8957 -167812 -253888 93645 21803 -114616 -196725 -153616 -70650 -215682 12629 -117728 136536
8945 112437 -134777 -130247 14137 312534 -193062 -119439 -391127 18304 90382 460256 168334
8933 -134945 -326856 342325 -102642 -146316 -73319 -114513 -108737 73452 14190 -29366 66027
8921 -117983 34733 428192 197574 80484 524212 -110344 61408 62867 -116704 -38873 -103571
8910 -103571 -185572 137043 -106784 -190402 -119918 -25054 146917 -125353 -104364 -70041 -33640
8898E6773P4490e5658k86917a14794B12816F6782b83409O8824g7176j51331B71432
8886b090A88599a65817j4259O5284N863j3055o2588Q8857j93889G4909a82638
8874b17740g6425b8381m9613j6776A3940b26796b8319E0923c10562A77195b2857
8862c1559A30831l516b55502N5014j92184b5819m9531k46303a05499a0673l13059
8851c23732d0190B2807g4441A25847b2164j33568j91644a0223m8143B1056f1400
8839a42895j02895Q2315j00759R3030A01746a68949B46234K5271O8671j55741
$$ plain form
8898 56773 131263 -55658 -342575 -114794 212816 66782 -283409 -214585 -77176 -228507 271432
8886 -2090 188599 -165817 -180076 -114792 -108929 -121984 -184572 -95715 -289604 74909 -182638
8874 -217740 -76425 -28381 -77994 -94770 13940 -226796 -28319 50923 -310562 177195 -22857
8862 -31559 130831 127315 -255502 -200488 -392672 -25819 -75350 -321653 -105499 -10673 -323732
8851 -323732 -40190 22807 -74441 125847 -22164 -155732 -347376 -10223 -58366 21056 -61400
8839 -142895 -245790 -163475 -264234 -171204 101746 -168949 246234 271505 340176 184435
$$ [...]
##END NTUPLES=NMR SPECTRUM
##END=
