##TITLE=AC1751_05000195609115FOTR0001_9275067_Bt7wbmRs15
##JCAMPDX= 6.0         $$ Bruker NMR JCAMP-DX V2.0
##DATA TYPE= NMR SPECTRUM
##DATA CLASS= NTUPLES
##ORIGIN= BRUKER
##OWNER= Administrator
$$ 1.72 TOPSPIN		Version 2.1
$$ 2015-07-18 09:55:15.854 -0700  Administrator@X
$$ Compression mode = diff/dup
##.OBSERVE FREQUENCY= 400.02188249412
##.OBSERVE NUCLEUS= ^1H
##.ACQUISITION MODE= SIMULTANEOUS (DQD)
##.ACQUISITION SCHEME= undefined
##.AVERAGES= 64
##.DIGITISER RES= 22
##SPECTROMETER/DATA SYSTEM= spect
##.PULSE SEQUENCE= noesygpps1d.comp
##.SOLVENT NAME= COFFEE_meoh
##.SHIFT REFERENCE= INTERNAL, COFFEE_meoh, 1, 14.96206
##AUDIT TRAIL= $$ (NUMBER, WHEN, WHO, WHERE, PROCESS, VERSION, WHAT)
$$ ##TITLE= Audit trail, TOPSPIN		Version 2.1
$$ ##JCAMPDX= 5.01
$$ ##ORIGIN= Bruker BioSpin GmbH
$$ ##OWNER= Administrator
$$ $$ E:\/data/COFFEE/nmr/AC1751_05000195609115FOTR0001_9275067_Bt7wbmRs15/22/pdata/1/auditp.txt
$$ ##AUDIT TRAIL=  $$ (NUMBER, WHEN, WHO, WHERE, PROCESS, VERSION, WHAT)
(   1,<2015-07-18 09:55:10.322 -0700>,<Administrator>,<X>,<go>,<TOPSPIN 2.1>,
      <created by zg
	started at 2015-07-18 09:43:38.291 -0700,
	POWCHK enabled, PULCHK disabled,
       configuration hash MD5:
       21 0F 79 D6 B3 7B B4 F6 88 20 88 DB 03 48 BD 9F
       data hash MD5: 64K
       46 DA 64 03 CB 4C C1 66 AE 85 0F 14 AF 67 FE 86>)
(   2,<2015-07-18 09:55:13.744 -0700>,<Administrator>,<X>,<proc1d>,<TOPSPIN 2.1>,
      <Start of raw data processing
       efp LB = 0.3 FT_mod = 6 PKNL = 1 PHC0 = 0 PHC1 = 0 SI = 128K 
       data hash MD5: 128K
       3E 95 40 23 DE 24 D8 A3 67 8D 13 30 FA 63 0E 6B>)
(   3,<2015-07-18 09:55:14.650 -0700>,<Administrator>,<X>,<proc1d>,<TOPSPIN 2.1>,
      <pk PHC0 = -84.9408 PHC1 = 0 
       data hash MD5: 128K
       92 1B 46 FC 1A 99 64 4E C2 CD 66 69 77 E3 42 FA>)
(   4,<2015-07-18 09:55:15.025 -0700>,<Administrator>,<X>,<proc1d>,<TOPSPIN 2.1>,
      <abs ABSG = 1 
       data hash MD5: 128K
       28 BA 33 E5 53 0D 57 24 30 22 99 F9 F7 40 D4 4E>)
(   5,<2015-07-18 09:55:15.135 -0700>,<Administrator>,<X>,<proc1d>,<TOPSPIN 2.1>,
      <abs ABSG = 2 
       data hash MD5: 128K
       95 CD 46 F9 91 A5 4F 91 21 CD D2 4A 97 B9 0F AD>)
(   6,<2015-07-18 09:55:15.229 -0700>,<Administrator>,<X>,<proc1d>,<TOPSPIN 2.1>,
      <abs ABSG = 3 
       data hash MD5: 128K
       64 DF A5 A8 AE A9 FB 96 A3 EE 7F 53 A6 5D 47 DB>)
(   7,<2015-07-18 09:55:15.307 -0700>,<Administrator>,<X>,<proc1d>,<TOPSPIN 2.1>,
      <abs ABSG = 4 
       data hash MD5: 128K
       36 57 04 94 59 0B 8E D7 15 D3 E2 ED D9 0C 99 69>)
(   8,<2015-07-18 09:55:15.400 -0700>,<Administrator>,<X>,<proc1d>,<TOPSPIN 2.1>,
      <abs ABSG = 5 
       data hash MD5: 128K
       2B 98 16 C2 52 FF A6 A3 FB 1E 9E DF 8A C2 B8 23>)
$$ ##END=
$$ 
$$ $$ hash MD5
$$ $$ 5A 6B C3 DF EB 6C 86 68 20 82 EE 14 8A 96 B3 96
##$RELAX= 
##$RELAX= 
##$RELAX= 
##$RELAX= 
##$RELAX= 
##$RELAX= 
##$RELAX= 
##$RELAX= 
$$ Bruker specific parameters
$$ --------------------------
##$DU= <E:\>
$$ [...]
##$TP07= 0
##$TPNAME0= <>
##$TPNAME1= <>
##$TPNAME2= <>
##$TPNAME3= <>
##$TPNAME4= <>
##$TPNAME5= <>
##$TPNAME6= <>
##$TPNAME7= <>
##$TPOAL= (0..7)
0.5 0.5 0.5 0.5 0.5 0.5 0.5 0.5
##$TPOFFS= (0..7)
0 0 0 0 0 0 0 0
##$TUNHIN= 0
##$TUNHOUT= 0
##$TUNXOUT= 0
##$USERA1= <user>
##$USERA2= <user>
##$USERA3= <user>
##$USERA4= <user>
##$USERA5= <user>
##$V9= 5
##$VALIST= <valist>
##$VCLIST= <CCCCCCCCCCCCCCC>
##$VD= 0
##$VDLIST= <DDDDDDDDDDDDDDD>
##$VPLIST= <PPPPPPPPPPPPPPP>
##$VTLIST= <TTTTTTTTTTTTTTT>
##$WBST= 2048
##$WBSW= 25
##$XGAIN= (0..3)
0 0 0 0
##$XL= 0
##$YL= 0
##$YMAX_a= 6752838
##$YMIN_a= -16961881
##$ZGOPTNS= <>
##$ZL1= 120
##$ZL2= 120
##$ZL3= 120
##$ZL4= 120
##$ABSF1= 14.96206
##$ABSF2= -5.596122
##$ABSG= 5
##$ABSL= 3
##$ALPHA= 0
##$AQORDER= 0
##$ASSFAC= 0
##$ASSFACI= 0
##$ASSFACX= 0
##$ASSWID= 0
##$AUNMP= <proc_prof1d_extract.lims>
##$AXLEFT= 0
##$AXNAME= <>
##$AXNUC= <1H>
##$AXRIGHT= 0
##$AXTYPE= 0
##$AXUNIT= <>
##$AZFE= 0.1
##$AZFW= 0.1
##$BCFW= 0
##$BC_mod= 0
##$BYTORDP= 0
##$COROFFS= 0
##$CY= 15
##$DATMOD= 1
##$DC= 0
##$DFILT= <>
##$DTYPP= 0
##$F1P= 0
##$F2P= 0
##$FCOR= 0.5
##$FTSIZE= 131072
##$FT_mod= 6
##$GAMMA= 0
##$GB= 0
##$INTBC= 1
##$INTSCL= 1
##$ISEN= 128
##$LB= 0.3
##$LEV0= 0
##$LPBIN= 0
##$MAXI= 10000
##$MC2= 0
##$MEAN= 0
##$ME_mod= 0
##$MI= 0
##$NCOEF= 0
##$NC_proc= -2
##$NLEV= 6
##$NOISF1= 0
##$NOISF2= 0
##$NSP= 0
##$NTH_PI= 0
##$NZP= 0
##$OFFSET= 14.96206
##$PC= 1
##$PHC0= -84.9408
##$PHC1= 0
##$PH_mod= 1
##$PKNL= yes
##$PPARMOD= 0
##$PPDIAG= 0
##$PPIPTYP= 0
##$PPMPNUM= 2147483647
##$PPRESOL= 1
##$PSCAL= 4
##$PSIGN= 0
##$PYNMP= <proc.py>
##$REVERSE= no
##$SF= 400.020009211267
##$SI= 131072
##$SIGF1= 0
##$SIGF2= 0
##$SINO= 400
##$SIOLD= 131072
##$SPECTYP= <>
##$SREGLST= <1H.CDCl3>
##$SSB= 0
##$STSI= 131072
##$STSR= 0
##$SW_p= 8223.68421052631
##$SYMM= 0
##$S_DEV= 0
##$TDeff= 65536
##$TDoff= 0
##$TI= <>
##$TILT= no
##$TM1= 0
##$TM2= 0
##$TOPLEV= 0
##$USERP1= <user>
##$USERP2= <user>
##$USERP3= <user>
##$USERP4= <user>
##$USERP5= <user>
##$WDW= 1
##$XDIM= 131072
##$YMAX_p= 380125528
##$YMIN_p= -12253
##$CURPLOT= <Network HP LaserJet P1505>
##$CURPRIN= <$Network HP LaserJet P1505>
##$DFORMAT= <normdp>
##$LAYOUT= <+/1D_H.xwp>
##$LFORMAT= <normlp>
##$PFORMAT= <normpl>
##$SURQMSG= 1
$$ End of Bruker specific parameters
$$ ---------------------------------
##NTUPLES= NMR SPECTRUM
##VAR_NAME=  FREQUENCY,     SPECTRUM/REAL,   SPECTRUM/IMAG
##SYMBOL=    X,             R,               I
##VAR_TYPE=  INDEPENDENT,   DEPENDENT,       DEPENDENT
##VAR_FORM=  AFFN,          ASDF,            ASDF
##VAR_DIM=   131072,        131072,          131072
##UNITS=     HZ,            ARBITRARY UNITS, ARBITRARY UNITS
##FACTOR=    0.0627417313425164, 1,          1
##FIRST=     8223.62146879497, 4304,         -49226
##LAST=      0,             4931,            -48538
##MIN=       0,             -12253,          0
##MAX=       8223.62146879497, 380125528,    0
$$ Real data points
##PAGE= N=1
##DATA TABLE= (X++(R..R)), XYDATA
$$ [...]
$$ plain form
60988 19500305 21312656 23191427 25064753 26822058 28324487 29443151 30110972 30354259
60980 30354259 30279882 30027069 29716066 29416800 29136173 28815007 28339262 27577314 26436781
60971 26436781 24910030 23079056 21080002 19054525 17115488 15335346 13749974 12368201
60963 12368201 11181694 10173077 9321399 8605065 8003236 7496725 7068816 6705710 6396110
60954 6396110 6130261 5899442 5696395 5515767 5353775 5207527 5074884 4954538 4845488
60945 4845488 4746269 4654985 4569966 4490007 4414024 4341072 4270818 4203489 4139106 4077242 4017857
60934 4017857 3961919 3910615 3864078 3821442 3782135 3746615 3715559 3688776 3665411 3645092 3628297
60923 3628297 3615336 3605332 3596640 3588138 3579660 3571212 3562392 3552771 3542350 3531175 3518879 3505193
$$ packed form
60988A9500305J812351J878771J873326J757305J502429J118664O67821K43287
60980C0354259p4377k52813l11003k99266k80627l21166m75745p61948j140533
60971B6436781j526751j830974j999054k025477j939037j780142j585372j381773
60963A2368201j186507j008617q51678p16334o01829n06511m27909l63106l09600
60954F396110k65849k30819k03047j80628j61992j46248j32643j20346j09050
60945D845488r9219r1284q5019p9959p5983p2952p0254o7329o4383o1864n9385
60934D017857n5938n1304m6537m2636l9307l5520l1056k6783k3365k0319j6795
60923C628297j2961j0004q692q502q478q448q820r621j0421j1175j2296j3686
$$ plain form
60911 3505193 3490736 3476721 3463922 3452365 3441984 3432960 3425269 3418493 3412329 3406793 3401600 3395947 3389505
60898 3389505 3383337 3379188 3377943 3379345 3383104 3389472 3398459 3409144 3420388 3431953 3444400 3458000 3472312
60885 3472312 3486935 3502254 3519191 3538434 3560073 3583789 3609119 3635584 3662741 3690129 3717109
60874 3717109 3742821 3766313 3786602 3802672 3813778 3820070 3822682 3822936 3821600 3819260 3817092 3816668 3818880
60861 3818880 3823548 3830239 3838969 3849885 3862714 3876944 3892251 3908327 3924531 3940095 3954528 3967437
60849 3967437 3978143 3985925 3990565 3992204 3990716 3985682 3976998 3964991 3949746 3930715 3907316 3879673
60837 3879673 3848620 3815206 3780380 3744873 3709090 3673284 3638005 3604169 3572461 3542900 3515281
60826 3515281 3489779 3466686 3445644 3425668 3406057 3386908 3368540 3350787 3333137 3315293 3297232
$$ packed form
60911C505193j4457j4015j2799j1557j0381r024p691o776o164n536n193n653o442
60898C389505o168m149j245J402L759O368Q987J0685J1244J1565J2447J3600J4312
60885C472312J4623J5319J6937J9243K1639K3716K5330K6465K7157K7388K6980
60874C717109K5712K3492K0289J6070J1106O292K612K54j336k340k168m24K212
60861C818880M668O691Q730J0916J2829J4230J5307J6076J6204J5564J4433J2909
60849C967437J0706P782M640J639j488n034q684j2007j5245j9031k3399k7643
60837C879673l1053l3414l4826l5507l5783l5806l5279l3836l1708k9561k7619
60826C515281k5502k3093k1042j9976j9611j9149j8368j7753j7650j7844j8061
$$ plain form
60815 3297232 3278829 3259876 3240513 3221307 3202798 3185227 3168795 3153871 3140588 3128474 3116878
60804 3116878 3105819 3096029 3088021 3081356 3075047 3068553 3062176 3056577 3052117 3048632 3045579 3042235 3037888 3032032
60790 3032032 3024550 3015664 3005693 2994828 2983227 2971248 2959452 2948182 2937225 2926063 2914517 2903033
60778 2903033 2892335 2882981 2875284 2869506 2865874 2864483 2865247 2867925 2872144 2877524 2883981 2891916 2901972 2914545
60764 2914545 2929476 2946116 2963602 2981158 2998336 3015021 3031095 3046008 3058679 3067905 3072967 3073973
60752 3073973 3071676 3066966 3060439 3052405 3043228 3033523 3023941 3014781 3005850 2996724 2987197 2977460 2967833 2958402
60738 2958402 2949075 2939997 2931695 2924614 2918696 2913636 2909365 2905918 2903009 2900261 2898015 2897303 2898728 2901664
60724 2901664 2904980 2908299 2912214 2917476 2924444 2933265 2944092 2956947 2971614 2987767 3005011 3022818
$$ packed form
60815C297232j8403j8953j9363j9206j8509j7571j6432j4924j3283j2114j1596
60804C116878j1059r790q008o665o309o494o377n599m460l485l053l344m347n856
60790C032032p482q886r971j0865j1601j1979j1796j1270j0957j1162j1546j1484
60778B903033j0698r354p697n778l632j391P64K678M219N380O457P935J0056J2573
60764B914545J4931J6640J7486J7556J7178J6685J6074J4913J2671R226N062J006
60752C073973k297m710o527q034r177r705r582r160q931r126r527r737r627r431
60738B958402r327r078q302p081n918n060m271l447k909k748k246p12J425K936
60724B901664L316L319L915N262O968Q821J0827J2855J4667J6153J7244J7807
$$ plain form
60712 3022818 3040720 3058700 3077210 3096642 3116842 3137248 3157353 3176970 3196162 3215074 3233812
60701 3233812 3252405 3270900 3289632 3309455 3331589 3357081 3386308 3419065 3455076 3494161 3535748
60690 3535748 3578427 3620360 3660076 3696532 3728421 3753858 3771023 3778965 3777881 3769126 3755136 3738749
60678 3738749 3721997 3705664 3690160 3676308 3664778 3655123 3646169 3637195 3628086 3618359 3606931 3593251
60666 3593251 3578216 3563608 3550883 3540681 3533142 3528335 3526425 3527584 3531743 3538554 3547834 3559951 3575418
60653 3575418 3594182 3615714 3639736 3666372 3695633 3727441 3762315 3801264 3844621 3891597 3941423
60642 3941423 3994202 4049931 4107218 4163811 4218039 4268676 4313467 4348839 4371553 4380139 4374696 4356220
60630 4356220 4326702 4289256 4247279 4203454 4159758 4117955 4079329 4043883 4010430 3977818 3945908
$$ packed form
60712C022818J7902J7980J8510J9432K0200K0406K0105J9617J9192J8912J8738
60701C233812J8593J8495J8732J9823K2134K5492K9227L2757L6011L9085M1587
60690C535748M2679M1933L9716L6456L1889K5437J7165P942j084q755j3990j6387
60678C738749j6752j6333j5504j3852j1530r655q954q974r109r727j1428j3680
60666C593251j5035j4608j2725j0202p539m807j910J159M159O811R280J2117J5467
60653C575418J8764K1532K4022K6636K9261L1808L4874L8949M3357M6976M9826
60642C941423N2779N5729N7287N6593N4228N0637M4791L5372K2714Q586n443j8476
60630D356220k9518l7446m1977m3825m3696m1803l8626l5446l3453l2612l1910
$$ plain form
60619 3945908 3915202 3885688 3856304 3825546 3792507 3757261 3720272 3681576 3640716 3597464 3552340
60608 3552340 3506278 3460044 3414337 3370338 3329657 3293359 3261250 3232471 3206786 3185002 3168082
60597 3168082 3156062 3147979 3142571 3138822 3136027 3133831 3132369 3132160 3133695 3137172 3142674 3150420 3160655 3173366
60583 3173366 3188272 3205099 3223733 3244030 3265509 3287281 3308417 3328487 3347739 3366615 3385042
60572 3385042 3402326 3417821 3431565 3444208 3456425 3468466 3480159 3491191 3501496 3511417 3521366 3531194
60560 3531194 3540010 3546715 3550574 3551218 3548422 3542254 3533265 3522194 3509537 3495755 3481820 3469066 3458385
60547 3458385 3449909 3443656 3440138 3440135 3444152 3452363 3464874 3481689 3502541 3527032 3554897 3585916 3619646
60534 3619646 3655459 3692732 3730643 3767681 3801661 3830416 3852401 3866595 3872092 3868240 3855399 3835490
$$ packed form
60619C945908l0706k9514k9384l0758l3039l5246l6989l8696m0860m3252m5124
60608C552340m6062m6234m5707m3999m0681l6298l2109k8779k5685k1784j6920
60597C168082j2020q083n408l749k795k196j462k09J535L477N502P746J0235J2711
60583C173366J4906J6827J8634K0297K1479K1772K1136K0070J9252J8876J8427
60572C385042J7284J5495J3744J2643J2217J2041J1693J1032J0305R921R949R828
60560C531194Q816O705L859O44k796o168q989j1071j2657j3782j3935j2754j0681
60547C458385q476o253l518lM017Q211J2511J6815K0852K4491K7865L1019L3730
60534C619646L5813L7273L7911L7038L3980K8755K1985J4194N497l852j2841j9909
$$ plain form
60522 3835490 3811545 3786458 3762035 3739191 3718864 3702438 3691126 3685224 3684182 3687409 3694741 3706127
60510 3706127 3721112 3738767 3758050 3778148 3798534 3818900 3839106 3859184 3879296 3899718 3920965
60499 3920965 3943991 3970060 4000148 4034422 4072491 4114102 4159243 4207456 4257466 4307857 4357835
60488 4357835 4406825 4453408 4495216 4530045 4556744 4574850 4583725 4582393 4570114 4546949 4513877 4472468
60476 4472468 4424279 4370400 4311600 4248962 4184122 4118827 4054471 3992216 3933252 3878570 3828634
60465 3828634 3783592 3743763 3709568 3680997 3657510 3638588 3624088 3613862 3607338 3603750 3602688 3604178
60453 3604178 3608310 3615052 3624419 3636470 3650983 3667373 3685166 3704366 3725050 3746633 3767956 3788214
60441 3788214 3807447 3825927 3843433 3859566 3874492 3888814 3902722 3915817 3927872 3939234 3950196
$$ packed form
60522C835490k3945k5087k4423k2844k0327j6426j1312n902j042L227P332J1386
60510C706127J4985J7655J9283K0098K0386K0366K0206K0078K0112K0422K1247
60499C920965K3026K6069L0088L4274L8069M1611M5141M8213N0010N0391M9978
60488D357835M8990M6583M1808L4829K6699J8106Q875j332j2279k3165l3072m1409
60476D472468m8189n3879n8800o2638o4840o5295o4356o2255n8964n4682m9936
60465C828634m5042l9829l4195k8571k3487j8922j4500j0226o524l588j062J490
60453C604178M132O742R367J2051J4513J6390J7793J9200K0684K1583K1323K0258
60441C788214J9233J8480J7506J6133J4926J4322J3908J3095J2055J1362J0962
$$ plain form
60430 3950196 3960362 3968902 3975065 3978135 3977311 3972251 3963701 3953150 3941868 3930560 3919802 3910355 3902979
60417 3902979 3898275 3896828 3899176 3905502 3915553 3929064 3946190 3967510 3993824 4025986 4064874 4111393
60405 4111393 4166413 4230560 4303956 4386346 4477584 4577726 4686359 4802058 4922817 5046752
60395 5046752 5171779 5294694 5411186 5517007 5608756 5683530 5738561 5771956 5783830 5776530 5753832
60384 5753832 5719950 5678907 5634306 5589305 5546555 5507888 5474080 5445112 5420589 5399666 5380828
60373 5380828 5362463 5343902 5325482 5307507 5289802 5272658 5257576 5246299 5239296 5235640 5234108 5233665
60361 5233665 5232889 5229615 5221432 5206206 5182024 5147227 5101108 5044680 4980462 4911383 4839847 4767783
60349 4767783 4697226 4630303 4568274 4510796 4456568 4404795 4355711 4309715 4266588 4225813 4187105
$$ packed form
60430C950196J0166Q540O163L070q24n060q550j0551j1282j1308j0758r447p376
60417C902979m704j447K348O326J0051J3511J7126K1320K6314L2162L8888M6519
60405D111393N5020O4147P3396Q2390R1238J00142J08633J15699J20759J23935
60395E046752J25027J22915J16492J05821R1749P4774N5031L3395J1874p300k2698
60384E753832l3882m1043m4601m5001m2750l8667l3808k8968k4523k0923j8838
60373E380828j8365j8561j8420j7975j7705j7144j5082j1277p003l656j532m43
60361E233665p76l274q183j5226k4182l4797m6119n6428o4218o9079p1536p2064
60349D767783p0557o6923o2029n7478n4228n1773m9084m5996m3127m0775l8708
$$ plain form
60338 4187105 4150244 4114867 4081064 4049867 4022482 3999102 3978999 3961644 3947062 3935129 3925234
60327 3925234 3916906 3910222 3905308 3901930 3899884 3899322 3900241 3902025 3903991 3906185 3909130 3912858 3916676 3919945
60313 3919945 3922652 3925035 3927025 3928391 3929294 3930282 3931684 3933296 3934866 3936672 3939353 3943185 3947814 3952772
60299 3952772 3957958 3963417 3968946 3974164 3978857 3982840 3985482 3985671 3982417 3975424 3965179 3952716 3939394
60286 3939394 3926634 3915628 3907187 3901752 3899366 3899619 3901841 3905537 3910698 3917712 3926959 3938357 3951165
60273 3951165 3964263 3976792 3988548 3999742 4010430 4020305 4028937 4036047 4041578 4045733 4049005 4052046 4055403
60260 4055403 4059396 4064242 4070248 4077849 4087395 4098717 4110939 4123053 4134904 4147379 4161353 4176646
60248 4176646 4192364 4208111 4224398 4241849 4260416 4279472 4298333 4316584 4334300 4352245 4371620
$$ packed form
60338D187105l6861l5377l3803l1197k7385k3380k0103j7355j4582j1933r895
60327C925234q328o684m914l378k046n62R19J784J966K194K945L728L818L269
60313C919945K707K383J990J366R03R88J402J612J570J806K681L832M629M958
60299C952772N186N459N529N218M693L983K642J89l254o993j0245j2463j3322
60286C939394j2760j1006q441n435k386K53K222L696N161P014R247J1398J2808
60273C951165J3098J2529J1756J1194J0688R875Q632P110N531M155L272L041L357
60260D055403L993M846O006P601R546J1322J2222J2114J1851J2475J3974J5293
60248D176646J5718J5747J6287J7451J8567J9056J8861J8251J7716J7945J9375
$$ plain form
60237 4371620 4393357 4417729 4444725 4474573 4507682 4544246 4584223 4627663 4674858 4726101 4781393
60226 4781393 4840426 4902871 4968760 5038616 5113095 5192424 5276303 5364392 5456736 5553510 5654550
60215 5654550 5759443 5868155 5981270 6099354 6222194 6348958 6479126 6612999 6751093
60206 6751093 6893149 7037841 7183062 7325995 7462992 7590067 7704124 7803740 7888802 7959592
60196 7959592 8016385 8059590 8089983 8108825 8117741 8118105 8110429 8094714 8071648 8043005 8010481 7974618
60184 7974618 7935448 7893899 7851851 7810925 7771869 7735005 7700495 7667997 7636714 7605939 7574918
60173 7574918 7541889 7503895 7457965 7402068 7334681 7254117 7159188 7050549 6931010 6804540 6675063
60162 6675063 6545790 6419033 6296440 6179517 6069881 5969007 5877970 5797672 5729008 5672447
$$ packed form
60237D371620K1737K4372K6996K9848L3109L6564L9977M3440M7195N1243N5292
60226D781393N9033O2445O5889O9856P4479P9329Q3879Q8089R2344R6774J01040
60215E654550J04893J08712J13115J18084J22840J26764J30168J33873J38094
60206F751093J42056J44692J45221J42933J36997J27075J14057R9616Q5062P0790
60196G959592N6793M3205L0393J8842Q916L64p676j5715k3066k8643l2524l5863
60184G974618l9170m1549m2048m0926l9056l6864l4510l2498l1283l0775l1021
60173G574918l3029l7994m5930n5897o7387q0564r4929j08639j19539j26470j29477
60162F675063j29273j26757j22593j16923j09636j00874r1037q0298o8664n6561
$$ plain form
60152 5672447 5627478 5592841 5567304 5550037 5540275 5536833 5538010 5541872 5546597 5550666 5552752 5551518 5545784
60139 5545784 5535053 5519777 5500909 5479158 5454720 5427546 5397666 5365144 5329772 5290923 5247945
60128 5247945 5200790 5150183 5097014 5041798 4985038 4928008 4872744 4821194 4774638 4733887 4699462
60117 4699462 4671311 4648832 4631560 4619684 4613551 4612848 4616606 4623988 4634864 4649702 4669041 4692957
60105 4692957 4720767 4751158 4782654 4813922 4843659 4870433 4892851 4909858 4920782 4925108 4922280 4911803
60093 4911803 4893701 4868945 4839251 4806269 4771087 4734616 4698055 4662419 4627901 4594320 4562091
60082 4562091 4531982 4503913 4476861 4450234 4424523 4400084 4376079 4351329 4325733 4300195 4275624
60071 4275624 4252744 4232520 4215917 4203307 4194760 4190731 4191813 4197929 4208499 4223372 4242820 4266506
$$ packed form
60152E672447m4969l4637k5537j7267r762l442J177L862M725M069K086j234n734
60139E545784j0731j5276j8868k1751k4438k7174k9880l2522l5372l8849m2978
60128E247945m7155n0607n3169n5216n6760n7030n5264n1550m6556m0751l4425
60117D699462k8151k2479j7272j1876o133p03L758P382J0876J4838J9339K3916
60105D692957K7810L0391L1496L1268K9737K6774K2418J7007J0924M326k828j0477
60093D911803j8102k4756k9694l2982l5182l6471l6561l5636l4518l3581l2229
60082D562091l0109k8069k7052k6627k5711k4439k4005k4750k5596k5538k4571
60071D275624k2880k0224j6603j2610q547m029J082O116J0570J4873J9448K3686
$$ plain form
60059 4266506 4293268 4322151 4353036 4385907 4420180 4455178 4490782 4526973 4562938 4597105 4628001
60048 4628001 4654668 4676350 4692201 4701538 4704246 4700812 4691999 4678545 4661201 4641004 4619361 4597644
60036 4597644 4576719 4557013 4539035 4523629 4511579 4503116 4497940 4495696 4496252 4499447 4504569 4510157 4514420
60023 4514420 4515848 4513383 4506146 4493458 4475470 4453682 4430461 4407807 4386542 4366558 4347644 4330039
60011 4330039 4314361 4301126 4290388 4281840 4275262 4270708 4268182 4267226 4267068 4267209 4267763 4269093 4271197 4273535
59997 4273535 4275509 4276991 4278337 4279932 4281943 4284534 4288117 4293204 4300127 4309033 4320050 4333362 4349311
59984 4349311 4368645 4392367 4421107 4454842 4493544 4537781 4588176 4644496 4705809 4771276 4840105
59973 4840105 4910905 4981933 5051930 5119695 5182677 5237005 5279436 5308527 5323642 5324057 5309971 5283557
$$ packed form
60059D266506K6762K8883L0885L2871L4273L4998L5604L6191L5965L4167L0896
60048D628001K6667K1682J5851R337K708l434q813j3454j7344k0197k1643k1717
60036D597644k0925j9706j7978j5406j2050q463n176k244N56L195N122N588M263
60023D514420J428k465p237j2688j7988k1788k3221k2654k1265j9984j8914j7605
60011D330039j5678j3235j0738q548o578m554k526r56j58J41N54J330K104K338
59997D273535J974J482J346J595K011K591L583N087O923Q906J1017J3312J5949
59984D349311J9334K3722K8740L3735L8702M4237N0395N6320O1313O5467O8829
59973D840105P0800P1028O9997O7765O2982N4328M2431K9091J5115M15j4086k6414
$$ plain form
59961 5283557 5247884 5205215 5157213 5106290 5055564 5007535 4963583 4924710 4892023 4866584 4849534
59950 4849534 4842302 4846063 4861080 4887167 4924568 4973658 5033937 5104161 5183405 5271279 5367081 5469508
59938 5469508 5577169 5688626 5801899 5914518 6023997 6127490 6221248 6301506 6365950 6413413
59928 6413413 6442299 6450817 6439224 6410566 6368520 6315586 6254086 6187594 6120027 6053907 5990583
59917 5990583 5931556 5878277 5830866 5788306 5749994 5716117 5686229 5658447 5630669 5602257 5574198
59906 5574198 5547949 5524407 5503902 5486854 5474157 5466688 5464498 5466965 5474035 5486980 5507509 5536357
59894 5536357 5572992 5616356 5665230 5718008 5772837 5828245 5883383 5937568 5989915 6039506 6085652
59883 6085652 6127859 6165711 6198937 6227623 6252521 6275288 6298272 6323751 6353302 6387807 6427500
$$ packed form
59961E283557l5673m2669m8002n0923n0726m8029m3952l8873l2687k5439j7050
59950D849534p232L761J5017K6087L7401M9090O0279P0224P9244Q7874R5802J02427
59938E469508J07661J11457J13273J12619J09479J03493R3758Q0258O4444M7463
59928F413413K8886Q518j1593k8658m2046n2934o1500o6492o7567o6120o3324
59917E990583n9027n3279m7411m2560l8312l3877k9888k7782k7778k8412k8059
59906E574198k6249k3542k0505j7048j2697p469k190K467P070J2945K0529K8848
59894E536357L6635M3364M8874N2778N4829N5408N5138N4185N2347M9591M6146
59883F085652M2207L7852L3226K8686K4898K2767K2984K5479K9551L4505L9693
$$ plain form
59872 6427500 6471377 6516497 6558246 6591372 6610745 6611616 6590401 6546208 6481809 6402981 6316690 6229404
59860 6229404 6146163 6070302 6003732 5947593 5902882 5870585 5851370 5845303 5851924 5870676 5901390 5944459
59848 5944459 6000583 6070401 6154386 6252857 6365691 6491875 6629633 6777305 6934061 7099563
59838 7099563 7273214 7454192 7642211 7837571 8039960 8247381 8456454 8663260 8863132
59829 8863132 9049716 9215118 9351661 9453658 9518034 9544334 9534824 9494156 9428289 9343538 9246437
59818 9246437 9143452 9039597 8937013 8835224 8732699 8627948 8519708 8407313 8291525
59809 8291525 8174641 8059279 7946898 7837338 7729480 7622225 7515041 7407804 7300370
59800 7300370 7192737 7085839 6981738 6882489 6788981 6701272 6619850 6545963 6480755 6424657 6377707
$$ packed form
59872F427500M3877M5120M1749L3126J9373Q71k1215m4193o4399p8828q6291q7286
59860F229404q3241p5861o6570n6139m4711l2297j9215o067O621J8752L0714M3069
59848E944459N6124O9818Q3985R8471J12834J26184J37758J47672J56756J65502
59838G099563J73651J80978J88019J95360K02389K07421K09073K06806J99872
59829H863132J86584J65402J36543J01997O4376K6300r510m0668o5867q4751r7101
59818I246437j02985j03855j02584j01789j02525j04751j08240j12395j15788
59809H291525j16884j15362j12381j09560j07858j07255j07184j07237j07434
59800G300370j07633j06898j04101r9249r3508q7709q1422p3887o5208n6098m6950
$$ plain form
59789 6377707 6340082 6312350 6295751 6292216 6303519 6330303 6372309 6429411 6501587 6587709 6685064
59778 6685064 6790374 6900693 7013086 7124207 7230785 7330186 7420281 7499408 7566984 7623588
59768 7623588 7669752 7704859 7727605 7737121 7733164 7715688 7685065 7642849 7592039 7536862 7482622 7435237
59756 7435237 7399821 7379222 7374012 7383670 7407314 7443336 7488897 7540017 7592021 7639989 7679224 7705602
59744 7705602 7715557 7706021 7674742 7620806 7544766 7448326 7334015 7204951 7064510 6915910 6762001
59733 6762001 6605329 6448368 6293632 6143376 5998917 5860375 5727494 5600700 5480970
59724 5480970 5368760 5263744 5165873 5075984 4994881 4922328 4857577 4800504 4751573 4710851 4677724
59713 4677724 4651606 4632387 4620174 4615009 4616975 4626212 4642678 4666093 4696170 4732777 4775874 4825354
$$ packed form
59789F377707l7625k7732j6599l535J1303K6784M2006N7102P2176Q6122R7355
59778F685064J05310J10319J12393J11121J06578R9401R0095P9127O7576N6604
59768G623588M6164L5107K2746R516l957j7476l0623m2216n0810n5177n4240m7385
59756G435237l5416k0599n210R658K3644L6022M5561N1120N2004M7968L9235K6378
59744G705602R955r536l1279n3936p6040r6440j14311j29064j40441j48600j53909
59733F762001j56672j56961j54736j50256j44459j38542j32881j26794j19730
59724E480970j12210j05016r7871q9889q1103p2553o4751n7073m8931m0722l3127
59713D677724k6118j9219j2213n165J966R237J6466K3415L0077L6607M3097M9480
$$ plain form
59701 4825354 4880799 4941312 5005781 5073545 5144595 5218938 5295986 5374810 5454707 5535231 5615977
59690 5615977 5696739 5777630 5858523 5938346 6015273 6087590 6154105 6213985 6266697 6312282 6351393
59679 6351393 6384993 6414069 6439438 6461450 6479825 6493884 6502845 6505856 6502205 6491934 6476047 6455723
59667 6455723 6431560 6404026 6374383 6344345 6314723 6284921 6254036 6222049 6189735 6157725 6125919
59656 6125919 6093724 6060717 6027243 5994439 5963638 5935733 5911149 5890146 5872731 5858240 5845332
59645 5845332 5832628 5819262 5804812 5788790 5770296 5748201 5721709 5690677 5655194 5614900 5569075
59634 5569075 5517599 5461604 5403059 5343994 5286269 5231666 5181758 5137801 5100913 5072015 5051301
59623 5051301 5038114 5031640 5031367 5036414 5044849 5054369 5063506 5071655 5078268 5082735 5084939 5085072 5082840 5077651
$$ packed form
59701D825354N5445O0513O4469O7764P1050P4343P7048P8824P9897Q0524Q0746
59690E615977Q0762Q0891Q0893P9823P6927P2317O6515N9880N2712M5585L9111
59679F351393L3600K9076K5369K2012J8375J4059Q961L011l651j0271j5887k0324
59667F455723k4163k7534k9643l0038k9622k9802l0885l1987l2314l2010l1806
59656F125919l2195l3007l3474l2804l0801k7905k4584k1003j7415j4491j2908
59645E845332j2704j3366j4450j6022j8494k2095k6492l1032l5483m0294m5825
59634E569075n1476n5995n8545n9065n7725n4603m9908m3957l6888k8898k0714
59623E051301j3187o474k73N047Q435R520R137Q149O613M467K204J33k232n189
$$ plain form
59609 5077651 5069853 5061074 5052834 5045195 5037140 5027991 5018129 5008548 5000057 4992897 4986945 4982248 4979199 4978028
59595 4978028 4978196 4978556 4978107 4976378 4973239 4968773 4963367 4957563 4951669 4945773 4940123 4935211 4931410 4928738 4926973
59580 4926973 4925665 4924035 4921179 4916483 4909673 4900490 4888706 4874549 4858865 4842807 4827580 4814384
59568 4814384 4804252 4797855 4795730 4798626 4807199 4821309 4840040 4862593 4888759 4918348 4950503 4983866
59556 4983866 5017176 5049395 5079509 5106634 5130379 5150840 5168134 5182049 5192268 5198915 5202806 5205149
59544 5205149 5207141 5209871 5214272 5220707 5228567 5236747 5244607 5251936 5257740 5259574 5254598 5241100 5218873
59531 5218873 5188748 5152438 5112312 5070297 5026788 4981132 4933145 4883637 4833622 4783742 4734607
59520 4734607 4687088 4642039 4600079 4561763 4527617 4497986 4473179 4453689 4439788 4430894 4425857 4423858
$$ packed form
59609E077651p798q779q240p639q055r149r862r581q491p160n952m697l049j171
59595D978028J68L60m49j729l139m466n406n804n894n896n650m912l801k672j765
59580D926973j308j630k856m696o810r183j1784j4157j5684j6058j5227j3196
59568D814384j0132o397k125K896Q573J4110J8731K2553K6166K9589L2155L3363
59556D983866L3310L2219L0114K7125K3745K0461J7294J3915J0219O647L891K343
59544E205149J992K730M401O435P860Q180P860P329N804J834m976j3498k2227
59531E218873l0125l6310m0126m2015m3509m5656m7987m9508n0015m9880m9135
59520D734607m7519m5049m1960l8316l4146k9631k4807j9490j3901q894n037j999
$$ plain form
59508 4423858 4424588 4427594 4432046 4437266 4442952 4448787 4454428 4459971 4465871 4472139 4478175 4483624 4488911 4494685
59494 4494685 4501206 4508605 4517318 4527979 4541255 4558077 4579660 4606871 4639694 4677493 4719568 4765410
59482 4765410 4814752 4867572 4923755 4982626 5043064 5104129 5165240 5225715 5284537 5340710 5393559
59471 5393559 5442808 5488927 5533303 5577189 5620028 5659402 5692937 5719763 5739889 5753012 5758643
59460 5758643 5756878 5748299 5733482 5713356 5689909 5665743 5642757 5621650 5602689 5586415 5573289 5562868
59448 5562868 5553510 5542895 5528849 5509906 5485377 5455286 5420542 5383049 5345221 5309150 5276227
59437 5276227 5247301 5222740 5202315 5185507 5172160 5162653 5157406 5156502 5159777 5166898 5177271 5190115
59425 5190115 5204612 5219812 5234779 5249478 5265265 5283684 5304877 5328063 5353547 5383173 5418511
$$ packed form
59508D423858P30L006M452N220N686N835N641N543N900O268O036N449N287N774
59494D494685O521P399Q713J0661J3276J6822K1583K7211L2823L7799M2075M5842
59482D765410M9342N2820N6183N8871O0438O1065O1111O0475N8822N6173N2849
59471E393559M9249M6119M4376M3886M2839L9374L3535K6826K0126J3123N631
59460E758643j765q579j4817k0126k3447k4166k2986k1107j8961j6274j3126j0421
59448E562868r358j0615j4046j8943k4529l0091l4744l7493l7828l6071l2923
59437E276227k8926k4561k0425j6808j3347r507n247r04L275P121J0373J2844
59425E190115J4497J5200J4967J4699J5787J8419K1193K3186K5484K9626L5338
$$ plain form
59414 5418511 5459678 5506038 5556254 5606367 5649144 5677503 5689295 5688524 5682649 5679517 5685854 5706317
59402 5706317 5742857 5795322 5862589 5942163 6028488 6112988 6187287 6247178 6294083 6333399 6371499
59391 6371499 6413223 6460738 6513781 6570548 6628481 6684892 6737642 6785496 6827654 6862945 6889818
59380 6889818 6907216 6915289 6915187 6908221 6895021 6875176 6847579 6811317 6766430 6714026 6655953 6594470
59368 6594470 6531977 6470678 6412346 6358237 6308926 6264131 6223036 6184976 6149629 6116515 6084835
59357 6084835 6054178 6025001 5997882 5972407 5947151 5920715 5892520 5862772 5832000 5800495 5767986
59346 5767986 5734014 5698847 5663756 5629984 5597720 5566561 5536898 5510256 5488193 5471230 5458943
59335 5458943 5450708 5446139 5445002 5446929 5451274 5457299 5464571 5473100 5482868 5493225 5502684 5509245 5510966 5506652
$$ packed form
59414E418511M1167M6360N0216N0113M2777K8359J1792p71n875l132O337K0463
59402E706317L6540N2465O7267P9574Q6325Q4500P4299N9891M6905L9316L8100
59391F371499M1724M7515N3043N6767N7933N6411N2750M7854M2158L5291K6873
59380F889818J7398Q073j02o966j3200j9845k7597l6262m4887n2404n8073o1483
59368F594470o2493o1299n8332n4109m9311m4795m1095l8060l5347l3114l1680
59357F084835l0657k9177k7119k5475k5256k6436k8195k9748l0772l1505l2509
59346E767986l3972l5167l5091l3772l2264l1159k9663k6642k2063j6963j2287
59335E458943q235m569j137J927M345O025P272Q529R768J0357R459O561J721m314
$$ plain form
59321 5506652 5496376 5481384 5463443 5444402 5426352 5411720 5402752 5400868 5406672 5420390 5442177 5472199
59309 5472199 5510794 5558493 5615710 5682411 5758227 5842805 5935834 6036652 6143808 6255003 6367513
59298 6367513 6478659 6585697 6685281 6773644 6847937 6907252 6951945 6982461 6999764 7006839 7008559
59287 7008559 7009541 7012606 7019362 7031252 7049494 7074781 7107640 7148342 7195660 7246091 7294889 7337472
59275 7337472 7369584 7387087 7386771 7367266 7328564 7271020 7195421 7103640 6998439 6882877 6760464
59264 6760464 6635308 6511125 6390157 6273695 6163285 6060574 5966167 5879607 5800480 5728799
59254 5728799 5664432 5607034 5556625 5513384 5476692 5445082 5417355 5393135 5372126 5353410 5335708
59243 5335708 5317857 5298888 5278071 5255087 5229831 5202038 5171549 5139003 5105765 5073015 5041232
$$ packed form
59321E506652j0276j4992j7941j9041j8050j4632q968j884N804J3718K1787L0022
59309E472199L8595M7699N7217O6701P5816Q4578R3029J00818J07156J11195J12510
59298F367513J11146J07038R9584Q8363P4293N9315M4693L0516J7303P075J720
59287G008559R82L065O756J1890J8242K5287L2859M0702M7318N0431M8798M2583
59275G337472L2112J7503l16j9505l8702n7544p5599r1781j05201j15562j22413
59264F760464j25156j24183j20968j16462j10410j02711r4407q6560p9127p1681
59254E728799o4367n7398n0409m3241l6692l1610k7727k4220k1009j8716j7702
59243E335708j7851j8969k0817k2984k5256k7793l0489l2546l3238l2750l1783
$$ plain form
59232 5041232 5010623 4981683 4955223 4932210 4913693 4900547 4893108 4891159 4894208 4901665 4913022 4928161
59220 4928161 4947367 4970765 4998032 5028866 5063325 5101308 5142203 5185745 5232751 5284105 5339165
59209 5339165 5396025 5453336 5511079 5569567 5628540 5687513 5746261 5804626 5862347 5919338 5975738
59198 5975738 6031493 6086165 6139020 6188719 6232853 6268442 6293264 6306558 6308574 6299970 6281749 6255314
59186 6255314 6222361 6185016 6146026 6108523 6075479 6049487 6032584 6025756 6028877 6041729 6064856 6098890
59174 6098890 6143339 6196736 6257603 6324395 6394830 6466436 6537811 6608125 6675127 6734718 6782932
59163 6782932 6817544 6837630 6842923 6834615 6816137 6792208 6767191 6744508 6726855 6716199 6713772 6720405
59151 6720405 6736523 6761488 6793518 6830838 6872799 6919711 6972085 7030531 7096155 7170632 7255997
$$ packed form
59232E041232l0609k8940k6460k3013j8517j3146p439j949L049P457J1357J5139
59220D928161J9206K3398K7267L0834L4459L7983M0895M3542M7006N1354N5060
59209E339165N6860N7311N7743N8488N8973N8973N8748N8365N7721N6991N6400
59198E975738N5755N4672N2855M9699M4134L5589K4822J3294K016q604j8221k6435
59186F255314l2953l7345l8990l7503l3044k5992j6903o828L121J2852K3127L4034
59174F098890M4449N3397O0867O6792P0435P1606P1375P0314O7002N9591M8214
59163F782932L4612K0086N293q308j8478k3929k5017k2683j7653j0656k427O633
59151F720405J6118K4965L2030L7320M1961M6912N2374N8446O5624P4477Q5365
$$ plain form
59140 7255997 7354460 7468038 7597918 7743903 7904141 8074900 8250745 8425579 8593844 8750691
59130 8750691 8891539 9012446 9110909 9185412 9234033 9254452 9245715 9209252 9147819 9064307 8962000
59119 8962000 8844973 8717115 8580920 8437791 8289187 8137108 7983968 7832790 7687271
59110 7687271 7550940 7426034 7313279 7212449 7122885 7043730 6974088 6912925 6858819 6810048
59100 6810048 6764960 6721911 6679027 6634785 6589135 6543475 6499217 6456852 6416523 6378777 6344257
59089 6344257 6313153 6285416 6261187 6240779 6224666 6213675 6208629 6209549 6215789 6227082 6243616 6264705
59077 6264705 6288216 6311876 6334418 6354957 6372149 6384849 6392960 6396830 6396336 6391381 6382765 6371718
59065 6371718 6359035 6345533 6332860 6322743 6315633 6310912 6307959 6305822 6301957 6292662 6275139 6248376
$$ packed form
59140G255997R8463J13578J29880J45985J60238J70759J75845J74834J68265J56847
59130H750691J40848J20907R8463P4503M8621K0419q737l6463o1433q3512j02307
59119H962000j17027j27858j36195j43129j48604j52079j53140j51178j45519
59110G687271j36331j24906j12755j00830q9564p9155o9642o1163n4106m8771
59100F810048m5088m3049m2884m4242m5650m5660m4258m2365m0329l7746l4520
59089F344257l1104k7737k4229k0408j6113j0991n046R20O240J1293J6534K1089
59077F264705K3511K3660K2542K0539J7192J2700Q111L870m94m955q616j1047
59065F371718j2683j3502j2673j0117p110m721k953k137l865r295j7523k6763
$$ plain form
59053 6248376 6211948 6165088 6107540 6040649 5967061 5889686 5811121 5733412 5657734 5584486 5513931
59042 5513931 5446610 5383041 5323435 5267915 5216753 5170167 5128199 5090971 5058802 5031770 5009326
59031 5009326 4990703 4975627 4964410 4957285 4953887 4953507 4955697 4960437 4967775 4977547 4989540 5003701 5020034
59018 5020034 5038522 5059373 5083071 5109858 5139306 5170779 5204177 5239856 5277988 5318548 5361957
59007 5361957 5409192 5461244 5518918 5583125 5654762 5734250 5821771 5918051 6024351 6141573 6269970
58996 6269970 6409660 6560536 6721373 6889905 7064165 7242913 7424155 7603832 7776488
58987 7776488 7936657 8079184 8199157 8292577 8357103 8391941 8397653 8376414 8331538 8265769 8180405
58976 8180405 8076620 7956963 7824841 7683208 7534860 7383604 7234123 7090832 6957488
$$ packed form
59053F248376l6428m6860n7548o6891p3588p7375p8565p7709p5678p3248p0555
59042E513931o7321o3569n9606n5520n1162m6586m1968l7228l2169k7032k2444
59031E009326j8623j5076j1217p125l398l80K190M740P338R772J1993J4161J6333
59018E020034J8488K0851K3698K6787K9448L1473L3398L5679L8132M0560M3409
59007E361957M7235N2052N7674O4207P1637P9488Q7521R6280J06300J17222J28397
58996F269970J39690J50876J60837J68532J74260J78748J81242J79677J72656
58987G776488J60169J42527J19973R3420O4526L4838N712k1239m4876o5769q5364
58976H180405j03785j19657j32122j41633j48348j51256j49481j43291j33344
$$ plain form
58967 6957488 6837260 6731861 6640621 6561316 6491815 6430012 6372469 6314634 6253052 6186640 6115587
58956 6115587 6039897 5959452 5874779 5787162 5698444 5611201 5528695 5453965 5388852 5334027 5289857
58945 5289857 5257041 5236503 5228754 5233420 5249346 5275071 5309014 5349293 5393857 5441032 5489732 5539036
58933 5539036 5588057 5636521 5685005 5734127 5783797 5833661 5883814 5934409 5984578 6032188 6074492
58922 6074492 6108734 6132570 6144731 6145541 6136594 6120128 6098861 6075890 6053991 6034943 6019856 6009978
58910 6009978 6006809 6011677 6025672 6049882 6085306 6132696 6192672 6265591 6350787 6446202 6549293
58899 6549293 6658127 6771297 6887174 7003792 7119077 7230423 7334086 7425506 7500296 7554882
58889 7554882 7586798 7595118 7580554 7544848 7490397 7420579 7339549 7250902 7156922 7059710 6962380
$$ packed form
58967F957488j20228j05399r1240p9305o9501o1803n7543n7835o1582o6412p1053
58956F115587p5690q0445q4673q7617q8718q7243q2506p4730o5113n4825m4170
58945E289857l2816k0538p749M666J5926K5725L3943M0279M4564M7175M8700M9304
58933E539036M9021M8464M8484M9122M9670M9864N0153N0595N0169M7610M2304
58922F074492L4242K3836J2161Q10q947j6466k1267k2971k1899j9048j5087r878
58910F009978l169M868J3995K4210L5424M7390N9976P2919Q5196R5415J03091
58899F549293J08834J13170J15877J16618J15285J11346J03663R1420P4790N4586
58889G554882L1916Q320j4564l5706n4451o9818q1030q8647r3980r7212r7330
$$ plain form
58878 6962380 6868195 6779018 6695632 6619173 6551038 6491427 6439032 6392166 6349232 6308026 6265640
58867 6265640 6219542 6168247 6110867 6046681 5975372 5897218 5813014 5724176 5632712 5540421 5448100
58856 5448100 5356029 5265013 5176343 5090949 5009292 4931840 4858879 4790078 4725106 4664522 4609174
58845 4609174 4558851 4512508 4469840 4431550 4398004 4368586 4342562 4319667 4299572 4281745 4266156
58834 4266156 4253369 4243637 4236637 4232311 4231171 4233452 4238717 4246639 4257535 4271836 4289651 4311063 4336151
58821 4336151 4364334 4394240 4424358 4453207 4478760 4498596 4511066 4515786 4512800 4502118 4484583 4462565
58809 4462565 4439175 4416955 4397391 4381106 4368220 4358920 4353976 4354391 4360605 4372491 4390044 4413292
58797 4413292 4441477 4473159 4507387 4544068 4582918 4622709 4661797 4698785 4732582 4762606 4789296
$$ packed form
58878F962380r4185q9177q3386p6459o8135n9611n2395m6866m2934m1206m2386
58867F265640m6098n1295n7380o4186p1309p8154q4204q8838r1464r2291r2321
58856E448100r2071r1016q8670q5394q1657p7452p2961o8801o4972o0584n5348
58845D609174n0323m6343m2668l8290l3546k9418k6024k2895k0095j7827j5589
58834D266156j2787r732p000m326j140K281N265P922J0896J4301J7815K1412K5088
58821D336151K8183K9906L0118K8849K5553J9836J2470M720k986j0682j7535k2018
58809D462565k3390k2220j9564j6285j2886r300m944M15O214J1886J7553K3248
58797D413292K8185L1682L4228L6681L8850L9791L9088L6988L3797L0024K6690
$$ plain form
58786 4789296 4813809 4836953 4859031 4880741 4903306 4927465 4953282 4981380 5013308 5049986 5090369
58775 5090369 5132216 5173561 5212946 5249035 5280788 5307573 5328532 5342380 5348425 5347302 5339891 5325846
58763 5325846 5303862 5273192 5234293 5188094 5135270 5076297 5011892 4943267 4872059 4799973 4728436
58752 4728436 4658623 4591630 4528347 4469349 4415345 4367547 4327094 4294242 4268689 4250561 4240376
58741 4240376 4238113 4243090 4254730 4272713 4296422 4325169 4359016 4398396 4442792 4490689 4540947 4593096
58729 4593096 4646046 4697584 4745379 4787209 4819796 4838853 4841375 4827191 4797756 4754531 4699272
58718 4699272 4634733 4563876 4488964 4412158 4336170 4263384 4195023 4132016 4075853 4027589 3986857
58707 3986857 3953066 3927029 3910214 3902886 3904145 3913323 3929910 3952281 3977844 4004583 4031278 4055954
$$ packed form
58786D789296K4513K3144K2078K1710K2565K4159K5817K8098L1928L6678M0383
58775E090369M1847M1345L9385L6089L1753K6785K0959J3848O045j123p411j4045
58763E325846k1984l0670l8899m6199n2824n8973o4405o8625p1208p2086p1537
58752D728436o9813o6993o3283n8998n4004m7798m0453l2852k5553j8128j0185
58741D240376k263M977J1640J7983K3709K8747L3847L9380M4396M7897N0258N2149
58729D593096N2950N1538M7795M1830L2587J9057K522j4184k9435m3225n5259
58718D699272o4539p0857p4912p6806p5988p2786o8361o3007n6163m8264m0732
58707C986857l3791k6037j6815p328J259R178J6587K2371K5563K6739K6695K4676
$$ plain form
58695 4055954 4075157 4085263 4083991 4070561 4045275 4009561 3966192 3919072 3872610 3830866 3796653
58684 3796653 3771265 3755050 3747978 3749447 3758023 3772004 3790215 3811939 3836222 3861569 3886182 3908285
58672 3908285 3926495 3940086 3948704 3951652 3947826 3936433 3917340 3890712 3857062 3817870 3775329 3730898
58660 3730898 3684767 3637100 3588953 3541356 3494483 3448633 3405305 3366191 3331492 3300206 3271672
58649 3271672 3245936 3222989 3202674 3185144 3170476 3157984 3146837 3137224 3130014 3125303 3122091 3119375
58637 3119375 3116777 3114191 3111678 3109746 3108873 3108593 3107733 3105764 3103258 3100917 3098823 3096890 3095416 3094802 3095128
58622 3095128 3096384 3098845 3102887 3108404 3114505 3119884 3123703 3126229 3128434 3130912 3133523 3136256 3139865 3145193
58608 3145193 3152174 3160025 3168183 3176671 3185776 3195840 3207186 3219854 3233525 3247965 3263295 3279582
$$ packed form
58695D055954J9203J0106j272j3430k5286l5714m3369m7120m6462m1744l4213
58684C796653k5388j6215p072J469Q576J3981J8211K1724K4283K5347K4613K2103
58672C908285J8210J3591Q618K948l826j1393j9093k6628l3650l9192m2541m4431
58660C730898m6131m7667m8147m7597m6873m5850m3328l9114l4699l1286k8534
58649C271672k5736k2947k0315j7530j4668j2492j1147r613p210m711l212k716
58637C119375k598k586k513j932q73k80q60j969k506k341k094j933j474o14L26
58622C095128J256K461M042N517O101N379L819K526K205K478K611K733L609N328
58608C145193O981P851Q158Q488R105J0064J1346J2668J3671J4440J5330J6287
$$ plain form
58596 3279582 3296651 3314743 3335010 3358760 3386299 3416879 3449493 3483393 3518186 3553902 3590733
58585 3590733 3628289 3665403 3701087 3735356 3768704 3801117 3832142 3861637 3889916 3917339 3944125
58574 3944125 3970238 3994949 4016736 4034018 4045751 4050989 4048350 4036579 4015475 3985901 3949232 3907247
58562 3907247 3862180 3816251 3771165 3728260 3688736 3653288 3621732 3593310 3567070 3541859 3516535
58551 3516535 3490527 3463639 3435049 3403201 3367199 3327684 3286011 3243353 3201071 3160979 3124384
58540 3124384 3091571 3062892 3039537 3022379 3010838 3003790 3000805 3001531 3004754 3009378 3015751 3024691 3035595
58527 3035595 3046727 3056944 3065868 3072765 3076680 3077553 3075938 3071702 3064301 3054333 3043481 3032784 3022128
58514 3022128 3011589 3002012 2993885 2986806 2980646 2976394 2975253 2977468 2982485 2989798 2999244 3010722 3023825
$$ packed form
58596C279582J7069J8092K0267K3750K7539L0580L2614L3900L4793L5716L6831
58585C590733L7556L7114L5684L4269L3348L2413L1025K9495K8279K7423K6786
58574C944125K6113K4711K1787J7282J1733N238k639j1771k1104k9574l6669m1985
58562C907247m5067m5929m5086m2905l9524l5448l1556k8422k6240k5211k5324
58551C516535k6008k6888k8590l1848l6002l9515m1673m2658m2282m0092l6595
58540C124384l2813k8679k3355j7158j1541p048k985P26L223M624O373Q940J0904
58527C035595J1132J0217Q924O897L915Q73j615m236p401r968j0852j0697j0656
58514C022128j0539r577q127p079o160m252j141K215N017P313R446J1478J3103
$$ plain form
58501 3023825 3037607 3050744 3062212 3071693 3079129 3084336 3087502 3089692 3092254 3095920 3100923 3107501 3115573
58488 3115573 3124150 3131633 3136392 3136676 3130625 3117211 3096875 3070710 3039542 3004437 2967375 2930467
58476 2930467 2894912 2861407 2830857 2803734 2779457 2757530 2738748 2724176 2713524 2705741 2700644 2698556
58464 2698556 2698769 2699841 2701187 2703026 2704873 2705431 2703797 2699437 2691099 2677215 2657587 2633523 2606264
58451 2606264 2576461 2545224 2514373 2485336 2458631 2434431 2412696 2392904 2374838 2359562 2348511
58440 2348511 2341688 2337904 2336702 2338735 2344203 2352213 2361912 2373024 2384994 2396580 2406678 2414809 2420752
58427 2420752 2424469 2426358 2426892 2426124 2424200 2421862 2419594 2416834 2413076 2409076 2405764 2402605 2398373 2392814
58413 2392814 2385944 2376488 2363062 2346612 2329669 2313409 2297329 2281632 2267626 2255670 2244875 2235159
$$ packed form
58501C023825J3782J3137J1468R481P436N207L166K190K562L666N003O578Q072
58488C115573Q577P483M759K84o051j3414k0336k6165l1168l5105l7062l6908
58476B930467l5555l3505l0550k7123k4277k1927j8782j4572j0652p783n097k088
58464B698556K13J072J346J839J847N58j634m360q338j3884j9628k4064k7259
58451B606264k9803l1237l0851k9037k6705k4200k1735j9792j8066j5276j1051
58440B348511o823l784j202K033N468Q010R699J1112J1970J1586J0098Q131N943
58427B420752L717J889N34p68j924k338k268k760l758m000l312l159m232n559
58413B392814o870r456j3426j6450j6943j6260j6080j5697j4006j1956j0795r716
$$ plain form
58401 2235159 2227556 2222047 2217164 2212283 2208354 2205800 2203677 2201714 2201286 2203329 2206943 2211055 2216050 2222796
58387 2222796 2231323 2241340 2252904 2265749 2279035 2292413 2306259 2320372 2333501 2344620 2353576 2360215
58375 2360215 2364182 2365971 2366825 2367186 2366372 2363958 2360148 2354726 2347235 2338403 2329663 2320993 2310993 2299478
58361 2299478 2288144 2278180 2269107 2260578 2253404 2248002 2243665 2240289 2239133 2240934 2244806 2249809 2256100 2263791
58347 2263791 2272344 2281856 2293325 2306804 2320841 2334535 2348503 2363093 2377331 2390496 2403050 2415149
58335 2415149 2425923 2435117 2443787 2452506 2460588 2467920 2475823 2485194 2495575 2506914 2520359 2536250 2553159
58322 2553159 2569929 2586809 2603613 2618779 2631476 2642645 2652640 2659744 2662470 2661480 2657776 2650742 2639562
58309 2639562 2625060 2608702 2591250 2573659 2557709 2544393 2533061 2523294 2516083 2512052 2510241 2509840
$$ packed form
58401B235159p603n509m883m881l929k554k123j963m28K043L614M112M995O746
58387B222796Q527J0017J1564J2845J3286J3378J3846J4113J3129J1119Q956O639
58375B360215L967J789Q54L61q14k414l810n422p491q832q740q670j0000j1515
58361B299478j1334r964r073q529p174n402m337l376j156J801L872N003O291P691
58347B263791Q553R512J1469J3479J4037J3694J3968J4590J4238J3165J2554J2099
58335B415149J0774R194Q670Q719Q082P332P903R371J0381J1339J3445J5891J6909
58322B553159J6770J6880J6804J5166J2697J1169R995P104K726r90l704p034j1180
58309B639562j4502j6358j7452j7591j5950j3316j1332r767p211m031j811m01
$$ plain form
58297 2509840 2511539 2516044 2522916 2531941 2543889 2558908 2575958 2594744 2616200 2640126 2664595 2688853
58285 2688853 2714541 2742870 2772944 2804147 2837829 2875203 2915876 2959743 3007794 3059589 3112452
58274 3112452 3164652 3216829 3268857 3318063 3362172 3401254 3435250 3462756 3484184 3502961 3521364
58263 3521364 3538151 3552489 3567120 3585253 3607287 3632923 3663322 3698592 3736264 3774970 3816778
58252 3816778 3863481 3913820 3966942 4025071 4089873 4159661 4233197 4312749 4400156 4493427 4590588
58241 4590588 4693352 4803566 4919697 5040413 5168015 5304645 5448817 5599431 5759385
58232 5759385 5931470 6114772 6308897 6517326 6742519 6982503 7236830 7510962 7809997
58223 7809997 8133291 8480548 8857849 9271894 9723805 10214748 10752287 11344957 11996512
$$ packed form
58297B509840J699M505O872R025J1948J5019J7050J8786K1456K3926K4469K4258
58285B688853K5688K8329L0074L1203L3682L7374M0673M3867M8051N1795N2863
58274C112452N2200N2177N2028M9206M4109L9082L3996K7506K1428J8777J8403
58263C521364J6787J4338J4631J8133K2034K5636L0399L5270L7672L8706M1808
58252C816778M6703N0339N3122N8129O4802O9788P3536P9552Q7407R3271R7161
58241D590588J02764J10214J16131J20716J27602J36630J44172J50614J59954
58232E759385J72085J83302J94125K08429K25193K39984K54327K74132K99035
58223G809997L23294L47257L77301M14045M51911M90943N37539N92670O51555
$$ plain form
58214 11996512 12712570 13507334 14397176 15394440 16515654 17789792 19251623 20935909 22888523
58205 22888523 25177309 27885307 31105189 34952146 39570565 45111783 51710837 59493897
58197 59493897 68594764 79151658 91305471 105214369 121036886 138861049 158665547
58190 158665547 180384491 203981051 229383113 256299634 284031418 311255392 335740169
58183 335740169 354287462 363402880 360683672 346057715 321898840 291957900 259979216
58176 259979216 228847868 200401677 175573355 154610550 137316350 123253010 111832163
58169 111832163 102332239 93973527 86089472 78289824 70502929 62887578 55685623 49096774
58161 49096774 43224278 38087436 33655696 29868222 26643911 23897870 21556050 19554431
$$ packed form
58214A1996512P16058P94764Q89842R97264J121214J274138J461831J684286J952614
58205B2888523K288786K707998L219882L846957M618419N541218O599054P783060
58197E9493897R100867J0556894J2153813J3908898J5822517J7824163J9804498
58190A58665547K1718944K3596560K5402062K6916521K7731784K7223974K4484777
58183C35740169J8547293R115418k719208j4625957k4158875k9940940l1978684
58176B59979216l1131348k8446191k4828322k0962805j7294200j4063340j1420847
58169A11832163r499924q358712p884055p799648p786895p615351p201955o588849
58161D9096774n872496n136842m431740l787474l224311k746041k341820k001619
$$ plain form
58153 19554431 17833118 16340672 15040361 13904650 12906458 12021335 11233229 10530511 9899133
58144 9899133 9325488 8802405 8325932 7889085 7484479 7110047 6766281 6450351 6158245
58135 6158245 5889901 5646602 5425488 5221793 5034372 4864078 4708710 4564323 4429621
58126 4429621 4304424 4185534 4068596 3952523 3838192 3724728 3611142 3499743 3393732
58117 3393732 3292901 3195487 3102455 3016022 2935600 2859081 2786627 2719350 2655772 2593440 2532789
58106 2532789 2475792 2422048 2369761 2319319 2272355 2228467 2186396 2147365 2113778 2085631 2061517
58095 2061517 2042183 2029684 2023774 2022214 2023758 2027802 2032080 2033937 2033199 2030933 2026311 2017642 2005455
58082 2005455 1991499 1975620 1956820 1936505 1917384 1899669 1881517 1862675 1844583 1827301 1809448
$$ packed form
58153A9554431j721313j492446j300311j135711r98192q85123p88106p02718o31378
58144I899133n73645n23083m76473m36847m04606l74432l43766l15930k92106
58135F158245k68344k43299k21114k03695j87421j70294j55368j44387j34702
58126D429621j25197j18890j16938j16073j14331j13464j13586j11399j06011
58117C393732j00831r7414r3032q6433q0422p6519p2454o7277o3578o2332o0651
58106B532789n6997n3744n2287n0442m6964m3888m2071l9031l3587k8147k4114
58095B061517j9334j2499n910j560J544M044M278J857p38k266m622q669j2187
58082B005455j3956j5879j8800k0315j9121j7715j8152j8842j8092j7282j7853
$$ plain form
58071 1809448 1790945 1772795 1754334 1733717 1711173 1689097 1668856 1649937 1632007 1615277 1598992
58060 1598992 1582191 1565909 1552139 1540697 1529558 1518125 1507553 1497847 1487397 1475793 1464705
58049 1464705 1455451 1447678 1440746 1434472 1428306 1421654 1415219 1410316 1406890 1403905 1401342 1399871 1398901 1397235
58035 1397235 1395589 1396032 1398755 1401568 1403006 1403825 1405013 1406325 1407382 1408515 1409931 1411497 1413694 1417413
58021 1417413 1422560 1428195 1434146 1441121 1449260 1458008 1467415 1478039 1489661 1501533 1513831 1527377 1542115
58008 1542115 1557489 1574087 1593175 1614707 1637622 1662143 1689933 1721853 1757189 1795202 1835810
57997 1835810 1878793 1924082 1972945 2027141 2086738 2150380 2217712 2289816 2367203 2449258 2535746
57986 2535746 2626819 2721074 2815367 2906903 2993788 3073381 3142308 3198955 3244461 3280798 3309561
$$ packed form
58071A809448j8503j8150j8461k0617k2544k2076k0241j8919j7930j6730j6285
58060A598992j6801j6282j3770j1442j1139j1433j0572r706j0450j1604j1088
58049A464705r254p773o932o274o166o652o435m903l426k985k563j471r70j666
58035A397235j646M43K723K813J438Q19J188J312J057J133J416J566K197L719
58021A417413N147N635N951O975Q139Q748R407J0624J1622J1872J2298J3546J4738
58008A542115J5374J6598J9088K1532K2915K4521K7790L1920L5336L8013M0608
57997A835810M2983M5289M8863N4196N9597O3642O7332P2104P7387Q2055Q6488
57986B535746R1073R4255R4293R1536Q6885P9593O8927N6647M5506L6337K8763
$$ plain form
57975 3309561 3333008 3354125 3374362 3392361 3405307 3410004 3402232 3377139 3331730 3266281 3183079 3085304
57963 3085304 2977673 2866321 2756652 2652013 2554740 2467025 2389972 2323114 2265692 2217329
57953 2217329 2176991 2142867 2114238 2092187 2077482 2068940 2064826 2064728 2068975 2077174 2088386 2101928 2117047
57940 2117047 2132582 2148013 2164316 2182891 2204026 2227132 2251982 2279081 2309141 2342611 2379301
57929 2379301 2418179 2458030 2498495 2539744 2580874 2619268 2651680 2675002 2685827 2680473 2656358
57918 2656358 2613126 2552459 2477670 2393632 2305819 2218561 2134421 2055151 1982230 1916392 1857801
57907 1857801 1807071 1765028 1731063 1702816 1678068 1656062 1636573 1618895 1602472 1587603 1574729
57896 1574729 1563726 1554490 1547522 1543354 1541957 1543114 1546658 1552000 1558200 1564833 1572066 1579634 1586653 1592665
$$ packed form
57975C309561K3447K1117K0237J7999J2946M697p772k5093m5409o5449q3202r7775
57963C085304j07631j11352j09669j04639r7273q7715p7053o6858n7422m8363
57953B217329m0338l4124k8629k2051j4705q542m114r8M247Q199J1212J3542J5119
57940B117047J5535J5431J6303J8575K1135K3106K4850K7099L0060L3470L6690
57929B379301L8878L9851M0465M1249M1130L8394L2412K3322J0825n354k4115
57918B656358m3232o0667p4789q4038q7813q7258q4140p9270p2921o5838n8591
57907A857801n0730m2043l3965k8247k4748k2006j9489j7678j6423j4869j2874
57896A574729j1003r236o968m168j397J157L544N342O200O633P233P568P019O012
$$ plain form
57882 1592665 1597818 1601661 1602904 1600933 1596457 1590069 1581251 1569541 1555679 1540708 1524757 1507485 1489006
57869 1489006 1469571 1449046 1427426 1405300 1383155 1360725 1337591 1313851 1289839 1265845 1242415
57858 1242415 1220093 1198503 1176688 1154804 1134389 1116341 1099751 1083505 1067988 1054268 1042546
57847 1042546 1032492 1024281 1018141 1013459 1009366 1005830 1003336 1001916 1001337 1001764 1003416 1005933 1008770 1011892
57833 1011892 1015489 1019474 1023806 1028790 1034489 1040432 1046393 1052805 1059833 1066851 1073546 1080749 1089285 1098671
57819 1098671 1107892 1116894 1126397 1136779 1148000 1160155 1173182 1186490 1199792 1213968 1230295 1249245
57807 1249245 1270789 1295372 1323686 1355899 1392123 1433276 1480403 1533258 1590398 1650592 1713270
57796 1713270 1777498 1841064 1900449 1951199 1988621 2008959 2010262 1992325 1956550 1906264 1846352
$$ packed form
57882A592665N153L843J243j971m476o388q818j1710j3862j4971j5951j7272j8479
57869A489006j9435k0525k1620k2126k2145k2430k3134k3740k4012k3994k3430
57858A242415k2322k1590k1815k1884k0415j8048j6590j6246j5517j3720j1722
57847A042546j0054q211o140m682m093l536k494j420n79M27J652K517K837L122
57833A011892L597L985M332M984N699N943N961O412P028P018O695P203Q536R386
57819A098671R221R002R503J0382J1221J2155J3027J3308J3302J4176J6327J8950
57807A249245K1544K4583K8314L2213L6224M1153M7127N2855N7140O0194O2678
57796A713270O4228O3566N9385N0750L7422K0338J303j7937l5775n0286n9912
$$ plain form
57785 1846352 1781602 1715444 1650387 1588690 1531797 1479810 1432434 1389837 1351709 1316292 1281734
57774 1281734 1248173 1217277 1189878 1165083 1141595 1118842 1096751 1075369 1054910 1035563 1017185
57763 1017185 999672 983374 968528 954599 940981 928024 916528 906454 897080 888289 880706 874598
57751 874598 869517 865142 861684 859419 858608 859829 863544 869198 875521 881879 888624 896120 904170 912491
57737 912491 920848 928375 933458 934779 932151 926166 917476 906628 894210 880924 867661 855466 845125
57724 845125 836784 830237 825407 822256 820446 819608 819791 821240 823868 827439 832062 838022 845284 853651 863146
57709 863146 873699 884737 895827 907627 921447 937825 956124 975458 995326 1015201 1034059
57698 1034059 1050689 1064246 1074549 1082003 1087063 1089541 1088675 1084145 1076573 1066729 1054856 1041304 1027157
$$ packed form
57785A846352o4750o6158o5057o1697n6893n1987m7376m2597l8128l5417l4558
57774A281734l3561l0896k7399k4795k3488k2753k2091k1382k0459j9347j8378
57763A017185j7513j6298j4846j3929j3618j2957j1496j0074r374q791p583o108
57751H74598n081m375l458k265q11J221L715N654O323O358O745P496Q050Q321
57737I12491Q357P527N083J321k628n985q690j0848j2418j3286j3263j2195j0341
57724H45125q341o547m830l151j810q38J83J449K628L571M623N960P262Q367R495
57709H63146J0553J1038J1090J1800J3820J6378J8299J9334J9868J9875J8858
57698A034059J6630J3557J0303P454N060K478q66m530p572r844j1873j3552j4147
$$ plain form
57685 1027157 1013355 999723 985916 972997 963063 957468 956359 959762 968094 981595 1000250 1024247
57673 1024247 1053561 1087078 1123143 1160966 1200428 1240293 1277551 1308501 1329227 1334988 1321164
57662 1321164 1286432 1234654 1172823 1107371 1042551 981064 924806 874899 831684 794867 763637
57651 763637 737022 714514 696099 681542 670021 660649 652942 646526 640858 635542 630577 626003 621561
57638 621561 616981 612289 607688 603417 599819 597129 594985 592538 589283 585504 581828 578623 575893 573330
57624 573330 570359 566545 562128 557811 553936 550272 546626 543182 540124 537375 534878 532678 530670 528729
57610 528729 527141 526382 526328 526301 526050 526103 526897 528126 529273 530292 531357 532371 533047 533231 532950 532478 532453 533518
57592 533518 535697 538499 541669 545268 548973 551987 553872 554764 554564 552714 549355 545976 544208 544292 545253
$$ packed form
57685A027157j3802j3632j3807j2919r934n595j109L403Q332J3501J8655K3997
57673A024247K9314L3517L6065L7823L9462L9865L7258L0950K0726N761j3824
57662A321164l4732n1778o1831o5452o4820o1487n6258m9907m3215l6817l1230
57651G63637k6615k2508j8415j4557j1521r372p707o416n668n316m965m574m442
57638F21561m580m692m601m271l598k690k144k447l255l779l676l205k730k563
57624E73330k971l814m417m317l875l664l646l444l058k749k497k200k008j941
57610E28729j588p59n4k7k51N3P94J229J147J019J065J014O76J84k81m72k5J065
57592E33518K179K802L170L599L705L014J885Q92k00j850l359l379j768Q4R61
$$ plain form
57577 545253 546220 547013 547783 548689 549856 551211 552413 553134 553210 552414 550505 547750 544898 542279 539423 536047
57561 536047 532937 531215 530964 531186 530952 530056 528712 527275 526351 526600 528110 530179 531934 533124 534306 536254
57545 536254 539177 542460 545276 547343 548919 550111 550609 550110 548595 545972 541847 535959 528607 520436 512028
57530 512028 503915 496696 490838 486464 483500 481825 481134 480908 480746 480624 480728 481193 482032 483100 484153 485267
57514 485267 487137 490528 495340 500621 505624 510341 514916 519138 522760 525794 528133 529416 529663 529554 529558
57499 529558 529136 527288 523706 518935 513743 508784 504663 501780 500099 499411 499780 501462 504495 508602 513425
57484 513425 518657 523992 529113 533691 537509 540814 544436 549082 554447 559486 563654 567376 571203 575215
57470 575215 579579 584936 591618 599036 606507 614355 623547 634443 646383 658178 668393 675388 677925
$$ packed form
57577E45253R67P93P70R06J167J355J202P21P6p96j909k755k852k619k856l376
57561E36047l110j722k51K22k34q96j344j437r24K49J510K069J755J190J182J948
57545E36254K923L283K816K067J576J192M98m99j515k623m125n888p352q171q408
57530E12028q113p219n858m374k964j675o91k26j62j22J04M65Q39J068J053J114
57514D85267J870L391M812N281N003M717M575M222L622L034K339J283K47j09M
57499E29558m22j848l582m771n192m959m121k883j681o88L69J682L033M107M823
57484E13425N232N335N121M578L818L305L622M646N365N039M168L722L827M012
57470E75215M364N357O682P418P471P848R192J0896J1940J1795J0215O995K537
$$ plain form
57457 677925 675989 670788 664022 657310 651949 648589 647159 647416 649475 653534 659411 666802 675785 686535
57443 686535 698725 711719 725222 739046 752001 761482 764504 759243 745828 726037 702342 677004
57431 677004 651822 628373 607978 591204 577767 567223 559533 554820 553030 554206 558713 566706 577700
57418 577700 591147 607282 626846 650132 676737 706132 738047 772327 808628 845861 881238
57407 881238 909905 926254 926209 908695 875634 831181 780708 729482 681414 638538 601264 569018
57395 569018 541063 517224 497757 482474 470363 460331 451858 444598 437941 431576 426021 421856 418720
57382 418720 415771 412835 410259 407816 404674 400451 395485 389991 383742 376771 369615 362579 355357 347654
57368 347654 339598 331309 322696 314000 306034 299460 294164 289625 285613 282252 279719 278154 277681 278338 280141
$$ packed form
57457F77925j936n201o766o712n361l360j430K57K059M059N877P391Q983J0750
57443F86535J2190J2994J3503J3824J2955R481L022n261j3415j9791k3695k5338
57431F77004k5182k3449k0395j6774j3437j0544p690m713j790J176M507P993J0994
57418E77700J3447J6135J9564K3286K6605K9395L1915L4280L6301L7233L5377
57407H81238K8667J6349m5j7514l3061m4453n0473n1226m8068m2876l7274l2246
57395E69018k7955k3839j9467j5283j2111j0032q473p260o657o365n555m165l136
57382D18720k949k936k576k443l142m223m966n494o249o971p156p036p222p703
57368C47654q056q289q613q696p966o574n296m539m012l361k533j565m73O57J803
$$ plain form
57353 280141 283214 287542 292629 297774 302669 307284 311185 313592 314322 314035 313257 311736 309206 306342 304340
57338 304340 303718 303984 304381 304563 304615 304702 304793 304636 304046 303217 302607 302475 302761 303410 304540 306136 307894 309530
57320 309530 311050 312554 314028 315448 316857 318220 319508 321021 323218 326003 328564 330321 331760 333888
57306 333888 337012 340461 343403 345569 347194 348649 350188 351780 353128 354059 354870 355994 357242 357720 356753
57291 356753 354715 352742 351689 351551 351745 351681 351078 350043 348989 348301 347912 347349 346370 345389 345014 345277 345622
57274 345622 345666 345649 346068 347129 348663 350333 351790 352862 353738 354797 356194 357790 359537 361612 364026 366459
57258 366459 368730 371137 373976 376966 379553 381679 383910 386737 390041 393278 396074 398621 401577 405554
57244 405554 410720 416984 424352 432789 441785 450686 459646 469753 481808 495306 508918 521605 533010
$$ packed form
57353B80141L073M328N087N145M895M615L901K407P30k87p78j521k530k864k002
57338C04340o22K66L97J82N2Q7R1j57n90q29o10j32K86O49J130J596J758J636
57320C09530J520J504J474J420J409J363J288J513K197K785K561J757J439K128
57306C33888L124L449K942K166J625J455J539J592J348R31Q11J124J248M78r67
57291C56753k038j973j053j38J94o4o03j035j054o88l89n63r79r81l75K63L45
57274C45622M4j7M19J061J534J670J457J072Q76J059J397J596J747K075K414K433
57258C66459K271K407K839K990K587K126K231K827L304L237K796K547K956L977
57244D05554N166O264P368Q437Q996Q901Q960J0107J2055J3498J3612J2687J1405
$$ plain form
57231 533010 543221 552644 561705 570163 576974 581344 583658 584926 585596 585500 584619 583214 581368 579108 576973
57216 576973 575845 576220 578104 581546 586617 592919 599757 606923 614778 623550 633104 643460 654867 667156
57202 667156 679526 691330 702772 714666 727705 742005 757061 772083 786651 801030 815663
57191 815663 830621 845921 862009 879264 897133 914576 931474 948967 968225 989450 1012223
57180 1012223 1036159 1060919 1086150 1111852 1138531 1166701 1196444 1227582 1259978 1293556 1328300
57169 1328300 1364359 1401782 1440079 1478362 1516081 1553383 1590705 1628333 1666379 1704895 1743937
57158 1743937 1783750 1824912 1868022 1913282 1960334 2008130 2054724 2097945 2137332 2175366 2216030
57147 2216030 2261992 2313432 2369145 2427770 2487987 2548605 2609007 2669056 2728407 2786438 2842969
$$ packed form
57231E33010J0211R423R061Q458O811M370K314J268O70r6q81j405j846k260k135
57216E76973j128L75J884L442N071O302O838P166P855Q772R554J0356J1407J2289
57202F67156J2370J1804J1442J1894J3039J4300J5056J5022J4568J4379J4633
57191H15663J4958J5300J6088J7255J7869J7443J6898J7493J9258K1225K2773
57180A012223K3936K4760K5231K5702K6679K8170K9743L1138L2396L3578L4744
57169A328300L6059L7423L8297L8283L7719L7302L7322L7628L8046L8516L9042
57158A743937L9813M1162M3110M5260M7052M7796M6594M3221L9387L8034M0664
57147B216030M5962N1440N5713N8625O0217O0618O0402O0049N9351N8031N6531
$$ plain form
57136 2842969 2898516 2953670 3008659 3063520 3118188 3172460 3226417 3280711 3335759 3390732 3444141
57125 3444141 3495486 3545646 3595785 3646834 3700096 3757361 3820139 3889581 3967374 4055836 4156733
57114 4156733 4270422 4396195 4532775 4678709 4833589 4999648 5182008 5387636 5624842
57105 5624842 5903530 6234899 6630954 7105469 7675638 8362262 9189072 10183252 11375906
57096 11375906 12799805 14486522 16467707 18779594 21464889 24570052 28140590 32214057
57088 32214057 36809258 41918094 47508785 53533410 59920389 66549849 73238258 79754557
57080 79754557 85854280 91300756 95867147 99341330 101547895 102374871 101787067 99824301
57072 99824301 96592558 92250811 86993330 81032709 74589778 67888389 61147961 54571061
$$ packed form
57136B842969N5547N5154N4989N4861N4668N4272N3957N4294N5048N4973N3409
57125C444141N1345N0160N0139N1049N3262N7265O2778O9442P7793Q8462J00897
57114D156733J13689J25773J36580J45934J54880J66059J82360K05628K37206
57105E624842K78688L31369L96055M74515N70169O86624Q26810R94180J192654
57096A1375906J423899J686717J981185K311887K685295L105163L570538M073467
57088C2214057M595201N108836N590691O024625O386979O629460O688409O516299
57080G9754557O099723N446476M566391L474183K206565Q26976n87804j962766
57072I9824301l231743m341747n257481n960621o442931o701389o740428o576900
$$ plain form
57064 54571061 48329211 42551106 37316450 32657844 28569952 25021239 21964170 19343593
57056 19343593 17103811 15192905 13563672 12173554 10985467 9968010 9093589 8336460
57048 8336460 7673211 7084577 6555951 6076479 5638375 5236480 4867160 4527050 4212894
57039 4212894 3922115 3652900 3403797 3173649 2961801 2767972 2591849 2432882 2290207
57030 2290207 2162621 2048897 1948286 1860505 1785184 1721720 1669768 1629397 1600551 1582714 1575408
57019 1575408 1578765 1593337 1619335 1655869 1700709 1751026 1804642 1859818 1912494 1953693 1971225
57008 1971225 1955587 1905034 1825685 1727808 1621946 1516724 1418052 1329228 1251604 1185283 1129629
56997 1129629 1083874 1047489 1019831 999605 985320 976235 972117 972049 974310 977770 982648 989404 997629
$$ packed form
57064E4571061o241850n778105n234656m658606m087892l548713l057069k620577
57056A9343593k239782j910906j629233j390118j188087j017457q74421p57129
57048H336460o63249n88634n28626m79472m38104m01895l69320l40110l14156
57039D212894k90779k69215k49103k30148k11848j93829j76123j58967j42675
57030B290207j27586j13724j00611q7781p5321o3464n1952m0371k8846j7837p306
57019A575408L357J4572K5998L6534M4840N0317N3616N5176N2676M1199J7532
57008A971225j5638n0553p9349r7877j05862j05222r8672q8824p7624o6321n5654
56997A129629m5755l6385k7658k0226j4285r085m118o8K261L460M878O756Q225
$$ plain form
56984 997629 1006538 1015874 1025427 1033814 1038443 1036784 1027528 1010788 987744 960170 930065 899410 869974
56971 869974 843055 819441 799784 784791 774796 769431 768204 771161 778381 789087 802082 817008
56959 817008 834432 854689 877425 902138 927959 952546 972241 984027 986915 981360 968456 950263
56947 950263 929937 910384 892960 877923 865656 856826 851794 850636 853698 861687 875233 894499
56935 894499 919046 948038 980971 1018179 1060026 1105381 1151345 1194351 1230720 1256236 1266731
56924 1266731 1260218 1238101 1203861 1161134 1113300 1063589 1014332 966439 920474 877827 840018
56913 840018 807199 778287 752519 730258 712400 699509 691497 687682 687216 689674 694964 702576 711386
56900 711386 720438 729224 736850 741760 742979 741029 736874 730594 722001 712074 702729 695290 690011 686943
$$ packed form
56984I97629Q909R336R553Q387M629j659r256j6740k3044k7574l0105l0655k9436
56971H69974k6919k3614j9657j4993r995n365j227K957P220J0706J2995J4926
56959H17008J7424K0257K2736K4713K5821K4587J9695J1786K888n555j2904j8193
56947I50263k0326j9553j7424j5037j2267q830n032j158L062P989J3546J9266
56935H94499K4547K8992L2933L7208M1847M5355M5964M3006L6369K5516J0495
56924A266731o513k2117l4240m2727m7834m9711m9257m7893m5965m2647l7809
56913H40018l2819k8912k5768k2261j7858j2891q012l815m66K458N290P612Q810
56900G11386R052Q786P626M910J219j950m155o280q593r927r345p439n279l068
$$ plain form
56886 686943 686428 688613 692994 698279 702201 701823 694997 681812 664256 644637 624790 606423 591276
56873 591276 580697 575431 575845 581869 592787 607549 625399 646100 669775 696831 727646 761865
56861 761865 798312 836017 874869 914462 952394 984285 1005487 1012659 1004588 982702 950922 914195
56849 914195 876750 841750 811938 789574 775663 769968 771951 781328 797854 821300 851802 889771
56837 889771 935330 988140 1047642 1112978 1182646 1254378 1324775 1388268 1436826 1462204 1459766 1430669
56825 1430669 1380875 1318495 1251493 1186396 1127820 1078632 1040287 1012991 996054 988760 991000 1002932
56813 1002932 1024234 1053969 1090923 1133793 1181485 1233573 1289949 1349252 1407692 1459647 1499008
56802 1499008 1519979 1518277 1493537 1450617 1397276 1340269 1284066 1232382 1188802 1155262 1131281
$$ packed form
56886F86943n15K185M381N285L922l78o826j3185j7556j9619j9847j8367j5147
56873E91276j0579n266M14O024J0918J4762J7850K0701K3675K7056L0815L4219
56861G61865L6447L7705L8852L9593L7932L1891K1202P172q071k1886l1780l6727
56849I14195l7445l5000k9812k2364j3911n695J983R377J6526K3446L0502L7969
56837H89771M5559N2810N9502O5336O9668P1732P0397O3493M8558K5378k438k9097
56825A430669m9794o2380o7002o5097n8576m9188l8345k7296j6937p294K240J1932
56813A002932K1302K9735L6954M2870M7692N2088N6376N9303N8440N1955L9361
56802A499008K0971j702k4740m2920n3341n7007n6203n1684m3580l3540k3981
$$ plain form
56791 1131281 1115613 1107964 1108621 1117239 1132739 1153875 1179300 1207548 1237649 1269553 1303424 1338464
56779 1338464 1372506 1402410 1424681 1436191 1434974 1420710 1394700 1359598 1318916 1276100 1233650
56768 1233650 1192917 1154381 1117689 1081768 1045660 1009420 973810 939216 905447 872553 841157
56757 841157 811804 784534 759304 736338 715838 697746 681939 668316 656577 646197 636689 627651
56745 627651 618789 610326 603175 598005 594187 590313 585818 581435 578024 575564 573482 571282 568738 566019
56731 566019 563828 562815 562732 562713 562453 562446 562957 563608 564250 565481 567815 570952 574321 577820 581597 585643 590043
56714 590043 595211 601453 608676 616887 626554 638157 651804 667703 686515 708682 733729 760829
56702 760829 789967 822152 858526 899585 945200 995104 1049209 1107428 1169235 1233620 1299609
$$ packed form
56791A131281j5668p649O57Q618J5500K1136K5425K8248L0101L1904L3871L5040
56779A338464L4042K9904K2271J1510j217j4264k6010l5102m0682m2816m2450
56768A233650m0733l8536l6692l5921l6108l6240l5610l4594l3769l2894l1396
56757H41157k9353k7270k5230k2966k0500j8092j5807j3623j1739j0380r508r038
56745F27651q862q463p151n170l818l874m495m383l411k460k082k200k544k719
56731E66019k191j013q3j9k60pN11O51O42J231K334L137L369L499L777M046M400
56714E90043N168O242P223Q211R667J1603J3647J5899J8812K2167K5047K7100
56702G60829K9138L2185L6374M1059M5615M9904N4105N8219O1807O4385O5989
$$ plain form
56691 1299609 1366468 1433004 1497017 1556126 1608999 1655176 1693910 1724184 1746045 1761054 1771170
56680 1771170 1777979 1783218 1788988 1796657 1806066 1816337 1826974 1837816 1848611 1859368 1870675 1883008
56668 1883008 1895968 1908602 1920069 1929459 1935406 1936565 1932328 1922570 1906912 1884742 1855828 1820538
56656 1820538 1779660 1734460 1686776 1638553 1591224 1545775 1503266 1464969 1431947 1404655 1382883
56645 1382883 1366022 1353448 1344648 1338832 1334684 1330968 1327433 1324729 1323455 1323809 1326169 1331304 1339729 1351371
56631 1351371 1366021 1383500 1403098 1423432 1443141 1461168 1476132 1486259 1490396 1488574 1481237 1468649
56619 1468649 1451636 1432120 1412105 1392538 1373666 1355817 1338900 1321719 1302951 1282862 1263241
56608 1263241 1245694 1230674 1218173 1208557 1202514 1200630 1203194 1210134 1221122 1235969 1254687 1276877
$$ packed form
56691A299609O6859O6536O4013N9109N2873M6177L8734L0274K1861J5009J0116
56680A771170O809N239N770P669R409J0271J0637J0842J0795J0757J1307J2333
56668A883008J2960J2634J1467R390N947J159m237r758j5658k2170k8914l5290
56656A820538m0878m5200m7684m8223m7329m5449m2509l8297l3022k7292k1772
56645A382883j6861j2574q800n816m148l716l535k704j274L54K360N135Q425J1642
56631A351371J4650J7479J9598K0334J9709J8027J4964J0127M137j822p337j2588
56619A468649j7013j9516k0015j9567j8872j7849j6917j7181j8768k0089j9621
56608A263241j7547j5020j2501r616o043j884K564O940J0988J4847J8718K2190
$$ plain form
56596 1276877 1301246 1326197 1350694 1374175 1395869 1414876 1430834 1443983 1454519 1462408 1467935 1471887
56584 1471887 1474917 1477009 1477850 1477623 1477169 1477393 1478609 1480588 1483140 1486338 1489916 1492700 1493174 1490701 1485868
56569 1485868 1479620 1472476 1464622 1456299 1447884 1439927 1433108 1427693 1422993 1417955 1412379 1406835 1401191 1393987
56555 1393987 1383625 1369393 1350875 1327283 1298205 1264515 1227693 1188581 1147435 1104784 1061475
56544 1061475 1018092 975022 932992 892951 855493 820766 788704 758983 731086 704877 680852
56533 680852 659376 640092 622478 606503 592144 578827 566110 554512 544763 536501 528603 520701
56521 520701 513494 507538 502538 497939 493570 489508 485827 482597 479707 476699 473198 469440 465950 462828
56507 462828 459857 457125 454920 453089 451128 448984 447167 446010 445328 444894 444694 444608 444332 443756 443038 442206
$$ packed form
56596A276877K4369K4951K4497K3481K1694J9007J5958J3149J0536P889N527L952
56584A471887L030K092Q41k27m54K24J216J979K552L198L578K784M74k473m833
56569A485868o248p144p854q323q415p957o819n415m700n038n576n544n644p204
56555A393987j0362j4232j8518k3592k9078l3690l6822l9112m1146m2651m3309
56544A061475m3383m3070m2030m0041l7458l4727l2062k9721k7897k6209k4025
56533F80852k1476j9284j7614j5975j4359j3317j2717j1598r749q262p898p902
56521E20701p207n956n000m599m369m062l681l230k890l008l501l758l490l122
56507D62828k971k732k205j831j961k144j817j157o82m34k00q6k76n76p18q32
$$ plain form
56491 442206 441176 440325 440533 442310 445111 447788 449637 450860 452131 453884 456040 458284 460403 462269 463697
56476 463697 464658 465473 466339 466752 466041 464545 463518 463535 463721 463015 461502 459869 458188 456135 454021 452734
56460 452734 452710 453656 455176 457121 459414 462062 465201 468750 472310 475845 480097 485627 491705 496859 500367
56445 500367 502644 504334 505726 506912 507882 508442 508491 508253 507778 506578 504338 501642 499202 496607 492775 487615
56429 487615 482384 478322 475648 473978 472956 472273 471669 471149 470825 470514 469953 469338 469076 469064 468841 468469 468577
56412 468577 469441 470645 471833 473109 474473 475448 475656 475363 475090 474948 474645 473988 473164 472553 472367 472477 472631
56395 472631 472781 473004 473164 473005 472661 472576 472722 472446 471396 470054 468939 467879 466622 465588 465344 465683 465911
56378 465911 465702 465109 464128 462845 461694 461000 460631 460567 461227 462599 463758 464095 464386 465645 467507 468846 469517
$$ packed form
56491D42206j030q51K08J777K801K677J849J223J271J753K156K244K119J866J428
56476D63697R61Q15Q66M13p11j496j027J7J86p06j513j633j681k053k114j287
56460D52734k4R46J520J945K293K648L139L549L560L535M252N530O078N154L508
56445E00367K277J690J392J186R70N60M9k38m75j200k240k696k440k595l832n160
56429D87615n231m062k674j670j022o83o04n20l24l11n61o15k62j2k23l72J08
56412D68577Q64J204J188J276J364R75K08k93k73j42l03o57q24o11j86J10J54
56395D72631J50K23J60j59l44q5J46k76j050j342j115j060j257j034k44L39K28
56378D65911k09n93r81j283j151o94l69o4O60J372J159L37K91J259J862J339O71
$$ plain form
56361 469517 470270 471318 472274 473277 474852 476721 478005 478692 479715 481547 483847 486568 490128 494273 497987
56346 497987 500919 503934 507793 512182 516378 520009 522817 524542 525475 526394 527552 528288 527907 526373 524026
56331 524026 521304 518909 517565 517312 517573 518007 518770 519898 521098 522291 523752 525658 527931 530461 532924
56316 532924 534679 535541 536437 538426 541281 543912 546028 548447 551879 556359 561776 567967 574282 580002 585193
56301 585193 590313 595172 599192 602441 605282 607213 607316 605738 603527 601106 598218 595327 593593 593339 593868
56286 593868 594936 597044 600129 603415 606706 610480 614492 617826 620524 623630 627311 630598 633409 637090
56272 637090 642276 647851 652893 658084 664352 671435 678701 686088 693430 700110 706286 713188 721391 730021
56258 730021 738431 747317 757237 767433 777215 787221 798094 809118 819448 829607 840406 851256
$$ packed form
56361D69517P53J048R56J003J575J869J284O87J023J832K300K721L560M145L714
56346D97987K932L015L859M389M196L631K808J725R33R19J158P36l81j534k347
56331E24026k722k395j344k53K61M34P63J128J200J193J461J906K273K530K463
56316E32924J755Q62Q96J989K855K631K116K419L432M480N417O191O315N720N191
56301E85193N120M859M020L249K841J931J03j578k211k421k888k891j734k54N29
56286E93868J068K108L085L286L291L774M012L334K698L106L681L287K811L681
56272F37090N186N575N042N191O268P083P266P387P342O680O176O902Q203Q630
56258G30021Q410Q886R920J0196R782J0006J0873J1024J0330J0159J0799J0850
$$ plain form
56246 851256 860891 869005 875897 881128 883824 883905 881963 878326 873131 866861 859933 852103 842968 832598
56232 832598 821211 808868 796045 783757 772482 761672 750926 740831 732049 724443 717785 712489
56220 712489 708907 706696 705510 705471 706273 706736 706035 704657 703530 703061 703536 705396 708330 711068 712803 713983
56204 713983 715101 715807 715957 716398 717826 719860 722040 724720 728087 731341 733756 735624 737406 738960 740361
56189 740361 742337 745077 747738 749972 752636 756084 759139 760840 761981 763691 765689 767124 767995 768601 768677
56174 768677 768286 768446 769694 771157 772156 773484 775882 778628 781026 784018 788726 794566 800387 806433 813618
56159 813618 821813 830372 839426 849270 859499 870236 883122 899601 919217 941092 965877 994557
56147 994557 1026503 1060572 1097223 1137700 1182023 1229622 1281209 1338116 1400313 1466680 1536589
$$ packed form
56246H51256R635Q114O892N231K696Q1j942l637n195o270o928p830r135j0370
56232H32598j1387j2343j2823j2288j1275j0810j0746j0095q782p606o658n296
56220G12489l582k211j186l9Q02M63p01j378j127m69M75J860K934K738J735J180
56204G13983J118P06J50M41J428K034K180K680L367L254K415J868J782J554J401
56189G40361J976K740K661K234K664L448L055J701J141J710J998J435Q71O06P6
56174G68677l91J60J248J463R99J328K398K746K398K992M708N840N821O046P185
56159H13618Q195Q559R054R844J0229J0737J2886J6479J9616K1875K4785K8680
56147I94557L1946L4069L6651M0477M4323M7599N1587N6907O2197O6367O9909
$$ plain form
56136 1536589 1609674 1684758 1760520 1836450 1911716 1983980 2050828 2111482 2165740 2212547 2251369
56125 2251369 2283789 2311770 2335274 2353180 2365187 2370794 2367867 2354791 2333175 2306087 2274353 2236730
56113 2236730 2192730 2142761 2086225 2022157 1951559 1877007 1800414 1723233 1648152 1578279 1515029
56102 1515029 1458770 1410706 1371801 1340590 1314581 1293310 1277653 1266775 1258483 1252242 1249122 1248786
56090 1248786 1249064 1248576 1247588 1246234 1244010 1241064 1238090 1235043 1231644 1228662 1226934 1225767 1224211 1223035 1223421
56075 1223421 1224758 1226046 1228349 1233210 1239662 1245683 1251655 1259315 1268095 1275870 1282886 1291541 1302380 1313511
56061 1313511 1324051 1335122 1347363 1360338 1374416 1390361 1407094 1422647 1437285 1452939 1469817
56050 1469817 1486544 1503341 1521875 1541993 1561811 1581157 1601923 1624909 1649187 1674552 1701748
$$ packed form
56136A536589P3085P5084P5762P5930P5266P2264O6848O0654N4258M6807L8822
56125B251369L2420K7981K3504J7906J2007N607k927j3076k1616k7088l1734l7623
56113B236730m4000m9969n6536o4068p0598p4552p6593p7181p5081o9873o3250
56102A515029n6259m8064l8905l1211k6009k1271j5657j0878q292o241l120l36
56090A248786K78m88r88j354k224k946k974l047l399k982j728j167j556j176L86
56075A223421J337J288K303M861O452O021N972P660Q780P775P016Q655J0839J1131
56061A313511J0540J1071J2241J2975J4078J5945J6733J5553J4638J5654J6878
56050A469817J6727J6797J8534K0118J9818J9346K0766K2986K4278K5365K7196
$$ plain form
56039 1701748 1730485 1760162 1792218 1828677 1868741 1909971 1952286 1997254 2043829 2088535 2129797
56028 2129797 2168602 2205202 2238912 2270953 2303637 2336821 2368909 2401058 2436460 2475715 2517012
56017 2517012 2560554 2608561 2661075 2716134 2773942 2836459 2903109 2971487 3042090 3117644 3198037
56006 3198037 3280853 3366596 3458214 3555700 3656604 3761676 3874338 3994713 4119997 4250626
55996 4250626 4389958 4537951 4691687 4852317 5024802 5210501 5406861 5614663 5838415
55987 5838415 6079199 6334645 6606482 6900499 7218683 7559518 7926519 8327925 8767528
55978 8767528 9244916 9765281 10339287 10972765 11667292 12432206 13285299 14241022 15310607
55969 15310607 16516145 17892920 19477356 21307750 23440833 25955695 28942446 32505343
$$ packed form
56039A701748K8737K9677L2056L6459M0064M1230M2315M4968M6575M4706M1262
56028B129797L8805L6600L3710L2041L2684L3184L2088L2149L5402L9255M1297
56017B517012M3542M8007N2514N5059N7808O2517O6650O8378P0603P5554Q0393
56006C198037Q2816Q5743R1618R7486J00904J05072J12662J20375J25284J30629
55996D250626J39332J47993J53736J60630J72485J85699J96360K07802K23752
55987E838415K40784K55446K71837K94017L18184L40835L67001M01406M39603
55978H767528M77388N20365N74006O33478O94527P64914Q53093R55723J069585
55969A5310607J205538J376775J584436J830394K133083K514862K986751L562897
$$ plain form
55961 32505343 36779627 41924993 48094903 55426057 64056731 74133423 85800342 99209218
55953 99209218 114532697 131917708 151408201 172957063 196530286 222132509 249652518
55946 249652518 278636209 308078157 336156168 359976672 375798276 380125528 371250735
55939 371250735 350150245 320046486 285051425 248884507 214248021 182763645 155156927
55932 155156927 131524594 111610677 95005760 81242140 69846984 60395708 52537422
55925 52537422 45978892 40468916 35806384 31842035 28457384 25549522 23037203 20862823
55917 20862823 18977151 17330471 15881851 14604202 13473822 12464547 11556299 10739080
55909 10739080 10003520 9336086 8727053 8173893 7672526 7213395 6789692 6401359 6047346
$$ packed form
55961C2505343M274284N145366O169910P331154Q630674J0076692J1666919J3408876
55953I9209218J5323479J7385011J9490493K1548862K3573223K5602223K7520009
55946B49652518K8983691K9441948K8078011K3820504J5821604M327252q874793
55939C71250735k1100490l0103759l4995061l6166918l4636486l1484376k7606718
55932A55156927k3632333j9913917j6604917j3763620j1395156r451276p858286
55925E2537422o558530n509976m662532l964349l384651k907862k512319k174380
55917B0862823j885672j646680j448620j277649j130380j009275r08248q17219
55909A0739080p35560o67434o09033n53160n01367m59131m23703l88333l54013
$$ plain form
55900 6047346 5721550 5419828 5143504 4892330 4660970 4445888 4249001 4071118 3907994
55891 3907994 3756204 3617012 3491385 3376861 3272226 3179758 3100041 3029926 2968181 2917826
55881 2917826 2880310 2852770 2833541 2824943 2827811 2838552 2854544 2877243 2906550 2936675 2960691 2974826
55869 2974826 2975224 2955139 2909326 2838249 2745397 2634052 2509232 2378782 2248983 2121768 1998529
55858 1998529 1883320 1779670 1687520 1606068 1536562 1479543 1432183 1391165 1355844 1326184 1300138
55847 1300138 1275541 1252348 1230878 1210076 1189512 1170783 1154981 1140958 1127819 1116735 1108506
55836 1108506 1101802 1095716 1091656 1090753 1091606 1092515 1093745 1095695 1096935 1095987 1093186 1089104 1082981 1074217 1063476
55821 1063476 1050914 1035417 1016969 997708 979231 961075 943135 927132 914056 902480 891162
$$ packed form
55900F047346l25796l01722k76324k51174k31360k15082j96887j77883j63124
55891C907994j51790j39192j25627j14524j04635r2468p9717p0115o1745n0355
55881B917826l7516k7540j9229q598K868J0741J5992K2699K9307L0125K4016J4135
55869B974826L98k0085m5813p1077r2852j11345j24820j30450j29799j27215j23239
55858A998529j15209j03650r2150q1452o9506n7019m7360m1018l5321k9660k6046
55847A300138k4597k3193k1470k0802k0564j8729j5802j4023j3139j1084q229
55836A108506o704o086m060r03Q53R09J230J950J240r48k801m082o123q764j0741
55821A063476j2562j5497j8448j9261j8477j8156j7940j6003j3076j1576j1318
$$ plain form
55810 891162 881144 873571 867687 862778 859915 859892 861415 863201 865968 870619 876468 883044 891603 902804
55796 902804 914732 925276 934901 945196 956360 968077 981412 997938 1018255 1042937 1073429 1110436
55784 1110436 1152980 1200750 1255821 1320323 1393892 1475079 1563750 1660400 1764607 1875940 1994964
55773 1994964 2121403 2252349 2383622 2511290 2630129 2732103 2808488 2852910 2861546 2832549
55763 2832549 2767460 2671924 2553122 2417305 2270835 2121358 1975492 1836365 1705226 1584020
55753 1584020 1474373 1375501 1285596 1204512 1133025 1070441 1015124 966662 925433 890641 860719
55742 860719 835102 813733 795433 778611 763151 749818 738319 727609 717629 709026 701551 694364
55730 694364 687470 681298 675220 668092 659929 651578 643097 633927 624338 615289 607090 599467 592656 587202
$$ packed form
55810H91162j0018p573n884m909k863k3J523J786K767M651N849O576Q559J1201
55796I02804J1928J0544R625J0295J1164J1717J3335J6526K0317K4682L0492L7007
55784A110436M2544M7770N5071O4502P3569Q1187Q8671R6650J04207J11333J19024
55773A994964J26439J30946J31273J27668J18839J01974P6385M4422Q636k8997
55763B832549o5089r5536j18802j35817j46470j49477j45866j39127j31139j21206
55753A584020j09647r8872q9905q1084p1487o2584n5317m8462m1229l4792k9922
55742H60719k5617k1369j8300j6822j5460j3333j1499j0710r980q603p475p187
55730F94364o894o172o078p128q163q351q481r170r589r049q199p623o811n454
$$ plain form
55716 587202 582988 579537 576856 574972 573208 571032 569019 567894 567287 566622 566435 567487 569323 571109 573220
55701 573220 576472 580315 583336 585198 586724 588459 590467 593112 596696 600695 604617 609213 615604 623682
55687 623682 632687 642757 654423 666981 678913 689758 700174 710418 720055 729006 737557 745550
55675 745550 752777 759918 767849 776254 784255 792215 801684 813748 828776 847634 871671 901312 935842
55662 935842 974785 1018562 1067806 1123044 1185212 1255637 1335372 1425050 1525156 1635768 1756277
55651 1756277 1885946 2024257 2169931 2320043 2470798 2618394 2758052 2882861 2985155
55642 2985155 3059311 3102965 3116550 3103168 3068565 3019870 2964031 2907664 2857218 2817764 2791730
55631 2791730 2779594 2781143 2794934 2817321 2843456 2868890 2888930 2897186 2886531 2851593 2789479 2698961
$$ packed form
55716E87202m214l451k681j884j764k176k013j125o07o65j87J052J836J786K111
55701E73220L252L843L021J862J526J735K008K645L584L999L922M596O391Q078
55687F23682R005J0070J1666J2558J1932J0845J0416J0244R637Q951Q551P993
55675G45550P227P141P931Q405Q001P960R469J2064J5028J8858K4037K9641L4530
55662I35842L8943M3777M9244N5238O2168P0425P9735Q9678J00106J10612J20509
55651A756277J29669J38311J45674J50112J50755J47596J39658J24809J02294
55642B985155P4156M3654J3585j3382l4603m8695n5839n6367n0446l9454k6034
55631B791730j2136J549J3791K2387K6135K5434K0040Q256j0655l4938o2114r0518
$$ plain form
55619 2698961 2581083 2440652 2285489 2123620 1961720 1805411 1659120 1525223 1404398
55610 1404398 1296900 1202518 1119768 1046579 981863 925268 875682 831413 791782 757107 727025
55599 727025 700160 675576 653303 633285 615060 598596 584265 571830 560482 549889 540143 530871
55587 530871 521646 513183 506644 501644 496362 489856 483019 477024 472066 467919 464464 461329 458089 455060
55573 455060 452877 451247 449321 447362 446647 447475 448623 449125 449302 449662 450124 450766 452050 453773 455005 455625
55557 455625 456632 458332 459505 459167 458115 457756 458273 458866 459142 459431 460147 461473 463297 465095 466256 466804
55541 466804 467277 467857 468344 469098 471051 474444 478419 482269 486307 491174 497033 503883 511947 521413 532356
55526 532356 545184 560475 578239 598141 620619 646905 677665 712550 751370 794840 843837
$$ packed form
55619B698961j17878j40431j55163j61869j61900j56309j46291j33897j20825
55610A404398j07498r4382q2750p3189o4716n6595m9586m4269l9631l4675l0082
55599G27025k6865k4584k2273k0018j8225j6464j4331j2435j1348j0593r746r272
55587E30871r225q463o539n000n282o506o837n995m958m147l455l135l240l029
55573D55060k183j630j926j959p15Q28J148N02J77L60M62O42J284J723J232O20
55557D55625J007J700J173l38j052l59N17N93K76K89P16J326J824J798J161N48
55541D66804M73N80M87P54J953L393L975L850M038M867N859O850Q064R466J0943
55526E32356J2828J5291J7764J9902K2478K6286L0760L4885L8820M3470M8997
$$ plain form
55515 843837 898857 960596 1030133 1108049 1194028 1287590 1388315 1494985 1605437 1717597 1829630
55504 1829630 1938604 2040011 2129191 2202225 2254918 2282137 2279409 2244879 2179389 2085791 1969182
55493 1969182 1837004 1697457 1557459 1422132 1295258 1179232 1074907 982275 901240 831420
55483 831420 771675 720416 676173 637608 603532 573335 546966 524127 504008 486147 470850
55472 470850 458225 447354 437040 426945 417458 408901 401375 395035 389930 385763 382148 378794 375338
55459 375338 371455 367373 363710 360542 357312 353902 350947 348563 345642 341252 336094 331677 328380 325252
55445 325252 321534 317530 313966 311141 308895 306985 305278 303713 302189 300559 298857 297421 296528 295982 295424
55430 295424 294876 294518 294130 293472 293100 293848 295382 296293 295967 295523 296401 298765 301782 304669 306873 307970 308168
$$ packed form
55515H43837N5020O1739O9537P7916Q5979R3562J00725J06670J10452J12160J12033
55504A829630J08974J01407Q9180P3034N2693K7219k728l4530o5490r3598j16609
55493A969182j32178j39547j39998j35327j26874j16026j04325r2632q1035o9820
55483H31420n9745n1259m4243l8565l4076l0197k6369k2839k0119j7861j5297
55472D70850j2625j0871j0314j0095r487q557p526o340n105m167l615l354l456
55459C75338l883m082l663l168l230l410k955k384k921m390n158m417l297l128
55445C25252l718m004l564k825k246j910j707j565j524j630j702j436q93n46n58
55430B95424n48l58l88o58l72P48J534R11l26m44Q78K364L017K887K204J097J98
$$ plain form
55413 308168 308476 309646 311265 312326 312356 311541 310243 308859 307753 306805 305385 303190 300723 298614 296867
55398 296867 295130 293236 291111 288738 286603 285593 285921 286654 286754 286098 285076 283885 282786 282354 282672 282720
55382 282720 281424 279054 276888 275724 275377 275410 275713 276381 277441 278672 279430 279036 277624 276272 275869 276212
55366 276212 276565 276645 276600 276491 276365 276537 277195 277990 278448 278529 278387 277925 277108 276328 275937 275679 275091 274228 273497 272998
55346 272998 272565 272273 272434 273160 274228 275249 275811 275718 275288 275080 275189 275197 274950 274774 274724 274345 273558 273050 273320
55327 273320 273946 274363 274661 274978 274793 273667 272203 271430 271534 271898 272022 271732 270911 269790 269145 269448 270097 270181
55309 270181 269673 269051 268187 266615 264738 263728 264092 265139 265988 266474 266956 267828 269381 271605 273979 275759
55293 275759 276549 276387 275505 274328 273438 273091 272988 272889 273157 274186 275655 276894 277692 278165 278163 277510 276625 276201
$$ packed form
55413C08168L08J170J619J061L0q15j298j384j106r48j420k195k467k109j747
55398B96867j737j894k125k373k135j010L28P33J00o56j022j191j099m32L18M8
55382B82720j296k370k166j164l47L3L03O68J060J231P58l94j412j352m03L43
55366B76212L53Q0m5j09j26J72O58P95M58Q1j42m62q17p80l91k58n88q63p31m99
55346B72998m33k92J61P26J068J021N62r3m30k08J09Qk47j76n0l79p87n08K70
55327B73320O26M17K98L17j85j126j464p73J04L64J24k90q21j121o45L03O49Q4
55309B70181n08o22q64j572j877j010L64J047Q49M86M82Q72J553K224K374J780
55293B75759P90j62q82j177q90l47j03r9K68J029J469J239P98M73ko53q85m24
$$ plain form
55275 276201 276386 276841 277376 277909 278076 277637 277105 277118 277285 276492 274484 272385 271438 271806 272790 273677 274129 274164 274062
55256 274062 274106 274383 274863 275437 275701 275061 273472 271690 270357 269233 267899 266747 266429 266662 266523 265849 265458
55239 265458 265878 266710 267395 267895 268362 268697 268750 268549 268200 267869 267864 268336 268983 269418 269729 270233 270878 271406 271921 272633
55219 272633 273199 273033 272251 271594 271429 271488 271596 271927 272424 272709 272714 272736 272757 272426 271889 271846 272466 272922 272460 271365
55199 271365 270434 269987 269853 269917 270131 270191 269670 268436 266730 264934 263417 262441 262084 262312 263139 264505 266026
55182 266026 267141 267574 267494 267243 267098 267254 267733 268315 268791 269218 269761 270409 271150 272208 273725 275363 276644
55165 276644 277619 278773 280310 281904 283127 283806 284034 284139 284476 284907 284736 283631 282366 282054 282750 283415 283218
55148 283218 282303 281240 280314 279495 278701 277895 277159 276598 276013 274984 273614 272793 273170 274198 274868 275068 275439
$$ packed form
55275B76201J85M55N35N33J67m39n32J3J67p93k008k099r47L68R84Q87M52L5j02
55256B74062M4K77M80N74K64o40j589j782j333j124j334j152l18K33j39o74l91
55239B65458M20Q32O85N00M67L35N3k01l49l31nM72O47M35L11N04O45N28N15P12
55219B72633N66j66p82o57j65N9J08L31M97K85NK2K1l31n37m3O20M56m62j095
55199B71365r31m47j34O4K14O0n21j234j706j796j517r76l57K28Q27J366J521
55182B66026J115M33q0k51j45J56M79N82M76M27N43O48P41J058J517J638J281
55165B76644R75J154J537J594J223O79K28J05L37M31j71j105j265l12O96O65j97
55148B83218r15j063r26q19p94q06p36n61n85j029j370q21L77J028O70K00L71
$$ plain form
55131 275439 276156 276742 277028 277408 278070 278764 279417 280195 280876 280887 280136 279176 278470 278080 278049 278340 278451 277920 277154
55112 277154 276958 277227 277149 276697 276736 277448 277913 277727 277786 278750 279793 279779 278853 277949 277430 277134 277205 277884 278800 279312
55092 279312 279392 279473 279656 279669 279466 279247 279065 278858 278763 278952 279323 279645 279776 279518 278634 277443 276957 277887 279753
55073 279753 281386 282068 281818 280902 279620 278408 277622 277282 277220 277304 277289 276852 276086 275618 275802 276160 276103 275868 276178
55054 276178 277184 278332 279158 279757 280463 281485 282785 284005 284570 284180 283138 282011 281144 280717 280962 281836
55038 281836 282703 282866 282447 282342 283253 285034 287047 288862 290447 291833 292777 292928 292357 291732 291702 292194 292627
55021 292627 292687 292497 292085 291306 290371 289819 289726 289546 289048 288784 289163 289620 289289 288107 286678 285454 284623 284518
55003 284518 285374 286811 288145 289183 290184 291094 291400 290844 289807 288845 288183 287799 287737 288128 288973 289971 290640
$$ packed form
55131B75439P17N86K86L80O62O94O53P78O81J1p51r60p06l90l1K91J11n31p66
55112B77154j96K69p8m52L9P12M65j86N9R64J043j4r26r04n19k96P1O79R16N12
55092B79312Q0Q1J83J3k03k19j82k07r5J89L71L22J31k58q84j191m86R30J866
55073B79753J633O82k50r16j282j212p86l40o2Q4j5m37p66m68J84L58n7k35L10
55054B76178J006J148Q26N99P06J022J300J220N65l90j042j127q67m27K45Q74
55038B81836Q67J63m19j05R11J781K013J815J585J386R44J51n71o25l0M92M33
55021B92627O0j90m12p79r35n52r3j80m98k64L79M57l31j182j429j224q31j05
55003B84518Q56J437J334J038J001R10L06n56j037r62o62l84o2L91Q45R98O69
$$ plain form
54986 290640 290754 290672 291032 291993 293075 293868 294559 295499 296533 297122 296990 296410 296014 296519 298313 301054 303787
54969 303787 305709 306684 306932 306639 306191 306339 307669 309989 312568 314835 316669 318337 320452 323628 327763
54954 327763 331957 335580 339149 343613 349030 354546 359603 364476 369530 374432 378381 380838 381871 381877 381086
54939 381086 379275 376001 371162 365223 358821 352423 346486 341618 338173 335795 333633 330983 327680 324090
54925 324090 320875 318523 316890 315431 314025 313227 313485 314511 315812 317452 319840 322956 326251 329218 331831
54910 331831 334585 338315 343612 350080 356406 361488 365252 368198 370716 373195 376152 379465 381908 382285
54896 382285 380804 378541 375740 371608 365834 359399 353519 348427 343558 338470 333228 328268 324184 321438
54882 321438 319986 319289 318801 318322 317860 317381 316788 316009 315050 313992 312890 311636 310107 308488 307170 306238
$$ packed form
54986B90640J14q2L60R61J082P93O91R40J034N89j32n80l96N05J794K741K733
54969C03787J922R75K48k93m48J48J330K320K579K267J834J668K115L176M135
54954C27763M194L623L569M464N417N516N057M873N054M902L949K457J033Op91
54939C81086j811l274m839n939o402o398n937m868l445k378k162k650l303l590
54925C24090l215k352j633j459j406p98K58J026J301J640K388L116L295K967K613
54910C31831K754L730N297O468O326N082L764K946K518K479K957L313K443L77
54896C82285j481k263k801m132n774o435n880n092m869n088n242m960m084k746
54882C21438j452o97m88m79m62m79n93p79r59j058j102j254j529j619j318r32
$$ plain form
54866 306238 305413 304660 304378 304645 304766 304095 302941 302104 301818 301743 301731 301931 302290 302637 303115 303958 304950 305694 306268
54847 306268 306981 307596 307515 306611 305166 303152 300452 297739 296107 295619 295147 294047 293070 293145 294097 295265 296739
54830 296739 299167 302613 306268 309199 311013 311976 312799 314090 315701 316820 316960 316607 316596 317094 317560 317521 317097
54813 317097 316806 317063 317824 318693 319441 320316 321623 323192 324714 326508 329312 333212 337367 341047 344372 347826
54797 347826 351666 356158 361637 367790 373436 377784 381459 385573 390055 393702 395737 396493 396451 395384 392780
54782 392780 388585 383159 376818 369846 362805 356516 351608 348124 345583 343452 341564 340079 339157 338904 339530
54767 339530 341183 343465 345542 347017 348346 350051 351842 353076 353878 355247 358028 362192 367120 372071
54753 372071 376410 379989 383499 387895 393121 397834 400809 402272 403361 404535 405066 404060 401347 397201
$$ packed form
54866C06238q25p53k82K67J21o71j154q37k86p5j2K00L59L47M78Q43R92P44N74
54847C06268P13O15q1r04j445k014k700k713j632m88m72j100r77P5R52J168J474
54830B96739K428L446L655K931J814R63Q23J291J611J119J40l53j1M98M66l9m24
54813C17097k91K57P61Q69P48Q75J307J569J522J794K804L900M155L680L325L454
54797C47826L840M492N479O153N646M348L675M114M482L647K035P56m2j067k604
54782C92780m195n426o341o972p041o289m908l484k541k131j888j485r22k53O26
54767C39530J653K282K077J475J329J705J791J234Q02J369K781M164M928M951
54753C72071M339L579L510M396N226M713K975J463J089J174N31j006k713m146
$$ plain form
54739 397201 391708 384877 377223 369782 363404 358117 353282 348416 343836 340408 338514 337404 335807 333217
54725 333217 330295 327962 326432 325326 324298 323137 321572 319619 318083 317973 319180 320235 319745 317818 315778
54710 315778 314793 315067 316048 316939 317119 316529 315757 315537 316099 317050 317781 317892 317419 316874 316908 317714 318836 319678 319968
54691 319968 319646 318719 317634 317352 318403 320022 320903 320811 320785 321649 322978 323867 324107 324128 324138 323867 323044 321666
54673 321666 319853 317836 316178 315586 316230 317382 318078 318191 318633 320286 322866 325112 326109 326154 326194 326718 327429
54656 327429 327819 327754 327576 327789 328583 329548 330028 329879 329616 329588 329430 328669 327599 326962 326972 327274 327780 328855 330499
54637 330499 332002 332777 333083 333520 334117 334375 334113 333777 333813 333989 333673 332815 332346 333250 335281 337053 337618 337506
54619 337506 337860 338934 340032 340686 341199 342033 343237 344582 345756 346351 346123 345406 344783 344239 343117 341064
$$ packed form
54739C97201n493o831p654p441o378n287m835m866m580l428j894j110j597k590
54725C33217k922k333j530j106j028j161j565j953j536j10J207J055m90j927k040
54710C15778r85K74R81Q91J80n90p72k20N62R51P31J11m73n45L4Q06J122Q42K90
54691C19968l22r27j085k82J051J619Q81r2k6Q64J329Q89K40K1J0k71q23j378
54673C21666j813k017j658n92O44J152O96J13M42J653K580K246R97M5M0N24P11
54656C27429L90o5j78K13P94R65M80j49k63k8j58p61j070o37J0L02N06J075J644
54637C30499J503P75L06M37N97K58k62l36L6J76l16q58m69R04K031J772N65j12
54619C37506L54J074J098O54N13Q34J204J345J174N95k28p17o23n44j122k053
$$ plain form
54603 341064 338523 336069 333751 331488 329691 329040 329733 331245 332728 333526 333502 333044 332695 332751 333303 334488 336258
54586 336258 338003 338949 339104 339274 339978 340809 341141 340994 340812 340784 340795 340792 340854 341056 341555 342555 343942 345176 345840
54567 345840 346095 346345 346705 347040 347221 347061 346336 345253 344629 345120 346383 347471 347965 348281 348926 349886 350866 351730
54549 351730 352488 353055 353279 353189 353099 353360 354003 354668 355000 355048 355092 355115 354778 353998 353332 353500 354633 356092 356942 356664
54529 356664 355590 354667 354564 354971 355054 354561 354117 354291 354865 355289 355467 355733 356278 356969 357592 358016 358265 358632 359507
54510 359507 360816 361847 361968 361437 361204 361919 363321 364570 365067 364985 365112 366083 367790 369628 371256 372827
54494 372827 374536 376396 378592 381560 385426 389710 393901 398048 402499 407324 412336 417474 422787 428190
54480 428190 433441 438312 442642 446418 449836 452968 455248 455727 454070 450919 447096 442870 438294 433698
$$ packed form
54603C41064k541k454k318k263j797o51O93J512J483P98k4m58l49N6N52J185J770
54586C36258J745R46J55J70P04Q31L32j47j82k8J1lO2K02M99J000J387J234O64
54567C45840K55K50L60L35J81j60p25j083o24M91J263J088M94L16O45R60R80Q64
54549C51730P58N67K24r0r0K61O43O65L32M8M4K3l37p80o66J68J133J459Q50k78
54529C56664j074r23j03M07Q3m93m44J74N74M24J78K66N45O91O23M24K49L67Q75
54510C59507J309J031J21n31k33P15J402J249M97q2J27R71J707J838J628J571
54494C72827J709J860K196K968L866M284M191M147M451M825N012N138N313N403
54480D28190N251M871M330L776L418L132K280M79j657l151l823m226m576m596
$$ plain form
54466 433698 429358 425085 420660 416331 412325 408305 403891 399436 395581 392248 388822 385265 382244 380100
54452 380100 378372 376585 374887 373656 372926 372580 372697 373288 373876 373718 372511 370710 369127 368206 367784 367557
54436 367557 367582 368082 368848 369293 369221 369040 369000 368698 367777 366644 365978 365857 365944 366238 366964 367893 368473 368644 368919 369605
54416 369605 370446 371071 371302 371013 370207 369325 368986 369300 369854 370342 370767 370988 370655 369763 368778 368040 367461 366987 366877
54397 366877 367315 368142 369230 370771 372962 375648 378416 380789 382314 382904 383224 384272 386357 388801 390800
54382 390800 392248 393584 395329 397938 401582 405694 409209 411722 414058 417301 421541 425984 429880 432768
54368 432768 434064 433259 430708 427676 425340 423958 423030 421853 419782 416445 412118 407720 404044 401041 398176
54353 398176 395434 393496 392759 392611 392160 391460 391433 392496 393833 394270 393457 391832 389842 387752 385986 384976
$$ packed form
54466D33698m340m273m425m329m006m020m414m455l855l333l426l557l021k144
54452C80100j728j787j698j231p30l46J17N91N88j58j207j801j583r21m22k27
54436C67557K5N00P66M45p2j81m0l02r21j133o66j21Q7K94P26R29N80J71K75O86
54416C69605Q41O25K31k89q06q82l39L14N54M88M25K21l33q92r85p38n79m74j10
54397C66877M38Q27J088J541K191K686K768K373J525N90L20J048K085K444J999
54382C90800J448J336J745K609L644M112L515K513K336L243M240M443L896K888
54368D32768J296q05k551l032k336j382r28j177k071l337m327m398l676l003k865
54353C98176k742j938p37j48m51p00k7J063J337M37q13j625j990k090j766j010
$$ plain form
54337 384976 384544 383904 382458 380374 378352 377023 376600 376751 376759 376088 374874 373636 372536 371309 369951 369027
54321 369027 369002 369592 370083 370149 370034 370056 370241 370519 371006 371855 372809 373183 372536 371328 370585 370844 371700 372541 373393
54302 373393 374724 376687 378838 380453 380861 379781 377693 375622 374134 372840 371267 369771 368919 368379 367356
54287 367356 365913 364858 364275 363259 361360 359268 357683 356510 355720 356021 357739 359828 360996 361398 362189
54272 362189 363612 364584 364208 362841 361434 360444 359728 359086 358600 358588 359301 360531 361626 362148 362385 362888 363657
54255 363657 364185 364254 364233 364477 364851 364964 364610 363846 362851 361837 360940 360146 359409 358825 358546 358616 359091 360142 361701
54236 361701 363095 363499 362885 362174 362204 362875 363520 363815 363978 364198 364297 364018 363375 362597 361958 361778 362396 363831 365608
54217 365608 367188 368632 370474 372804 374837 375743 375728 375815 376573 377461 377548 376602 375287 374550 375004 376749 379513
$$ packed form
54337C84976m32o40j446k084k022j329m23J51Qo71j214j238j100j227j358r24
54321C69027k5N90M91O6j15K2J85K78M87Q49R54L74o47j208p43K59Q56Q41Q52
54302C73393J331J963K151J615M08j080k088k071j488j294j573j496q52n40j023
54287C67356j443j055n83j016j899k092j585j173p90L01J718K089J168M02P91
54272C62189J423R72l76j367j407r90p16o42m86j2P13J230J095N22K37N03P69
54255C63657N28O9k1K44L74J13l54p64r95j014q97p94p37n84k79P0M75J051J559
54236C61701J394M04o14p11L0O71O45K95J63K20R9k79o43p78o39j80O18J435J777
54217C65608J580J444J842K330K033R06j5Q7P58Q88Q7r46j315p37M54J745K764
$$ plain form
54200 379513 382920 386699 390676 394712 398820 403292 408461 414263 420146 425356 429232 431434 432250 432496 432611
54185 432611 431857 429023 424036 418303 413162 408577 403720 398353 393061 388435 384615 381492 378864 376474
54171 376474 374287 372687 372019 372026 372075 371911 371779 371848 371857 371405 370303 368652 366831 365428 364906 365252 366066 366960 367777
54152 367777 368572 369573 370986 372627 373914 374486 374655 374926 375271 375338 375174 375232 375643 376060 376324 376797 377766 378897
54134 378897 379589 379676 379526 379596 380052 380752 381400 381760 381744 381369 380742 380206 380234 380956 381938 382730 383489 384635 386039
54115 386039 387058 387380 387339 387359 387613 388331 389775 391591 392788 392890 392692 393313 394861 396633 398403 400721 403937
54098 403937 407580 410941 413822 416496 419273 422369 425984 430238 435180 440936 447739 455768 465126 475970
54084 475970 488331 501770 515555 529348 543388 557838 572336 586556 600774 615280 629414
$$ packed form
54200C79513L407L779L977M036M108M472N169N802N883N210L876K202Q16K46J15
54185D32611p54k834m987n733n141m585m857n367n292m626l820l123k628k390
54171C76474k187j600o68PM9j64j32O9Rm52j102j651j821j403n22L46Q14Q94Q17
54152C67777P95J001J413J641J287N72J69K71L45O7j64N8M11M17K64M73R69J131
54134C78897O92Q7j50P0M56P00O48L60j6l75o27n36K8P22R82P92P59J146J404
54115C86039J019L22m1K0K54P18J444J816J197J02j98O21J548J772J770K318L216
54098D03937L643L361K881K674K777L096L615M254M942N756O803Q029R358J0844
54084D75970J2361J3439J3785J3793J4040J4450J4498J4220J4218J4506J4134
$$ plain form
54073 629414 641718 650975 656525 657586 653072 642514 626730 607231 585325 562138 539092 517681
54061 517681 498789 482530 468667 456820 446469 437283 429493 423576 419482 416512 414015 411885 410304
54048 410304 409308 408762 408530 408502 408601 408801 409036 409187 409372 410084 411649 413643 415305 416517 417884 419751 421786
54031 421786 423724 425906 428637 431487 433754 435375 436871 438562 440247 441541 442285 442742 443623 445570 448352
54016 448352 450828 452048 452099 451573 450704 449552 448564 448174 448041 447474 446523 445840 445513 444927 443966 443458 444053 445419
53998 445419 447003 448857 450996 452462 451956 449278 445481 441605 437826 433877 429717 425567 421713 418509
53984 418509 416305 415039 414076 412706 410801 408797 407072 405590 404167 402819 401599 400270 398528 396592
53970 396592 395180 394711 394894 395371 396368 398163 400120 401016 400479 399536 399415 400256 401309 401974 402222 402308 402578 403441
$$ packed form
54073F29414J2304R257N550J061m514j0558j5784j9499k1906k3187k3046k1411
54061E17681j8892j6259j3863j1847j0351r186p790n917m094k970k497k130j581
54048D10304r96n46k32k8R9K00K35J51J85P12J565J994J662J212J367J867K035
54031D21786J938K182K731K850K267J621J496J691J685J294P44M57Q81J947K782
54016D48352K476J220N1n26q69j152r88l90j33n67r51o83l27n86r61n08N95J366
53998D45419J584J854K139J466n06k678l797l876l779l949m160m150l854l204
53984D18509k204j266r63j370j905k004j725j482j423j348j220j329j742j936
53970C96592j412m69J83M77R97J795J957Q96n37r43j21Q41J053O65K48Q6K70Q63
$$ plain form
53952 403441 405057 407041 408815 410295 412003 414490 417809 421449 424548 426336 426743 426649 427187 428677 430352
53937 430352 431115 430380 428348 425867 424066 423648 424327 425217 425916 426906 428743 431292 434101 437202 441044 445788
53921 445788 451142 456807 462701 468803 475281 482789 492088 503188 515312 527914 541204 555309 569351
53908 569351 581910 592131 599771 604320 604821 600793 592907 582529 570948 559163 547953 537685 528231
53895 528231 519358 511197 504151 498457 494006 490464 487400 484373 481147 477796 474545 471534 468821 466470
53881 466470 464412 462305 459806 456981 454302 452166 450553 449171 447758 446137 444141 441720 439147 436925
53867 436925 435339 434119 432718 430862 428712 426469 424094 421524 418951 416670 414802 413388 412563 412375 412560
53852 412560 412849 413376 414346 415412 415870 415533 414931 414500 414117 413656 413443 413813 414574 415346 416053 416674 416822 416164
$$ packed form
53952D03441J616J984J774J480J708K487L319L640L099J788M07r4N38J490J675
53937D30352P63p35k032k481j801m18O79Q90O99R90J837K549K809L101L842M744
53921D45788N354N665N894O102O478P508R299J1100J2124J2602J3290J4105J4042
53908E69351J2559J0221P640M549N01m028p886j0378j1581j1785j1210j0268r454
53895E28231q873q161p046n694m451l542l064l027l226l351l251l011k713k351
53881D66470k058k107k499k825k679k136j613j382j413j621j996k421k573k222
53867D36925j586j220j401j856k150k243k375k570k573k281j868j414q25j88J85
53852D12560K89N27R70J066M58l37o02m31l83m61k13L70P61P72P07O21J48o58
$$ plain form
53834 416164 415120 414640 415244 416623 418130 419318 420020 420281 420286 420184 419994 419845 420121 421101 422568 424086 425562
53817 425562 427241 429264 431560 434137 437123 440533 444240 448106 451862 455009 457211 458723 460043 461150
53803 461150 461428 460353 457960 454736 451372 448596 446803 445828 445379 445605 446830 448858 451095 453354 455922
53788 455922 458745 461157 462656 463433 463892 464193 464541 465367 466752 468087 468723 468638 468092 467026 465298 463161
53772 463161 460934 458429 455311 451952 449311 447879 447201 446508 445403 443832 441808 439428 436930 434507 432211
53757 432211 430109 428383 427164 426437 426165 426378 427038 427966 428984 429990 430852 431407 431705 432092 432808 433620 434077
53740 434077 434071 433890 433691 433260 432430 431472 430808 430539 430539 430860 431613 432540 433240 433880 435119 437082 438976 440216 441501
53721 441501 444118 448414 453558 458683 463516 467831 471098 473065 474219 475239 476209 476672 476241 474911 472987
$$ packed form
53834D16164j044m80O04J379J507J188P02K61Nj02j90j49K76R80J467J518J476
53817D25562J679K023K296K577K986L410L707L866L756L147K202J512J320J107
53803D61150K78j075k393l224l364k776j793r75m49K26J225K028K237K259K568
53788D55922K823K412J499P77M59L01L48Q26J385J335O36q5n46j066j728k137
53772D63161k227k505l118l359k641j432o78o93j105j571k024k380k498k423k296
53757D32211k102j726j219p27k72K13O60R28J018J006Q62N55K98L87P16Q12M57
53740D34077oj81j99m31q30r58o64k69%L21P53R27P00O40J239J963J894J240J285
53721D41501K617M296N144N125M833M315L267J967J154J020R70M63m31j330j924
$$ plain form
53706 472987 470909 468992 467097 464758 461754 458402 455153 452156 449406 447069 445409 444546 444512 445354 446959
53691 446959 448953 451027 453232 455659 457930 459355 459656 459328 459198 459742 460852 462135 463283 464165 464706 464917
53675 464917 465090 465720 466943 468214 468834 468777 468706 469227 470460 472242 474268 475920 476465 475714 474218 472628 471214
53658 471214 470108 469555 469589 469842 470028 470307 470840 471319 471352 471035 470692 470300 469669 469068 469067 469728 470379 470325 469534 468576
53638 468576 468098 468340 468945 469249 468888 468042 466980 465641 463935 462221 461054 460606 460644 460954 461436 461947 462493
53621 462493 463488 465320 467718 469952 471649 472959 474000 474715 475340 476381 477918 479506 480996 482927 485715
53606 485715 488923 491785 494083 496052 497724 499031 500387 502515 505551 508839 511804 514657 517969 521861
53592 521861 525982 530087 534200 538152 541394 543572 545136 547040 549825 553201 556550 559548 562203 564580
$$ packed form
53706D72987k078j917j895k339l004l352l249k997k750k337j660q63l4Q42J605
53691D46959J994K074K205K427K271J425L01l28j30N44J110J283J148Q82N41K11
53675D64917J73O30J223J271O20n7p1N21J233J782K026J652N45p51j496j590j414
53658D71214j106n53L4K53J86K79N33M79L3l17l43l92o31o01jO61O51n4p91r58
53638D68576m78K42O05L04l61q46j062j339j706j714j167m48L8L10M82N11N46
53621D62493R95J832K398K234J697J310J041P15O25J041J537J588J490J931K788
53606D85715L208K862K298J969J672J307J356K128L036L288K965K853L312L892
53592E21861M121M105M113L952L242K178J564J904K785L376L349K998K655K377
$$ plain form
53578 564580 566762 568874 570795 571984 571954 570922 569612 568345 566663 564039 560651 557177 554021 551100 548308
53563 548308 545816 543747 541770 539293 536153 532966 530676 529706 529615 529614 529336 528985 528833 528782 528522 527974 527432 527301
53545 527301 527862 529268 531532 534256 536541 537518 537247 536834 537431 539194 541495 544046 547329 551822 557235
53530 557235 562830 568243 573675 579407 585443 591601 597717 603727 609610 615182 619952 623477 626027 628623
53516 628623 632128 636534 641365 646562 652554 659675 667982 677534 688326 699925 711683 723419 735550
53503 735550 748470 762192 776739 792407 809361 827224 845317 863140 880554 897758 915172
53492 915172 933029 950938 968230 984898 1001800 1019634 1038150 1056741 1075379 1094405 1113635
53481 1113635 1132393 1150393 1167932 1185067 1201132 1215454 1228188 1240185 1252234 1264678 1277445
$$ packed form
53578E64580K182K112J921J189l0j032j310j267j682k624l388l474l156k921k792
53563E48308k492k069j977k477l140l187k290r70r1jk78l51j52n1k60n48n42j31
53545E27301N61J406K264K724K285R77k71m13N97J763K301K551L283M493N413
53530E57235N595N413N432N732O036O158O116O010N883N572M770L525K550K596
53516F28623L505M406M831N197N992P121Q307R552J0792J1599J1758J1736J2131
53503G35550J2920J3722J4547J5668J6954J7863J8093J7823J7414J7204J7414
53492I15172J7857J7909J7292J6668J6902J7834J8516J8591J8638J9026J9230
53481A113635J8758J8000J7539J7135J6065J4322J2734J1997J2049J2444J2767
$$ plain form
53470 1277445 1290097 1301988 1312737 1322535 1331747 1340269 1347638 1353738 1358935 1363300 1366077 1366367 1364164
53457 1364164 1360367 1355750 1350293 1343583 1335498 1326253 1315991 1304589 1291844 1277789 1262913 1248040
53445 1248040 1233696 1219484 1204359 1187775 1170303 1152903 1135905 1119163 1102948 1087994 1074588
53434 1074588 1062148 1049943 1037730 1025444 1012735 999343 985706 972712 960894 950175 940365
53423 940365 931498 923643 916787 911135 907266 905732 906533 909152 913039 917938 923813 930712 938857 948679
53409 948679 960516 974238 989355 1005608 1023315 1042860 1063883 1085234 1105992 1126487 1148128
53398 1148128 1172131 1198504 1226350 1255014 1284737 1316209 1349758 1385208 1422338 1461144 1501637
53387 1501637 1543712 1587297 1632321 1678297 1724223 1769286 1813628 1858118 1903320 1948892 1993976
$$ packed form
53470A277445J2652J1891J0749R798R212Q522P369O100N197M365K777K90k203
53457A364164l797m617n457o710q085r245j0262j1402j2745j4055j4876j4873
53445A248040j4344j4212j5125j6584j7472j7400j6998j6742j6215j4954j3406
53434A074588j2440j2205j2213j2286j2709j3392j3637j2994j1818j0719r810
53423I40365q867p855o856n652l869j534Q01K619L887M899N875O899Q145R822
53409I48679J1837J3722J5117J6253J7707J9545K1023K1351K0758K0495K1641
53398A148128K4003K6373K7846K8664K9723L1472L3549L5450L7130L8806M0493
53387A501637M2075M3585M5024M5976M5926M5063M4342M4490M5202M5572M5084
$$ plain form
53376 1993976 2037899 2080404 2121438 2160938 2198753 2234564 2267855 2298062 2324928 2348766 2370314
53365 2370314 2390151 2408114 2423342 2434943 2442573 2446369 2446483 2442782 2434896 2422398 2404981 2382582
53353 2382582 2355280 2323107 2286107 2244625 2199297 2150682 2099235 2045826 1991912 1938799 1886886
53342 1886886 1835929 1785803 1736626 1688360 1640828 1594031 1548043 1502740 1458190 1415200 1374776
53331 1374776 1336926 1300587 1264942 1230274 1197315 1166433 1137768 1111571 1087838 1065980 1045408
53320 1045408 1026219 1008911 993696 980507 969390 960311 952738 945925 939631 934124 929551 925746 922699
53307 922699 920782 920391 921607 924230 927907 932244 937119 942935 950230 959009 968716 978925 989826 1001920
53293 1001920 1015450 1030186 1045595 1061210 1077100 1094045 1112944 1133916 1156198 1178989 1202149
$$ packed form
53376A993976M3923M2505M1034L9500L7815L5811L3291L0207K6866K3838K1548
53365B370314J9837J7963J5228J1601P630L796J14l701p886j2498j7417k2399
53353B382582k7302l2173l7000m1482m5328m8615n1447n3409n3914n3113n1913
53342A886886n0957n0126m9177m8266m7532m6797m5988m5303m4550m2990m0424
53331A374776l7850l6339l5645l4668l2959l0882k8665k6197k3733k1858k0572
53320A045408j9189j7308j5215j3189j1117r079p573o813o294n507m573l805l047
53307I22699j917l91J216K623L677M337M875N816P295Q779R707J0209J0901J2094
53293A001920J3530J4736J5409J5615J5890J6945J8899K0972K2282K2791K3160
$$ plain form
53282 1202149 1225853 1249930 1273865 1297364 1320554 1343609 1366416 1388650 1409904 1429647 1447370
53271 1447370 1463043 1477324 1490962 1503929 1515388 1524606 1531602 1536674 1539553 1539511 1536238 1530237 1522229
53258 1522229 1512507 1500975 1487442 1471700 1453596 1433304 1411265 1387670 1362348 1335457 1307911
53247 1307911 1280650 1253676 1226312 1198252 1169840 1141435 1113186 1085474 1058911 1033584 1008815
53236 1008815 984027 959453 935625 912564 889909 867572 845726 824260 802787 781290 760395
53225 760395 740812 722791 706217 691056 677506 665765 655736 646992 639035 631635 624869 618821
53213 618821 613334 608143 603132 598364 593943 589913 586110 582011 577013 571176 565503 561080 558006 555491
53199 555491 552954 550522 548435 546509 544469 542376 540390 538454 536602 535231 534574 534147 533280 532059 531197
$$ packed form
53282A202149K3704K4077K3935K3499K3190K3055K2807K2234K1254J9743J7723
53271A447370J5673J4281J3638J2967J1459R218O996N072K879m2l273o001q008
53258A522229r722j1532j3533j5742j8104k0292k2039k3595k5322k6891k7546
53247A307911k7261k6974k7364k8060k8412k8405k8249k7712k6563k5327k4769
53236A008815k4788k4574k3828k3061k2655k2337k1846k1466k1473k1497k0895
53225G60395j9583j8021j6574j5161j3550j1741j0029q744p957p400o766o048
53213F18821n487n191n011m768m421m030l803m099m998n837n673m423l074k515
53199E55491k537k432k087j926k040k093j986j936j852j371o57m27q67j221q62
$$ plain form
53184 531197 531012 531159 531361 531689 531918 531376 529993 528839 528922 529797 530104 529252 527794 526228 524370 522143 520110
53167 520110 518697 517437 515641 513448 511651 510675 510251 509936 509393 508248 506341 504210 502767 502249 501900 500881
53151 500881 499076 496790 494149 491273 488637 486743 485514 484550 483817 483566 483622 483341 482454 481443 480827 480496
53135 480496 480073 479589 479365 479498 479849 480444 481502 483117 485177 487542 490034 492376 494417 496359 498428 500438
53119 500438 502057 503467 505292 507786 510418 512403 513318 513152 512117 510585 508861 506902 504536 501999 499843
53104 499843 498195 496577 494605 492367 489907 487016 484019 482106 482095 483210 483851 483382 482484 481890 481627 481554
53088 481554 481775 482254 482657 482911 483436 484519 485895 487185 488290 489051 489044 488130 486886 486008 485546 485129 484718 484726
53070 484726 485448 486807 488533 490300 491639 492037 491238 489333 486615 483508 480573 478340 477039 476494 476274
$$ packed form
53184E31197j85J47K02L28K29n42j383j154Q3Q75L07q52j458j566j858k227k033
53167E20110j413j260j796k193j797r76m24l15n43j145j907k131j443n18l49j019
53151E00881j805k286k641k876k636j894j229r64p33k51N6k81q87j011o16l31
53135D80496m23m84k24J33L51N95J058J615K060K365K492K342K041J942K069K010
53119E00438J619J410J825K494K632J985R15j66j035j532j724j959k366k537k156
53104D99843j648j618j972k238k460k891k997j913j1J115O41m69q98n94k63p3
53088D81554K21M79M03K54N25J083J376J290J105P61pr14j244q78m62m17m11Q
53070D84726P22J359J726J767J339L98p99j905k718l107k935k233j301n45k20
$$ plain form
53055 476274 475945 475311 474463 473517 472307 470520 468215 465938 464163 462793 461414 459872 458416 457369 456908
53040 456908 457029 457520 457943 457843 457000 455501 453697 452112 451162 450756 450298 449326 448089 447306 447410 448183 449063
53023 449063 449609 449665 449314 448781 448417 448585 449416 450525 451105 450597 449326 448247 447924 448016 447897 447521 447357 447683
53005 447683 448266 448722 448905 448917 448984 449338 450026 450786 451228 451224 451028 450994 451245 451654 452027 452299 452633 453379 454851 457009
52985 457009 459386 461387 462730 463514 463873 463746 463193 462798 463319 464812 466501 467787 469000 470756 472854 474453
52969 474453 475182 475448 475602 475470 474917 474272 473789 473166 472041 470654 469604 469132 468984 468831 468486 467851 466913 465710
52951 465710 464206 462392 460612 459473 459201 459409 459724 460233 460986 461434 460920 459519 457878 456358 454853 453383
52935 453383 452375 452237 452998 454402 456022 457272 457680 457376 457070 457463 458718 460482 462217 463504 464180 464279
$$ packed form
53055D76274l29o34q48r46j210j787k305k277j775j370j379j542j456j047m61
53040D56908J21M91M23j00q43j499j804j585r50m06m58r72j237p83J04P73Q80
53023D49063N46N6l51n33l64J68Q31J109N80n08j271j079l23R2j19l76j64L26
53005D47683N83M56J83J2O7L54O88P60M42mj96l4K51M09L73K72L34P46J472K158
52985D57009K377K001J343P84L59j27n53l95N21J493J689J286J213J756K098J599
52969D74453P29K66J54j32n53o45m83o23j125j387j050m72j48j53l45o35r38j203
52951D65710j504j814j780j139k72K08L15N09P53M48n14j401j641j520j505j470
52935D53383j008j38P61J404J620J250M08l04l06L93J255J764J735J287O76R9
$$ plain form
52919 464279 463859 462956 461757 460647 460008 460039 460749 461857 462744 462936 462783 463270 464904 467130 469081 470463 471376
52902 471376 471762 471545 470985 470311 469317 467815 466251 465246 464696 463910 462541 460874 459368 458496 458810 460456
52886 460456 462651 464306 465207 465964 466890 467669 468209 468984 470228 471487 472339 473011 473928 475106 476395 477973
52870 477973 480207 483166 486467 489439 491447 492357 492768 493431 494390 494977 494537 492720 489235 484109 478305 473327
52854 473327 469833 467213 464756 462626 461263 460472 459633 458473 457178 456081 455559 455815 456448 456629 456127 455806
52838 455806 456735 459173 462724 466903 471115 474626 477331 480152 483975 488428 492475 495989 499977 505229
52824 505229 511459 517810 523456 527546 529252 528331 525275 520648 514581 507232 499394 492207 486325 481652
52810 481652 477884 475042 473335 472666 472513 472329 471899 471212 470199 468880 467624 466892 466719 466780 466980 467596 468733
$$ packed form
52919D64279m20r03j199j110o39L1P10J108Q87J92j53M87J634K226J951J382R13
52902D71376L86k17n60o74r94j502j564j005n50p86j369j667j506q72L14J646
52886D60456K195J655R01P57R26P79N40P75J244J259Q52O72R17J178J289J578
52870D77973K234K959L301K972K008R10M11O63R59N87m40j817l485n126n804m978
52854D73327l494k620k457k130j363p91q39j160j295j097n22K56O33J81n02l21
52838D55806R29K438L551M179M212L511K705K821L823M453M047L514L988N252
52824E05229O230O351N646M090J706r21l056m627o067p349p838p187n882m673
52810D81652l768k842j707o69j53j84m30o87j013j319j256p32j73O1K00O16J137
$$ plain form
52793 468733 470098 471471 472902 474195 474675 473933 472510 471382 470964 470947 470890 470615 470174 469848 470053 470935 472185
52776 472185 473472 474821 476252 477312 477379 476280 474339 472081 470196 469399 469736 470305 470238 469780 469796 470378 470632
52759 470632 469829 468088 465953 463917 462490 462027 462222 462281 461816 461218 461019 461392 462345 463835 465436 466450 466703
52742 466703 466767 467149 467727 468333 469284 470821 472436 473411 473791 474230 475040 475980 476892 477991 479338 480538 481163
52725 481163 481207 480968 480647 480278 479872 479479 479136 478820 478533 478437 478814 479732 480715 481045 480536 479776 479398 479340 479156 478825
52705 478825 478765 479080 479265 478835 477885 476832 475907 475197 474932 475345 476283 477225 477744 477801 477590 477286 476978 476771 476858
52686 476858 477489 478736 480238 481352 481776 481977 482725 484168 485657 486602 487230 488204 489642 490891 491304 490978
52670 490978 490554 490466 490658 490988 491626 492790 494193 495141 495352 495465 496432 498478 500967 503174 504771 505592 505500
$$ packed form
52793D68733J365J373J431J293M80p42j423j128m18j7n7k75m41l26K05Q82J250
52776D72185J287J349J431J060O7j099j941k258j885p97L37N69o7m58J6N82K54
52759D70632q03j741k135k036j427m63J95N9m65n98j99L73R53J490J601J014K53
52742D66703O4L82N78O06R51J537J615R75L80M39Q10R40R12J099J347J200O25
52725D81163M4k39l21l69m06l93l43l16k87r6L77R18R83L30n09p60l78n8j84l31
52705D78825o0L15J85m30r50j053r25p10k65M13R38R42N19N7k11l04l08k07Q7
52686D76858O31J247J502J114M24K01P48J443J489R45O28R74J438J249M13l26
52670D90978m24q8J92L30O38J164J403R48K11J13R67K046K489K207J597Q21r2
$$ plain form
52653 505500 504749 503987 503474 502668 501144 499572 499160 500203 501861 503426 505154 507620 510798 514204 517555
52638 517555 520875 524054 526606 527852 527290 524984 521671 518297 515329 512663 510185 508067 506418 504957
52624 504957 503296 501379 499522 498187 497741 498153 498794 498864 498208 497486 497405 497988 498690 498981 498711 498195 498026 498455
52606 498455 498922 498566 497272 495729 494396 493080 491762 491059 491342 491974 492071 491617 491273 491504 492497 494485 497374
52589 497374 500328 502457 503735 504584 504889 504292 503251 502749 502851 502541 501307 500029 499811 500551 501287 501537 501753
52572 501753 502563 503940 505167 505528 505037 504397 504147 504126 504038 504148 504829 505689 505927 505501 505147 505196 505192 504887 504727 504952
52552 504952 505027 504572 504263 505133 507284 509835 511812 512688 512452 511717 511501 512373 513966 515679 517527 519778 522156
52535 522156 524121 525847 528181 531489 535131 538240 540633 542692 544695 546537 547966 548907 549555 550231 551167
$$ packed form
52653E05500p51p62n13q06j524j572m12J043J658J565J728K466L178L406L351
52638E17555L320L179K552J246n62k306l313l374k968k666k478k118j649j461
52624E04957j661j917j857j335m46M12O41P0o56p22q1N83P02K91k70n16j69M29
52606D98455M67l56j294j543j333j316j318p03K83O32R7m54l44K31R93J988K889
52589D97374K954K129J278Q49L05n97j041n02J02l10j234j278k18P40P36K50K16
52572E01753Q10J377J227L61m91o40k50k1q8J10O81Q60K38m26l54M9ml05j60K25
52552E04952P5m55l09Q70K151K551J977Q76k36p35k16Q72J593J713J848K251K378
52535E22156J965J726K334L308L642L109K393K059K003J842J429R41O48O76R36
$$ plain form
52520 551167 552437 554095 556191 558547 560673 562124 562884 563245 563385 563166 562257 560334 557312 553549 549691
52505 549691 546168 542987 540077 537598 535700 534275 533248 532852 533175 533617 533326 532183 530866 529919 529241 528632
52489 528632 528329 528627 529386 530393 531908 534274 537082 539341 540703 541989 544169 547178 550239 553064 556117
52474 556117 559684 563333 566582 569600 572842 576282 579420 581796 583100 582999 581352 578557 575180 571323
52460 571323 566826 562019 557656 553941 550247 546118 542061 538916 536803 535148 533561 532239 531508 531340 531366
52445 531366 531222 530858 530578 530737 531331 532026 532596 533185 534069 535364 536993 538741 540295 541545 542855 544709
52429 544709 546897 548467 548767 548251 547967 548491 549608 550830 551926 553075 554716 557061 559642 561637 562826
52414 562826 563899 565622 568100 571135 574757 578899 582991 586546 589900 593656 597582 600706 602380 602524
$$ packed form
52520E51167J270J658K096K356K126J451P60L61J40k19r09j923l022l763l858
52505E49691l523l181k910k479j898j425j027l96L23M42k91j143j317r47o78o09
52489E28632l03K98P59J007J515K366K808K259J362J286K180L009L061K825L053
52474E56117L567L649L249L018L242L440L138K376J304j01j647k795l377l857
52460E71323m497m807m363l715l694m129m057l145k113j655j587j322p31j68K6
52445E31366j44l64k80J59N94O95N70N89Q84J295J629J748J554J250J310J854
52429E44709K188J570L00n16k84N24J117J222J096J149J641K345K581J995J189
52414E62826J073J723K478L035L622M142M092L555L354L756L926L124J674J44
$$ plain form
52400 602524 600941 597312 592091 586576 581648 577041 572250 567582 563787 561105 559340 558530 558853 559937 560934
52385 560934 561476 562124 563650 566167 569188 572352 575841 580123 585455 591621 597951 603489 607237 608531 607346
52370 607346 604243 599968 595146 590302 585927 582313 579401 576971 574887 573006 571012 568721 566500 565007
52356 565007 564405 564184 563898 563745 564133 564975 565768 566253 566633 567158 567822 568521 569294 570257 571472 572955 574726 576809
52338 576809 579309 582476 586534 591364 596575 601965 607660 613553 618886 622831 625464 627730 630304 632875
52324 632875 634736 635683 635924 635500 634418 633280 633151 634588 637278 640738 644896 649696 654669 659380 664021
52309 664021 669047 674415 679698 684823 690135 695690 700993 705582 709365 712166 713432 712812 710802 708434
52295 708434 706455 705088 704280 703751 702902 701280 699255 697797 697354 697364 697151 696967 697658 699576 702310 705405
$$ packed form
52400F02524j583l629n221n515m928m607m791m668l795k682j765q10L23J084R97
52385E60934N42O48J526K517L021L164L489M282N332O166O330N538L748J294j185
52370F07346l103m275m822m844m375l614k912k430k084j881j994k291k221j493
52356E65007o02k21k86j53L88Q42P93M85L80N25O64O99P73R63J215J483J771K083
52338E76809K500L167M058M830N211N390N695N893N333L945K633K266K574K571
52324F32875J861R47K41m24j082j138j29J437K690L460M158M800M973M711M641
52309F64021N026N368N283N125N312N555N303M589L783K801J266o20k010k368
52295G08434j979j367q08n29q49j622k025j458m43J0k13j84O91J918K734L095
$$ plain form
52279 705405 708735 712080 714958 717249 719529 722310 725242 727587 729341 731327 734171 737668 741321 745083
52265 745083 749270 753972 758784 763099 766607 769636 773029 777463 782751 787918 791988 794553 795668 795540
52251 795540 794453 792722 790525 787878 784883 781829 778978 776448 774381 773011 772387 772236 772209 772147 772049 772011 772384
52234 772384 773789 776724 781160 786575 792336 798080 803853 809944 816441 823056 829591 836420 844228 853273
52220 853273 863214 873567 883903 893757 902957 912136 922259 933445 944801 955556 965639 974838
52208 974838 982258 987238 990159 991623 991383 988911 984671 979935 975438 970966 966177 961158 956242 951861
52194 951861 948580 946688 945777 945202 944916 945334 946527 948143 949984 952024 953948 955359 956505 958135 960647
52179 960647 963929 967958 972717 977499 981202 983631 985799 988581 991769 994791 997713 1001000 1004771 1008801
$$ packed form
52279G05405L330L345K878K291K280K781K932K345J754J986K844L497L653L762
52265G45083M187M702M812M315L508L029L393M434N288N167M070K565J115j28
52251G95540j087j731k197k647k995l054k851k530k067j370o24j51k7o2r8l8L73
52234G72384J405K935M436N415N761N744N773O091O497O615O535O829P808R045
52220H53273R941J0353J0336R854R200R179J0123J1186J1356J0755J0083R199
52208I74838P420M980K921J464k40k472m240m736m497m472m789n019m916m381
52194I51861l281j892r11n75k86M18J193J616J841K040J924J411J146J630K512
52179I60647L282M029M759M782L703K429K168K782L188L022K922L287L771M030
$$ plain form
52165 1008801 1012894 1016926 1020717 1024129 1026971 1028773 1029158 1028546 1027901 1027614 1027300 1026907 1027125 1028244 1029436 1029882
52149 1029882 1029876 1029944 1029505 1027471 1023888 1019930 1016403 1013290 1010785 1009703 1010453 1012337 1014329 1016032 1017561 1019053
52133 1019053 1020834 1023714 1028494 1035162 1042904 1050946 1059174 1067949 1077520 1087716 1098128 1108422 1118455
52120 1118455 1128074 1136865 1144024 1148446 1149069 1145380 1137653 1126571 1112740 1096811 1079953 1063626 1048677
52107 1048677 1035000 1022298 1010818 1001053 993135 986985 982785 980820 980990 982972 986771 992673 1000612
52094 1000612 1009970 1019999 1030144 1039949 1049019 1057129 1064104 1069611 1073363 1075606 1077150 1078828 1081104
52081 1081104 1084165 1088072 1092694 1097711 1102775 1107596 1111952 1115796 1119296 1122538 1125224 1126916 1127487 1127007
52067 1127007 1125275 1121961 1117321 1112292 1107585 1103050 1098333 1093895 1090914 1090100 1090957 1092418 1094010 1096190
$$ packed form
52165A008801M093M032L791L412K842J802L85o12o45k87l14l93K18J119J192M46
52149A029882oO8m39k034l583l958l527l113k505j082P50J884J992J703J529J492
52133A019053J781K880M780O668P742Q042Q228Q775R571J0196J0412J0294J0033
52120A118455R619Q791P159M422O23l689p727j1082j3831j5929j6858j6327j4949
52107A048677j3677j2702j1480r765p918o150m200j965J70J982L799N902P939
52094A000612R358J0029J0145R805R070Q110O975N507L752K243J544J678K276
52081A081104L061L907M622N017N064M821M356L844L500L242K686J692N71m80
52067A127007j732l314m640n029m707m535m717m438k981q14Q57J461J592K180
$$ plain form
52053 1096190 1099559 1103988 1108668 1112866 1116394 1119341 1121749 1123780 1125899 1128481 1131267 1133527 1134815 1135325
52039 1135325 1135555 1135907 1136651 1137917 1139565 1141281 1142988 1144985 1147560 1150609 1153786 1156867 1159827 1162715 1165730
52024 1165730 1169373 1174277 1180795 1188841 1198199 1208889 1221093 1234681 1248954 1263001 1276313 1288855
52012 1288855 1300541 1310827 1318939 1324289 1326490 1325277 1320775 1313772 1305253 1295613 1284646 1272363 1259399
51999 1259399 1246365 1233125 1219036 1203784 1187708 1171379 1155093 1138807 1122423 1106151 1090587
51988 1090587 1076340 1063487 1051573 1040323 1030191 1021917 1015530 1009987 1003770 995732 985458 973182
51976 973182 959495 944928 929672 913805 897811 882665 869193 857537 847456 838987 832482 828030
51964 828030 825246 823728 823400 824220 825827 827819 830169 833046 836301 839506 842485 845440 848442 851084 852825
$$ packed form
52053A096190L369M429M680M198L528K947K408K031K119K582K786K260J288N10
52039A135325K30L52P44J266J648J716J707J997K575L049L177L081K960K888L015
52024A165730L643M904O518Q046R358J0690J2204J3588J4273J4047J3312J2542
52012A288855J1686J0286Q112N350K201j213m502p003q519r640j0967j2283j2964
51999A259399j3034j3240j4089j5252j6076j6329j6286j6286j6384j6272j5564
51988A090587j4247j2853j1914j1250j0132q274o387n543o217q038j0274j2276
51976I73182j3687j4567j5256j5867j5994j5146j3472j1656j0081q469o505m452
51964H28030k784j518l28Q20J607J992K350K877L255L205K979K955L002K642J741
$$ plain form
51949 852825 853459 853131 852132 850814 849496 848233 846860 845462 844583 844774 846028 847916 850136 852723 855892
51934 855892 860001 865548 872805 881487 891148 901826 913818 926664 938913 949273 957623 964406 969207
51921 969207 970618 967671 960939 951906 941496 929674 916412 902461 888929 876395 864865 854494
51909 854494 845843 839234 834270 830279 827078 824992 824265 824831 826681 830077 835305 842464 851642 863032
51895 863032 876583 891636 907200 922662 938145 954171 971165 989336 1008922 1030303 1053777
51884 1053777 1079256 1106199 1133751 1160808 1185901 1207180 1222634 1230511 1229671 1219832 1201681 1176792
51872 1176792 1147378 1115943 1084773 1055326 1027975 1002608 979522 959469 942645 927955 913701
51861 913701 898866 883508 868076 852859 838165 824576 812641 802388 793338 785037 777608 771777
$$ packed form
51949H52825O34l28r99j318j318j263j373j398q79J91J254J888K220K587L169
51934H55892M109N547P257Q682R661J0678J1992J2846J2249J0360Q350O783M801
51921I69207J411k947o732r033j0410j1822j3262j3951j3532j2534j1530j0371
51909H54494q651o609m964l991l201k086p27N66J850L396N228P159R178J1390
51895H63032J3551J5053J5564J5462J5483J6026J6994J8171J9586K1381K3474
51884A053777K5479K6943K7552K7057K5093K1279J5454P877q40r839j8151k4889
51872A176792k9414l1435l1170k9447k7351k5367k3086k0053j6824j4690j4254
51861I13701j4835j5358j5432j5217j4694j3589j1935j0253r050q301p429n831
$$ plain form
51849 771777 768241 766897 766833 767300 768507 771178 775466 780746 786433 792425 798572 804273 808971 812612 815198
51834 815198 816196 814954 811553 806712 800893 793983 785923 777179 768421 760130 752681 746445 741451 737210
51820 737210 733249 729770 727486 726777 727235 728103 729011 730193 732066 734732 737960 741627 745935 751014 756371
51805 756371 761165 765156 769036 773503 778233 782222 785056 787386 790064 793292 796849 800775 805367 810658
51791 810658 816304 822018 827803 833618 838948 842823 844288 842911 838895 832708 824665 815007 804247 793044
51777 793044 781612 769749 757837 747411 739963 735225 731335 726906 722374 719011 717144 715901 714471
51764 714471 713034 712399 713172 715369 718576 722254 725975 729452 732369 734303 734916 734276 732935 731661 730949
51749 730949 730683 730321 729574 728882 729049 730427 732664 735189 737657 739893 741897 744080 747081 751014 755239
$$ packed form
51849G71777l536j344o4M67J207K671M288N280N687N992O147N701M698L641K586
51834H15198R98j242l401m841n819o910q060q744q758q291p449o236m994m241
51820G37210l961l479k284p09M58Q68R08J182J873K666L228L667M308N079N357
51805G56371M794L991L880M467M730L989K834K330K678L228L557L926M592N291
51791H10658N646N714N785N815N330L875J465j377m016o187q043r658j0760j1203
51777G93044j1432j1863j1912j0426p448m738l890m429m532l363j867j243j430
51764G14471j437o35P73K197L207L678L721L477K917J934O13o40j341j274p12
51749G30949k66l62p47o92J67J378K237K525K468K236K004K183L001L933M225
$$ plain form
51734 755239 759191 763170 767891 773451 779227 784675 789823 795024 800709 807404 815502 824778 834364 843342
51720 843342 851209 857826 863299 868124 873187 879273 886526 894351 901750 907759 911707 913240 912248 908956
51706 908956 904222 899532 896368 895467 896684 899327 902359 904448 904235 900676 893054 880823 863885 843097
51692 843097 820243 797350 776054 757336 741437 727924 716229 706192 697955 691425 686274 682524
51680 682524 680633 680750 682248 684261 686521 689450 693606 699212 706063 713713 721887 730770 740704 751545
51666 751545 762602 773254 783189 791852 798172 801317 801445 799266 795082 788882 781342 774017 768214 764049
51652 764049 760913 758498 756919 756022 755174 753924 752460 751021 749098 745672 740293 733574 726487 719487 712588
51637 712588 705978 700185 695739 692895 691609 691504 691944 692472 693133 694187 695675 697556 699985 702957 705778
$$ packed form
51734G55239L952L979M721N560N776N448N148N201N685O695Q098R276R586Q978
51720H43342P867O617N473M825N063O086P253P825P399O009L948J533r92l292
51706I08956m734m690l164r01J217K643L032K089k13l559p622j2231j6938k0788
51692H43097k2854k2893k1296j8718j5899j3513j1695j0037q237o530n151l750
51680F82524j891J17J498K013K260K929M156N606O851P650Q174Q883R934J0841
51666G51545J1057J0652R935Q663O320L145J28k179m184o200p540p325n803m165
51652G64049l136k415j579q97q48j250j464j439j923l426n379o719p087p000o899
51637G12588o610n793m446k844j286j05M40N28O61J054J488J881K429K972K821
$$ plain form
51622 705778 707517 708023 708013 708129 708547 709553 711747 715267 719479 723841 728579 733973 739532 744399 748244
51607 748244 751235 753542 755504 757856 761044 764571 767845 771517 777077 785091 794668 804798 815347 826415
51593 826415 837523 848003 857693 866846 875873 885692 897787 913215 931639 951785 972608 993538
51581 993538 1013858 1032534 1048765 1062254 1072964 1080964 1086534 1089959 1091179 1090168 1087874 1086419 1088191
51568 1088191 1094972 1107997 1128198 1155782 1189635 1227607 1267454 1307489 1346635 1384346 1420487
51557 1420487 1454892 1486815 1514879 1537500 1553168 1560487 1558409 1546652 1525651 1496020 1458306 1413399
51545 1413399 1362877 1308655 1252473 1195910 1140600 1088042 1039261 994927 955698 922046 893751
51534 893751 869937 849734 832656 818296 806014 795233 785881 778228 772261 767455 763240 759590 756964
$$ packed form
51622G05778J739N06j0J16M18J006K194L520M212M362M738N394N559M867L845
51607G48244K991K307J962K352L188L527L274L672N560Q014R577J0130J0549J1068
51593H26415J1108J0480R690R153R027R819J2095J5428J8424K0146K0823K0930
51581I93538K0320J8676J6231J3489J0710Q000N570L425J220j011k294j455J772
51568A088191O781J3025K0201K7584L3853L7972L9847M0035L9146L7711L6141
51557A420487L4405L1923K8064K2621J5668P319k078j1757k1001k9631l7714m4907
51545A413399n0522n4222n6182n6563n5310n2558m8781m4334l9229l3652k8295
51534H93751k3814k0203j7078j4360j2282j0781r352p653n967m806m215l650k626
$$ plain form
51521 756964 755672 755491 756043 757320 759391 761606 762714 762142 760770 759937 759911 759897 759391 758761 758399 758059 757450
51504 757450 756977 757331 758510 759701 760112 759747 759477 760497 763528 768237 773454 778087 781859 785251 788981
51489 788981 793604 799216 805269 810842 815363 818916 821766 823789 824573 823748 820890 815391 806976 796470
51475 796470 785679 776241 768529 761608 754249 746174 738453 732557 728956 726821 725096 723553 722599 722560 723581
51460 723581 725987 730171 736153 743641 752511 762844 774489 787044 800429 815132 831568 849141
51448 849141 866008 879789 888816 893061 893988 893368 892187 890592 888511 885810 881891 875579 865880 852979
51434 852979 838490 824595 812710 802849 794311 786882 781055 777139 774710 773183 772368 771971 771048 768687
51420 768687 765030 760950 756850 752462 747811 743562 740194 737478 735039 732919 731295 730161 729605 729976 731398
$$ packed form
51521G56964j292j81N52J277K071K215J108n72j372q33k6j4n06o30l62l40o09
51504G57450m73L54J179J191M11l65k70J020L031M709N217M633L772L392L730
51489G88981M623N612O053N573M521L553K850K023P84q25k858n499q415j0506
51475G96470j0791r438p712o921p359q075p721n896l601k135j725j543r54l9J021
51460G23581K406M184N982P488Q870J0333J1645J2555J3385J4703J6436J7573
51448H49141J6867J3781R027M245R27o20j181j595k081k701l919o312r699j2901
51434H52979j4489j3895j1885r861q538p429n827l916k429j527q15l97r23k361
51420G68687l657m080m100m388m651m249l368k716k439k120j624j134n56L71J422
$$ plain form
51405 731398 733466 735742 738233 741147 744586 748851 754642 762435 771912 782464 794104 807490 823247
51392 823247 841759 863476 888852 917935 950426 986238 1025686 1069117 1116794 1169273 1227330
51381 1227330 1291034 1359016 1428904 1498470 1566222 1630968 1691105 1744435 1788618 1821798 1842896
51370 1842896 1851433 1847195 1830153 1800698 1759824 1709011 1649917 1584257 1513935 1441162 1368266 1297354
51358 1297354 1230136 1167943 1111687 1061681 1017613 978885 945002 915651 890490 869044 850808
51347 850808 835338 822278 811422 802762 796403 792373 790488 790302 791118 792201 793134 793901 794492 794593 793934
51332 793934 792842 792147 792557 794357 797623 802309 808098 814525 821387 828716 836274 843582 850728 858749 868685
51317 868685 880437 892995 905627 918301 930778 941667 948695 949876 944443 932863 916318 896298
$$ packed form
51405G31398K068K276K491K914L439M265N791P793R477J0552J1640J3386J5757
51392H23247J8512K1717K5376K9083L2491L5812L9448M3431M7677N2479N8057
51381A227330O3704O7982O9888O9566O7752O4746O0137N3330M4183L3180K1098
51370A842896Q537m238j7042k9455m0874n0813n9094o5660p0322p2773p2896p0912
51358A297354o7218o2193n6256n0006m4068l8728l3883k9351k5161k1446j8236
51347H50808j5470j3060j0856q660o359m030j885j86Q16J083R33P67N91J01o59
51332G93934j092o95M10J800L266M686N789O427O862P329P558P308P146Q021R936
51317H68685J1752J2558J2632J2674J2477J0889P028J181n433j1580j6545k0020
$$ plain form
51305 896298 874619 853434 834660 819042 805922 794222 783640 774756 768128 763670 760952 759744
51293 759744 760021 761677 764548 768680 774223 780989 788281 795371 802057 808579 815023 820975 825707 828493
51279 828493 828731 826119 821008 814439 807506 800725 794203 788307 783769 781031 779854 779688 780193 781212 782447
51264 782447 783409 783595 782625 780377 777144 773513 769920 766389 762770 759094 755503 751999 748443 744758 741041
51249 741041 737585 734936 733763 734383 736425 739097 741791 744289 746540 748470 750029 751163 751671 751271 749916
51234 749916 747984 746022 744351 742987 741888 741170 741025 741532 742666 744493 747081 750110 752784 754488 755423
51219 755423 756220 756875 756563 754676 751662 748500 745672 743033 740482 738211 736322 734655 733130 731984 731559
51204 731559 732055 733561 736064 739276 742634 745662 748335 751103 754569 759102 764603 770681 777154 784184
$$ packed form
51305H96298k1679k1185j8774j5618j3120j1700j0582q884o628m458k718j208
51293G59744K77J656K871M132N543O766P292P090O686O522O444N952M732K786
51279H28493K38k612n111o569o933o781o522n896m538k738j177j66N05J019J235
51264G82447R62J86r70k248l233l631l593l531l619l676l591l504l556l685l717
51249G41041l456k649j173O20K042K672K694K498K251J930J559J134N08m00j355
51234G49916j932j962j671j364j099p18j45N07J134J827K588L029K674J704R35
51219G55423P97O55l12j887l014l162k828k639k551k271j889j667j525j146m25
51204G31559M96J506K503L212L358L028K673K768L466M533N501O078O473P030
$$ plain form
51190 784184 791732 799092 805434 810843 816280 822249 827903 831802 833285 832675 830405 826521 821093 814527
51176 814527 807166 798884 789494 779453 769881 761805 755512 750580 746314 742195 738226 735011 733304 733224
51162 733224 734040 734889 735678 736996 739188 741822 744184 746072 747847 749843 751978 753960 755684 757339 759212
51147 759212 761388 763617 765463 766594 766843 766016 763920 760833 757846 756388 757265 760283 764741 770096 776060
51132 776060 782371 788751 794963 800645 805111 807580 807738 805904 802586 797969 792005 784872 777172 769659
51118 769659 762968 757568 753713 751210 749341 747279 744675 741790 739098 736865 735167 734132 733980 734760 736061
51103 736061 737123 737340 736753 735982 735631 735892 736762 738369 740777 743596 746182 748347 750563 753305 756451 759494
51087 759494 762085 764086 765356 765880 766089 766597 767503 768203 768086 767304 766626 766582 766920 766963 766412 765709 765596 766375
$$ packed form
51190G84184P548P360O342N409N437N969N654L899J483o10k270l884n428o566
51176H14527p361q282r390j0041r572q076o293m932m266m119l969l215j707q0
51162G33224Q16Q49P89J318K192K634K362J888J775J996K135J982J724J655J873
51147G59212K176K229J846J131K49q27k096l087k987j458Q77L018M458N355N964
51132G76060O311O380O212N682M466K469J58j834l318m617n964p133p700p513
51118G69659o691n400l855k503j869k062k604k885k692k233j698j035j52P80J301
51103G36061J062K17n87p71l51K61Q70J607K408K819K586K165K216K742L146L043
51087G59494K591K001J270N24K09N08R06P00j17p82o78m4L38M3n51p03j13P79
$$ plain form
51069 766375 767700 769065 770364 771870 773692 775449 776600 777118 777729 779348 782289 786217 790904 796756 804343
51054 804343 813537 823512 833581 843705 854209 865436 877839 891787 906808 921374 933982 944357
51042 944357 953089 960223 964847 966185 964494 960599 954975 947694 939030 929630 920113 910744 901493 892272
51028 892272 883235 875070 868847 865276 864024 864007 864429 865421 867721 871906 877971 885430 893750 902800 912935
51013 912935 924503 937285 950626 964207 978380 993559 1009515 1025608 1041496 1057134 1072126
51002 1072126 1085644 1097234 1107314 1116545 1124975 1132182 1138068 1143025 1147316 1150716 1152904 1153868 1153714 1152292
50988 1152292 1149252 1144384 1137749 1129555 1120054 1109490 1097928 1085132 1070720 1054612 1037337 1019863
50976 1019863 1003111 987672 974030 962838 954677 949470 946421 944798 944622 946342 949978 954889 960279
$$ packed form
51069G66375J325J365J299J506J822J757J151N18O11J619K941L928M687N852P587
51054H04343R194R975J0069J0124J0504J1227J2403J3948J5021J4566J2608J0375
51042I44357Q732P134M624J338j691l895n624p281q664r400r517r369r251r221
51028H92272r037q165o223l571j252j7M22R92K300M185O065P459Q320R050J0135
51013I12935J1568J2782J3341J3581J4173J5179J5956J6093J5888J5638J4992
51002A072126J3518J1590J0080R231Q430P207N886M957M291L400K188R64j54j422
50988A152292l040m868o635q194r501j0564j1562j2796j4412j6108j7275j7474
50976A019863j6752j5439j3642j1192q161n207l049j623j76J720L636M911N390
$$ plain form
50963 960279 965584 970418 974567 978203 981768 985445 989000 992354 996119 1001317 1008620 1018021 1029158 1041791
50949 1041791 1055891 1071447 1088329 1106456 1125932 1146610 1167400 1186326 1201571 1212296 1218300
50938 1218300 1219516 1216455 1210712 1204042 1196849 1188454 1178867 1169320 1160639 1152009 1141998 1130144 1116883
50925 1116883 1102619 1087689 1072852 1058878 1045756 1032915 1020126 1007642 995757 984879 975736
50914 975736 968742 963275 958318 953735 950097 947350 944646 941691 939320 938267 938050 937648 936766 935902 935489
50899 935489 935539 935972 936819 938090 939637 941187 942384 942935 942762 941931 940466 938371 935697 932427 928411 923774
50883 923774 919197 915345 912085 908817 905506 902850 901350 900828 900939 901553 902442 903264 904200 906049 909288 913459
50867 913459 917792 921966 925947 929646 933233 937310 942219 947515 952602 957542 962769 968429 974615 981897
$$ packed form
50963I60279N305M834M149L636L565L677L555L354L765N198P303R401J1137J2633
50949A041791J4100J5556J6882J8127J9476K0678K0790J8926J5245J0725O004
50938A218300J216l061n743o670p193q395r587r547q681q630j0011j1854j3261
50925A116883j4264j4930j4837j3974j3122j2841j2789j2484j1885j0878r143
50914I75736o994n467m957m583l638k747k704k955k371j053k17m02q82q64m13
50899I35489N0M33Q47J271J547J550J197N51j73q31j465k095k674l270m016m637
50883I23774m577l852l260l268l311k656j500n22J11O14Q89Q22R36J849L239M171
50867I13459M333M174L981L699L587M077M909N296N087M940N227N660O186P282
$$ plain form
50853 981897 990831 1001078 1011712 1022428 1033804 1046294 1059550 1072908 1086105 1099305 1112716 1126375
50841 1126375 1140168 1153964 1167854 1182176 1197211 1212998 1229630 1247417 1266390 1285946 1305524
50830 1305524 1325533 1347086 1370759 1396072 1422144 1448362 1474347 1499779 1524518 1548533 1571499
50819 1571499 1592644 1611018 1625681 1635819 1641142 1642201 1639745 1633636 1623035 1607939 1589969 1571136
50807 1571136 1552273 1533219 1514137 1495934 1479443 1464819 1451853 1440464 1430773 1423100 1418079 1416397
50795 1416397 1418170 1422760 1429459 1438225 1449486 1463283 1478885 1495306 1511968 1528686 1545130 1560571
50783 1560571 1574216 1585570 1594270 1599724 1601259 1598799 1593219 1585794 1577275 1567561 1556144 1542679 1527046
50770 1527046 1509118 1488714 1465829 1440714 1413663 1384945 1355127 1325336 1296817 1270156 1245156
$$ packed form
50853I81897Q934J0247J0634J0716J1376J2490J3256J3358J3197J3200J3411J3659
50841A126375J3793J3796J3890J4322J5035J5787J6632J7787J8973J9556J9578
50830A305524K0009K1553K3673K5313K6072K6218K5985K5432K4739K4015K2966
50819A571499K1145J8374J4663J0138N323J059k456o109j0601j5096j7970j8833
50807A571136j8863j9054j9082j8203j6491j4624j2966j1389r691p673n021j682
50795A416397J773M590O699Q766J1261J3797J5602J6421J6662J6718J6444J5441
50783A560571J3645J1354Q700N454J535k460n580p425q519r714j1417j3465j5633
50770A527046j7928k0404k2885k5115k7051k8718k9818k9791k8519k6661k5000
$$ plain form
50759 1245156 1221587 1199788 1180318 1163329 1148636 1136289 1126565 1119333 1113871 1109594 1106687 1105655
50747 1105655 1106422 1108263 1110674 1113875 1118232 1123506 1129195 1135532 1143672 1154593 1168193 1183761 1201039
50734 1201039 1220227 1241029 1262336 1283145 1303312 1322995 1341766 1358825 1373950 1387669 1400410
50723 1400410 1411919 1421733 1429817 1436408 1441402 1444304 1444921 1443909 1442388 1441049 1439835 1438659 1438185 1439516
50709 1439516 1443116 1448534 1455371 1464123 1475601 1489703 1505227 1520819 1535749 1549866 1563318 1576442
50697 1576442 1589530 1602468 1614775 1626053 1636273 1645715 1655027 1665315 1677598 1691835 1706838 1721455
50685 1721455 1735617 1750016 1765090 1780744 1796896 1813841 1832104 1852266 1874986 1900941 1930595
50674 1930595 1964079 2001215 2041436 2083760 2127074 2170547 2213600 2255522 2295301 2331973 2365014
$$ packed form
50759A245156k3569k1799j9470j6989j4693j2347r724p232n462m277k907j032
50747A105655P67J841K411L201M357N274N689O337Q140J0921J3600J5568J7278
50734A201039J9188K0802K1307K0809K0167J9683J8771J7059J5125J3719J2741
50723A400410J1509R814Q084O591M994K902O17j012j521j339j214j176m74J331
50709A439516L600N418O837Q752J1478J4102J5524J5592J4930J4117J3452J3124
50697A576442J3088J2938J2307J1278J0220R442R312J0288J2283J4237J5003J4617
50685A721455J4162J4399J5074J5654J6152J6945J8263K0162K2720K5955K9654
50674A930595L3484L7136M0221M2324M3314M3473M3053M1922L9779L6672L3041
$$ plain form
50663 2365014 2394342 2420053 2442141 2460336 2474139 2483194 2487786 2488884 2487494 2483937 2477873 2469013 2457680
50650 2457680 2444662 2430792 2416932 2404231 2394036 2387353 2384551 2385651 2390725 2399936 2413409 2431255
50638 2431255 2453397 2479036 2506501 2534052 2560833 2586630 2610795 2632037 2649451 2663180 2673665
50627 2673665 2680648 2683329 2681102 2673385 2658770 2635089 2600815 2556446 2504613 2449193 2394295 2343464
50615 2343464 2299129 2262429 2233453 2211693 2196446 2187084 2183022 2183389 2186785 2191505 2195981 2198813 2198558
50602 2198558 2193903 2184193 2169433 2149560 2124051 2092606 2056101 2016470 1975578 1934404 1893387 1853294
50590 1853294 1815525 1781559 1752207 1727364 1706406 1688741 1674035 1662104 1652892 1646546 1643183 1642300
50578 1642300 1642574 1642627 1642066 1641535 1641706 1642525 1643551 1644631 1645908 1647409 1649164 1651740 1656129 1662892 1671744 1682276
$$ packed form
50663B365014K9328K5711K2088J8195J3803R055M592J098j390l557o064q860j1333
50650B457680j3018j3870j3860j2701j0195o683k802J100N074R211J3473J7846
50638B431255K2142K5639K7465K7551K6781K5797K4165K1242J7414J3729J0485
50627B673665O983K681k227p717j4615k3681l4274m4369n1833n5420n4898n0831
50615B343464m4335l6700k8976k1760j5247r362m062L67L396M720M476K832k55
50602B198558m655r710j4760j9873k5509l1445l6505l9631m0892m1174m1017m0093
50590A853294l7769l3966k9352k4843k0958j7665j4706j1931r212o346l363q83
50578A642300K74N3n61n31J71Q19J026J080J277J501J755K576M389O763Q852J0532
$$ plain form
50562 1682276 1694763 1709842 1727606 1747519 1769218 1792895 1818793 1846814 1876923 1909536 1945051
50551 1945051 1983222 2023396 2065155 2108261 2152062 2195597 2238486 2281315 2324908 2369515 2414847
50540 2414847 2460533 2506244 2551668 2596615 2640999 2684524 2726736 2767850 2809326 2853242 2901193
50529 2901193 2954030 3012334 3076385 3145559 3218276 3292817 3367897 3442344 3514537 3582338 3643336
50518 3643336 3695191 3736113 3765182 3781845 3785072 3773522 3746782 3705950 3652630 3587889 3512659
50507 3512659 3428791 3338989 3245933 3152048 3059984 2972575 2892147 2820276 2758287 2707466 2668629
50496 2668629 2641813 2626500 2621797 2626390 2638758 2657649 2682019 2710374 2740431 2769424 2794438 2812530
50484 2812530 2821154 2818710 2804365 2777336 2737026 2684129 2621000 2550465 2474681 2395460 2314997 2235498
$$ packed form
50562A682276J2487J5079J7764J9913K1699K3677K5898K8021L0109L2613L5515
50551A945051L8171M0174M1759M3106M3801M3535M2889M2829M3593M4607M5332
50540B414847M5686M5711M5424M4947M4384M3525M2212M1114M1476M3916M7951
50529B901193N2837N8304O4051O9174P2717P4541P5080P4447P2193O7801O0998
50518C643336N1855M0922K9069J6663L227j1550k6740m0832n3320o4741p5230
50507C512659q3868q9802r3056r3885r2064q7409q0428p1871o1989n0821l8837
50496B668629k6816j5313m703M593J2368J8891K4370K8355L0057K8993K5014J8092
50484B812530Q624k444j4345k7029m0310n2897o3129p0535p5784p9221q0463p9499
$$ plain form
50472 2235498 2158330 2084181 2013777 1947736 1885881 1827495 1772473 1721720 1676270 1636456 1601935
50461 1601935 1571991 1545617 1521841 1500426 1482037 1467403 1456414 1448145 1441634 1436534 1433157 1431997
50449 1431997 1433133 1436148 1440709 1447035 1455490 1465796 1476945 1487818 1497458 1504808 1508846 1509387 1507482
50436 1507482 1504800 1502846 1502828 1505714 1511883 1520924 1532256 1545975 1562796 1583247 1607182 1634034 1663227
50423 1663227 1694339 1727160 1761627 1797489 1833945 1869901 1904831 1939300 1974423 2010819 2048262
50412 2048262 2086368 2125325 2165642 2207211 2248960 2289559 2328251 2364732 2398481 2428580 2454148
50401 2454148 2474547 2489086 2496864 2497084 2489364 2473622 2449901 2418462 2379859 2334800 2284132 2229172
50389 2229172 2171924 2114640 2059108 2006384 1957170 1912319 1872992 1840370 1815121 1797048 1785314
$$ packed form
50472B235498p7168p4149p0404o6041o1855n8386n5022n0753m5450l9814l4521
50461A601935k9944k6374k3776k1415j8389j4634j0989q269o511n100l377j160
50449A431997J136L015M561O326Q455J0306J1149J0873R640P350M038N41j905
50436A507482k682j954j8K886O169R041J1332J3719J6821K0451K3935K6852K9193
50423A663227L1112L2821L4467L5862L6456L5956L4930L4469L5123L6396L7443
50412B048262L8106L8957M0317M1569M1749M0599L8692L6481L3749L0099K5568
50401B454148K0399J4539P778K20p720j5742k3721l1439l8603m5059n0668n4960
50389B229172n7248n7284n5532n2724m9214m4851l9327l2622k5249j8073j1734
$$ plain form
50378 1785314 1779112 1778154 1782477 1791762 1804811 1819714 1834662 1848639 1861194 1871542 1878206 1879730 1875327
50365 1875327 1864474 1846359 1820598 1788432 1752307 1713995 1673750 1631521 1588222 1545254 1503422
50354 1503422 1462982 1424345 1387970 1353833 1321670 1291604 1263964 1238647 1215301 1194065 1175460
50343 1175460 1159527 1145677 1133458 1122893 1113954 1106288 1099666 1094187 1089834 1086251 1083220 1080909 1079392
50330 1079392 1078339 1077406 1076628 1076261 1076627 1078322 1082075 1087951 1095078 1102601 1110680 1120121 1131229 1143448
50316 1143448 1156030 1168645 1181318 1194157 1207134 1219881 1231608 1241392 1248604 1253124 1255328 1255915
50304 1255915 1255473 1254011 1251152 1246923 1242110 1237602 1233753 1230650 1228541 1227495 1226958 1226234 1225236 1224275 1223295
50289 1223295 1221936 1220207 1218435 1216608 1214540 1212722 1212175 1213166 1214858 1216641 1219168 1223517 1229860 1237558
$$ packed form
50378A785314o202r58M323R285J3049J4903J4948J3977J2555J0348O664J524m403
50365A875327j0853j8115k5761l2166l6125l8312m0245m2229m3299m2968m1832
50354A503422m0440l8637l6375l4137l2163l0066k7640k5317k3346k1236j8605
50343A175460j5933j3850j2219j0565q939p666o622n479m353l583l031k311j517
50330A079392j053r33p78l67L66J695L753N876P127P523Q079R441J1108J2219
50316A143448J2582J2615J2673J2839J2977J2747J1727R784P212M520K204N87
50304A255915m42j462k859m229m813m508l849l103k109j046n37p24r98r61r80
50289A223295j359j729j772j827k068j818n47R91J692J783K527M349O343P698
$$ plain form
50275 1237558 1246187 1255826 1266525 1278015 1289856 1301554 1312714 1323403 1334030 1344390 1353148 1358873
50263 1358873 1361416 1361797 1360938 1359123 1356444 1352915 1348071 1341246 1332517 1322782 1312699 1302179 1291206 1280568
50249 1280568 1271287 1263718 1257624 1252807 1249279 1247082 1246318 1247130 1249349 1252426 1256069 1260707 1266949 1274808
50235 1274808 1283929 1294441 1307071 1322395 1340351 1360641 1383405 1409372 1439387 1473654 1511417
50224 1511417 1551514 1593287 1636626 1680999 1724943 1766974 1806604 1843868 1878033 1907474 1931013
50213 1931013 1948960 1962769 1973932 1983145 1990010 1993309 1991693 1984132 1969652 1947194 1916419 1878609
50201 1878609 1836101 1790814 1743968 1697163 1652680 1612166 1575754 1543059 1514486 1490759 1471512
50190 1471512 1455123 1439860 1424632 1408806 1392060 1374646 1357324 1340871 1325884 1313012 1302799
$$ packed form
50275A237558Q629R639J0699J1490J1841J1698J1160J0689J0627J0360Q758N725
50263A358873K543L81q59j815k679l529m844o825q729r735j0083j0520j0973j0638
50249A280568r281p569o094m817l528k197p64Q12K219L077L643M638O242P859
50235A274808R121J0512J2630J5324J7956K0290K2764K5967L0015L4267L7763
50224A511417M0097M1773M3339M4373M3944M2031L9630L7264L4165K9441K3539
50213A931013J7947J3809J1163R213O865L299j616p561j4480k2458l0775l7810
50201A878609m2508m5287m6846m6805m4483m0514l6412l2695k8573k3727j9247
50190A471512j6389j5263j5228j5826j6746j7414j7322j6453j4987j2872j0213
$$ plain form
50179 1302799 1295144 1289272 1284470 1280580 1277701 1275766 1274621 1274151 1274031 1273585 1272283 1270365 1268702 1268023 1268417
50164 1268417 1269596 1271478 1274391 1278726 1284441 1291044 1298160 1306059 1315384 1326297 1338073 1349609 1360088
50151 1360088 1368964 1375577 1379300 1380158 1378971 1376684 1373642 1369623 1364386 1358030 1350975 1343854 1337398 1332184
50137 1332184 1328401 1325954 1324779 1324895 1326144 1328052 1330125 1332262 1334800 1338164 1342497 1347587 1353244 1359811
50123 1359811 1368211 1379273 1393065 1409190 1427790 1449847 1476318 1507290 1542353 1581472 1625059
50112 1625059 1673303 1725933 1782727 1843802 1909264 1978842 2051961 2127877 2205587 2283809 2361162
50101 2361162 2436216 2507400 2573273 2633146 2687230 2735997 2779517 2817456 2849323 2874308 2890942
50090 2890942 2897209 2891106 2871112 2836411 2787062 2724176 2649939 2567358 2479659 2389490 2298557 2208219
$$ packed form
50179A302799p655n872m802l890k879j935j145m70j20m46j302j918j663o79L94
50164A268417J179J882K913M335N715O603P116P899R325J0913J1776J1536J0479
50151A360088Q876O613L723Q58j187k287l042m019n237o356p055p121o456n214
50137A332184l783k447j175J16J249J908K073K137K538L364M333N090N657O567
50123A359811Q400J1062J3792J6125J8600K2057K6471L0972L5063L9119M3587
50112A625059M8244N2630N6794O1075O5462O9578P3119P5916P7710P8222P7353
50101B361162P5054P1184O5873N9873N4084M8767M3520L7939L1867K4985J6634
50090B890942O267o103j9994l4701m9349o2886p4237q2581q7699r0169r0933r0338
$$ plain form
50078 2208219 2120341 2037197 1960399 1890360 1826988 1770422 1720677 1677043 1638506 1604612 1575242
50067 1575242 1549618 1526256 1504162 1483502 1464830 1448120 1432999 1419584 1408592 1400686 1396040 1394329
50055 1394329 1394753 1396157 1397610 1398995 1400754 1403098 1405829 1409013 1413189 1418586 1424530 1430173 1435559 1441302
50041 1441302 1447238 1452094 1454774 1455528 1455513 1455598 1455961 1456454 1456898 1457164 1457389 1458012 1459229 1460662 1462025 1463898 1467200
50024 1467200 1471956 1477318 1482907 1489417 1497586 1507168 1517363 1527761 1538358 1548983 1559239 1568821 1577445
50011 1577445 1584580 1589700 1592718 1593812 1592936 1589896 1584887 1578651 1572034 1565675 1560091 1555838 1553421 1553099
49997 1553099 1554726 1557781 1561790 1566961 1574230 1584534 1598213 1615297 1636060 1660879 1689722 1722229
49985 1722229 1758216 1797677 1840224 1884891 1930607 1976580 2022134 2066475 2108831 2148780 2186369
$$ packed form
50078B208219q7878q3144p6798p0039o3372n6566m9745m3634l8537l3894k9370
50067A575242k5624k3362k2094k0660j8672j6710j5121j3415j0992p906m646j711
50055A394329M24J404J453J385J759K344K731L184M176N397N944N643N386N743
50041A441302N936M856K680P54j5Q5L63M93M44K66K25O23J217J433J363J873L302
50024A467200M756N362N589O510Q169R582J0195J0398J0597J0625J0256R582Q624
50011A577445P135N120L018J094q76l040n009o236o617o359n584m253k417l22
49997A553099J627L055M009N171P269J0304J3679J7084K0763K4819K8843L2507
49985A722229L5987L9461M2547M4667M5716M5973M5554M4341M2356L9949L7589
$$ plain form
49974 2186369 2221914 2255596 2287045 2315242 2338772 2356038 2365134 2363951 2350940 2325969 2290285 2245730
49962 2245730 2194175 2137599 2078204 2018093 1958754 1900826 1844315 1789176 1735836 1685134 1637733
49951 1637733 1593803 1553411 1516929 1484701 1456484 1431636 1409843 1391293 1376000 1363214 1351656
49940 1351656 1340249 1328632 1317055 1305873 1295247 1285451 1277297 1271752 1268997 1268309 1269132 1271742 1276451
49927 1276451 1282693 1289606 1297272 1306592 1318050 1331298 1345914 1361778 1378467 1394947 1410187 1423654
49915 1423654 1434997 1443756 1449768 1453560 1455974 1457477 1457820 1456145 1451421 1443152 1431752 1417985 1402151
49902 1402151 1384261 1364912 1345353 1326506 1308474 1291121 1274494 1258439 1242532 1226914 1212714
49891 1212714 1201063 1192034 1185023 1179905 1177277 1177731 1181293 1187389 1194949 1202730 1210039 1217202 1225100 1234295
$$ packed form
49974B186369L5545L3682L1449K8197K3530J7266R096j183j3011k4971l5684m4555
49962B245730n1555n6576n9395o0111n9339n7928n6511n5139n3340n0702m7401
49951A637733m3930m0392l6482l2228k8217k4848k1793j8550j5293j2786j1558
49940A351656j1407j1617j1577j1182j0626r796q154n545k755o88Q23K610M709
49927A276451O242O913P666R320J1458J3248J4616J5864J6689J6480J5240J3467
49915A423654J1343Q759O012L792K414J503L43j675m724q269j1400j3767j5834
49902A402151j7890j9349j9559j8847j8032j7353j6627j6055j5907j5618j4200
49891A212714j1651r029p011n118k628M54L562O096P560P781P309P163P898R195
$$ [...]
##END NTUPLES=NMR SPECTRUM
##END=
