##TITLE=AC1751_05000195609115FOTR0001_9275067_Bt7wbmRs15
##JCAMPDX= 6.0         $$ Bruker NMR JCAMP-DX V2.0
##DATA TYPE= NMR SPECTRUM
##DATA CLASS= NTUPLES
##ORIGIN= BRUKER
##OWNER= Administrator
$$ 1.72 TOPSPIN		Version 2.1
$$ 2015-07-18 17:47:46.494 -0700  Administrator@X
$$ Compression mode = diff/dup
##.OBSERVE FREQUENCY= 400.02188249412
##.OBSERVE NUCLEUS= ^1H
##.ACQUISITION MODE= SIMULTANEOUS (DQD)
##.ACQUISITION SCHEME= undefined
##.AVERAGES= 8
##.DIGITISER RES= 22
##SPECTROMETER/DATA SYSTEM= spect
##.PULSE SEQUENCE= zg30
##.SOLVENT NAME= COFFEE_meoh
##.SHIFT REFERENCE= INTERNAL, COFFEE_meoh, 1, 14.98509
##AUDIT TRAIL= $$ (NUMBER, WHEN, WHO, WHERE, PROCESS, VERSION, WHAT)
$$ ##TITLE= Audit trail, TOPSPIN		Version 2.1
$$ ##JCAMPDX= 5.01
$$ ##ORIGIN= Bruker BioSpin GmbH
$$ ##OWNER= Administrator
$$ $$ E:\/data/COFFEE/nmr/AC1751_05000195609115FOTR0001_9275067_Bt7wbmRs15/30/pdata/1/auditp.txt
$$ ##AUDIT TRAIL=  $$ (NUMBER, WHEN, WHO, WHERE, PROCESS, VERSION, WHAT)
(   1,<2015-07-18 17:47:38.854 -0700>,<Administrator>,<X>,<go>,<TOPSPIN 2.1>,
      <created by zg
	started at 2015-07-18 17:46:32.588 -0700,
	POWCHK enabled, PULCHK disabled,
       configuration hash MD5:
       21 0F 79 D6 B3 7B B4 F6 88 20 88 DB 03 48 BD 9F
       data hash MD5: 64K
       E4 F7 6C 20 EA 14 13 1E 52 65 20 60 18 0F B2 86>)
(   2,<2015-07-18 17:47:42.291 -0700>,<Administrator>,<X>,<proc1d>,<TOPSPIN 2.1>,
      <Start of raw data processing
       efp LB = 0 FT_mod = 6 PKNL = 1 PHC0 = 0 PHC1 = 0 SI = 32K 
       data hash MD5: 32K
       F0 77 36 AE 06 64 38 FF 15 60 94 FF A5 C8 81 B1>)
(   3,<2015-07-18 17:47:42.588 -0700>,<Administrator>,<X>,<proc1d>,<TOPSPIN 2.1>,
      <pk PHC0 = 89.83521 PHC1 = 0 
       data hash MD5: 32K
       5F 82 65 5E A5 1D D4 17 83 8D 0D DA 91 61 C6 50>)
(   4,<2015-07-18 17:47:42.697 -0700>,<Administrator>,<X>,<proc1d>,<TOPSPIN 2.1>,
      <abs ABSG = 1 
       data hash MD5: 32K
       57 07 41 8E CB FD 95 82 FC 18 55 6C 4D 4F 8D 1A>)
(   5,<2015-07-18 17:47:42.775 -0700>,<Administrator>,<X>,<proc1d>,<TOPSPIN 2.1>,
      <abs ABSG = 2 
       data hash MD5: 32K
       CA 14 F2 75 09 9C EE 59 5A E5 E8 0C A0 11 1F A7>)
(   6,<2015-07-18 17:47:42.822 -0700>,<Administrator>,<X>,<proc1d>,<TOPSPIN 2.1>,
      <abs ABSG = 3 
       data hash MD5: 32K
       3D 4E 8C 4C AC 9D 21 62 23 29 A1 B8 55 08 9A CB>)
(   7,<2015-07-18 17:47:42.900 -0700>,<Administrator>,<X>,<proc1d>,<TOPSPIN 2.1>,
      <abs ABSG = 4 
       data hash MD5: 32K
       AC 5A 45 74 77 57 E3 2D D9 D9 9E D7 B0 39 DA B1>)
(   8,<2015-07-18 17:47:42.947 -0700>,<Administrator>,<X>,<proc1d>,<TOPSPIN 2.1>,
      <abs ABSG = 5 
       data hash MD5: 32K
       03 51 F8 42 AF B2 60 01 71 ED 38 3A CF 25 8A 9A>)
$$ ##END=
$$ 
$$ $$ hash MD5
$$ $$ 23 F1 A6 B4 F4 8A BB F0 0F 08 01 34 47 23 7C 62
##$RELAX= 
##$RELAX= 
##$RELAX= 
##$RELAX= 
##$RELAX= 
##$RELAX= 
##$RELAX= 
$$ Bruker specific parameters
$$ --------------------------
##$DU= <E:\>
##$EXPNO= 30
$$ [...]
150 150 150 150 150 150 150 150
##$TP07= 0
##$TPNAME0= <>
##$TPNAME1= <>
##$TPNAME2= <>
##$TPNAME3= <>
##$TPNAME4= <>
##$TPNAME5= <>
##$TPNAME6= <>
##$TPNAME7= <>
##$TPOAL= (0..7)
0.5 0.5 0.5 0.5 0.5 0.5 0.5 0.5
##$TPOFFS= (0..7)
0 0 0 0 0 0 0 0
##$TUNHIN= 0
##$TUNHOUT= 0
##$TUNXOUT= 0
##$USERA1= <user>
##$USERA2= <user>
##$USERA3= <user>
##$USERA4= <user>
##$USERA5= <user>
##$V9= 5
##$VALIST= <valist>
##$VCLIST= <CCCCCCCCCCCCCCC>
##$VD= 0
##$VDLIST= <DDDDDDDDDDDDDDD>
##$VPLIST= <PPPPPPPPPPPPPPP>
##$VTLIST= <TTTTTTTTTTTTTTT>
##$WBST= 2048
##$WBSW= 25
##$XGAIN= (0..3)
0 0 0 0
##$XL= 0
##$YL= 0
##$YMAX_a= 620477
##$YMIN_a= -528450
##$ZGOPTNS= <>
##$ZL1= 120
##$ZL2= 120
##$ZL3= 120
##$ZL4= 120
##$ABSF1= 14.98509
##$ABSF2= -5.573092
##$ABSG= 5
##$ABSL= 3
##$ALPHA= 0
##$AQORDER= 0
##$ASSFAC= 0
##$ASSFACI= 0
##$ASSFACX= 0
##$ASSWID= 0
##$AUNMP= <proc_prof1d_extract_pilot.lims>
##$AXLEFT= 0
##$AXNAME= <>
##$AXNUC= <1H>
##$AXRIGHT= 0
##$AXTYPE= 0
##$AXUNIT= <>
##$AZFE= 0.1
##$AZFW= 0.1
##$BCFW= 0
##$BC_mod= 0
##$BYTORDP= 0
##$COROFFS= 0
##$CY= 15
##$DATMOD= 1
##$DC= 0
##$DFILT= <>
##$DTYPP= 0
##$F1P= 0
##$F2P= 0
##$FCOR= 0.5
##$FTSIZE= 32768
##$FT_mod= 6
##$GAMMA= 0
##$GB= 0
##$INTBC= 1
##$INTSCL= 1
##$ISEN= 128
##$LB= 0
##$LEV0= 0
##$LPBIN= 0
##$MAXI= 10000
##$MC2= 0
##$MEAN= 0
##$ME_mod= 0
##$MI= 0
##$NCOEF= 0
##$NC_proc= -8
##$NLEV= 6
##$NOISF1= 0
##$NOISF2= 0
##$NSP= 0
##$NTH_PI= 0
##$NZP= 0
##$OFFSET= 14.98509
##$PC= 1
##$PHC0= 89.83521
##$PHC1= 0
##$PH_mod= 1
##$PKNL= yes
##$PPARMOD= 0
##$PPDIAG= 0
##$PPIPTYP= 0
##$PPMPNUM= 2147483647
##$PPRESOL= 1
##$PSCAL= 4
##$PSIGN= 0
##$PYNMP= <proc.py>
##$REVERSE= no
##$SF= 400.02
##$SI= 32768
##$SIGF1= 0
##$SIGF2= 0
##$SINO= 400
##$SIOLD= 32768
##$SPECTYP= <>
##$SREGLST= <1H.CDCl3>
##$SSB= 0
##$STSI= 32768
##$STSR= 0
##$SW_p= 8223.68421052631
##$SYMM= 0
##$S_DEV= 0
##$TDeff= 65536
##$TDoff= 0
##$TI= <>
##$TILT= no
##$TM1= 0
##$TM2= 0
##$TOPLEV= 0
##$USERP1= <user>
##$USERP2= <user>
##$USERP3= <user>
##$USERP4= <user>
##$USERP5= <user>
##$WDW= 1
##$XDIM= 32768
##$YMAX_p= 450924245
##$YMIN_p= -699153
##$CURPLOT= <Network HP LaserJet P1505>
##$CURPRIN= <$Network HP LaserJet P1505>
##$DFORMAT= <normdp>
##$LAYOUT= <+/1D_H.xwp>
##$LFORMAT= <normlp>
##$PFORMAT= <normpl>
##$SURQMSG= 1
$$ End of Bruker specific parameters
$$ ---------------------------------
##NTUPLES= NMR SPECTRUM
##VAR_NAME=  FREQUENCY,     SPECTRUM/REAL,   SPECTRUM/IMAG
##SYMBOL=    X,             R,               I
##VAR_TYPE=  INDEPENDENT,   DEPENDENT,       DEPENDENT
##VAR_FORM=  AFFN,          ASDF,            ASDF
##VAR_DIM=   32768,         32768,           32768
##UNITS=     HZ,            ARBITRARY UNITS, ARBITRARY UNITS
##FACTOR=    0.250966925370066, 1,           1
##FIRST=     8223.43324360094, -76987,       -58983
##LAST=      0,             82693,           -26796
##MIN=       0,             -699153,         0
##MAX=       8223.43324360094, 450924245,    0
$$ Real data points
##PAGE= N=1
##DATA TABLE= (X++(R..R)), XYDATA
$$ [...]
19522I3252c35383C46110d986j10494J9490k47067J21978K7428A67214H0564B5313
19510a52290A2783g4818k29381R7543C0318a08285J1289j55248O4516b4667m5258
19499f9925j54555D8110a88403h1251A2928n400J92790d761C4062b00844a2882
19487h2365b7846m5962q2570e8147A12086h0601j7389B49600b7783l35238G17
19475G6849a6788l28407F7982d6189B05396b7479j60475A63285c4539m82628H5963
19463B03368l5695a32911j31081a27942A38047a93351F3233K21810o3794a5606
19452c88841i2829M1458B35325E5790N4308m9528Q7097a56358e2425A32983J5877
19441A48860k1470a67839D46021a78737r7038c9066D2117b486A28936f5523q263
$$ y = [93252, -335383, 346110, -4986, -115480, -95990, -343057, -221079, -193651, 167214, 80564, 25313, -152290, 12783, -74818, -304199, -206656, 30318, -108285, -96996, -252244, -187728, -24667, -69925, -224480, 48110, -188403, -81251, 12928, 7528, 200318, -4761, 34062, -200844, -12882, -82365, -27846, -73808, -156378, -58147, 112086, -80601, -97990, 249600, -27783, -363021, 717, 76849, -16788, -345195, 67982, -46189, 205396, -27479, -187954, 163285, -34539, -517167, 85963, 203368, 167673, -132911, -263992, -127942, 138047, -193351, 63233, 285043, 221249, -15606, -388841, -92829, -51371, 235325, 55790, 110098, 60570, 147667, -156358, -52425, 132983, 148860, 127390, -167839, 446021, -178737, -275775, -39066, 42117, -2486, 128936, -65523, -73786]
19430g3786j96416J25932C2055K72924A01837a54527B69147l0094p9116m3184
19420A16753a24881k8454n7390A07547a83478B73613B9985b02145A69454J27383
19410B96837f283A57335E9252b29202f1630A19935J35132a78496A48088a31317
19399A50657b71989B0010d264A11452l6833c11234f1510r4252P0770B23053c22736
19387a08995F0879b21862f5830l5891A64603l4851A2121J11551k790q975d5417
19375E6121j7951a15431d2990I5570K5885C993g3733k1120J9375B70621b84780
19363b25345A61869a87823k50172a07601A3207b60672L2745B2335N3431a67316
19352b45260D21753F3339j6854A4496a33616e3385E7015N4505c9695o560k8246
$$ y = [-73786, -270202, -144270, 32055, 304979, 101837, -154527, 269147, 239053, 159937, 116753, -124881, -153335, -210725, 107547, -183478, 273613, 29985, -202145, 169454, 296837, -6283, 157335, 59252, -229202, -61630, 119935, 255067, -178496, 148088, -131317, 150657, -271989, 20010, -4264, 111452, 74619, -311234, -61510, -155762, -84992, 223053, -322736, -108995, 60879, -221862, -65830, -101721, 164603, 129752, 12121, 123672, 120882, 111907, -45417, 56121, 38170, -115431, -42990, 95570, 121455, 3993, -73733, -94853, -75478, 270621, -284780, -225345, 161869, -187823, -437995, -107601, 13207, -260672, -227927, 22335, 75766, -167316, -245260, 421753, 63339, 46485, 14496, -133616, -53385, 57015, 111520, -39695, -46255, -74501]
19341g4501o5816G0660j8708b28806R3612o4959i8721l30873i1662j04801A80520
19329d7233k52663D3998j6547Q3045a54608M8355A17420c05916J18631j19069
19319c06354I8621h1968B6896d9881n6800m6632O9955k71473a11444j17811d7153
19307B89550c8626j66947c6467B11267j3077k6401c12330A28464n3888L1322c10082
19295i2665n2837L742k78789a83081A08684A6134a06443D1917d4881B7014a66929
19283A32584c15881E240a53563r465A17442K0783a69989G147J39174a11429A65779
19271A39960a595C6310a48730k61259e1187p633C3404b01273N1453j27253a12292
19259e1297m6052D5972a83056J9100F9509J0820d1240j1446k42558J05600K1478
$$ y = [-74501, -140317, 70660, 51952, -228806, -135194, -200153, -98721, -429594, -91662, -196463, 180520, -47233, -299896, 43998, 27451, 110496, -154608, -106253, 117420, -305916, -187285, -306354, 98621, -81968, 26896, -49881, -106681, -153313, -83358, -354831, -111444, -229255, -47153, 289550, -38626, -205573, -36467, 211267, 198190, 171789, -312330, 128464, 74576, 105898, -310082, -92665, -145502, -141760, -420549, -183081, 108684, 16134, -106443, 41917, -44881, 27014, -166929, 132584, -315881, 5240, -153563, -163028, 117442, 138225, -169989, 7147, 146321, -111429, 165779, 139960, -1595, 36310, -148730, -409989, -51187, -58820, 33404, -201273, -149820, -277073, -112292, -51297, -97349, 45972, -183056, -163956, 69509, 80329, -41240, -52686, -295244, -189644, -168166]
19248a68166M7322o9806h0719A35177E0986f1318H7730j4336J15763a22586E3788
19236a22837D9950O0797c16259d6937j24783k03716E5601R859d5192j87589a04421
19224A11583P6960A2515a9441k0007B35759a1194j69629D5573a50172k27698a2271
19212g5223k53497A0701h9777G2145a15339k19843E4281a19651A0641J39394a56571
19200A97493d46A76060J6617F554L4318a4996o555r8252f357A68387C003b99101
19187a4196j76762o5801h4350c6658J8169q7043I9852P3910j4060i4235A3569
19175c14013d9130E0612j8498c8096C8732b47863C4407R8178j7527A3036a46176
19163d7493J702k54300J40093c893j89212f3291d653k71420a3100j06939E1047
$$ y = [-168166, -120844, -190650, -80719, 135177, 50986, -61318, 87730, 73394, 189157, -122586, 53788, -122837, 49950, 110747, -316259, -46937, -171720, -375436, 55601, 65460, -45192, -232781, -104421, 111583, 188543, 12515, -19441, -39448, 235759, -11194, -180823, 45573, -150172, -377870, -12271, -75223, -328720, 10701, -89777, 72145, -115339, -335182, 54281, -119651, 10641, 150035, -156571, 197493, -446, 176060, 192677, 6554, 40872, -14996, -21551, -119803, -6357, 168387, 3003, -299101, -14196, -190958, -256759, -84350, -36658, -18489, -105532, 99852, 173762, 159702, -94235, 13569, -314013, -49130, 50612, 32114, -38096, 38732, -247863, 34407, 132585, 115058, 13036, -146176, -47493, -45791, -300091, -159998, -3893, -193105, -63291, -4653, -276073, -13100, -120039, 51047]
19151a32987k9918K8510n7436m3632d5969A42400J2722L8921Q2961d41805a29593
19139E3666K29476a34058L0752A02951K02918j47331n4959a21271B6465a02491
19128A84578b14561K8239n3826j067D9488O143a89563R3668p7921j1152b8208
19116e6113j34748c0456j67049A61421B4733d9013m1608m6445a2290C12941a84691
19104b63364a22226k63410h3797A08353C6429M3636A0550b01635A02703a8564
19093a51795A61926b72166e4197J8044A95981a74549c3453B11455e8199B34431
19082a9737B0369f2075A8239f8787m0588k25529N8884A1717P8566R031d2065D35514
19069A26777D4926n020p02b01789D2889d61285a4089j30216l038B42565a00170
$$ y = [-132987, -162905, -134395, -191831, -235463, -45969, 142400, 155122, 194043, 277004, -441805, -129593, 53666, 283142, -134058, -103306, 102951, 305869, 158538, 103579, -121271, 26465, -102491, 184578, -214561, -186322, -240148, -241215, 49488, 55631, -189563, -95895, -173816, -184968, -28208, -56113, -190861, -30456, -197505, 161421, 24733, -49013, -90621, -137066, -12290, 312941, -184691, -263364, -122226, -385636, -83797, 108353, 36429, 80065, 10550, -201635, 102703, -18564, -151795, 161926, -272166, -54197, -36153, 195981, -174549, -33453, 211455, -58199, 234431, -19737, 20369, -62075, 18239, -68787, -109375, -334904, -276020, 11717, 90283, 99314, -42065, 435514, 126777, 44926, 39906, 39204, -201789, 42889, -461285, -14089, -144305, -147343, 242565, -100170]
19057b27165A33261g7083P62j20182j88559G0612J19892f7310J8036p0842A21991
19045b24381N5541d8097C2921c8612m0653a6247A31714J31517b42821d1609j64769
19034b06378b772l6754A62256h3693G5967k4077K2873a81982h8005r6835D0449
19022e4862B80091D1543a18464A4466K24165m8184b22372e2173e535A62492a83354
19010b63171B51366b79744a27327j79366D9299a77511a5230j25933r0498h0793
18999B4383c13984J10764F7067M3014a81853q25i03j67503b7543B74214F2166
18987e4792j59214J3432j0315E0547L0670d1523n8379n6736F3880J97585i8211
18975F7127O0944a06933m7887A13254b76961C02572C7980b67125j19054a21126
$$ y = [-227165, 133261, -77083, -76321, -196503, -385062, 70612, 190504, -67310, -49274, -120116, 121991, -224381, -168840, -48097, 32921, -38612, -79265, -16247, 131714, 263231, -242821, -41609, -206378, -2772, -39526, 162256, -83693, 75967, 51890, 74763, -181982, -88005, -184840, 40449, -54862, 280091, 41543, -118464, 14466, 238631, 190447, -222372, -52173, -5535, 162492, -183354, -263171, 251366, -279744, -127327, -306693, 49299, -177511, -15230, -141163, -231661, -80793, 24383, -313984, -203220, 67067, 110081, -181853, -182678, -903, -168406, -27543, 274214, 62166, -54792, -214006, -200574, -210889, 50547, 81217, -41523, -99902, -156638, 63880, 261465, -98211, 67127, 128071, -106933, -154820, 113254, -276961, 302572, 37980, -267125, -386179, -121126]
18964A13646l6566e5498j02952I5882J77550g7746f972r3621l4638B46020H5194
18952A7920a68770B9175J55377g0755A0008a84162C5916b16628f6538J2394A14072
18940f5730K6001A11064K8446A6270b22898A20388b4802J369A06339a80993d9829
18928b42011D179e3518k40138g2096B87589a79032a3261j29894e2709A00381k7376
18917G3005d0247k91503F5826b71632J33658O2226k6650G5691e7888F4589j2524
18906E2065B4431c38914c2712B77917I0780a51376M9624H1914C918a54718A58209
18894a32332N8496a9478m2755j29102O8527A08863g0855p2027K4275M954j01828
18883b15481K6941j8037A62096n7911B8908a17971j99310A40686a02825e0985
$$ y = [113646, 77080, -55498, -158450, 95882, 273432, -77746, -6972, -100593, -135231, 246020, 85194, 17920, -168770, 29175, 184552, -70755, 10008, -184162, 35916, -216628, -66538, -54144, 114072, -65730, -39729, 111064, 139510, 16270, -222898, 120388, -24802, -23433, 106339, -180993, -49829, -242011, 4179, -53518, -293656, -72096, 287589, -179032, -13261, -143155, -52709, 100381, 73005, -40247, -331750, 65826, -271632, -137974, -75748, -102398, 75691, -57888, 64589, 52065, 24431, -338914, -32712, 277917, 90780, -151376, -101752, 81914, 3918, -154718, 158209, -132332, -73836, -19478, -62233, -191335, -122808, 108863, -70855, -142882, -118607, -113653, -215481, -188540, -206577, 162096, 104185, 28908, -117971, -317281, 140686, -102825, -50985]
18872A43932L1746j802f9001A02324K4057e06442A48461B3255f3170q1444j26643
18861b71257J03701b8919A60509K03771E5251b43218a02059A97209A4882g2669
18850i9638p6119F9084i7526b3026D6850N0774d1528E3378g3365Q056p4240G1874
18837h4609A9646b57331B40399I5605f1377q9026E9244a35604A0443b85j56026
18826a56311m4403e1684j55166e9056B38351e4090A38284m6199k5300b15964B87284
18814B25985b95009b9156h101r0262A8644K78958a10270B46021L7798C9133a51396
18802B7756b75014O6173C2265N1639a37806q6318A55398c2729j76463K23F5144
18790i6045q9656n8194i941k13945C359L11870f9322b7009j74895D7004M7766
$$ y = [143932, 175678, 173876, -69001, 102324, 126381, -506442, 148461, 23255, -63170, -144614, -271257, -167556, -28919, 160509, 364280, 55251, -243218, -102059, 197209, 14882, -72669, -99638, -175757, 69084, -97526, -23026, 46850, 97624, -41528, 53378, -73365, -65309, -139549, 71874, -84609, 19646, -257331, 240399, 95605, -61377, -150403, 59244, -135604, 10443, -285, -156311, -200714, -51684, -206850, -59056, 238351, -54090, 138284, 92085, 66785, -215964, 287284, 225985, -295009, -29156, -8101, -98363, 18644, 297602, -110270, 246021, 283819, 39133, -151396, 27756, -275014, -208841, 32265, 83904, -137806, -224124, 155398, -32729, -209192, -208969, 65144, -96045, -185701, -243895, -9941, -223886, 3359, 315229, -69322, -27009, -201904, 47004, 94770]
18779I4770e18748J01616J99849M2354c1596B08857f3348o7519J8420I6642d6196
18767c69454b5977l04460H1880b16795c2013o8689k39742c0890j27108B6296J5087
18756D1383a86677A00577a06172o8699D72013G7176c4957q9881k78748B81907
18745h1611o970A78697a70097D8048b25733A57062h8740d4286j82012L4410A41953
18733a74268M9350A37504l4827a14896j49547c2418A5350g6607C629e059j58666
18722a63725B7953a96335h816D05732b5402r3333l14634K13479p1078J36940B02787
18710I8599h4415B4890R9327b549k71297a11962E3756g485A33174F1925a58553
18698b46120k24802A12168i8135m5489A87660o6984a12308l52A76862q5789a27520
$$ y = [94770, -518748, -417132, -217283, -174929, -31596, 208857, -63348, -130867, -112447, 96642, -46196, -369454, -25977, -330437, 81880, -216795, -32013, -100702, -340444, -30890, -157998, 26296, 41383, -186677, 100577, -106172, -174871, 472013, 77176, -34957, -124838, -403586, 281907, -81611, -88581, 178697, -170097, 48048, -225733, 157062, -88740, -44286, -226298, -191888, 141953, -174268, -124918, 137504, 102677, -114896, -264443, -32418, 15350, -76607, 3629, -5059, -163725, 27953, -196335, -8816, 405732, -25402, -118735, -433369, -219890, -290968, -154028, 202787, 98599, -84415, 24890, 124217, -2549, -273846, -111962, 53756, -7485, 133174, 61925, -158553, -246120, -470922, 112168, -98135, -143624, 187660, 120676, -112308, -112660, 176862, 91073, -127520]
18686E6434a19662A14768b46506e592k7743A24926b8490j69310K7055F0164b21866
18674d6101j54470A61924b43735F6302g8138j53326A08040k9430g2252F6484I740
18662c27740A40058a58298D02041d7381n3591o5590K010m8228C39124K9257b533
18650a32523B6505a946j15680A48304L9264a2314k97872A02685a15107A17033
18639b91272J30168e1941j37717A2804d3654j18142j81416C58693c1545l5501
18629f7046p5284A19484b09560K1640I9429c50509a28772L1524D0782b89953K8377
18618b61576m7171B45050c29092i7447k58244a31205F7206b29681o6902A43882
18607B08027b12536P6614I0120e25947a29566b4004j5498k1228l38518A63099
$$ y = [56434, -119662, 114768, -246506, -5592, -33335, 124926, -28490, -197800, -170745, 60164, -221866, -46101, -200571, 161924, -243735, 66302, -78138, -231464, 108040, 78610, -72252, 66484, 9740, -327740, 140058, -158298, 402041, -47381, -100972, -166562, -164552, -212780, 339124, 368381, -2533, -132523, 26505, -1946, -117626, 148304, 187568, -12314, -310186, 102685, -115107, 117033, -291272, -161104, -51941, -189658, 12804, -43654, -161796, -343212, 358693, -31545, -67046, -142330, 119484, -209560, -187920, 99429, -350509, -128772, -97248, 40782, -289953, -261576, -308747, 245050, -329092, -97447, -355691, -131205, 67206, -229681, -296583, 143882, 208027, -212536, -135922, 90120, -525947, -129566, -24004, -39502, -60730, -399248, 163099]
18596A40612E8212g889o0889j6464l5930e1403A89830M7976b26187H6863Fa24773
18583b53636O6009Q9309L0242I9095e9035B03681a6615A20247a17476a500j17152
18572a18652m7693g5396J7923c500l61966J28498G1031e3072k53139G4090e7287
18560a15562o059B45747b38540P8190L3189m6880c7609F5972J38162d19526F8377
18548b22582I529L2976a67289O7623C19923b06826j13764B8773J15268a10745
18537A0153i4301A85192J36094A47549a11949D7267j7969K13716M0287a8247B23278
18525c1319l38702f9230n22986B0506M5346J1360J77192A09303M5730a39156j06955
18514b46111B6305b17189a4194A11957b5942m3799j03412g2865j456r8593J9682
$$ y = [140612, 58212, -7889, -68778, -85242, -121172, -51403, 189830, 237806, -226187, 86863, 6, -124773, -253636, -187627, -98318, -68076, 99095, -59035, 203681, -16615, 120247, -117476, -1500, -118652, -166345, -75396, -57473, -3500, -365466, -236968, 71031, -53072, -306211, 74090, -57287, -115562, -121621, 245747, -238540, -160350, -127161, -174041, -37609, 65972, 204134, -419526, 68377, -222582, 9529, 42505, -167289, -99666, 319923, -206826, -320590, 28773, 144041, -110745, 10153, -94301, 185192, 321286, 147549, -111949, 47267, 29298, 243014, 283301, -18247, 223278, -31319, -370021, -69230, -592216, 20506, 65852, 77212, 254404, 109303, 155033, -139156, -246111, 26305, -217189, -14194, 111957, -25942, -69741, -173153, -72865, -74321, -172914, -153232]
18503a53232F9765P6140d9275G0319J89897j23554E5617N9483c77377A8746a43028
18491A90213a14614d1076l6055F2868E455O1074b37625e8664k0029h126C529K33734
18479B37263b36907l4864J32204B2215J00720b21972F4847a54781E3172c0529
18468f7373K8l2216B16083H2269d58060i5756G571J11859a67638n0511b8109A51459
18455c52403A23012i5106B4830R7000e9369j95406A33216j7012J13533b05234
18444a26798j23015r2983A89375b08904k7903O064L8047n1517E1297B0650J62870
18433A83520a07677A98520a30561R495j78397A1608a15799F3700Q863M2188J01418
18422B16169b09338H4536a18866E0098a55774B9179N7965a54596B16208F5674
$$ y = [-153232, 69765, 145905, -49275, 70319, 260216, 136662, 55617, 115100, -377377, 18746, -143028, 190213, -114614, -41076, -77131, 62868, 5455, 66529, -237625, -58664, -78693, -8126, 3529, 237263, -236907, -271771, -139567, 22215, 122935, -221972, 64847, -154781, 53172, -30529, -67373, -67345, -99561, 216083, 82269, -458060, -95756, 7571, 119430, -167638, -218149, -28109, 151459, -352403, 123012, -95106, 24830, 121830, -59369, -254775, 133216, 116204, 229737, -205234, -126798, -249813, -342796, 189375, -208904, -236807, -230743, -192696, -244213, 51297, 20650, 183520, -107677, 198520, -130561, -121066, -299463, 11608, -115799, 63700, 72563, 114751, 216169, -209338, 84536, -118866, 50098, -155774, 29179, 87144, -154596, 216208, 65674]
18411d16647B1397O2160a4433j642j02649C8009a94900N3527M9966A27561h2142
18399A5809e4722l9444k20576J3944e7402j54011j53338A22136i2229A83834F9069
18387i0756A53346N4433K8858E8662a82953j04838A06263c47654a53937m4368
18377a98305Q4580k53892I6345d43054A33065o1005f3696B003K69973a85939A24132
18365A01518h4973F0947O4177A4629c89732a94015h2073A04400D1918a60016k83215
18354d43231A606a78713j40124L1461c7577B64855a51507K938a752r86j1434j6587
18342c0759j17756K652B01722j00457C8703b64533Q5729I7735a42021A65467B4212
18330B00713J09169d8278k5962A32526J35057a89576d2216r2439b410r9660L6632
$$ y = [-416647, 21397, 83557, -14433, -16075, -118724, 38009, -194900, -141373, -91407, 127561, -82142, 15809, -54722, -94166, -314742, -300798, -57402, -211413, -364751, 122136, -92229, 183834, 69069, -90756, 153346, 207779, 236637, 58662, -182953, -287791, 106263, -347654, -153937, -198305, -113725, -367617, 96345, -443054, 133065, 72060, -63696, 2003, 271976, -185939, 124132, 101518, -84973, 60947, 125124, 14629, -389732, -194015, -82073, 104400, 41918, -160016, -443231, 1606, -178713, -318837, -287376, -37577, 264855, -151507, -148569, -1752, -2738, -14172, -30759, -148515, -145863, 201722, 101265, 38703, -264533, -178804, 97735, -142021, 165467, 24212, 200713, 309882, -48278, -74240, 132526, 267583, -189576, -42216, -134655, -2410, -102070, -65438]
18319f5438I4007c1400H4330a00532C45176g4817j0424k6903a6359I9769b49280
18307I2946a15674L820A73711K9005c88318e8576I502a18564k48958a36461M5045
18296i1416j21773g8492A08356a41599B49355d3137k5550j6912p5631G0143a2391
18284B21906n7995i7334m324E1338M9821K03031a3623I1483g9493G3596I972N6711
18272F6683a4265k12202a08977j33227C01258h6517q6592E5325a93992d8612j03587
18261a52199q7735B9638K31058l3504c32561A96463i7130A25283n8612b71168
18250a38933C8829i4382C0663i7555a3880l5229D9424c00487a44094A23194h7045
18238B3685G155J22638g7774j82704J04484C146b78995c6802j36072B41703b01206
$$ y = [-65438, 94007, -31400, 84330, -100532, 345176, -74817, -85241, -112144, -16359, 99769, -249280, 92946, -115674, -111854, 173711, 202716, -388318, -58576, 9502, -118564, -367522, -136461, -91416, -213189, -78492, 108356, -141599, 249355, -43137, -68687, -85599, -161230, 70143, -12391, 221906, 163911, -97334, -101658, 51338, 101159, 304190, -13623, 91483, -79493, 73596, 9972, 66683, -14265, -226467, -108977, -242204, 301258, -86517, -173109, 55325, -193992, -48612, -152199, -239934, 29638, 260696, 227192, -332561, 196463, -97130, 125283, 66671, -271168, -138933, 38829, -94382, 30663, -97555, -13880, -49109, 49424, -300487, -144094, 123194, -87045, 23685, 7155, 129793, -77774, -260478, -155994, 3146, -278995, -36802, -172874, 241703, -201206]
18226A36430O6558G5098N469a9581C2344J50259B1964b56585A21161k2234C6325
18214g5964k39907a35695O6113j1950k8934A4364a3119e185k72614e1232A14117
18202d1321A82975a30654J9267A16617a11703k0130B71377a64172k6385A12410
18191c784p5991H7970B1547J07358C1273a53917p5874P3485K2790A21908a67201
18179A79146I691Q1772l0304L20903b90512B54216p3151g6822B32076a35627D0822
18167a31541A1568a05481A0858O747b45390B32083a54981B32611o5967a07914
18156f3500f441j43094J0023d2979C92978a65189A65832a12424a2526A95024A4011
18144D8997L4057a5904k78049c5610j5847A92448p3492f5336H6035b8578m2591
$$ y = [136430, 202988, 75098, 80567, -19581, 32344, 182603, 21964, -256585, 121161, 98927, 36325, -75964, -315871, -135695, -69582, -81532, -110466, 14364, -13119, -5185, -277799, -51232, 114117, -41321, 182975, -130654, -111387, 116617, -111703, -131833, 271377, -164172, -190557, 112410, -3784, -79775, 87970, 21547, 128905, 31273, -153917, -229791, -156306, -133516, 121908, -167201, 179146, 9691, 91463, 61159, 382062, -290512, 254216, 181065, -76822, 232076, -135627, 40822, -131541, 11568, -105481, 10858, 17605, -245390, 232083, -154981, 232611, 166644, -107914, -63500, -6441, -149535, -139512, -42979, 392978, -165189, 165832, -112424, -12526, 195024, 14011, 48997, 83054, -15904, -293953, -35610, -51457, 192448, 118956, -65336, 86035, -28578, -71169]
18133g1169k41173a39064f1370E8255g2640E1317J67274A07946f6072o445j43228
18122b15745e9341j71617D9054Q9437b26911A30065a03129R88A41586a75847J6838
18111a59009C7343K03915a0518B01656m9132m3437J41624i8561H7435a65195N2724
18100a12471K4681c9589B55599H3361r87D0486J6320J79405K0024a85448Q8690
18089i6758A32030c61234C55675a31116k2086A32595f2810g50l0788j7879D03598
18077i2910l4859D41614A94069q1173Q6998i0880j23233F7016K93079A51265C0559
18065C28452g640B17390H9822i26k11888A58883I868J2099c25346A81364a56638
18053f1333j9184A91896L524H8915n850g0843o6116k16647a24622q5618A13449
$$ y = [-71169, -312342, -139064, -61370, 58255, -72640, 51317, 218591, 107946, -66072, -72517, -215745, -59341, -230958, 49054, 138491, -226911, 130065, -103129, -102141, 141586, -175847, -159009, 37343, 241258, -10518, 201656, 152524, 109087, 250711, -98561, 87435, -165195, -112471, -87790, -39589, 255599, 83361, 82374, 40486, 56806, 236211, 256235, -185448, -96758, 132030, -361234, 355675, -131116, -153202, 132595, -62810, -750, -31538, -49417, 403598, -92910, -127769, 441614, 194069, 112896, 199894, -90880, -214113, 67016, 360095, 151265, 30559, 328452, -7640, 217390, 89822, -926, -212814, 158883, 9868, 21967, -325346, 181364, -156638, -61333, -80517, 191896, 195420, 88915, 83065, -70843, -136959, -353606, -124622, -210240, 113449]
18041d2385q6559B93381a1226A58881b65837C61055a58331B10847f3627A42852
18030a66050b545j59667q8980o872A31299b5083l3631m2034A49849D0966a55025
18018C738J29946D1785e5844B83961a0312j34475d9796m7013c7711B53048A06727
18006C82350f2347H3966a94340h1081I8992m743a68802r8861O9545A3793R805
17995B3598A1424f5973A66806l0387f9604A43256c36000B17860i4023D712c32028
17983c02537J42381A29521c2940l16404B44610I81b04213f7175r0471C77353G453
17971A61518n504a92700a1566j10B10270J99911a68991F1639a80450N8133j27981
17960b50298A99611b37556J51A10887d9582k7456G3476K80331j34533o5610J94352
$$ y = [-42385, -128944, 293381, -11226, 158881, -265837, 361055, -158331, 210847, -63627, 142852, -166050, -2545, -162212, -251192, -258064, 131299, -25083, -58714, -100748, 149849, 40966, -155025, 3738, 133684, 41785, -55844, 283961, -10312, -144787, -49796, -96809, -37711, 253048, 106727, 382350, -62347, 83966, -194340, -81081, 98992, 94249, -168802, -267663, -198118, 13793, 23598, 11424, -65973, 166806, 136419, -69604, 143256, -336000, 217860, -94023, 4712, -332028, -302537, -160156, 129521, -32940, -349344, 244610, 981, -204213, -67175, -157646, 377353, 7453, 161518, 156014, -192700, -11566, -11676, 210270, 410181, -168991, 61639, -180450, -122317, -250298, 199611, -237556, -237405, 110887, -49582, -77038, 73476, 353807, 219274, 153664, 348016]
17949C48016E0309a02266b705j05228B65163h8251B9264e7776p7477p0823A41133
17937A90520I3620L7433P1694f726j67906C73115a7661B8101K15126J88487k05735
17926B25979h7612B0350a80808B03406H6851b57862c5144q2187A5035h8415I8551
17914b08840g2436B25142p5063k1573E5751Q0522b22119A54776q790k2292A8919
17902a81213G1395j8001f795j50003a3885j39057A10961J68194K2025b90509h4246
17890a4607B63088K06947B6854a82627L9993k09760C39519a31953k42423a37308
17879A5336Q9123Q4691p6271m7494b5295B22685G2456a37112F8164k6381M7045
17868H8828J83953a52922J5723H3950J28274m7840J40649B3189N7182L7871a50216
$$ y = [348016, 50309, -102266, -2705, -107933, 265163, -88251, 29264, -57776, -135253, -206076, 141133, 190520, 93620, 131053, 202747, -6726, -174632, 373115, -17661, 28101, 243227, 431714, 225979, -87612, 20350, -180808, 203406, 86851, -257862, -35144, -117331, 15035, -88415, 98551, -208840, -72436, 225142, 150079, 128506, 55751, 136273, -222119, 154776, 145986, 123694, 18919, -181213, 71395, 53394, -6795, -156798, -13885, -152942, 110961, 279155, 301180, -290509, -84246, -14607, 263088, 470035, 26854, -182627, -142634, -352394, 339519, -131953, -374376, -137308, 15336, 104459, 189150, 112879, 65385, -25295, 222685, 72456, -137112, 68164, 41783, 88828, 272781, -152922, -137199, 83950, 212224, 164384, 305033, 23189, 80371, 118242, -150216]
17856I2066J67751A00602a79729d3577C03460I8932e8576A31942L7060e5664j51505
17845b07169j9156A93829e3710k25918a09869B3004J3117b6270j30910A41202
17834A9092a38634B79603g2883l7235A83068I226h7810A6365K37767e7393r0538
17823a47931H6152j7299A5491a87773m6121B00967G7392C3683N69721F9698a02633
17811A21559e906j8441p9592j65072B99977j16151o3508a031C0582e8742n7809
17800a16551d7429A22846h1484B02442L3798G646d2631l893B29554D4421J1428
17789E5849B414f6711a2200l296j27396q7861B30178D0094J14407f5070A39862
17777A0675O2905h9782D07861A30242a82901A94452d2985G1148K81904H9754B6424
$$ y = [92066, 259817, 100602, -179729, -43577, 303460, 98932, -58576, 131942, 169002, -55664, -207169, -226325, 193829, -53710, -279628, -109869, 23004, 36121, -26270, -157180, 141202, 19092, -138634, 279603, -72883, -110118, 183068, 9226, -87810, 16365, 254132, -57393, -147931, 86152, 68853, 15491, -187773, -233894, 200967, 77392, 33683, 603404, 69698, -102633, 121559, -5906, -24347, -103939, -269011, 299977, 183826, 120318, -1031, 30582, -58742, -116551, -47429, 122846, -81484, 202442, 236240, 7646, -42631, -46524, 229554, 44421, 55849, 2414, -66711, -12200, -15496, -142892, -230753, 230178, 40094, 154501, -65070, 139862, 10675, 73580, -89782, 407861, 130242, -182901, 194452, -42985, 71148, 353052, 89754, 26424]
17765C6777g7387B98615r1142J67243L6509C9935o87e30p7976A97291l6645O839
17753A67485n7018J10918a7756G4789M7712k5453A8802L95529j18086g7238I6186
17741E9001a15330l3712D15126j70359A20304J94201G8571b0938A85478J5256
17731B00734q0382B4746M6162L04417A07471O0106J7584e7770B95310c38677I3434
17719A51444a41553B63155F1313j8558J42083I0084b13368B56796r280F6064a20001
17707C33905F1869P6806a8516D909J62488D3380L05378E7697g9399L9178A42009
17695h7573A14055B3867J77598q2913J47203A25075c5887A78998n2587h2693C30900
17683E9115b4147o3730A04024C1467J59285K12969L9049A20914b86986G4744K1374
$$ y = [36777, -77387, 298615, 207473, 374716, 411225, 39935, 39248, -530, -78506, 197291, 160646, 167485, 110467, 221385, -17756, 74789, 122501, 97048, 18802, 414331, 296245, -77238, 96186, 59001, -115330, -149042, 415126, 244767, 120304, 314505, 78571, -20938, 185478, 200734, 120352, 24746, 70908, 375325, 107471, 167577, 185161, -57770, 295310, -338677, 93434, 151444, -141553, 263155, 61313, 42755, 184838, 90084, -213368, 256796, 247516, 66064, -120001, 333905, 61869, 138675, -18516, 4909, 167397, 43380, 348758, 57697, -79399, -40221, 142009, -87573, 114055, 23867, 201465, 118552, 265755, 125075, -35887, 178998, 126411, -82693, 330900, 59115, -24147, -87877, 104024, 31467, 190752, 403721, 442770, 120914, -286986, 74744, 96118]
17672I6118a90247i3916A60543L9195C1932K61664r1494G5116b9556A33300f9223
17660E0712K21252b02412A2487Q2582J23952c32368B65795p7191c2874F4778N3253
17649A18031K50073B6687P9075P1977c81l4574A27698L3689n5198D101c17916
17637b99322C35696c0147n147F0512b4066B10269b29243I2607k9509g5348A07349
17625A01452K24798o5171m0679K07810a78274l0266r0311e8504j01709H2273L55981
17614D38254A11518C1493J6698a89346k94483A30613D7347h0339k2034L1676j32496
17603b03193f6698C1276a24103B3650J3606f1781A84861m0850b47541B21930j0042
17592B11888A02097J82346q4416K60972j22403E6480J5889J53247E9925R4544
$$ y = [96118, -190247, -93916, 160543, 199738, 31932, 293596, 202102, 75116, -29556, 133300, -69223, 50712, 271964, -202412, 12487, 95069, 219021, -332368, 265795, 188604, -32874, 64778, 118031, 368104, 26687, 105762, 177739, -381, -34955, 127698, 161387, 106189, 4101, -317916, -299322, 335696, -30147, -35294, 60512, -24066, 210269, -229243, 92607, 63098, -75348, 107349, 101452, 326250, 261079, 220400, 428210, -178274, -208540, -298851, -58504, -160213, 82273, 438254, 111518, 31493, 48191, -189346, -483829, 130613, 47347, -80339, -102373, -70697, -203193, -66698, 31276, -124103, 23650, 37256, -61781, 184861, 144011, -247541, 221930, 211888, 102097, 284443, 200027, 460999, 338596, 56480, 72369, 225616, 59925, 154469]
17582A54469a231B22861a52098c6431C77228F6469P9687j8428c47804a52870B15126
17570B52071k6185B4819Q1901R1486n5933C6053a61674c109j15239c3223B36948
17558A47321Q1320I5672J05779p948G9449a34651B02630p6459L4168J6738N9752
17547B36829a26435A50815A2268K16361H0934L13470d7999n2325A16904P0165
17537A87069a23861K3691d5678C06217O9679A19887a28352A18778J82744A2351
17526h7448A9602G713b50458A22536K37269k1145A67539K01544l8945J25790b1489
17514B53139B9276F502c960B38155G3737M0631p844j6054L14318A15494Q3768
17503A99262J83501D5606O6620C40J71281o9277h89C89752A9942L01666D7316
$$ y = [154469, -1231, 222861, -152098, -36431, 377228, 66469, 146156, 127728, -347804, -152870, 215126, 252071, 225886, 24819, 106720, 198206, 142273, 36053, -161674, -3109, -118348, -33223, 236948, 147321, 228641, 95672, 201451, 193503, 79449, -134651, 202630, 126171, 160339, 177077, 236829, -126435, 150815, 12268, 228629, 80934, 394404, -47999, -100324, 116904, 187069, -123861, -100170, -45678, 306217, 375896, 119887, -128352, 118778, 301522, 12351, -87448, 19602, 7713, -250458, 122536, 359805, 338660, 167539, 369083, 330138, 455928, -21489, 253139, 29276, 6502, -3960, 238155, 73737, 114368, 106524, 90470, 404788, 115494, 199262, 382763, 45606, 112226, 340, 171621, 102344, -889, 389752, 19942, 321608, 47316]
17491D4130E898J02664M2829K1935d1310B44250p0947j5972R4361A12683J48558
17480B61241P041A29680a07682A81036l5768O6492K54432B04739J81935A82265
17469A54006b9540G1934P8167b57007A53955c4420F61358k71851G8526L68845
17459D47371k5308G8476J29684q4230L61871j79953A24474N5678B2169J67665
17449A89834d2169B81277j1655R0459j8914J24216B28756J6924J60375M4869j86489
17438B64435L8312a7297E4044J01722J30952p070P1927J5025L6679j85743Q7626
17427C05162Q5130j78595p4830K23559A14343B9398L24070j52140Q5911C4955
17416C21346k0601K40435A75900J72621H6927N92900k05160j69018r3848D7004
$$ y = [44130, 5898, 108562, 151391, 173326, -41310, 244250, 173303, 157331, 251692, 112683, 261241, 268282, 129680, -107682, 181036, 145268, 211760, 466192, 204739, 386674, 182265, 154006, -29540, 71934, 150101, -257007, 153955, -34420, 661358, 389507, 78526, 447371, 422063, 78476, 208160, 123930, 485801, 305848, 124474, 180152, 22169, 189834, -42169, 281277, 269622, 360081, 341167, 465383, 228756, 245680, 406055, 450924, 264435, 302747, -17297, 54044, 155766, 286718, 279648, 351575, 366600, 403279, 217536, 305162, 390292, 211697, 136867, 360426, 114343, 29398, 353468, 201328, 287239, 34955, 321346, 300745, 541180, 175900, 348521, 86927, 679827, 474667, 305649, 211801, 47004]
17405A42579J33167b58529A57110J56702A5885K32646j02415J6829K09898K1763
17395C94606H6866K15336R7092a39999F1311L52300m3447c3244G8078B7522J20993
17384A48515J23172r8529P011q4742J71935J03595j72479k4642J79418g1488n2392
17373a23880A04369m8280O5425L34834c6006B66243I8155K52230D0669c0350D12195
17361C85260Q5298B12883K4705A2071M02993A71942n484L21320A03618K16428
17351C20046A34407K11634m6312j23836B5883K02915K73452j60354A38528K33027
17341C71555N0244j67331o2981D0918L8818J19389J63468j55978b3549o2371C34816
17329C98065A69171Q2786F7211K70040o5128o9635J08475i4857A40795J88885
$$ y = [142579, 275746, -258529, 157110, 313812, 15885, 248531, 146116, 162945, 372843, 394606, 86866, 302202, 399294, -139999, 61311, 413611, 370164, -33244, 78078, 27522, 148515, 271687, 173158, 180169, 95427, 267362, 370957, 198478, 173836, 353254, -71488, -123880, 104369, 56089, 121514, 456348, -36006, 266243, 98155, 350385, 40669, -30350, 412195, 385260, 470558, 212883, 237588, 12071, 415064, 171942, 166458, 487778, 103618, 320046, 134407, 346041, 299729, 175893, 25883, 228798, 502250, 341896, 138528, 371555, 421799, 254468, 191487, 40918, 79736, 199125, 362593, 206615, -23549, -85920, 334816, 398065, 169171, 251957, 67211, 337251, 272123, 202488, 310963, -94857, 140795, 329680]
17319C29680K3672A42956K68337n7906n7339j04930J19899l2251g7446B84837
17308B95156E6889J46166K06921A81034J4124K37181K9105A79796m1236K5805
17298A64365l0325C9208K10811J3100K51756B30196B4772K44837M53152a05151
17287F5675J08520j4371J53461j08770J51302J01500A95973J03431J38352j472
17277D36284A53746L4534k6975J83563K7323J2378A29044K22765J14828b2160
17266D69812j26281m2607L3040I4744K27870m6700J5801J31497A08741J297J41398
17255B51436o4533L01508A77139M34959G4226K72672J11106H2775M9000a30833
17244B06662k6227p1242P2688K82870I9808J09596l7733L80287B36484A10141
$$ y = [329680, 353352, 142956, 411293, 353387, 296048, 191118, 311017, 278766, -77446, 284837, 295156, 56889, 203055, 409976, 181034, 195158, 432339, 461444, 179796, 138560, 164365, 134040, 39208, 250019, 263119, 514875, 230196, 24772, 269609, 722761, -105151, 65675, 174195, 159824, 313285, 204515, 355817, 457317, 195973, 299404, 437756, 436284, 153746, 188280, 161305, 344868, 372191, 384569, 129044, 351809, 466637, -22160, 469812, 343531, 300924, 333964, 94744, 322614, 275914, 291715, 423212, 108741, 110038, 251436, 186903, 488411, 177139, 612098, 74226, 346898, 458004, 82775, 131775, -130833, 206662, 180435, 109193, 181881, 464751, 99808, 209404, 171671, 551958, 236484, 110141]
17233B73959O3595K39784B09468J07978K7165j24369L78953A98907G29L98906
17223C99635M7856p9548M3561A62490J73132E7474K75717d3610B93871M9467J02715
17212D46053j22188K29257G4159M30404f030B62793N9097K34408k58338o0321
17202B37639J31641K6642r7128J1736J92251E0557L53484j37086D9390N60128
17192F09518j87433C6032J17476L00995J40703j91069P1030j90169J30480j39400
17182B76078j25371O1188J61728J02577J454j54675O9681M2663j13713J63088
17172D84698A64661K70573M1512K4697k21715a27015C25471K14230j65964K01409
17162E75146j39164J02292k58774K71089k7593A92613K23181K18513j71610L0925
$$ y = [273959, 337554, 577338, 209468, 317446, 344611, 220242, 599195, 198907, 729, 399635, 447491, 367943, 411504, 162490, 335622, 57474, 333191, -43610, 293871, 343338, 446053, 323865, 553122, 74159, 504563, -6030, 262793, 321890, 556298, 297960, 237639, 369280, 395922, 298794, 310530, 502781, 50557, 404041, 266955, 49390, 609518, 422085, 36032, 153508, 454503, 595206, 404137, 475167, 284998, 415478, 276078, 150707, 211895, 373623, 476200, 477654, 322979, 392660, 435323, 321610, 484698, 164661, 435234, 476746, 501443, 279728, -127015, 325471, 539701, 373737, 575146, 435982, 538274, 279500, 550589, 522996, 192613, 415794, 634307, 462697, 493622]
17152D93622M9377n5576A47968N66734k37765r9738o3778J93803j10189j16720
17142B80315J10476L40979B48637L85026q3639j56736K84610l30037J02108K5172
17132D75141n4333k08725M30288J24873l81311A40568J02106L02237M3939B46013
17121B81190L39546C06168K59717j13008L28883k46184k11420M45699j05463Q165
17111F72557k34693N1127L8848J28145B20209L96522j73509j13685L11102n0575
17101E90064q7942K94137k70428K46787j46589k08181J81092N2562j86905L15420
17091G80017l9862j03933J71487N9746C50544K46085O2232m0235O5163k28138
17081D55651K47532J18894k51044Q8117j461K57657m10608J14628j46340O9364
$$ y = [493622, 542999, 487423, 147968, 714702, 476937, 377199, 313421, 507224, 397035, 280315, 390791, 731770, 248637, 633663, 550024, 393288, 677898, 347861, 449969, 475141, 420808, 212083, 642371, 767244, 385933, 140568, 242674, 544911, 588850, 246013, 281190, 620736, 306168, 565885, 452877, 781760, 535576, 324156, 769855, 664392, 672557, 437864, 488991, 527839, 655984, 220209, 616731, 443222, 329537, 640639, 590064, 502122, 796259, 525831, 772618, 626029, 417848, 598940, 651502, 464597, 780017, 740155, 636222, 807709, 867455, 350544, 596629, 658861, 618626, 683789, 455651, 703183, 822077, 571033, 659150, 657689, 915346, 504738, 619366, 473026, 542390]
17071E42390J32036J12804k1873j01043j36719K85527k08476K45388J38658j75325
17061H13367K74289k42889j21814k20857k3824Q4109J10591O7410l9214Q2300
17051G83468l30855K46308K20738j31943J46071J5834J34685m75028J22359J78788
17041I10425k82002o3677K15000L69924m09955k3733K34880j93837m8765J94444
17031I02704J47549j60827l5281q8543O6371J9645C01270O71660R3164k95135
17021G70959J50711J03650j12129L439J70010Q5471k92115R9838j79162J00821
17011I01493K0592M29189m77927O3583j8606j24675L43310m61178L84253q7827
17001I72207o4041N1419M03358k37063j26139j22354J45576J19529l0268J03239
$$ y = [542390, 674426, 787230, 765357, 664314, 527595, 813122, 604646, 850034, 988692, 813367, 1087656, 844767, 722953, 502096, 478272, 562381, 672972, 740382, 701168, 783468, 452613, 698921, 919659, 787716, 933787, 949621, 1084306, 609278, 731637, 910425, 628423, 564746, 779746, 1149670, 739715, 715982, 950862, 757025, 708260, 902704, 1050253, 889426, 854145, 765602, 831973, 851618, 301270, 972930, 1066094, 770959, 921670, 1025320, 913191, 916630, 1086640, 1172111, 879996, 979834, 800672, 901493, 922085, 1351274, 873347, 936930, 918324, 793649, 1136959, 675781, 1060034, 972207, 908166, 959585, 1362943, 1125880, 999741, 877387, 1022963, 1142492, 1112224, 1215463]
16991A215463j57229k65718M97687l22531Q449K49311k13191J19598m7800k2393
16981A061646K0092N36999n59339J9792J07034K33444m09997J46165L06673l18607
16971A143902j1772Q2814K02757M5884j01810O6421q4534j18466p3004k378L11377
16960A461191k39031L63420L5488l56180O5919n8789J00986j86580K16047O962
16950A409433m6495m7935K03076k60024Q7658R8797j23668L08720j32794O0766
16940A557534k9906J54462q9276P7392m07401M20244R4564J75670k20795J12377
16930A844865l67718J37558J91951p5104Q470J16242k22539O5220K85750K77381
16920B262076k85365P8946n36798L26370J35642j74680n6989L14467J24398j83362
$$ y = [1215463, 1058234, 792516, 1290203, 967672, 976121, 1225432, 1012241, 1131839, 1084039, 1061646, 1081738, 1618737, 1059398, 1079190, 1186224, 1419668, 1009671, 1155836, 1462509, 1143902, 1132130, 1214944, 1417701, 1463585, 1361775, 1428196, 1343662, 1225196, 1152192, 1149814, 1461191, 1222160, 1585580, 1621068, 1264888, 1330807, 1272018, 1373004, 1186424, 1402471, 1409433, 1362938, 1315003, 1518079, 1258055, 1345713, 1444510, 1320842, 1629562, 1496768, 1557534, 1527628, 1682090, 1592814, 1670206, 1262805, 1683049, 1777613, 1953283, 1732488, 1844865, 1477147, 1614705, 1806656, 1731552, 1740022, 1856264, 1633725, 1698945, 1984695, 2262076, 1976711, 2055657, 1518859, 1845229, 1980871, 1806191, 1749202, 2063669, 2188067, 2004705]
16910B004705j54076J11449L03060k650j76325l02452O39964k79188J69464J8481
16900B332432K1336j8879N119P9454k66676O9951q7016J66171K95784o6647j15230
16889B415799q5446J91610O5200L33231j91302K1398O6562j69646Q2611J7352
16879B747369K66481l12462k5891R8219O2910K60831J13166J13260o8142p9355
16869C176386J64422j19799J12552j36694K3933P7765K61456R9370j39215J22586
16859C642762J9776r5524J53287j5357L51967j52991J26459j04998J11911j22035
16849C915257J04586K57575m0045N77128o30350K43989R3734N9715P9437J44645
16839D805671J62350p5154L1009N00523k97789k711K50211L23629K0729m57580
$$ y = [2004705, 1850629, 1962078, 2265138, 2262488, 2086163, 1783711, 2423675, 2144487, 2313951, 2332432, 2353768, 2334889, 2340008, 2419462, 2152786, 2222737, 2135721, 2301892, 2597676, 2531029, 2415799, 2330353, 2521963, 2587163, 2920394, 2729092, 2750490, 2817052, 2647406, 2730017, 2747369, 3013850, 2701388, 2675497, 2773716, 2836626, 3097457, 3210623, 3323883, 3255741, 3176386, 3340808, 3221009, 3333561, 3196867, 3220800, 3298565, 3560021, 3659391, 3520176, 3642762, 3662538, 3567014, 3720301, 3704944, 4056911, 3903920, 4030379, 3925381, 4037292, 3915257, 4019843, 4277418, 4237373, 4814501, 4184151, 4428140, 4521874, 4581589, 4661026, 4805671, 4968021, 4892867, 4923876, 5424399, 5126610, 5123899, 5374110, 5697739, 5718468, 5260888]
16829E260888L02228L56752J57680m55879N75875j43339Q1066P2025K37680L50566
16819F795542j81545J3603J64781L29656p0667M83636k9466M70463m33846L57904
16809G900061K65542J21932P7455J87489N08393j52055K7920L28576N5983M20770
16799I742066K77994J51303K53386K80072K33963j83167N56575K71212M68847
16790A2052251J0564o1609O06470M55155K2576N11316K36707K97957J99746O58754
16780A4989887N49963M31005J79834N40281L02817R24752L48291K49578O72500
16771A9188908N63174P15239M58288O54733Q29142Q32214P39141L66680J202134
16762B5549653Q57756R86301P03715J097828J054138R72844J232501R82529J305896
$$ y = [5260888, 5563116, 5919868, 6077548, 5621669, 6197544, 6054205, 6135271, 6207296, 6444976, 6795542, 6613997, 6627600, 6792381, 7122037, 7051370, 7535006, 7505540, 7976003, 7542157, 7900061, 8165603, 8287535, 8364990, 8552479, 9060872, 8908817, 8936737, 9265313, 9321296, 9742066, 10020060, 10171363, 10424749, 10704821, 10938784, 10755617, 11312192, 11583404, 12052251, 12062815, 12001206, 12607676, 13062831, 13085407, 13596723, 13833430, 14131387, 14331133, 14989887, 15539850, 15970855, 16150689, 16690970, 16993787, 17918539, 18266830, 18516408, 19188908, 19752082, 20467321, 20925609, 21580342, 22409484, 23241698, 23980839, 24347519, 25549653, 26407409, 27393710, 28097425, 29195253, 30249391, 31222235, 32454736, 33437265, 34743161]
16753C4743161J178436J276114J802312J359902J477901J443014K347116J565866
16745D7193822J956893K081406J982457K798700K053988K444744K862842K948522
16737F6323374K952147K870226L184569L388941L618200L861455L176033M220575
16729I3595520L974080L800611L814261M188464M166480M088479L845472L865780
16721A25339147L355295L436410L042666L029589J800200J633465J139693J071397
16713A43847862L02652l61881j356106j328129j882006k300966l038501k989011
16705A30893914l581993l304557m449633l832623m309639m145017m209428m030601
16697I9030423l989824m066128m120297l525535l682630l746256l059327l240686
$$ y = [34743161, 35921597, 37197711, 39000023, 40359925, 41837826, 43280840, 45627956, 47193822, 49150715, 51232121, 53214578, 56013278, 58067266, 60512010, 63374852, 66323374, 69275521, 72145747, 75330316, 78719257, 82337457, 86198912, 89374945, 93595520, 97569600, 101370211, 105184472, 109372936, 113539416, 117627895, 121473367, 125339147, 128694442, 132130852, 135173518, 138203107, 140003307, 141636772, 142776465, 143847862, 144150514, 143788633, 142432527, 141104398, 139222392, 136921426, 133882925, 130893914, 127311921, 124007364, 119557731, 115725108, 111415469, 107270452, 103061024, 99030423, 95040599, 90974471, 86854174, 83328639, 79646009, 75899753, 72840426, 69599740]
16689F9599740l265252k863235k541385k678193k730833k637752k177567j868606
16681D8836917k415527j514590k041193j930655j642917j709075j381837j407814
16673C4793309j510838j290088r09443j298993j075322j004625j067167r09319
16665B5727514j117231n87092r39211p36812n87367j182343m22123n16166r16122
16656A8723047m90940q03313m68518l31274l85423j31132q07589l18010n00008
16647A4486840m12199m99738k13964p70922l7724l41467n94241j83140R0789o28906
16637A0895328k16100J03493o23247l70032j57887j17808k66137k73256n8114
16628H916240k42518P2336j34504k14944m21069j05372j08360j96921l25706J02832
$$ y = [69599740, 66334488, 63471253, 60929868, 58251675, 55520842, 52883090, 50705523, 48836917, 46421390, 44906800, 42865607, 40934952, 39292035, 37582960, 36201123, 34793309, 33282471, 31992383, 31082940, 29783947, 28708625, 27704000, 26636833, 25727514, 24610283, 24023191, 23083980, 22347168, 21759801, 20577458, 20155335, 19639169, 18723047, 18232107, 17428794, 16960276, 16629002, 16243579, 16112447, 15304858, 14986848, 14486840, 14074641, 13574903, 13360939, 12590017, 12552293, 12210826, 11616585, 11433445, 11524234, 10895328, 10679228, 10782721, 10159474, 9789442, 9631555, 9513747, 9247610, 8974354, 8916240, 8673722, 8746058, 8611554, 8396610, 7975541, 7870169, 7761809, 7564888, 7239182, 7342014]
16618G342014k7346n05671l82636L46418l42484n5173j12373j77453k88425L205
16608E800076k549o07393K34682n2518l87249K60746l1565r4213m636m18047O6885
16597D764219k99389k06632L30209p0044j31375K2750k14033j03401J10061n91839
16587C610526M17301m96031K92547j44357p5190R8757J53729q4724j0145n20674
16577C241739j94195M62003l83327J56612r4374k415l64562l8651K23197j37393
16567B868634R179P2194m31417Q04713o00347K27715n03185j32461L3566K83128
16557B631719k33268J86434j34967r1988p4693j38210J27730m167q7640o2922
16547B118028N19961n59430N64379m52688N7138k60063J27936R7944m82749n6538
$$ y = [7342014, 7314668, 6808997, 6426361, 6772779, 6430295, 6375122, 6262749, 6085296, 5796871, 5800076, 5797527, 5190134, 5424816, 5372298, 4985049, 5245795, 5214230, 5120017, 5115381, 4697334, 4764219, 4464830, 4258198, 4588407, 4518363, 4386988, 4409738, 4195705, 4092304, 4202365, 3610526, 4027827, 3531796, 3824343, 3679986, 3604796, 3703553, 3857282, 3772558, 3762413, 3241739, 3047544, 3509547, 3126220, 3282832, 3188458, 3186043, 2821481, 2782830, 3006027, 2868634, 2877813, 2950007, 2518590, 3323303, 2722956, 2950671, 2447486, 2315025, 2348591, 2631719, 2398451, 2584885, 2449918, 2357930, 2283237, 2145027, 2272757, 2268590, 2180950, 2118028, 2637989, 2078559, 2642938, 2190250, 2247388, 1987325, 2115261, 2213205, 1730456, 1673918]
16537A673918J26066J39601J00801k36316k7282r0862J82690J73154k9785k67102
16527A744883Q8586j36696j89551J00595J26790L5758j06334j33665J9478M1886
16517A591730O0153k12261m2825k52n741J12746P7544k55499K21773k70142K23226
16506A500452J8994k74483J2089O7193k42722J29276J38027K2388j34737J41100
16496A377577j6292k21769k427J04944j43886J32154L26764k65477m00980K93281
16486A183889k07375L98364F07586M54853J30611l09670J15746l3724m3844K10465
16476A132023L3429k29467j49264J93858j62541M52202n34550L02463j20668j0921
16466I06564j90371k93505N44214k52332k61763N50849R2048j26771j10674D09679
$$ y = [1673918, 1799984, 1939585, 2040386, 1804070, 1776788, 1685926, 1868616, 2041770, 2011985, 1744883, 1833469, 1696773, 1507222, 1607817, 1734607, 1770365, 1664031, 1530366, 1549844, 1591730, 1651883, 1439622, 1396797, 1396545, 1390804, 1503550, 1581094, 1325595, 1547368, 1277226, 1500452, 1519446, 1244963, 1257052, 1324245, 1081523, 1210799, 1348826, 1371214, 1236477, 1377577, 1361285, 1139516, 1137089, 1242033, 1098147, 1230301, 1557065, 1291588, 890608, 1183889, 976514, 1374878, 607586, 1062439, 1193050, 883380, 999126, 965402, 921558, 1132023, 1165452, 935985, 786721, 980579, 818038, 1270240, 735690, 1038153, 917485, 906564, 716193, 422688, 966902, 714570, 452807, 1003656, 1095704, 968933, 858259, 409679]
16455H51465q7865K42624k64815J14609j64540n5088Q2065Q5525j08971R535J29503
16444H34047J3507K9079C63588K03268K21410J4267k93143N60486k42319o6463
16434G61094J24403k12420q842j37304r7456L07104C51594K17973L12408O4912
16424I46887k83299k41279j16211L5885L7951M81958l33130r5603J87212j76572
16414D43799K41631L01437l88106j31717A51127K31032J77878k41760K81947k3561
16404E76663m242k20650L8735j24641M15631J26173l65513J02243l7634n0183
16394D56582A81756K90674n8981J14475k38293J16020n8913Q6186l5367n4727
16384C42830j09965J90051J932m6808J90381J47754k72377j51111A21627M45424
$$ y = [851465, 763600, 1006224, 741409, 856018, 691478, 636390, 718455, 803980, 695009, 704544, 834047, 847554, 876633, 363588, 566856, 788266, 802533, 509390, 1069876, 827557, 761094, 885497, 673077, 664235, 526931, 429475, 736579, 351594, 569567, 881975, 946887, 663588, 422309, 306098, 341983, 379934, 861892, 528762, 433159, 620371, 443799, 685430, 986867, 598761, 467044, 151127, 382159, 560037, 318277, 600224, 576663, 572421, 351771, 390506, 265865, 681496, 807669, 442156, 544399, 506765, 456582, 181756, 472430, 413449, 527924, 289631, 405651, 346738, 432924, 397557, 342830, 232865, 422916, 424848, 378040, 568421, 716175, 443798, 292687, 121627, 567051]
16374E67051B31805J70797p4343J57966r7234M1100r5263N8486R762J50204A61210
16362a03470G08745j84831k43723J49770q8892P6043o4263o0963j9851J85875
16352D57910J24259M3261l06352A43176J87971p9574p3576J43757H6192J39605
16342B25797K52343A48645A1837K60188q1718K93745e6750B86099N1696A6891
16331A36815N00885I9736K34009J54391A01115l2541K01845R400r8740M22296
16321F03375k92452L5741q1502K01365f3642G8968J86770o4006K96493k07275
16311B90950Q6870A15836C282K19548J62626A68004N0945L30368B4277N6174K8334
16300A08785R3901K6197N880N1448A6240K30345J17686R1121B11163n1559O08461
$$ y = [567051, 231805, 402602, 328259, 486225, 388991, 430091, 334828, 393314, 403076, 553280, 161210, -103470, 708745, 523914, 280191, 429961, 341069, 417112, 352849, 291886, 272035, 457910, 582169, 625430, 319078, 143176, 331147, 251573, 177997, 321754, 86192, 225797, 478140, 148645, 11837, 272025, 190307, 484052, -56750, 286099, 337795, 16891, 136815, 637700, 99736, 333745, 488136, 101115, 68574, 270419, 279819, 181079, 603375, 310923, 346664, 265162, 466527, -63642, 78968, 265738, 201732, 498225, 290950, 377820, 115836, 3282, 222830, 385456, 168004, 218949, 549317, 24277, 80451, 108785, 202686, 228883, 234763, 286211, 16240, 246585, 364271, 455392, 211163, 159604, 768065]
16289G68065B98400j26516N26913B08429N48199q4251q3432r0689J80006F2926
16278B89562I4824J36504J76949b3110C94807j27645j10249L04474j53176a03301
16267C49945l4765o4045j07433R3657I8263M53247A17244R7813H2413R2336F1611
16255D12990j53303a32966F172K8567J2178J47643H4798L65859A55254K76189
16245D31443A24800a13149G3976J06716J79772n2775H1352R0372n7341K05210
16235C19593A46544J56124j02317c7446A56340A9135K71007i8375d7804B60232
16224d1467E4062a1731B88224D5830K41249D6296P9072E3496J41483R6634d9417
16212A32839L65551g1107k6240L0387E00932G4331J88120n1093L6276m8210a92798
$$ y = [768065, 298400, 171884, 698797, 208429, 756628, 672377, 588945, 498256, 678262, 62926, 289562, 94824, 231328, 408277, -23110, 394807, 267162, 156913, 461387, 308211, -103301, 349945, 315180, 251135, 143702, 237359, 98263, 551510, 117244, 215057, 82413, 174749, 61611, 412990, 259687, -132966, 6172, 34739, 46917, 194560, 84798, 450657, 155254, 431443, 124800, -113149, 73976, 180692, 360464, 307689, 81352, 171724, 114383, 319593, 146544, 302668, 200351, -37446, 156340, 19135, 290142, -98375, -47804, 260232, -41467, 54062, -11731, 288224, 45830, 287079, 46296, 125368, 53496, 194979, 291613, -49417, 132839, 498390, -71107, -97347, -66960, 500932, 74331, 262451, 211358, 247634, 199424, -192798]
16200a15332H1183L60482b11786H5413b53108R6796D50455F7984L62273A61961
16189A74835K3848J28183A50318C4494O8769j970b4717A60769a20239J4528C5008
16177f5787G5716P1081b884A15513N5731A7535L20779A53621e6359B10866M7341
16166B58207J5176D0045J8027a44110m1064G5983J57098m7939o3626K4602J12904
16155B59022F1812L2789C4727L07699A64609c3513j23040B05884a0457j18613
16145a29070f0926j3435P78k1461A57346L1786i3363B29613c4746A44030L16029
16134D60059F9198k3212L01002J60556E0709b9870A85763k9553q611Q4118p0789
16123A60928i2188K87B26130B5697N1730a44134M2312L9737C8391L42106A1196
$$ y = [-115332, 81183, 441665, -211786, 85413, -253108, -156312, 450455, 67984, 430257, 161961, 174835, 198683, 326866, 150318, 34494, 103263, 101293, -24717, 160769, -120239, -105711, 35008, -65787, 75716, 146797, -2884, 115513, 171244, 17535, 338314, 153621, -56359, 210866, 258207, 273383, 40045, 58072, -144110, -185174, 75983, 233081, 185142, 121516, 146118, 259022, 61812, 94601, 34727, 342426, 164609, -33513, -156553, 205884, -10457, -129070, -60926, -74361, -73583, -95044, 157346, 189132, -93363, 229613, -34746, 144030, 460059, 69198, 45986, 346988, 507544, 50709, -29870, 185763, 156210, 147599, 231717, 160928, -92188, -91901, 226130, 25697, 77427, -144134, -101822, -62085, 38391, 380497, 11196]
16111a73035A46736a21313A13507e8059k05294C8012A5245j359R1663b2164G8660
16099A3799Q4663J53767j8538D0542a00912C84550A44857e1305G7796p419f2190
16087G3131j3088j2355J07190F8907J33976m2447J6376G2806C4266a8689B55083
16075A08090k452h2288k7487j601A98543B6577R0039J42988A22371l5804K67263
16064C53830A6017K15231a39347G4035l6429a84969k3001D13497A76346A972L20031
16053C22003c5467A8642K82664G3397j4893M043N7523N24106C07851I2585P7542
16042A70127c3175B3552a12812B25734C1172M6682P9953e6152j75046B79296a46597
16030C63683r1461A3643h7266j02255A08441M2696a80284a6650A99315O0960a25555
$$ y = [-173035, 146736, -121313, 113507, -58059, -263353, 38012, 15245, 13886, 105549, -22164, 78660, 13799, 98462, 252229, 233691, 40542, -100912, 384550, 144857, -51305, 77796, 70377, -62190, 73131, 60043, 47688, 154878, 68907, 202883, 160436, 176812, 72806, 34266, -18689, 255083, 108090, 105638, -82288, -109775, -111376, 198543, 26577, 116616, 259604, 122371, 86567, 353830, 16017, 231248, -139347, 74035, 37606, -184969, -207970, 413497, 176346, 1972, 322003, -35467, 18642, 301306, 73397, 58504, 62547, 120070, 644176, 307851, 92585, 170127, -33175, 23552, -112812, 225734, 31172, 77854, 157807, -56152, -231198, 279296, -146597, 363683, 272222, 13643, -87266, -189521, 108441, 151137, -180284, -16650, 199315, 260275, -125555]
16018a30958I7078b66664L3493A23172f9719C34434b44189N4369G6881l1156c70093
16006b11982e0175k15747B4955J43399c16666I8433L4790a408l3549j12223A16711
15994C05727H4372a79217C29198j40082d5812J7015G0497J03803g7387L1412A26438
15982D4420a16581B37178e2498k25225A59048G3489P0744b35866D21294H106K34046
15971B42152C1415J5080J24368b42842A31349b08863B23442l0971Q9836I4141
15960h1968C72603b67290A98249J3798h0735p6101j36089D89771f3767a3530a825
15948A73772b95072j0662e1245A60452b16448J3654I8067K0792n7858b09E9657
15936B07060a19852b2810A3198R1293D6057i8572J6832j43920i897A36218c05858
$$ y = [-130958, 97078, -266664, -233171, 123172, -69719, 334434, -244189, -189820, 76881, 45725, -370093, -211982, -50175, -265922, 24955, 168354, -316666, 98433, 133223, -1408, -34957, -147180, 116711, 305727, 84372, -179217, 329198, 189116, -45812, -28797, 70497, 174300, -77387, -45975, 126438, 44420, -116581, 237178, -52498, -277723, 159048, 73489, 144233, -235866, 421294, 8106, 242152, 31415, 46495, 170863, -242842, 131349, -208863, 223442, 192471, 282307, 94141, -81968, 372603, -267290, 198249, 212047, -80735, -156836, -292925, 489771, -63767, -13530, -1825, 173772, -295072, -305734, -51245, 160452, -216448, -202794, 98067, 118859, 61001, -209, 59657, 207060, -119852, -22810, 13198, 104491, 46057, -98572, -81740, -225660, -9897, 136218, -305858]
15924a65982g8087A33305e8144j65030I5940C9616Q8906P4079D5368q553K2867
15913E9682L92969E3123r899g8044k2454l8591c3768k89034f5949j34246j71522
15902c71717F3786a87003O7619A8176l397c18199C14246D6593a58080A11702J98918
15891C10620A2610Q0215K50392A50626a14900A72438h019p4684m3925A21577b91353
15879C68614b46714A60961a54488E5827J1869O8484F986b83333F7344O0639b1859
15867a48671b6303A51878E970b27474I8565J82946d2502j06068e990I5046A4767
15855C37293E9908J6522b39121e5837a7376j32974G0117J93306a00956D2100f025
15843f0571q0931G4918Q1440a24573b4653C28209h8256A55649B5061a2926l0016
$$ y = [-165982, -78087, 133305, -58144, -223174, 95940, 39616, 128522, 202601, 45368, 36815, 59682, 452651, 53123, 43224, -78044, -100498, -139089, -33768, -322802, -65949, -200195, -371717, 63786, -187003, -119384, 18176, 14779, -318199, 314246, 46593, -158080, 111702, 310620, 12610, 92825, 343217, 150626, -114900, 172438, -8019, -82703, -126628, 121577, -291353, 368614, -246714, 160961, -154488, 55827, 67696, 136180, 6986, -283333, 67344, 127983, -21859, -148671, -26303, 151878, 5970, -227474, 98565, 281511, -42502, -148570, -5990, 95046, 14767, 337293, 59908, 76430, -239121, -55837, -17376, -150350, 70117, 263423, -100956, 42100, -6025, -60571, -141502, 74918, 156358, -124573, -24653, 328209, -88256, 155649, 25061, -12926, -42942]
15832d2942j59080D7383d8090A3778J07414a36872G3515J09397a91112B83049
15821A3762K89196m9184n1979b60617a4402j35267I0223J01464B8988a00347d1103
15809A01251b6083j46495Q2561A40208f8486A72394J70860d4704A31450h2101
15798b39940o5976d1035L841l31300b4073A42209a64554J4082f9584B60944A715
15786A03958L6281a15831A70447a38722B26136c3461B21477C7900J01134g0628
15775a90317B81585I949R1346R7582c8937A70671h8688H2419q779g8938A56091
15763B6630J76490a93926Q3992r5052i4461d4447J2536m6179j07965G0349M1114
15752A11463J15692k4152d8485E5708a16168B10924a42326A41971f9514A9485
$$ y = [-42942, -202022, 47383, -48090, 13778, 121192, -136872, 73515, 182912, -191112, 283049, 13762, 302958, 253774, 201795, -260617, -14402, -149669, 90223, 191687, 28988, -100347, -41103, 101251, -26083, -172578, -90017, 140208, -68486, 172394, 343254, -44704, 131450, -82101, -239940, -305916, -41035, -37194, -368494, -24073, 142209, -164554, -150472, -69584, 260944, 1715, 103958, 140239, -115831, 170447, -138722, 226136, -33461, 221477, 37900, 139034, -70628, -190317, 281585, 9949, 101295, 198877, -38937, 170671, -88688, 82419, 73640, -78938, 156091, 26630, 203120, -193926, -109934, -204986, -94461, -44447, -31911, -78090, -186055, 70349, 111463, 227155, 203003, -48485, 55708, -116168, 210924, -142326, 141971, -69514, 19485]
15741D09224a67333m762r2300H9158J39183a67010o9667A46029e9772B8716a65001
15729G1257K40791A9284K47527H2361J42621a8247j32071F3921P4629b63341j33278
15718c96619F4400O4710a29534I350M4871N3827a44754E5014G848J21281G097
15706B99460d51396f4714A22438i8672L1695o9444B0697J45377d5361o7108B69985
15694A90348N2137C5936K02353e7361B00966a97891E7096j6122J19340I267M4031
15683E3298c7912j1997A19240E9165h9599B30987c41052J29957d5564G8830a51839
15671a4557D1293K2961J16973c23344C6879a06966L1517C6979b26411A50948a54873
15659b92941I2473Q7384l5149a50982A32967a5873e356B4584Q4303a15762A90306
$$ y = [409224, -167333, -172095, -264395, 89158, 228341, -167010, -236677, 146029, -59772, 28716, -165001, 71257, 312048, 19284, 266811, 82361, 224982, -18247, -150318, 63921, 138550, -263341, -396619, 64400, 129110, -129534, 9350, 54221, 108048, -144754, 55014, 7848, 129129, 7097, 299460, -451396, -64714, 122438, -98672, -66977, -136421, 20697, 166074, -45361, -112469, 269985, 190348, 242485, 35936, 238289, -57361, 200966, -197891, 57096, 40974, 160314, 9267, 53298, -37912, -49909, 119240, 59165, -89599, 230987, -341052, -211095, -45564, 78830, -151839, -14557, 41293, 64254, 181227, -323344, 36879, -106966, -75449, 36979, -226411, 150948, -154873, -292941, 92473, 179857, 144708, -150982, 132967, -15873, -5356, 24584, 108887, -115762, 190306]
15647d368G0109A6759a23167A53407i6753J6342C35311q2538a74442O6829I8581
15635D63082e5814B20027J40156i8700A71429A5791K04380N1150d6833B33121
15624A6128M0744Q1708h4820A76473m7555a11483I1388m601R7671d39159A43448
15612B46740c22950B214K16260b5105A79187Q9061K40663e0807K068a1861j8154
15601c0015A09719Q5705a62442a2798A60643D8666A4087a88473C71507a2997A09144
15589A11448b4425j536b928A99183k7092a07321d5956G5851K1357c54515J12990
15578b41525O3147D5314J38747a8335B76065A28897R351b38012B0538r461a43782
15566A52010J63950a15570A67841E5162L31789f7393A43530a0162D19872f0234
$$ y = [-4368, 70109, 16759, -123167, 153407, -96753, -80411, 335311, 252773, -174442, -107613, 98581, 463082, -55814, 220027, 360183, -98700, 171429, 15791, 220171, 271321, -46833, 233121, 16128, 56872, 138580, -84820, 176473, 128918, -111483, 91388, 86787, 184458, -439159, 143448, 246740, -322950, 2214, 218474, -25105, 179187, 268248, 508911, -50807, -48739, -11861, -30015, 109719, 195424, -162442, -12798, 160643, 48666, 14087, -188473, 371507, -12997, 109144, 111448, -24425, -25961, -2928, 199183, 172091, -107321, -45956, 75851, 97208, -354515, -241525, -178378, 45314, 184061, -18335, 276065, 128897, 138248, -238012, 20538, 11077, -143782, 152010, 315960, -115570, 167841, 55162, 386951, -67393, 143530, -10162, 419872, -60234]
15555d8163I9327g6524A1909i9929C73383G4945n19J81943h8884K8911C8619f4111
15542B59107b7095B45740K0393g7160o9206M9391b6923C18986i2623l1471e2913
15530B12548a50844A86196l9928d1275I4487a50316A07586B5450L1200J11994
15520A68644k6628B1729J89523p0122L30017j17919j24490i2575B4802d38837
15509E2669b11913B44520b02619A95790e9836j41632B79199M4578F8464O1020
15499A29484A799a68520B90622H7248P6129c5580l8290j69500b1545A72038N8189
15488B30227b17550A3447K37789a25507A06927k2254b51139m8977A53205p6468
15478G6737a76303e2372A16899J75786o462a62705A49865p0830j9881a7291F5927
$$ y = [-48163, 99327, -76524, 11909, -99929, 373383, 74945, 74426, 256369, -88884, -59973, 38619, -64111, 259107, -27095, 245740, 266133, -77160, -146366, -96975, -26923, 318986, -92623, -124094, -52913, 212548, -150844, 186196, 146268, -41275, 94487, -150316, 107586, 25450, 56650, 168644, 142016, 21729, 211252, 141130, 471147, 353228, 228738, -92575, 24802, -438837, 52669, -211913, 244520, -202619, 195790, -59836, -201468, 279199, 323777, 68464, 129484, 1799, -168520, 290622, 87248, 163377, -35580, -73870, -243370, -21545, 172038, 230227, -217550, 13447, 251236, -125507, 106927, 84673, -251139, -300116, 153205, 76737, -176303, -52372, 116899, 292685, 286223, -162705, 149865, 79035, 59154, -17291, 65927]
15466A92824F5739a58459c4159o4599A77669C8541P6331K43746b046A53995F6767
15454c5759C94732j68772a78876Q7262F3445L08848A04209a34163A84871J33065
15444C17936h9273A48172j425g3540C00795o910r3114M73574B26536n1623J29320
15433C04233b80477a23290C48615r9712k3861a46697C31733a7456l7625j35406
15423a90487B266K28639e7845B01817a07078d4407A39969h395D484J02060j2970
15412I3574f8065b0935J89l23971A88955m4429Q1594a20247B57435A17663C5818
15400b14696A67030q1267K3664b6261A5099K89121b1440A16553G187R0953K29506
15389C27646J68490a45054E778K85317A8065P5344I196L43178n9115C5328M02010
$$ y = [192824, 65739, -158459, -34159, -98758, 177669, 38541, 114872, 358618, -2046, 153995, 66767, -35759, 394732, 225960, -178876, -91614, 63445, 372293, 104209, -134163, 184871, 317936, -89273, 148172, 146747, -73540, 300795, 293885, 200771, 674345, 226536, 174913, 304233, -280477, -123290, 348615, 248903, 225042, -146697, 331733, -17456, -55081, -190487, 2266, 230905, -57845, 201817, -107078, -44407, 139969, -8395, 4484, 106544, 93574, -68065, -20935, -20746, -344717, 188955, 144526, 226120, -120247, 257435, 117663, 35818, -214696, 167030, 85763, 109427, -26261, 15099, 304220, -21440, 116553, 7187, 98140, 327646, 496136, -145054, 5778, 291095, 18065, 93409, 9196, 352374, 293259, 35328, 437338]
15378D37338k16902a87595j9339d946A1437K02901c6486C23039j02560A04886
15367B86392K40997d4251b983m0157G4996J99794q2232o4528a23677n3527A14762
15355E17343B56922a2083C57710p5736j35146a6064k41043C01813G8956J0912
15345H9868O8930L22931f960A50800K81017a64958a396B22725B6157J72790p9652
15334A19295c1109D6424K00636j20923b05982B46499j03159c0251B32070n7704
15324A74366m8739K86698j46256a6499H4082P8444R0618J6500M5532j49462l6764
15313A28950e520E46379A60975J55434D6765K83146I1299O9522O7991J62532A65994
15301A98418M9804r1319A6541K22153A05725k102J46125B2049K53071l7286e310
$$ y = [437338, 220436, -187595, -206934, -4946, 11437, 214338, -36486, 323039, 220479, 104886, 286392, 527389, -44251, -2983, -43140, 74996, 274790, 192558, 128030, -123677, -177204, 114762, 517343, 256922, -12083, 357710, 281974, 146828, -16064, -257107, 301813, 78956, 89868, 158798, 481729, -6960, 150800, 431817, -164958, -1396, 222725, 26157, 198947, 119295, -31109, 46424, 247060, 126137, -205982, 246499, 143340, -30251, 232070, 174366, 125627, 412325, 266069, -16499, 84082, 162526, 253144, 269644, 315176, 165714, 128950, -5520, 546379, 160975, 316409, 46765, 329911, 91299, 160821, 228812, 391344, 165994, 198418, 248222, 156903, 16541, 238694, 105725, 103623, 249748, 22049, 275120, 237834, -5310]
15289B24316J43820a08535A35025P2502A1514e6164C14316o069J47229r8719n9218
15278B97539j23484M13421A81765J37527a61066C3300J38846k9427L64604B33656
15267A68899k8996Q550J50205o3828r423J3802r7454K46085j84258J76113c766
15255I3801b1975B21544J57188A52129K92886I4644P72447B84282Q76661K48728
15245A409671N82883l50236J31426n67322n85018A88372l960a03313D75631k03616
15235B72015A31241h8719F5799J0353J17711P1409A11657L10721k08849J23364
15225C36893A64579o6432c3025D33387o2379D4038J17239J35698A44447Q5210
15215B29657G7835K91266j53033K66055j34488B8604M98082F0250b3862A09444
$$ y = [224316, 368136, -108535, 135025, 207527, 11514, -56164, 314316, 308247, 455476, 356757, 297539, 174055, 587476, 181765, 319292, -161066, 33300, 172146, 142719, 507323, 233656, 168899, 139903, 148453, 298658, 234830, 225407, 239209, 141755, 387840, 203582, 379695, -3766, 93801, -21975, 221544, 378732, 152129, 445015, 94644, 867091, 284282, 1160943, 1409671, 1992554, 1642318, 1773744, 1206422, 621404, 188372, 184412, -103313, 475631, 272015, 131241, -88719, 65799, 76152, 193863, 265272, 111657, 422378, 213529, 336893, 164579, 98147, -33025, 433387, 371008, 44038, 161277, 296975, 144447, 229657, 77835, 369101, 216068, 482123, 347635, 28604, 526686, 60250, -23862, 109444]
15204e0564D95737A33824J56037A9703d3552B32200A13075N3102J0835c4288H093
15192A56590K07698I1428J97580K7088K90648A06478B9743c7053A31962J24685
15182B56647j08029L51096A53224A2011a27623A29624J91300m5794A0964P8466
15172H9430K10670r7849M9407H3075K05655J2506J85768k40662a06560B75601
15161D43567j04267L8886k1995j41577q5030L60470c3562A56343Q8725o9110C3799
15149a41303A66484o6425C7256L2525b933E68327A91446J69039L9868j13303M544
15138B91594A10296K73911N7745j34149J8973P5325A3937M11259A27580D1018
15127C12178j152J76537G1466O2167K04383A63424m1101O8655J69362j64753M6290
$$ y = [-50564, 495737, 133824, 289861, 19703, -43552, 232200, 113075, 166177, 177012, -34288, 8093, 156590, 364288, 91428, 289008, 316096, 606744, 106478, 29743, -37053, 131962, 256647, 148618, 499714, 153224, 12011, -127623, 129624, 320924, 275130, 10964, 89430, 300100, 202251, 251658, 83075, 288730, 301236, 487004, 246342, -106560, 275601, 443567, 339300, 378186, 356191, 214614, 129584, 490054, -33562, 156343, 245068, 175958, 33799, -141303, 166484, 100059, 37256, 69781, -2933, 568327, 191446, 360485, 400353, 287050, 291594, 110296, 384207, 441952, 307803, 326776, 402101, 13937, 425196, 127580, 41018, 312178, 311026, 487563, 71466, 133633, 338016, 163424, 122323, 190978, 360340, 195587, 241877]
15116B41877A08176K39664p8063r2487G1378M55922A91243J15676J41479E3450
15105C76483j62726K73820B19690D0813o780r575O43317b8840D68505J11360Q9105
15094F68970A61345K71400j58885a13068c672o0203A43631K26712J96760p2026
15084D95077j63756A15575J35418J19266I2531J42010K83429j69416A43523J93734
15074C37257O4363j25980L37957A10123J1458K58022A16858M03278a21207B66549
15063B44000G3997L66359R03A69143P8489L48817j66397P5868p9461n3127j12889
15052B60443K66813j98164A12510M42476o724B36697M42670A66492K73714N2301
15042D92507J31562B11536J17104J69838L1048O0310B12051J00243R1740k9234
$$ y = [241877, 108176, 347840, 269777, 177290, 71378, 527300, 191243, 306919, 448398, 53450, 376483, 213757, 487577, 219690, 40813, 34033, 24458, 667775, -28840, 468505, 579865, 668970, 161345, 432745, 273860, -113068, -3672, -63875, 143631, 370343, 567103, 495077, 331321, 115575, 250993, 370259, 92531, 234541, 517970, 348554, 143523, 337257, 401620, 275640, 613597, 110123, 121581, 379603, 116858, 520136, -121207, 266549, 244000, 73997, 440356, 441259, 169143, 247632, 596449, 430052, 505920, 426459, 373332, 260443, 527256, 329092, 112510, 554986, 548262, 236697, 679367, 166492, 440206, 492507, 624069, 211536, 328640, 498478, 529526, 589836, 212051, 312294, 404034, 374800]
15032C74800Q6251j28242m2723J05400R6924A31643L81686A80684p5349L50985
15022D56320A64220o2221L91749j70228J64751A69820J27721M1487K0521q3082
15012B76467K34007k06686K98013k62908J11861r9621K73901A78537O9122n2704
15002A94955K08053K05149k42664A27262L59087A59681K8740L94039A70302Q1832
14992B52134J01378L81649j55124B85950l933K08767k25248L40298B69769K09737
14982D79506o3540j82529L58757P1741p9162j92788J66442j28297J15413B18284
14971C73195N1513j81992q4913L99431K45717j2004C45695M11263j83713J16565
14961F89810k53817K03612k43739L25807l04695L64764J17669l09670J36432A45496
$$ y = [374800, 461051, 332809, 290086, 395486, 492410, 131643, 513329, 180684, 105335, 456320, 164220, 101999, 493748, 323520, 488271, 169820, 297541, 339028, 359549, 276467, 510474, 303788, 601801, 338893, 450754, 351133, 625034, 178537, 247659, 194955, 403008, 608157, 365493, 127262, 486349, 159681, 188421, 582460, 170302, 252134, 353512, 735161, 580037, 285950, 282017, 490784, 265536, 605834, 269769, 479506, 415966, 233437, 592194, 663935, 584773, 391985, 558427, 430130, 545543, 218284, 373195, 424708, 242716, 157803, 557234, 802951, 790947, 345695, 756958, 573245, 689810, 435993, 639605, 395866, 721673, 416978, 781742, 899411, 589741, 726173, 145496]
14950F07673R5193J27122k82134N3343O591k55131A66895N02101j54003J94564
14940G09557r6589j07910J7984K84366n7151j54343J5033J40475B76525J09040
14930C85565A88468L14255o1969J1355J7096K4230K9662m4936J55992o6912k36026
14919C31215K66157j77893M1670K11485K1654k80183L34082k59117j42782J01573
14909D47861k4994K19279o9595J00935j42305o7296K99254k29245p126K67201
14899G93969k83728j81343J20966j14160L36595B35433L17848q4210J20188B81453
14888C86717R7294R0763p7204K2134L7526q9078j31974J25620B14386K12162J24987
14877E51535l9576L846j24097K75623k1437F8443L44836J29196O7039j19315O4899
$$ y = [607673, 702866, 829988, 547854, 601197, 607788, 352657, 166895, 668996, 514993, 709557, 612968, 505058, 523042, 807408, 750257, 595914, 610947, 751422, 276525, 385565, 188468, 502723, 440754, 452109, 469205, 493435, 523097, 478161, 634153, 567241, 331215, 597372, 419479, 461149, 672634, 694288, 414105, 748187, 489070, 346288, 447861, 422867, 642146, 572551, 673486, 531181, 463885, 763139, 533894, 526768, 793969, 510241, 328898, 449864, 335704, 672299, 235433, 553281, 469071, 589259, 281453, 386717, 484011, 574774, 497570, 519704, 557230, 468152, 336178, 461798, 214386, 426548, 551535, 511959, 515805, 391708, 667331, 645894, 68443, 413279, 542475, 609514, 490199, 555098]
14866E55098K7835j58473M55325k42775Q3985q8840j18545r2654J02778k18600
14856C05134p0169J71462O8974J93392k29273M05242k85297J211r2693J49812
14846F17795j60585M13214k88922K27073J71148l08976N7848o4824J79181n9602
14836G83350l38472n7789K83063B76288L36858J34169j51676j20187M27156C58290
14825H86159k46204K64728j51271K05478D35029L34238j94107l1716R6990M2285
14815F82719J34331q1949q2618L18245l80216R1112K03054m8501k65730K22517
14805G92964j14645M6670M19422l29742K24825k72203K24975D52868L75636m6456
14795G82048j49501K21327q1030J1896j52513J05201K05484M2887K3815k10384
$$ y = [555098, 582933, 424460, 879785, 637010, 720995, 632155, 513610, 420956, 523734, 305134, 234965, 406427, 475401, 668793, 439520, 844762, 559465, 560676, 467983, 617795, 457210, 870424, 581502, 808575, 979723, 670747, 728595, 663771, 842952, 783350, 444878, 387089, 670152, 276288, 613146, 747315, 595639, 475452, 902608, 358290, 886159, 639955, 904683, 753412, 958890, 435029, 769267, 575160, 543444, 640434, 682719, 817050, 735101, 652483, 970728, 590512, 681624, 884678, 836177, 570447, 792964, 678319, 724989, 1144411, 814669, 1039494, 767291, 992266, 452868, 828504, 782048, 632547, 853874, 772844, 784740, 632227, 737428, 942912, 985799, 1009614, 799230]
14785G99230P6347k16513M98583D95274L37809L086j4153j01450j7312K15920
14775I19174K15735E37700L39851J18295l35110j20482L55195n1506j28122N03524
14765A219345E69625J78022J58630K10136k76162Q9n551k94023J11886K27995
14755H80647Q6450J0834k48618K70375p3318J68234k05106j01681M26394o5750
14745A148461j44702K24061m57336K00185k59011J96488K8343J2577l20800M36931
14735A065197k36052K63933j14974M004P6672Q4075j47582Q0331J99494n30653
14725G44445K83137K69214m71834O4375J20350M4753K6843j6501j47226j70396
14715G47160L22933l594k19382J16411j63600N1118J0948l277J95551J69610m39157
$$ y = [799230, 875577, 659064, 1157647, 495274, 833083, 836169, 822016, 720566, 703254, 919174, 1134909, 537700, 877551, 995846, 660736, 540254, 895449, 843943, 715821, 1219345, 569625, 747647, 906277, 1116413, 840251, 840340, 834789, 540766, 652652, 880647, 967097, 977931, 729313, 999688, 926370, 1094604, 889498, 787817, 1214211, 1148461, 1003759, 1227820, 770484, 970669, 711658, 908146, 936489, 949066, 628266, 1065197, 829145, 1093078, 978104, 982108, 1058780, 1142855, 995273, 1075604, 1275098, 744445, 1027582, 1296796, 824962, 889337, 1009687, 1054440, 1081283, 1064782, 917556, 747160, 1070093, 1066499, 847117, 963528, 799928, 851046, 861994, 858717, 1054268, 1223878, 784721]
14704G84721J97843l3545L92459j53377j13025l85817L85004m0312L19388m21728
14694I31611o8553q4304L06585l74693M51306j11519K57277E91164K47724J60366
14684I99254J63321k9815k69374L74016n1q3277j08406J19344Q6477p9769n0946
14673A120774n2656j33892m4729K73425k40904J85454l3872L67087m16277M2570
14663A066980K33870k34289J32669L55439p06244L69972j06077k89595L09261
14654A131986P4635O1043n04077M92745L4011Q2467j10580j11640J91625L39882
14644A682097m01630J89300j97979j3780o0412l12181O55662k17599k62587L59290
14634A420181k01180j64367m0174L68955j85132J86721P8594o7583k38803J38807
$$ y = [784721, 982564, 949019, 1341478, 1188101, 1075076, 689259, 1074263, 1033951, 1353339, 931611, 863058, 778754, 1085339, 710646, 1161952, 1050433, 1307710, 591164, 838888, 999254, 1162575, 1132760, 863386, 1237402, 1237351, 1154074, 1045668, 1165012, 1251489, 1171720, 1120774, 1068118, 934226, 889497, 1162922, 922018, 1107472, 1073600, 1440687, 1024410, 1066980, 1300850, 1066561, 1199230, 1554669, 848425, 1218397, 1112320, 822725, 1131986, 1206621, 1267664, 763587, 1256332, 1290343, 1372810, 1262230, 1150590, 1342215, 1682097, 1280467, 1469767, 1271788, 1258008, 1197596, 885415, 1541077, 1323478, 1060891, 1420181, 1219001, 1054634, 1014460, 1383415, 1198283, 1385004, 1463598, 1396015, 1157212, 1296019]
14624A296019j56253K75599j80920M06264k76213k31828M56699k69664K51613
14615A571316j73411n9102J60042L15209m96654N77690p40404K44444L25980l24571
14605A400539J20971J42046J94573m52484L59668l235k15492K20152J43262j61028
14595A748972Q3444n2032K7878j17785l72389M95046R267j2792k70757M32090
14585A970942m28774L99301j8719l71480L52853J45873j8623J74583k18616j88689
14575A798651J8990K08114j55855K66526l20975L15220J63745N2901j4294L28200
14565B661223n37768K31342J04727m0772k9187M08706k51734j22737N45227j23475
14555B845552K01267K38534P39749n4216N69798J312081K204015O311137J0234504
$$ y = [1296019, 1139766, 1415365, 1234445, 1640709, 1364496, 1132668, 1589367, 1319703, 1571316, 1397905, 1338803, 1498845, 1814054, 1317400, 1895090, 1154686, 1399130, 1725110, 1400539, 1521510, 1663556, 1858129, 1405645, 1765313, 1762078, 1546586, 1766738, 1910000, 1748972, 1832416, 1780384, 1808262, 1690477, 1318088, 1813134, 1822401, 1809609, 1538852, 1970942, 1542168, 1941469, 1922750, 1551270, 1904123, 2049996, 2031373, 2205956, 1987340, 1798651, 1817641, 2025755, 1869900, 2136426, 1815451, 2130671, 2294416, 2347317, 2333023, 2661223, 2123455, 2354797, 2459524, 2418752, 2389565, 2798271, 2546537, 2423800, 2969027, 2845552, 3046819, 3285353, 4025102, 3970886, 4540684, 5852765, 8056780, 14367917, 24602421]
14546B4602421J1733523Q170580A8316636G166245j891517m2295k377513q29523
14538B025397j35872r5745L68550j05101p8846M80j22944K60813L9247Q4781j3583
14527B227177j38523L54492l01579j85471N23361q8867M7748P5529K8617M2877
14517B585361j70738m035N66199m01027K69841j59555M5201L91049k37620J81293
14507C065969j36483L7553k31110K66283K2779k06829K61364l07987L632M17866
14497C193037m0096q8538K67778m8032O1663J38828j06354j20032M8557L71146
14487C677957k07423J38138q9892J60504K12365p2581n9976K49241j16022k31247
14477C661064L26319l12941L36775K0924J84071J09735k14808j00222K76011J66111
$$ y = [24602421, 36335944, 44506524, 18316636, 7166245, 5274728, 5232433, 2854920, 2025397, 1889525, 1793780, 2162330, 2057229, 1978383, 1978863, 1855919, 2116732, 2155979, 2240760, 2227177, 2088654, 2443146, 2141567, 1956096, 2479457, 2390590, 2438338, 2513867, 2542484, 2585361, 2414623, 2410588, 2976787, 2575760, 2845601, 2686046, 2731247, 3122296, 2884676, 3065969, 2929486, 2967039, 2735929, 3002212, 3024991, 2818162, 3079526, 2771539, 2775171, 3193037, 3152941, 3064403, 3332181, 3284149, 3345812, 3484640, 3378286, 3258254, 3306811, 3677957, 3470534, 3608672, 3518780, 3679284, 3891649, 3819068, 3759092, 4008333, 3892311, 3661064, 3987383, 3674442, 4011217, 4032141, 4216212, 4325947, 4111139, 4010917, 4286928, 4453039]
14467D453039J51080l16615J82994m436j22928o3605L42295j55286J87269M22116
14457E075923k51293L14532j66064n9204J38520K79364j70823J26261l5060J52708
14447E404864O1689j2961J878j2485J18486K69324K68226k34992k0654N43513
14437F386888j41625j59079L97745p1355L32339O7387n09895N54386j06059K88863
14427G039595J63053l28555K22921J55951K28858J0476O0905J73616O0434q7548
14417G699706M38517j99011J81369K30782L393J47716L428Q9296M13222J62558
14407I170976P8976m9887L33288k53795O08170K30628J674K48352J91856K53916
14397A0814154j45974j62951J045684p6170K06243J85114k55725M97736L51012
$$ y = [4453039, 4604119, 4287504, 4470498, 4466062, 4343134, 4279529, 4621824, 4466538, 4653807, 5075923, 4824630, 5139162, 4973098, 4913894, 5052414, 5331778, 5160955, 5287216, 5252156, 5404864, 5466553, 5453592, 5455470, 5442985, 5561471, 5830795, 6099021, 5864029, 5843375, 6386888, 6245263, 6086184, 6483929, 6412574, 6744913, 6812300, 6302405, 6856791, 6750732, 7039595, 7202648, 6874093, 7097014, 7252965, 7481823, 7492299, 7553204, 7726820, 7787254, 7699706, 8138223, 7939212, 8120581, 8351363, 8354756, 8502472, 8505900, 8595196, 9008418, 9170976, 9249952, 9200065, 9533353, 9279558, 9887728, 10118356, 10120030, 10368382, 10560238, 10814154, 10668180, 10505229, 11550913, 11474743, 11680986, 11866100, 11610375, 12108111, 12459123]
14388A2459123J78508K9829K71536M15101J38074K88835J64839K68669L23435
14379A4537949J20543M79538K94717L71349M8305M51355Q2405N12747O98214K1038
14369A7618160K48801L89629N7495P27683Q4067O54183M47684L25401J45615O53705
14359B1352423P33343J98098L70813Q54851M27413O72935Q34809M64277P40468
14350B6649430P89170L16661R43143N00442P38313O85902J042708P15867O79232
14341C3060868R42942J264638O97099O06640J713613J018969J242154Q72920J733783
14332D3153626P93867J578554J483502J367115J628169J467210J792678J927356
14324E5192077J384747K408933J755289K500096K046181K320240K340614K476316
$$ y = [12459123, 12637631, 12667460, 12938996, 13354097, 13492171, 13781006, 13945845, 14214514, 14537949, 14658492, 15138030, 15432747, 15804096, 15852401, 16303756, 16386161, 16898908, 17597122, 17618160, 17866961, 18256590, 18314085, 19041768, 19125835, 19780018, 20227702, 20553103, 20698718, 21352423, 22085766, 22283864, 22654677, 23509528, 23936941, 24609876, 25444685, 25908962, 26649430, 27438600, 27755261, 28698404, 29198846, 29937159, 30623061, 31665769, 32381636, 33060868, 34003810, 35268448, 35965547, 36572187, 38285800, 39304769, 40546923, 41419843, 43153626, 43947493, 45526047, 47009549, 48376664, 50004833, 51472043, 53264721, 55192077, 56576824, 58985757, 60741046, 63241142, 65287323, 67607563, 69948177, 72424493]
14316G2424493K967041K974533K842195L413990L435238M109911L111792M354189
14308I9633382L775788M596194M543703N006428N289543N584837O111940O597837
14300A41139652O694362P107315P511081P747712R069323Q930975R456899J0071247
14292B07728566J1142996J0935014J2040548J2695302J3142757J3281043J4209574
14285B95175800J4019788J5105476J4599611J5085551J4553798J4557538J3919057
14278C97016619J2830893J1765779J0317857Q876671O877952L238474k289336
14271D48634909l881004l948617K435513J72745m929892q665506j0666060j2283870
14263D06868218j3332615j4248096j4943076j5066669j5072522j5204307j4802686
$$ y = [72424493, 75391534, 78366067, 81208262, 84622252, 88057490, 92167401, 95279193, 99633382, 103409170, 108005364, 112549067, 117555495, 122845038, 128429875, 134541815, 141139652, 147834014, 154941329, 162452410, 170200122, 179269445, 188200420, 197657319, 207728566, 218871562, 229806576, 241847124, 254542426, 267685183, 280966226, 295175800, 309195588, 324301064, 338900675, 353986226, 368540024, 383097562, 397016619, 409847512, 421613291, 431931148, 440807819, 447685771, 450924245, 448634909, 444753905, 440805288, 443240801, 443413546, 438483654, 429818148, 419152088, 406868218, 393535603, 379287507, 364344431, 349277762, 334205240, 319000933, 304198247]
14256C04198247j4458079j4189012j3573909j2723797j1919788j1066649j1360605
14249B14906408j0832418r991500r751088q881473q227584p830595p540208p029109
14241A44822433p010019o275557n670430n501394m857999n448203m718775m391659
14233A00948397l900878m268200l577094l166314l699315l409870k740815l001099
14225G3184812k784927k274473k458356k168958k438726j956254k187792j767595
14217E5147731j451185k086220j697715j190230j359296j475356j603160j128541
14209D3156028j592823n60460j283035p26603j448872j022855j227850j018704
14201C4274826n04604n61612j289922n88665j208382m89185o66758m75348n95910
$$ y = [304198247, 289740168, 275551156, 261977247, 249253450, 237333662, 226267013, 214906408, 204073990, 194082490, 184331402, 175449929, 167222345, 159391750, 151851542, 144822433, 137812414, 131536857, 125866427, 120365033, 115507034, 110058831, 105340056, 100948397, 97047519, 92779319, 89202225, 86035911, 82336596, 78926726, 76185911, 73184812, 70399885, 68125412, 65667056, 63498098, 61059372, 59103118, 56915326, 55147731, 53696546, 51610326, 49912611, 48722381, 47363085, 45887729, 44284569, 43156028, 41563205, 41002745, 39719710, 38993107, 37544235, 36521380, 35293530, 34274826, 33770222, 33208610, 31918688, 31330023, 30121641, 29632456, 28965698, 28490350, 27894440]
14192B7894440j165384n66942p82806l95141p17132m49689l86233p60263m75866
14183B2194984m39175j18189p90327o57644l56857R6273n64018o81221o66641
14174A8017185R8694n38101k08464k78411n80321k27165m92083L5835m00344j69079
14164A5257746k08145k93383l02820l97662j19852k21567k98042m8955n21203
14155A2846117J17097k94096r5067j72561m94868m5120L7927k23638k88494j57480
14145A1229817l34666j41298k15387p8659k85788j70690J12125J22995n75052
14136I663397J90740n38942l5128r6725k58592k85430O2998j0554k75714K0334
14126H436384L4364l08075l45421K39028k80960R1819m03099Q6664j52973n1849
$$ y = [27894440, 26729056, 26162114, 25379308, 24984167, 24267035, 23817346, 23431113, 22670850, 22194984, 21755809, 21637620, 20847293, 20189649, 19832792, 19929065, 19365047, 18683826, 18017185, 18115879, 17577778, 17369314, 17090903, 16510582, 16283417, 15791334, 15827169, 15426825, 15257746, 15049601, 14756218, 14453398, 14055736, 13935884, 13714317, 13416275, 13367320, 12846117, 12963214, 12669118, 12574051, 12401490, 11906622, 11861502, 11899429, 11675791, 11387297, 11229817, 10895151, 10753853, 10538466, 10459807, 10174019, 10003329, 10115454, 10238449, 9663397, 9854137, 9315195, 9280067, 9183342, 8924750, 8639320, 8702318, 8691764, 8416050, 8436384, 8470748, 8162673, 7817252, 8056280, 7775320, 7867139, 7464040, 7550704, 7397731, 7345882]
14116G345882k58374k6128k37138j8127K15914l64771K7670l25922M33800k76048
14106F516758k44196J03683k01158K11689l65576k4629R3097m17044K48657k41640
14096E679641j11047q9390J71561l07004Q3438R8958p2428K10237n01536j78481
14086D983949Q0309J5196l16J7182l83373J83340j63681j68970L56811j91880
14076D728567j28308j19386J70563l76792K5881N4775L0800k79977R4693j44841
14066D055975J95676k33683J11531k55579r8958J40841J222R6897R2888n64690
14056C542120P5344K08662Q9550P0647m04655k85588M00989m61283J34331q9752
14046C280365P8842J48984j53046o2115l7904p5670P6624j29212Q1892j39048
$$ y = [7345882, 7087508, 7061380, 6824242, 6806115, 7022029, 6657258, 6684928, 6359006, 6792806, 6516758, 6272562, 6376245, 6175087, 6386776, 6021200, 5996571, 6089668, 5672624, 5921281, 5679641, 5568594, 5479204, 5650765, 5343761, 5427199, 5526157, 5453729, 5663966, 5162430, 4983949, 5064258, 5079454, 5079138, 5096320, 4712947, 4896287, 4732606, 4563636, 4920447, 4728567, 4600259, 4480873, 4651436, 4274644, 4300525, 4355300, 4386100, 4106123, 4200816, 4055975, 4251651, 4017968, 4129499, 3873920, 3774962, 3915803, 3917025, 4013922, 4106810, 3542120, 3617464, 3826126, 3915676, 3986323, 3581668, 3296080, 3697069, 3235786, 3370117, 3280365, 3359207, 3508191, 3355145, 3293030, 3255126, 3179456, 3256080, 3126868, 3208760, 3069712]
14036C069712j51932J85886P5627m27389K24131k1177l2275L100n2279O3957l01448
14025B635913L63787m14860k09154J86394p5169L13110k59089k01575K88973l2468
14015B595862j062l70229J34929J46702l82857Q049L9456j604j81289K30520j1668
14004B206809n7100n8640j57183L39325Q8094m00166N4143k9843J93300n20573
13994A658166J67653k64495O29719K7486J83643J428113L965691R218881J3693820
13985C0708677J3002190j6017585A1749277n193228j479085p80091o26940l5968
13977C633965n81430j60978O1674l31332K08659k2874l0563j90016j56829J2972
13967B443248p1118O8365l23803j3544K57448o0669K52064m29066L43109l65671
$$ y = [3069712, 2917780, 3103666, 3179293, 2751904, 2976035, 2954858, 2922583, 2925683, 2873404, 2937361, 2635913, 2999700, 2584840, 2375686, 2562080, 2486911, 2800021, 2540932, 2339357, 2628330, 2595862, 2594800, 2224571, 2359500, 2506202, 2123345, 2131394, 2170850, 2169246, 1987957, 2218477, 2206809, 2149709, 2091069, 1933886, 2273211, 2361305, 1961139, 2015282, 1985439, 2178739, 1658166, 1825819, 1561324, 2191043, 2218529, 2402172, 3830285, 7795976, 17014857, 30708677, 43710867, 27693282, 11749277, 6556049, 5076964, 4296873, 3669933, 3633965, 3052535, 2891557, 2953231, 2621899, 2830558, 2807684, 2777121, 2587105, 2430276, 2443248, 2372130, 2440495, 2116692, 2103148, 2360596, 2299927, 2551991, 2122925, 2466034, 2100363]
13957B100363l93189K51768J53749J42696j75186P492k12938N8028r2404j849
13947A838530j40392M50606l15859J53443J01815j50651j99502J64557J4389j78804
13937A738132k50790K54780m5873J19722j38708k13668L71098j34580k41343J35521
13927A594291k37843m7627K64934j99171p782L51001o9505k11299M5993K47669
13917A730661o98398M01287R0360J38605j76127p7975K9416k218j27008O27N682
13906A314912K64609j41865L20530J57965o34777J45201J26894k87286K31003
13897A497186p2219j54032J62919K53285m09814j45315M84946k99720j8963m6008
13887A252265R5862K70934l99809L3336k08920J75964M6310J63009L8244l11247
$$ y = [2100363, 1707174, 1958942, 2112691, 2255387, 2080201, 2087693, 1874755, 1932783, 1840379, 1838530, 1698138, 2148744, 1832885, 1986328, 2088143, 1937492, 1737990, 1902547, 1916936, 1738132, 1487342, 1742122, 1696249, 1815971, 1677263, 1463595, 1834693, 1700113, 1458770, 1594291, 1356448, 1308821, 1573755, 1374584, 1366802, 1717803, 1648298, 1436999, 1482992, 1730661, 1032263, 1433550, 1523910, 1662515, 1486388, 1408413, 1437829, 1435611, 1308603, 1309230, 1314912, 1579521, 1437656, 1758186, 1916151, 1281374, 1426575, 1553469, 1266183, 1497186, 1424967, 1270935, 1433854, 1687139, 1277325, 1132010, 1616956, 1317236, 1298273, 1252265, 1348127, 1619061, 1219252, 1252588, 1043668, 1219632, 1265942, 1428951, 1467195, 1155948]
13877A155948p3991L74468l1654p5464O3679j68812j22472j8682J70862K0310
13867A294192r0504r0513P1150J0233M9288j11466K80739m30769k45594M45915
13857A182671l98671J48740J58478j98677K31682L2389K3886k14823J44236j36789
13847I73122j01530L28925k7256k20408q4947M48470k99413j74090L22721l1706
13837A133888O9514J0586m38155K6302J86260N6377k02814q7555l0661M59081
13827A182823l02661K22308k17264O5930j9532k14117k15580N12747J70890K8024
13817A213568n51128K42174k07214j68662N48634j30814j38084k91032J35336
13808F52778M22739n5473l14655N275L06871m5730l429m49640K91288q0004p7407
$$ y = [1155948, 1081957, 1456425, 1424771, 1349307, 1412986, 1244174, 1121702, 1103020, 1273882, 1294192, 1203688, 1113175, 1184325, 1194558, 1243846, 1132380, 1413119, 982350, 736756, 1182671, 784000, 932740, 1091218, 892541, 1124223, 1156612, 1180498, 965675, 1109911, 973122, 871592, 1200517, 1173261, 952853, 867906, 1316376, 1016963, 842873, 1165594, 1133888, 1203402, 1213988, 775833, 802135, 988395, 1044772, 841958, 754403, 723742, 1182823, 880162, 1102470, 885206, 951136, 931604, 717487, 501907, 1014654, 1185544, 1213568, 662440, 904614, 697400, 528738, 1077372, 946558, 808474, 517442, 652778, 1075517, 1020044, 705389, 710664, 1017535, 971805, 968376, 518736, 810024, 730020, 652613]
13797F52613K86715J33466k54931n9960l19242O98444k34461j80184n7441k03967
13787D61052M39520l20142L0631j71055J85759K96942l50323J75943M6539C74063
13776A042151l89767q3195M25275m04290M3342j23734L71162B56188J56544K02700
13766F15432J22538K12171C42612K17786B60686P88755D7971M78066K25653j5369
13756G36321k78410j82466M04467k53714K21893J69196j9931j63028K00974k07257
13746F28045j18786K44463l44006J04755L30625k41425r1749B31603M70494k13038
13736D89059J27000M0926k57739K69220L2734J2741r8817k25328K18526K52055
13726H60377B51048M58235k0071k2482H6310O74300l65481K81628K8739k40282
$$ y = [652613, 939328, 1072794, 817863, 757903, 438661, 1137105, 902644, 722460, 665019, 461052, 900572, 580430, 611061, 440006, 625765, 922707, 572384, 748327, 794866, 374063, 1042151, 652384, 569189, 994464, 590174, 633516, 509782, 880944, 256188, 412732, 615432, 737970, 950141, 342612, 560398, 260686, 1049441, 47971, 526037, 751690, 736321, 457911, 275445, 679912, 426198, 648091, 817287, 797356, 634328, 835302, 628045, 509259, 753722, 409716, 514471, 845096, 603671, 511922, 231603, 702097, 489059, 616059, 656985, 399246, 668466, 701200, 713941, 615124, 389796, 608322, 860377, 251048, 709283, 689212, 666730, 86310, 760610, 395129, 676757, 705496, 465214]
13716D65214J77985l9420j94819m2397N54577k94251j67260J30521j06366j55190
13706C28594K77747J9931j8835O947n6921k593R8519p9978J41455k93408K25783
13695F47241k3489j55076o8716J46861j11258J54532B30657M47175k77012L55824
13685G56644k12047l113m8732k1687A12866L96766K7254j31096K16854j00128
13675E22516r042L00921B66284K70908p3953q7234Q0520r6020Q2323K31731l22107
13664C52452j11110p7813M76404K1913k39669m5525K9474J71953J11384l15727
13654C73736K15108j68721J01931B50115L83971B99314K42930r1923L7061j30982
13644C56400n3733K09591j92355J23535G8544M36371n1257j28213o7239M69189
$$ y = [465214, 643199, 603779, 408960, 366563, 921140, 626889, 459629, 590150, 483784, 328594, 606341, 626272, 607437, 614384, 557463, 554870, 653389, 573411, 714866, 421458, 647241, 623752, 468676, 399960, 546821, 435563, 590095, 230657, 677832, 400820, 756644, 544597, 541484, 492752, 471065, 112866, 509632, 536886, 405790, 622644, 522516, 513474, 814395, 266284, 537192, 463239, 376005, 456525, 360505, 442828, 674559, 352452, 241342, 163529, 639933, 661846, 422177, 376652, 406126, 578079, 689463, 373736, 588844, 420123, 522054, 250115, 634086, 299314, 542244, 450321, 487382, 356400, 302667, 512258, 319903, 443438, 78544, 514915, 463658, 335445, 268206, 737395]
13634G37395A67543M74911E7852L43609O9541j85029H5239K43203K19286j08911
13624D38817J85208A73731j8378L60092q9190J70401j7575j54524H4569L94275
13614D78844o1727A63596Q7514M3091M1464P8132M6437A32526L52504A96455N3501
13603B49956M1554r346L37357B66802L1103A37133l8743N82691l35512I0470K47319
13592C37789q3772A13431M11063n7521r1553j63954J81644j56701L7926L9553
13582C13888P0102a11272A25943P189K09470n7042j0977J1425Q9103j56688o8436
13571A49987R4998J41941j69750A2386K29153a87138F2142L40683R9588B16941
13560C31452B6358Q4522K47619o3302J99331B28761L53205F9212M18751j43330
$$ y = [737395, 167543, 642454, 57852, 401461, 471002, 285973, 85239, 328442, 547728, 438817, 624025, 173731, 155353, 515445, 426255, 596656, 579081, 424557, 84569, 478844, 417117, 163596, 251110, 294201, 335665, 413797, 460234, 132526, 485030, 196455, 249956, 291510, 282164, 619521, 266802, 297905, 137133, 98390, 681081, 345569, 90470, 337789, 254017, 113431, 524494, 466973, 375420, 211466, 393110, 236409, 274335, 313888, 383990, -111272, 125943, 133132, 342602, 285560, 274583, 286008, 375111, 218423, 149987, 244985, 386926, 217176, 12386, 241539, -187138, 62142, 402825, 502413, 216941, 331452, 26358, 110880, 358499, 295197, 494528, 228761, 581966, 69212, 487963, 344633]
13550C44633A54469n5345J88742j21751O0684l8348R619J19936M7338j59837L7361
13539B42868M5958K5134p0257J20165A43519R6242m111J43112F2337K77192J33764
13528D73293N2120B25505J65402j17854p1179L44735B46652J39642F0598N00214
13518E60812B69046m5553L72717j94621j40417j3784j21164K8822M6595l3892
13508A67749K2919K08653i3779B62099J98325j66304E4279M71092K074B59972
13497F1425b5307A98642K49995N9270D5250L5534K80522j50301L3439B2010Q2034
13486A04044a16414G6371K83166C3779M48048j51139j23263O7675E3591K15446
13476B69037j29057a06174B97588J18508c2990B39204M5583L03861k65630J3843
$$ y = [344633, 154469, 99124, 287866, 166115, 226799, 188451, 198070, 318006, 365344, 205507, 242868, 288826, 313960, 243703, 363868, 143519, 239761, 235650, 378762, 62337, 339529, 473293, 525413, 225505, 390907, 273053, 201874, 546609, 246652, 386294, 60598, 560812, 269046, 223493, 596210, 401589, 261172, 247388, 126224, 155046, 201641, 167749, 190668, 399321, -93779, 262099, 460424, 294120, 54279, 525371, 527445, 259972, 61425, -25307, 198642, 448637, 507907, 45250, 80784, 361306, 211005, 244444, 22010, 104044, -116414, 76371, 359537, 33779, 481827, 330688, 207425, 275100, 53591, 269037, 139980, -106174, 297588, 416096, -32990, 239204, 284787, 588648, 323018, 336861]
13466C36861j55845Q6642j28549K10639A08410K7117J84585L8082H5034K76200
13456C61234A19257L08412B3940J82630N5079A04298K90143A47120P943A8258
13445D59334A08022e6582B72777P9047r676j43940F5288g1993C49466j51727M9718
13434B47457o7997K0084G3709j8331J14977q3104C2019K80777q9712M6779O6200
13423C36063j19469D2997b6488G6256M0916B3908L904J47911C7054K37256K236
13412B76546E2848L38680R6578A27069K14217b1232A35301J55121A16695K27535
13402C44230J0982A00724J72134r177L11818L3648H224M51613q9386j49909D5706
13390B71994g1628j7333A72679p2667P9673A9725L42868H1680l5559b3450j3772
$$ y = [336861, 181016, 267658, 139109, 349748, 108410, 135527, 320112, 358194, 85034, 361234, 119257, 427669, 23940, 206570, 261649, 104298, 394441, 147120, 155063, 18258, 459334, 108022, -56582, 272777, 351824, 342148, 198208, 65288, -71993, 349466, 197739, 247457, 179460, 199544, 73709, 55378, 170355, 87251, 32019, 312796, 223084, 269863, 336063, 216594, 42997, -26488, 76256, 117172, 23908, 27812, 175723, 37054, 274310, 276546, 52848, 391528, 488106, 127069, 341286, -21232, 135301, 290422, 116695, 344230, 355212, 100724, 272858, 263681, 575499, 609147, 8224, 459837, 370451, 220542, 45706, 271994, -71628, -88961, 172679, 100012, 179685, 19725, 362593, 81680, 46121, -23450, -37222]
13379c7222D14851f3614B48486d2050a7426E16567A68976L04297a81877B73827
13368B53007E6365L453P4891J21443m162r991H0191c663B27923A03694J88216
13357B91910K3149D7681L25769Q767A14654D1113e9092D00112J34626j64429a24037
13345E86475A81968J12337K4424C9958L2300L14468j13440Q0728J15105A37699
13334A67954K021Q3177j17749O0878q4267N43317A35155m7292A267f7694B35236
13322D03279I191K69373j14509L011M63296B9681K44961j22710e3533E34205A79162
13310A8213J97964G3365i686E4368j7756h8430B10650J49292a72533B8056j618
13299B6438a76146A62761G3078J42250p966J10700j28829a45615B98926o8856
$$ y = [-37222, 414851, -63614, 248486, -42050, -17426, 516567, 168976, 473273, -181877, 273827, 253007, 56365, 59818, 134709, 256152, 251990, 241999, 80191, -3663, 227923, 103694, 291910, 315059, 47681, 373450, 382217, 114654, 41113, -59092, 400112, 534738, 370309, -124037, 586475, 181968, 294305, 318729, 39958, 72258, 386726, 273286, 354014, 469119, 137699, 167954, 169975, 253152, 135403, 196281, 112014, 655331, 135155, 87863, 1267, -67694, 235236, 403279, 9191, 278564, 164055, 167066, 630362, 29681, 274642, 151932, -53533, 534205, 179162, 18213, 216177, 73365, -9686, 54368, 36612, -88430, 210650, 359942, -172533, 28056, 26438, -176146, 162761, 73078, 215328, 207362, 318062, 189233, -145615, 298926, 230070]
13289B30070j02271n7307O1868J49699A19421M1044E4236O2736N13766D3589J28645
13278A72234i6085A4906J00099n6089O2266a08407L2291n6265B24634H0825J42264
13267B23089a10175F0056L7500J7533d9596q3911G817g1897b208F165e7214I8843
13254E3161a06078C48337b27448A19870J63851A02637a46289e8543r2885j7426
13244a68854K8066D822K00387a22367B82101j23719J91884a52480B84403A17633
13233I6019C5031d4442A77914F6029J20077g1302A20993l0210a43665A24254J52780
13222B77034i3511D7381Q056N7411J83371i1222A82249G5006L3494b67508f0041
13210A87018J94093A02640C1110K53293j02405G4424k9405K65450j33795K54461
$$ y = [230070, 127799, 70492, 132360, 282059, 119421, 160465, 54236, 116972, 630738, 43589, 172234, -96085, 14906, 115005, 58916, 121182, -108407, -76116, -132381, 224634, 80825, 223089, -110175, 60056, 97556, 115089, -49596, -133507, 7817, -71897, -2208, 6165, -57214, 98843, 53161, -106078, 348337, -227448, 119870, 283721, 102637, -146289, -58543, -151428, -168854, -140788, 4822, 205209, -122367, 282101, 158382, 350266, -152480, 284403, 117633, 96019, 35031, -44442, 177914, 66029, 186106, -71302, 120993, 90783, -143665, 124254, 277034, -93511, 47381, 55437, 112848, 296219, -91222, 182249, 75006, 108500, -267508, -60041, 187018, 381111, 102640, 31110, 284403, 181998, 74424, 45019, 310469, 176674, 431135]
13200D31135b2684B65763R0246M8079A2820J105L5587B3425a76288B6976a28345
13188A36836J52439h2151I962K33577A06706E2200J20351k7869C1614L70197C0252
13176B50887n9746g6309B65661q310f9936E13239k52809B5641J37619c0912A95039
13164B34974I122J51138m3408K70244j46246r2381F5185i9414m4529j36187Q5523
13153a94607A13296J10510d7097F7914K39107J7104a45775f5824K5871A89090
13142a94831I7393K7433e1859A84374a347A01133K9243a01516A49761K1894f1386
13130B70666H5032f4343b6639A08415e7627B9222a975A79184a25266B19021d0449
13118F6688b9158q020C32532b64577f2496C896a08615A49107g928k84378B67676
$$ y = [431135, -22684, 265763, 356009, 404088, 12820, 13925, 49512, 23425, -176288, 26976, -128345, 136836, 289275, -82151, 9962, 243539, 106706, 52200, 172551, 144682, 31614, 401811, 30252, 250887, 191141, -76309, 265661, 257351, -69936, 513239, 260430, 25641, 163260, -30912, 195039, 234974, 9122, 160260, 116852, 387096, 240850, 148469, 65185, -99414, -143943, -280130, -194607, 113296, 223806, -47097, 67914, 307021, 324125, -145775, -65824, -39953, 189090, -194831, 97393, 124826, -51859, 184374, -1347, 101133, 130376, -101516, 149761, 171655, -61386, 270666, 85032, -64343, -26639, 108415, -57627, 29222, -1975, 179184, -125266, 219021, -40449, 66688, -29158, -37178, 332532, -264577, -62496, 3896, -108615, 149107, -7928, -292306, 267676]
13106F6538j7186J22640J58723O6796A75310h4306C4529a54833e3277A11388e3060
13094F5046J70099G6459e1867B25237J07884a22063p4135A73699E76J23185J32695
13083B56456A6808L06777j45508A4821i2431A42407J5369p4248f9734k0644o3684
13072a54062G637L61335A0580K6089H734K353M12161a55963I7044M0597N7037
13061A94678E7025L35371b18261e7486B30756F9234i1601A31646J04653A01612
13050A47290B0580a06215C44718A51620b34775A66679B1053K20294j1850R6542
13040C26039A25109a49759A95611I7614a21123A97122k7945b11893A32838a78678
13029B55321A26673M04777a73017C73250l7482f7849j03935P5023A79594c6601
$$ y = [66538, 49352, 171992, 330715, 397511, 175310, -84306, 34529, -154833, -53277, 111388, -53060, 65046, 235145, 76459, -51867, 225237, 333121, -122063, -196198, 173699, 576, 123761, 256456, 16808, 323585, 178077, 14821, -92431, 142407, 157776, 83528, -69734, -90378, -154062, 7637, 368972, 10580, 36669, 8734, 11087, 423248, -155963, 97044, 137641, 194678, 57025, 392396, -218261, -57486, 230756, 69234, -91601, 131646, 236299, 101612, 147290, 20580, -106215, 344718, 151620, -234775, 166679, 21053, 241347, 229497, 326039, 125109, -149759, 195611, 97614, -121123, 197122, 169177, -211893, 132838, -178678, 255321, 126673, 531450, -173017, 373250, 335768, -67849, -171784, -96761, 179594, -36601]
13018f2519l069o6007k421C496J82549a9287A0804a43165A48956E8495M6974J67071
13006B72540j35443A0832a62787A67969n1541L5891a94278G5796J52028J21518
12996C49342o4609j32205a75425e6609A26855m7451L5104L58735A49556e7635
12985B22429m4329m8362l6363e3353I8053h1155c7064B34682a1279j37708A03072
12973A89728o3695f8958L0299C68177j54939G3824a86176B03682b03264e4265
12962a83684A62540J10876a09305O588l208B36444F0549K2097d53823E4267h2259
12950C9333d9881E5566h4746B62465A549M698O3117K16562j16965e426j4938M149
12938a6215I2027Q7609b85708A51257Q9780a11617q2904N8848b6947C58002j05673
$$ y = [-62519, -65588, -131595, -134016, 3496, 186045, -19287, 10804, -143165, 148956, 58495, 105469, 272540, 137097, 10832, -162787, 167969, 116428, 152319, -194278, 75796, 227824, 349342, 284733, 152528, -175425, -56609, 126855, 79404, 114508, 473243, 149556, -57635, 222429, 178100, 129738, 93375, -53353, 98053, -81155, -37064, 234682, -11279, -148987, 103072, 189728, 126033, -68958, -38659, 368177, 213238, 73824, -186176, 203682, -203264, -54265, -183684, 162540, 273416, -109305, -102717, -105925, 236444, 60549, 82646, -453823, 54267, -82259, 39333, -49881, 55566, -84746, 262465, 1549, 6247, 69364, 285926, 168961, -5426, -20364, -16215, 92027, 179636, -285708, 151257, 241037, -111617, -194521, -135673, -26947, 358002, 252329]
12927B52329m7168J28079H041i4805r1022B00328Q8131A42607c5903F1414k2084
12916C9330m397K78512g1657l7454H4848i6436A13650a04892l7516I7390a71939
12904a03792D18408G1242k0066Q0146a87688K363e5969h502C34948K8250a95839
12892C45243j58947C2610K62539I9365N0719L8337a2006A7286a17559B10626P2356
12881B82982C1439a80550B25234G8458M1507a11495k0858c0424H6434K72616a93038
12869h1891D9389e0669m727A33925K13234c32749M7416B7403Q6566b00853b7191
12857B1034O08794A11656f5040A31024B1429M7530c10467C359a57765B41521j19151
12846A22370J1087h5194Q292I3259K04682j22167i9355M4636G591a73260F9743
$$ y = [252329, 205161, 333240, 8041, -94805, -185827, 200328, 288459, 142607, -35903, 61414, 39330, 34933, 313445, -71657, -109111, 84848, -96436, 113650, -104892, -142408, 97390, -171939, -103792, 418408, 71242, 51176, 131322, -187688, -185325, -55969, -8502, 334948, 363198, -195839, 345243, 186296, 32610, 295149, 99365, 150084, 188421, -12006, 17286, -117559, 210626, 282982, 31439, -180550, 225234, 78458, 119965, -111495, -132353, -30424, 86434, 359050, -193038, -81891, 49389, -50669, -55396, 133925, 347159, -332749, -285333, 27403, 113969, -200853, -27191, 21034, 629828, 111656, -65040, 131024, 21429, 68959, -310467, 3359, -157765, 241521, 122370, 133457, -85194, -76902, 93259, 297941, 175774, -99355, -54719, 7591, -173260, 69743]
12834a86748I1730D0642e4701F9414h4697A24714J28665n1510A2683M8774J49219
12823B10676E1219J2206P6547C6784J59017C5244a72696B27108C4418a95783O2178
12812a33605A89184m409a1164j82612F0949j2215e4986j45870A81458a01569D48899
12800i1416D1583J27062h5754L8743A58323e4807B52505g8959L8562j43907h5773
12788a9764k02520C34429A26207A116K44652A15104i5030b7891A68279B2523b5121
12776C12872A1331b33737H7962B9943J55001P2493A9902J17219a546j82527A11483
12764D52330d78394a30345B3213Q7993C3775a29416k69939D4012P5004e9486H7917
12752a11227l2363F2843O8269a04655B35440k4313E1939b28013C74219f6093k3208
$$ y = [-186748, 91730, 40642, -54701, 69414, -84697, 124714, 253379, 201869, 12683, 61457, 210676, 51219, 63425, 139972, 36784, 195801, 35244, -172696, 227108, 34418, -195783, -133605, 189184, 184775, -11164, -193776, 60949, 48734, -54986, -200856, 181458, -101569, 448899, -91416, 41583, 168645, -85754, -47011, 158323, -54807, 252505, -78959, -40397, -184304, -85773, -19764, -222284, 334429, 126207, 1116, 245768, 115104, -95030, -27891, 168279, 22523, -25121, 312872, 11331, -233737, 87962, 29943, 184944, 257437, 19902, 137121, -1546, -184073, 111483, 452330, -478394, -130345, 23213, 111206, 33775, -129416, -399355, 44012, 119016, -59486, 87917, -111227, -143590, 62843, 131112, -104655, 235440, 211127, 51939, -228013, 374219, -66093, -89301]
12741h9301A42285j1183b64677A67908a48842A79239D1777c2295A16600a3310
12730G7801J12631H4072l1136g3188H7108B7163J0041K01505a14046F9762g9574
12718E2835J88777g830j31516A05240J9082D8783P9753P6183j9881A1062J50047
12707A61109A1586i1694h107A31288k7322J17882d7334B05016K31545a92300R560
12696a82740o507F3325a63704n1624I5397h8842A64820b1656j23985A15725J40561
12685B56286h4759A62464Q9923A16512a23427c7749k958R690C02587j16587a20215
12673g2269C05907c79392I3422b91971a38088N5080A93043L55139k40684p5520
12663B31978b40262A94989C6462Q9528M17645j88776A17513a62908A20269R3728
$$ y = [-89301, 142285, 131102, -264677, 167908, -148842, 179239, 41777, -32295, 116600, -13310, 77801, 190432, 84072, 52936, -73188, 87108, 27163, 37204, 238709, -114046, 69762, -79574, 52835, 241612, -7830, -139346, 105240, 124322, 48783, 128536, 204719, 184838, 11062, 161109, 11586, -91694, -8107, 131288, 103966, 221848, -47334, 205016, 436561, -192300, -182740, -189247, 63325, -163704, -215328, 95397, -88842, 164820, -21656, -145641, 115725, 256286, -84759, 162464, 252387, 116512, -123427, -37749, -40707, -31017, 302587, 186000, -120215, -72269, 305907, -379392, 93422, -291971, -138088, -83008, 193043, 548182, 307498, 231978, -240262, 194989, 36462, 125990, 543635, 354859, 117513, -162908, 120269, 213997]
12653B13997o0380E0693K37908O1863d2639A35579a97020G5787a67243B01214
12642A28743k6029M5009A8433O8452O4067e0637B0948L51763A68234H2398M8824
12631A31222a11396k48373a62238F8756K01465g5628B81359I754K5750K70452
12621C05956a34501c3006D5658J73189j07025j9534L7865a86017B3051L08278
12611C31329a4777A20317P6000a44521A53907J0819F0651d3067B13386c9744B54679
12599A78389k9623m49A8606a64452G2779a23054J2329j3278A52105b164G0110
12587c5701C19570a65640j59966h5232A1328J47768a58655B16564l4172b78172
12576c5767C9428J19710c5924l0433F6505a45163a9177j37423C19838D4738i1586
$$ y = [213997, 153617, 50693, 288601, 350464, -42639, 135579, -197020, 75787, -167243, 201214, 128743, 102714, 147723, 18433, 86885, 150952, -50637, 20948, 372711, 168234, 82398, 131222, -111396, -359769, -162238, 68756, 270221, -75628, 281359, 9754, 35504, 305956, -134501, -33006, 45658, 218847, 111822, 92288, 130153, -186017, 23051, 331329, -14777, 120317, 196317, -144521, 153907, 164726, 60651, -43067, 213386, -39744, 254679, 178389, 148766, 148317, 18606, -164452, 72779, -123054, -110725, -124003, 152105, -2164, 70110, -35701, 319570, -165640, -325606, -85232, 11328, 159096, -158655, 216564, 182392, -278172, -35767, 39428, 159138, -35924, -66357, 66505, -145163, -19177, -156600, 319838, 44738, -91586]
12564c7704A49876p1786N1027a32145F0229A4589a5421B75718L449b9993J1948
12553a8045A15008O7447a18739a7770j33242A11275K76195D5310d6960l26967
12543c73927B71834o6065F3125a52771E1850e4199n6252A32750g8959E0554D683
12531B62742I7600h1834K3181H4975j9791a91020A84934G838J01402a61589B6429
12519C10920A55346n335b12683A6807e1577B96621A0472K5832a70024d0326G5233
12507A20761e9378j81070i3977A08107J07016J2868j03060K84396g1390A85109
12496a45773B2172J81010C1819a01790j55295a513r907j3068g49B59186r6413
12485A62773Q3623a22150A68830G2206a06159K7245I7502M5237c76628A10931
$$ y = [-37704, 149876, 78090, 129117, -132145, 60229, 14589, -15421, 275718, 279167, -29993, -18045, 115008, 182455, -118739, -17770, -151012, 111275, 387470, 45310, -46960, -373927, 271834, 205769, 63125, -152771, 51850, -54199, -110451, 132750, -78959, 50554, 4683, 262742, 97600, -81834, -58653, 84975, 65184, -191020, 184934, 7838, 109240, -161589, 26429, 310920, 155346, 150011, -212683, 16807, -51577, 296621, 10472, 36304, -170024, -40326, 75233, 120761, -59378, -240448, -93977, 108107, 215123, 227991, 124931, 409327, -71390, 185109, -145773, 22172, 203182, 31819, -101790, -257085, -1513, -11420, -24488, -749, 259186, 162773, 246396, -122150, 168830, 72206, -106159, -78914, 97502, 142739, -376628, 110931]
12474B46791A8026e6450K0741o5130B1809e9632C04531C7387I929K12789K00218
12463D22936d2150J0361A0332b28158F3510L462R2960b15579c7092n1266C1155
12451B18915N3186d62677A87928a39909A44506E7217M8170b14852A42563a74036
12440D249O3579c2356G2012j352a22518r8457f8735r1850b7657A4693K05547g7952
12427a20873n369r1335A74231o9088l0442J54681k6970c71135A92070e820l63045
12416c68865A23535c2677k6311m3859I7515e64455A98851c14635F8449J02354
12406A70803K1264J08000c92695c2590B22323a05188A65269O7251j6019M5504
12396B62005A26958N9840Q8460D097d3245j0908J2969B0597a56701M1711A43115
$$ y = [246791, 18026, -56450, -35709, -100839, 21809, -59632, 304531, 37387, 9929, 222718, 422936, -42150, -31789, 10332, -228158, 63510, 66972, 159932, -215579, -37092, -88358, 31155, 218915, 272101, -462677, 187928, -139909, 144506, 57217, 105387, -214852, 142563, -174036, 4249, 67828, -32356, 72012, 70660, -122518, -220975, -68735, -160585, -27657, 14693, 220240, -77952, -120873, -126242, -217577, 174231, 105143, 74701, 229382, 202412, -371135, 192070, -5820, -368865, 123535, -32677, -58988, -102847, 97515, -564455, 198851, -314635, 68449, 170803, 192067, 300067, -392695, -32590, 222323, -105188, 165269, 232520, 216501, 262005, 126958, 186798, 275258, 4097, -43245, -54153, -41184, 20597, -156701, -114990, 143115]
12384I533N512J41660b01133P502F2393d8163A88306i7922k46354J00670e8911
12372F9362k5314J40852m6908h305r0925j49820C59567a33702B1851J35536a47679
12360I1956R0088b33602a6190n9875r2541B4170a71951r8896A80270l0990F9711
12348C74598B2646J14334a3140l505k0749C24647h4353A02164J05762c60406A3443
12336A5667h6070o4094A92219e4085a2600B63089H714a75264C5481K16754b90878
12324D1132b97366A27150A4604Q8006c50909I9229B5633h7488k51032B32379g1034
12312B21358E3717b52828H3234M9455J12410a02370B8984h6109i883n3230n4646
12301a17759L1767A66084d7284A5739b33890B89929r6801o9714f0267a7771B59871
$$ y = [9533, 15045, 156705, -201133, -193631, 62393, -48163, 188306, -97922, -344276, -243606, -58911, 69362, 44048, 184900, 137992, -8305, -99230, -249050, 359567, -133702, 21851, 157387, -147679, 91956, 182044, -233602, -16190, -76065, -168606, 24170, -171951, -270847, 180270, 149280, 69711, 374598, 22646, 136980, -13140, -16645, -37394, 324647, -84353, 102164, 207926, -360406, 13443, 15667, -86070, -150164, 192219, -54085, -12600, 263089, 8714, -175264, 35481, 252235, -290878, 41132, -297366, 127150, 14604, 102610, -350909, 99229, 25633, -87488, -338520, 232379, -71034, 221358, 53717, -252828, 83234, 132689, 245099, -102370, 28984, -86109, -9883, -63113, -117759, -85992, 166084, -47284, 15739, -233890, 289929, 193128, 123414, -60267, -17771, 259871]
12289A4789Q3680b47800O4444K4224I6674a00737B61852c79036D3537J01559d7575
12277a0093G9883k1725J20922o5045b72314D7608a69308E3107b59154e9985r9863
12266a59848j6571e3782m1851r1919A33155Q152B0509J10167f3460j46235R2857
12255a16838j63595F3397b5421A05306k8770O2312J36634o3662f178B13725a63927
12243a04170B28092B8849a29894C58442j50510E7655j3370a46610K807A29500
12232C4139O170a78092e5088B70320b9633F8748B0538K03470J68398j63145c2248
12220A99887B117L90302A67661b3090C67169D0729K0294M43156B19093Q2934a38523
12208B72167i490j39505C85550j26896c9544i555E7536K0932O4301K54905J01761
$$ y = [14789, 98469, -247800, -183356, -159132, 96674, -100737, 261852, -379036, 43537, 145096, -47575, -10093, 79883, 58158, 179080, 114035, -272314, 47608, -169308, 53107, -259154, -59985, -159848, -176419, -53782, -95633, -187552, 133155, 141307, 20509, 130676, -63460, -209695, -116838, -280433, 63397, -25421, 105306, 76536, 138848, 275482, 211820, -6178, 213725, -163927, -104170, 228092, 28849, -129894, 358442, 207932, 57655, 44285, -146610, -143803, 129500, 34139, 40309, -178092, -55088, 270320, -29633, 68748, 20538, 224008, 392406, 229261, -32248, 199887, 2117, 392419, 167661, -23090, 367169, 40729, 61023, 504179, 219093, 302027, -138523, 272167, -9490, -148995, 385550, 258654, -39544, -9555, 57536, 78468, 142769, 397674, 499435]
12197D99435H4522J62863G8273e8518C86667A19056J52877J641L5973I0449M56181
12186E46630a06678E8128B3114e1991D43859E4863a83135B38367N3539K3377r7680
12175B17603P2094R4906J70600G3911K85379a44571N8198A64871K47149j99055
12165B12965K6711r7857F4467K17645J09809A53931a53669g618C93302A39570
12154A10957d5662A62758N0469r0188N6816A9577a02674A15697R0887K3517A2856
12142c31907A01257c19125a42406A435a9348A06003a37194j7932j11300O3572
12132b02854h6189d2527A63981p4950a31801A98385o7595J89794A15940M6807
12122A62747K0515a67750C50524b6707B04485a40971B96090b3695B03185k0650
$$ y = [499435, 84522, 247385, 78273, -58518, 386667, 119056, 271933, 273574, 309547, 90449, 546630, -106678, 58128, 23114, -51991, 443859, 54863, -183135, 238367, 291906, 315283, 217603, 289697, 384603, 555203, 73911, 359290, -144571, -86373, 164871, 412020, 212965, 239676, 141819, 64467, 282112, 391921, 153931, -153669, -7618, 393302, 139570, 110957, -45662, 162758, 213227, 123039, 179855, 19577, -102674, 115697, 206584, 230101, 12856, -331907, 101257, -319125, -142406, 1435, -19348, 106003, -137194, -155126, -266426, -202854, -86189, -42527, 163981, 89031, -131801, 198385, 130790, 320584, 115940, 162747, 183262, -167750, 350524, -26707, 204485, -140971, 296090, -23695, 203185, 182535]
12112A82535R0966E8711K45941H5058g3207p6262A99183b78456b0108j5375j11116
12101a46599i657C00263j36011o0469b1655A69668G7108a383B01371c0947C18398
12089c8141A89321q8946L9701a011k95319f8113A3380M34079I2720J4507c68702
12077A04020b14426M2895A37427a4434A2928a09398G1293a32102F0848N6717L20944
12066D38509K66082M71629B25746E9091B2037J77088c09674O7036A78022f8073
12055a86680c7312j34606A00810a79645C51897a60409A52229a34615j99822C60083
12044a20550G4021a455C8746o361a78208J504N5518e0229F9120f1810D922b33078
12031A62071A4641i3319j30197A63361m2868c84971A89631m9047E0892M3356a5243
$$ y = [182535, 273501, 58711, 304652, 85058, -73207, -149469, 199183, -278456, -20108, -35483, -146599, -9657, 300263, 164252, 103783, -21655, 169668, 77108, -1383, 201371, -30947, 318398, -38141, 189321, 100375, 140076, -1011, -296330, -68113, 13380, 447459, 92720, 107227, -368702, 104020, -214426, -171531, 137427, -14434, 12928, -109398, 71293, -132102, 60848, 117565, 438509, 704591, 1176220, 225746, 59091, 22037, 199125, -309674, -242638, 178022, -68073, -186680, -37312, -171918, 100810, -179645, 351897, -160409, 152229, -134615, -334437, 360083, -120550, 74021, -1455, 38746, 32385, -178208, -176704, -121186, -50229, 69120, -61810, 4922, -233078, 162071, 14641, -93319, -223516, 163361, 120493, -384971, 189631, 140584, 50892, 94248, -15243]
12019A50229J82305f4154A80825B7777d4725l5129c4423A30165e7413C49996j71903
12008A78093B2045d8551H4214k4406a44279B631J0137K78499G3233a02206k4098
11997a26304k16193i950A83256d7274k07188g3766j45871k2559A17473q404i8487
11985h2780b7388B6775J81686H4193K55273C9242M5799C5989J99551G3711A9811
11973D937e5999A4812a13581a2601o2720E7109B1205Q7927b00642J0858B7178
11961a23779B30531a16508p5041m1319n7828A79111d29791e6027p9390b3880C14237
11949b0433I8093a84217C26663b50909k8799i1456A20581e4533D8220J18282b39466
11937G0320a84541o554b0367E632J27499a11679B46368a72750B5109R10q274K00246
$$ y = [150229, 332534, -64154, 180825, 27777, -44725, -79854, -34423, 130165, -57413, 349996, 178093, 22045, -48551, 84214, 59808, -144279, 2631, 12768, 291267, 73233, -102206, -126304, -342497, -9950, 183256, -47274, -254462, -73766, -219637, -242196, 117473, 109069, -98487, -82780, -27388, 26775, 208461, 84193, 339466, 39242, 85041, 35989, 235540, 73711, 19811, 4937, -55999, 14812, -113581, -12601, -75321, 57109, 21205, 109132, -200642, -189784, 27178, -123779, 230531, -116508, -191549, -232868, -290696, 179111, -429791, -56027, -135417, -23880, 314237, -20433, 98093, -184217, 326663, -250909, -279708, -91456, 120581, -54533, 48220, 166502, -239466, 70320, -184541, -191095, -20367, 5632, 133131, -111679, 246368, -172750, 25109, 26019, 17745, 217991]
11925B17991b31081n0367C8015a10742i799A99470e395D6769e9915b3012k56110
11914b79122G5032j3365q400e9355D3838A1831K23609M4578a74299M263A23508
11902D7755i5443n1524g0992F1212k2957e3940j43025f8588H8998g3465A05521
11890F4846J36857q5966a19358k9532A01930b20294a9443j00079A196i5227A44171
11878c01434d4207C3988K32847A0452a60554j62612C7481O5760a54920B31263
11867a87856B5468c02569h353n4655A61271b29706C7850a14281j6385C28978e3985
11855A53421M820a34952H1398B6972J14478g2496j81799c981A13890k6998b3915
11843c05050B03156b0620n2108b0935k23803d0632j20527D382O2622b7678n6842
$$ y = [217991, -231081, -281448, 38015, -110742, -9799, 199470, -5395, 46769, -59915, -23012, -279122, 75032, 61667, 53267, -59355, 43838, 11831, 235440, 280018, -174299, -170036, 123508, 47755, -95443, -146967, -70992, 61212, 38255, -53940, -196965, -68588, 88998, -73465, 105521, 64846, 201703, 115737, -119358, -148890, 101930, -220294, -19443, -119522, 1196, -95227, 144171, -301434, -44207, 33988, 266835, 10452, -160554, -323166, 37481, 103241, -154920, 231263, -187856, 25468, -302569, -8353, -63008, 161271, -229706, 37850, -114281, -130666, 328978, -53985, 153421, 158241, -134952, 81398, 26972, 141450, -72496, -254295, -3981, 113890, 86892, -23915, -305050, 203156, -20620, -72728, -20935, -244738, -40632, -161159, 4382, 67004, -27678, -84520]
11832h4520D4626b13584a05259a8264q6543A32949b30889A78164a05714a2213
11821D2574c51985H5679i8528k5232b6980B12116h0560n7241j0594B37406G9437
11809a84420H9995a93335H5760h416l2002F7100q620J80246a59878A6465b14804
11797b11744k71321A77716b33469i1775j41898H111L60107a71372b7153G532M9195
11786E6727a08619k2447H8457b3004l4437A53816I713a354n0327A36581c20143
11774a5491A09171J4432d619n0880A09825a44990A15644J18145d10489h7399Q591
11763g8808A51282a67602j16989j74210J91711G0646f20319G3670b71541A58004
11752a19097A25768b38258J03738A26663D4930K08189b59229P8670O9333k66460
$$ y = [-84520, 44626, -213584, -105259, -18264, -104807, 132949, -230889, 178164, -105714, -12213, 42574, -351985, 85679, -98528, -123760, -26980, 212116, -80560, -137801, -148395, 237406, 79437, -184420, 89995, -193335, 85760, -8416, -40418, 67100, 58480, 238726, -159878, 16465, -214804, -211744, -483065, 177716, -233469, -91775, -233673, 8111, 368218, -171372, -27153, 7532, 56727, -108619, -131066, 88457, -23004, -57441, 153816, 9713, -1354, -51681, 136581, -320143, -15491, 109171, 123603, -4619, -55499, 109825, -144990, 115644, 233789, -410489, -87399, -78808, 151282, -167602, -284591, -458801, -267090, 70646, -620319, 73670, -271541, 158004, -119097, 125768, -238258, -134520, 126663, 44930, 253119, -259229, -180559, -111226, -377686]
11742c77686A15874h8348m223n9958D0057J36842B7727J5551b75367B8887c88173
11730b02197c435A05561b4832C1594e8060F0104a90626f5276A128a47473j5232
11719a62705J7756A26609b34204a15268B2082e2564m8146b5986A7899J84542c2003
11707a20733j06939A53353B1321K3882e718j08216M5735A19564b57822I7964c73061
11695a49004B54563j21901b25197C3906b17722K6876N6084e1728k30054a35176
11684g71A51087a08444j19670k4893j5427M0704C1946a79942c4669B96068j41745
11673A54323o0446m5200a40908O0822j44016f3991a4168n8593j18382h3655C13555
11661E1047Q312k9328b18778e5412k9169p6062H1730M8177Q5702g4916r8852I0224
$$ y = [-377686, 115874, -88348, -92571, -152529, 40057, 176899, 27727, 43278, -275367, 28887, -388173, -202197, -3435, 105561, -24832, 31594, -58060, 60104, -190626, -65276, 1128, -147473, -162705, -144949, 126609, -234204, -115268, 22082, -52564, -100710, -25986, 17899, 202441, -32003, -120733, -227672, 153353, 21321, 45203, -5718, -113934, -68199, 119564, -257822, 97964, -373061, -149004, 254563, 132662, -225197, 33906, -217722, -190846, -134762, -51728, -281782, -135176, -771, 151087, -108444, -228114, -253007, -268434, -227730, 31946, -179942, -34669, 296068, 154323, 93877, 48677, -140908, -80086, -224102, -63991, -14168, -72761, -191143, -83655, 313555, 51047, 59359, 30031, -218778, -55412, -84581, -160643, 81730, 129907, 215609, -74916, -173768, 90224]
11648a68322r6230a01297k6404J651j58280Q5378g0194A72000I544f0816A09183
11636H849g4985Q072J9681C09307a12059k70362B40306A11998L7857a11093m0825
11625a51918q6675c7415D04925a68047A66866C1463a17967A7334h7006J210h857
11613B00876a59821f3200E9508J07809h7527K1957a6466n3918p3720b3788A57639
11601c76007c0303A3337b4238j1244B06003c4382m8386K6562K7368j32667A00517
11589f0582F652i1349k02387E4955O3990a99269A15961M6089E2315O7271a4324
11577B03044q7475a02912L5384j90941b2086B10334b46508C20644B7894a70263
11566a70139B3493c0552p7665A44266c9197m1150A21003g0657A65192a27971I2084
$$ y = [-168322, -264552, -101297, -127701, -126050, -284330, -198952, -70194, 172000, 9544, -60816, 109183, 8849, -74985, -66913, -47232, 309307, -112059, -382421, 240306, 111998, 149855, -111093, -151918, -238593, -37415, 404925, -168047, 166866, 31463, -117967, 17334, -87006, -85796, -8857, 200876, -159821, -63200, 59508, 167317, -87527, -65570, -16466, -70384, -144104, -23788, 157639, -376007, -30303, 13337, -24238, -35482, 206003, -34382, -82768, -56206, -28838, -161505, 100517, -60582, 6652, -91349, -293736, 54955, 118945, -199269, 115961, 162050, 52315, 119586, -14324, 203044, 115569, -102912, -67528, -258469, -22086, 210334, -246508, 320644, 27894, -170263, -170139, 23493, -30552, -108217, 144266, -39197, -80347, 121003, -70657, 165192, -127971, 92084]
11554b3099j90730A1492b20285F8327b26115g1128I2914K50F72f3496I783g9577
11541h9508d220j0217k36973f1791j04313a8555D4764K10316b05149A34968Q2569
11530B17537h3428l1708A09782K44918G7025J0903c1334I3980a88650p3438A75369
11518A75305o408F7630b9847E4889J6550a0451B08922B210K0863b0326l9866B56905
11505B71313B1513b26052e7096A22432m927A2087N4062K18370F9762J20983L8634
11494B29379b4306A711b1186k42632g2696J4793a9922B09553A7127J12994J2722
11483A42843F6053h1198r162H7692l8801g4383j0085A77278C3416J57772R684
11472B00872M7788F3267J62798a8498j01650A01225E0191M4766a0709B74587a0822
$$ y = [-23099, -213829, 11492, -220285, 68327, -226115, -71128, 92914, 93164, 672, -63496, 9783, -79577, -89508, -4220, -14437, -251410, -61791, -166104, -18555, 44764, 255080, -205149, 134968, 217537, -83428, -115136, 109782, 354700, 77025, 87928, -31334, 93980, -188650, -262088, 175369, 175305, 168897, 67630, -29847, 54889, 71439, -10451, 208922, 2210, 23073, -20326, -60192, 256905, 271313, 21513, -226052, -57096, 122432, 117505, 12087, 66149, 284519, 69762, 190745, 229379, -24306, 1711, -21186, -263818, -72696, -57903, -19922, 209553, 17127, 130121, 142843, 66053, -81198, -90360, 87692, 48891, -74383, -84468, 177278, 33416, 191188, 200872, 248660, 63267, 226065, -18498, -120148, 101225, 50191, 94957, -10709, 274587, -10822]
11460F5115J01064J38124H9178J63814a98740q1612K2105D59923H2877f3920k76750
11449c40670B35235a45972C52283A07183d2691B80299O8952a29612B30746c600
11438C23361a36899P161F0097J19151F5321L8633D9865a61690A86626a39487A93204
11426i5074o0320A14098b15343g6281j50407D2597R9915a29587I9392B3133N031
11415B8164R1339n8643L3830J65899b48834g5506k76497A5838a78848c7487A07777
11403a99051I1521C7797b86595d1210C4329P9661i8377J427j4755M303B790a25528
11390a99003Q9557p4593P8239o4342A9516c96880e7568G9069c26783A31908B9691
11378A93625B7767a5203j37289e2860k32551J06886h2670k7469B37574f4366R202
$$ y = [65115, 166179, 304303, 89178, 252992, -198740, -280352, -258247, 459923, 82877, -63920, -340670, 235235, -145972, 352283, 107183, -42691, 280299, 349251, -129612, 230746, -3600, 323361, -136899, -129738, 60097, 179248, 65321, 103954, 49865, -161690, 186626, -139487, 193204, -95074, -155394, 114098, -215343, -76281, -226688, 42597, 142512, -129587, 99392, 23133, 28164, 119503, 60860, 94690, 260589, -248834, -75506, -352003, 15838, -178848, -37487, 107777, -199051, 91521, 37797, -286595, -41210, 34329, 113990, -98377, -96950, -111705, -107402, 2790, -125528, -199003, -109446, -184039, -105800, -170142, 19516, -396880, -57568, 79069, -326783, 131908, 29691, 193625, 27767, -15203, -152492, -52860, -285411, -178525, -82670, -110139, 237574, -64366, -55164]
11367e5164j58473O0669I7747e3276q5815k13259c1197k599B36186h3445p5045
11356a58490d8233k9865j6687C27801b26261a0351l36431h5931k51743A24096
11345B25510H4828J69715b58293b3964I9513J90906A00388a87156G7394a30763
11334a77450p0346A01988a62801A40564b29828J11809l3865j03555E03620k03999
11324B99621f6758p1328A73397a78185l2145J4163F2172b41806B09584E4994a67516
11312C4110h7397j03034d7091O755C0075a92750A65f6116a4045k34609a10401
11300i2883j70844J20890A08885c66236J41754j09624A32533f5500o8204d3048
11289B44260g7163A43282c51202A1789K30628a74633B8152f2836A22438c0534
$$ y = [-55164, -213637, -152968, 97747, -53276, -139091, -352350, -31197, -33796, 236186, -83445, -158490, -48233, -78098, -94785, 327801, -226261, -10351, -346782, -85931, -337674, 124096, 225510, 84828, 254543, -258293, -23964, 99513, 290419, 100388, -187156, 77394, -130763, -177450, -247796, 101988, -162801, 140564, -229828, -118019, -151884, -255439, 503620, 299621, -66758, -138086, 173397, -178185, -210330, -196167, 62172, -241806, 209584, 54994, -167516, 34110, -87397, -190431, -47091, -40336, 30075, -192750, 165, -66116, -14045, -248654, -110401, -92883, -263727, -142837, 108885, -366236, -224482, -334106, 132533, -65500, -133704, -43048, 244260, -77163, 143282, -351202, 11789, 242417, -174633, 28152, -62836, 122438, -30534]
11278A5127L8537Q6583a22616l77465J88898A40240b15265j22952f3527l2248
11268i5775G0133a05788B09559K7847b1355n6380j60782A12288d4679l51076a29098
11256e3077j69215R9504A25488b83143P3442R502p1669I5399b68648H1303b7521
11244f8954q4082E3136b95093j38952a21254A03541b5606C77592A76932c5155
11233b14771G6618a91450A07365a05797q1323c182r5735r404B57720f2998j10465
11222a73463b9266j26091A3329b96338D5285J28462f738A10300a63642A54718
11211A0018J03987N2420c3909l27593C12098j27175F7991e6930A44495a93699
11200a74347I2253e8897l7239G5562c16777f7230O408A30187e2598D9027J33374
$$ y = [15127, 53664, 140247, -122616, -500081, -311183, 140240, -215265, -338217, -63527, -95775, 70133, -105788, 209559, 237406, -21355, -77735, -238517, 112288, -44679, -395755, -129098, -53077, -222292, -122788, 125488, -283143, -209701, -200199, -271868, 95399, -268648, 81303, -27521, -68954, -153036, 53136, -295093, -434045, -121254, 103541, -25606, 377592, 176932, -35155, -214771, 76618, -191450, 107365, -105797, -187120, -3182, -98917, -108321, 257720, -62998, -173463, -29266, -155357, 13329, -296338, 45285, 173747, -6738, 110300, -163642, 154718, 10018, 114005, 166425, -33909, -361502, 312098, 184923, 67991, -56930, 144495, -193699, -174347, 92253, -58897, -96136, 75562, -316777, -67230, -60822, 130187, -52598, 49027, 182401]
11189A82401c86136C70519c9740j84905O3756j33602A42062a5274I7666c42011
11178c7331B46590g1370D18127j58895A09486K19321i7676r556C50045i4577I036
11166a57547b1573o1349H036h7875j31979R4856K2946A19425E8503b00793B37360
11154i2041F7029J57255b06452D8813a4005B3413b87635j50250B15006a60593
11143A37860d55592A32442c7337A27230a25408c9146b386G4527a27493e0763F6056
11131d2184j5751G2554j4842h3936A5964K43051k0509b33365a5284A55577a5152
11119A07449a30948e1659B20742r0681K19528A51477m4356l3486a61966B19669
11108A49866a8804A3610M72050k35178a97976j6709A70910R5387j2881j17721
$$ y = [182401, -386136, 370519, -39740, -224645, -160889, -294491, 142062, -15274, 97666, -342011, -37331, 246590, -71370, 418127, 259232, 109486, 328807, -97676, -107232, 350045, -94577, 9036, -157547, -21573, -82922, 8036, -87875, -219854, -124998, -102052, 119425, 58503, -200793, 237360, -92041, 67029, 224284, -206452, 48813, -14005, 23413, -287635, -437885, 215006, -160593, 137860, -455592, 132442, -37337, 127230, -125408, -39146, -2386, 74527, -127493, -50763, 66056, -42184, -57935, 72554, 57712, -83936, 15964, 259015, 238506, -233365, -15284, 155577, -15152, 107449, -130948, -51659, 220742, 130061, 349589, 151477, 107121, 73635, -161966, 219669, 149866, -18804, 13610, 485660, 250482, -197976, -214685, 170910, 266297, 253416, 135695]
11098A35695O0101J23371A23880c1382p4422A25280H543a0130C46509j49881J34194
11087C30822J42109B6387c3701B26383c07191a53014G5229b61493A85656m97I1960
11075g2152A96592F821K32048J56208L1975B7214J14233O9643o1418b6372F3915
11063C16585P0137K18000G6759J38830I0475L04490I5054K05982J46953P4522
11053E22511k43470Q3078A22257P0900n6452L01871J71588j00075K89891j88118
11043F11862l2886o2881J49778k62902K45340k01889A87889K53653J26047j79574
11033C88015J67091j11959J66559l1105k18016K41144k44649r0809L60313k05855
11023D20729m9037K98J06520O3805j22909M8802j46762M9124J82735j93064m7325
$$ y = [135695, 195796, 319167, 123880, -31382, -105804, 125280, 8543, -10130, 346509, 196628, 330822, 472931, 26387, -33701, 226383, -307191, -153014, 75229, -261493, 185656, 185159, 91960, -72152, 196592, 6821, 238869, 395077, 427052, 27214, 141447, 211090, 149672, -26372, 63915, 316585, 386722, 604722, 76759, 215589, 90475, 394965, 95054, 301036, 447989, 522511, 279041, 362119, 122257, 193157, 136705, 438576, 610164, 510089, 799980, 611862, 578976, 516095, 665873, 402971, 648311, 446422, 187889, 441542, 567589, 388015, 555106, 443147, 609706, 578601, 360585, 601729, 357080, 266271, 626584, 420729, 371692, 371990, 478510, 542315, 419406, 468208, 321446, 370570, 553305, 360241, 312916]
11012C12916L69849r8432J50694l38951J8236J62016k04870n2284P0274A02088
11001C37694q1080J71676J17899L8312B32408J28467Q729P5952k0097j7438K6658
10990D34679K17399j67575J06240B78721K95287Q1302M6078p7930k18305M6146
10980D51299K99704L75987q8284k68832K75701K74505r9913K65425L18002m18353
10970A385241K42361J29387O93046l21075R9955l76459j98347J13008k94126k03711
10960A269280l16452l0754l65970N54847E38137N4074j73366M72347k68525B63909
10949E09419B00720K34947B12165O7763Q434J05084j11339A6939a0169d999A71787
10937a04054B59838a70624A52784a63822M430O7036D446c727k8794Q023j89156
$$ y = [312916, 682765, 584333, 735027, 396076, 414312, 576328, 371458, 319174, 389448, 102088, 337694, 256614, 428290, 546189, 584501, 232408, 360875, 369604, 445556, 425459, 408021, 434679, 652078, 484503, 590743, 278721, 574008, 655310, 701388, 623458, 405153, 451299, 751003, 1126990, 1038706, 769874, 1045575, 1320080, 1220167, 1485592, 1803594, 1385241, 1627602, 1756989, 2450035, 2128960, 2228915, 1852456, 1654109, 1767117, 1472991, 1269280, 952828, 922074, 556104, 1110951, 538137, 592211, 418845, 891192, 622667, 263909, 509419, 200720, 435667, 212165, 279928, 288362, 393446, 282107, 16939, -10169, -4999, 171787, -104054, 259838, -170624, 152784, -163822, -159392, -92356, 4446, -3727, -32521, -24498, -213654]
10926b13654H9582R4316h8673E3035a04149A53235J22444q0933c3829D8139P2088
10915A20227C8312h1348A37829M3928P0821o4343R5055f6037N578A326a73095
10903a0076k14264D5678h9930k06920C5805L3281i9198D8040g7686j38380A76967
10891A10171a27819M4579j07010D2858a20963J0651E9902A455K4357g544E5265
10879a99063Q6489j53586J30979E8465b51701j07456G0446k6955a67765B40402
10868f6313o5792B30813C5947J05529J05357b62360R7185A43022P8850a96057
10857a68240e1122n9975k07604b0555A24954J03204h8462J634A75082H6204B9754
10845c10985B54559a91002j67912B01363b25835M8855N4560I6671J0244a17796
$$ y = [-213654, 89582, 183898, -88673, 53035, -104149, 153235, 275679, 194746, -33829, 48139, 120227, 38312, -81348, 137829, 181757, 252578, 188235, 283290, -66037, -60459, 1326, -173095, -10076, -224340, 45678, -89930, -296850, 35805, 69086, -99198, 48040, -77686, -216066, 176967, 110171, -127819, -83240, -190250, 42858, -120963, -110312, 59902, 1455, 25812, -7544, 55265, -199063, -112574, -266160, -135181, 58465, -251701, -359157, 70446, 43491, -167765, 240402, -66313, -132105, 230813, 35947, 141476, 246833, -262360, -165175, 143022, 221872, -196057, -168240, -51122, -111097, -318701, -20555, 124954, 228158, -88462, -86828, 175082, 86204, 29754, -310985, 254559, -191002, -358914, 201363, -225835, -176980, -122420, 96671, 106915, -117796]
10834c26800A83574a12271m5417B13382a92043D0263J04679f887j78904J8708
10824a67083A40959a00631j02582n8054A01791l9914J07268a28839j04523B56139
10813A98439b32439C2150i3127A9316a22236e0180C4795K9952b2001k46330C6359
10801A7506K01247E652L12317a4690I1071a10108H2388b7594C4744J75141a94585
10789d3600j28807k00345e7898l0304C990h9054B36862c6650k968G9164a01783
10777B26535c24660G0716a3330B12028a71357C3351b36614j3253g2450H1421d49332
10765e4394D871g8781G7722M541e0011r7938A0571c9H2861j9759b69530J23540
10753a45990e1198j91819M2230C99934F225K93260h7407m4018L7507j18539a5348
$$ y = [-326800, 183574, -112271, -157688, 213382, -192043, 40263, 144942, -6887, -185791, -167083, 140959, -100631, -203213, -261267, 101791, 61877, 169145, -128839, -233362, 256139, 198439, -232439, 32150, -93127, 19316, -122236, -50180, 34795, 64747, -22001, -268331, 36359, 17506, 218753, 5652, 317969, -14690, 91071, -110108, 82388, -27594, 34744, 209885, -194585, -43600, -172407, -372752, -57898, -88202, 3990, -89054, 236862, -36650, -39618, 79164, -101783, 226535, -324660, 70716, -13330, 212028, -171357, 33351, -236614, -249867, -72450, 81421, -449332, -54394, 4871, -78781, 77722, 82263, -50011, -147949, 10571, -39, 82861, 63102, -269530, -145990, -51198, -243017, -200787, 399934, 6225, 299485, -87407, -131425, -93918, -212457, -15348]
10741A08954n2177c82929G7201K8762b05050A03866c34418d6344l7406B38052
10730F0312J2006g0763k65007g3487B40541g7991F6834d71067a46456a054B02664
10718a00022k11261P5655D5219c2384k92706a30655E283d8725C54118a7893G1990
10706a16046L821A50949b84837a14396D40651A74182a00179o0241C2678e33861
10695G1108P7655F5097a20461e4840A56665b13719P1002N8100j30175G3800H536
10683B24669a35335b3275C81501B3005a80668g5154A97478n5337a14047N13C2771
10671B7532d5227q307C4227c29533e4665D4891J26578a03314A7862f3612l3633
10660i7245a0248j84683r4712b1620A7531a93989P6353A35607c64712H4809k6683
$$ y = [108954, 56777, -382929, 77201, 105963, -205050, 103866, -334418, -46344, -83750, 238052, 60312, 72318, -70763, -335770, -73487, 240541, -77991, 66834, -471067, -146456, -1054, 202664, -100022, -311283, -235628, 45219, -32384, -325090, -130655, 5283, -48725, 354118, -17893, 71990, -116046, -112225, 150949, -284837, -114396, 440651, 174182, -100179, -160420, 32678, -533861, 71108, 148763, 65097, -120461, -54840, 156665, -213719, -142717, -84617, -214792, 73800, 8536, 224669, -135335, -23275, 381501, 23005, -180668, -75154, 197478, 142141, -114047, -113534, 32771, 27532, -45227, -53534, 34227, -329533, -54665, 44891, 171469, -103314, 17862, -63612, -97245, -10248, -194931, -289643, -21620, 17531, -193989, -117636, 135607, -364712, 84809, 58126]
10649E8126J580I406a00565L1094o0888C3616Q4281N9377J37367a14372p7690
10638a92062a5315l88369B8884f8345l21873e8464l4721A6133J65741b20484m8719
10627b69203R9440A77460a31952d2462B0771Q8240b53458i4650A12905a1033j00356
10616a11389c3826A33893a35511A93147p5049h3949L8274k46553N7630d644A18776
10604d10356A07997a30086k4548A0311f8779j92239A1105O7533a77316c1712k26886
10593b58598d4844C50560r3862J48011a38377k53135e6466A04285l5708B5360
10582A68685E6624N5816J8035J18118a96793i2725i606k59191l00601a2546A38298
10570c25396a59896L1409j44144J31482d0858Q431j13638D47469a13011C098P5293
$$ y = [58126, 59706, 9406, -100565, -69471, -130359, 33616, 117897, 177274, 314641, -114372, -192062, -15315, -403684, 28884, -68345, -390218, -58464, -93185, 16133, 181874, -220484, -269203, -169763, 177460, -131952, -42462, 20771, 109011, -253458, -94650, 112905, -11033, -111389, -33826, 133893, -135511, 193147, 118098, -83949, -45675, -292228, -234598, -4644, 118776, -410356, 107997, -130086, -154634, 10311, -68779, -261018, 11105, 78638, -177316, -31712, -258598, -44844, 350560, 256698, 404709, -138377, -391512, -56466, 104285, 68577, 25360, 168685, 56624, 112440, 130475, 248593, -196793, -92725, -9606, -268797, -569398, -12546, 138298, -325396, -159896, -128487, -272631, -141149, -40858, -32427, -146065, 447469, -113011, 3098, 78391]
10559G8391J14485a62556j34960a14270j06456f3927j15159A05048h1324j21598
10549b02922q1595f0798a2874m38309c0292A19800b2275M977A62939Q3588a42130
10537h6814d492F5718b2900r3932A5448J32388c24051J3510A32923d1089o2849
10526a03938B78104i6156A1620c44776B38051c8130g16j02862A2366f664B77477
10514c28273C77842i3942A30118b67961a12718j93623J9732a16790n1966k9216
10504a97972A12302i765A3529P6019m0177k0758H811e241m6959B54946f6363A61513
10491B40194d3001l01907b4724j74299A393b53542O8927E387i6382k14785i8427
10479A15977g8302a1183j42309B77482A02690K30978A32359b08723E40361b04572
$$ y = [78391, 192876, -162556, -297516, -114270, -220726, -63927, -179086, 105048, -81324, -202922, -284517, -60798, -12874, -451183, -30292, 119800, -22275, -17298, 162939, 246527, -142130, -86814, -4492, 65718, -22900, -116832, 15448, 147836, -324051, -310541, 132923, -41089, -103938, 278104, -96156, 11620, -344776, 238051, -38130, -716, -103578, 12366, -6664, 277477, -328273, 377842, -93942, 130118, -267961, -112718, -306341, -286609, -116790, -168756, -197972, 112302, -9765, 13529, 89548, 49371, 28613, 8811, -5241, -52200, 254946, -66363, 161513, 240194, -43001, -344908, -24724, -199023, 1393, -253542, -184615, 5387, -96382, -311167, -98427, 115977, -78302, -11183, -153492, 277482, 102690, 333668, 132359, -208723, 540361, -204572]
10468b06210A17804a13949j22675D5198i5968l4406j64255a26405M1414G251g977
10456B81793D3531N2586i8115B787J7371a76755K7732o4620A11554C4203c37895
10444D5395O4748b3401j23763k1416H6221J36965n6727B5316c19877a300k56209
10433b57509h8241j61250A43117A7953a85421E52196H7074J08504o4314l3913
10423I7351R85l1871d00229a0676H3477F673a27231F4815N8906D4895L1437a25197
10410i2313j66399f0807C456a00362c1656q7674H3806N3320F3009a56727A01661
10398F086L5477B023c2473m8680a4494A20374a76197e6168A54796b6373E6511
10386B67804O8492h5825J1188G7464b03561A85224n0211j8111Q8459J06550A16494
$$ y = [-206210, 117804, -113949, -236624, 45198, -95968, -130374, -294629, -126405, -84991, 7251, -7977, 281793, 43531, 96117, -98115, 2787, 20158, -176755, -149023, -213643, 111554, 34203, -337895, 45395, 110143, -23401, -147164, -168580, 86221, 223186, 166459, 25316, -319877, -1300, -257509, -88241, -249491, 143117, 17953, -185421, 552196, 87074, 195578, 131264, 97351, 98336, 66465, -400229, -10676, 83477, 6673, -127231, 64815, 123721, 44895, 76332, -125197, -92313, -258712, -60807, 3456, -100362, -31656, -119330, 83806, 137126, 63009, -156727, 101661, 6086, 41563, 2023, -32473, -81153, -14494, 120374, -176197, -56168, 154796, -26373, 56511, 267804, 336296, -85825, -74637, 77464, -203561, 185224, 135013, 116902, 205361, 311911, 116494]
10374A11878K28724A00142J43287a04613d1377I3051L6218M15901l9836k40116
10364B65218m6127K17141j20221Q3272Q1007A24503L12748j95820N4070C4109
10353G3638A0599J57081q1785M46723N0500A21394R5306B55K13701E3814J28619
10342A82433a97079B41587o2844O2120J70759G6105a18831B93958D5417J70189
10332B15606n7691B5885J98449o1911h201H178b53482a01456B6534P979a49820
10320A97202H8326R5959g5004D3547b21813a10725L7557A4704J28262N6112A5501
10308a03368A00799h5089j32005g7070B3896a23165C12462a24725I6588c98478
10297a1693j72577G9335e2985J3748J8024B47381n3979b87976J03242g6102q2711
$$ y = [111878, 340602, 100142, 243429, -104613, -41377, 93051, 129269, 545170, 505334, 265218, 219091, 436232, 316011, 399283, 480290, 124503, 437251, 241431, 295501, 34109, 73638, 10599, 167680, 85895, 532618, 583118, 121394, 216700, 255, 213956, 53814, 182433, -197079, 241587, 178743, 240863, 411622, 76105, -118831, 293958, 45417, 215606, 157915, 25885, 224334, 162423, -8201, 8178, -253482, -101456, 26534, 34513, -149820, 197202, 88326, 184285, -75004, 43547, -221813, -110725, -73168, 14704, 142966, 199078, 15501, -103368, 100799, -85089, -217094, -77070, 23896, -123165, 312462, -124725, 96588, -398478, -11693, -184270, 79335, -52985, -39237, -21213, 247381, 193402, -287976, -184734, -76102, -158813]
10286a58813O8119D3026H351g2934j45026B3421g2932r2833D183K38028j1122
10275B31089F9299a66296b6178k27294Q4973d339A322e1117q8989m8937j19122
10264c08165I2077j0019R4323a76897H4565a01747j3021j7193n3647D0011I284
10252a8148C83431b00929O6702D73918F0101b106k9234B13567k1816b50277L8451
10241b11826A87990e1141q470r3713f2517j37543A37783m6748a1717j23173D7616
10229a17245I8716O9046p8340K137L7126a00487F7355h0133k08174P8732E9576
10217H0950a37944B06561b72665A29504a91610E2775O030B1735b17897i9007K0413
10206g8594A30076c90954a16868H087a37383A456e5026A14127B7736b91043i1102
$$ y = [-158813, -90694, 43026, 8351, -72934, -217960, 23421, -72932, -165765, 4183, 242211, 231089, 69299, -166296, -26178, -253472, -168499, -4339, 1322, -51117, -140106, -189043, -308165, 92077, 82058, 176381, -176897, 84565, -101747, -114768, -131961, -185608, 40011, 9284, -18148, 383431, -200929, -134227, 473918, 60101, -2106, -31340, 213567, 191751, -250277, -211826, 187990, -51141, -59611, -153324, -62517, -200060, 137783, 91035, -11717, -134890, 47616, -117245, 98716, 167762, 89422, 91559, 128685, -100487, 67355, -80133, -288307, -209575, 59576, 80950, -137944, 206561, -272665, 129504, -191610, 52775, 58805, 21735, -217897, -99007, -78594, 130076, -390954, -116868, 8087, -137383, 1456, -55026, 114127, 27736, -291043, -91102]
10194D9830k850Q3111M0513a13675k6818j95514J65847D2854O2497b11851B68949
10182F1699a33013j57674e7158I6101B9477b72459N7303A26590K7406R5535h4273
10170F502J93343j3277G637b51090K3524a01821m7414O2950k59608R4450I367
10158b9970k9058I594b71182e3109C04443l3736a38878e0386m7513c6220k51842
10147b88062D0794a75054B0112J83193n4457a89478G7536i9440l1506D301A071
10135f501o6526n893A91151a83790j33512i39B03654a0634D7581j8471f9216r6639
10123a65855B47003l7533a1765l29011c1199j12843B0010a3068A02507a4684j52559
10112a67243F0964a53974A28317a26274o5922f7830l3534k1865k96108A78579
$$ y = [49830, 46980, 130091, 170604, -113675, -140493, -336007, -170160, 42854, 105351, -211851, 268949, 61699, -133013, -290687, -57158, 96101, 29477, -272459, -215156, 126590, 153996, 249531, -84273, 6502, 199845, 186568, 7637, -251090, -227566, -101821, -149235, -86285, -345893, -251443, 9367, -29970, -59028, 9594, -271182, -53109, 304443, 270707, -138878, -50386, -97899, -36220, -288062, 40794, -175054, 20112, 203305, 148848, -189478, 77536, -99440, -130946, 4301, 1071, -6501, -73027, -78920, 191151, -183790, -317302, -939, 203654, -10634, 47581, 29110, -69216, -165855, 247003, 209470, -11765, -340776, -31199, -144042, 20010, -13068, 102507, -14684, -167243, 60964, -153974, 128317, -126274, -192196, -67830, -101364, -123229, -419337, 178579]
10101h4446l1473B42538b36907f1357k2124k9472K1696p6128l7550g2902J832
10090g1070A48720J2286J221J62703d28567a40964m4417D7064A1891c5526l12433
10079c47959F1351G664J90370e6103m56544b43151I7720A9183b59142f4429P263
10068e7166m02628a06840d9381j64776a01708E4469i1737l70915G7848a06631
10057A0072a41096A14471f2574l6668m2387H8098g9044r8519G3090C5624b91168
10045B44335c01096a0031j70197j20617R4537m58087H7544l5593f4661A90307
10034I7670c9829o3595j20069A77580c2042k57995k24320A44902a53531j76355
10024c29886a22578n8625B72895a59255N1525A50354e6012a4246o8629j56507
$$ y = [-84446, -115919, 242538, -236907, -61357, -83481, -112953, -91257, -167385, -204935, -72902, -71070, 148720, 161006, 162227, 324930, -428567, -140964, -185381, 47064, 11891, -35526, -347959, 61351, 7664, 198034, -56103, -512647, -243151, 97720, 19183, -259142, -64429, -57166, -459794, -106840, -49381, -214157, -101708, 54469, -91737, -462652, 77848, -106631, 10072, -141096, 114471, -62574, -99242, -141629, 88098, -79044, -177563, 73090, 35624, -291168, 244335, -301096, -10031, -180228, -300845, -206308, -664395, 87544, 51951, -64661, 190307, 97670, -39829, -103424, -223493, 177580, -32042, -290037, -514357, 144902, -153531, -329886, -122578, -181203, 272895, -159255, -107730, 150354, -56012, -14246, -82875, -239382]
10014b39382k8700i7922q7640P3837G5026B050b72895I1076j2411d4979M011A3422
10001d0652j56477f9840E8972e61037C3179a29756k245d0294D55928D7075f5102
9989A34261o5593O6767b38706F6055K6065a68282O8512j51684C020c86680A28992
9977g1450B3897g7818k39244a57845H1136J56790d1259A82238k6984e4645A29419
9965A36201a35423N6091A21212g4547q0892A64066N5034c24440C37515f3366o7060
9954a30426M6009J6435L3266A41815D0804A7631d6259l66585B717K3262K91025
9943C17004a48097d7596A26905h5616G4313b91089j27966J70953Q1879I1525h1372
9931c50714g7889C15761c87940a70219d6333m9272A46811k117k3598a02676j21508
$$ y = [-239382, -268082, -97922, -185562, -111725, 75026, 2050, -272895, 91076, 78665, -44979, -40968, 13422, -40652, -197129, -69840, 58972, -561037, 33179, -129756, -132001, -40294, 455928, 47075, -65102, 134261, 68668, 135435, -238706, 66055, 92120, -168282, -99770, -251454, 3020, -386680, 128992, -71450, 23897, -77818, -317062, -157845, 81136, 237926, -41259, 182238, 155254, -54645, 129419, 136201, -135423, -79332, 121212, -74547, -155439, 164066, 219100, -324440, 337515, -63366, -130426, -84417, -67982, -34716, 141815, 40804, 17631, -46259, -412844, 2717, 25979, 317004, -148097, -47596, 126905, -85616, 74313, -291089, -419055, -248102, -166223, 91525, -81372, -350714, -77889, 315761, -387940, -170219, -46333, -95605, 146811, 144694, 121096, -102676, -224184]
9920b24184L0625N7430A6492a09586K80r535b206n8431A45315b21966O949c7092
9907a6620j28621A19057a71088A86057a11144G2373a78100j09294O5213B42766
9896E3268J59994a03770k42667D7281M009i0693F0873b19474B32178i4204a9128
9884I6645a33053A0492c48207e3525b3221B0907a78084a7503k08111h6895m6988
9873a33883r300G0791a72235A16879m9525M5831a8424A02549b16605A37496e8538
9861A40959a57904A54015a13528B09407m7634b23367A1548a11419B8805L1889
9851F0694b49617k3576M212N9803g1749j81321m3248R7230g6050a9007B0578J07903
9839A28481a10282j07755f7415G0973b72931B34583a45424k61316a20217H261
$$ y = [-224184, -193559, -136129, 16492, -109586, -109306, -118841, -2206, -60637, 145315, -221966, -215017, -37092, -16620, -145241, 119057, -171088, 186057, -111144, 72373, -178100, -287394, -222181, 242766, 53268, 213262, -103770, -346437, 47281, 51290, -90693, 60873, -219474, 232178, -94204, -19128, 96645, -133053, 10492, -348207, -53525, -23221, 20907, -178084, -17503, -225614, -86895, -133883, -143183, 70791, -172235, 116879, 67354, 113185, -18424, 102549, -216605, 137496, -58538, 140959, -157904, 154015, -113528, 209407, 161773, -223367, 11548, -111419, 28805, 60694, -249617, -273193, -268981, -209178, -71749, -253070, -296318, -199088, -76050, -19007, 20578, 128481, -110282, -218037, -67415, 70973, -272931, 234583, -145424, -406740, -120217, 8261]
9828C0726e5277f361l02158Q2506C122a29362J4500p6119Q8347d3373k00339j21583
9816c65295F7013a32945B03707q9090C5757c65650Q2787f143j3043A24923b02087
9804a64795A6890a18080l14923K01574J11540A02656N280k2736L9942J220e21720
9792b32635d8k7015k43058J26274A21585J37407e21484f6362j6602A78500c01378
9780a70712O0116n4641L0804A88166a76503o3348N6743B611J00020C4642P4876
9769A09518a00454l53455A82830e0331j6679D8779R05J61714a79315A93866a5886
9757A66052G1202a2423b484j21207a1612k41621e2136d184j95582A0250Q818J82755
9745B01823c5932D9799K3586b15701b2059l7325i967B0870b86149c5695j9331
$$ y = [30726, -55277, -6361, -308519, -226013, 3122, -129362, -114862, -190981, -102634, -43373, -243712, -365295, 67013, -132945, 203707, 114617, 35757, -365650, -282863, -6143, -19186, 124923, -202087, -164795, 16890, -118080, -433003, -231429, -119889, 102656, 107936, 85200, 125142, 126362, -521720, -232635, -48, -27063, -270121, -143847, 121585, 258992, -521484, -66362, -82964, 178500, -301378, -170712, -110596, -165237, -134433, 188166, -176503, -239851, -183108, 2611, 102631, 34642, 109518, -100454, -453909, 182830, -50331, -67010, 48779, 49684, 211398, -179315, 193866, -15886, 166052, 71202, -12423, -2484, -123691, -11612, -253233, -52136, -4184, -199766, 10250, 19068, 201823, -35932, 49799, 73385, -215701, -22059, -59384, -9967, 20870, -286149, -35695, -55026]
9734e5026j04000B0330a39143A31676c71830l6471A6846N1259a32755O2453j06632
9723a76934f8680E5442a66611E5634b40393K4117H7182a13722j56010f3198m5323
9712a08521d9991B36746a13365c6614k73166i8333j29088C60025h0641H2754N3157
9701A35911m9361a01193G9805A7908a35903n7561g4767C2733L9752a80479m9786
9690b30265F2002O0705c49582a41133C477a31605K9718o9997e0770k30493h739
9678e6638I9946g5638C4031a43842j69211I0218a51736b4316k35428A94157a93646
9666c16872a27197C5114e5863j05733L2798C63198j19098r6205J2854K3300N0232
9655B34281a17732A13537g4402C4748j2598b20224j7342A04765b6834k07465Q5873
$$ y = [-55026, -159026, 20330, -139143, 131676, -371830, -408301, 16846, 68105, -132755, -70302, -176934, -68680, 55442, -166611, 55634, -240393, -216276, 87182, -113722, -269732, -63198, -108521, -49991, 236746, -113365, -36614, -309780, -98333, -227421, 360025, -80641, 82754, 135911, 86550, -101193, 79805, 17908, -135903, -193464, -74767, 32733, 72485, -180479, -230265, 62002, 122707, -349582, -141133, 3477, -131605, -101887, -171884, -50770, -281263, -8739, -56638, 99946, -75638, 34031, -143842, -313053, 90218, -151736, -24316, -259744, 194157, -193646, -316872, -127197, 35114, -55863, -161596, -128798, 363198, 244100, 147895, 160749, 184049, 234281, -117732, 113537, -74402, 34748, 22150, -220224, -237566, 104765, -26834, -234299, -148426]
9644a48426j2061I81J5456a13275c1998m98686B6004e1256A25216J77791d5375
9632A20685M3800J3690c6884I7637J44728R8004a85304J9424e600p1464A32417
9620c6143l1938F7225B7517D565b14010A25424d39297K14933R9839A53079a59858
9608c45507f9450G8461J55185i5105H9676a04468N74j55960a12577n6452B29939
9596h2796r575K8601j0822k05102e4507A96039b32254a00867h400j1431j29712
9585a49543k4780O7662j4837F9770a43768A62580b74369R8679q2777B83059p4904
9574B08155g0135j73559J08017d0226B09303b05953F6951J1978c6211n8429e017
9562C12406B5688b74502E7833P144g0323A28614Q238a57304d5248k9301F5603
$$ y = [-148426, -160487, 981, 16437, -113275, -31998, -530684, 26004, -51256, 125216, 303007, -45375, 120685, 164485, 178175, -36884, 97637, 242365, 340369, -185304, -165880, -5600, -77064, 132417, -36143, -68081, 67225, 27517, 4565, -214010, 125424, -439297, -224364, -124525, 153079, -159858, -345507, -69450, 78461, 233646, -95105, 89676, -104468, -103894, -259854, -112577, -169029, 229939, -82796, -92371, -63770, -74592, -279694, -54507, 196039, -232254, -100867, -8400, -19831, -149543, -174323, -106661, -121498, 69770, -143768, 162580, -274369, -175690, -258467, 283059, 208155, -70135, -243694, -135677, -40226, 209303, -205953, 66951, 78929, -36211, -94640, -5017, 312406, 25688, -274502, 57833, 64977, -70323, 128614, 136852, -157304, -45248, -74549, 65603]
9550d28270G7340g7481l46064a93269N3726M3117A93607K8622a56659d6343J6252
9539c0091l6314I774a19797j32866Q0383b4810j36378a8159j63746B855L03239
9528C06094a84955p0602j04985L6142L0631a8901j65827r3462R2395b9334l26635
9517c55969G8895a1439j93895P5932c0583k0664j29799n6365j23765E2255b00679
9505A91924o1184a6799j4845D1434J98651b083A4022p2h4580G2030a64033L364
9493a60669d3350D1171a19443m6559k18545a77938g7203p3103A58156E5783b30369
9481A26903b41697g6632l49584e3552B6175O3623J32638e2911C6664i2607E3499
9469A57119a55047O028G6710a76573j53957A26444p984b26659B6650b1269E5481
$$ y = [-428270, 77340, -77481, -423545, -193269, -139543, -96426, 193607, 222229, -156659, -46343, -30091, -66405, 9774, -119797, -252663, -172280, -24810, -161188, -18159, -181905, 2855, 306094, -184955, -255557, -360542, -324400, -293769, -18901, -184728, -278190, -185795, -29334, -355969, 78895, -11439, -205334, -129402, -30583, -51247, -181046, -237411, -361176, 52255, -200679, 191924, 130740, -16799, -31644, 41434, 240085, -2083, 14022, 13950, -84580, 72030, -164033, -160669, -43350, 41171, -119443, -166002, -384547, -177938, -77203, -150306, 158156, 55783, -230369, 126903, -241697, -76632, -426216, -53552, 26175, 89798, 222436, -52911, 36664, -92607, 53499, 157119, -155047, -149019, 76710, -176573, -330530, 126444, 118460, -226659, 26650, -21269, 55481]
9457f9382F9665c04861a2442m1141k40440R2826A7178h8703r3298B6631a54092
9445b8907m5409a0436q9264A31104P6895m6614C3728R9517a1552j26545A9744
9433h3418J8470H997b2246k23704p6560D8896a66744A45867a16733j4354F7965
9421B78381c11165A3286c7422k780k10308Q2210N2895d5676B66292b8445j32029
9410a60474a5488j04205A78468q6351M3732C8085b8247C4398f4689k3408q1695
9399a69792A071b21446H2593K69838b1147q1172k11247c3273j74607g7900j61664
9388b39564h2038d162j6619l58802e9222n4001E054f9293A76117c12119H819N1028
9376E9847A1779a45520N8051k87645A61037d21883J69305k46553F4503d2234F2354
$$ y = [-69382, 69665, -304861, -12442, -53583, -294023, -201197, 17178, -88703, -182001, 26631, -154092, -28907, -74316, -10436, -99700, 131104, 207999, 161385, 33728, 133245, -11552, -138097, 19744, -83418, -64948, 8997, -22246, -245950, -322510, 48896, -166744, 145867, -116733, -131087, 67965, 278381, -311165, 13286, -37422, -40202, -250510, -168300, -115405, -45676, 266292, -28445, -160474, -15488, -119693, 178468, 92117, 135849, 38085, -28247, 34398, -64689, -88097, -169792, 1071, -221446, 82593, 352431, -21147, -102319, -313566, -33273, -207880, -77900, -239564, -82038, -4162, -20781, -379583, -59222, -113223, 5054, -69293, 176117, -312119, 8819, 59847, 11779, -145520, -87469, -375114, 161037, -421883, -252578, -499131, 64503, -42234, 62354]
9364B63874D5286g0995j3450o1245D4947J59175d8493B9540O268b38327B87462
9352a20198B06737a73972p9547B07139a97574F5882k2204a37349E0598P4633a66908
9340a24764B93915b43856N7896h5663j58364J00568A15627e6494B19259a7456
9329b76385N3313A41396d7965A6601c3672m4822j31245D7769a5005l52590J21640
9318b45955a05434k2808B3841b55738j83294J57953J34013D1680a42029A97036
9307C48932c15770J31622j54661j14021J06832g7671F9832a50957N7874A8715
9296A23122g366j7518q7409j30088L4006r314P3156K9890B3365h0469A22619K7244
9284A49863D4158d12238a51558G1398a27389K4828h465C0665Q0203M07a26401
$$ y = [263874, 45286, -70995, -84445, -145690, 44947, 204122, -48493, 29540, 35808, -238327, 287462, -120198, 206737, -173972, -253519, 207139, -197574, 65882, 43678, -137349, 50598, 125231, -166908, -124764, 293915, -243856, -185960, -85663, -244027, -143459, 115627, -56494, 219259, -17456, -276385, -223072, 141396, -47965, 16601, -33672, -78494, -209739, 47769, -15005, -367595, -245955, -105434, -128242, 23841, -255738, -439032, -281079, -147066, 41680, -142029, 197036, 348932, -315770, -184148, -338809, -452830, -345998, -77671, 69832, -150957, -93083, 18715, 123122, -7366, -24884, -112293, -242381, -208375, -217689, -144533, -114643, 23365, -80469, 122619, 149863, 44158, -412238, -151558, 71398, -127389, -102561, -8465, 30665, 110868, 111275, -126401]
9272A51412i6698J9378p8612B10824a18566A45380c65716a54259B6858Q1152C5753
9260b37117f1608A75078c9369l1547a7542E0539a45298j4375j15358a10911k30663
9249c41574a31115c9643j00384B0571M3633b63305I915a70786A08744c77654A18820
9237c65917e2932k3584A69483b89814C9250J68790q9984b27425b3095A84522e1180
9225a36597C6514b6735D7983Q1267b03442A05416e4974k6267B56689b98998F6012
9213f8073C6509a47299o0796B4346h1110A99869b4824A58537c66469B04462I8721
9201a61726A26206k9570a6754P153j1266B24107f3843m51160a29887j79036N2671
9190b56252G378f3075p1786E2915a55601B8480J65468c9123q3266N6632m4329
$$ y = [151412, -96698, -77320, -155932, 210824, -118566, 145380, -365716, -154259, 26858, 108010, 35753, -237117, -61608, 175078, -39369, -70916, -17542, 50539, -145298, -159673, -275031, -110911, -341574, -131115, -39643, -140027, 20571, 64204, -263305, 9915, -170786, 108744, -377654, 118820, -365917, -52932, -76516, 169483, -289814, 39250, 208040, 118056, -227425, -23095, 184522, -51180, -136597, 36514, -26735, 47983, 129250, -203442, 105416, -54974, -81241, 256689, -298998, 66012, -68073, 36509, -147299, -208095, 24346, -81110, 199869, -24824, 158537, -366469, 204462, 98721, -161726, 126206, 96636, -16754, -9601, -20867, 224107, -63843, -515003, -129887, -308923, -256252, 7378, -63075, -134861, 52915, -155601, 28480, 193948, -39123, -122389, -65757, -110086]
9179a10086D6045N2439a0971j35739j2594k2286B7116a66334i71j36606O8186
9168f9391O507k55891e6391q1842j86782N3562g4529K9865l7946k27466A34558
9156h410C4171N373g5176K3866C48996c35181A37854b15612L2984C02453j5856
9145B86597a55150C9846d365j91119n8256K6928A28014l4847g9105P43D1865b94306
9132b12j59922f4942k15080a28507I1692j384b03548b5371A23779d98804K15980
9121b82824H6756b13395N0497b7822H9972a38910A34994a57876B54172b14113
9110a35450A34965a78503j27784a49002B47960a96223J2583M8269H3441b30330
9099d22107k7452a24525F7255C0399a82891A19771a67645H0519b81641Q1909l45374
$$ y = [-110086, 46045, 98484, -10971, -146710, -159304, -181590, 27116, -166334, -971, -137577, -69391, -62884, -318775, -56391, -138233, -325015, -271453, -74529, -44664, -82610, -310076, 134558, -8410, 34171, 39544, -75176, -51310, 348996, -335181, 137854, -215612, -182628, 302453, 286597, -155150, 39846, -4365, -195484, -253740, -226812, 128014, 93167, -79105, -78362, 41865, -294306, -212, -160134, -64942, -280022, -128507, 91692, 90308, -203548, -25371, 123779, -498804, -282824, 86756, -213395, -162898, -27822, 89972, -138910, 134994, -157876, 254172, -214113, -135450, 134965, -178503, -306287, -149002, 247960, -196223, -183640, -135371, 83441, -230330, -422107, -449559, -124525, 67255, 30399, -182891, 119771, -167645, 80519, -281641, -199732, -545106]
9088e45106b12514d4282j19344A25755a87061f920r9153p51l3538A2811b768n8207
9076f0975o13B34900b87816a11570n4198n4517O7163M4374A95851g4531A46575
9064I1572k3171d0563B1513c13627A10260M4280R3739a91886A31696a45028B6489
9052a07283C0203J02319d3180l1985o8409j56982K3171j01359A19900c2729F4838
9040h1609o3037k13965J37950e251k24200A28788a50903A019J76177J81399b58773
9028E1633K61380i054k17042j02219c8067A76342p2356b71398a14639l32751e5978
9016i1882k5029L81B6031d2072J2257j24793C2332J31262E682L7419c22485a29763
9003g5683e738H0161g2662k01662d6531n6904q5529B59384G1098b8374d192m912
$$ y = [-545106, -212514, -44282, -163626, 125755, -187061, -6920, -106073, -106824, -140362, 12811, -2768, -60975, -61588, 234900, -287816, -111570, -165768, -220285, -153122, -108748, 195851, -74531, 146575, 91572, 68401, -40563, 21513, -313627, 110260, 154540, 248279, -191886, 131696, -145028, 26489, -107283, 30203, 132522, -43180, -75165, -143574, -300556, -277385, -378744, 119900, -32729, 64838, -81609, -144646, -358611, -220661, -5251, -229451, 128788, -150903, 1019, 177196, 358595, -258773, 51633, 313013, -9054, -226096, -328315, -38067, 176342, 103986, -271398, -114639, -447390, -55978, -91882, -116911, -116530, 26031, -42072, -29815, -154608, 32332, 163594, 5682, 43101, -322485, -129763, -75683, -5738, 80161, -72662, -274324, -46531, -103435, -188964, 259384, 71098, -28374, -4192, -9104]
8991i104A24514a52806j38892A01710B0284a33920M406a7394B8043J306b63589
8979a51298e8952B45099b52134E8646c02727A5897f6279C0554M0416b28142C01476
8967a35221l81748J12017b4099l83657J99230A82168a5636B6029b79067J21255
8957a57812D4623a71616f1053A13942i3710E79c3576o9727c3017k49116a794E9056
8944A47914J11343a49169B9742a23613l1007D6636b9320k69892A00381a45780
8933a48316d488q4159j11760E5592J24033F3632k4509J19426C8330a81520g3874
8921A6239K42968P53l1001i4671H318K96277e2165j40048B91700b12315j76720
8910c89035I9871g9004G1232b14028l829R5261j76643g1722o7142q5354A37661
$$ y = [-9104, 124514, -152806, -291698, 101710, 20284, -133920, -129514, -17394, 28043, 29349, -263589, -151298, -58952, 245099, -252134, 58646, -302727, 15897, -66279, 30554, 70970, -228142, 301476, -135221, -516969, -404952, -24099, -407756, -208526, 182168, -15636, 26029, -279067, -157812, 44623, -171616, -61053, 113942, -93710, 579, -33576, -103303, -33017, -282133, -1794, 59056, 147914, 259257, -149169, 29742, -123613, -154620, 46636, -29320, -299212, 100381, -145780, -148316, -4488, -88647, -200407, 55592, 179625, 63632, 39123, 158549, 38330, -181520, -73874, 16239, 259207, 259960, 228959, -94671, 8318, 304595, -52165, -192213, 291700, -212315, -389035, 99871, -79004, 71232, -214028, -217857, -122596, -299239, -71722, -138864, -224218, 137661]
8898a05817j17679j61377C1245J34931K502j3235a92401A13307a73284K688N4461
8887a16135o6642A39879J3259B284a48642l5309O7133a7636o1748q3242j2713
8876a75339O5978E0894K54091A4409g7001r3870j22197h1481B47632i3638B51320
8864H8389a22708M2349B48050A05543l1497a13871B94717c63863a42507D2326
8853d65189A08595g0048C0886K6675h1613C2031b514r0403E1780J94610a78677
$$ y = [-105817, -223496, -384873, 31245, 166176, 168678, 155443, -192401, 113307, -173284, -170596, -116135, -182777, 139879, 153138, 2284, -148642, -183951, -116818, -17636, -79384, -162626, -175339, -109361, 50894, 304985, 14409, -77001, -170871, -293068, -81481, 247632, -93638, 251320, 88389, -122708, -80359, 248050, 105543, 74046, -113871, 294717, -363863, -142507, 42326, -465189, 108595, -70048, 30886, 57561, -81613, 32031, -2514, -92917, 51780, 246390, -178677]
$$ [...]
##END NTUPLES=NMR SPECTRUM
##END=
