##TITLE=AC1751_05000195609115FOTR0001_9275067_Bt7wbmRs15
##JCAMPDX= 6.0         $$ Bruker NMR JCAMP-DX V2.0
##DATA TYPE= NMR SPECTRUM
##DATA CLASS= NTUPLES
##ORIGIN= BRUKER
##OWNER= Administrator
$$ 1.72 TOPSPIN		Version 2.1
$$ 2015-07-18 18:02:07.416 -0700  Administrator@X
$$ Compression mode = diff/dup
##.OBSERVE FREQUENCY= 400.02188249412
##.OBSERVE NUCLEUS= ^1H
##.ACQUISITION MODE= SIMULTANEOUS (DQD)
##.ACQUISITION SCHEME= undefined
##.AVERAGES= 64
##.DIGITISER RES= 22
##SPECTROMETER/DATA SYSTEM= spect
##.PULSE SEQUENCE= noesygpps1d.comp
##.SOLVENT NAME= COFFEE_meoh
##.SHIFT REFERENCE= INTERNAL, COFFEE_meoh, 1, 14.96219
##AUDIT TRAIL= $$ (NUMBER, WHEN, WHO, WHERE, PROCESS, VERSION, WHAT)
$$ ##TITLE= Audit trail, TOPSPIN		Version 2.1
$$ ##JCAMPDX= 5.01
$$ ##ORIGIN= Bruker BioSpin GmbH
$$ ##OWNER= Administrator
$$ $$ E:\/data/COFFEE/nmr/AC1751_05000195609115FOTR0001_9275067_Bt7wbmRs15/32/pdata/1/auditp.txt
$$ ##AUDIT TRAIL=  $$ (NUMBER, WHEN, WHO, WHERE, PROCESS, VERSION, WHAT)
(   1,<2015-07-18 18:00:45.682 -0700>,<Administrator>,<X>,<go>,<TOPSPIN 2.1>,
      <created by zg
	started at 2015-07-18 17:49:15.682 -0700,
	POWCHK enabled, PULCHK disabled,
       configuration hash MD5:
       21 0F 79 D6 B3 7B B4 F6 88 20 88 DB 03 48 BD 9F
       data hash MD5: 64K
       0E 09 27 F9 94 91 0D EB 1D 00 F5 6A 17 13 48 D3>)
(   2,<2015-07-18 18:00:52.744 -0700>,<Administrator>,<X>,<audit>,<TOPSPIN 2.1>,
      <user comment:
       ICON-NMR User ID: COFFEE
       data hash MD5: 64K
       0E 09 27 F9 94 91 0D EB 1D 00 F5 6A 17 13 48 D3>)
(   3,<2015-07-18 18:02:04.760 -0700>,<Administrator>,<X>,<proc1d>,<TOPSPIN 2.1>,
      <Start of raw data processing
       efp LB = 0.3 FT_mod = 6 PKNL = 1 PHC0 = 0 PHC1 = 0 SI = 128K 
       data hash MD5: 128K
       22 69 89 E1 45 AD 71 19 34 A9 37 57 BF B1 A6 22>)
(   4,<2015-07-18 18:02:05.713 -0700>,<Administrator>,<X>,<proc1d>,<TOPSPIN 2.1>,
      <pk PHC0 = -88.70361 PHC1 = 0 
       data hash MD5: 128K
       9B 29 EE 32 46 B5 EB CE 9B 84 38 9A 7A B1 D2 C6>)
(   5,<2015-07-18 18:02:06.525 -0700>,<Administrator>,<X>,<proc1d>,<TOPSPIN 2.1>,
      <abs ABSG = 1 
       data hash MD5: 128K
       D4 10 18 77 BB 50 C3 B1 E9 4E 2C DA 82 30 E9 07>)
(   6,<2015-07-18 18:02:06.744 -0700>,<Administrator>,<X>,<proc1d>,<TOPSPIN 2.1>,
      <abs ABSG = 2 
       data hash MD5: 128K
       A9 D2 14 7B 7E A5 05 AD EC 74 87 AF F1 08 D1 39>)
(   7,<2015-07-18 18:02:06.838 -0700>,<Administrator>,<X>,<proc1d>,<TOPSPIN 2.1>,
      <abs ABSG = 3 
       data hash MD5: 128K
       BF B7 FF A0 DA 47 C3 99 27 63 35 A6 CF 43 EE 2B>)
(   8,<2015-07-18 18:02:07.057 -0700>,<Administrator>,<X>,<proc1d>,<TOPSPIN 2.1>,
      <abs ABSG = 4 
       data hash MD5: 128K
       C5 B4 FE 7C AF 1A D9 A0 FB 55 39 40 82 BE D8 4D>)
(   9,<2015-07-18 18:02:07.150 -0700>,<Administrator>,<X>,<proc1d>,<TOPSPIN 2.1>,
      <abs ABSG = 5 
       data hash MD5: 128K
       51 16 19 06 83 9D A1 55 B3 9B E9 21 D7 21 48 D1>)
$$ ##END=
$$ 
$$ $$ hash MD5
$$ [...]
##$TP07= 0
##$TPNAME0= <>
##$TPNAME1= <>
##$TPNAME2= <>
##$TPNAME3= <>
##$TPNAME4= <>
##$TPNAME5= <>
##$TPNAME6= <>
##$TPNAME7= <>
##$TPOAL= (0..7)
0.5 0.5 0.5 0.5 0.5 0.5 0.5 0.5
##$TPOFFS= (0..7)
0 0 0 0 0 0 0 0
##$TUNHIN= 0
##$TUNHOUT= 0
##$TUNXOUT= 0
##$USERA1= <user>
##$USERA2= <user>
##$USERA3= <user>
##$USERA4= <user>
##$USERA5= <user>
##$V9= 5
##$VALIST= <valist>
##$VCLIST= <CCCCCCCCCCCCCCC>
##$VD= 0
##$VDLIST= <DDDDDDDDDDDDDDD>
##$VPLIST= <PPPPPPPPPPPPPPP>
##$VTLIST= <TTTTTTTTTTTTTTT>
##$WBST= 2048
##$WBSW= 25
##$XGAIN= (0..3)
0 0 0 0
##$XL= 0
##$YL= 0
##$YMAX_a= 6746623
##$YMIN_a= -16481162
##$ZGOPTNS= <>
##$ZL1= 120
##$ZL2= 120
##$ZL3= 120
##$ZL4= 120
##$ABSF1= 14.96219
##$ABSF2= -5.595992
##$ABSG= 5
##$ABSL= 3
##$ALPHA= 0
##$AQORDER= 0
##$ASSFAC= 0
##$ASSFACI= 0
##$ASSFACX= 0
##$ASSWID= 0
##$AUNMP= <proc_prof1d_extract.lims>
##$AXLEFT= 0
##$AXNAME= <>
##$AXNUC= <1H>
##$AXRIGHT= 0
##$AXTYPE= 0
##$AXUNIT= <>
##$AZFE= 0.1
##$AZFW= 0.1
##$BCFW= 0
##$BC_mod= 0
##$BYTORDP= 0
##$COROFFS= 0
##$CY= 15
##$DATMOD= 1
##$DC= 0
##$DFILT= <>
##$DTYPP= 0
##$F1P= 0
##$F2P= 0
##$FCOR= 0.5
##$FTSIZE= 131072
##$FT_mod= 6
##$GAMMA= 0
##$GB= 0
##$INTBC= 1
##$INTSCL= 1
##$ISEN= 128
##$LB= 0.3
##$LEV0= 0
##$LPBIN= 0
##$MAXI= 10000
##$MC2= 0
##$MEAN= 0
##$ME_mod= 0
##$MI= 0
##$NCOEF= 0
##$NC_proc= -2
##$NLEV= 6
##$NOISF1= 0
##$NOISF2= 0
##$NSP= 0
##$NTH_PI= 0
##$NZP= 0
##$OFFSET= 14.96219
##$PC= 1
##$PHC0= -88.70361
##$PHC1= 0
##$PH_mod= 1
##$PKNL= yes
##$PPARMOD= 0
##$PPDIAG= 0
##$PPIPTYP= 0
##$PPMPNUM= 2147483647
##$PPRESOL= 1
##$PSCAL= 4
##$PSIGN= 0
##$PYNMP= <proc.py>
##$REVERSE= no
##$SF= 400.020009160289
##$SI= 131072
##$SIGF1= 0
##$SIGF2= 0
##$SINO= 400
##$SIOLD= 131072
##$SPECTYP= <>
##$SREGLST= <1H.CDCl3>
##$SSB= 0
##$STSI= 131072
##$STSR= 0
##$SW_p= 8223.68421052631
##$SYMM= 0
##$S_DEV= 0
##$TDeff= 65536
##$TDoff= 0
##$TI= <>
##$TILT= no
##$TM1= 0
##$TM2= 0
##$TOPLEV= 0
##$USERP1= <user>
##$USERP2= <user>
##$USERP3= <user>
##$USERP4= <user>
##$USERP5= <user>
##$WDW= 1
##$XDIM= 131072
##$YMAX_p= 380697015
##$YMIN_p= -10759
##$CURPLOT= <Network HP LaserJet P1505>
##$CURPRIN= <$Network HP LaserJet P1505>
##$DFORMAT= <normdp>
##$LAYOUT= <+/1D_H.xwp>
##$LFORMAT= <normlp>
##$PFORMAT= <normpl>
##$SURQMSG= 1
$$ End of Bruker specific parameters
$$ ---------------------------------
##NTUPLES= NMR SPECTRUM
##VAR_NAME=  FREQUENCY,     SPECTRUM/REAL,   SPECTRUM/IMAG
##SYMBOL=    X,             R,               I
##VAR_TYPE=  INDEPENDENT,   DEPENDENT,       DEPENDENT
##VAR_FORM=  AFFN,          ASDF,            ASDF
##VAR_DIM=   131072,        131072,          131072
##UNITS=     HZ,            ARBITRARY UNITS, ARBITRARY UNITS
##FACTOR=    0.0627417313425164, 1,          1
##FIRST=     8223.62146879497, 4139,         -49670
##LAST=      0,             4722,            -50098
##MIN=       0,             -10759,          0
##MAX=       8223.62146879497, 380697015,    0
$$ Real data points
##PAGE= N=1
##DATA TABLE= (X++(R..R)), XYDATA
$$ [...]
60985B2739040J807492J720294J582490J372914J075047P09384L37556K6606j92907
60976C1177916l34207m28372n03049n87664p23417r47280j256829j594928j876514
60967B2925656k035826k054753j956884j783516j574012j357897j153937r71614
60959A0037217q13973o80736n70070m79104m04563l43600k93923k53475k20527
60950E977246j93942j72769j55646j41147j28572j17888j08921j01163r4339q8580
60940D674279q3902p9910p6116p2189o7942o3422n9000n5011n1329m7589m3684
60929C974185l9722l5752l1939k8648k5896k3033j9583j6055j3282j1311r713
60918C719251q599q423q999r769j0799j2445j4186j4967j4715j4313j3989j3064
$$ y = [22739040, 24546532, 26266826, 27849316, 29222230, 30297277, 31006661, 31344217, 31370823, 31177916, 30843709, 30415337, 29912288, 29324624, 28601207, 27653927, 26397098, 24802170, 22925656, 20889830, 18835077, 16878193, 15094677, 13520665, 12162768, 11008831, 10037217, 9223244, 8542508, 7972438, 7493334, 7088771, 6745171, 6451248, 6197773, 5977246, 5783304, 5610535, 5454889, 5313742, 5185170, 5067282, 4958361, 4857198, 4762859, 4674279, 4590377, 4510467, 4434351, 4362162, 4294220, 4230798, 4171798, 4116787, 4065458, 4017869, 3974185, 3934463, 3898711, 3866772, 3838124, 3812228, 3789195, 3769612, 3753557, 3740275, 3728964, 3719251, 3710652, 3702229, 3693230, 3683461, 3672662, 3660217, 3646031, 3631064, 3616349, 3602036, 3588047, 3574983]
60906C574983j1457j0143r586r038p895o696o153o164o334o484o113m431j606
60893C482883J173L396N953R319J2234J3322J3022J2789J3159J3804J4742J6227
60881C612023J7878J9157K0384K2195K4210K5300K5028K3774K1647J8290J3834
60870C843720R151M895R35k971o380q261p886n700l176j404J82K989P069J0768
60856C843931J2868J4037J5458J7081J8210J8925J9717K0262J9786J8274J6328
60845D034877J4112J1445Q562N755K539j826p137j2524j7641k2609k7035l0211
60833C958307l2226l3817l5135l5664l5323l4620l3701l2186l0105k8030k6129
60822C601371k4048k1854k0208j9320j8654j7959j7731j8245j8900j9090j9035
$$ y = [3574983, 3563526, 3553383, 3543797, 3534759, 3526864, 3520168, 3514015, 3507851, 3501517, 3495033, 3488920, 3484489, 3482883, 3484056, 3487452, 3493405, 3502724, 3514958, 3528280, 3541302, 3554091, 3567250, 3581054, 3595796, 3612023, 3629901, 3649058, 3669442, 3691637, 3715847, 3741147, 3766175, 3789949, 3811596, 3829886, 3843720, 3852871, 3857766, 3858701, 3855730, 3849350, 3841089, 3833203, 3827503, 3824327, 3822923, 3823105, 3826094, 3833163, 3843931, 3856799, 3870836, 3886294, 3903375, 3921585, 3940510, 3960227, 3980489, 4000275, 4018549, 4034877, 4048989, 4060434, 4068996, 4074751, 4077290, 4075464, 4068327, 4055803, 4038162, 4015553, 3988518, 3958307, 3926081, 3892264, 3857129, 3821465, 3786142, 3751522, 3717821, 3685635, 3655530, 3627500, 3601371, 3577323, 3555469, 3535261, 3515941, 3497287, 3479328, 3461597, 3443352, 3424452, 3405362, 3386327]
60811C386327j9230j9501j9220j8168j6798j5705j5115j4773j4216j3253j2114
60800C208234j1058r972q632p230o177n505m888m215l827m122n168o623p914q697
60786C114206r320j0475j2130j3338j3530j3364j3663j4026j3427j1864j0369
60775B978700r395q246o310m055k279r67O62L166O292R279J1642J3565J5412J7033
60761C024499J7978J8371J8823J9204J8313J5439J1462P718M348P13l133o419
60749C147316q853j0731j2054j2430j1868j0799r465q073p301p679q589q882q433
60736C022159q037p909p400o359n517n204m758l696k497j668r10J38J096J518
60722B970956J814K757M367N933P016P948R291J1112J2881J4090J4921J6100J7946
$$ y = [3386327, 3367097, 3347596, 3328376, 3310208, 3293410, 3277705, 3262590, 3247817, 3233601, 3220348, 3208234, 3197176, 3187204, 3178572, 3171342, 3165165, 3159660, 3154772, 3150557, 3146730, 3142608, 3137440, 3130817, 3122903, 3114206, 3104886, 3094411, 3082281, 3068943, 3055413, 3042049, 3028386, 3014360, 3000933, 2989069, 2978700, 2969305, 2961059, 2954749, 2950694, 2948415, 2947448, 2948110, 2951276, 2957568, 2966847, 2978489, 2992054, 3007466, 3024499, 3042477, 3060848, 3079671, 3098875, 3117188, 3132627, 3144089, 3151807, 3156155, 3156868, 3153735, 3147316, 3138463, 3127732, 3115678, 3103248, 3091380, 3080581, 3071116, 3063043, 3055742, 3048063, 3039474, 3030592, 3022159, 3014122, 3006213, 2998813, 2992454, 2986937, 2981733, 2976975, 2973279, 2970782, 2969114, 2968204, 2968342, 2969438, 2970956, 2972770, 2975527, 2979894, 2985827, 2992843, 3000791, 3010082, 3021194, 3034075, 3048165, 3063086, 3079186, 3097132]
60709C097132J9845K0963K1163K0822K0186J9407J8928J9095J9553J9691J9520
60698C316305J9569K0090K1064K2744K5370K8526L1573L4619L8230M2169M5273
60687C645532M6596M5958M3342L8643L2128K4367J5748O643j956q847j3622j6579
60675C857953j7819j7415j6254j5498j5078j3953j2058j0758j1046j2360j3719
60664C701995j4815j5518j5334j4150j2600j1043q850n371r26L692Q048J1887
60652C627015J4888J7156J9383K1944K4458K6699K9218L2518L6315M0240M4598
60641C934432M9665N4820N9025O1716O2596O1133N7145N1270M4100L5056K3143
60630D494101Q690o398k0085l1301l9638m4743m6406m5069m1933l8513l5809l3860
$$ y = [3097132, 3116977, 3137940, 3159103, 3179925, 3200111, 3219518, 3238446, 3257541, 3277094, 3296785, 3316305, 3335874, 3355964, 3377028, 3399772, 3425142, 3453668, 3485241, 3519860, 3558090, 3600259, 3645532, 3692128, 3738086, 3781428, 3820071, 3852199, 3876566, 3892314, 3898957, 3897001, 3888154, 3874532, 3857953, 3840134, 3822719, 3806465, 3790967, 3775889, 3761936, 3749878, 3739120, 3728074, 3715714, 3701995, 3687180, 3671662, 3656328, 3642178, 3629578, 3618535, 3609685, 3604314, 3603388, 3607080, 3615128, 3627015, 3641903, 3659059, 3678442, 3700386, 3724844, 3751543, 3780761, 3813279, 3849594, 3889834, 3934432, 3984097, 4038917, 4097942, 4159658, 4222254, 4283387, 4340532, 4391802, 4435902, 4470958, 4494101, 4502791, 4496393, 4476308, 4445007, 4405369, 4360626, 4314220, 4269151, 4227218, 4188705, 4152896, 4119036]
60618D119036l2185l0750l0169l0906l2590l4427l6065l7850m0260m3185m5821
60607C724828m7358m7817m7810m7407m5806m2659l8974l5893l3031k9095k3991
60596C284987j9052j5255j2327r811p809o278m668k785j103J65J542L465N741
60583C216812Q191J0942J3771J6074J7893J9975K2375K3971K3996K3087K2169
60572C419256K1231J9950J8593J7487J6380J5148J4388J4449J4596J4042J3136
60561C598656J2615J2282J1379R771P743N068J349k979p014j0513j3854j6896
60549C607607j8805j9002j7641j5143j1878q281m732j213K549O680J1118J5778
60537C547037K0521K5105K9466L3710L7675M0776M2427M2312M0158L5859K9972
$$ y = [4119036, 4086851, 4056101, 4025932, 3995026, 3962436, 3928009, 3891944, 3854094, 3813834, 3770649, 3724828, 3677470, 3629653, 3581843, 3534436, 3488630, 3445971, 3406997, 3371104, 3338073, 3308978, 3284987, 3265935, 3250680, 3238353, 3228542, 3220733, 3214455, 3209787, 3207002, 3205899, 3206064, 3207606, 3211071, 3216812, 3225003, 3235945, 3249716, 3265790, 3283683, 3303658, 3326033, 3350004, 3374000, 3397087, 3419256, 3440487, 3460437, 3479030, 3496517, 3512897, 3528045, 3542433, 3556882, 3571478, 3585520, 3598656, 3611271, 3623553, 3634932, 3644703, 3652446, 3657514, 3658863, 3655884, 3648870, 3638357, 3624503, 3607607, 3588802, 3569800, 3552159, 3537016, 3525138, 3516857, 3512125, 3510912, 3513461, 3520141, 3531259, 3547037, 3567558, 3592663, 3622129, 3655839, 3693514, 3734290, 3776717, 3819029, 3859187, 3895046, 3925018]
60526C925018K3403J6406Q515k30q784j6068k1685k5327k6461k5123k2235j8580
60514C808849j4238r422m787l89M536R939J4274J6457J7393J8433J9286J8878
60502C899209J7466J6392J6339J7144J8906K1863K5551K9422L3901L9509M5330
60491D181032M9733N2414N4240N5303N4591N1681M7176M1339L3706K4461J4778
60480D660454N346m302j4376k3790l1263l6821m1631m6781n2444n7805o1644o3419
60468D231524o3692o3045o1039n7120n2149m7716m3968l9501l3636k7476k2150
60457C720032j7343j2309p404l589j055R37L182O063R464J2692J4907J6040J6939
60444C758556J8251J9673K0689K1446K2376K3281K3446K2488K0735J8952J7932
$$ y = [3925018, 3948421, 3964827, 3973342, 3973112, 3964328, 3948260, 3926575, 3901248, 3874787, 3849664, 3827429, 3808849, 3794611, 3785189, 3780402, 3780013, 3784549, 3794488, 3808762, 3825219, 3842612, 3861045, 3880331, 3899209, 3916675, 3933067, 3949406, 3966550, 3985456, 4007319, 4032870, 4062292, 4096193, 4135702, 4181032, 4230765, 4283179, 4337419, 4392722, 4447313, 4498994, 4546170, 4587509, 4621215, 4645676, 4660454, 4665800, 4661498, 4647122, 4623332, 4592069, 4555248, 4513617, 4466836, 4414392, 4356587, 4294943, 4231524, 4167832, 4104787, 4043748, 3986628, 3934479, 3886763, 3842795, 3803294, 3769658, 3742182, 3720032, 3702689, 3690380, 3682976, 3679387, 3678332, 3679269, 3682451, 3688514, 3697978, 3710670, 3725577, 3741617, 3758556, 3776807, 3796480, 3817169, 3838615, 3860991, 3884272, 3907718, 3930206, 3950941, 3969893, 3987825]
60433C987825J7964J8389J7988J6221J3868J2035J0802R212O512K863j107n039
60421D107533q815j2037j3923j3901j2154r375o122k663O57L498O132R462J4028
60408D062320J9423K5088L1350L9047M8427N8927O9884Q0834R1303J00998J10220
60397D737821J19444J28229J35019J38187J37048J31783J22771J10092R3621P3583
60387E927598N1164K8319O856j2083k7572l8607m4801m7010m6624m4500m1022
60376E711718l6773l2451k8396k4807k2198k0958k0643k0389j9773j8671j6602
60365E450057j3254r361o143l961k563k610n666j2347k1509l1688m2414n3502
60353E245039o3960p2339p7774q0100p9380p5931p0632o4674n8903n3574m8556
$$ y = [3987825, 4005789, 4024178, 4042166, 4058387, 4072255, 4084290, 4095092, 4104304, 4110816, 4113679, 4112572, 4107533, 4098718, 4086681, 4072758, 4058857, 4046703, 4037328, 4031206, 4028543, 4029200, 4032698, 4038830, 4048292, 4062320, 4081743, 4106831, 4138181, 4177228, 4225655, 4284582, 4354466, 4435300, 4526603, 4627601, 4737821, 4857265, 4985494, 5120513, 5258700, 5395748, 5527531, 5650302, 5760394, 5854015, 5927598, 5978762, 6007081, 6013937, 6001854, 5974282, 5935675, 5890874, 5843864, 5797240, 5752740, 5711718, 5674945, 5642494, 5614098, 5589291, 5567093, 5546135, 5525492, 5505103, 5485330, 5466659, 5450057, 5436803, 5427442, 5421299, 5417338, 5414775, 5412165, 5406499, 5394152, 5372643, 5340955, 5298541, 5245039, 5181079, 5108740, 5030966, 4950866, 4871486, 4795555, 4724923, 4660249, 4601346, 4547772, 4499216]
60342D499216m3735l9363l6021l4056l3173l2803l2623l2350l1381k9335k6704
60331D127672k4246k1811j8666j4985j1965j0156q645o426l838j925q83N8J435
60318D005619K902L781L876L557L207K721J738M50k36K31J166J463J105J029J564
60303D034173J983J874K001L195N131O860Q056Q954R420Q800O748L620J7l684
60289D097148p319j0735j3611j5398j5587j4222j1980r536o914l778k41K939N133
60276C995899O531P873R554J1292J2660J3661J4485J4943J4587J3397J1963J0841
60264D137686J0038R259Q365P416O584O088N969N851N399N040N582O974Q138Q431
60250D236820Q500R206J0437J1694J3136J5085J7047J8174J8551J8997J9858K0802
$$ y = [4499216, 4455481, 4416118, 4380097, 4346041, 4312868, 4280065, 4247442, 4215092, 4183711, 4154376, 4127672, 4103426, 4081615, 4062949, 4047964, 4035999, 4025843, 4017198, 4010772, 4006934, 4005009, 4004126, 4004184, 4005619, 4008521, 4012302, 4016178, 4019735, 4022942, 4025663, 4027401, 4027851, 4027615, 4027846, 4029012, 4030475, 4031580, 4032609, 4034173, 4036156, 4038030, 4040031, 4043226, 4048357, 4055217, 4063273, 4072227, 4081647, 4090447, 4097195, 4100815, 4100832, 4097148, 4089829, 4079094, 4065483, 4050085, 4034498, 4020276, 4008296, 3998760, 3991846, 3988068, 3987827, 3990766, 3995899, 4002430, 4010303, 4019857, 4031149, 4043809, 4057470, 4071955, 4086898, 4101485, 4114882, 4126845, 4137686, 4147724, 4156983, 4165348, 4172764, 4179348, 4185436, 4191405, 4197256, 4202655, 4207695, 4213277, 4220251, 4228389, 4236820, 4245320, 4254526, 4264963, 4276657, 4289793, 4304878, 4321925, 4340099, 4358650, 4377647, 4397505, 4418307]
60238D418307K1684K2746K3996K5212K6516K8283L0525L3015L5939L9634M3818
60227D749675M7777N1396N5267N9855O5098P0758P6461Q1600Q5915R0093R5006
60216E528901J00494J05688J10397J15243J20536J25906J31118J36381J41642
60207F616306J46353J49996J52205J52346J49796J44547J36927J26850J14253
60198G889579J00077Q5789P2069N8939M7010L7262K9524K2479J5415Q681K193
60187H369017n008j3101k0683k6441l0611l4040l6761l8348l8804l8371l7136
60176H049713l5626l5005l5960l8014m0765m5138n2458o2708p4613q7226j00503
60165G441697j14245j27065j36792j41870j42374j39696j35018j28406j19650
$$ y = [4418307, 4439991, 4462737, 4486733, 4511945, 4538461, 4566744, 4597269, 4630284, 4666223, 4705857, 4749675, 4797452, 4848848, 4904115, 4963970, 5029068, 5099826, 5176287, 5257887, 5343802, 5433895, 5528901, 5629395, 5735083, 5845480, 5960723, 6081259, 6207165, 6338283, 6474664, 6616306, 6762659, 6912655, 7064860, 7217206, 7367002, 7511549, 7648476, 7775326, 7889579, 7989656, 8075445, 8147514, 8206453, 8253463, 8290725, 8320249, 8342728, 8358143, 8366824, 8369017, 8364009, 8350908, 8330225, 8303784, 8273173, 8239133, 8202372, 8164024, 8125220, 8086849, 8049713, 8014087, 7979082, 7943122, 7905108, 7864343, 7819205, 7766747, 7704039, 7629426, 7542200, 7441697, 7327452, 7200387, 7063595, 6921725, 6779351, 6639655, 6504637, 6376231, 6256581]
60156F256581j09533r9378q9480p9022o7659n6168m5200l4420k3481j3049m207
60145E634984K604P569J0887J2620J2741J1107P846L837Q9l425p543j2378j6988
60132E663950k0854k4646k9014l3641l8162m3098m8959n5046n9941o2826o3771
60121E183992o3166o1382n8578n4420m8460m1103l3613k6844k0580j4443q675
60110D752728l514J405O418J1210J5356J8978K2367K5401K7830K9504L0046K8932
60098D966661K6313K3037J9456J4951R113K558l992j0605j7418k3785k8854l2469
60086D944966l4881l6146l6365l6022l5489l4729l3902l3502l3512l3189l2278
60075D564951l1577l1675l1935l1447l0248k8789k6889k4027k0136j5407r900
$$ y = [6256581, 6147048, 6047670, 5958190, 5879168, 5811509, 5755341, 5710141, 5675721, 5652240, 5639191, 5634984, 5637588, 5645157, 5656044, 5668664, 5681405, 5692512, 5700358, 5704195, 5704284, 5700859, 5693316, 5680938, 5663950, 5643096, 5618450, 5589436, 5555795, 5517633, 5474535, 5425576, 5370530, 5310589, 5247763, 5183992, 5120826, 5059444, 5000866, 4946446, 4897986, 4856883, 4823270, 4796426, 4775846, 4761403, 4752728, 4749214, 4750619, 4757037, 4768247, 4783603, 4802581, 4824948, 4850349, 4878179, 4907683, 4937729, 4966661, 4992974, 5016011, 5035467, 5050418, 5059531, 5062089, 5058097, 5047492, 5030074, 5006289, 4977435, 4944966, 4910085, 4873939, 4837574, 4801552, 4766063, 4731334, 4697432, 4663930, 4630418, 4597229, 4564951, 4533374, 4501699, 4469764, 4438317, 4408069, 4379280, 4352391, 4328364, 4308228, 4292821, 4282921]
60064D282921m002J433O035J0452J5257K0017K4073K7565L0879L3822L6052L7689
60052D522193L8814L9057L8322L7185L5761L3117K8660K3253J7990J2734O868
60041D833954P85m627r333j3820j7920k0996k2803k3288k2124j9424j6261j3353
60029D650790r992n371k76L806O599Q575R222P419L337j669o923j2762j8941k4155
60015D609659k7476k9069k9296k8103k5642k2567j9395j6154j2776r341o044l363
60003D380433j976j790j580m21R74J335Q40Q57J921L166L800M044M386M902N466
59988D406357O045O659P518R085J1569J4670J8257K2791K8492L4713M0891M7333
59976D654380N4157O0307O4804O8286P1863P4993P5884P3616O8469O0544M9679
$$ y = [4282921, 4278919, 4280352, 4286387, 4296839, 4312096, 4332113, 4356186, 4383751, 4414630, 4448452, 4484504, 4522193, 4561007, 4600064, 4638386, 4675571, 4711332, 4744449, 4773109, 4796362, 4814352, 4827086, 4833954, 4834739, 4830112, 4820779, 4806959, 4789039, 4768043, 4745240, 4721952, 4699828, 4680404, 4664143, 4650790, 4640798, 4635427, 4635151, 4638957, 4645556, 4654131, 4663353, 4670772, 4674109, 4672440, 4665517, 4652755, 4633814, 4609659, 4582183, 4553114, 4523818, 4495715, 4470073, 4447506, 4428111, 4411957, 4399181, 4389840, 4383796, 4380433, 4378457, 4376667, 4375087, 4374666, 4375640, 4376975, 4377815, 4378672, 4380593, 4383759, 4387559, 4391603, 4395989, 4400891, 4406357, 4412402, 4419061, 4426579, 4435664, 4447233, 4461903, 4480160, 4502951, 4531443, 4566156, 4607047, 4654380, 4708537, 4768844, 4833648, 4901934, 4973797, 5048790, 5124674, 5198290, 5266759, 5327303, 5376982]
59965E376982L6595K2625Q395n982j9563l0946l9861m6923n1898n3831n2873n0338
59953E092382m6688m1171l3673k5269j6395o150N836J8268K9790M0573N1509O2836
59941E131848P4247Q5450R5916J04820J11750J16786J19635J19516J16231J10338
59931F186537J01945R0287P4914N6459L5918J4234p078k6083m1725n4136o3286
59920F367986o8430o9412o7399o3612n8248n1392m4078l7648l2607k8759k5859
59909E820542k3637k1884k0949k1484k3337k5384k6743k7221k6260k2735j6553
59898E564355r408k857L582J1420K0836L0355L8571M5234N0720N5142N8054N8775
59886E924779N7124N3942N0504M7271M3697L9421L5014L1191K8053K5630K4636
$$ y = [5376982, 5413577, 5436202, 5444597, 5438615, 5419052, 5388106, 5348245, 5301322, 5249424, 5195593, 5142720, 5092382, 5045694, 5004523, 4970850, 4945581, 4929186, 4923036, 4928872, 4947140, 4976930, 5017503, 5069012, 5131848, 5206095, 5291545, 5387461, 5492281, 5604031, 5720817, 5840452, 5959968, 6076199, 6186537, 6288482, 6378769, 6453683, 6510142, 6546060, 6560294, 6553216, 6527133, 6485408, 6431272, 6367986, 6299556, 6230144, 6162745, 6099133, 6040885, 5989493, 5945415, 5907767, 5875160, 5846401, 5820542, 5796905, 5775021, 5754072, 5732588, 5709251, 5683867, 5657124, 5629903, 5603643, 5580908, 5564355, 5554947, 5552090, 5555672, 5567092, 5587928, 5618283, 5656854, 5702088, 5752808, 5807950, 5866004, 5924779, 5981903, 6035845, 6086349, 6133620, 6177317, 6216738, 6251752, 6282943, 6310996, 6336626, 6361262]
59875F361262K5976K9771L5222M1199M6603N0377N1411M8385L9996K5891P331
59864F763424j3652l5603n7300p6355q9438r4557r2297q4530p2914n9053m4858
59853F042867l1604j9074o415O570J9592L2727M6249N9931P3206Q5930R8406J10782
59841F519167J22803J34081J44282J53308J61589J70007J79253J89273J99332
59832G973095K08307K14872K17732K15919K08658J95081J74468J46949J13764
59823I668845P6924L8867K191l0959n9163q1280r6311j04486j08000j09609j10572
59812I086447j10884j11224j13142j17025j21106j23194j22662j20349j17364
59803H029497j14504j12273j10826j10069j09832j09610j08357j05264j00647
$$ y = [6361262, 6387238, 6417009, 6452231, 6493430, 6540033, 6590410, 6641821, 6690206, 6730202, 6756093, 6763424, 6749772, 6714169, 6656869, 6580514, 6491076, 6396519, 6304222, 6219692, 6146778, 6087725, 6042867, 6011263, 5992189, 5985774, 5992344, 6011936, 6044663, 6090912, 6150843, 6224049, 6309979, 6408385, 6519167, 6641970, 6776051, 6920333, 7073641, 7235230, 7405237, 7584490, 7773763, 7973095, 8181402, 8396274, 8614006, 8829925, 9038583, 9233664, 9408132, 9555081, 9668845, 9745769, 9784636, 9786827, 9755868, 9696705, 9615425, 9519114, 9414628, 9306628, 9197019, 9086447, 8975563, 8864339, 8751197, 8634172, 8513066, 8389872, 8267210, 8146861, 8029497, 7914993, 7802720, 7691894, 7581825, 7471993, 7362383, 7254026, 7148762, 7048115]
59794G048115r5339q9394q2202p3738o4665n5298m5451l5200k4682j3238J8J4793
59782F483719K9961M5212O0829P5854Q8142R6733J02512J06182J07124J04868
59772G301136J00001R2900Q3155P1098N8381M6131L3866K1043Q099m933j9040
59761G791837l4120m7674n7115o2046o2873n8658m8360l3232j6074J271J8059
59750G391015L3098M4946N3359N8714O0235N6389M6957L3263J6344l625k6047
59739G764648m9456p2627r4994j15754j33503j47187j56669j62223j64174j63170
59729F504891j60126j55653j49926j43115j35519j27356j18870j10432j02239
59720E301655r4100q5867p7768p0040o2658n5669m9195m2780l5492k7173j8862
$$ y = [7048115, 6952776, 6863382, 6781180, 6707442, 6642777, 6587479, 6542028, 6506828, 6482146, 6468908, 6468926, 6483719, 6513680, 6558892, 6619721, 6695575, 6783717, 6880450, 6982962, 7089144, 7196268, 7301136, 7401137, 7494037, 7577192, 7648290, 7706671, 7752802, 7786668, 7807711, 7815810, 7810877, 7791837, 7757717, 7710043, 7652928, 7590882, 7528009, 7469351, 7420991, 7387759, 7371685, 7372956, 7391015, 7424113, 7469059, 7522418, 7581132, 7641367, 7697756, 7744713, 7777976, 7794320, 7790695, 7764648, 7715192, 7642565, 7547571, 7431817, 7298314, 7151127, 6994458, 6832235, 6668061, 6504891, 6344765, 6189112, 6039186, 5896071, 5760552, 5633196, 5514326, 5403894, 5301655, 5207555, 5121688, 5043920, 4973880, 4911222, 4855553, 4806358, 4763578, 4728086, 4700913, 4682051]
59709D682051j1444m567K452R548J6471K3590L1180L8574M4986N0575N5844O0674
59697D999934O4846O8850P3059P6791P9337Q1351Q3973Q6969Q8980Q9310Q8262
59686E881662Q5932Q2029P6880P1456O6155O0425N3709M6139L8363L1250K5591
59675F519591K1421J7816J3883R535M841o59p113j3426j8249k1543k4138k6197
59663F475762k7189k7128k6704k6388k6317k6849k8271l0127l1728l3045l4204
59652F157812l4542l3293l0885k8461k6274k3716k0685j7752j5168j2877j1458
59641E902701j1810j3889j6809k0171k4204k8723l3194l7808m3214m8977n3554
59630E570348n6024n6788n6341n4445n0828m5641l8885l0492k1317j3049o598
$$ y = [4682051, 4670607, 4666040, 4668492, 4678040, 4694511, 4718101, 4749281, 4787855, 4832841, 4883416, 4939260, 4999934, 5064780, 5133630, 5206689, 5283480, 5362817, 5444168, 5528141, 5615110, 5704090, 5793400, 5881662, 5967594, 6049623, 6126503, 6197959, 6264114, 6324539, 6378248, 6424387, 6462750, 6494000, 6519591, 6541012, 6558828, 6572711, 6582246, 6587087, 6586428, 6579315, 6565889, 6547640, 6526097, 6501959, 6475762, 6448573, 6421445, 6394741, 6368353, 6342036, 6315187, 6286916, 6256789, 6225061, 6192016, 6157812, 6123270, 6089977, 6059092, 6030631, 6004357, 5980641, 5959956, 5942204, 5927036, 5914159, 5902701, 5890891, 5877002, 5860193, 5840022, 5815818, 5787095, 5753901, 5716093, 5672879, 5623902, 5570348, 5514324, 5457536, 5401195, 5346750, 5295922, 5250281, 5211396, 5180904, 5159587, 5146538, 5139940]
59619E139940j375L470P889J1353J3558J4223J2984J0009O231K507j020m489p743
59606E207537j0472j2493j3752j4397j4830j5203j4968j3540j1305r212p448n330
59594E064587k636k00J084J116K94r09j811j712o85L16M47j97r00j103q07n90
59578E056294j273l204n900q646j1271j3910j6363j8206j9269j9421j8250j5593
59566D904988j1988p935l079K939R395J5252K0631K6184L1284L4384L5209L5089
59554E092353L4755L3298K9956K5652K1782J8451J4846J0813P121M424K650J382
59542E297483M92M51J947M923Q046R694R509Q539P692O520L551k521j1755k2519
59528E322052l2194l8980m3108m5972m8464n0634n2494n4034n4684n3798n1616
$$ y = [5139940, 5138565, 5142035, 5149924, 5161277, 5174835, 5189058, 5202042, 5212051, 5218282, 5220789, 5219769, 5215280, 5207537, 5197065, 5184572, 5170820, 5156423, 5141593, 5126390, 5111422, 5097882, 5086577, 5077365, 5069917, 5064587, 5061951, 5061751, 5062835, 5063951, 5064245, 5063336, 5061525, 5059813, 5059128, 5059444, 5059891, 5059694, 5058794, 5057691, 5056884, 5056294, 5055021, 5051817, 5045917, 5037271, 5026000, 5012090, 4995727, 4977521, 4958252, 4938831, 4920581, 4904988, 4893000, 4885065, 4881986, 4884925, 4894320, 4909572, 4930203, 4956387, 4987671, 5022055, 5057264, 5092353, 5127108, 5160406, 5190362, 5216014, 5237796, 5256247, 5271093, 5281906, 5289027, 5293451, 5296101, 5297483, 5297975, 5298426, 5300373, 5305296, 5313342, 5323036, 5332545, 5341084, 5348776, 5355296, 5358847, 5356326, 5344571, 5322052, 5289858, 5250878, 5207770, 5161798, 5113334, 5062700, 5010206, 4956172, 4901488, 4847690, 4796074]
59517D796074m8868m5507m0933l5397l0014k5229k0450j5402j0778p092l970j004
59505D511430J536L347M618N518N826N482M824L943K536O81q52j357o70J200M124
59490D552186P399J0131J2335J4912J8329K2220K6355L0957L5683L9484M2062
59479D812053M4456M7538N0798N3265N4817N5897N6616N6938N7106N7235N6934
59468E403653N5948N4611N3118N0840M6958M1366L4491K6740J8589J0629L046
59457E799989m485j1918j8359k2983k5843k7311k7354k6017k4063k2345k0937
59446E568374j9677j9208k0568k3770k7569l0708l2841l4047l4054l2384k9070
59435E264478k4861k0554j6221j1371n942q14L011N588P939J0809J3866J6111
$$ y = [4796074, 4747206, 4701699, 4660766, 4625369, 4595355, 4570126, 4549676, 4534274, 4523496, 4516404, 4512434, 4511430, 4512966, 4516313, 4520931, 4526449, 4532275, 4537757, 4542581, 4546524, 4549060, 4549741, 4548889, 4547532, 4546862, 4548062, 4552186, 4559585, 4569716, 4582051, 4596963, 4615292, 4637512, 4663867, 4694824, 4730507, 4769991, 4812053, 4856509, 4904047, 4954845, 5008110, 5062927, 5118824, 5175440, 5232378, 5289484, 5346719, 5403653, 5459601, 5514212, 5567330, 5618170, 5665128, 5706494, 5740985, 5767725, 5786314, 5796943, 5799989, 5795504, 5783586, 5765227, 5742244, 5716401, 5689090, 5661736, 5635719, 5611656, 5589311, 5568374, 5548697, 5529489, 5508921, 5485151, 5457582, 5426874, 5394033, 5359986, 5325932, 5293548, 5264478, 5239617, 5219063, 5202842, 5191471, 5185529, 5184715, 5187726, 5193314, 5201253, 5212062, 5225928, 5242039]
59423E242039J6753J5732J3806J2203J1783J2459J3675J5406J8252K2412K6857
59412E421377K9813L0289K9218K8681K9315K8766K3975J5429P978O712J2899K4408
59400E688860L8423N2373O3917P2413P9647Q6794R1137Q8509P9278O9319O4141
59389F474811O3953O5400O5979O5242O3252N9794N4634M7524L8338K7795J7334
59378G044056P787r84q905j5352k0556k6046l2771l9905m6324n2171n7864o2588
59366F688377o4942o4539o1963n7812n2728m7774m3766m0572l7667l4989l2658
59355F148967l0509k8535k7150k6443k5873k5305k5480k6739k8211k9067k9743
59344E845912l0911l2058l2227l1450l0282k8492k5443k1415j7368j3580r617
$$ y = [5242039, 5258792, 5274524, 5288330, 5300533, 5312316, 5324775, 5338450, 5353856, 5372108, 5394520, 5421377, 5451190, 5481479, 5510697, 5539378, 5568693, 5597459, 5621434, 5636863, 5644841, 5651553, 5664452, 5688860, 5727283, 5779656, 5843573, 5915986, 5995633, 6082427, 6173564, 6262073, 6341351, 6410670, 6474811, 6538764, 6604164, 6670143, 6735385, 6798637, 6858431, 6913065, 6960589, 6998927, 7026722, 7044056, 7051843, 7050859, 7041954, 7026602, 7006046, 6980000, 6947229, 6907324, 6861000, 6808829, 6750965, 6688377, 6623435, 6558896, 6496933, 6439121, 6386393, 6338619, 6294853, 6254281, 6216614, 6181625, 6148967, 6118458, 6089923, 6062773, 6036330, 6010457, 5985152, 5959672, 5932933, 5904722, 5875655, 5845912, 5815001, 5782943, 5750716, 5719266, 5688984, 5660492, 5635049, 5613634, 5596266, 5582686, 5573069]
59333E573069n482j704J668N151Q766J1706J3269J3484J2730J1217Q973N917J877
59320E660641l153q656j3631j6906j7501j5114j0435m637J668Q681J6618K5275
59308E622850L4522M4483N4913O5054P4515Q3660R2686J00874J07232J11326J12954
59297F505069J11496J06201R6891Q4104O8771N1960L4629J7657K430q988j5086
59286G055134j6121j3235o706L566J6030K7791L7477M6088N4370O0883O3618O1894
59274G390789N5596M4031K7164O857j4643l6624n8995q0333r8505j12615j22973
59263F999749j29553j31974j30712j27012j21626j14661j06447r7573q8337p9051
59253E872803p0533o3324n6739m9664m2039l4716k8251k2803j8798j6621j5825
$$ y = [5573069, 5567587, 5565883, 5567551, 5572702, 5581468, 5593174, 5606443, 5619927, 5632657, 5643874, 5652847, 5658764, 5660641, 5657488, 5648832, 5635201, 5618295, 5600794, 5585680, 5575245, 5570608, 5572276, 5580957, 5597575, 5622850, 5657372, 5701855, 5756768, 5821822, 5896337, 5979997, 6072683, 6173557, 6280789, 6392115, 6505069, 6616565, 6722766, 6819657, 6903761, 6972532, 7024492, 7059121, 7076778, 7079208, 7070220, 7055134, 7039013, 7025778, 7019072, 7022638, 7038668, 7066459, 7103936, 7150024, 7204394, 7265277, 7328895, 7390789, 7446385, 7490416, 7517580, 7524437, 7509794, 7473170, 7414175, 7333842, 7235337, 7122722, 6999749, 6870196, 6738222, 6607510, 6480498, 6358872, 6244211, 6137764, 6040191, 5951854, 5872803, 5802270, 5738946, 5682207, 5632543, 5590504, 5555788, 5527537, 5504734, 5485936, 5469315, 5453490]
59242E453490j5569j5686j6588j8365k0742k3562k6527k8922l0341l1280l2250
59231E193658l2791l2149l0314k7572k3679j8533j3034q087l350J925P339J1941
59219E025354J5855J9967K4368K8486L2497L7111M2142M6666N0531N4345N7977
59208E435299O0559O1998O3123O4127O4335O3747O3390O3666O3647O2573O0847
59197F127311N8834N5813N0931M4350L6564K7315J6171L750q468j9407k8838l6653
59185F327673m2300m5079m4755m1676l6406k9281k0406j0008J392J3241K5087
59174F097482L6415M6756N6107O4839P2843P9158Q2785Q3542Q1737P7411P0350
59163F849425O0541M8266L4099J9103M737p715j7332k3152k4335k1083j4718o542
$$ y = [5453490, 5437921, 5422235, 5405647, 5387282, 5366540, 5342978, 5316451, 5287529, 5257188, 5225908, 5193658, 5160867, 5128718, 5098404, 5070832, 5047153, 5028620, 5015586, 5007499, 5004149, 5006074, 5013413, 5025354, 5041209, 5061176, 5085544, 5114030, 5146527, 5183638, 5225780, 5272446, 5322977, 5377322, 5435299, 5495858, 5557856, 5620979, 5685106, 5749441, 5813188, 5876578, 5940244, 6003891, 6066464, 6127311, 6186145, 6241958, 6292889, 6337239, 6373803, 6401118, 6417289, 6421039, 6412571, 6393164, 6364326, 6327673, 6285373, 6240294, 6195539, 6153863, 6117457, 6088176, 6067770, 6057762, 6059154, 6072395, 6097482, 6133897, 6180653, 6236760, 6301599, 6374442, 6453600, 6536385, 6619927, 6701664, 6779075, 6849425, 6909966, 6958232, 6992331, 7011434, 7016171, 7008456, 6991124, 6967972, 6943637, 6922554, 6907836, 6901294]
59151F901294K710J2060K0071K6094L0882L5264L9180M2740M7280N4214O3611
59140G275400P4964Q8535J04683J22436J40030J56349J70670J81328J86074J83793
59130H684262J74973J60594J41446J18368R2360O4504L6130Q447j8448m5271p1420
59119I345945r4228j11485j23871j33589j41489j47101j50637j52901j53506j51099
59109G986039j45399j37415j27653j15835j02675r0271q0148p2067o5182n9327
59099F990067n4699n1265m8913m7525m6749m6192m5837m5580m4719m2693l9943
59088F475952l7111l3843k9559k4882k0880j7173j2277n771J360Q411J5404K1742
59076F341373K6132K8236K8971K8698K6528K2015J6288J0841O109J871j833m809
$$ y = [6901294, 6904004, 6916064, 6936135, 6962229, 6993111, 7028375, 7067555, 7110295, 7157575, 7211789, 7275400, 7350364, 7438899, 7543582, 7666018, 7806048, 7962397, 8133067, 8314395, 8500469, 8684262, 8859235, 9019829, 9161275, 9279643, 9372003, 9436507, 9472637, 9481084, 9462636, 9417365, 9345945, 9251717, 9140232, 9016361, 8882772, 8741283, 8594182, 8443545, 8290644, 8137138, 7986039, 7840640, 7703225, 7575572, 7459737, 7357062, 7266791, 7186643, 7114576, 7049394, 6990067, 6935368, 6884103, 6835190, 6787665, 6740916, 6694724, 6648887, 6603307, 6558588, 6515895, 6475952, 6438841, 6404998, 6375439, 6350557, 6329677, 6312504, 6300227, 6294456, 6295816, 6304227, 6319631, 6341373, 6367505, 6395741, 6424712, 6453410, 6479938, 6501953, 6518241, 6529082, 6535191, 6537062, 6535229, 6530420]
59064F530420p044q510r135r093q582p444n827n104p117j2386j9927k8730l8383
59051F363138m8325n7706o6131p3468p8853q1060q0126p7509p4413p0959o7113
59040E587475o3223n9333n5099n0747m7058m4126m1068l7253l2892k8225k3183
59029E105268j8179j4138j1334r049o642m041j080K576O516R698J1881J3994J6724
59016E102194J9698K2393K4916K7480K9943L2259L4651L7064L9217M1357M4153
59005E455325M7767N1913N6889O3459P1575Q0407Q9772J00339J12045J23659J34419
58994F387569J45005J56132J67100J76413J83135J86967J87579J84356J76481
58985G950737J63064J43868J20012R3340O5002L5363N208k3957n0942p5356r6875
$$ y = [6530420, 6523376, 6514866, 6505731, 6496638, 6488056, 6480612, 6474785, 6469681, 6462564, 6450178, 6430251, 6401521, 6363138, 6314813, 6257107, 6190976, 6117508, 6038655, 5957595, 5877469, 5799960, 5725547, 5654588, 5587475, 5524252, 5464919, 5409820, 5359073, 5312015, 5267889, 5226821, 5189568, 5156676, 5128451, 5105268, 5087089, 5072951, 5061617, 5052568, 5045926, 5041885, 5040805, 5043381, 5049897, 5059595, 5071476, 5085470, 5102194, 5121892, 5144285, 5169201, 5196681, 5226624, 5258883, 5293534, 5330598, 5369815, 5411172, 5455325, 5503092, 5555005, 5611894, 5675353, 5746928, 5827335, 5917107, 6017446, 6129491, 6253150, 6387569, 6532574, 6688706, 6855806, 7032219, 7215354, 7402321, 7589900, 7774256, 7950737, 8113801, 8257669, 8377681, 8471021, 8536023, 8571386, 8576594, 8552637, 8501695, 8426339, 8329464]
58974H329464j14992j29678j41358j49998j54947j55757j52380j44603j32365
58965G053386j16891j00600q5682p3353o4340n9039n7202n8353o2462o9221p6982
58954F229261q3672q8635r2382r4591r3938q9967q3704p6022o6765n5764m3481
58943E360340l0399j6886l872P546J7374K6325L4112L9537M2383M3815M4597M4517
58931E609389M3783M3573M4509M6039M7695M9737N2118N4082N5112N5076N3122
58920F154235M7889L9181K8227J6132L435q701j8549k5417k9743l1418k9685k4849
58908F120737j8220j0018P23J3765K7264M0304N3806O8060Q1490R2818J02508
58897F573237J10985J17346J21013J22766J22847J19733J12173J00803Q6520O8917
$$ y = [8329464, 8214472, 8084794, 7943436, 7793438, 7638491, 7482734, 7330354, 7185751, 7053386, 6936495, 6835895, 6750213, 6676860, 6612520, 6553481, 6496279, 6437926, 6375464, 6306243, 6229261, 6145589, 6056954, 5964572, 5869981, 5776043, 5686076, 5602372, 5526350, 5459585, 5403821, 5360340, 5329941, 5313055, 5309183, 5316729, 5334103, 5360428, 5394540, 5434077, 5476460, 5520275, 5564872, 5609389, 5653172, 5696745, 5741254, 5787293, 5834988, 5884725, 5936843, 5990925, 6046037, 6101113, 6154235, 6202124, 6241305, 6269532, 6285664, 6289099, 6280398, 6261849, 6236432, 6206689, 6175271, 6145586, 6120737, 6102517, 6092499, 6093222, 6106987, 6134251, 6174555, 6228361, 6296421, 6377911, 6470729, 6573237, 6684222, 6801568, 6922581, 7045347, 7168194, 7287927, 7400100, 7500903, 7587423, 7656340]
58887G656340M7805K4807J927k0168m1090n9372p3649q4148r1641r6037r7120
58876G167654r5599r2137q6548p9033p1030o3678n6801n0482m6331m5753m8219
58865F432043n2533n8515o6093p3926q0460q5449q9241r1715r3069r4348r5783
58854E550911r5881r3551q9931q6627q3407p9219p4359o9809o5403o0332n4743
58843D697649m9320m4004l8570l3713l0128k7308k4534k2189k0702j9129j6300
58832D371752j2563q984n558j739K044M978P356J0140J3515J7051K0669K4253
58820D442914K7001K8324K8613K8129K5989K1429J5174Q321R24p060j4411j9668
58808D585679k2710k4106k3826k1747j8469j4323q774k066L957Q242J2337J8031
$$ y = [7656340, 7704145, 7728952, 7730879, 7710711, 7669621, 7610249, 7536600, 7452452, 7360811, 7264774, 7167654, 7072055, 6979918, 6893370, 6814337, 6743307, 6679629, 6622828, 6572346, 6526015, 6480262, 6432043, 6379510, 6320995, 6254902, 6180976, 6100516, 6015067, 5925826, 5834111, 5741042, 5646694, 5550911, 5455030, 5361479, 5271548, 5184921, 5101514, 5022295, 4947936, 4878127, 4812724, 4752392, 4697649, 4648329, 4604325, 4565755, 4532042, 4501914, 4474606, 4450072, 4427883, 4407181, 4388052, 4371752, 4359189, 4350205, 4344647, 4342908, 4344952, 4349930, 4357286, 4367426, 4380941, 4397992, 4418661, 4442914, 4469915, 4498239, 4526852, 4554981, 4580970, 4602399, 4617573, 4625894, 4626818, 4619758, 4605347, 4585679, 4562969, 4538863, 4515037, 4493290, 4474821, 4460498, 4451724, 4449658, 4453615, 4461857, 4474194, 4492225]
58796D492225K4414K9366L2744L5882L8756M0060L9630L8531L6990L4242L0369
58785D873209K6457K2979J9648J6822J5447J5652J6795J8805K2070K6131K9749
58774E103764L2216L3545L3661L2483L0497K8230K5513K2167J8726J5527J1766
58763E388095O624O48n140j0823j7174k4363l2153m0488m8825n5855o1034o5416
58751E034096o9712p2685p2829p0530o7053o2538n6649n0073m3546l6363k7649
58740D404469j8340r977k376N664J3970K1229K7098L2407L7721M3103M8691N4070
58728D657729N7830N9036N8267N5903N0682M1536K9490J5914K69j8168l7581n4944
58716D915963o9116q0411q8130r1146r0204q7160q2389p5239o6414n7585m8957
$$ y = [4492225, 4516639, 4546005, 4578749, 4614631, 4653387, 4693447, 4733077, 4771608, 4808598, 4842840, 4873209, 4899666, 4922645, 4942293, 4959115, 4974562, 4990214, 5007009, 5025814, 5047884, 5074015, 5103764, 5135980, 5169525, 5203186, 5235669, 5266166, 5294396, 5319909, 5342076, 5360802, 5376329, 5388095, 5394719, 5395367, 5390227, 5379404, 5362230, 5337867, 5305714, 5265226, 5216401, 5160546, 5099512, 5034096, 4964384, 4891699, 4818870, 4748340, 4681287, 4618749, 4562100, 4512027, 4468481, 4432118, 4404469, 4386129, 4376152, 4373776, 4379440, 4393410, 4414639, 4441737, 4474144, 4511865, 4554968, 4603659, 4657729, 4715559, 4774595, 4832862, 4888765, 4939447, 4980983, 5010473, 5026387, 5026656, 5008488, 4970907, 4915963, 4846847, 4766436, 4678306, 4587160, 4496956, 4409796, 4327407, 4252168, 4185754, 4128169, 4079212]
58705D079212l9508k9238j9103r273N17R449J6561K2430K7749L1076L0457K6557
58693D146886K1587J5731P394l446j4827k5359l4521m0749m2142l9186l4253k8291
58681C928824k0509j1127j889O247J3483J9302K2671K4008K4486K3568J9815J3919
58669D062798Q141K728m167j2831k1188k8039l4200l9881m3765m5522m6664m8042
58657C749368m8708m8020m6644m4865m2049l8367l5050l2364k9370k6024k3415
58646C334492k1655j9628j7057j4715j2450r439o466n390n959n759l855j926j281
58633C208912j253j171j471k073k036j484j675k567k614j425l23K89J520L427
58619C196056M448M138L975M570M540L090J368M04j17k18R16L101M947O164P873
$$ y = [4079212, 4039704, 4010466, 3991363, 3982090, 3982607, 3992056, 4008617, 4031047, 4058796, 4089872, 4120329, 4146886, 4168473, 4184204, 4191598, 4188152, 4173325, 4147966, 4113445, 4072696, 4030554, 3991368, 3957115, 3928824, 3908315, 3897188, 3895299, 3901546, 3915029, 3934331, 3957002, 3981010, 4005496, 4029064, 4048879, 4062798, 4070939, 4073667, 4069500, 4056669, 4035481, 4007442, 3973242, 3933361, 3889596, 3844074, 3797410, 3749368, 3700660, 3652640, 3605996, 3561131, 3519082, 3480715, 3445665, 3413301, 3383931, 3357907, 3334492, 3312837, 3293209, 3276152, 3261437, 3248987, 3239548, 3233082, 3227692, 3221733, 3215974, 3212119, 3210193, 3208912, 3207659, 3206488, 3205017, 3202944, 3200908, 3199424, 3197749, 3195182, 3192568, 3191143, 3190820, 3191109, 3192629, 3196056, 3200504, 3204642, 3208617, 3213187, 3217727, 3220817, 3222185, 3222589, 3222472, 3222254, 3223170, 3226271, 3231218, 3237382, 3245255]
58604C245255J0008J0997J0613J0687J2072J3425J3839J4205J5115J5924J6771
58593C388911J8962K2430K5320K7067K9268L2515L5118L6065L6586L7519L7801
58582C727562L6927L6294L6591L6447L5168L4405L5367L6731L6906L6142L4793
58571D123333L1733K6204J9268J1842L231o894j7038k5937l4110m1910m7893n0690
58559C991139n0798m9208m6025m1609l7269l3643l0141k6976k5685k6627k8152
58548C595006k9388l1578l5434l9437m2157m4073m5662m5800m3540l9599l4768
58537C163570k8868k2330j6747j2527q078k525K815O706R584J1850J2835J2522
58525C128807J2077J1625R881O759L789J160k687p505j0572j0921j0981j2355
$$ y = [3245255, 3255263, 3266260, 3276873, 3287560, 3299632, 3313057, 3326896, 3341101, 3356216, 3372140, 3388911, 3407873, 3430303, 3455623, 3482690, 3511958, 3544473, 3579591, 3615656, 3652242, 3689761, 3727562, 3764489, 3800783, 3837374, 3873821, 3908989, 3943394, 3978761, 4015492, 4052398, 4088540, 4123333, 4155066, 4181270, 4200538, 4212380, 4215611, 4208717, 4191679, 4165742, 4131632, 4089722, 4041829, 3991139, 3940341, 3891133, 3845108, 3803499, 3766230, 3732587, 3702446, 3675470, 3649785, 3623158, 3595006, 3565618, 3534040, 3498606, 3459169, 3417012, 3372939, 3327277, 3281477, 3237937, 3198338, 3163570, 3134702, 3112372, 3095625, 3083098, 3075020, 3072495, 3075310, 3082016, 3091600, 3103450, 3116285, 3128807, 3140884, 3152509, 3162390, 3169149, 3172938, 3174098, 3171411, 3163906, 3153334, 3142413, 3131432, 3119077]
58513C119077j3207j1781r392p734o112l603j180N01K850O668J0235J2122J3336
58500C111780J4646J4545J2078Q957O697M314J155q44j84J613K885M507P078Q329
58486C197556O252K291j500o037j2873k0663k7089l2209l6906m0020m0151l8437
58474B950214l6643l4176k9778k4372j9483j4632r099m323j705K75L801Q157J1072
58461B799308J2131J2224J1144Q316M478K85n230j2594j9946k5298k8960l1752
58449B724106l2972l2251l1213l0943k9989k7106k3680k1108j8308j4227j0291
58438B452018p739n130j151K693M925O849R697J1839J1876J1536J2359J2381R595
58425B531748N830L552J700j528m596n387n344o678q002p114n674o556q653r059
$$ y = [3119077, 3105870, 3094089, 3084697, 3076963, 3070851, 3067248, 3066068, 3066569, 3069419, 3076087, 3086322, 3098444, 3111780, 3126426, 3140971, 3153049, 3162006, 3168703, 3173017, 3174172, 3173328, 3173144, 3174757, 3177642, 3182149, 3189227, 3197556, 3203808, 3206099, 3204599, 3198562, 3185689, 3165026, 3137937, 3105728, 3068822, 3028802, 2988651, 2950214, 2913571, 2879395, 2849617, 2825245, 2805762, 2791130, 2782031, 2777708, 2776003, 2776278, 2780079, 2788236, 2799308, 2811439, 2823663, 2834807, 2843123, 2847601, 2847886, 2842656, 2830062, 2810116, 2784818, 2755858, 2724106, 2691134, 2658883, 2627670, 2596727, 2566738, 2539632, 2515952, 2494844, 2476536, 2462309, 2452018, 2444279, 2439149, 2437998, 2440691, 2445616, 2452465, 2462162, 2474001, 2485877, 2497413, 2509772, 2522153, 2531748, 2537578, 2541130, 2542830, 2541302, 2536706, 2531319, 2525975, 2519297, 2511295, 2504181, 2498507, 2491951, 2483298, 2474239]
58411B474239q553j0057j3194j5110j5472j6163j6967j5957j3424j1400j0002
58400B327940p943n706m621l947k301p71j014j724o74J277J848J563K432L858
58386B310217L811K740K509K726J870P61J230K625L226L654N299P021P037O465
58372B361191P229Q240P417N647M849L985J012k974n520o909q698j0099r773r021
58358B346576r364r233p027m771m566m276j329K183L148L155N304Q212Q819Q461
58344B345292J0279J3048J3667J3364J5260J7947J7794J5662J4965J5069J3036
58333B505383J0060R517J0354R068O698P080R652J0794J0911J3229J6807J7836
58321B637389J6880J7848K0632K1596K0441J9729J8596J3992P275K587m61n534
$$ y = [2474239, 2465686, 2455629, 2442435, 2427325, 2411853, 2395690, 2378723, 2362766, 2349342, 2337942, 2327940, 2319997, 2314291, 2309670, 2305723, 2303422, 2302651, 2301637, 2299913, 2299239, 2300516, 2302364, 2303927, 2306359, 2310217, 2314028, 2316768, 2319277, 2322003, 2323873, 2324634, 2325864, 2328489, 2331715, 2335369, 2340668, 2347689, 2354726, 2361191, 2368420, 2376660, 2384077, 2389724, 2394573, 2398558, 2399570, 2396596, 2391076, 2384167, 2375469, 2365370, 2355597, 2346576, 2337212, 2327979, 2320952, 2316181, 2311615, 2307339, 2306010, 2308193, 2311341, 2314496, 2319800, 2328012, 2336831, 2345292, 2355571, 2368619, 2382286, 2395650, 2410910, 2428857, 2446651, 2462313, 2477278, 2492347, 2505383, 2515443, 2524960, 2535314, 2544382, 2551080, 2558160, 2567812, 2578606, 2589517, 2602746, 2619553, 2637389, 2654269, 2672117, 2692749, 2714345, 2734786, 2754515, 2773111, 2787103, 2794378, 2796965, 2796504, 2790970]
58309B790970j2048j6005j7263j8810j9843j7064j1836q613p112l637J045K961
58297B662745K999N561J0111J2248J2330J4648J8778K0402J9989K2023K6101K7612
58285B855547K6753K7941L0805L0907K9008L0307L4709L7217L7537L9876M3502
58274C224109M3469M0446L9862M1501M0179L6440L5943L8338L7705L4040L3232
58263C645264L5483L5158L2354L2964L6883L8094L6877L9666M6235M9657M9662
58252D078297N3140O0517O4976O6129P0815P9142Q3801Q4590Q9291R8644J05203
58241D934545J08619J16688J29427J38006J41640J49300J62374J72379J78301
58232F231279J88938K05307K18516K27992K43425K65716K85132L01342L25158
$$ y = [2790970, 2778922, 2762917, 2745654, 2726844, 2707001, 2689937, 2678101, 2669488, 2662376, 2658739, 2659784, 2662745, 2665744, 2671305, 2681416, 2693664, 2705994, 2720642, 2739420, 2759822, 2779811, 2801834, 2827935, 2855547, 2882300, 2910241, 2941046, 2971953, 3000961, 3031268, 3065977, 3103194, 3140731, 3180607, 3224109, 3267578, 3308024, 3347886, 3389387, 3429566, 3466006, 3501949, 3540287, 3577992, 3612032, 3645264, 3680747, 3715905, 3748259, 3781223, 3818106, 3856200, 3893077, 3932743, 3978978, 4028635, 4078297, 4131437, 4191954, 4256930, 4323059, 4393874, 4473016, 4556817, 4641407, 4730698, 4829342, 4934545, 5043164, 5159852, 5289279, 5427285, 5568925, 5718225, 5880599, 6052978, 6231279, 6420217, 6625524, 6844040, 7072032, 7315457, 7581173, 7866305, 8167647, 8492805]
58223H492805L57182L85826M10212M42914M86070N28020N67874O19056O83763
58214A2973722P49759Q17591R03791J011721J128402J256472J418349J622463
58206B1882270J859028K137254K491836K945699L505569M201345N082897O163269
58198E0269167P409931Q805824J0373805J2138284J4128526J6428858J9135372
58191A38689767K2208884K5399206K8279886L0251627L0595397K8860796K5380776
58184C29666339K1103322J6512343J0803441K611570q208860j9738045k9112249
58177C23637861l4419445l5531466l3513174k9665462k5061255k0492053j6456413
58170A28498593j3147533j0542547q548869p106965o220653n902106o047851o378903
$$ y = [8492805, 8849987, 9235813, 9646025, 10088939, 10575009, 11103029, 11670903, 12289959, 12973722, 13723481, 14541072, 15444863, 16456584, 17584986, 18841458, 20259807, 21882270, 23741298, 25878552, 28370388, 31316087, 34821656, 39023001, 44105898, 50269167, 57679098, 66484922, 76858727, 88997011, 103125537, 119554395, 138689767, 160898651, 186297857, 214577743, 244829370, 275424767, 304285563, 329666339, 350769661, 367282004, 378085445, 380697015, 372488155, 352750110, 323637861, 289218416, 253686950, 220173776, 190508314, 165447059, 144955006, 128498593, 115351060, 104808513, 96259644, 89152679, 82932026, 77029920, 70982069, 64603166]
58162F4603166o567040o438768o027491n448871m791084m119711l500370k968461
58154B4741370k513605k120661j796281j540648j329678j145107r93031q76557
58146A2425802p78498o86854o10880n56635n10927m63854m24032l97468l73037
58137G623617l42447l14353k95435k76637k50857k26321k10065j95025j75360
58128E337117j58456j50225j43579j32641j23916j22743j22391j17061j12462
58119D153643j13494j13987j08511j02400j00583r7987r0224q2764q0510p8681
58109C184502p2602o6496o4454o2506n7360n3398n3529n2747m7986m4608m5924
58098B562892m6023m0554l4963l4310l4220k9797k4705k3205k1679j6158j0653
$$ y = [64603166, 58036126, 51597358, 45569867, 40120996, 35329912, 31210201, 27709831, 24741370, 22227765, 20107104, 18310823, 16770175, 15440497, 14295390, 13302359, 12425802, 11647304, 10960450, 10349570, 9792935, 9282008, 8818154, 8394122, 7996654, 7623617, 7281170, 6966817, 6671382, 6394745, 6143888, 5917567, 5707502, 5512477, 5337117, 5178661, 5028436, 4884857, 4752216, 4628300, 4505557, 4383166, 4266105, 4153643, 4040149, 3926162, 3817651, 3715251, 3614668, 3516681, 3426457, 3343693, 3263183, 3184502, 3111900, 3045404, 2980950, 2918444, 2861084, 2807686, 2754157, 2701410, 2653424, 2608816, 2562892, 2516869, 2476315, 2441352, 2407042, 2372822, 2343025, 2318320, 2295115, 2273436, 2257278, 2246625]
58087B246625r885j0982r912r278j2300j5720j5950j5943j9044k2236k2136k1504
58075B061735k3337k4595k2289j9781k0633k2023k0556j8843k0035k1516k0204
58064A827923j8626j9600k0350j7962j5352j5723j6376j4130j1653j2218j3263
58053A652670j1413r133r945j1617j0420p986p758q546p584o197o708p346n758
58040A542259l914m217m562k573p45j912l478j915P92R66m9J108L296L256J763
58025A530075J740K755K678K374L710N323N239N148P278R693R530Q304R009J0549
58011A613405J0076Q604R223J1720J3747J5433J8248K1162K2451K3535K6760L1187
57999A825551L4569L7485M1589M5885M8829N1870N6807O1884O4716O6819P1035
$$ y = [2246625, 2236740, 2225758, 2215846, 2206568, 2194268, 2178548, 2162598, 2146655, 2127611, 2105375, 2083239, 2061735, 2038398, 2013803, 1991514, 1971733, 1951100, 1929077, 1908521, 1889678, 1869643, 1848127, 1827923, 1809297, 1789697, 1769347, 1751385, 1736033, 1720310, 1703934, 1689804, 1678151, 1665933, 1652670, 1641257, 1632124, 1622179, 1610562, 1600142, 1592156, 1584398, 1575852, 1568268, 1562071, 1555363, 1548017, 1542259, 1538345, 1534128, 1529566, 1526993, 1526248, 1524336, 1520858, 1518943, 1519735, 1520701, 1520652, 1521760, 1525056, 1528312, 1530075, 1531815, 1534570, 1537248, 1539622, 1543332, 1548655, 1553894, 1559042, 1566320, 1576013, 1585543, 1593847, 1602856, 1613405, 1623481, 1632085, 1641308, 1653028, 1666775, 1682208, 1700456, 1721618, 1744069, 1767604, 1794364, 1825551, 1860120, 1897605, 1939194, 1985079, 2033908, 2085778, 2142585, 2204469, 2269185, 2336004, 2407039]
57988B407039P6609Q1150Q5161R0129R4141R4168R0928Q7089Q2197P3990O3339
57977C325940N3482M5526L8599L3143K9950K7191K2283J5442P800k422j7911l7823
57965C541200n8961p9797r9550j15049j22843j23417j19625j12370j01510q9288
57955B518790p8570o8827n7916m6716l7942l1488k5038j8404j3183q948l782J961
57943B129937O183Q865J1823J5198J7607J9122K0929K2711K3525K4371K6763K9816
57931B356850L1879L3809L7349M1576M4431M6362M8727M9888M6824L9608L0358
57920B807661J8901L517j4871l3424n1513o9890q6350r6718j00133r9376r6070
57909B181734q9538q0369p0978o2150n2792m3355l5947l0675k5471j9993j6269
$$ y = [2407039, 2483648, 2564798, 2649959, 2740088, 2834229, 2928397, 3019325, 3106414, 3188611, 3262601, 3325940, 3379422, 3424948, 3463547, 3496690, 3526640, 3553831, 3576114, 3591556, 3599356, 3596934, 3579023, 3541200, 3482239, 3402442, 3302892, 3187843, 3065000, 2941583, 2821958, 2709588, 2608078, 2518790, 2440220, 2371393, 2313477, 2266761, 2228819, 2197331, 2172293, 2153889, 2140706, 2131758, 2127976, 2129937, 2136120, 2144985, 2156808, 2172006, 2189613, 2208735, 2229664, 2252375, 2275900, 2300271, 2327034, 2356850, 2388729, 2422538, 2459887, 2501463, 2545894, 2592256, 2640983, 2690871, 2737695, 2777303, 2807661, 2826562, 2830079, 2815208, 2781784, 2730271, 2660381, 2574031, 2477313, 2377180, 2277804, 2181734, 2092196, 2011827, 1940849, 1878699, 1825907, 1782552, 1746605, 1715930, 1690459, 1670466, 1654197]
57898A654197j4927j4056j2388j0597q938o565l660j467J92K747O042Q351R339
57885A608270J0286J1324J1179R770Q391P205N223K667P75p24l272o732r613j1830
57871A642919j4463j7165j8630j9326k0789k2539k2789k1986k2250k3507k3644
57860A415831k2582k2657k4479k5910k5745k5164k4829k3679k1524j9852j9195
57849A160215j8278j6540j4941j3682j1760r302p768p311o434m740l390k548j025
57836A042496J159K563L040L937N287N674N173N459O528O485N117M538N507O234
57822A109197N843N801O896P768P723Q110R573J0718J0829J1307J2963J4464J4826
57809A236018J5110J6290J7821J9576K2789K7692L2559L6500M0985M7206N4082
$$ y = [1654197, 1639270, 1625214, 1612826, 1602229, 1593291, 1586726, 1583066, 1581599, 1581791, 1584538, 1590580, 1598931, 1608270, 1618556, 1629880, 1641059, 1650829, 1659220, 1666425, 1671648, 1674315, 1675090, 1674366, 1671094, 1664362, 1654749, 1642919, 1628456, 1611291, 1592661, 1573335, 1552546, 1530007, 1507218, 1485232, 1462982, 1439475, 1415831, 1393249, 1370592, 1346113, 1320203, 1294458, 1269294, 1244465, 1220786, 1199262, 1179410, 1160215, 1141937, 1125397, 1110456, 1096774, 1085014, 1075712, 1067944, 1060633, 1054199, 1049459, 1046069, 1043521, 1042496, 1043655, 1046218, 1049258, 1053195, 1058482, 1064156, 1069329, 1074788, 1081316, 1087801, 1092918, 1097456, 1102963, 1109197, 1115040, 1120841, 1127737, 1135505, 1143228, 1151338, 1160911, 1171629, 1182458, 1193765, 1206728, 1221192, 1236018, 1251128, 1267418, 1285239, 1304815, 1327604, 1355296, 1387855, 1424355, 1465340, 1512546, 1566628]
57798A566628O0229O5728P0496P2843P1167O5489N6273M3491K7682J0099q821
57787B101304k8996m8188o2574p0706p4408p4988p1595o4564n7137n1773m7375
57776A449000m2179l6968l3291l0783k8486k6867k6353k5720k4038k2474k2150
57765A129691k1926k0462j8687j8050j7843j6644j5044j4480j4491j3478j1491
57754I47095j0063r774r833r634r099p948o098m236k751q33K187N357P303Q196
57740H99869R218J0652J1728J1806J0749Q625N901L274P13k530o417r755j1914
57727I41919j3589j5050j5181j3341j0838r241q321o952n001l117j524j10J055
57714H40709K188L882N993P429P870Q392R665J0888J1449J2263J4256J6757J8582
$$ y = [1566628, 1626857, 1692585, 1763081, 1835924, 1907091, 1972580, 2028853, 2072344, 2100026, 2110125, 2101304, 2072308, 2024120, 1961546, 1890840, 1816432, 1741444, 1669849, 1605285, 1548148, 1496375, 1449000, 1406821, 1369853, 1336562, 1305779, 1277293, 1250426, 1224073, 1198353, 1174315, 1151841, 1129691, 1107765, 1087303, 1068616, 1050566, 1032723, 1016079, 1001035, 986555, 972064, 958586, 947095, 937032, 927258, 917425, 907791, 898692, 890744, 884646, 880410, 877659, 876826, 879013, 884370, 891673, 899869, 909087, 919739, 931467, 943273, 954022, 962647, 968548, 971822, 972535, 970005, 963588, 953833, 941919, 928330, 913280, 898099, 884758, 873920, 864679, 856358, 849406, 844405, 841288, 839764, 839654, 840709, 842897, 846779, 852772, 860201, 868071, 876463, 886128, 897016, 908465, 920728, 934984, 951741, 970323]
57701I70323J9588K0194K0448K0537K0949K1164J9633J6054J2206R362O464K260
57689A159182k437o202r252j2460j5313j6740j6994j6944j6333j4380j1364p992
57677A012771l934J568Q293J5549K3350L1673L9371M5149M8800N0248M8402M2523
57665A363763L3670K3013R595q202k9237m9383o4597p3036p4783p1300o5067n8257
57653I36179n1482m4486l7636l1667k6523k1725j7532j4614j2848j1409r843q213
57641F48201o588n168m429m392m258l495k626k259k164k040k268l018l529l301
57627E98666l041l442m011m087m060m390m540m015l487l548l495k614j717j837
57613E50382k426k371j843j605j393o68p1l78p87j05J048J174M29K14O82P56L96
$$ y = [970323, 989911, 1010105, 1030553, 1051090, 1072039, 1093203, 1112836, 1128890, 1141096, 1150458, 1156922, 1159182, 1156745, 1150543, 1141291, 1128831, 1113518, 1096778, 1079784, 1062840, 1046507, 1032127, 1020763, 1012771, 1008837, 1010405, 1018698, 1034247, 1057597, 1089270, 1128641, 1173790, 1222590, 1272838, 1321240, 1363763, 1397433, 1420446, 1430041, 1421839, 1392602, 1343219, 1278622, 1205586, 1130803, 1059503, 994436, 936179, 884697, 840211, 802575, 770908, 744385, 722660, 705128, 690514, 677666, 666257, 656414, 648201, 641613, 636445, 632016, 627624, 623366, 619871, 617245, 614986, 612822, 610782, 608514, 605496, 601967, 598666, 595625, 592183, 588172, 584085, 580025, 575635, 571095, 567080, 563593, 560045, 556550, 553936, 552219, 550382, 547956, 545585, 543742, 542137, 540744, 540076, 540005, 539627, 538840, 538735, 539783, 540957, 541386, 541600, 542282, 543038, 543434]
57596E43434P47J886K426J724Q94J085K060K845K780J804N79K31J044J653O68
57581E65860j358k673k693k221j697p94L31Q70O56L53K42j3l91m32k68n94j495
57564E53683k270k500k417k186j695j065o19m13l95p33j399j802j550j073q17
57549E32749m68K18O56M47L27R72J712J702J479J897K301J430m34j924k744l762
57533E36558n229o491p218p455o857n347m011l799l789k549o13K80O1K58J193
57518D84992J558R70P52J639K703L174L540M179M457M002L423L200L045K916L315
57503E27865M066M016K591O44p77j544k040k549l321m307m796m209l126k465j959
57488E08089p86O54J236J246K134M028N408N589N643O334O926O809O587O757O755
$$ y = [543434, 544181, 546067, 548493, 550217, 551111, 552196, 554256, 557101, 559881, 561685, 562264, 562495, 563539, 565192, 565860, 564502, 561829, 559136, 556915, 555218, 554424, 554755, 555625, 556281, 556634, 556876, 556863, 556472, 556040, 555772, 555178, 553683, 551413, 548913, 546496, 544310, 542615, 541550, 540931, 540518, 540123, 539390, 537991, 536189, 534639, 533566, 532749, 532281, 532499, 533155, 533602, 533929, 534901, 536613, 538315, 539794, 541691, 543992, 545422, 544988, 543064, 540320, 536558, 531329, 524838, 517620, 510165, 503308, 497961, 493950, 490151, 486362, 483813, 483200, 483480, 483541, 483799, 484992, 486550, 487520, 488272, 489911, 492614, 495788, 499328, 503507, 507964, 511966, 515389, 518589, 521634, 524550, 527865, 531931, 535947, 538538, 539182, 538405, 536861, 534821, 532272, 528951, 524644, 519848, 515639, 512513, 510048, 508089, 507303, 507957, 509193, 510439, 512573, 516601, 522009, 527598, 533241, 539575, 546501, 553310, 559897, 566654, 573409]
57473E73409O235N845N957N847N051M356M651N777P144Q430R111Q506O942N705
57459F62966N151L981J103k861o503q998r958r126o989m701k673j46L337P074
57445F31657J0350J3314J6067J7946J8379J7537J5678J2775R125N088o0p532j6639
57432G43685k4491k8873l0107k9435k7164k3435j9251j5397j1460p129l286n44
57420E23113K076N704R836J3410J6746K0903K5834L0655L5175L9637M3276M4514
57408H10879M2535L7697L0515K1075R283m881k0865l6640m8987n5705n7171n5108
57396F72627n0563m3997l6522k9662k4033j9329j5337j2147r615p519o031n252
57384D12620m587l398k013j256j187j125p45m34o22j402k642m015n024n523n931
$$ y = [573409, 579644, 585489, 591446, 597293, 602344, 606700, 611351, 617128, 624272, 632702, 641813, 650319, 657261, 662966, 668117, 672098, 673201, 670340, 663837, 654839, 644881, 635755, 628766, 624065, 621392, 621246, 624583, 631657, 642007, 655321, 671388, 689334, 707713, 725250, 740928, 753703, 762828, 767916, 767856, 760324, 743685, 719194, 690321, 660214, 630779, 603615, 580180, 560929, 545532, 534072, 526943, 523657, 523113, 525189, 530893, 540729, 554139, 570885, 591788, 617622, 648277, 683452, 723089, 766365, 810879, 853414, 891111, 921626, 942701, 951984, 947103, 926238, 889598, 840611, 784906, 727735, 672627, 622064, 578067, 541545, 511883, 487850, 468521, 453184, 441037, 431422, 423903, 417872, 412620, 408033, 404635, 402622, 401366, 400179, 399054, 398309, 397875, 397253, 395851, 393209, 389194, 384170, 378647, 372716]
57369C72716o633p432q005q390q607q366p687p256p554q072q039p462o786n932
57355B66495m453k391k48J719L509M891N495N361M976M767M857N083N011M185
57341C09257K632Q96n56j683k531l022l186l169k912k294j641j480j753j960k059
57326B84539k452l009l108k691k337k127j529o82n08j170j670j499j390j762j756
57311B56849p55L30L68l67r14j096j208j039l02N17P50N22M20O18R82J355J338
57294B58368M77q12j456j338j564k517k943j880k59M94L05j40p66j672k344k492
57278B39461k679l033k497o74Q38N11p79j239r54j307k427l177l231l230l142
57263B12441k299r53j51j37k66l63o93q92l60M85Q08Q64J430K075J690O19L72
$$ y = [372716, 366083, 358651, 350646, 342256, 333649, 325283, 317596, 310340, 302786, 294714, 286675, 279213, 272427, 266495, 262042, 259651, 259403, 261122, 264631, 269522, 275017, 280378, 285354, 290121, 294978, 300061, 305072, 309257, 311889, 312785, 312229, 310546, 308015, 304993, 301807, 298638, 295726, 293432, 291791, 290311, 288558, 286598, 284539, 282087, 279078, 275970, 273279, 270942, 268815, 267286, 266604, 266096, 264926, 263256, 261757, 260367, 258605, 256849, 256094, 256424, 256792, 256425, 255511, 254415, 253207, 252168, 251866, 252383, 253133, 253655, 254075, 254693, 255675, 257030, 258368, 258845, 258033, 256577, 255239, 253675, 251158, 248215, 246335, 246076, 246570, 246875, 246735, 245969, 244297, 241953, 239461, 236782, 233749, 231252, 230578, 231416, 231927, 231148, 229909, 228955, 227648, 225221, 222044, 218813, 215583, 212441, 210142, 209189, 209038, 208901, 208635, 208272, 207579, 206687, 206327, 206812, 207620, 208484, 209914, 211989, 213679, 214298, 214670]
57246B14670J298K176K310K327K647K814K730L059L901M451M452M745N843P067
57232B64490P651P661P412O830N902M925L971K763J269k25j817l976o698r297
57218B90861j1061j1680j1165r990q990q484p847o601n375m836m439l374k096
57205A94923j542j344m13J054J764J432J094J322J624J663J714J756J478J244
57191B07769J664K182J542j45j234p65M28J182J331J322J480K043L036M041M821
57176B30697N914P755R646J0764J1612J3074J4509J4483J3153J2157J2225J2563
57164C68552J2596J2612J2626J2250J1755J1771J2018J1839J1721J2533J3640
57153E03913J3765J3436J4352J6481J8210J9265K0953K3244K4389K3935K3514
$$ y = [214670, 215968, 218144, 220454, 222781, 225428, 228242, 230972, 234031, 237932, 242383, 246835, 251580, 257423, 264490, 272141, 279802, 287214, 294044, 299946, 304871, 308842, 311605, 312874, 312649, 310832, 306856, 300158, 290861, 279800, 268120, 256955, 246965, 237975, 229491, 221644, 215043, 209668, 204832, 200393, 197019, 194923, 193381, 192037, 191624, 192678, 194442, 195874, 196968, 198290, 199914, 201577, 203291, 205047, 206525, 207769, 209433, 211615, 213157, 213012, 211778, 211013, 211441, 212623, 213954, 215276, 216756, 218799, 221835, 225876, 230697, 236611, 244366, 254012, 264776, 276388, 289462, 303971, 318454, 331607, 343764, 355989, 368552, 381148, 393760, 406386, 418636, 430391, 442162, 454180, 466019, 477740, 490273, 503913, 517678, 531114, 545466, 561947, 580157, 599422, 620375, 643619, 668008, 691943, 715457]
57142G15457K3966K4230K3820K3752K4230K4000K3159K3874K7026L0614L3013
57131I97141L5323L8950M3250M7600N3815O4380P9300R5800J09656J16179J12494
57120A793888J00723Q7244P7336P1930P0085P1866P7223Q4543R2552J01905J13472
57109B742767J26956J42594J61999J85957K13835K46557K87509L38945M00548
57100D847667M73413N62108O70106P95778R34754J082836J234416J382313J522668
57091A3506059J656129J780240J883751J951238J968350J919151J787858J576950
57083B8029726J325799J104073R79783R82963J079855J169660J124853Q71983
57075C6668695M51126j5424m26112p70605j101081j452918j806675k113198k331923
$$ y = [715457, 739423, 763653, 787473, 811225, 835455, 859455, 882614, 906488, 933514, 964128, 997141, 1032464, 1071414, 1114664, 1162264, 1216079, 1280459, 1359759, 1455559, 1565215, 1681394, 1793888, 1894611, 1981855, 2059191, 2131121, 2201206, 2273072, 2350295, 2434838, 2527390, 2629295, 2742767, 2869723, 3012317, 3174316, 3360273, 3574108, 3820665, 4108174, 4447119, 4847667, 5321080, 5883188, 6553294, 7349072, 8283826, 9366662, 10601078, 11983391, 13506059, 15162188, 16942428, 18826179, 20777417, 22745767, 24664918, 26452776, 28029726, 29355525, 30459598, 31439381, 32422344, 33502199, 34671859, 35796712, 36668695, 37119821, 37104397, 36678285, 35907680, 34806599, 33353681, 31547006, 29433808, 27101885]
57066B7101885k443739k447457k357605k200619k004485j790621j574789j370038
57058A0912532j184905j021539q78761p55798o51898n64604m90569m27191l72437
57049D564830l24451k82271k45996k15550j90055j68631j50632j35010j20685
57040B731549j07922r8082r1574q7022q2720p7883p2291o5861n9048n2797m7664
57029A888685m3541m0279l7904l6078l4124l1649k8567k4473j8781j1468l022
57018A578799O331J6674K7565L7614M4954M8033M6524M2058L7196L2496K4942
57007A943186J0649j0670l4662n5578o9679p5940p5286o9987o2745n5302m7985
56996A396001m0739l4051k8571k4409k1268j8918j7246j6026j4874j3316j1011
$$ y = [27101885, 24658146, 22210689, 19853084, 17652465, 15647980, 13857359, 12282570, 10912532, 9727627, 8706088, 7827327, 7071529, 6419631, 5855027, 5364458, 4937267, 4564830, 4240379, 3958108, 3712112, 3496562, 3306507, 3137876, 2987244, 2852234, 2731549, 2623627, 2525545, 2433971, 2346949, 2264229, 2186346, 2114055, 2048194, 1989146, 1936349, 1888685, 1845144, 1804865, 1766961, 1730883, 1696759, 1665110, 1636543, 1612070, 1593289, 1581821, 1578799, 1585130, 1601804, 1629369, 1666983, 1711937, 1759970, 1806494, 1848552, 1885748, 1918244, 1943186, 1953835, 1943165, 1908503, 1852925, 1783246, 1707306, 1632020, 1562033, 1499288, 1443986, 1396001, 1355262, 1321211, 1292640, 1268231, 1246963, 1228045, 1210799, 1194773, 1179899, 1166583, 1155572]
56985A155572q201n810m677m645m836m862n379p415j1375j6583k1450k4274k4436
56972A011629k2832k0767j8615j5957j2759r507o218k247K491O949J0145J2426
56960I34738J4858J7623J9695K0055J8682J6243J3181R326M207k369r886j7059
56948A039294k2323k4576k3741k0705j6748j2898r462o072k209K162O489J0378
56936I19589J4237J8871K4347K9586L3288L4939L4737L2907K9507K4620J8199
56925A214827R877m23j1622k1782k9557l4988l8790m1281m2309m1851m0243l7883
56913H83975l5016l1797k8362k4777k1010j7082j3275r975p160m200m98L596P042
56900G01461R353J1098J2833J4116J4035J2381R737O700L651J058o72j604k155
$$ y = [1155572, 1147371, 1141561, 1136884, 1132239, 1127403, 1122541, 1117162, 1109747, 1098372, 1081789, 1060339, 1036065, 1011629, 988797, 968030, 949415, 933458, 920699, 911192, 904974, 902727, 905218, 912167, 922312, 934738, 949596, 967219, 986914, 1006969, 1025651, 1041894, 1055075, 1064401, 1068608, 1066239, 1056353, 1039294, 1016971, 992395, 968654, 947949, 931201, 918303, 908841, 902769, 900560, 902722, 909211, 919589, 933826, 952697, 977044, 1006630, 1039918, 1074857, 1109594, 1142501, 1172008, 1196628, 1214827, 1224704, 1224281, 1212659, 1190877, 1161320, 1126332, 1087542, 1046261, 1003952, 962101, 921858, 883975, 848959, 817162, 788800, 764023, 743013, 725931, 712656, 702681, 695521, 691321, 690823, 694419, 701461, 710814, 721912, 734745, 748861, 762896, 775277, 785014, 791714, 795365, 796423, 795751, 794147, 791992]
56887G91992k661l351m386n519o173o432p446j0098j3690j6791j8856k0083k0095
56874F56411j8149j4584j0745p317l878j36L594P379J1852J6954K1588K5088K7986
56861G16043L0707L2360L1642K8325K3268J7417J1152M188m145j3832k3233k9888
56849H24004l2473l1408k7613k1732j4646p479o06O463J3869K1174K8513L6620
56837G94686M5167N2432N7151N9304N8523N3577M4723L4693K5460J5251R29j7249
56825A224647l5154m8607n5884n6820n1851m2612l1824k1480j1829k468O509J4930
56813H87557K3192L1734M0211M7634N3139N6175N6217N2782M6017L7143K7649
56802A359450J7582N180j0721k7906m1637m8681m9581m6615m0944l2808k3241
$$ y = [791992, 789331, 785980, 781594, 776075, 769902, 763470, 756024, 745926, 732236, 715445, 696589, 676506, 656411, 638262, 623678, 612933, 605616, 601738, 601602, 605196, 612575, 624427, 641381, 662969, 688057, 716043, 746750, 779110, 810752, 839077, 862345, 879762, 890914, 895102, 890957, 877125, 853892, 824004, 791531, 760123, 732510, 710778, 696132, 688653, 688047, 694510, 708379, 729553, 758066, 794686, 839853, 892285, 949436, 1008740, 1067263, 1120840, 1165563, 1200256, 1225716, 1240967, 1241896, 1224647, 1189493, 1140886, 1085002, 1028182, 976331, 933719, 901895, 880415, 868586, 866118, 872627, 887557, 910749, 942483, 982694, 1030328, 1083467, 1139642, 1195859, 1248641, 1294658, 1331801, 1359450, 1377032, 1382212, 1371491, 1343585, 1301948, 1253267, 1203686, 1157071, 1116127, 1083319, 1060078]
56791A060078j3942n756J497Q016J3888J9580K5338L0259L2921L2930L0982K7684
56779A263475K3235J8050J2593O523j023j0101j9502k7659l3397l6102l5968l4127
56767A125997l1885k9880k8386k7904k8629k9675k9863k9138k8297k7547k6369
56756H08424k4720k3176k1826k0051j7725j5540j3907j2429j0868r696r162q642
56744F20682p489o055n181n000m814m097l158k786l340m317m841m559l860l170
56730E58015k405j403m34J37L91O77J077J483J860K087J829J074M82P36J774L032
56714E70412M097M764M978N218O288Q170R643R905R930J1261J3897J6532J8561
56701F93656K0739K3846K7802L2235L6980M1821M6424N0766N5051N9214O2948
$$ y = [1060078, 1046136, 1040380, 1041877, 1049893, 1063781, 1083361, 1108699, 1138958, 1171879, 1204809, 1235791, 1263475, 1286710, 1304760, 1317353, 1323876, 1322853, 1312752, 1293250, 1265591, 1232194, 1196092, 1160124, 1125997, 1094112, 1064232, 1035846, 1007942, 979313, 949638, 919775, 890637, 862340, 834793, 808424, 783704, 760528, 738702, 718651, 700926, 685386, 671479, 659050, 648182, 638486, 629324, 620682, 613193, 607138, 601957, 596957, 592143, 588046, 584888, 582102, 578762, 574445, 569604, 565045, 561185, 558015, 555610, 554207, 553773, 553910, 554301, 554978, 556055, 557538, 559398, 561485, 563314, 564388, 564870, 565606, 567380, 570412, 574509, 579273, 584251, 589469, 595757, 603927, 613570, 623475, 633405, 644666, 658563, 675095, 693656, 714395, 738241, 766043, 798278, 835258, 877079, 923503, 974269, 1029320, 1088534, 1151482]
56690A151482O6129O8571O9581O8428O5185O0387N4060M5890L6391K7054J9202
56679A732360J3216Q861N832L872K891K987M056N579P166Q917J0875J2596J3803
56666A833011J4889J6026J6358J4861J1608P271J940m610j1943j9279k6425l3356
56654A820351l9359m3699m6730m9137n0396m9348m6035m1645l6828l1384k5561
56643A360229k0179j5445j0981p144m939m346m046l053j494L85K724N289P430
56630A304430R125J1007J3099J4632J5308J5530J5135J3174R403M802K32m351
56618A421526q956j2969j5907j7802j8480j7629j5921j4822j4794j4861j4405
56607A254980j4108j4472j4680j3825j2149j0144p341l033K398P846J2681J6856
$$ y = [1151482, 1217611, 1286182, 1355763, 1424191, 1489376, 1549763, 1603823, 1649713, 1686104, 1713158, 1732360, 1745576, 1754437, 1760269, 1764141, 1767032, 1770019, 1774075, 1779654, 1786820, 1795737, 1806612, 1819208, 1833011, 1847900, 1863926, 1880284, 1895145, 1906753, 1914024, 1915964, 1911354, 1899411, 1880132, 1853707, 1820351, 1780992, 1737293, 1690563, 1641426, 1591030, 1541682, 1495647, 1454002, 1417174, 1385790, 1360229, 1340050, 1324605, 1313624, 1306480, 1301541, 1297195, 1293149, 1290096, 1288602, 1288987, 1291711, 1297000, 1304430, 1313555, 1324562, 1337661, 1352293, 1367601, 1383131, 1398266, 1411440, 1420843, 1425645, 1425877, 1421526, 1412570, 1399601, 1383694, 1365892, 1347412, 1329783, 1313862, 1299040, 1284246, 1269385, 1254980, 1240872, 1226400, 1211720, 1197895, 1185746, 1175602, 1168261, 1165228, 1167626, 1175472, 1188153, 1205009]
56595A205009K0260K2669K4132K4945K5289K5029K3633K0584J6312J2338R735
56584A429935P824N363K603Q04P3o84j607j515n7J424J868J791J933K000J537
56569A453292P51k88k028m254n793o156o192o392n968m568l378l409l915l861
56555A397841l806m974p382j0318j3848j8434k3626k8457l2684l6554l9815m2021
56543A135922m3388m4329m4586m3783m2299m0705l8781l6018l2727k9672k6997
56532G12637k4392k1910j9853j8132j6476j4938j3549j1991j0172q650p791p087
56520E37696o021m981m485m176l468k633k349k543k627k553k722l100l249l122
56506D89667l087l247l274k921k307j771j610j759j648q35K39O92L70j77p96j779
$$ y = [1205009, 1225269, 1247938, 1272070, 1297015, 1322304, 1347333, 1370966, 1391550, 1407862, 1420200, 1429935, 1437759, 1443122, 1445725, 1446529, 1446602, 1445918, 1444311, 1442796, 1442739, 1444163, 1446031, 1447822, 1449755, 1451755, 1453292, 1454043, 1453755, 1451727, 1447473, 1441680, 1435524, 1429332, 1422940, 1416972, 1412404, 1409026, 1405617, 1401702, 1397841, 1394035, 1389061, 1381679, 1371361, 1357513, 1339079, 1315453, 1286996, 1254312, 1217758, 1177943, 1135922, 1092534, 1048205, 1003619, 959836, 917537, 876832, 838051, 802033, 769306, 739634, 712637, 688245, 666335, 646482, 628350, 611874, 596936, 583387, 571396, 561224, 552574, 544783, 537696, 531675, 526694, 522209, 518033, 514565, 511932, 509583, 507040, 504413, 501860, 499138, 496038, 492789, 489667, 486580, 483333, 480059, 477138, 474831, 473060, 471450, 469691, 468043, 467208, 467447, 468139, 468509, 468332, 467536, 465757]
56490D65757k668k368q75L60M45K00O16J326J560J549J887K322K296K015K039
56475D76461K295K295J881J155K39m68n14k47n74j419j625q59l70j063k066k197
56459D72924j645j172p67j35M89J062K161L703M342L452K463K869M024M422M142
56444E02334M327N001N157M474L464K286Q55k97n91n31j078k258l415m343n072
56429E10313n209m597m035m160m302l604k573k179k143j567o63l31m67k27M18
56414D74674P30N82M96N76N48N47P99R52P36P29J359J866J451P07N39M64m36j553
56396D85766j492l74L62J53k23k98m52q26j042j037j053r26m12N7k5k68j37p7
56378D77696p25j542j567j002p36p64m49J40M52N92Q93R54M00k6M57J138R25K65
$$ y = [465757, 463089, 460721, 459846, 460206, 460651, 460851, 461467, 462793, 464353, 465902, 467789, 470111, 472407, 474422, 476461, 478756, 481051, 482932, 484087, 484326, 483858, 483344, 483097, 482523, 481104, 479479, 478620, 478250, 477187, 475121, 472924, 471279, 470107, 469340, 469205, 469694, 470756, 472917, 476620, 480962, 484414, 486877, 489746, 493770, 498192, 502334, 506661, 511662, 516819, 521293, 524757, 527043, 527898, 527601, 527010, 526479, 525401, 523143, 519728, 515385, 510313, 505104, 500507, 496472, 492312, 488010, 484406, 481833, 479654, 477511, 475944, 475281, 474950, 474483, 474256, 474674, 475404, 475986, 476482, 477058, 477606, 478153, 478952, 479904, 480640, 481369, 482728, 484594, 486045, 486752, 487291, 487755, 487319, 485766, 484274, 483900, 484262, 484415, 484192, 483894, 483442, 482616, 481574, 480537, 479484, 478558, 478146, 478203, 478178, 477910, 477773, 477696, 476971, 475429, 473862, 472860, 472124, 471360, 470911, 471051, 471503, 472095, 472988, 473942, 474342, 474316, 474773, 475911, 476836, 477101]
56360D77101L48J038J305J142J315J747J889K149L136M058L741K740K492K929
56346E07130L007K978L800M751M211K648K217L231L668K621J680K081K809K540
56332E49372J556O91k9p73j281j527j825j919j266m36p13j964k539j649k98N71
56316E35971J269K113K617K576K615K991L046K422J748J617J914K515L578M773
56302E71765N253M722L741K872K272K069K253K410K334K436K637J771n79k603
56288F03353k359o11L86K89O71K036L204L585L820M055L677K947K871L273L054
56273F34251K410K725M097N097N202N393O031O259N966O255P448Q466Q663Q482
56259G16745Q074P122O204O461P648Q426Q667R375J0358J0279R267R032R996J0615
$$ y = [477101, 477449, 478487, 479792, 480934, 482249, 483996, 485885, 488034, 491170, 495228, 498969, 501709, 504201, 507130, 510137, 513115, 516915, 521666, 525877, 528525, 530742, 533973, 537641, 540262, 541942, 544023, 546832, 549372, 550928, 551619, 551590, 550817, 549536, 548009, 546184, 544265, 542999, 542563, 541850, 539886, 537347, 535698, 535400, 535971, 537240, 539353, 541970, 544546, 547161, 550152, 553198, 555620, 557368, 558985, 560899, 563414, 566992, 571765, 577018, 581740, 585481, 588353, 590625, 592694, 594947, 597357, 599691, 602127, 604764, 606535, 605956, 603353, 600994, 600383, 600769, 601058, 601729, 603765, 606969, 610554, 614374, 618429, 622106, 625053, 627924, 631197, 634251, 636661, 639386, 643483, 648580, 653782, 659175, 665206, 671465, 677431, 683686, 691134, 699600, 708263, 716745, 724819, 731941, 738145, 744606, 752254, 760680, 769347, 778722, 789080, 799359, 808626, 817658, 827654, 838269]
56245H38269J0040R075Q092O321L860K028J059l34k499m249n234o503q141q868
56231H42916q638r042j0264j0388q739p222p063o801n098l106k392k529k434k249
56217G56951k363k217j512j123j597k203k419k736l090k318k09J652K051J603
56203G40470J211Q49O02J056J879J844R80P90J693K344K104K008K464K390J529
56188G64213J281K225K974K566J881J693J531J348K007L176L157J808J167K104
56174G93131K859K126J091J057J448J583K116L334M148M107M276N040N333M977
56160H36626N414O993Q158Q284Q722R933J0497J0199J1069J3881J6536J7613J8601
56147I82526K0886K3409K5151K7169L0284L3362L5801L9171M4498N0438N5869
$$ y = [838269, 848309, 857384, 865476, 871797, 875657, 877685, 878744, 878410, 875911, 871662, 866428, 859925, 851784, 842916, 834278, 825236, 814972, 804584, 795845, 788623, 781560, 774759, 769661, 766555, 764163, 761634, 759200, 756951, 754588, 752371, 750859, 749736, 748139, 745936, 743517, 740781, 737691, 735373, 735164, 736816, 738867, 740470, 741681, 742530, 743132, 744188, 746067, 747911, 748891, 749681, 751374, 753718, 755822, 757830, 760294, 762684, 764213, 765494, 767719, 770693, 773259, 775140, 776833, 778364, 779712, 781719, 784895, 788052, 789860, 791027, 793131, 795990, 798116, 799207, 800264, 801712, 803295, 805411, 808745, 812893, 817000, 821276, 826316, 831649, 836626, 842040, 849033, 857191, 865475, 874197, 884130, 894627, 904826, 915895, 929776, 946312, 963925, 982526, 1003412, 1026821, 1051972, 1079141, 1109425, 1142787, 1178588, 1217759, 1262257, 1312695, 1368564]
56136A368564O1622O7952P2896P5055P5451P4993P2741O8280O3091N7889N1414
56125B109948M3441L6047L0306K4728J8572J3341R244L699m549j3213k0395k7309
56113B223860l4940m1665m6631n1953n8914o5269o8854p0624p1570p0098o5162
56102A578180n8677n2315m5160l6953k9946k5034j9872j3464q635p052n951k949
56090A272172OQ24J252K990L954K290L23N35J310N33l07M75J004l36j092J078
56074A287011L923M482L951M626N532N201N282P238R022R020R484J2102J4242
56061A381116J3733J3121J4861J6728J6551J6787J9512K1660K0510J9106K0654
56050A574339K2403K0949J8980K0351K2933K2891K1884K3383K5775K5768K4897
$$ y = [1368564, 1430186, 1498138, 1571034, 1646089, 1721540, 1796533, 1869274, 1937554, 2000645, 2058534, 2109948, 2153389, 2189436, 2219742, 2244470, 2263042, 2276383, 2285627, 2289326, 2284777, 2271564, 2251169, 2223860, 2188920, 2147255, 2100624, 2048671, 1989757, 1924488, 1855634, 1785010, 1713440, 1643342, 1578180, 1519503, 1467188, 1422028, 1385075, 1355129, 1330095, 1310223, 1296759, 1288124, 1281072, 1275121, 1272172, 1272178, 1273002, 1274254, 1277244, 1281198, 1283488, 1283811, 1284346, 1285656, 1286189, 1285882, 1286357, 1287361, 1287025, 1285933, 1287011, 1290934, 1295416, 1299367, 1303993, 1309525, 1314726, 1320008, 1327246, 1336268, 1345288, 1354772, 1366874, 1381116, 1394849, 1407970, 1422831, 1439559, 1456110, 1472897, 1492409, 1514069, 1534579, 1553685, 1574339, 1596742, 1617691, 1636671, 1657022, 1679955, 1702846, 1724730, 1748113, 1773888, 1799656, 1824553]
56039A824553K6119K7651K6637K5069K5719K6231K3730K1056K1782K3491K2742
56028B094780K2090K5070K9009L0286L1811L7468M3952M6301M6800N0046N4014
56017B511627N4640N4487N7947O2558O4039O5078O9889P5178P6179P6487Q1810
56006C249919Q9086R2243R3586R8686J05181J07857J09693J16360J24953J29878
55996D317442J34542J45077J58003J66635J74037J86668K01257K11653K22336
55987E917650K40739K62551K79640K95983L19980L47864L71437L95319M29052
55978H860215M69109N06998N47778O01416O63689P25929P95453Q84932R90556
55969A5046075J103820J235423J403140J606784J842331K130300K502363K973046
$$ y = [1824553, 1850672, 1878323, 1904960, 1930029, 1955748, 1981979, 2005709, 2026765, 2048547, 2072038, 2094780, 2116870, 2141940, 2170949, 2201235, 2233046, 2270514, 2314466, 2360767, 2407567, 2457613, 2511627, 2566267, 2620754, 2678701, 2741259, 2805298, 2870376, 2940265, 3015443, 3091622, 3168109, 3249919, 3339005, 3431248, 3524834, 3623520, 3728701, 3836558, 3946251, 4062611, 4187564, 4317442, 4451984, 4597061, 4755064, 4921699, 5095736, 5282404, 5483661, 5695314, 5917650, 6158389, 6420940, 6700580, 6996563, 7316543, 7664407, 8035844, 8431163, 8860215, 9329324, 9836322, 10384100, 10985516, 11649205, 12375134, 13170587, 14055519, 15046075, 16149895, 17385318, 18788458, 20395242, 22237573, 24367873, 26870236, 29843282]
55961B9843282L555795M290303N214288O319604P574948Q979641J0560262J2343212
55953H8681335J4382846J6781537J9595194K2703221K5785798K8351281K9730290
55946B46011502K9244722K6709046K2760892J8295419J3324445O686988k661043
55939C60371971j4031154k4941174l2756565l6312111l6102447l3384723k9365790
55932A53478007k4950040k0737908j7026488j3881432j1283271r197874p551090
55925D8849904o236859n178988m342030l683283l144134k690920k319870k018287
55917A9235533j758200j528821j338979j185174j048573r24042q22124p41324
55909I888296o66098n93095n33296m87347m43118l98538l63701l39206l14008
$$ y = [29843282, 33399077, 37689380, 42903668, 49223272, 56798220, 65777861, 76338123, 88681335, 103064181, 119845718, 139440912, 162144133, 187929931, 216281212, 246011502, 275256224, 301965270, 324726162, 343021581, 356346026, 363033014, 360371971, 346340817, 321399643, 288643078, 252330967, 216228520, 182843797, 153478007, 128527967, 107790059, 90763571, 76882139, 65598868, 56400994, 48849904, 42613045, 37434057, 33092027, 29408744, 26264610, 23573690, 21253820, 19235533, 17477333, 15948512, 14609533, 13424359, 12375786, 11451744, 10629620, 9888296, 9222198, 8629103, 8095807, 7608460, 7165342, 6766804, 6403103, 6063897, 5749889]
55900E749889k85755k63045k46667k28030k06824j91660j82401j69749j53038
55891C822720j41149j35022j26053j12780j02948r7746q9623p7146o7194o0785
55881B812274n1115l7244k6025j8708q815M950J6290K3343L0852L8771M0603L4918
55869B860094K7233J8829M692j5966l7600n7987p9636j00517j13929j18967j21206
55858B265040j21965j17032j07017r8436r2931q5367p4484o5534o0396n4679m6919
55847A340280m1405l9481l6870l2056k8802k7991k5306j9523j5155j4264j3206
55836A046221r908p063n807l415M91K321J331J340L712N148M203L414L281Q00
55822A046069m222p883q991j0733j4048j5764j5066j5230j7094j7208j4384j1817
$$ y = [5749889, 5464134, 5201089, 4954422, 4726392, 4519568, 4327908, 4145507, 3975758, 3822720, 3681571, 3546549, 3420496, 3307716, 3204768, 3107022, 3017399, 2940253, 2873059, 2812274, 2761159, 2723915, 2697890, 2679182, 2670367, 2675317, 2691607, 2714950, 2745802, 2784573, 2825176, 2860094, 2887327, 2906156, 2910848, 2894882, 2857282, 2799295, 2719659, 2619142, 2505213, 2386246, 2265040, 2143075, 2026043, 1919026, 1820590, 1727659, 1642292, 1567808, 1502274, 1441878, 1387199, 1340280, 1298875, 1259394, 1222524, 1190468, 1161666, 1133675, 1108369, 1088846, 1073691, 1059427, 1046221, 1036313, 1029250, 1023443, 1020028, 1020519, 1022840, 1024171, 1025511, 1029223, 1034371, 1038574, 1041988, 1045269, 1046069, 1041847, 1033964, 1024973, 1014240, 1000192, 984428, 969362, 954132, 937038, 919830, 905446, 893629]
55810H93629j0873q989n634m007m799m444j676K85J38R60M044O342O347O684Q393
55795H86400Q599O463N674Q103J0484J0373J0182J2311J5207J7324K0383K5641
55783A037144L1163L5567M0552M7392N4809O2335P1651Q2605R2277R9930J08503
55772A763928J19159J28775J34814J38132J38725J33388J20118J00689P6443M5905
55762B900076R224k9028o4162r4841j20237j37828j46756j49697j48918j43916
55752A873917j34945j25098j16377j07264r6464q5650p6276o7172n7536m9038
55742I58097m2778l7377l2021k8120k6088k3855k0410j7411j5620j3383j0274
55731F90760q500q744q561o855n943p043p796o735o141p756r453r074q009q011
$$ y = [893629, 882756, 873767, 868133, 864126, 859327, 854883, 853207, 853492, 853630, 854590, 858634, 864976, 871323, 878007, 886400, 894999, 901462, 907136, 915239, 925723, 936096, 946278, 958589, 973796, 991120, 1011503, 1037144, 1068307, 1103874, 1144426, 1191818, 1246627, 1308962, 1380613, 1463218, 1555495, 1655425, 1763928, 1883087, 2011862, 2146676, 2284808, 2423533, 2556921, 2677039, 2777728, 2854171, 2900076, 2909300, 2880272, 2816110, 2721269, 2601032, 2463204, 2316448, 2166751, 2017833, 1873917, 1738972, 1613874, 1497497, 1390233, 1293769, 1208119, 1131843, 1064671, 1007135, 958097, 915319, 877942, 845921, 817801, 791713, 767858, 747448, 730037, 714417, 701034, 690760, 682260, 673516, 664955, 658100, 652157, 645114, 637318, 630583, 624442, 616686, 607233, 598159, 590150, 582139]
55717E82139p830o018m016l491l408k500j753j949j618MR28r4r59K32J910K024
55701E53601J474J860K382J758P99N24J47p22m88J525L206L097K976M567O471
55686E83177O921O931P935Q941Q720Q454R403J0316R797Q976R219R540Q715P705
55672G04750P455O735M764L509M700O965Q605J0750J4834J9516K3120K6882L2575
55659H75160L9025M4212M8890N5023O2408O9973P8769R0415J04003J17357J29987
55648A715222J42007J51776J57419J59323J58301J52826J40838J22885J00686
55639C001283P4252M3464J1375j7221l9625n5185o2814o1609n3209m0730k5867
55628B774114r217P414K1334L0833L4822L1802K1337N419j3837l6655o3634r2539
$$ y = [582139, 574309, 568291, 564275, 560784, 557376, 554876, 553123, 551174, 549556, 549560, 550488, 550394, 549435, 549667, 551577, 553601, 555075, 556935, 559317, 561075, 561874, 562398, 562545, 561823, 561335, 562860, 566066, 569163, 572139, 576706, 583177, 590098, 597029, 604964, 613905, 622625, 631079, 640482, 650798, 660595, 669571, 678790, 688330, 697045, 704750, 712205, 718940, 723704, 727213, 731913, 738878, 747483, 758233, 773067, 792583, 815703, 842585, 875160, 914185, 958397, 1007287, 1062310, 1124718, 1194691, 1273460, 1363875, 1467878, 1585235, 1715222, 1857229, 2009005, 2166424, 2325747, 2484048, 2636874, 2777712, 2900597, 3001283, 3075535, 3118999, 3130374, 3113153, 3073528, 3018343, 2955529, 2893920, 2840711, 2799981, 2774114, 2764897, 2772311, 2793645, 2824478, 2859300, 2891102, 2912439, 2917858, 2904021, 2867366, 2803732, 2711193]
55616B711193j19354j41448j57621j66423j66956j60641j50034j36715j21890
55607A390111j07621r5343q4347p3658o4035n6352m9699m3218l7975l4756l1811
55596G11296k7400k2785j9952j8109j5412j2567j1514j1693j1004r509q948r241
55584E33162q655p052n989n804n348m411l929l903l438k654k440k572k064r60
55570D73943J5R51K099K682K299K363L947N397M565K332J180J183L04j914l876
55555D97470m761n203n335m691l869l935m316l567j939r83r42p39k49k87o59m54
55539D55541O6K5n7R37K388K747K302K708M069M944N040N553O842Q124R364J1216
55523E21809J3222J4321J5130J7359K0972K4287K6961L0585L5967M2104M8251
$$ y = [2711193, 2591839, 2450391, 2292770, 2126347, 1959391, 1798750, 1648716, 1512001, 1390111, 1282490, 1187147, 1102800, 1029142, 965107, 908755, 859056, 815838, 777863, 743107, 711296, 683896, 661111, 641159, 623050, 607638, 595071, 583557, 571864, 560860, 551351, 542403, 533162, 524507, 517455, 511466, 505662, 500314, 495903, 491974, 488071, 484633, 481979, 479539, 476967, 474903, 473943, 473958, 474909, 477008, 479690, 481989, 484352, 488299, 493696, 498261, 500593, 501773, 502956, 503260, 501346, 497470, 492709, 487506, 482171, 477480, 473611, 469676, 465360, 461793, 459854, 458871, 457929, 457190, 456941, 456654, 455995, 455541, 455607, 455632, 455575, 456512, 458900, 461647, 463949, 466657, 470726, 475670, 480710, 486263, 493105, 501229, 510593, 521809, 535031, 549352, 564482, 581841, 602813, 627100, 654061, 684646, 720613, 762717, 810968]
55512H10968N5007O2791P1027P9260Q7632R5918J03470J10114J15796J19494J19776
55501A831253J16052J07995R4506P5004N1037K4758l518l4131o5243r3422j16600
55490A987691j34137j44631j46433j40475j30172j18249j05573r2869q1217p0710
55480H23225o0740n1805m5011l9834l4496k8647k3688k0361j7976j6069j4871
55469D69727j4027j2771j1285j0198r016p015n255n367o657o816n307l677k671
55456C69665j683j029j952l987n017m489m081m616m883m182l640m039m457m003
55442C17607l066k218j553j561k739m003l546j612m15q59j544j443j283j568j478
55427B88719o05J31J22j15k09l56j32J051K194J677K12K25J839K383P50o89N9
$$ y = [810968, 865975, 928766, 999793, 1079053, 1166685, 1262603, 1366073, 1476187, 1591983, 1711477, 1831253, 1947305, 2055300, 2149806, 2224810, 2275847, 2300605, 2297087, 2262956, 2197713, 2104291, 1987691, 1853554, 1708923, 1562490, 1422015, 1291843, 1173594, 1068021, 975152, 893935, 823225, 762485, 710680, 665669, 625835, 591339, 562692, 539004, 518643, 500667, 484598, 469727, 455700, 442929, 431644, 421446, 412430, 405415, 400160, 394793, 388136, 381320, 376013, 372336, 369665, 367982, 366953, 365001, 361014, 355997, 351508, 347427, 342811, 337928, 333746, 330106, 326067, 321610, 317607, 314541, 312323, 310770, 309209, 306470, 302467, 298921, 297309, 296894, 296035, 294491, 293048, 291765, 290197, 288719, 288114, 288245, 288367, 288252, 288043, 287687, 287555, 288606, 290800, 292477, 292689, 292914, 294753, 297136, 297886, 297197, 297256]
55410B97256J594J745Q28K99J17m91j122j015o10p12j041j013j050j810k959l686
55394B86330l703l038j730l26L84N63J113J935J868O77m87j016j518k065j710
55379B77277m70J33o06j462j444j183j226q60J95P41R1n82k72R8n07j274r78j13
55361B67558R8k42j93L14O84Q97J243J515J455J389J509J287L58q07j655k134
55345B73276k024q48R10J795J247L34Pm1j18K83J127J216n0j524k036j947j966
55328B69641j712o82N29J142J315J371R62No66n62l91p40j085r22p19p75m81L14
55310B66544O22Km47M6N43J43l10K19J022Q89J64n7J52Kl59k08L52O36M91P6p09
55289B69813j588j591m49O48P66O11J017J256L89p59o88M38J198J075O71K16n72
$$ y = [297256, 298850, 300595, 301423, 301722, 301839, 301348, 300226, 299211, 298601, 297889, 296848, 295835, 294785, 292975, 290016, 286330, 282627, 279589, 277859, 277533, 277917, 278480, 279593, 281528, 283396, 284073, 283586, 282570, 281052, 278987, 277277, 276807, 276940, 276334, 274872, 273428, 272245, 271019, 270159, 270354, 271095, 271186, 270604, 270332, 270430, 269923, 268649, 267671, 267558, 267656, 267414, 267221, 267535, 268219, 269116, 270359, 271874, 273329, 274718, 276227, 277514, 277872, 277065, 275410, 273276, 271252, 270404, 271314, 273109, 274356, 274690, 274697, 274656, 274538, 274821, 275948, 277164, 277114, 275590, 273554, 271607, 269641, 267929, 267247, 267776, 268918, 270233, 271604, 272566, 272571, 271905, 271343, 270952, 270212, 269127, 268205, 267486, 266711, 266230, 266544, 267166, 267168, 266721, 266767, 267310, 267453, 267143, 267362, 268384, 269273, 269437, 269380, 269532, 269534, 269175, 268967, 269319, 269955, 270446, 270522, 269813, 268225, 266634, 266185, 266833, 267599, 268210, 269227, 270483, 270872, 270113, 269425, 269863, 271061, 272136, 272807, 273023, 272451]
55272B72451j423j611j056l01K90N12Qj024j499p57L99R01R38J252J617J317N27
55255B72541O3J40L10K79n3q50j816k106j461o96l70M3Q32J117L20o01o36l24
55237B66732n31p29j60L55l93j726j871o64L24K30k15k18J04M21O56O92M67L67
55219B63841P19J147J102O51R1n95j192j008k4N74J02m21P1Q69P49J04Q3M18L
55200B67284q73q58J21P22L86oK13P06J125J505J521O83n68j124p20r1L68Q72
55182B71266J233Q71k6n41m05k70m67n52k66L8J50K89N08O16P19J071J424J293
55164B76951Q58P00P90O03K34L59J057J568J400Q53L94R8j69n57j176j770j753
55147B80440j093p06j230j988j946j204n60j59K86L86m08j410j263J55J552J998
$$ y = [272451, 271028, 269417, 268361, 268060, 268350, 268862, 268870, 267846, 266347, 265590, 265989, 266890, 267828, 269080, 270697, 272014, 272541, 272604, 272744, 273054, 273333, 273280, 272430, 270614, 268508, 267047, 266351, 265981, 266024, 266856, 267973, 268293, 267692, 267056, 266732, 266201, 265472, 265312, 265667, 265274, 263548, 261677, 261013, 261337, 261567, 261352, 261134, 261238, 261659, 262315, 263007, 263474, 263841, 264560, 265707, 266809, 267460, 267551, 266956, 265764, 264756, 264732, 265306, 265408, 264987, 265058, 265927, 266676, 266780, 266863, 267281, 267284, 266411, 265553, 265674, 266396, 266782, 266776, 266989, 267695, 268820, 270325, 271846, 272529, 271961, 270837, 270117, 270026, 270394, 271266, 272499, 273370, 273344, 272803, 272398, 272128, 271661, 271109, 270843, 270881, 271031, 271320, 271828, 272444, 273163, 274234, 275658, 276951, 277809, 278509, 279299, 279902, 280136, 280495, 281552, 283120, 284520, 285373, 285767, 285865, 285696, 285139, 283963, 282193, 280440, 279347, 278641, 277411, 275423, 273477, 272273, 271713, 271554, 271840, 272226, 271818, 270408, 269145, 269300, 270852, 272850]
55131B72850J701R91j63j368j754j159m42l07n54p13o50l48K13P14P29L83J92
55114B70315K22Q9k07k20J28L70K50N5N5K26N08Q59J029Q58O83Q57J014N08m96
55095B77103j064p14L8M52L73J54J53L50L95J01o1N22J510J762R33P1Q0M60L73
55076B82991R9L80R49Q82O8q05j348j665j673j193n00K4M49Q11O24k41q26k55
55058B78771Q43J254R53P68P68L81j44N1Q06R33J05o04l44L55N10m1p07r03m68
55039B83287K52O77N84L35L07M61P74J431K192K288J538P33L28k61j287j734r64
55022B90941n4k28q31n40L43N38Qk57j94m78q36l87N02O36M5j28J84j09j183j927
55002B86045j918j954k291k081r98Q8M75L59n0p25r95o1J465K053J568J416K066
$$ y = [272850, 274551, 275542, 275379, 274011, 272257, 271098, 270656, 270349, 269795, 269082, 268432, 268084, 268297, 269011, 269740, 270123, 270315, 270537, 270626, 270419, 270199, 270327, 270697, 270947, 271002, 271057, 271283, 271791, 272650, 273679, 274537, 275220, 276077, 277091, 277599, 277103, 276039, 275325, 275363, 275815, 276188, 276342, 276495, 276845, 277240, 277341, 277280, 277802, 279312, 281074, 282007, 282078, 282158, 282618, 282991, 283090, 283470, 284419, 285301, 285369, 284564, 283216, 281551, 279878, 278685, 278185, 278209, 278658, 279469, 280093, 279852, 279026, 278771, 279614, 280868, 281821, 282589, 283357, 283738, 283594, 283645, 284451, 285384, 285489, 284885, 284541, 284896, 285406, 285365, 284658, 283755, 283287, 283539, 284216, 284800, 285135, 285442, 285903, 286677, 288108, 290300, 292588, 294126, 294859, 295187, 294926, 293639, 291905, 290941, 290887, 290659, 289828, 289288, 289631, 290169, 290177, 289920, 289726, 289248, 288412, 288025, 288527, 289163, 289208, 289080, 289264, 289155, 287972, 286045, 284127, 282173, 279882, 277801, 276803, 276891, 277366, 277725, 277675, 276950, 275955, 275894, 277359, 279412, 280980, 282396, 284462]
54985B84462K247J204K4j25L68O24O93R65J194R60L59l78j160j561r68L93J488
54968B90789J819J830J818J480R01P93J410K095K292K112J778J368J279J863K663
54953C16290K960K943L256L683L664L772M956O519O809N870N348N617N220L632
54939C80539K261J872J216p06k946m381n338o320o772o371n984o061n611m039
54925C31359k478k006j961j414q60j043j391j128p12o99l74Q25J799J405N57R41
54909C22820K402L459L722M025M620M994N213N855O701O819N946M686L527K575
54895C87364J902J247j60k502m636n531n816o658p694p539n985m292l396l153
54881C33151l244l569l718l175k247j741j727j512r14n68p90j059q41l09M6k4
$$ y = [284462, 286709, 287913, 287937, 287812, 288180, 288804, 289497, 290462, 291656, 292616, 292975, 292597, 291437, 289876, 288908, 289301, 290789, 292608, 294438, 296256, 297736, 298637, 299430, 300840, 302935, 305227, 307339, 309117, 310485, 311764, 313627, 316290, 319250, 322193, 325449, 329132, 332796, 336568, 341524, 348043, 354852, 360722, 366070, 371687, 376907, 380539, 382800, 384672, 385888, 385182, 382236, 377855, 372517, 366197, 359425, 353054, 347070, 341009, 335398, 331359, 328881, 326875, 324914, 323500, 322640, 321597, 320206, 319078, 318366, 317667, 317293, 318118, 319917, 321322, 321879, 322820, 325222, 328681, 332403, 336428, 341048, 346042, 351255, 357110, 363811, 370630, 376576, 381262, 384789, 387364, 389266, 390513, 390353, 387851, 383215, 377684, 371868, 365210, 357516, 349977, 343992, 339700, 336304, 333151, 329907, 326338, 322620, 319445, 317198, 315457, 313730, 312218, 311304, 310736, 309946, 308887, 308046, 307737, 307783, 307759]
54865C07759m91j130j550j461r36j98O45J413J703J315N89j1l43m53m13n03r87
54848C04948j507j315m58N4l45r96j142r70q77o31m5K88m3l10L64J563K140J784
54830C02502J101N82L50O01J335J927J764J060L84j30m00P2J312K097J292l72
54814C15477j072l07P00R41P63Q18R76Q26N03M79Q93J496K036K484K948L402L547
54797C36910L170K653K756L641M579M822M450M039L986M387N066N438M826L291
54783C94014J647L69r06k516m085n100n572n715n617n542n766n811m809l006j796
54768C39789j691j508l25R72J198P39O49Q82Q16P47J327K165K395K186K285K534
54752C55160K336K230L310N203O271N935N337N373N422M573L008J538M83m99j877
$$ y = [307759, 307268, 306138, 304588, 303127, 302191, 301993, 302638, 304051, 305754, 307069, 307658, 307647, 307304, 306851, 306438, 305935, 304948, 303441, 302126, 301668, 301722, 301377, 300381, 299239, 298269, 297392, 296761, 296716, 297004, 296961, 296651, 297015, 298578, 300718, 302502, 303603, 304185, 304535, 305136, 306471, 308398, 310162, 311222, 311606, 311476, 311076, 311148, 312460, 314557, 315849, 315477, 314405, 314098, 314798, 315739, 316502, 317320, 318296, 319122, 319625, 320104, 320997, 322493, 324529, 327013, 329961, 333363, 336910, 340080, 342733, 345489, 349130, 353709, 358531, 362981, 367020, 371006, 375393, 380459, 385897, 390723, 394014, 395661, 396030, 395124, 392608, 388523, 383423, 377851, 372136, 366519, 360977, 355211, 349400, 344591, 341585, 339789, 338098, 336590, 336265, 337237, 338435, 339174, 339823, 340705, 341521, 342268, 343595, 345760, 348155, 350341, 352626, 355160, 357496, 359726, 363036, 368239, 374510, 380445, 385782, 391155, 396577, 401150, 404158, 405696, 406179, 405680, 403803]
54737D03803l799n810p050p117o586o147n652m677l679l530m117m329l573k414
54723C35323j623j325j270j289j268j153j098j247j456j556j665j817j620q52
54709C16084p0k3o76j347j544j153j83R98J593J220N57M49Q03R74Q50O93L63m08
54691C19180j170j149l53M92Q79P75J73o97j076m28O44J031N51qq0K62Q00J351
54673C21177J530J073K58n45j366k129k171j105K56P98N52L98O83J058J326J497
54657C23290J310O43N1J4J25j17k13M50J187Q50k57p73l67k3k76n76m68j19M53
54638C25184J405K178J847N93l01j54M76R30J154J106N72j35l49j45k20n99n14
54621C33028K59J035J410J695J901J491M69k42n7N51R26R69Q06M63K26M83R14
$$ y = [403803, 400004, 394194, 387144, 380027, 373441, 367294, 361642, 356965, 353286, 349756, 345639, 341310, 337737, 335323, 333700, 332375, 331105, 329816, 328548, 327395, 326297, 325050, 323594, 322038, 320373, 318556, 316936, 316084, 316014, 315991, 315315, 313968, 312424, 311271, 311088, 312086, 313679, 314899, 315456, 315905, 316708, 317682, 318532, 319225, 319588, 319180, 318010, 316861, 316508, 317000, 317879, 318654, 318827, 318130, 317054, 316626, 317270, 318301, 318852, 318844, 318764, 319026, 319826, 321177, 322707, 323780, 324038, 323493, 322127, 319998, 317827, 316722, 316978, 317776, 318328, 318726, 319409, 320467, 321793, 323290, 324600, 325243, 325294, 325308, 325433, 325316, 325103, 325553, 326740, 327590, 327333, 326560, 326193, 326170, 325894, 325318, 324850, 324731, 325184, 326589, 328767, 330614, 331207, 330906, 330752, 331228, 332158, 333312, 334418, 334990, 334855, 334506, 334361, 334141, 333542, 333028, 333287, 334322, 335732, 337427, 339328, 340819, 341288, 341046, 340989, 341540, 342466, 343435, 344241, 344704, 344930, 345413, 346327]
54604C46327O80l96j534k058j978j456o29jj22o65p56k33K52M45O69P99K49p97
54586C38796j328j006n65m29p5Q17J658J855J503P82k80j187j098q4P31O56J59
54569C40905j32j97n2M25P70K42p76q44N12K013K411J952J462J114Q45R00J160
54552C52710R05K4m84R1J083J569J580J495J120K79m80o79p25j119j516j331p13
54535C53809k16n3k12o55q81j93J091J622Q52j54m36n22j053j305m21P64P76k49
54517C52564q78o33l67n02l60M41J261J517J569J940K337K100J223M52L80P75
54501C63819R31N77K50N75J443K170K399K297K058J725J561J858K401K676K752
54486C89492L159L901M368M378M419M661M692M497M671N251N363M520L337K393
$$ y = [346327, 347007, 346611, 345077, 343019, 341041, 339585, 338956, 338955, 338833, 338168, 337412, 337179, 337431, 337876, 338545, 339344, 339593, 338796, 337468, 336462, 335897, 335468, 335393, 336210, 337868, 339723, 341226, 342008, 341728, 340541, 339443, 339359, 340090, 340746, 340905, 340773, 340576, 340524, 340949, 341719, 341961, 341185, 340341, 340853, 342866, 345277, 347229, 348691, 349805, 350650, 351550, 352710, 353615, 353639, 353155, 353246, 354329, 355898, 357478, 358973, 360093, 360372, 359892, 359213, 358488, 357369, 355853, 354522, 353809, 353593, 353540, 353328, 352673, 351792, 351599, 352690, 354312, 355164, 355010, 354574, 354052, 352999, 351694, 351273, 352037, 352813, 352564, 351686, 351053, 350686, 350184, 349824, 350265, 351526, 353043, 354612, 356552, 358889, 360989, 362212, 362664, 363044, 363819, 364750, 365327, 365577, 366152, 367595, 369765, 372164, 374461, 376519, 378244, 379805, 381663, 384064, 386740, 389492, 392651, 396552, 400920, 405298, 409717, 414378, 419070, 423567, 428238, 433489, 438852, 443372, 446709, 449102]
54472D49102J406J03r94j471j801k479l192l578l936m465m588l917l113k908l018
54457D11151k904k780k939k842j978j031j039j860k504k633k605k458j922j200
54443C80456q18p75o92n70o22n92j08M82M24l57j172j425j096n45k46m58p38l30
54425C70818O27R98K84n05l87Q8r8o64o32n0K65L28Q64J699J679M31j015j623
54407C73107j433r66m43J08O04J020J335J283O83q3m24l04j06O8L96P37P65N64
54389C76911N26O96P72O65N70O20R73J894L235M135L921L003K230J781J373J213
54373D04518J756K772L556L967M389M829M909M638M242L355J382j243l194l848
54359D36028l904m199m759n241n482n300m402l021k026j952k308k156j156J97
$$ y = [449102, 450508, 450611, 449617, 448146, 446345, 443866, 440674, 437096, 433160, 428695, 424107, 420190, 417077, 414169, 411151, 408247, 405467, 402528, 399686, 397708, 396677, 395638, 393778, 391274, 388641, 386036, 383578, 381656, 380456, 379638, 378863, 378171, 377601, 376979, 376387, 376279, 376761, 377185, 376828, 375656, 374231, 373135, 372590, 372344, 371886, 371148, 370818, 371445, 372443, 372727, 372222, 371835, 371923, 371825, 371161, 370529, 370479, 370744, 371072, 371936, 373635, 375314, 375745, 374730, 373107, 371674, 370708, 370265, 370373, 370977, 371997, 373332, 374615, 375298, 375215, 374791, 374487, 374381, 374449, 374845, 375582, 376347, 376911, 377437, 378133, 378905, 379570, 380140, 380760, 381733, 383627, 386862, 390997, 394918, 397921, 400151, 401932, 403305, 404518, 406274, 409046, 412602, 416569, 420958, 425787, 430696, 435334, 439576, 442931, 444313, 443070, 439876, 436028, 432124, 427925, 423166, 417925, 412443, 407143, 402741, 399720, 397694, 395742, 393434, 391278, 390122, 390319]
54345C90319J168J390J050N49K0o91j492j890j663j282j264j484j597j752k240
54330C79141k757k698k023j224n85q1J89P5k31m01m53n24m41p5J69p2l41K2P73
54311C68463J032N65m4l97o19p48n66j63Q8J74M22Q28J025R80J036J211J099N59
54293C74945p4n21p41o65k82j0l36j039j410j187q06p21j027j634k244k289j427
54276C58532j39P68J084J027N91l10j149j206n30K28P85J243J334P12r7r7O80
54259C63456J120O26j36l70p5M03R02J179Q94J93l51o11r50j235p60N20J527J396
54241C67728M84l44p94r56p36m0Q48J544J846J523M30r32j541j054k58k0k47m12
54223C67069m86p40j028r29m57o4%J7L90J122J709J586P83rk37j58k81l76K24
$$ y = [390319, 391487, 392877, 393927, 394476, 394496, 393805, 392313, 390423, 388760, 387478, 386214, 384730, 383133, 381381, 379141, 376384, 373686, 371663, 370439, 369854, 369773, 369962, 370037, 369806, 369405, 368952, 368428, 367987, 367912, 368081, 368009, 367668, 367690, 368463, 369495, 370060, 370016, 369619, 369000, 368252, 367686, 367523, 367611, 367785, 368207, 369035, 370060, 371040, 372076, 373287, 374386, 374945, 374871, 374350, 373609, 372944, 372662, 372652, 372316, 371277, 369867, 368680, 367874, 367153, 366126, 364492, 362248, 359959, 358532, 358393, 359161, 360245, 361272, 361863, 361553, 360404, 359198, 358668, 358896, 359681, 360924, 362258, 362970, 362873, 362776, 363456, 364576, 365202, 365066, 364696, 364621, 365024, 365926, 367105, 367999, 368192, 367841, 367230, 366280, 365045, 364285, 364805, 366332, 367728, 368212, 367868, 367074, 366118, 365382, 365342, 366190, 367734, 369580, 371103, 371533, 370601, 369060, 368006, 367748, 367728, 367481, 367069, 366583, 365843, 364815, 363886, 363429, 363365, 363365, 363382, 363772, 364894, 366603, 368189, 368972, 368963, 368726, 368568, 368287, 367911, 368135]
54204C68135J441K311K260J802J678J885K030K127K529L314M189M873N297N487
54190D09358N440N093M360L232J815J92j549l011l583l157k509k577l519m771
54176D04814n690n763m744l158k201k438k968k644j689j147j168r92m53k26n34
54161C68999p61n64l43l76m38m83p20q68l24O35R04J72n14k77M99J084J477J912
54143C70014K057J503M94k93l88K58J175J429N42n63m28R23J914J626Q62N68M12
54126C82105k66j115j354r11k07N58J163J171O36L88Q53J338J143N77J92j30m23
54109C85718O0J648L122L067J858J024J032J114R89J338K378L235L170K495J948
54094D14196J817J989K259K325K017J708K116L480N271O855Q097R238J0411J1412
$$ y = [368135, 369576, 371887, 374147, 375949, 377627, 379512, 381542, 383669, 386198, 389512, 393701, 398574, 403871, 409358, 414798, 419891, 424251, 427483, 429298, 429490, 427941, 424930, 421347, 418190, 415681, 413104, 409585, 404814, 399124, 393361, 388617, 385459, 383258, 380820, 377852, 375208, 373519, 372372, 371204, 370212, 369759, 369533, 368999, 368238, 367674, 367331, 366955, 366517, 366034, 365314, 364446, 364122, 364757, 365661, 365833, 365319, 365042, 365541, 366625, 368102, 370014, 372071, 373574, 374068, 373775, 373387, 373645, 374820, 376249, 376791, 376228, 375800, 376723, 378637, 380263, 381125, 381693, 382105, 381839, 380724, 379370, 378459, 378252, 378810, 379973, 381144, 381780, 382168, 383021, 384359, 385502, 386079, 386271, 386141, 385718, 385778, 387426, 390548, 393615, 395473, 396497, 397529, 398643, 399632, 400970, 403348, 406583, 409753, 412248, 414196, 416013, 418002, 420261, 422586, 424603, 426311, 428427, 431907, 437178, 444033, 452130, 461368, 471779, 483191]
54080D83191J1838J1528J0912J0733J1291J2162J2797J2996J2696J1694J0008
54069F11846Q085O294M428K011j258n499j0592j5722j9537k1291k1446k0759j9277
54056D97283j6810j3853j1268r348p820o572n695n035m343l705l326l011k442
54043D04055j781j477j537j489j021j92Q18J727K153K040J919K238K699K725K415
54028D15292K388K831L252L208K768K237J814J531J249Q43N33P30J283J344M90
54013D41793m33l28O27J187O74l96j244j635j664j428j186j233j451j276m74M88
53997D32021R85R65R28J312K021K492K276J562R79Q27P38K78n07j311k017k548
53981D41001k673k436k413l032l806l890l203k436k044j870j782j962k351k378
$$ y = [483191, 495029, 506557, 517469, 528202, 539493, 551655, 564452, 577448, 590144, 601838, 611846, 619931, 626225, 630653, 632664, 631406, 625907, 615315, 599593, 580056, 558765, 537319, 516560, 497283, 480473, 466620, 455352, 446004, 438184, 431612, 425917, 420882, 416539, 412834, 409508, 406497, 404055, 402274, 400797, 399260, 397771, 396750, 396558, 397376, 399103, 401256, 403296, 405215, 407453, 410152, 412877, 415292, 417680, 420511, 423763, 426971, 429739, 431976, 433790, 435321, 436570, 437413, 437946, 438676, 439959, 441303, 441793, 441360, 441032, 441659, 442846, 443520, 443124, 441880, 440245, 438581, 437153, 435967, 434734, 433283, 432007, 431533, 432021, 433006, 433971, 434899, 436211, 438232, 440724, 443000, 444562, 445541, 446368, 447106, 447384, 446877, 445566, 443549, 441001, 438328, 435892, 433479, 430447, 426641, 422751, 419548, 417112, 415068, 413198, 411416, 409454, 407103, 404725]
53967D04725j661o34j37m46j021j096m95K57N38L18J47M83J216J922K365K570
53951D09051K666K717K679K414J973J722J935K278K167J612J180J031O48j76q17
53936D33080o95j66K0k79o66r05j015r63p25m65k15K66J024J638J910K335L405
53919D37584M748N599N781N745N842O175O899Q132R650J1120J2361J3106J2929
53906E45671J1862J0690R989R224P508M860J963r87m281p668j0216j1395j1626
53893E55594j1605j1523j1128j0133q570o916n724m977m149l197k897l649m538
53880D66588m399l411k725k843l261l457l290k507r91M86P19m28j824k531k658
53865D33468k605k343j881j645j877k169k045j621j301j145r33o16l82l96o21
$$ y = [404725, 403064, 402430, 402293, 401847, 400826, 399730, 399235, 399492, 400030, 400348, 400495, 400978, 402194, 404116, 406481, 409051, 411717, 414434, 417113, 419527, 421500, 423222, 425157, 427435, 429602, 431214, 432394, 433425, 434073, 433897, 433080, 432385, 432219, 432239, 431960, 431294, 430389, 429374, 428411, 427686, 427221, 427006, 427272, 428296, 429934, 431844, 434179, 437584, 442332, 447931, 453712, 459457, 465299, 471474, 478373, 486505, 496155, 507275, 519636, 532742, 545671, 557533, 568223, 578212, 587436, 594944, 599804, 601767, 600780, 596499, 588831, 578615, 567220, 555594, 543989, 532466, 521338, 511205, 502635, 495719, 489995, 485018, 480869, 477672, 474775, 471126, 466588, 462189, 458778, 456053, 453210, 449949, 446492, 443202, 440695, 439704, 440190, 440909, 440481, 438657, 436126, 433468, 430863, 428520, 426639, 424994, 423117, 420948, 418903, 417282, 415981, 414836, 413903, 413287, 412905, 412509, 411888]
53850D11888p88o56k91m8o5m5K11L89K26Q1M04Q99R03M19O1J00J98J05o8k11l29
53829D13383k42K32Q46J230J432J568J276K76o95n53N58J383J336J101J265J471
53813D25867J399J525K179K710K379J630J589K579L751M150L638K738J902J042
53799D59078j22j345j816j155j29K07j60l52N0N77P83P97Q28Q88J125J738K413
53782D63405K549K188J960J996J758J130P39Q41Q02K01m80q46j375k452l410l461
53766D65545k981k923l340l463l001k493k396k561k669k562k117j347o62n79j078
53751D31373j572j560j049l62J17O0o23j562k060j607l31J048J749J650J404J630
53735D28305K061J836O54p77j558j506j018m51Q4N79J026J422J674J696J658J889
$$ y = [411888, 411100, 410444, 410153, 410105, 410040, 409995, 410206, 410595, 410821, 410902, 411306, 412205, 413108, 413527, 413588, 413688, 413886, 413991, 413923, 413712, 413383, 413141, 413373, 414219, 415449, 416881, 418449, 419725, 420001, 419306, 418753, 419311, 420694, 422030, 423131, 424396, 425867, 427266, 428791, 430970, 433680, 436059, 437689, 439278, 441857, 445608, 449758, 453396, 456134, 458036, 459078, 458956, 457611, 455795, 454640, 454511, 454718, 454558, 454206, 454256, 454833, 455616, 456413, 457241, 458129, 459254, 460992, 463405, 465954, 468142, 470102, 472098, 473856, 474986, 475725, 476566, 477368, 477569, 477089, 476243, 474868, 472416, 469006, 465545, 462564, 459641, 456301, 452838, 449837, 447344, 444948, 442387, 439718, 437156, 435039, 433692, 433030, 432451, 431373, 429801, 428241, 427192, 426830, 426947, 427007, 426384, 424822, 422762, 421155, 420824, 421872, 423621, 425271, 426675, 428305, 430366, 432202, 432856, 432079, 430521, 429015, 427997, 427546, 427630, 428209, 429235, 430657, 432331, 434027, 435685, 437574]
53719D37574K487L181L668L861L829L753L889M248M368L794K719J738R88J30q98
53704D79329j700k134k477k784k692k215j955k176k308j766p82Q1O84J119J231
53689D59455R37O30O64P26K85n00q99m75N28J647K524K822K275J084J6j38P10
53672D72291J788K165J633P71J50k33n05m24J57P08N43k19q59j085j111r09k83
53655D74578M01N18L10O13J352J438N81m5M15J120Q14m01j461j840j720j324r45
53638D74404j117j891k381j902j038p19p76m25K38M08L3j42N8l6n94p70N8J323
53620D64731K056K028J657J279R65Q16R44J285J653J929K116K229K238K107J944
53605D89977K030K505L031L083K688K491K899L532L782L605L386L344L387L283
$$ y = [437574, 440061, 443242, 446910, 450771, 454600, 458353, 462242, 466490, 470858, 474652, 477371, 479109, 480097, 480227, 479329, 477629, 475495, 473018, 470234, 467542, 465327, 463372, 461196, 458888, 457122, 456340, 456421, 457105, 458224, 459455, 460392, 461022, 461686, 462412, 462697, 462197, 461298, 460823, 461351, 462998, 465522, 468344, 470619, 471703, 471719, 471581, 472291, 474079, 476244, 477877, 478648, 478798, 478565, 478060, 477636, 477793, 478501, 479044, 478825, 477966, 476881, 475770, 474861, 474578, 474979, 475497, 475807, 476420, 477772, 479210, 479791, 479746, 480161, 481281, 482095, 481694, 480233, 478393, 476673, 475349, 474404, 473287, 471396, 469015, 467113, 466075, 465356, 464580, 464155, 464393, 464801, 464834, 464692, 464750, 464714, 464120, 463350, 463408, 464731, 466787, 468815, 470472, 471751, 472716, 473532, 474476, 475761, 477414, 479343, 481459, 483688, 485926, 488033, 489977, 492007, 494512, 497543, 500626, 503314, 505805, 508704, 512236, 516018, 519623, 523009, 526353, 529740, 533023]
53591E33023K792J933J275J513K451K941K302J279J104J976L087L706L643K989
53577E66014K093J570J737K106K003J381O28j33r33j542j877k490l891n526o279
53562E54861n840m837l721k404j012j79k52q25j295j415j248j008r61j096r21
53547E27847j35O74O53p3m57O8R94J574J671J532J382J484K051K860L356L364
53531E48845L276L445L808M206M652N215N956P019Q320R209R090Q338P891P950
53517F37220P787P060O404O350O494O259N878N961O523P103P561Q213R303J0772
53503G38888J2403J3854J4775J5234J5820J6968J8381J9419J9888K0033K0013
53492I25676J9703J9030J8138J7363J7132J7719J8751J9259J8647J7484J6905
$$ y = [533023, 535815, 537748, 539023, 540536, 542987, 545928, 548230, 549509, 550613, 552589, 555676, 559382, 563025, 566014, 568107, 569677, 571414, 573520, 575523, 576904, 577532, 577399, 576466, 574924, 573047, 570557, 566666, 561140, 554861, 549021, 544184, 540463, 538059, 537047, 536868, 536616, 535791, 534496, 533081, 531833, 530825, 529864, 528768, 527847, 527712, 528386, 529039, 528966, 528509, 528577, 529571, 531145, 532816, 534348, 535730, 537214, 539265, 542125, 545481, 548845, 552121, 555566, 559374, 563580, 568232, 573447, 579403, 586422, 594742, 603951, 613041, 621379, 629270, 637220, 645007, 652067, 658471, 664821, 671315, 677574, 683452, 689413, 695936, 703039, 710600, 718813, 728116, 738888, 751291, 765145, 779920, 795154, 810974, 827942, 846323, 865742, 885630, 905663, 925676, 945379, 964409, 982547, 999910, 1017042, 1034761, 1053512, 1072771, 1091418, 1108902, 1125807]
53481A125807J7258J7805J7833J7444J7089J6749J6068J5050J4097J3389J2638
53470A301227J1679J0839J0457J0275R736Q758P784P076O341N217L664J791l60
53457A394484k609m604o266p924r731j1310j2337j3094j4012j5011j5784j6411
53445A265391j7118j7678j7761j7736j8247j9024j8978j7676j6011j5005j4552
53434A075605j3856j2651j1505j1099j1510j2084j1846j0339q233o830o709p193
53422I51750p226o496n374m156k840j440q2J310L096N478Q092J0177J1301J1881
53408I75471J2759J4202J5608J6452J7149J8481K0333K1815K2594K3389K4786
53397A183039K6375K7582K8798L0829L3583L6035L7572L8641L9905M1338M2480
$$ y = [1125807, 1143065, 1160870, 1178703, 1196147, 1213236, 1229985, 1246053, 1261103, 1275200, 1288589, 1301227, 1312906, 1323745, 1334202, 1344477, 1354213, 1362971, 1370755, 1377831, 1384172, 1389389, 1393053, 1394844, 1394484, 1391875, 1387271, 1381005, 1373081, 1363350, 1352040, 1339703, 1326609, 1312597, 1297586, 1281802, 1265391, 1248273, 1230595, 1212834, 1195098, 1176851, 1157827, 1138849, 1121173, 1105162, 1090157, 1075605, 1061749, 1049098, 1037593, 1026494, 1014984, 1002900, 991054, 980715, 972482, 965652, 958943, 951750, 944524, 938028, 932654, 928498, 925658, 924218, 924136, 925446, 928542, 934020, 942112, 952289, 963590, 975471, 988230, 1002432, 1018040, 1034492, 1051641, 1070122, 1090455, 1112270, 1134864, 1158253, 1183039, 1209414, 1236996, 1265794, 1296623, 1330206, 1366241, 1403813, 1442454, 1482359, 1523697, 1566177]
53386A566177M3256M4107M5337M6629M7312M7039M6179M5478M5327M5417M5199
53375B067457M4481M3459M2172M0341L7849L5119L2651L0382K7795K4655K1241
53364B447602J7796J4245J0696P679N319K629j577p127j2629j7352k2113k7862
53352B417306l4141l9666m3947m7539n0866n3559n5042n5145n4154n2677n1517
53341A879053n1122n1102n0650m9495m8100m6939m6031m5146m4091m2686m0905
53330A362786l9103l7631l6263l4442l2175l0098k8518k6944k4882k2561k0448
53319A029721j8493j6346j4029j1894j0089q477p034n868m906l822k432r29L50
53306I25752J275K033K930M055N148N918O482P298Q580R938J0849J1286J1692
$$ y = [1566177, 1609433, 1653540, 1698877, 1745506, 1792818, 1839857, 1886036, 1931514, 1976841, 2022258, 2067457, 2111938, 2155397, 2197569, 2237910, 2275759, 2310878, 2343529, 2373911, 2401706, 2426361, 2447602, 2465398, 2479643, 2490339, 2498018, 2503337, 2505966, 2504389, 2497262, 2484633, 2467281, 2445168, 2417306, 2383165, 2343499, 2299552, 2252013, 2201147, 2147588, 2092546, 2037401, 1983247, 1930570, 1879053, 1827931, 1776829, 1726179, 1676684, 1628584, 1581645, 1535614, 1490468, 1446377, 1403691, 1362786, 1323683, 1286052, 1249789, 1215347, 1183172, 1153074, 1124556, 1097612, 1072730, 1050169, 1029721, 1011228, 994882, 980853, 968959, 958870, 950393, 943359, 937491, 932585, 928763, 926331, 925402, 925752, 927027, 929060, 931990, 936045, 941193, 947111, 953593, 960891, 969471, 979409, 990258, 1001544, 1013236]
53293A013236J2438J3562J4967J6490J7770J8383J8379J8507J9506K1258K2935
53282A207431K3968K4576K5204K5785K5885K5263K4034K2463K0976K0072J9759
53271A465416J9201J7575J5157J2919J1136R175O737M358K348K17k322m692o500
53258A550725q417j1085j3837j5677j7005j9065k1939k4383k5747k6794k8314
53247A338462k9975l1092l1615l1823l1684l1071l0158k9144k7944k6500k5068
53236A012388k3920k3004k2164k1397k0830k0592k0763k1147k1206k0606j9638
53225G77121j8699j7603j6048j4454j3495j2875j1620r655q062p509p428p127
53213F32546o667o223n567m827m798n657o247n504l955k971l039l656m385m958
$$ y = [1013236, 1025674, 1039236, 1054203, 1070693, 1088463, 1106846, 1125225, 1143732, 1163238, 1184496, 1207431, 1231399, 1255975, 1281179, 1306964, 1332849, 1358112, 1382146, 1404609, 1425585, 1445657, 1465416, 1484617, 1502192, 1517349, 1530268, 1541404, 1550579, 1557316, 1561674, 1564022, 1564239, 1561917, 1557225, 1550725, 1542308, 1531223, 1517386, 1501709, 1484704, 1465639, 1443700, 1419317, 1393570, 1366776, 1338462, 1308487, 1277395, 1245780, 1213957, 1182273, 1151202, 1121044, 1091900, 1063956, 1037456, 1012388, 988468, 965464, 943300, 921903, 901073, 880481, 859718, 838571, 817365, 796759, 777121, 758422, 740819, 724771, 710317, 696822, 683947, 672327, 662672, 654610, 647101, 639673, 632546, 625879, 619656, 614089, 609262, 604464, 598807, 592560, 587056, 583101, 580130, 577091, 573435, 569050, 564092]
53199E64092m870l903k843k666l156l267k731k251k150j865j073l45k42m94n44
53184E31692l84l63n67p86q62p69n02j54R5J10j50o93j400j856j640q98l15m05
53166E20153j066j805k173j871r03K08O18p5j406k498k854k572k032j523j127
53151D99074p31k00L27M31j54j114j787j809j412r91o80m37m00q09j587k268k403
53134D83050j909j005k1O63P99O02O40J172J821K160K260K337K170J481O77N51
53118D97448J219K046K627L169L692L585K463R06j93o66r47j238j419j677k490
53103E08525l841m898m849l866k927k680k731k280j290n71o15p97k03J048J944
53088D79969J904J337Q26M34O0j58k12m70j134j681j440m79M48Q16Q23R65J374
$$ y = [564092, 559222, 555319, 552476, 549810, 546654, 543387, 540656, 538405, 536255, 534390, 533317, 532972, 532730, 532236, 531692, 531308, 530945, 530378, 529592, 528730, 527961, 527459, 527305, 527400, 527510, 527360, 526667, 525267, 523411, 521771, 520873, 520558, 520153, 519087, 517282, 515109, 513238, 512335, 512543, 513161, 513086, 511680, 509182, 506328, 503756, 501724, 500201, 499074, 498343, 498143, 498470, 498901, 498747, 497633, 495846, 494037, 492625, 491634, 490954, 490517, 490117, 489308, 487721, 485453, 483050, 481141, 480136, 480115, 480778, 481577, 482179, 482819, 483991, 485812, 487972, 490232, 492569, 494739, 496220, 496897, 497448, 498667, 500713, 503340, 506509, 510201, 513786, 516249, 517155, 516962, 516296, 515349, 514111, 512692, 511015, 508525, 504684, 499786, 494937, 491071, 488144, 485464, 482733, 480453, 479163, 478592, 477977, 477180, 476977, 478025, 479969, 481873, 483210, 484036, 484470, 484530, 484372, 484160, 483690, 482556, 480875, 479435, 478956, 479404, 480220, 481043, 482008, 483382]
53071D83382J659J454R82Q76J242J321M80p24j127n49J5j56p06j113j541k225
53055D83270k774k705k255j956j846j653j427j317j106n76j33l80j188j795j810
53040D60349j512j237r09l76K31N64L66k85r12r79m79O9K77K38Q1l50r99j316
53022D52821r21k46M9n0j11o6j57k71J7P36J322J245N08m01q45n19J40K88k86
53003D53253p91n64k9Ol79m16J00O08P08N76L94R8k00k08L2J24K1J29O43J203
52983D55308J420J336J213J242J472J711J552R04L92O76J467J811J343O52L02
52968D72801K52L40O37J006R35K50n64j014j176j244j061n54k04m85j123j443
52952D67353j287j119j242j383j118m20K50L67j74q47r67m46Q3N0l70o02m77l21
$$ y = [483382, 485041, 486495, 487477, 488353, 489595, 490916, 491396, 490672, 489545, 488996, 489011, 488855, 488149, 487036, 485495, 483270, 480496, 477791, 475536, 473580, 471734, 470081, 468654, 467337, 466231, 465655, 465522, 465142, 463954, 462159, 460349, 458837, 457600, 456691, 456315, 456546, 457110, 457476, 457191, 456279, 455300, 454821, 454890, 455167, 455405, 455486, 455136, 454137, 452821, 451900, 451654, 451703, 451653, 451542, 451476, 451319, 451048, 451065, 451801, 453123, 454368, 454876, 454475, 453630, 453111, 453251, 453539, 453253, 452462, 451898, 451869, 451875, 451496, 451080, 451180, 451788, 452496, 453072, 453466, 453564, 453364, 453156, 453188, 453312, 453333, 453462, 454105, 455308, 456728, 458064, 459277, 460519, 461991, 463702, 465254, 466158, 466550, 467226, 468693, 470504, 471847, 472499, 472801, 473053, 473393, 474030, 475036, 475971, 476221, 475657, 474643, 473467, 472223, 471162, 470608, 470404, 469919, 468796, 467353, 466066, 464947, 463705, 462322, 461204, 460784, 461034, 461401, 461227, 460380, 459413, 458967, 459050, 459100, 458730, 458128, 457651, 457330]
52934D57330l40l48k08j26l03n28m70k11j51l22k72K16O85O43L85N83J224J585
52916D59372J279P57M83K92j11m74l07M31J373K147K390J796O55m2L43J171J322
52899D72877O47l5k63m28q96j354j334q69l85k44n33r25q19N1J076J357Q49L67
52881D69139M11N25J81k78o1J002K230K817K598K009J571J370J083N62J78L73
52865D85710J002J484J477J100N14j93p23o78k10q9q71k184l183l468l291k977
52849D73420k564k005j519j433j700j766j184k05N13P76R43J115P97j74q80k53
52833D63881J472K902L173K848L026L973M944N112M506L976M262N150N769N746
52819E20740N560N482M711K233j704n551p888q431p794o803o008n430m780m015
$$ y = [457330, 456990, 456642, 456434, 456308, 456005, 455477, 455007, 454796, 454645, 454323, 454051, 454267, 454952, 455595, 455980, 456563, 457787, 459372, 460651, 461408, 461891, 462183, 462072, 461598, 461291, 461722, 463095, 465242, 467632, 469428, 470083, 470041, 470384, 471555, 472877, 473524, 473489, 473226, 472798, 471902, 470548, 469214, 468345, 467960, 467716, 467183, 466258, 465439, 465490, 466566, 467923, 468772, 469139, 469550, 470075, 470256, 469978, 469917, 470919, 473149, 475966, 478564, 480573, 482144, 483514, 484597, 485159, 485337, 485710, 486712, 488196, 489673, 490773, 491287, 491094, 490371, 489693, 489483, 489394, 488523, 486339, 483156, 479688, 476397, 473420, 470856, 468851, 467332, 465899, 464199, 462433, 461249, 461044, 461557, 462333, 463276, 464391, 465188, 465014, 464134, 463881, 465353, 468255, 471428, 474276, 477302, 481275, 486219, 491331, 495837, 499813, 504075, 509225, 514994, 520740, 526300, 531782, 536493, 538726, 537022, 531471, 523583, 515152, 507358, 500555, 494547, 489117, 484337, 480322]
52805D80322l453l108k472j378n61o61j117r21j03M17K34j86m74p09q57p52o23
52788D63598p76p50J94J667K340J736Q61O95J004J125R45O70L37O6J45M33L55
52771D74645j44l68L1M10J21n65j002j048q79m86R1N45O89O47L85l29j245j620
52753D69878j327j133j499j845j570j004o16j32P99J656J719J202Q34P23M31o8
52737D68048l38j65L07R81J769K349K502K428K399K330K066J632Q98m20j912k426
52721D82448j505l15j94q90j142n65M0J4m65r14j007o31j16j94r73j394n63P96
52703D72430J182M25k77k32o7l94q22p26j17O26J258J520J116K59l16j70L97R18
52685D77010J266J411J209P26L87M53O46N30R0k43n9N89J119R43J84l54j87K60
$$ y = [480322, 476869, 473761, 471289, 469911, 469350, 468689, 467572, 466651, 466548, 466965, 467199, 467013, 466539, 465830, 464973, 464221, 463598, 462822, 462072, 462266, 463933, 466273, 468009, 468870, 469565, 470569, 471694, 472639, 473309, 473646, 473712, 473857, 474290, 474645, 474501, 474133, 474164, 474574, 474695, 474130, 473128, 472080, 471201, 470715, 470806, 471351, 472040, 472687, 473072, 472743, 471498, 469878, 468551, 467418, 465919, 464074, 462504, 461500, 460884, 460752, 461551, 463207, 464926, 466128, 466962, 467685, 468116, 468048, 467710, 467545, 467852, 468833, 470602, 472951, 475453, 477881, 480280, 482610, 484676, 486308, 487206, 486786, 484874, 482448, 480943, 480628, 480434, 479544, 478402, 477837, 477877, 477891, 477426, 476512, 475505, 474874, 474758, 474564, 473591, 472197, 471634, 472430, 473612, 474037, 473760, 473528, 473461, 473067, 472245, 471519, 471402, 472028, 473286, 474806, 475922, 476181, 475865, 475695, 476092, 477010, 478276, 479687, 480896, 481622, 482009, 482462, 483108, 483638, 483728, 483485, 483426, 484015, 485134, 486077, 486261, 485907, 485720, 485980]
52667D85980M02M32Q39J450J686J568J619J839J686J121P90R58J095P86M15M64
52651E03130P69Q34M88o5m61l25L32Q21M37m06l93J058L012M216M453M242L828
52634E25970L102K130J093k02k076m222n656n578m142k304j013n60o30r16j408
52619E03588k000k163j528n66r7j71j16K51K81l31q23m03N29R33N28oj11N0J20
52600D97965N8J7M3Q1J14J47K07L39N31O80P53Q39R23P78L21p2P8P05J194J120
52580E06821O90L76L17K92J14j80m99p93r20p02k11J81K18P1Jo5l38o47n85j81
52560E03960J6l19q21r26n01K01Q45J136R48O29P70J400J733J150M5o80o72k57
52542E08657J75M51M92M08N36R74J339J396J579K313L151L321K915K742L078L284
$$ y = [485980, 486382, 486814, 487653, 489103, 490789, 492357, 493976, 495815, 497501, 498622, 499412, 500370, 501465, 502251, 502666, 503130, 503899, 504733, 505221, 505156, 504695, 504370, 504702, 505523, 505960, 505554, 505161, 506219, 509231, 513447, 517900, 522142, 525970, 529072, 531202, 532295, 532093, 530017, 525795, 520139, 514561, 510419, 508115, 507102, 506542, 505912, 504996, 503588, 501588, 499425, 497897, 497331, 497234, 497063, 496947, 497198, 497479, 497148, 496325, 495922, 496451, 497384, 497912, 497906, 497795, 497845, 497965, 498023, 498040, 498083, 498164, 498278, 498425, 498632, 498971, 499502, 500182, 500935, 501774, 502697, 503475, 503796, 503724, 503802, 504507, 505701, 506821, 507511, 507887, 508204, 508496, 508610, 508430, 507931, 507138, 506218, 505516, 505305, 505486, 505704, 505775, 505776, 505711, 505373, 504726, 504141, 503960, 503976, 503657, 502836, 501910, 501409, 501610, 502455, 503591, 504539, 505168, 505938, 507338, 509071, 510221, 510266, 509586, 508914, 508657, 508832, 509283, 509775, 510183, 510719, 511693, 513032, 514428, 516007, 518320, 521471, 524792, 527707, 530449, 533527, 536811]
52526E36811K788J760P95M43J014K213K960K362R26J40P54K113L269L907L953
52511E66208L178J693J47r87j867k688l244l427l576l821l711l008k274k099k181
52496E38343j817r96k83J19N36J095J373R39q5j028j213n88J23K00o6L44J699
52479E38695K897K817J797J161J546K396K972L197L384L631L771L739L660L630
52465E79293L459K790J567K26r04k161m009o010p055o821o171n741m943l160j161
52450E39199l44q54j477j371q78n44k69J47L65J9n20m64M02J419J789J371P23
52433E38713M87P95J298J663J872K039K133K070J841J402O76j51n61k14O07J330
52417E56000J686J731J546J244J118J355J782K243K974M141N220N503N091M715
$$ y = [536811, 539599, 541359, 542154, 542597, 543611, 545824, 548784, 551146, 552072, 552212, 552966, 555079, 558348, 562255, 566208, 569386, 571079, 571226, 570239, 568372, 565684, 562440, 559013, 555437, 551616, 547905, 544897, 542623, 540524, 538343, 536526, 535530, 535247, 535366, 535902, 536997, 538370, 539309, 539224, 538196, 536983, 536395, 536518, 536718, 536652, 536996, 538695, 541592, 544409, 546206, 547367, 548913, 551309, 554281, 557478, 560862, 564493, 568264, 572003, 575663, 579293, 582752, 585542, 587109, 587335, 586431, 584270, 580261, 574251, 567196, 560375, 554204, 548463, 543520, 540360, 539199, 538855, 538001, 536524, 535153, 534275, 533731, 533462, 533609, 533974, 533993, 533473, 533009, 533411, 534830, 536619, 537990, 538713, 539200, 539995, 541293, 542956, 544828, 546867, 549000, 551070, 552911, 554313, 554989, 554838, 554277, 554063, 554670, 556000, 557686, 559417, 560963, 562207, 563325, 564680, 566462, 568705, 571679, 575820, 581040, 586543, 591634, 596349]
52403E96349M522L843K342O64m69j266k333l621m531m912n241n776o064n465l916
52388E64126k007n03J23o6m96m37N03K150L922N191N599N207M407L587K879K257
52372E96442J823J781K041K058J288k56j952l164l711l830l812l797l781l680
52358E77450l317k540j463n19j68l91o08k46N86J168J041N65L77N37O02M75O36
52341E74185J306J924J875J339J019J217J734K403L237M084M718N233N808O156
52327F16238N739M704L871L540L041J862O44L24P71J081J022J302K280L244L375
52312F53038K933K949L960N476O611O896O437N652N037M949N285N408M642K921
52298G22194Q32j011k433l468l990l853l289k758k407j938j110j42N17O68N27
$$ y = [596349, 600871, 604714, 607056, 607720, 607251, 605985, 603652, 600031, 595500, 590588, 585347, 579571, 573507, 568042, 564126, 562119, 561616, 561739, 561673, 561177, 560740, 561243, 563393, 567315, 572506, 578105, 583312, 587719, 591306, 594185, 596442, 598265, 600046, 602087, 604145, 605433, 605177, 603225, 600061, 596350, 592520, 588708, 584911, 581130, 577450, 574133, 571593, 570130, 569611, 569443, 569052, 568444, 568198, 568784, 569952, 570993, 571558, 571935, 572472, 573074, 573549, 574185, 575491, 577415, 579290, 580629, 581648, 582865, 584599, 587002, 590239, 594323, 599041, 604274, 610082, 616238, 621977, 626681, 630552, 634092, 637133, 638995, 639639, 639963, 640734, 641815, 642837, 644139, 646419, 649663, 653038, 655971, 658920, 662880, 668356, 674967, 681863, 688300, 693952, 698989, 703938, 709223, 714631, 719273, 722194, 723026, 722015, 719582, 716114, 712124, 708271, 704982, 702224, 699817, 697879, 696769, 696627, 697144, 697812, 698339]
52283F98339N13R11J638K331K731K935L133L297L303L264L429L822M195M345M178
52268G42364L606K772K221K418L003L145K670K325K668L316L653L750M046M522
52254G86479M736M498L908K917J338n96k224l126l455l535l375k852k126j635
52240G80952j608j742j488o66L68J249K054K966L669L564K670J855J991L088M512
52225H03434N720O533O977P148P213P269P280P235P270P539Q091Q863R674J0250
52211I10496J0486J0640J0887J0749R567P541N745M794M154L125J862Q48j04j558
52197I89232l417m902n521n510n252m814m057k925j565m09j2m47r81p54K92J419
52181I50377J950J832J487J422J891K699L386L778M069M206L722K583J675J794
$$ y = [698339, 698852, 699763, 701401, 703732, 706463, 709398, 712531, 715828, 719131, 722395, 725824, 729646, 733841, 738186, 742364, 745970, 748742, 750963, 753381, 756384, 759529, 762199, 764524, 767192, 770508, 774161, 777911, 781957, 786479, 791215, 795713, 799621, 802538, 803876, 803280, 801056, 797930, 794475, 790940, 787565, 784713, 782587, 780952, 779344, 777602, 776114, 775448, 775816, 777065, 779119, 782085, 785754, 789318, 791988, 793843, 795834, 798922, 803434, 809154, 815687, 822664, 829812, 837025, 844294, 851574, 858809, 866079, 873618, 881709, 890572, 900246, 910496, 920982, 931622, 942509, 953258, 962825, 970366, 976111, 980905, 985059, 988184, 990046, 990894, 990790, 989232, 985815, 980913, 975392, 969882, 964630, 959816, 955759, 952834, 951269, 950860, 950848, 950401, 949420, 948666, 948958, 950377, 952327, 954159, 955646, 957068, 958959, 961658, 965044, 968822, 972891, 977097, 980819, 983402, 985077, 986871]
52167I86871K522K894K872L229M048M383L580K124Q26q1o56p47l16K44N78Q76
52151A013247J413J976K116J754J087J63j046k267l030l150k859k452k098j885
52137A002969j804j689j264l78R01K321L571M493N228N982O694P133P346P721
52123A049224Q427R141R533R851J0564J1510J1818J0784Q611O001L254Lm078q579
52109A136064j2531j5228j6711j7389j7415j6534j4545j1769q957o663m765k766
52097I90791o02J213K409L595N488P692R013R015Q550Q420Q335P679O602N558
52083A073758M336K563P88M3L62P88R21J417K641L856M328M410M788N257N136
52068A115392M453L840L341K204L2k471m219m820m704m458m264l922l153j926
$$ y = [986871, 989393, 992287, 995159, 998388, 1002436, 1006819, 1010399, 1012523, 1013349, 1013268, 1012612, 1011865, 1011549, 1011793, 1012371, 1013247, 1014660, 1016636, 1018752, 1020506, 1021593, 1021756, 1020710, 1018443, 1015413, 1012263, 1009404, 1006952, 1004854, 1002969, 1001165, 999476, 998212, 997834, 998735, 1001056, 1004627, 1009120, 1014348, 1020330, 1027024, 1034157, 1041503, 1049224, 1057651, 1066792, 1076325, 1086176, 1096740, 1108250, 1120068, 1130852, 1139463, 1145464, 1148718, 1148721, 1144643, 1136064, 1123533, 1108305, 1091594, 1074205, 1056790, 1040256, 1025711, 1013942, 1004985, 998322, 993557, 990791, 990189, 991402, 993811, 997406, 1002894, 1010586, 1019599, 1028614, 1037164, 1045584, 1053919, 1061598, 1068200, 1073758, 1078094, 1080657, 1081445, 1081488, 1081850, 1082638, 1083559, 1084976, 1087617, 1091473, 1095801, 1100211, 1104999, 1110256, 1115392, 1119845, 1123685, 1127026, 1129230, 1129262, 1126791, 1122572, 1117752, 1113048, 1108590, 1104326, 1100404, 1097251, 1095325]
52054A095325n27O75J511J991K118J907J583J541J909K323K321J959J754J957
52040A118347K167J886J258Q50Q52R17Q48R48J453K027K201K022J956K279K949
52025A142960L821M729N441N879O244O695P102P348P676Q333R211J0161J1336
52012A236936J2707J3581J3229J1794R883P546M417P79k454m890o957q933j0552
51999A277086j1796j3079j4352j4878j4518j4283j4922j5846j6264j6573j7442
51988A113133j8219j7554j5421j3201j1674j0169q002n669l993l015k461k613
51976A001142l974o337q953j1426j3813j5905j7067j6904j5685j3956j2041j0147
51964H54934q549p399o405n046l173j261N8O63J037J733K796L805M435M781N051
$$ y = [1095325, 1094798, 1095473, 1096984, 1098975, 1101093, 1103000, 1104583, 1106124, 1108033, 1110356, 1112677, 1114636, 1116390, 1118347, 1120514, 1122400, 1123658, 1124508, 1125360, 1126277, 1127125, 1128073, 1129526, 1131553, 1133754, 1135776, 1137732, 1140011, 1142960, 1146781, 1151510, 1156951, 1162830, 1169074, 1175769, 1182871, 1190219, 1197895, 1206228, 1215439, 1225600, 1236936, 1249643, 1263224, 1276453, 1288247, 1298130, 1305676, 1310093, 1310872, 1308418, 1303528, 1296571, 1287638, 1277086, 1265290, 1252211, 1237859, 1222981, 1208463, 1194180, 1179258, 1163412, 1147148, 1130575, 1113133, 1094914, 1077360, 1061939, 1048738, 1037064, 1026895, 1018893, 1013224, 1009231, 1006216, 1003755, 1001142, 997168, 990831, 981878, 970452, 956639, 940734, 923667, 906763, 891078, 877122, 865081, 854934, 846385, 838986, 832581, 827535, 824362, 823101, 823159, 823822, 824859, 826592, 829388, 833193, 837628, 842409, 847460]
51949H47460N086M484L214J833Q43Q4r40k228l165l266k678j830r38j08M68P78
51933H49097J269K404M067N715P074Q272R304R840R721R292R015Q931Q706Q021
51919I50728O741M801K179j004m355p302r445j0866j1985j2949j3433j3150j2290
51906H67670j1133r526p259m807l057k243j713q92J30J177K631M907P701J0272
51892H53858J2346J4316J6536J8797K0548K1532K2061K2750K3857K5036K5809
51881A077446K6185K6502K6610K5671K2951J8422J2380M849m087j3457k1434k6477
51869A175561k8483k8723k8621k8559k7864k5948k3159k0357j7954j5896j4393
51858I15604j3978j4660j5666j6184j5991j5130j3597j1701j0104q992p661n494
$$ y = [847460, 852546, 857030, 860244, 862077, 862920, 863004, 862064, 859836, 856671, 853405, 850727, 848897, 847959, 847851, 848319, 849097, 850366, 852770, 856837, 862552, 869626, 877898, 887202, 897042, 906763, 916055, 925070, 934001, 942707, 950728, 957469, 962270, 964449, 963445, 959090, 951788, 942343, 931477, 919492, 906543, 893110, 879960, 867670, 856537, 847011, 839752, 834945, 831888, 829645, 827932, 827040, 827170, 828347, 830978, 835885, 843586, 853858, 866204, 880520, 897056, 915853, 936401, 957933, 979994, 1002744, 1026601, 1051637, 1077446, 1103631, 1130133, 1156743, 1182414, 1205365, 1223787, 1236167, 1241016, 1236929, 1223472, 1202038, 1175561, 1147078, 1118355, 1089734, 1061175, 1033311, 1007363, 984204, 963847, 945893, 929997, 915604, 901626, 886966, 871300, 855116, 839125, 823995, 810398, 798697, 788593, 779601, 771940, 766446]
51846G66446k931q58N76J932L469M893N992O729O837O008M691L877L859L747K591
51831H17858N30j527k988l992n024o399p942q936q623p076n399m663m808m855
51817G46156m106k816j718j240j254j281q41K36J598K614K957K946L135L697M241
51802G54324M326L983L675L812M305M604M179L058J823J108J097J700K959M944
51788G99897P170Q602Q596P586O492N581M318K259l60l040n556p916j0015j1622
51774H11992j2492j2437j1476j0100r070q692q361p227n276l442k565k417k020
51761G16417q76M37J079J075J203J842K426K364J890J603J474J010K35k03O0O33
51745G32669R74R92Q84Q48J071J656K362K774K824K717K405J684R64J183K637
$$ y = [766446, 763515, 762657, 763233, 765165, 768634, 773527, 779519, 786248, 793085, 799093, 803784, 807661, 811520, 815267, 817858, 818388, 816861, 813873, 809881, 804857, 798458, 790516, 781580, 772957, 765881, 760482, 755819, 751011, 746156, 742050, 739234, 737516, 736276, 735022, 733741, 732900, 733136, 734734, 737348, 740305, 743251, 746386, 750083, 754324, 758650, 762633, 766308, 770120, 774425, 779029, 783208, 786266, 788089, 789197, 790294, 791994, 794953, 799897, 807067, 815669, 824265, 831851, 838343, 843924, 848242, 850501, 850141, 847101, 841545, 833629, 823614, 811992, 799500, 787063, 775587, 765487, 756417, 747725, 739364, 732137, 726861, 723419, 720854, 718437, 716417, 715541, 715978, 717057, 718132, 719335, 721177, 723603, 725967, 727857, 729460, 730934, 731944, 732179, 731976, 732036, 732669, 733643, 734635, 735519, 736367, 737438, 739094, 741456, 744230, 747054, 749771, 752176, 753860, 754824, 756007, 758644]
51730G58644M425N487N734N757N930O286O858P534P912P839P782Q133Q420P842
51716H54583O454N209M842N223N739N898N469M502L295K101Q68n50j997l050l346
51701H95240k712j236N23J711J863J221O1j969n399j0056j5030j9277k1921k2376
51687H00643k0821j8366j6111j4172j2061r782p765o038m223k371r91j61O29J641
51673F90051K595L401M431N827P217Q399R649J0988J1780J1558J0652R593Q317
51660G94458O495M169J626j012l568n528o525o795o640n822m150k386j724k296
51646G60302k900k530j595j316k238l758m943n443n543n588n558n244m668m078
51632G04900l552k841j780o56J06M84Q72J503K158K492K421K077J538Q07ln67
$$ y = [758644, 763069, 768556, 774290, 780047, 785977, 792263, 799121, 806655, 814567, 822406, 830188, 838321, 846741, 854583, 861037, 866246, 871088, 876311, 882050, 887948, 893417, 897919, 901214, 903315, 904183, 903633, 901636, 898586, 895240, 892528, 891292, 891815, 893526, 895389, 896610, 896671, 894702, 889303, 879247, 864217, 844940, 823019, 800643, 779822, 761456, 745345, 731173, 719112, 709330, 701565, 695527, 691304, 688933, 687942, 687781, 688410, 690051, 692646, 696047, 700478, 706305, 713522, 721921, 731570, 742558, 754338, 765896, 776548, 786141, 794458, 800953, 805122, 806748, 805736, 802168, 796640, 790115, 783320, 776680, 770858, 766708, 764322, 762598, 760302, 757402, 754872, 753277, 751961, 749723, 745965, 741022, 735579, 730036, 724448, 718890, 713646, 708978, 704900, 701348, 698507, 696727, 696071, 696177, 696661, 697533, 699036, 701194, 703686, 706107, 708184, 709722, 710529, 710526, 709959]
51616G09959n46J64J361K653L662M187M299M309M479M723M672M100L234K496K107
51601G55859K071K496L560N098O513P342P776Q418R520J0638J1061J0485R260
51588H50097Q175Q051R334J1820J4730J7219J8935K0047K0715K0792K0095J8703
51576A038713J6786J4317J1415Q714O898N771M419K535J161J708M659R584J5980
51563A142660K3402L0919L7197M1403M3643M4313M3424M0822L6847L2257K7408
51552A544295K1712J4203M725n665j5687k5013l4032m2615m9757n4661n7559n8952
51540A240994n8670n6339n2421m7958m3397l8426l2972k7628k2953j8983j5662
51529H25585j3184j1600j0491r333p878o057l929j959q88r13j337j272m38R12
$$ y = [709959, 709413, 709577, 710938, 713591, 717253, 721440, 725739, 730048, 734527, 739250, 743922, 748022, 751256, 753752, 755859, 757930, 760426, 763986, 769084, 775597, 782939, 790715, 799133, 808653, 819291, 830352, 840837, 850097, 858272, 866323, 875657, 887477, 902207, 919426, 938361, 958408, 979123, 999915, 1020010, 1038713, 1055499, 1069816, 1081231, 1089945, 1096843, 1102614, 1107033, 1109568, 1110729, 1112437, 1117096, 1126680, 1142660, 1166062, 1196981, 1234178, 1275581, 1319224, 1363537, 1406961, 1447783, 1484630, 1516887, 1544295, 1566007, 1580210, 1584935, 1579270, 1563583, 1538570, 1504538, 1461923, 1412166, 1357505, 1299946, 1240994, 1182324, 1125985, 1073564, 1025606, 982209, 943783, 910811, 883183, 860230, 841247, 825585, 812401, 800801, 790310, 780977, 773099, 767042, 763113, 761154, 760266, 759353, 758016, 756744, 756306, 757218]
51515G57218K417L594L781K700R47m93j200j477j627j530j013k89J45J6m97r95
51499G61697j289j479j607j296q9J829L519M116L647K852K421K612L444M739N965
51484G91081O420N886M895M083L435K384O27j530l632n517p124q188q548q489
51470G75783q414q246p651o762o116n767n109l851k576j909j580q52M54J933L363
51455G22700M950O883R139J1638J4120J5959J6604J6243J5674J5439J5313J4487
51443H79149J2138Q105L378l76k232k780l155l781m620o082q611j1555j3497j3824
51429H32257j3080j1700r494o649m212k877k144j267m87n79j627k910l762m030
51415G67439l958l962m353m901m946m185l052k044j081R9J279J929J895J557J476
$$ y = [757218, 759635, 763229, 767010, 769710, 770657, 770164, 768964, 767487, 765860, 764330, 763317, 763028, 763173, 763189, 762692, 761697, 760408, 758929, 757322, 756026, 755937, 757766, 761285, 765401, 769048, 771900, 774321, 776933, 780377, 785116, 791081, 797501, 803387, 808282, 812365, 815800, 818184, 818811, 817281, 813649, 808132, 801008, 792820, 784272, 775783, 767369, 759123, 751472, 744710, 738594, 732827, 727718, 723867, 721291, 719382, 717802, 716950, 717404, 719337, 722700, 727650, 734533, 743672, 755310, 769430, 785389, 801993, 818236, 833910, 849349, 864662, 879149, 891287, 899392, 902770, 902394, 900162, 897382, 894227, 890446, 885826, 879744, 871133, 859578, 846081, 832257, 819177, 807477, 797983, 791334, 787122, 784245, 782101, 780834, 780347, 779768, 778141, 775231, 771469, 767439, 763481, 759519, 755166, 750265, 745319, 741134, 738082, 736038, 734957, 735056, 736335, 738264, 740159, 741716, 743192]
51400G43192K115L613N617P468Q752R478R776R904J0621J2821J6481K0526K4051
51387H84415K7261L0814L4916L9524M4731N0366N5647O0037O3961O7890P1087
51376A430649P2206P0917O7976O3627N6891M6832L3877J9477M856r444k3114l5740
51364A799010m6927n6510o4410p0308p3697p4426p3047p0306o6379o1053n4658
51353A087289m8268m2731l7910l3174k8238k3325j8920j5560j3415j1771r545
51342H04432o620m061k696k145j731j477j454r89L66J649J555L89k28M09J409
51327G88808J925K272K991L857M449M940N702O625P416Q189R275J0669J2046J3102
51313H82266J3658J3571J2775J1241Q791N026l31p009j3910j9340k1944k1807
$$ y = [743192, 745307, 748920, 754537, 762005, 770757, 780235, 790011, 799915, 810536, 823357, 839838, 860364, 884415, 911676, 942490, 977406, 1016930, 1061661, 1112027, 1167674, 1227711, 1291672, 1359562, 1430649, 1502855, 1573772, 1641748, 1705375, 1762266, 1809098, 1842975, 1862452, 1867308, 1857864, 1834750, 1799010, 1752083, 1695573, 1631163, 1560855, 1487158, 1412732, 1339685, 1269379, 1203000, 1141947, 1087289, 1039021, 996290, 958380, 925206, 896968, 873643, 854723, 839163, 825748, 813977, 804432, 797812, 793751, 791055, 788910, 787179, 785702, 784248, 783259, 783625, 785274, 786829, 787218, 786990, 787399, 788808, 790733, 793005, 795996, 799853, 804302, 809242, 814944, 821569, 828985, 837174, 846449, 857118, 869164, 882266, 895924, 909495, 922270, 933511, 942302, 947328, 946997, 939988, 926078, 906738, 884794, 862987]
51301H62987k0323j8676j6771j4131j1178q824p059n092k781r43M3R31K471M376
51287G65030N879O733P158P351P461P648P777P398O351M956L351J136j923n214
51273H31092p707q815q614p575o329n285m218k602n97Q68J213R08O26K93n05j641
51257G81112k598l187l545l706l686l791m197m452l955k802j645q59l37M7L75
51242G42774R45J957K938L082K233J036R5m96p76p27o46j122k215l138l125k268
51226G40547j156o6J065K108K755K946K866K550J935J264R61R14L91r48k376k890
51210G52866k484k072k169k305j908j204p76o50m02P0M93Q45J430K234K799K951
51194G49718L182L954M995N693N935O155O683P386P897P910P292O153M817L561
$$ y = [862987, 842664, 823988, 807217, 793086, 781908, 773084, 766025, 760933, 758152, 757209, 757252, 758183, 760654, 765030, 770909, 777642, 784800, 792151, 799612, 807260, 815037, 822435, 828786, 833742, 837093, 838229, 836306, 831092, 823385, 814570, 805956, 798381, 792052, 786767, 782549, 779947, 779350, 780218, 781431, 782339, 782965, 783258, 782753, 781112, 778514, 775327, 771782, 768076, 764390, 760599, 756402, 751950, 747995, 745193, 743548, 742689, 742352, 742399, 742774, 743719, 745676, 748614, 751696, 753929, 754965, 755060, 754564, 753788, 753061, 752415, 751293, 749078, 745940, 742815, 740547, 739391, 739325, 740390, 742498, 745253, 748199, 751065, 753615, 755550, 756814, 757775, 758689, 759080, 758132, 755756, 752866, 750382, 748310, 746141, 743836, 741928, 740724, 739948, 739298, 738896, 738966, 739459, 740304, 741734, 743968, 746767, 749718, 752900, 756854, 761849, 767542, 773477, 779632, 786315, 793701, 801598, 809508, 816800, 822953, 827770, 831331]
51180H31331K347R50p55k726m846o898q498r303r331q932q392p710o762n583m456
51165G50436l672l216k710j815o50L49R83J475J989K262K022J543J414J832K412
51150G54654K738K730K430J808J005M34L64N27M64J42j52l86q03j257j082N6J614
51133G65286K894L954N152O127O091N183M538M650M552L218J023r92k654m474
51119H04548o309p369p548p625p921p728o507m809l530k839k351j837j264n67
51105G36344J46M84K77j10k96l00j91J99P96J026O14J87M74J277J888K176K512
51088G47503K863K814K437K245K246J827Q63J38K60P13N73k32q91p93j75L64O49
51071G63404R95J586K049J901J280Q60R63J188J218J454K296L243L476L130L114
$$ y = [831331, 833678, 834628, 833873, 831147, 826301, 819403, 810905, 801602, 792271, 783339, 774947, 767237, 760475, 754892, 750436, 746764, 743548, 740838, 739023, 738373, 738722, 739705, 741180, 743169, 745431, 747453, 748996, 750410, 752242, 754654, 757392, 760122, 762552, 764360, 765365, 765799, 766163, 766690, 767154, 767296, 767144, 766758, 765955, 764698, 763616, 763672, 765286, 768180, 772134, 777286, 783413, 789504, 794687, 799225, 803875, 808427, 811645, 812668, 811676, 809022, 804548, 798239, 790870, 783322, 775697, 767776, 760048, 753541, 748732, 745202, 742363, 740012, 738175, 736911, 736344, 736490, 736974, 737251, 737141, 736845, 736545, 736354, 736553, 737349, 738375, 738989, 739176, 739650, 740927, 742815, 744991, 747503, 750366, 753180, 755617, 757862, 760108, 761935, 762798, 762936, 763196, 763909, 764482, 764250, 763359, 762566, 762391, 762755, 763404, 764399, 765985, 768034, 769935, 771215, 772075, 773038, 774226, 775444, 776898, 779194, 782437, 785913, 789043, 792157]
51056G92157L671M128M257M913O745R057J0657J1314J1639J2001J2310J2638J3144
51043I08631J3428J2711J0845Q462O000L192j32l294n391o381p100q216r556j0460
51029I12739j0516r866q986q270p685o797n230l137j056P41K544M643O625P682
51015H73431P678P513Q140R454J0603J1232J1875J3067J4544J5624J6107J6391
51003A015659J6876J7478J7736J7165J5613J3471J1458J0020R002P979O773N416
50991A164646L773J605r59l362n088o105o851p913r594j1568j3094j3879j4559
50978A077052j5930j7702j8633j7994j6454j5127j4201j2882j0447p032l470o48
50966I26532J076K054K938M018N174O329P539Q490Q514P542O510O262O480O337
$$ y = [792157, 795828, 799956, 804213, 809126, 815871, 824928, 835585, 846899, 858538, 870539, 882849, 895487, 908631, 922059, 934770, 945615, 954077, 960077, 963269, 963137, 959843, 954452, 948071, 940971, 932755, 923199, 912739, 902223, 892357, 883371, 875101, 867416, 860619, 855389, 852252, 851196, 851937, 854481, 859124, 865749, 873431, 881109, 888622, 896762, 906216, 916819, 928051, 939926, 952993, 967537, 983161, 999268, 1015659, 1032535, 1050013, 1067749, 1084914, 1100527, 1113998, 1125456, 1135476, 1144478, 1152457, 1159230, 1164646, 1168419, 1170024, 1169065, 1165703, 1160615, 1154510, 1147659, 1139746, 1130152, 1118584, 1105490, 1091611, 1077052, 1061122, 1043420, 1024787, 1006793, 990339, 975212, 961011, 948129, 937682, 930650, 927180, 926532, 927608, 929662, 932600, 936618, 941792, 948121, 955660, 964150, 972664, 980206, 986716, 992978, 999458, 1005795]
50952A005795N877N976P028Q550J0154J2051J4374J6631J8175J8793J8581J7710
50940A159695J6437J4840J2393Q415L194j796n252p091q004q515q879r302r745
50927A156390r953j0038j0571j1708j2783j3281j3581j4082j4274j3565j2491
50916A020063j2039j2058j1420r670p503n620m082k893k233j914j451r44j044
50903I47192j809k489k664k718k803k377j288m13m07o50k89M04P09Q50J549K506
50887I35303K579J507L23j96n59j588l126m266m460l980l462l294l303k945j946
50872I06587p89j55O3P30K203L647M074L688L603M308N041M875L918L094L039
50857I47926L652M596N663O608P093P144P348Q139R116R509R298R352J0303J1816
$$ y = [1005795, 1011672, 1017648, 1024676, 1033226, 1043380, 1055431, 1069805, 1086436, 1104611, 1123404, 1141985, 1159695, 1176132, 1190972, 1203365, 1211780, 1214974, 1213178, 1207926, 1200835, 1192831, 1184316, 1175437, 1166135, 1156390, 1146437, 1136399, 1125828, 1114120, 1101337, 1088056, 1074475, 1060393, 1046119, 1032554, 1020063, 1008024, 995966, 984546, 974876, 967373, 961753, 957671, 954778, 952545, 950631, 949180, 948236, 947192, 945383, 942894, 940230, 937512, 934709, 932332, 931044, 930631, 930224, 929574, 929285, 929689, 930398, 931248, 932797, 935303, 937882, 939389, 939712, 939516, 938957, 937369, 934243, 929977, 925517, 921537, 918075, 914781, 911478, 908533, 906587, 905798, 905643, 905706, 906436, 908639, 912286, 916360, 920048, 923651, 927959, 933000, 937875, 941793, 944887, 947926, 951578, 956174, 961837, 968445, 975538, 982682, 990030, 998169, 1007285, 1016794, 1026092, 1035444, 1045747, 1057563]
50843A057563J3130J3976J4549J4878J4716J4087J3519J3542J4110J4665J4812
50832A213547J4813J5312J6571J8177J9618K0862K2096K3180K3903K4618K5880
50821A438577K7343K7769K6549K4548K2858K1205J8356J3849Q547L538p69m493
50809A627877p852j1184j4687j7868j9752k0005j9385j8667j7611j5609j2978
50798A452279j0734r082p024l865l98K125L714N554Q339J1538J4411J6846J8738
50785A502441J9407J8399J6476J4883J3798J2261R675O537L563Q01k012m809p339
50772A604081r614j1810j4011j6278j8711k1190k3345k5009k6374k7526k8216
50761A381997k8295k7969k7360k6205k4377k2288k0325j8237j5606j2607r826
$$ y = [1057563, 1070693, 1084669, 1099218, 1114096, 1128812, 1142899, 1156418, 1169960, 1184070, 1198735, 1213547, 1228360, 1243672, 1260243, 1278420, 1298038, 1318900, 1340996, 1364176, 1388079, 1412697, 1438577, 1465920, 1493689, 1520238, 1544786, 1567644, 1588849, 1607205, 1621054, 1629601, 1633139, 1632370, 1627877, 1620025, 1608841, 1594154, 1576286, 1556534, 1536529, 1517144, 1498477, 1480866, 1465257, 1452279, 1441545, 1432463, 1425439, 1421574, 1421176, 1423301, 1427015, 1432569, 1440908, 1452446, 1466857, 1483703, 1502441, 1521848, 1540247, 1556723, 1571606, 1585404, 1597665, 1607340, 1613877, 1617440, 1618241, 1616229, 1611420, 1604081, 1594467, 1582657, 1568646, 1552368, 1533657, 1512467, 1489122, 1464113, 1437739, 1410213, 1381997, 1353702, 1325733, 1298373, 1272168, 1247791, 1225503, 1205178, 1186941, 1171335, 1158728, 1148902]
50750A148902p512n526l907k901k447k046j185L02K222M074N336N975O524P447
50736A155258Q712J0257J2384J5135J7682J9111J9517J9660J9677J9028J7659
50725A334080J6297J5395J4595J3452J1982J0184P845N244L342K712K791K769
50713A440688K619K591K287J217O1K67K260M862O809Q158R701J1617J3378J4619
50699A521134J5417J5708J5157J3837J2487J1758J1503J1180J0645J0189R983
50688A658998J0027J0530J1769J3458J4851J5636J6267J7186J8199J8994J9769
50677A825684K0939K2511K4387K6900L0474L4826L9074M2535M4991M6256M6211
50666B204788M5192M3742M1789L8666L4181K9185K4774K1345J8637J6282J3889
$$ y = [1148902, 1141390, 1135864, 1131957, 1129056, 1126609, 1124563, 1123378, 1123680, 1125902, 1129976, 1135312, 1141287, 1147811, 1155258, 1163970, 1174227, 1186611, 1201746, 1219428, 1238539, 1258056, 1277716, 1297393, 1316421, 1334080, 1350377, 1365772, 1380367, 1393819, 1405801, 1415985, 1423830, 1429074, 1432416, 1435128, 1437919, 1440688, 1443307, 1445898, 1448185, 1449402, 1449463, 1449730, 1451990, 1456852, 1463661, 1471819, 1481520, 1493137, 1506515, 1521134, 1536551, 1552259, 1567416, 1581253, 1593740, 1605498, 1617001, 1628181, 1638826, 1649015, 1658998, 1669025, 1679555, 1691324, 1704782, 1719633, 1735269, 1751536, 1768722, 1786921, 1805915, 1825684, 1846623, 1869134, 1893521, 1920421, 1950895, 1985721, 2024795, 2067330, 2112321, 2158577, 2204788, 2249980, 2293722, 2335511, 2374177, 2408358, 2437543, 2462317, 2483662, 2502299, 2518581, 2532470]
50655B532470J0918P052K660j376m389o367p760q976j0039j0606j0276q883o443
50642B477985k958J506O612J1803J6659K0990K4575K7045K8141K8000K7113K6008
50630B693479K4892K3455K1160J7794J3535Q409K090n379j3130k0446k7988l7082
50618B700789m7477n6624o1617o1410n6857m9316m0008l0248k1300j3702p222
50607B255008j655K705N446O583O435N079K207k473q718j5702k2519k8785l4620
50594B168991l9968m4164m6335m6268m4664m2492m0161l7407l3836k9504k4882
50583A739310k0413j6255j2460r207o643m618k824j213p1M34O45J143K079K907
50569A672814K924K137J470J931L643N851P825R465J1038J2673J4348J6146J8249
$$ y = [2532470, 2543388, 2550440, 2553100, 2551724, 2547335, 2540968, 2533208, 2524232, 2514193, 2503587, 2493311, 2484428, 2477985, 2475027, 2476533, 2483145, 2494948, 2511607, 2532597, 2557172, 2584217, 2612358, 2640358, 2667471, 2693479, 2718371, 2741826, 2762986, 2780780, 2794315, 2802724, 2804814, 2799435, 2786305, 2765859, 2737871, 2700789, 2653312, 2596688, 2535071, 2473661, 2416804, 2367488, 2327480, 2297232, 2275932, 2262230, 2255008, 2253353, 2256058, 2261504, 2268087, 2274522, 2279601, 2281808, 2279335, 2270617, 2254915, 2232396, 2203611, 2168991, 2129023, 2084859, 2038524, 1992256, 1947592, 1905100, 1864939, 1827532, 1793696, 1764192, 1739310, 1718897, 1702642, 1690182, 1680975, 1674332, 1669714, 1666890, 1665677, 1665606, 1666040, 1666685, 1667828, 1669907, 1672814, 1675738, 1677875, 1679345, 1681276, 1684919, 1690770, 1698595, 1708060, 1719098, 1731771, 1746119, 1762265, 1780514]
50556A780514K0779K3740K6904K9773L1980L3905L6423L9725M2766M4333M4383
50545B155225M3895M3738M4125M4928M5887M6633M7044M7529M8475M9597N0293
50534B667369N0478N0465N0242M9671M9385N0630N4000N8958O4709P0794P6623
50523C293324Q1260Q4201Q5685Q5810Q3843P8958P1299O1732N0826L8494K4448
50512D039880Q735q039k4796m0586n5223o9016q1762r2412r9983j04278j05467
50501C367053j03498r8431r0852q1383p0091n7038m3135k9743j7418n629O039
50490B775874J6820K5172L0112L1934L1566K9337K4579J6571N631p060k0489l4258
50478B925789m7992o0942p2216q1049q6755q9053q8566q6530q3712q0081p5596
$$ y = [1780514, 1801293, 1825033, 1851937, 1881710, 1913690, 1947595, 1984018, 2023743, 2066509, 2110842, 2155225, 2199120, 2242858, 2286983, 2331911, 2377798, 2424431, 2471475, 2519004, 2567479, 2617076, 2667369, 2717847, 2768312, 2818554, 2868225, 2917610, 2968240, 3022240, 3081198, 3145907, 3216701, 3293324, 3374584, 3458785, 3544470, 3630280, 3714123, 3793081, 3864380, 3926112, 3976938, 4015432, 4039880, 4048615, 4040576, 4015780, 3975194, 3919971, 3850955, 3769193, 3676781, 3576798, 3472520, 3367053, 3263555, 3165124, 3074272, 2992889, 2922798, 2865760, 2822625, 2792882, 2775464, 2769835, 2775874, 2792694, 2817866, 2847978, 2879912, 2911478, 2940815, 2965394, 2981965, 2987596, 2980536, 2960047, 2925789, 2877797, 2816855, 2744639, 2663590, 2576835, 2487782, 2399216, 2312686, 2228974, 2148893, 2073297]
50467B073297p0654o5557o0289n5158n0858m7372m3523l8406l2678k7668k3674
50456A557460j9986j6286j3034j0601q757p094n336l284r44J316L215M972O802
50443A488443Q248Q654Q079P086N782L874J581k93j327j816j897j010J440N347
50429A532191R994J4551J8320K1008K3010K5089K7576L0088L2137L3650L4855
50418A802469L6026L7408L9070M0676M1699M1996M1963M2051M2455M3213M4247
50407B253273M5218M5662M5366M4394M2737M0199L6575L1671K5306J7711R711
50396B637823K058n461j3627k2611l1708m0286m8177n5067o0175o3028o3951o3400
50384B172390o1252n7203n1456m4523l6662k8052j9350j1481m943M24N009R050
$$ y = [2073297, 2002643, 1937086, 1876797, 1821639, 1770781, 1723409, 1679886, 1641480, 1608802, 1581134, 1557460, 1537474, 1521188, 1508154, 1497553, 1488796, 1481702, 1476366, 1473082, 1472138, 1473454, 1476669, 1481641, 1488443, 1496691, 1505345, 1513424, 1520510, 1526292, 1530166, 1531747, 1531454, 1530127, 1528311, 1526414, 1525404, 1526844, 1532191, 1542185, 1556736, 1575056, 1596064, 1619074, 1644163, 1671739, 1701827, 1733964, 1767614, 1802469, 1838495, 1875903, 1914973, 1955649, 1997348, 2039344, 2081307, 2123358, 2165813, 2209026, 2253273, 2298491, 2344153, 2389519, 2433913, 2476650, 2516849, 2553424, 2585095, 2610401, 2628112, 2637823, 2639881, 2634420, 2620793, 2598182, 2566474, 2526188, 2478011, 2422944, 2362769, 2299741, 2235790, 2172390, 2111138, 2053935, 2002479, 1957956, 1921294, 1893242, 1873892, 1862411, 1857468, 1857892, 1862901, 1871951]
50372A871951J2515J5091J6296J5844J3892J0723O409R49n438j2395j9706k7106
50360A899025l3937l9297m2671m4321m4974m5299m5521m5343m4257m2040l9069
50349A432296l6024l3345l1097k9221k7604k5942k3845k1263j8600j6225j4032
50338A155098j1772r645q167p444o955o207n226m239l181j976r64n91p04o71q1
50323A087275R72K333L906N411O557P564Q952J0630J1907J2571J3279J4441J5420
50310A201218J5452J4729J3927J3135J1962J0322Q315N699K357r17k960l623l817
50297A285799m244m822n288n616n681n276m688m521m808m937m591m102l691l142
50283A220392k529k421k839k653q30K131M551N348N073N296P123J0161J2790J3715
$$ y = [1871951, 1884466, 1899557, 1915853, 1931697, 1945589, 1956312, 1962721, 1963670, 1958232, 1945837, 1926131, 1899025, 1865088, 1825791, 1783120, 1738799, 1693825, 1648526, 1603005, 1557662, 1513405, 1471365, 1432296, 1396272, 1362927, 1331830, 1302609, 1275005, 1249063, 1225218, 1203955, 1185355, 1169130, 1155098, 1143326, 1133681, 1125514, 1118070, 1111115, 1104908, 1099682, 1095443, 1092262, 1090286, 1089322, 1088731, 1088027, 1087356, 1087275, 1088247, 1090580, 1094486, 1099897, 1106454, 1114018, 1122970, 1133600, 1145507, 1158078, 1171357, 1185798, 1201218, 1216670, 1231399, 1245326, 1258461, 1270423, 1280745, 1289060, 1294759, 1297116, 1296199, 1293239, 1289616, 1285799, 1281555, 1276733, 1271445, 1265829, 1260148, 1254872, 1250184, 1245663, 1240855, 1235918, 1231327, 1227225, 1223534, 1220392, 1217863, 1215442, 1212603, 1209950, 1209120, 1211251, 1215802, 1221150, 1226223, 1231519, 1238642, 1248803, 1261593, 1275308]
50269A275308J3253J2753J2788J2580J1288R213P268N834M658L470K187P77o35
50256A370742j736k481l346m873p072r492j1557j2645j2372j1081r700q723p768
50243A267896o381m770l271j669K92K148L259L838M749O364Q270J0057J1713J3271
50229A315766J4732J6465J9095K2802K7118L1446L5374L8511M0640M2182M3835
50218A647966M5443M5721M3578L9441L4825L0740K6972K2861J8333J3957J0180
50207A980017O744K915j829p455j3657k0241k7002l3443l8853m2789m5242m6236
50195A712929m5536m2910l8678l3724k8982k4946k1686j9146j7246j5790j4553
50184A409732j3568j3201j3673j4603j5148j4641j2999j0613q033n696l777k233
$$ y = [1275308, 1288561, 1301314, 1314102, 1326682, 1337970, 1347183, 1354451, 1360285, 1364943, 1368413, 1370600, 1371377, 1370742, 1369006, 1366525, 1363179, 1358306, 1351234, 1341742, 1330185, 1317540, 1305168, 1294087, 1284387, 1275664, 1267896, 1261515, 1256745, 1253474, 1251805, 1252097, 1254245, 1257504, 1261342, 1266091, 1272455, 1280725, 1290782, 1302495, 1315766, 1330498, 1346963, 1366058, 1388860, 1415978, 1447424, 1482798, 1521309, 1561949, 1604131, 1647966, 1693409, 1739130, 1782708, 1822149, 1856974, 1887714, 1914686, 1937547, 1955880, 1969837, 1980017, 1986761, 1989676, 1987847, 1980392, 1966735, 1946494, 1919492, 1886049, 1847196, 1804407, 1759165, 1712929, 1667393, 1624483, 1585805, 1552081, 1523099, 1498153, 1476467, 1457321, 1440075, 1424285, 1409732, 1396164, 1382963, 1369290, 1354687, 1339539, 1324898, 1311899, 1301286, 1293253, 1287557, 1283780, 1281547]
50172A281547j055l10J25N70J068J145N12k73l52L18J058J617K459L763M965N660
50156A302817O316P507Q976J0072J0653J0914J0648R409P345N172L326J517p05
50143A393967l341n947p989r161r504r201q195o276l729j496l59j18N1P09J873
50128A331284L254M349M603M080L769M584O298Q007R541J1574J4361J7238J9711
50115A442653K2294K5771L0124L4723L9211M3740M8455N3251N7973O2495O6557
50104A927247O9815P2131P3690P4619P4665P3398P0754O7232O3353N9088N4098
50093B680090M8461M2715L7031L0741K2953J3306J901j1061k5121l9345n2813
50082B748858o5098p5864q4278q9479r1542r1331q9438q5858q0704p4533o7843
$$ y = [1281547, 1280492, 1280182, 1280307, 1280877, 1281945, 1283090, 1283602, 1283329, 1282977, 1283295, 1284353, 1285970, 1288429, 1292192, 1297157, 1302817, 1309133, 1316640, 1325616, 1335688, 1346341, 1357255, 1367903, 1377312, 1384657, 1389829, 1393155, 1394672, 1393967, 1390626, 1384679, 1376690, 1367529, 1358025, 1348824, 1340629, 1334353, 1330624, 1329128, 1328769, 1328651, 1328702, 1329411, 1331284, 1334538, 1338887, 1343490, 1347570, 1351339, 1355923, 1362221, 1370228, 1379769, 1391343, 1405704, 1422942, 1442653, 1464947, 1490718, 1520842, 1555565, 1594776, 1638516, 1686971, 1740222, 1798195, 1860690, 1927247, 1997062, 2069193, 2142883, 2217502, 2292167, 2365565, 2436319, 2503551, 2566904, 2625992, 2680090, 2728551, 2771266, 2808297, 2839038, 2861991, 2875297, 2877198, 2866137, 2841016, 2801671, 2748858, 2683760, 2607896, 2523618, 2434139, 2342597, 2251266, 2161828, 2075970, 1995266, 1920733, 1852890]
50071A852890o0846n3862m7387m1534l6013l0861k6658k3750k1738k0029j8395
50060A471817j6696j4606j2051r516p458n830m413l180j927j21K216L985M182
50047A406402L341K987L707M657N049N161N535N849N336L942K455J534J150R72
50033A458077R25J089J277J058L03m82o48k03J33j32n38k19R68K345L430M557
50017A471940O216Q245J0074J1465J2478J2891J2338J1132J0235J0022R571P776
50005A594383M834K015J00j259k554l612m080m135m186m193l772k764j263P56
49991A570270L355O275R061J1585J4168J7236K1082K5808L1060L5946L9654M2140
49979A827640M3816M4727M4527M3255M1479L9664L7846L6059L4434L2671L0064
$$ y = [1852890, 1792044, 1738182, 1690795, 1649261, 1613248, 1582387, 1555729, 1531979, 1510241, 1490212, 1471817, 1455121, 1440515, 1428464, 1418948, 1411490, 1405660, 1401247, 1398067, 1396140, 1396019, 1398235, 1402220, 1406402, 1409743, 1412730, 1416437, 1421094, 1426143, 1431304, 1436839, 1442688, 1448024, 1451966, 1454421, 1455955, 1457105, 1458077, 1459002, 1460091, 1461368, 1462426, 1462729, 1462247, 1461599, 1461396, 1461529, 1461397, 1460859, 1460640, 1461608, 1463953, 1467383, 1471940, 1478156, 1486401, 1496475, 1507940, 1520418, 1533309, 1545647, 1556779, 1567014, 1577036, 1586607, 1594383, 1599217, 1601232, 1601332, 1600073, 1597519, 1593907, 1589827, 1585692, 1581506, 1577313, 1573541, 1570777, 1569514, 1570270, 1573625, 1579900, 1588961, 1600546, 1614714, 1631950, 1653032, 1678840, 1709900, 1745846, 1785500, 1827640, 1871456, 1916183, 1960710, 2003965, 2045444, 2085108, 2122954, 2159013, 2193447, 2226118, 2256182]
49968B256182K6278K1499J5568P736k140j2814k2779l1660l9709m6461n0972n3264
49956B067464n4401n4961n4472n2708n0624m9269m8357m6738m3973m0727l7628
49945A533606l4530l1046k7332k3937k1147j8803j6698j4866j3426j2349j1507
49934A307965j0843j0309r674q611p087n443l921k244P0K953N693P682R064J0453
49920A285748J2142J3806J4972J5564J5894J6204J6377J6086J5099J3349J0887
49909A446128Q005N351L572K576J404r28m504q637j2683j6341j9271k0985k1403
49896A362284k1146k0892k0706k0219j9238j7839j6014j3748j1373r366p632n464
49884A178647k494N95K734L704M313N282O337O708O333O228P477J0018J2624J4089
$$ y = [2256182, 2282460, 2303959, 2319527, 2327263, 2325123, 2312309, 2289530, 2257870, 2218161, 2171700, 2120728, 2067464, 2013063, 1958102, 1903630, 1850922, 1800298, 1751029, 1702672, 1655934, 1611961, 1571234, 1533606, 1499076, 1468030, 1440698, 1416761, 1395614, 1376811, 1360113, 1345247, 1331821, 1319472, 1307965, 1297122, 1286813, 1277139, 1268528, 1261441, 1255998, 1252077, 1249833, 1249903, 1252856, 1258549, 1266231, 1275295, 1285748, 1297890, 1311696, 1326668, 1342232, 1358126, 1374330, 1390707, 1406793, 1421892, 1435241, 1446128, 1454133, 1459484, 1463056, 1465632, 1467036, 1466108, 1461604, 1452967, 1440284, 1423943, 1404672, 1383687, 1362284, 1341138, 1320246, 1299540, 1279321, 1260083, 1242244, 1226230, 1212482, 1201109, 1191743, 1184111, 1178647, 1176153, 1176748, 1179482, 1183186, 1187499, 1192781, 1199118, 1205826, 1212159, 1218387, 1225864, 1235882, 1248506, 1262595]
$$ [...]
##END NTUPLES=NMR SPECTRUM
##END=
