##TITLE=AC1751_05000195609115FOTR0001_9275067_Bt7wbmRs15
##JCAMPDX= 6.0         $$ Bruker NMR JCAMP-DX V2.0
##DATA TYPE= NMR SPECTRUM
##DATA CLASS= NTUPLES
##ORIGIN= BRUKER
##OWNER= Administrator
$$ 1.72 TOPSPIN		Version 2.1
$$ 2015-07-19 00:29:44.963 -0700  Administrator@X
$$ Compression mode = diff/dup
##.OBSERVE FREQUENCY= 400.02188249412
##.OBSERVE NUCLEUS= ^1H
##.ACQUISITION MODE= SIMULTANEOUS (DQD)
##.ACQUISITION SCHEME= undefined
##.AVERAGES= 8
##.DIGITISER RES= 22
##SPECTROMETER/DATA SYSTEM= spect
##.PULSE SEQUENCE= zg30
##.SOLVENT NAME= COFFEE_meoh
##.SHIFT REFERENCE= INTERNAL, COFFEE_meoh, 1, 14.98509
##AUDIT TRAIL= $$ (NUMBER, WHEN, WHO, WHERE, PROCESS, VERSION, WHAT)
$$ ##TITLE= Audit trail, TOPSPIN		Version 2.1
$$ ##JCAMPDX= 5.01
$$ ##ORIGIN= Bruker BioSpin GmbH
$$ ##OWNER= Administrator
$$ $$ E:\/data/COFFEE/nmr/AC1751_05000195609115FOTR0001_9275067_Bt7wbmRs15/30/pdata/1/auditp.txt
$$ ##AUDIT TRAIL=  $$ (NUMBER, WHEN, WHO, WHERE, PROCESS, VERSION, WHAT)
(   1,<2015-07-19 00:29:37.838 -0700>,<Administrator>,<X>,<go>,<TOPSPIN 2.1>,
      <created by zg
	started at 2015-07-19 00:28:31.307 -0700,
	POWCHK enabled, PULCHK disabled,
       configuration hash MD5:
       21 0F 79 D6 B3 7B B4 F6 88 20 88 DB 03 48 BD 9F
       data hash MD5: 64K
       61 69 E1 C1 9F 14 5E 3C F9 DE A3 AE 87 C2 AC 3B>)
(   2,<2015-07-19 00:29:40.979 -0700>,<Administrator>,<X>,<proc1d>,<TOPSPIN 2.1>,
      <Start of raw data processing
       efp LB = 0 FT_mod = 6 PKNL = 1 PHC0 = 0 PHC1 = 0 SI = 32K 
       data hash MD5: 32K
       8D 73 77 65 15 9C EB E2 0B 27 CA D4 C7 3D E2 E5>)
(   3,<2015-07-19 00:29:41.260 -0700>,<Administrator>,<X>,<proc1d>,<TOPSPIN 2.1>,
      <pk PHC0 = 88.29712 PHC1 = 0 
       data hash MD5: 32K
       A5 D6 99 B3 CC D6 F9 4C B7 D1 C8 6F 54 C4 71 87>)
(   4,<2015-07-19 00:29:41.385 -0700>,<Administrator>,<X>,<proc1d>,<TOPSPIN 2.1>,
      <abs ABSG = 1 
       data hash MD5: 32K
       DF 6E 25 99 6D 87 F9 79 3A 8C E3 C6 D4 3D 72 E3>)
(   5,<2015-07-19 00:29:41.432 -0700>,<Administrator>,<X>,<proc1d>,<TOPSPIN 2.1>,
      <abs ABSG = 2 
       data hash MD5: 32K
       00 DB 00 1E D2 C0 E6 91 FE BA 6D 55 23 CA 5A 35>)
(   6,<2015-07-19 00:29:41.494 -0700>,<Administrator>,<X>,<proc1d>,<TOPSPIN 2.1>,
      <abs ABSG = 3 
       data hash MD5: 32K
       3D 6E 1A 19 92 A2 D2 A6 46 83 37 B3 06 E9 C1 29>)
(   7,<2015-07-19 00:29:41.557 -0700>,<Administrator>,<X>,<proc1d>,<TOPSPIN 2.1>,
      <abs ABSG = 4 
       data hash MD5: 32K
       A7 22 B9 3D DC 1D 1C 01 49 37 54 E3 76 D1 A2 24>)
(   8,<2015-07-19 00:29:41.635 -0700>,<Administrator>,<X>,<proc1d>,<TOPSPIN 2.1>,
      <abs ABSG = 5 
       data hash MD5: 32K
       DF AD 88 98 54 C5 26 FE E7 EF A9 7D 03 01 0C 58>)
$$ ##END=
$$ 
$$ $$ hash MD5
$$ $$ 53 03 8C 1E FF 1B 38 66 E6 D5 73 C5 CF B4 38 35
##$RELAX= 
##$RELAX= 
##$RELAX= 
##$RELAX= 
##$RELAX= 
##$RELAX= 
##$RELAX= 
$$ Bruker specific parameters
$$ --------------------------
##$DU= <E:\>
##$EXPNO= 30
$$ [...]
150 150 150 150 150 150 150 150
##$TP07= 0
##$TPNAME0= <>
##$TPNAME1= <>
##$TPNAME2= <>
##$TPNAME3= <>
##$TPNAME4= <>
##$TPNAME5= <>
##$TPNAME6= <>
##$TPNAME7= <>
##$TPOAL= (0..7)
0.5 0.5 0.5 0.5 0.5 0.5 0.5 0.5
##$TPOFFS= (0..7)
0 0 0 0 0 0 0 0
##$TUNHIN= 0
##$TUNHOUT= 0
##$TUNXOUT= 0
##$USERA1= <user>
##$USERA2= <user>
##$USERA3= <user>
##$USERA4= <user>
##$USERA5= <user>
##$V9= 5
##$VALIST= <valist>
##$VCLIST= <CCCCCCCCCCCCCCC>
##$VD= 0
##$VDLIST= <DDDDDDDDDDDDDDD>
##$VPLIST= <PPPPPPPPPPPPPPP>
##$VTLIST= <TTTTTTTTTTTTTTT>
##$WBST= 2048
##$WBSW= 25
##$XGAIN= (0..3)
0 0 0 0
##$XL= 0
##$YL= 0
##$YMAX_a= 609989
##$YMIN_a= -524652
##$ZGOPTNS= <>
##$ZL1= 120
##$ZL2= 120
##$ZL3= 120
##$ZL4= 120
##$ABSF1= 14.98509
##$ABSF2= -5.573092
##$ABSG= 5
##$ABSL= 3
##$ALPHA= 0
##$AQORDER= 0
##$ASSFAC= 0
##$ASSFACI= 0
##$ASSFACX= 0
##$ASSWID= 0
##$AUNMP= <proc_prof1d_extract_pilot.lims>
##$AXLEFT= 0
##$AXNAME= <>
##$AXNUC= <1H>
##$AXRIGHT= 0
##$AXTYPE= 0
##$AXUNIT= <>
##$AZFE= 0.1
##$AZFW= 0.1
##$BCFW= 0
##$BC_mod= 0
##$BYTORDP= 0
##$COROFFS= 0
##$CY= 15
##$DATMOD= 1
##$DC= 0
##$DFILT= <>
##$DTYPP= 0
##$F1P= 0
##$F2P= 0
##$FCOR= 0.5
##$FTSIZE= 32768
##$FT_mod= 6
##$GAMMA= 0
##$GB= 0
##$INTBC= 1
##$INTSCL= 1
##$ISEN= 128
##$LB= 0
##$LEV0= 0
##$LPBIN= 0
##$MAXI= 10000
##$MC2= 0
##$MEAN= 0
##$ME_mod= 0
##$MI= 0
##$NCOEF= 0
##$NC_proc= -8
##$NLEV= 6
##$NOISF1= 0
##$NOISF2= 0
##$NSP= 0
##$NTH_PI= 0
##$NZP= 0
##$OFFSET= 14.98509
##$PC= 1
##$PHC0= 88.29712
##$PHC1= 0
##$PH_mod= 1
##$PKNL= yes
##$PPARMOD= 0
##$PPDIAG= 0
##$PPIPTYP= 0
##$PPMPNUM= 2147483647
##$PPRESOL= 1
##$PSCAL= 4
##$PSIGN= 0
##$PYNMP= <proc.py>
##$REVERSE= no
##$SF= 400.02
##$SI= 32768
##$SIGF1= 0
##$SIGF2= 0
##$SINO= 400
##$SIOLD= 32768
##$SPECTYP= <>
##$SREGLST= <1H.CDCl3>
##$SSB= 0
##$STSI= 32768
##$STSR= 0
##$SW_p= 8223.68421052631
##$SYMM= 0
##$S_DEV= 0
##$TDeff= 65536
##$TDoff= 0
##$TI= <>
##$TILT= no
##$TM1= 0
##$TM2= 0
##$TOPLEV= 0
##$USERP1= <user>
##$USERP2= <user>
##$USERP3= <user>
##$USERP4= <user>
##$USERP5= <user>
##$WDW= 1
##$XDIM= 32768
##$YMAX_p= 449734072
##$YMIN_p= -757056
##$CURPLOT= <Network HP LaserJet P1505>
##$CURPRIN= <$Network HP LaserJet P1505>
##$DFORMAT= <normdp>
##$LAYOUT= <+/1D_H.xwp>
##$LFORMAT= <normlp>
##$PFORMAT= <normpl>
##$SURQMSG= 1
$$ End of Bruker specific parameters
$$ ---------------------------------
##NTUPLES= NMR SPECTRUM
##VAR_NAME=  FREQUENCY,     SPECTRUM/REAL,   SPECTRUM/IMAG
##SYMBOL=    X,             R,               I
##VAR_TYPE=  INDEPENDENT,   DEPENDENT,       DEPENDENT
##VAR_FORM=  AFFN,          ASDF,            ASDF
##VAR_DIM=   32768,         32768,           32768
##UNITS=     HZ,            ARBITRARY UNITS, ARBITRARY UNITS
##FACTOR=    0.250966925370066, 1,           1
##FIRST=     8223.43324360094, -10591,       -127234
##LAST=      0,             74989,           -117579
##MIN=       0,             -757056,         0
##MAX=       8223.43324360094, 449734072,    0
$$ Real data points
##PAGE= N=1
##DATA TABLE= (X++(R..R)), XYDATA
$$ [...]
23805 -42842 169939 -261319 -17787 -237147 288066 30124 -99079 45529 112644 -2372 161764
23793 201982 -365917 19579 -105778 -67666 243992 -104385 -312395 -21096 -279506 24959
23782 -329747 -116208 93845 247087 -20566 -216485 -21456 -290789 189073 192116 -44283 90254
23770 -24796 226085 -402451 -1257 -60212 -21847 -391026 -156538 -259141 -1512 89797 -99947
23758 -141356 128628 15780 12015 234511 509575 -215846 87647 -411253 38170 36578 -151211
23746 -92562 -134362 -83970 -182206 -419625 47810 -85118 30243 -265503 -471440 100742 262580
23735 262580 -136865 128360 -36320 -173736 -74643 69065 -142488 201691 -253757 -151759
23725 -151759 -66714 223023 -98301 -17257 -24957 278724 -284326 -4465 -323576 -141882 -83869
23714 -83869 -110852 -78715 206781 -161354 152377 -75580 -42990 -114118 -228425 101971 151782
23703 151782 62244 -208515 365182 -62978 -159150 236675 -59348 -196912 120364 -36362
23692 -164579 59886 -118006 16570 -352493 -141546 -110304 -26687 -306148 105595 174962
23682 174962 96818 -15312 220868 3092 3638 -58163 -284391 -256081 342546 187375 133121
23671 133121 -113986 -302078 -48268 -49555 -126311 1065 30748 138104 -225467 207722 -77837
23659 -12588 -51399 116299 -229828 -82503 179309 98716 59618 76829 -65663 30168 252220
23648 252220 -79960 -347102 249933 -158344 15272 -22714 142211 -72882 -73354 -46185 23918
23636 23497 -224050 206961 -19268 113104 333101 157086 35568 422899 -218522 60881
23625 -279470 -221428 -108381 89739 27069 -175293 177929 -5174 -286439 -94181 117196 -19474
23613 -284895 417057 206911 -40889 -98002 -47684 -69103 -335464 23852 -288114 -111986
23602 81831 99808 241042 -331392 198282 -371587 142501 -444392 -61413 16767 126079
23592 126079 -374593 -168577 -16750 133533 -175359 -40660 -194597 -100427 -118208 -22746
23581 -339383 -62244 -27589 85317 -93769 7822 -252404 -70412 22685 -194357 173078 -102963
23569 16433 244295 78934 100456 89073 -401105 5109 -273645 -3467 -53351 -98217 -277397
23558 -277397 -170390 -18290 71684 49946 -159001 -53234 -179798 151499 -157710 5602 -20400
23546 82848 397872 3993 -128984 -375636 239619 9520 -102916 208969 -215554 13665 -112963
23534 -171380 -24231 132100 185937 -168453 -220161 -506475 -281952 283818 257434 -159317
23523 168780 -246469 -310411 -238226 -60592 160361 -97082 -451241 68728 134731 114842 -90762
23511 71258 226608 -193552 -33295 -86641 185723 251919 -35522 -254119 163619 -165751
23500 -5800 -125939 27570 155797 -113136 5986 357514 -90107 -73736 55211 -13562 -309516
23489 -309516 -250731 -46723 -113169 48595 264560 109263 -42235 -75279 284816 76699 -160290
23477 -520818 156502 34710 -89403 109422 18700 158686 28895 -34668 -128094 -585 -222390
23466 -222390 27516 -66134 172596 201482 73285 -46381 127258 -115497 267309 139099
23456 139099 -287216 145724 214614 -219600 -172491 88696 -237718 -92014 -87798 5939 -5757
23444 123394 -51263 92836 -105587 42512 102127 190556 -37656 -160597 -357808 -115818 57031
23432 118307 -108018 -54076 -82332 -14234 81642 244 -134932 58683 -28179 -349467 27109
23420 -318888 -13966 -20909 -404742 123665 82534 -152862 -56835 -17791 69501 -84094 238606
23408 65990 380 -120342 119246 35459 -136726 245323 -271865 -173976 44849 -108334 108559
23396 -183145 -254209 -280344 -414457 67958 -61182 -132586 -158236 -392513 42104 -78137 -107098
23385 -107098 -40455 -197545 -381909 -215713 177822 -17430 -37217 111917 -76225 249105
23374 -24708 -216735 -199793 -242032 -47406 -32230 131281 20026 -26772 -62644 81937 37555
23362 92942 -407969 57661 -58277 -175331 -144721 174637 -24100 -114833 111185 -81691 168996
23350 -50343 -137147 -68545 43565 -117299 -620015 68810 25039 140809 -47819 -98118 136758
23338 -88514 -195679 -27336 -3872 53635 72428 -174062 -122600 -259852 242537 72050 433195
23327 433195 3533 -216194 -279220 223815 -98 235197 -234877 257722 127318 -77975 7277
23315 -29264 45121 66449 37935 153267 170816 -151180 231954 -85392 -189183 -336573 -65802
23303 -75117 142493 161237 187532 291331 73717 -103517 -144701 -102752 122536 -17972 93725
23291 90766 259264 219312 104416 197700 -122324 130538 116441 -244247 9060 79482 -353193
23279 -325711 -100144 -73896 68533 94321 24567 46894 -169058 -66609 34300 -7214 42812
23267 -92729 15787 136567 41557 9069 -279724 153887 99354 -265778 -183426 96130 -4977
23255 -523843 -63283 185664 58712 59588 -41510 24423 -96320 -117329 -179247 -181699 -89314 -216617
23243 -216617 -291987 182873 150670 -142365 -47589 -55295 58114 69228 5606 -146543 -60569
23231 -176241 214818 103929 159067 -118353 65767 -60481 -21293 -142201 176944 101004
23221 101004 -429097 -233506 79483 343572 -74575 163444 319794 127001 12913 -167813
23210 105893 -86224 -324072 69777 -5174 -108402 273331 139863 42221 67208 205895 -82403
23198 -76837 233139 52798 351615 379766 78885 29203 -406730 -49282 109526 -63137 -56067
23187 -56067 152000 -47182 88198 -98054 59217 -121357 89238 -103935 -280298 217976 -309446
23175 82504 151170 -389420 -104522 -108867 -30384 -39000 -138798 194314 138552 -284117 171463
23163 -21558 -67088 169335 -153655 175832 177818 -17091 -18158 39290 -339873 -424775 27378
23151 -196686 -244178 -16345 139030 -18977 -165000 319330 -159185 170677 -123206 145356
23140 -59198 108053 -64412 166434 32895 423455 45721 189299 -72781 -162111 34188 -178464
23128 -119673 21411 -74531 62663 -266162 -50082 99622 -304220 -178949 43543 -209937 60869
23116 111794 26049 -29161 268463 17368 29629 -136276 -358892 -68227 193455 73198 -316560
23104 -259567 170561 -299222 -21980 -73381 -246083 -412311 -189867 38942 -147459 25262
23093 22153 -193732 199561 65797 324598 162075 197979 -38107 70666 244282 -182533
23082 -144571 -72176 168108 1276 -86544 57237 210308 -194631 -102415 84030 -197568 -179315
23071 -179315 160778 -429168 -178886 63037 230676 66363 -33601 -17005 -60234 -25638 -2423
23059 -120179 71919 -152816 -266471 -119140 -35470 231294 48461 435771 -411494 -124871
23048 -76691 -154739 -23651 4097 -75505 47095 -339218 190531 180929 336264 118299 -17046
23036 -267256 -128430 -63188 104777 152392 316054 205068 -158709 77846 -131960 54361
23025 4622 -22587 83476 100569 -132336 -124938 -50258 362790 -124696 -83233 -17589 2006 6565
23013 6565 15006 81796 168163 30797 -267103 -173150 -159539 -272884 399817 164755 -142423
23001 -328256 -264806 -38035 -43945 83660 62970 172420 190441 171826 -194589 -73841 -55131
22990 -55131 76754 -227932 -71680 -250094 -65667 -204895 111606 358802 83191 -120544
22979 -481371 118501 -214915 -165680 101998 258346 83188 152781 44237 -175332 -246196
22969 -246196 37255 -44376 64348 -58305 -168610 243852 -65011 134778 -156424 89196 -338293
22957 -13038 337725 -347065 184474 -45853 -105666 -1736 -133323 -138442 142008 -77144 -39072
22946 -39072 -194570 194214 -158194 -108386 -26801 -326909 -100335 13782 -205350 235479
22935 -33613 -164433 -238937 -32612 123017 123745 222932 -141581 95335 -43532 18679 -92602
22923 237019 -502712 -255687 17962 -177137 21477 -55083 15727 129042 -37857 -204243
22913 -204243 -17674 36115 -142489 -283729 -46519 59559 -446763 104650 -50238 164659
22902 -91037 78687 16821 -341535 -185345 -177423 307548 211504 133626 -236443 296647 -230668
22890 -311651 -293226 75315 135682 -172110 -196502 90918 239566 -204936 142271 -355109
22879 -50583 310907 145076 -190526 -96965 247691 -43249 22929 80067 60606 -253949 180488
22867 313492 79610 71065 27423 -299323 -343775 -45683 -166807 -58149 -119649 -163947 142526
22855 -222690 -121621 -230868 -52019 69726 26574 1232 389129 -242421 264818 -80203 -135869
22844 -135869 181754 -428335 -72819 557 -69498 108642 -227630 -153540 -10346 -353688 193262
22832 -66188 -129637 -345372 83781 28437 -330845 -101688 -179176 -96246 -145893 -29625 68527
22820 43467 98349 -22783 55514 -11467 -124898 8314 -310731 -11716 278305 -271697 -451761
22809 -451761 126935 -275597 -68778 39465 -273012 -36048 288814 -237764 80492 -145267
22798 -168385 179452 68650 6639 281919 -154133 -1614 -51086 -149295 -251185 -93596 -283362
22787 -283362 -234598 -366211 -87218 -146604 172814 -114497 14942 315368 -176395 205584
22776 -86043 -205734 -253164 -40585 25345 -144501 54123 -238131 -47281 -63352 -370775 -193442
22765 -193442 -245664 37098 -256892 16789 -50280 76942 167238 79901 85123 109689 -226080
22753 172482 191230 -293821 -119965 235283 -155449 -47488 196996 -25568 -180117 -114680
22743 -114680 -21415 -147910 46028 -127894 66745 4470 123747 -320399 226540 -137807
22732 101539 -111628 -66976 -114335 81813 -193689 64628 40857 -131762 22456 273190 163947
22721 163947 168920 23830 -208 45723 39413 -35106 -133178 65859 -64993 182040 -155580 -85162
22709 -85162 148064 -496995 -63681 -336586 -238035 74071 -34184 -37079 -214866 -220959 207914
22697 -110926 -60171 -217525 165029 -163094 -61548 -200451 347837 63663 -75392 -69103 -86223
22686 -86223 477790 -158553 140897 69517 -170465 -114307 -17078 -334278 -218550 -372108
22676 -372108 -149368 -141507 -234915 105001 -484745 212690 -32786 33666 -75743 107744 37624
22664 5101 88240 153765 256689 -267681 102793 -102764 -338160 22302 143394 73219 60380
22653 60380 -201139 -44517 -81710 167657 185662 -272220 285450 414860 -207544 130533
22642 156595 -234647 251799 -165327 -106614 -244825 -236599 271162 -70483 66065 15468 -479227
22630 21067 -32569 116545 29834 -114616 47378 121610 -34804 -134648 -378308 24276 -293165
22618 -33595 -189596 90954 -142945 75956 -14697 -40885 -112948 26546 -26370 -298286 -163400
22607 -163400 -229626 410932 -26037 -101276 186650 -136825 108396 199798 67875 -167027
22596 59920 20939 -263968 -101722 -86058 143545 -169736 -251683 28786 -183263 -457332
22586 -457332 -14289 -59173 23995 -36796 -90608 47606 -51300 -217595 -40507 94085 157958
22575 157958 12546 35961 198134 47504 -93762 -41585 -86505 -127680 -142594 -269453 -103172
22563 -168227 -125396 -250123 92020 360608 -776 -194956 -153639 4019 -81401 -117626 -51054
22551 234863 -48043 51467 -159241 -40131 -411776 246157 204410 -231285 -96042 144126
22540 58726 -314066 -322521 25182 14103 55034 155530 86991 241949 -85339 122155 -350007
22528 32768 -76439 -216593 -410192 -38793 64523 -94865 426401 -34630 -25508 -233778 -5579
22516 29657 -95264 106976 54209 -168666 95447 -413524 171470 56555 35636 -7004 168410
22504 -82943 -203443 -44741 -569373 30693 249948 -4670 -248382 144570 -87624 -35885 17657
22492 1497 -321443 64171 -50500 -141156 -97177 60721 274319 -314672 -190422 144352 14956
22480 -5718 -143779 21375 44354 -71911 75033 356765 213523 66723 75483 -102024 92785
22468 -248692 -138335 -238764 -27525 -57399 -248816 6200 -317245 175599 -158801 -55479
22457 59420 170124 561150 44409 79772 -69130 28653 -67015 -30022 185752 62979 -322429
22445 -130201 16088 -147521 185279 54973 -57886 94910 -305149 232 -102350 -17969 -269232
22434 -269232 -66450 193769 -217763 363751 396440 89744 -196882 -151205 254682 178135
22424 178135 -104656 -13989 -219932 120520 -137145 -9263 -216106 142667 -249591 -170244
22414 -170244 231147 301105 -120115 229072 30114 99538 8707 -127223 79491 -181961 -255264
22403 -255264 72465 88581 -307977 -108889 -345285 -174803 -39462 -381191 -92498 68375
22392 -40690 -19754 -442697 27388 -13684 -376503 -96146 -39520 -100592 30874 423579 150202
22380 444559 -256871 5453 87906 -49489 -129362 106580 -226109 157744 193270 -28593 -175431
22369 -175431 -274239 282289 -32697 -57809 -66954 117883 -34152 222777 -9985 -407887 -42165
22357 98734 -200919 289738 -160965 -310462 17661 -73501 -261397 -216550 117013 -35791
22346 57898 164641 203616 236300 85435 -155187 -53528 292725 5297 -150806 53747 -123508
22334 -56164 -36513 106711 71657 -138532 -284320 53947 120845 -14332 -381017 71486 75708
22323 75708 -48301 -171321 27525 78014 -225476 -338122 -150780 105131 -233503 167602
22312 283597 -240592 -18363 191510 -447217 -246549 75 136639 -73060 -243596 -5537 31052
22300 96267 122078 -80927 -147879 23621 177390 -143614 64667 214459 -12819 -253080 -91894
22288 -7417 -78967 -1302 -75229 217394 -124832 -229425 280424 120896 -132191 177733 51987
22276 -344537 204458 -322942 26713 106186 -502166 37659 235162 -259895 -149771 -20146
22265 -224186 93637 90237 -1127 -122411 -67126 -158726 -62487 94975 -104584 -31876 -46380
22254 -46380 -43558 -63903 69429 -137995 42081 -411081 -202603 78415 115548 -302980 107472
22242 -139430 -330201 -81912 -12254 -154436 40562 -30446 -84218 132458 -19320 167851 131184
22231 131184 5633 -100748 -214335 -225498 29367 71227 56966 -208746 68112 113704 -439112
22219 -57519 195299 132878 84241 -179875 -309761 124072 7922 -94295 -31055 -61445 -122807
22208 -122807 36631 605 -131027 -246754 10490 94041 -138738 3092 -336928 -155099 177602
22196 73489 -236898 208509 85043 -264710 13373 -44453 -78664 141260 53486 -11223 -115226
22185 -115226 -17431 15920 -210869 -77482 -113733 -114190 234356 -163026 300577 -222965 -55983
22173 93950 -128124 -36557 -43756 82077 210550 -218990 18548 -231103 -94804 -118132 58330
22161 108796 -22910 -207945 31739 2191 53129 -174162 17963 -250519 -48882 -118551 -3497
22149 -219229 -37145 -187395 33416 19706 71946 -290876 -100721 32156 -96889 166263 40621
22137 -156856 -145181 -44588 77637 -65195 44417 -265769 -240542 -241639 -185509 -86409 66521
22125 57800 -105060 138416 -351917 -13963 -47214 175887 -307670 165066 -30483 85124
22114 63995 -165132 57401 13389 11597 -868 -354577 156061 -159205 113098 31188 9990
22102 -299338 -21524 -220518 -117590 -86250 41058 -297727 -245780 163176 -119498 -5026 -552846
22091 -552846 -34388 81196 116571 -94428 -52348 -398255 -356152 -41824 -111746 385829 -63807
22079 -316810 -114087 381574 155363 -180312 -205652 -18719 -116108 1833 -29147 -56165 -81513
22068 -81513 112473 -146852 14487 248819 -209897 -20787 -13556 257053 -282884 -286004 -185329
22057 -185329 212905 -151932 -108998 -326146 36037 -20585 163214 -79974 101165 -241567
22046 -166897 34986 156117 -190707 -224434 7249 -45377 181467 49799 -224709 -63609 -111163
22035 -111163 356800 -7777 -151340 -128248 233087 201082 -18906 -72149 -44138 55226 -12204
22023 -125315 132245 -66949 -288997 15714 36564 45500 -62714 61403 258145 124362 -184300
22011 91996 -88727 -72467 130406 -100609 65961 -195233 -335600 97761 -90144 101514 -21997
21999 156295 -121598 -200810 159485 -2738 156207 91541 -320827 -130477 -55147 254810
21988 -257462 80970 -173381 -5189 289427 29976 -102873 13169 -84551 7750 -326724 -167306
21977 -167306 65790 -99783 207498 252628 276506 11196 -331021 -111533 308379 -199700
21966 -233312 -32086 44113 94618 -36990 -105885 51597 70329 109112 -46742 -242270 138205
21954 -112167 -51459 219488 34691 -25652 -357514 -9354 118817 -61357 46544 -138306 54821
21942 254836 34763 66847 146200 -60347 -101180 -122046 24198 158718 -151612 150859 -127962
21930 -54829 84285 -42725 78699 -188028 -249949 -18606 94412 -20400 18507 -153046 -21231
21918 -22625 9744 -231082 -313234 -17489 -154103 -156370 -190795 257036 -274945 -29046 -155464
21907 -155464 100757 -260182 -234701 204683 -130010 -104353 85798 237744 -268694 33302
21896 -175834 -121262 -166266 -195400 -268957 -105601 10471 -179355 -53729 -156445 -503516 -257958
21885 -257958 -3343 -294687 -58794 213282 39751 396379 -79523 -103188 -183216 -7434 -276418
21874 -276418 -103695 -236596 -239451 -81452 -153078 -140756 -363828 -151072 -185300 -141342 -97611
21863 -97611 -173257 109900 -356935 -173106 -145722 -140000 163626 222375 -261619 167333 -223505
21851 -69873 163653 216109 -254742 104284 -496474 -157388 -26617 113010 -16743 -53066
21841 -53066 71930 -231012 -85500 124117 -104974 372373 67452 35820 -224757 -473298
21831 -473298 54594 124667 -68840 -66929 133445 -183344 -209525 -131334 -104634 3052 -51990
21819 -30271 -140063 -266535 -76671 61563 -289683 76958 52016 151451 -242637 -118365 -500
21807 -162346 248861 35256 111595 -25535 -28746 8488 -41986 -184178 372184 -38286 86888
21795 -228187 -102886 158130 32655 -54343 -23421 -198708 68201 -39343 -54478 -15710 56174
21783 -44043 78871 180237 -190834 258613 36519 -154683 269455 -280361 -143874 112026
21772 -40879 83278 365031 6449 -247375 -135200 -37003 57295 -17630 35383 -155354 121358
21760 -27035 -98085 -46314 28080 -289083 -85806 65318 34214 -37395 -98794 117908 78080
21749 78080 -25333 -167431 -122604 -318326 175226 54794 18489 -52680 -138733 56309 -169618
21737 -287627 -120520 13623 -276815 17965 -55659 93672 -2595 -153853 108115 -50666 237923
21725 -4433 -6865 -87003 -252829 -254969 190523 -266906 292773 -369599 -276457 -156095 -180833
21714 -180833 39454 -166510 -202901 -279321 -111521 -207942 125877 -42942 -178656 126419
21703 -76000 -421325 -7749 -480056 111037 301602 353848 -43238 -21297 -73610 -88488 1279
21691 150312 41006 53201 28952 231922 102553 -27534 -158076 296329 16659 233126
21681 233126 98933 64956 -116055 -4934 -119692 -147217 -64329 -16646 40512 -40361 -76784
21670 -76784 -103169 77681 38713 -164603 56665 -85560 -60098 303772 -251974 -92451 -157876
21659 -157876 199955 -149614 -217252 -93723 -84448 -208179 -189696 -24861 84444 -246947 -256709
21648 -256709 123694 -494370 216654 -57941 -163626 -72999 -86303 -112866 31210 -187324
21637 -132343 303501 -86541 337322 52009 124138 -18131 -268459 38110 122228 -156496 -38306
21625 -368661 24858 -271822 -255291 105093 -187508 -231306 43921 168510 -215569 274660
21614 121205 107766 -219291 -228750 -264972 -89511 -135437 -39719 -142363 -72617 -263893 245867
21602 -298677 -30994 -257995 264853 -15721 -349343 -129298 -80346 -3523 -134900 -41272 -144358
21591 -144358 -50635 -151210 1090 -216570 -89451 -201654 -330148 -72753 177567 -130801
21580 -38641 -49526 273700 -183423 -97214 -34251 -364575 290318 50868 209968 182683 -127666
21568 106096 -113725 92684 36910 -58452 -137464 176129 -231637 -73582 -112413 157642 -31181
21556 194929 -121819 -118484 182853 -265550 21024 -26712 32090 112633 42477 51860 -328025
21544 -53154 76702 134683 -182604 -20755 -62166 -109410 589 -33898 54536 13104 -138239 22959
21531 -171075 -457350 -97186 -194368 4212 -119760 -200675 -98043 -182173 -187170 -122583 -75333
21520 -75333 -51097 83074 50421 -249598 -343555 -128228 -34174 -260019 -145151 -182016 40642
21508 -194884 -105430 -303437 -389327 162403 -315726 -179229 9758 -190385 -155301 -279157
21498 -279157 86319 73404 -272913 -161245 -215886 101464 205960 63741 419983 9987 -4241
21486 219498 183170 -442420 -421717 -153356 47248 -55880 -114356 169632 -22062 -228600 40184
21474 -82906 -53185 200405 -273960 40489 -166487 130195 -57555 16892 132463 131934 106406
21463 106406 -252838 -74983 -131779 124741 -257402 -437395 -191204 -224760 161136 337254
21453 337254 -101611 47640 62157 -51552 7900 151507 96419 -305365 38816 -241272 55984
21441 270660 421792 297827 16701 244116 200198 -4388 -116620 75593 -81447 -208450 11827
21429 -15462 -35343 22253 13659 103056 -490890 114896 -103267 78682 -221698 -189516 -51446
21417 -89588 142582 373144 -186756 133141 -325302 -290225 -134554 -167701 -51714 -241981
21407 -241981 -367002 -192265 237773 -60477 425572 -186628 -80701 168653 -161599 183087
21396 -92078 -171352 98834 -14123 -213248 440948 60079 16957 -3711 33473 -186118 160568
21384 -212949 101156 -78192 10293 -99945 -187001 -198435 -49400 212301 95626 26846 -222294
21372 31335 4441 234761 -218002 -7083 83206 -323682 -15325 -215690 76661 140309 -70107
21360 -254035 -352341 28248 -313995 -20174 -111004 317742 -180543 -243877 27062 9360 -215946
21348 255584 -230711 -20573 -29994 -28365 -165295 -48621 37568 22335 -101734 222381 315821
21337 315821 -185276 -190422 -473854 -332294 -235404 -48749 -79675 -124662 -132186 -229835 -13398
21325 266905 -184128 -122446 -180182 -67794 -95285 140114 -297775 -117642 -98723 107704
21314 -31338 -35858 -140916 -196001 64918 19213 -295255 -260554 146672 -420213 127885 39308
21302 -3205 64652 -20310 25653 30666 -215926 -124751 136788 -244341 -250679 361566 176732
21290 -161953 73496 30533 29909 -112572 -312415 77220 -91351 -394380 379376 -64603 -83844
21279 -83844 -236733 -459722 172542 64630 -5655 123257 106866 -119264 -109727 240477 -15257
21267 -285656 -81432 136785 -180082 164418 -120208 -208506 122 -68097 -93108 -217024 24945
21255 8609 65122 -268845 -159648 -370292 121376 -77463 406461 24764 -112719 365686
21244 -286585 178651 128342 -152547 -25444 -241617 -494005 305290 -48393 -45036 32241 -322417
21232 -374244 -217846 43305 -197522 103892 157650 -3581 -68202 123728 -165979 -12048 -6097
21221 -6097 -75983 -190856 19238 -145188 97848 -207117 -183894 -161956 -21937 -81831 -118180
21210 -118180 82605 -193207 -13331 -27011 -79851 -322124 334594 243760 7477 194053 -192030
21198 -3436 -50113 15077 -161869 75203 -175785 -361681 -255427 -110770 -235369 -182750 -367790
21187 -367790 -168808 -39383 -71849 2751 135708 -163913 -452122 70579 -54055 -58082 -175845
21176 -175845 115834 -180662 -257656 -201639 -145583 -30303 -15110 59180 108653 -24871 -234875
21165 -234875 -215438 -466730 -133328 -307630 164894 -177252 -205295 -170189 210710 -189549
21154 -100024 -178726 277796 -97399 -313068 -15415 -41452 -313919 -122100 -10888 -405011
21144 -405011 294230 -395447 -247464 -14919 -199814 -119825 36112 190 53920 -341856 -221741
21133 -221741 -95787 -104538 -196047 -144361 -120630 144311 -149522 -1296 97177 -265427 -199984
21122 -199984 -38239 1731 -200213 55655 114672 -226173 -132550 -229411 59913 -61710 108089
21110 354993 -39756 -152990 -56227 100547 -557155 -18435 -88799 -252196 -151964 -180416
21100 -180416 -170898 -360101 241676 289800 110057 163527 100381 -254658 28690 114224 18387
21088 -63735 -224037 282863 103359 -166097 -21510 155238 -3428 -141822 -459277 -178698
21077 -387593 253795 -211876 -163949 -88597 108618 330605 -202180 -176380 10870 387585
21067 387585 129400 -156684 1122 -379267 256932 188255 -247086 195928 329715 91526
21056 216387 -60058 71447 26256 14863 -131826 72081 83511 -121005 8149 -339460 447757
21044 -368697 -299299 15352 -126647 -85730 241692 -72250 -270036 112471 197630 -26563 -102659
21033 -102659 -42945 -226405 1164 221030 -113472 78113 15878 -93132 27663 -400261 -180726
21021 38184 22206 233876 195442 -137517 132388 -206187 -65051 -226153 -200886 -342847
21011 -342847 -413295 47813 -4926 -385232 174460 234929 -246489 -389799 46609 10669 160315
21000 160315 -327508 -168991 -156343 -29652 -148125 37158 -102966 -5757 -275196 -139052
20990 -139052 141351 -114694 -32221 -38125 -40515 117420 301469 -241581 33780 -88397 -197966
20979 -197966 -85843 -193833 -1734 246760 -217969 4499 57683 -134933 -86142 -33822 -91737
20968 -91737 6731 -100718 -100784 -181695 -84206 -287309 -188626 -330236 -132586 69708 -232057
20956 -156844 -137370 -96622 446390 -106827 -66867 -454746 -312073 79913 -155485 -305135
20946 -305135 -228877 -319702 -104695 -90503 79895 158016 79357 -91413 42407 -71617 -105663
20935 -105663 59395 -176886 -172572 83724 -7495 -103517 105223 313965 66034 289655 -90347
20923 211277 188245 188371 -65993 -75762 99902 -121221 -118496 -196943 -111455 -112801 -37279 -191080
20911 -191080 129017 -71505 -325202 -205851 -287749 -126614 -261072 -140656 119131 -3496
20900 90119 134622 -581264 -59102 -17145 -58379 230240 53238 58641 -251907 -164533 21238
20888 101602 -22744 170643 -103120 -117468 90098 -197043 -108317 -226745 133936 -179921
20877 -24143 278913 199299 71406 47354 -260336 -167198 -194731 -10542 198084 -144068 -134074
20866 -134074 -101857 -77943 -36871 -39487 -100556 44408 -25605 -8086 -373767 436901 -285180
20854 -184869 -208805 113284 -37813 46965 -46708 -51266 -162585 -279800 -117773 32442 -365303
20842 26142 -116352 132692 -319804 136550 -137311 86984 -200707 -20111 -357215 175915
20831 -242100 205038 124926 322301 -105126 99174 195290 -233441 -66123 -60082 -11183 214640
20819 -124821 -217549 -298349 7036 -25049 -301410 -85491 65835 -206252 74055 -252561 -198172
20808 -198172 240707 333815 -38658 -371929 -216047 -319037 191422 -221990 -332983 -213865
20798 -213865 -186139 -35561 372 25304 133604 90866 51870 116558 -124147 -281735 -37442
20786 72981 392184 -77123 -63176 -66714 3432 -19401 -294369 -154262 113303 301843 165843
20775 165843 -87546 145280 -138524 -196030 -101256 116745 -101718 31192 -459252 3139 -8442
20763 -206783 59385 -24433 -222304 -171152 -273546 -347793 -105019 -211169 -52467 181878
20752 92723 -52285 11633 -188048 91148 -45169 61620 -213169 -101303 -410052 65886 -32491
20740 -79896 154822 180186 -138143 165954 4530 144187 -216938 -61649 -34837 -99565 -229582
20729 -229582 218058 -324334 -11759 -13489 -15806 -193420 165537 100249 -227952 168733 -294499
20717 80384 -260254 -177529 -113468 90346 -75634 116265 -149502 164235 -315543 -337771 -340237
20706 -340237 -78171 25139 -427413 -393308 -285392 -66648 -87278 23981 -920 24975 4134 132220
20694 132220 -63709 303047 53736 3524 91190 69826 -456957 -82871 -131110 -162643 145855
20682 -286740 -139253 -33271 152858 -45410 76297 13869 -119687 82563 35977 -33265 116413
20670 182124 17798 112086 -476563 -297622 -53366 -208970 -48863 118123 -261911 -67899
20659 -153058 -104881 11638 -6521 85632 -342926 -54507 11386 -131659 -78772 243259 -57743
20647 -1804 -91249 -40987 106127 -10052 -71914 -60400 -44360 -167725 73213 -573520 42956
20635 90600 11394 23509 27416 -156798 -128240 150880 -135064 -41554 92720 -48149 -265431
20624 -265431 -250450 75857 97231 28206 -174581 53480 -215732 -187796 -220600 129156 310494
20613 310494 32405 81985 -81849 -9088 73710 41516 11417 130633 200215 99993 -123222
20601 62843 -3090 -130092 73300 117875 -128174 329959 -290364 64653 -192756 -104291 -99584
20590 -99584 329914 -92144 -193733 -291270 -183878 -273903 335355 -87506 -106703 -68185 -169548
20579 -169548 -167974 -236792 -90234 -318967 89361 -113994 -165331 168829 375003 164073 -120678
20567 -103302 -70664 -168995 -187022 -122595 255298 74830 -22004 21781 -130243 270714 183795
20556 183795 -82485 96277 -88791 -232197 -168884 101662 264943 -198231 -208708 -317666
20546 -317666 -98678 -8442 121424 -212894 140892 103199 -157394 -32966 -111500 -372392 -72840
20534 73320 -239839 190395 -15636 1554 -91268 -26742 -236991 -497684 -53149 113496 -50524
20522 -16715 -629209 -247343 15285 -68608 145530 -358965 45796 109900 -344569 -21101 -265275
20511 -265275 -98705 -340589 -12039 -88453 -113813 -318786 39341 -354681 37468 -122490 -46720
20499 260986 -36907 771 54965 -6015 -50806 31999 -217046 -107556 -6999 233154 -56421 13752
20486 -160051 135144 -67223 194055 72337 29334 -174000 -148929 82006 -39398 -142963 -141647
20475 -141647 -169495 -82044 144669 -192620 57886 266880 -34740 -155759 -70966 145507
20464 378921 26608 -141632 203067 -38553 97359 29229 -61208 -70642 -108986 -187252 -300453
20453 -300453 -115678 -85293 -84654 50848 -161450 75603 86251 191008 -135340 -296040 357040
20441 -51481 68954 20297 -138145 -149594 299686 -175681 -151168 -20433 -4441 -118254 -83697
20430 -83697 -393904 32025 -339353 152472 174987 -210685 42272 -13938 -70579 -114467 -69226
20419 -69226 -59366 -56892 -11363 24747 -105922 -368826 -92516 -209771 118316 70642 42954
20408 42954 226605 148528 -100008 -101994 -28697 -78863 218494 -172600 -22211 42685 -15896
20396 173035 53253 38043 176092 -110323 203350 77366 -32646 -346691 -91680 -32886 -5334
20384 112952 -169941 -166843 84536 -197128 -103600 17023 27345 -176305 174339 95637 -15968
20372 195675 -315108 33815 164589 -249241 -220309 -316799 175548 -318058 212448 -124773
20361 -294150 7902 -406562 176884 14560 -417579 108858 -1616 236579 -174013 7241 -166019
20349 199814 229792 -146035 -6003 -226587 -425417 -86051 -131277 103566 -212535 61682 -97517
20337 -134783 4699 -145303 41449 -12994 16036 410543 -122141 -229113 14509 -345523 -424648
20326 -424648 -82103 -298509 178676 119128 -352323 -28143 -278287 -93214 -69584 -302912
20316 -302912 -281763 -13797 -266138 195525 -265625 -44703 -90307 -66879 373312 -411024
20305 46792 234888 -43220 -279053 -201769 -105713 -178926 -792 205451 -193185 8880 -166706
20293 226045 149290 -109737 -107251 -245310 15937 163040 -4741 -72995 -154663 -197670 21781
20281 74165 -180371 113131 280104 -246685 10560 118933 70948 319069 -122691 -71021
20271 -71021 -161621 -376718 -90536 -20664 -183394 138034 -199986 1241 14163 18353 -9157
20259 -263135 -128789 -326299 217421 -237101 -18543 92117 -23866 54870 -298297 70043
20248 -101341 -225636 -63891 7798 95385 -177577 -44801 -222473 147669 -59770 -151040 -38822
20236 -90112 -358316 -200324 -223809 -73703 -40773 -65213 89497 -223920 -86978 387059 -20606
20224 368184 -78069 -350345 154033 -33061 -273398 67992 -156846 -236207 -24077 50355 18114
20212 -252840 -267748 -90681 -97875 168105 -49821 174092 70188 -315900 23612 19310 7403
20200 -235884 -159627 -189379 -98572 -195175 -2561 -206614 208625 -44241 8897 34089 -22939
20188 -69755 103270 90628 -139589 93038 -9377 -156927 -306883 34891 -62314 51827 -68774
20176 -106303 -180639 -3445 237683 -104314 135156 349179 -64609 314452 -149937 164537
20165 -42706 -68823 76046 -119343 76554 -391312 23371 -199793 -42757 37140 22926 187518
20154 187518 -30362 -147202 -131744 -207951 -91502 -81561 -228702 30453 -1845 -141140 47779
20142 -58874 60029 196811 79664 -121883 -85056 -232717 -145297 -115677 61279 64763 -209662
20130 30441 -26247 -99112 -144909 9484 -132536 62930 -39234 -116303 -5801 25932 -97550 -100260
20118 -100260 -122979 -30905 -524926 -200636 -121985 -210381 191983 109697 196979 59100 272964
20107 272964 178995 -90835 141664 -187634 117931 -115485 95334 185372 -207827 368951
20096 -289050 41993 -213882 94384 -58032 -98944 -118797 262075 -163993 -62427 -352106 -238922
20085 -238922 -365945 -107712 174602 85554 -48368 -291627 -220013 -4113 39189 -234514 -434636
20074 -434636 -214653 30410 44119 -13664 -302127 125041 -125426 -167853 -223191 146092
20063 -280271 -77697 433931 -189519 -122907 222925 27494 97094 -121333 -91582 -50630 -69354
20052 -69354 27881 511100 -300333 58202 208957 105588 -135786 91008 -274683 -144802
20042 -144802 -246 42491 -264578 -240753 33566 86922 -342244 -180794 -156236 79025 125485
20031 125485 175227 -344865 148616 -234356 -161612 50585 36766 40174 391026 -437978 26440
20019 -275786 -163716 -209252 -214437 -177497 5128 189976 289248 26795 -71320 28350 96218
20008 96218 128057 -192417 49437 -350792 61836 49739 -274616 -72687 -107535 38698 -24915
19996 -137972 -97858 -79265 -92785 -188412 -59209 -63 189367 107710 37595 167180 146747 -748379
19983 125309 -253009 10833 -104386 -19614 126713 98563 -87132 27329 -193934 -351183
19973 -351183 164211 -109869 -65457 -1105 -90020 189142 -189092 342904 -42968 -178909
19963 -178909 -153100 -199779 -89914 -69321 154908 -409549 -105920 228595 -4837 -12893 -52981
19952 -52981 73155 49331 224294 -233967 -24191 234418 -169664 -216433 -16800 -183834 -48083
19940 -122850 -15556 303881 -422418 25365 2663 23828 -111088 33912 -76433 -114489 225748
19928 -202830 346349 65821 -68377 -165588 -172635 122820 -84201 -27764 -9904 25588 66070
19917 66070 -189033 -201202 201507 -122690 179431 -80581 -245175 30748 -229627 -12985
19906 -10539 152050 -207025 -136513 -293982 234314 -11949 -82576 -224518 85858 64505 -7093
19894 -294032 -291978 -187347 -46110 53750 45276 45119 -43982 142998 -69805 72593 -9573 -8498
19882 -8498 -270531 165210 72073 -109141 -230641 -40228 -200229 -126187 195632 -335066
19871 -78643 44094 -117895 82511 -185272 -113501 -175494 80008 40749 120944 -37612 -72538
19860 -72538 -48376 -244158 96683 -101574 -140317 -115199 -60581 8978 88182 -214689 -18820
19848 34159 -93813 -81167 -40218 -120243 -67922 -86712 -125897 -99376 -230138 66327 -222949
19836 267516 213452 -343561 -265530 -219385 12221 129279 -229119 -132909 -250626 -337928 -28504
19824 20980 101716 -128344 -38497 -31678 -32764 -99462 56010 -170393 -131194 172312 -124431
19812 -32570 402340 -219027 -179661 -146456 -244875 -45212 366052 -77493 22225 -73508 -241167
19801 -241167 -142607 -56004 -52463 -249977 77651 60380 -117552 -105406 -6141 -462644 -44344
19789 -40362 -86553 -43101 -20065 111086 -123762 -364068 84660 250058 132410 52240 54951
19778 54951 2467 188524 -136328 -26145 114954 87352 36366 -192310 148898 254553 -104252
19766 -197548 31826 97383 -199430 273166 79057 69711 -61368 -34690 -180101 -16018 -178574
19755 -178574 25451 -117243 -297789 -83946 139171 -65775 -156569 -23360 -88681 -44509 -57746
19744 -57746 -237827 210990 134502 -150167 -10149 -214914 -134705 44729 -269035 -93795 -14218
19732 -248840 -77249 -104835 -274334 -40156 274710 -240404 -229971 -150482 126886 85626 10106
19720 -374709 146496 -107462 140324 -36401 -133523 -246903 -292750 -216574 7646 -265257 -62657
19708 -11351 186646 -29027 -55096 8299 58372 -539041 -217840 -152224 -145951 -285961 -89096
19696 -140192 57582 -209143 -4469 -121992 -189497 53996 -188294 -356901 10251 -21138 -200164
19685 -200164 -86919 149595 -67071 77513 -54535 49701 -90283 115709 94888 -73448 21002
19673 -517922 -138646 -154479 9623 -133840 125717 46347 57352 -23408 282275 -16011 -250433
19662 -250433 -101404 -45129 324726 -204297 -303345 -351744 -4323 202061 -107622 -79720 -70472
19651 -70472 282480 239209 16551 -9050 106698 -98420 183349 -49792 -282084 -117230 -87216
19640 -87216 -95957 271622 -76084 129490 161347 81678 -46302 -97590 187392 -328705 62934
19628 236322 297659 -66641 -162782 -94114 -40886 98906 -172845 93439 -10383 41145 287590
19617 287590 -253820 -147990 24821 -148777 -38795 -224498 -72572 -206503 7473 -33678 -207292
19606 -207292 -26221 202756 -230085 120780 -240510 -280918 92162 51806 203821 -308054
19595 -67985 263697 -98552 -46356 -50440 -333468 189525 -39577 -129000 -191159 198437 97003
19583 -163766 180303 149355 -173392 198896 166997 -245764 -225825 -86288 7853 -340094 203957
19571 -78450 151318 -85753 99797 -188807 419630 -256089 29802 -107688 -173160 -216204 -169924
19560 -169924 -129394 41585 -35890 148162 -10479 217895 -275377 76182 -64196 -227020 -343811
19549 -343811 -20104 20714 42110 22674 16873 -302419 -8937 77788 53125 -180268 -359695
19538 -359695 -292032 155781 -158187 22480 165850 11452 -76485 97155 294806 83123 -158412
19526 -100939 -60811 -150760 28001 8208 175001 -139157 -184707 -8518 -150255 -287610 -125901
19514 168646 -58707 -376827 83781 -458075 -166497 -116198 -30963 -226359 -241225 123330
19503 167977 222274 -122295 -14974 125308 211696 50456 44794 3191 -118452 -257222 -75388
19491 -80376 249613 -206918 37509 68203 224123 351897 -118351 -188126 -98962 157575
19480 309231 46476 -25349 -160261 -35416 24755 111627 16798 -144918 345263 14904 -48895
19468 -224443 47187 -50061 178607 110431 -200914 -347248 -96460 -138263 -156431 -26068 -55116
19457 -55116 -249032 -178515 124472 150821 51407 -154783 34997 23132 13789 -211298 -131105
19446 -131105 229896 45491 -137246 -204720 284081 -100104 -71933 48344 351090 228102
19436 228102 21779 -276437 -144841 -41878 49612 161941 -232279 327306 68153 -65900
19425 163376 -80446 -137128 133799 -12364 44342 222446 119322 -67977 212114 -56368 -502391
19414 -502391 251097 -34419 -289943 35453 -145111 -197578 -29045 126007 212305 397094
19404 397094 264 225680 -4706 142140 -109359 75025 -229303 306096 -40259 -368013 175200
19392 -84576 -14441 -255307 -324900 -10450 73543 161932 122101 298042 -74786 54083 -86642
19380 -16891 -155019 -172361 -48154 -2688 -326624 213310 364548 -203669 -77000 -63219 -59936
19369 -59936 -222925 261923 -27755 -243997 -58151 -196126 -179864 -70627 -44316 -293824 -231964
19358 -231964 -166186 -1649 -62360 -149435 -42207 99050 -193309 300954 79203 -107672 -270795
19347 -270795 -175451 -188883 -158322 -392513 -204173 -29998 -104660 -213507 -8053 -121666 -119716
19336 -119716 46679 132246 -81084 -293965 53870 137362 42184 -319559 144332 128584 74047
19325 74047 -129 135634 -320302 61368 -23048 207778 -251215 -255390 -237057 -79193 -246094
19314 -246094 -148236 24844 -74756 55808 -333857 64771 -199997 66363 10869 -198764 -87171
19302 271045 22918 -134011 -300045 56269 123328 -95279 -15788 -216989 -128924 -385394 165112
19290 -342157 -216835 -56254 -52916 -300329 -27288 -6757 -45668 -312125 -552822 -228971 -233584
19279 -233584 -1465 -1355 -4260 119765 90832 32056 150019 447868 -246844 -192052 -326987
19268 -326987 -89367 35909 45819 -95349 3831 5962 -77547 103465 -53789 -264188 16054 -138186
19255 53217 95869 -139982 -118311 185645 -24226 -67371 329454 9717 -146327 -15268 107263
19243 -153400 -174355 -5894 -373369 -107036 -97651 -83809 -86416 64417 -79757 -278330 -173187
19232 -173187 -143478 -115402 -251839 -28180 -6733 11728 -133633 20948 -244360 -134609 147075
19220 -169569 -4504 142499 -50355 139627 -458088 -2401 58799 -156268 -148721 180742 -40429
19208 -2029 -69433 -142990 142795 12811 -193928 34740 111161 12108 26128 90010 -275154
19196 115032 37696 47490 -68271 55072 10142 -95690 -49055 -211877 -179424 237596 -177679
19184 5317 -321253 -272542 -170118 75020 64493 68830 -126311 -126318 -127343 -282103 137492 -79000
19171 -76423 319314 38073 -278581 199385 13425 -27514 -18171 22666 96176 -174342 159329
19159 -57444 -27602 140314 -40237 151554 -49363 -54055 -277531 -116999 -221236 -37655 -106194
19148 -106194 166772 -305052 -115300 -52623 -75160 -473832 -345791 -99123 144493 -168470
19137 -82297 -22589 -279864 -23382 256354 -100070 -175782 134250 5632 -59060 -42734 -7498
19125 97439 108260 76215 57385 -172887 -182936 -77799 -233419 215983 -293153 40698 43775
19114 43775 88121 68105 126959 -157703 -132925 -86611 198645 -38774 -172592 166663 25771
19102 -43556 190411 -70431 -123552 -83459 128386 -135508 -3462 -61268 -41898 1925 104170
19091 104170 -143279 -87709 -218167 -28135 -200100 -139595 -237568 -54065 -76406 81695 -68581
19079 -337962 52338 -28846 36430 -106477 -92625 202127 278572 31292 352813 -302139 -35299
19067 -69338 -22255 234216 -203412 -192267 -105549 90814 109168 165994 -134087 110859 -93703
19055 29704 178280 -234996 -132310 2464 96091 -44421 -258612 -40087 -311493 51559 16301
19043 -270791 106137 14060 -77336 182258 -174508 -201116 9173 84977 -129072 262045 47862
19031 -43724 -89849 184084 60469 308681 -116193 -59351 138528 -187157 49351 26657 -39456
19019 -179429 -194404 -5049 -166477 -122803 94883 -80972 160763 397958 56224 110516 -242467
19007 -113035 13569 -284758 -276805 41138 171656 -232798 -211987 -83206 50189 -182056 -205279
18996 -205279 87270 169536 -182204 72036 112170 -32284 241246 55326 180510 -162768 -24281
18984 -613678 150171 125812 -181552 110064 -12826 -34695 -187092 -116645 -22463 -184719
18974 -184719 -75250 19848 -171944 10745 -55053 -10990 -152908 -24060 -107185 178798 326089
18963 326089 -204940 -34716 -129006 116578 123770 -257284 51725 -133844 141516 -191159
18952 -128682 -63685 -312602 36290 -180229 -251516 -320929 -71395 2423 -273148 -159054 235106
18940 -306606 212846 11725 -257904 -130503 61897 -108725 227865 -265619 -32196 -95909
18930 -95909 -95956 -83574 17149 135210 -43659 -261723 -93939 -211277 320578 105523 -120267
18918 -187043 41506 94791 218496 -165329 -103665 -137092 -136788 -232779 409733 -30398 7629
18906 320318 -39288 -196258 -2615 -270958 -3758 82589 -190439 24686 157906 -67638 3582
18894 -22266 85622 -244869 86886 40530 265300 139128 -169584 -47172 195483 -267047
18883 -410913 128764 -63279 -162145 -398898 5618 54498 -93065 -25235 126853 67833 -119897
18871 -75588 6142 57176 -139025 -318878 -172064 -89809 -279647 299692 -94969 165533 -134548
18859 -72054 72122 259162 52664 738 -132368 -307960 -271900 123350 -30479 78063 -64562
18847 -242230 182611 -10863 274043 -469792 -294756 -77263 75628 -230896 39709 118852
18837 118852 -19564 -299974 149090 -25059 156156 -77055 -175487 175881 -92621 -121259 2122
18825 104702 25496 4079 133802 -387355 -125229 -15528 -264697 248816 -433542 -276710
18815 -276710 -396 -115185 -257594 304317 380245 -198105 67193 -208351 12203 -186521 37034
18803 -89329 -238213 -189306 -32544 46462 136077 -200921 40706 -171158 -297812 -102444 170616
18791 -167617 200803 -294334 -105338 15254 98076 -174755 12162 -119095 -202778 61190
18780 -221604 17505 -95582 -161878 -113193 -417738 168868 95116 -104694 -49887 100797 -108847
18768 -91831 66997 -345851 106659 -47222 -228621 -230322 -161827 372617 -369866 346410 -61870
18756 60866 373811 15653 -7102 -245431 63926 -10998 -451226 12407 95324 -163614 5672
18744 -279828 -236694 333487 4225 -200587 34846 -265017 -18384 -243078 -135287 40020 -59929
18732 -491527 -1928 -261857 -148150 14471 -242431 67732 -119858 54825 72961 -216919 120601
18720 -18555 57550 116290 82938 -37118 60912 86085 -383779 -261538 -41239 27747 62529
18709 62529 162562 135394 -209735 218961 293473 32323 7865 305347 -162120 79556 52518
18698 52518 -161047 -108815 268139 -182593 -264272 -216985 370968 -155965 -29734 -32810 -234044
18687 -234044 -211056 -138637 -176216 -152330 -223060 -76328 -179355 -150864 -201566 -23079 -133332
18676 -133332 -244615 -141587 -132327 138803 74646 -20533 95212 -300795 75888 -88694 86116
18664 6533 -427155 34225 -58562 -213689 -59091 -230531 -155849 -27128 52901 115976 -45290
18652 -526098 4316 -64769 221569 377247 -268392 -230839 388890 -34562 52575 -399 -96603
18641 -96603 -328367 107124 -219979 -143572 236806 -69146 -338137 224487 82485 -71398
18630 -27493 139006 -62128 23288 -89298 -237492 -8084 -376893 245514 -179653 39496 -63191
18618 -182360 -149527 -6963 -21346 19638 209034 -41272 63923 -173465 121807 -130100 -135946
18607 -135946 -703 68329 60426 248684 211352 -82186 -12532 -158501 226059 97201 15871
18595 -70777 48024 -286149 -144856 128748 100 -141003 -30774 106441 -67395 164407 -404872
18583 2329 165292 -28878 -153651 -402152 -174348 -140300 -276062 -166633 233350 11739
18572 -137636 -142291 150830 -34502 -138143 298994 -276684 -183577 -108669 85114 -84391 -19504
18560 -142348 264978 6048 -118629 -113249 -348917 78007 -5344 -425055 -101034 -207169 129969
18548 -410014 79511 -49284 -174654 201848 -16653 149963 -234107 40288 114645 -125159
18537 126008 -372812 -179565 -108163 -116787 -256106 -239801 -35779 -52851 -211000 -105928 -101709
18526 -101709 131132 -176820 97749 -41 -238023 -226799 -140742 -53223 -118929 -104724 -14573
18514 -17202 -155191 117113 -10788 248285 127547 -66727 -131801 -28010 -175589 7427 286135
18503 286135 48561 143470 -198070 -43593 -141838 44951 -68835 -272635 -177970 -84226 30687
18491 -18749 191334 31658 174587 117348 45818 78462 951 -60675 -150192 99484 70305 97403
18479 97403 -125194 -511837 -214501 -110420 -259162 37669 -110973 110679 -25635 2859
18468 -274890 -199576 -3746 -148928 -188130 -275965 486445 106557 -131439 -124882 -25606 112005
18456 3618 -66317 16312 -17050 -331905 -118726 -83290 -102316 329412 130119 -85206 115740
18444 -103471 260989 -196639 -4246 90801 211689 -131962 100562 185922 37443 5051 -100874
18432 139282 -186593 98090 -263027 -158754 186301 -265861 -308617 -306577 -244306 -305798 -30464
18420 62278 23560 -164321 -46772 -109557 -37399 16872 26054 -119028 -168230 -57761 -99905
18409 -99905 -142771 61311 -214453 13821 189994 42692 105980 109760 1684 44030 44349 -83797
18396 -64470 -149325 -108268 -94977 -258452 71732 -68060 -78237 -297172 -249741 -70463 -38826
18385 -38826 25776 -181448 -88426 -213896 362036 -96407 141138 -95859 143294 -92666 54671
18373 -230023 -204009 74809 -28262 -334456 42374 45829 436056 194203 90207 -103769 -161731
18362 -161731 -253665 6562 301295 91285 -318357 115409 129936 9319 -25353 -97301 83917
18350 33238 14622 114134 267162 106104 140442 106302 -117665 13558 217393 -189381 78447
18338 -135384 -117806 -80091 -127397 302729 78007 18048 284725 319340 -168998 -10275 53009
18326 -133810 -52759 -48027 -235532 30767 -157856 125706 -115150 -117023 -98787 -104023 -14143
18314 -195081 66494 199018 -288164 -14316 -106425 182353 292835 14072 -359394 -188732
18304 -188732 44148 81907 -295580 -56779 -279826 -219013 -135149 -92948 256134 130539 -10388
18292 -103226 53375 77853 271879 -181790 -290381 9301 24507 -161471 -133279 74235 49258
18281 49258 215414 -121195 51325 47527 -107933 152215 -70422 110040 -26651 -206407 -147280
18270 -147280 -242377 46721 48963 -130971 -443432 228936 76076 23114 1269 36884 -133015
18258 -223621 235707 -68222 13367 -36907 -90871 144343 63287 -124461 -125716 77673 -370850
18246 -229121 -173527 -16186 106561 136757 194503 -211219 191762 131625 -110381 94122 -256840
18234 13097 -110618 -156631 -75860 85483 80909 81314 -59069 13648 84567 5332 110132 20139
18221 175646 7211 -287870 142413 -357350 138903 -195448 199882 -7371 201697 34835
18210 -91016 96163 -94984 325715 94634 -90515 247567 194811 -298818 174526 31271 -144086
18198 -376568 123079 -145597 -83419 -240713 91212 -195280 -304132 -309778 -159208 89882
18187 -55965 27260 -129351 229434 -78013 141170 -118794 37750 50958 104123 -170014 -53166
18175 -161766 -152623 -111595 -204483 -278311 418144 174923 28273 -17288 184280 155139 -311995
18163 205017 -73051 242096 -88625 53320 -49332 76973 -177516 -109870 -237793 174667 -109617
18151 274868 -266770 -48398 -83164 -3464 -31688 -212691 -259831 276622 73531 102531 335976
18140 335976 -130775 443044 24621 -187334 365144 -240817 279591 18023 -161451 -39502
18129 -175959 95385 -142103 212162 -281281 -80470 -204535 18043 -113924 319490 -259912
18118 -90585 -198025 -150938 -135669 95326 -52160 237977 -53149 -18629 39030 -65434 201017
18106 -195386 15583 181821 -78449 124965 -50154 283879 255262 24037 233675 92102 320069
18095 320069 1329 20534 -6158 6983 -6644 -152386 -200113 145894 -213240 16283 17668 37623
18083 37623 115922 111714 127723 -47120 304261 -154959 -59850 10552 -166603 240482 -87753
18071 78243 -15836 170814 65949 -14890 -30977 78603 178966 96545 231239 -124889 -294054
18060 -294054 100945 94683 148479 14255 256789 304720 -194875 -106143 -68363 -194507 -97899
18049 -97899 -14578 -23120 -25566 161673 192643 -474306 260605 97085 274799 190548 102697
18038 102697 189074 -114324 131067 -15302 -134073 -201910 -245374 11218 4394 -28393 -217763
18027 -217763 438266 -109577 102930 -243456 -150846 59671 -177363 -162394 73334 55315
18017 55315 278453 -45603 106869 200828 -162895 36120 213989 266391 87098 122057 -145885
18005 -165194 168174 -144123 152009 -94465 -181004 -156615 -113281 -264705 114613 122050 -68429
17993 -62529 -213082 195192 -40005 -12518 179655 22926 39819 -15309 -265773 -178975 -187042
17982 -187042 -180290 50844 360779 -172412 122085 13401 -102720 30566 63283 243008 -85779
17970 60272 69921 41086 287546 -45223 -168607 -3699 115830 -78223 -105215 256692 130741
17959 130741 227820 -76004 -177927 -13038 -175979 -367898 -15970 346570 -32428 -139227
17949 -139227 1737 -213860 -11724 245748 -36272 32598 216868 60100 -171349 -100595 44881
17937 166660 128623 -349719 219234 408816 -7983 -65756 -46609 210808 -77444 163150 -20746
17925 44201 23260 -223017 90776 -66013 189805 -148001 257084 95588 299204 90229 -205007
17913 129870 -96023 23110 94213 498782 120731 182679 -116448 -42407 74225 101079 280040
17902 280040 39911 124877 -102590 156895 297316 18219 14106 198797 -6910 -194264 377851
17890 -144087 -115371 -5406 149604 -195945 104236 220385 -50718 -198861 81895 112498 158062
17879 158062 -39066 -145273 63786 -329158 246886 12354 -119209 -151985 1503 35290 -67982
17867 -26032 -215927 -214550 -153239 199060 -121226 35002 -170282 -32073 12767 153308 294934
17856 294934 -102567 -27284 50572 -31286 277323 30325 -54074 252006 -28875 157196 182610
17845 182610 -256859 264311 -16958 134310 -43129 20817 113813 -202429 194169 429016
17835 429016 122841 17964 -36445 451740 138480 273008 88904 14746 -1553 -241764 -85892
17823 -45100 -37522 -20440 302469 78645 56490 -30333 -91727 -127030 99614 208846 -89905
17811 348117 124893 -236635 294403 -114111 402101 -92605 -53022 -95459 98156 124376
17801 124376 -248962 -47093 -12509 -184047 -225431 130867 -96370 143929 -109944 -17203
17790 43826 33329 14277 241416 -167374 8508 159975 35965 11369 469635 -55086 194571
17778 246649 63498 -6499 -219725 270696 -69220 -240153 205207 216966 -21977 -41586 230724
17766 117759 -208097 198621 79487 -5231 -117968 73597 199451 202302 -126570 -119279 -90560
17755 -90560 71532 -9330 40014 -144679 117484 -49902 164615 327927 334108 -27457 83071
17743 144601 -188655 36095 310371 58366 73263 45142 40591 158848 -259220 -9903 -16445
17732 -16445 -110760 183484 -178089 28004 55174 -107426 191640 237397 140958 -1622 211407
17720 -80326 53607 -177026 95233 127074 65456 -104351 371613 90178 -199333 80225 -114673
17708 366946 230868 -190282 116772 -10143 -69384 -120552 38095 193360 321 94088 318279
17697 318279 -42366 120786 283888 -5529 159175 221469 -61562 -278554 167136 -132008
17686 -16351 206249 131872 -256774 190134 -19894 -1018 -428062 222365 -138478 342073
17675 354864 308761 184526 -139905 -194084 188077 90738 323183 36392 112898 -95679 230066
17663 -182854 -11319 247390 -75553 -82850 -73646 273673 -88449 281392 350373 -44619 472892
17651 -23361 -238458 -328647 76359 -102741 29706 -236484 174855 202796 356512 283331 -20036
17639 170995 168352 287923 -212986 161756 104520 143817 181619 43275 185005 68759 332746
17628 332746 168637 -81906 217670 -387802 155495 -50761 350619 -167270 -31276 128040
17617 258405 127562 62533 360430 130839 92858 73470 282186 83948 -80243 -64724 256568
17605 219416 10584 4566 169456 128230 33756 -37544 34000 1189 -355880 130970 -51380
17593 425221 124332 96155 351988 150803 220890 -9649 -75111 150889 138468 320287 -60249
17581 -6373 40097 36715 -70719 -23955 373929 390408 -10598 160544 135227 200385 134617 55556
17568 110444 86793 366654 117967 -78987 56511 91733 28083 -17556 -90125 286979 104160
17556 76367 -64027 295033 287796 -207417 41873 94843 98326 -181066 43237 236353 -66536
17544 298082 279887 161872 5440 348899 -55138 398824 -82423 107831 -30669 52452 -199155
17532 56363 -297650 79494 -82099 416623 266985 -248380 -30948 -305076 38994 290963
17522 290963 62040 -288101 179206 38013 90149 590739 151844 212169 -43676 -221961
17512 -221961 216362 126712 187565 224548 128037 -154971 -220851 227803 284608 -107559 109958
17500 36055 129826 191543 256679 -62213 325850 195722 216354 139593 99980 237051 407757
17489 407757 237259 83552 275747 434845 429274 326801 347825 10488 106424 17116 -45500
17477 111122 10792 -33347 226438 386713 115553 70534 585598 267660 293481 384590
17467 384590 -110430 426236 302581 363046 215554 42631 205851 234447 107188 242899
17457 242899 28119 292755 315459 339274 293250 -4550 360373 404152 765692 413005 337582
17446 337582 172706 322070 35816 131756 397769 140407 237061 256591 280093 371584 -4181
17434 35412 325381 134776 235677 149184 301563 396957 -89387 455697 148686 178845
17424 178845 427913 482675 249284 602336 56219 307405 1397 183673 59307 539252
17414 539252 262618 443969 237193 490789 86205 510793 402868 -75089 -55243 154499
17403 -9817 176931 389681 357901 120382 88998 397920 213003 452666 40971 -65954 -37453
17392 -37453 7892 142091 256277 10884 -57794 240473 221817 766512 -89391 330189 456153
17381 456153 -61315 381854 214147 210375 17246 88452 -78321 -126421 57500 189289 468121
17370 468121 131556 139931 263975 230846 131380 518842 168142 165128 47685 175369 108605
17359 108605 89112 346982 25173 373955 317027 -60202 195052 309684 415162 -24973
17348 195717 70464 483633 -199761 -24278 184402 289353 193369 466172 69873 164506
17338 164506 221024 64047 335351 320225 60774 -17499 -67093 120178 86332 11146 429927
17327 429927 87136 320362 80518 156539 -13765 255861 156058 459926 310200 380796 193326
17316 193326 27737 418417 112723 154844 381215 518968 78812 243173 83209 173183
17306 173183 643140 101089 -202754 188179 476681 104617 162936 367952 433322 407667
17296 407667 391214 191445 135661 169664 321676 125328 209107 -15332 4949 169720 39213
17284 358209 225337 490132 256359 115590 281606 320088 377305 370682 149898 7816 656387
17273 656387 436788 414388 240883 334556 136275 691266 528445 -59063 399941 484643
17263 484643 315358 294863 314465 685336 553548 462477 36559 288998 150040 322204
17253 322204 153098 170519 325283 221131 388731 166366 464462 372764 391062 190832
17242 348041 302352 480839 296256 467986 519652 217429 187703 99086 334330 115002
17231 4626 195755 727502 674529 218515 361040 161314 36304 486498 -18408 227369
17220 383906 548198 457096 -85668 230112 60179 408280 478329 190133 241835 370054
17210 370054 469734 253526 129505 348456 399865 297358 3125 446247 139277 428739
17200 428739 370077 399498 148438 131590 423110 220550 215073 307198 442456 421680 479412
17189 479412 3476 435278 222143 76900 327977 457487 654637 461000 723131 277152
17178 338771 433456 223595 509991 692290 465656 426466 306401 301880 432496 480913
17168 480913 533853 451455 465706 355027 574442 431537 526968 720391 525400 199666
17157 622161 515245 217474 597778 383977 337050 259322 452527 310469 416255 237230
17147 237230 381513 608216 596567 128134 529479 394354 326563 588037 854801 546101
17137 546101 303114 748345 597351 649535 612639 715817 505593 396529 136481 296016
17127 296016 178214 548568 522444 820942 777410 170397 591813 681785 472196 445333
17117 445333 667101 459709 306110 320628 516566 597758 781672 525653 512312 623724
17107 623724 484761 507467 350932 836077 431325 212816 614963 695519 814501 549345
17097 549345 638496 482463 718133 329543 543722 579133 572093 588203 610749 584165 894373
17086 894373 445045 738629 295065 455531 540828 553585 820792 470917 857200 926327
17076 926327 858504 883252 728097 850955 471230 962068 1133013 1029415 610040 600571
17066 600571 431540 533859 1122744 811413 656373 1191136 913707 726837 1078414 721013
17056 721013 1055161 631329 783588 625154 848717 433571 911076 1065989 299813 346346
17046 346346 635713 983208 642391 608431 819218 619869 1142895 734753 864328 819641
17036 819641 1051716 1042088 808362 345226 868108 678882 878464 879579 894310 790122
17026 790122 1026587 968004 808972 1102067 741839 743603 1084062 870886 973303 1059203
17016 1059203 797505 624954 844730 952335 1135114 844108 694829 1088660 817635
17007 817635 1100834 1029040 974295 808766 1003999 993066 894249 946042 669327 1044187
16997 1044187 1236054 825946 652022 1003086 1084748 957785 849623 1228409 1236073 1305919
16987 1305919 967186 1100464 1084362 1056441 1201260 851216 1136972 1303780 1012231 859919
16977 859919 1460509 1127539 971424 1208861 1125914 1060460 1070831 1254803 1216187 1208833 1433466
16966 1433466 1665970 1156555 1157040 1131489 1521805 1291567 1099769 1376413 1378547 1282531 1498958
16955 1498958 1365070 1285259 1473318 1322755 1216886 1329884 1493590 1487980 1381247 1810137
16945 1810137 1488695 1390139 1588565 1397985 1652251 1657789 1659010 1564030 1513789 1427352 1636030
16934 1636030 1571262 1750312 1675386 1901265 1693861 1677268 1495823 1747356 1625649 1940972
16924 1940972 1783080 1891775 1644996 2327773 1971387 1795987 2065615 1792379 1779898 1748944
16914 1748944 1951396 1857429 1973787 1749520 2020786 2227987 2084644 2200183 2107899 2041153
16904 2041153 2222009 1934480 2066391 2109470 2432591 2404387 2358309 2332246 2438511 2238504
16894 2238504 2223528 2625643 2239795 2222196 2273762 2361380 2243808 2589759 2694587 2554445
16884 2554445 2961415 2834990 2848311 2751342 2900273 2799577 2595801 2971586 2574828 2613703
16874 2613703 2736937 3004824 3157094 2925274 3091359 3166290 3010800 3224201 3375409 3213891
16864 3213891 3383669 3722891 3224627 3532520 3432413 3884715 3508004 3683333 3936857
16855 3936857 3893640 3379641 3538781 3960353 4308766 3986673 4481621 3937902 4147495 4215627
16845 4215627 4634273 4637391 4465466 4474323 4629146 4313882 4620368 4691046 5088739 5024920
16835 5024920 4851514 5091933 5388724 5260452 5311916 5624386 5384547 5693366 5872562 5791271
16825 5791271 5782442 6145244 6145732 6235768 6272148 6287916 6541988 6748709 6632990 6692333 6775735
16814 6775735 7431782 7505036 7622206 7435881 7737797 7813791 8253353 8378925 7891116 8471127
16804 8471127 8512075 8948275 9142135 9211938 9314975 9431058 9477159 9999300 10070613 10302009
16794 10302009 10493436 10905186 11100045 11376110 11544745 11678653 12504208 12515381 12706157
16785 12706157 13015488 13638307 13871929 14251882 14628245 14698996 15529044 15672613 16193737
16776 16193737 16797024 17197082 17426258 18461038 18617101 19058816 19996908 20309059 20840594
16767 20840594 21344005 21848355 22880856 23257573 24428928 25216481 26030027 26951897 28339303
16758 28339303 28770184 29702482 31146482 31999148 33119627 34503686 35759218 37002715
16750 37002715 38477436 40157010 41840117 43158907 45080177 46778405 48785573 50867747
16742 50867747 53379525 55481352 58120449 60115523 63006102 66050237 68863598 72038633
16734 72038633 75250291 78699490 81993121 85397732 89371415 92912208 96970171 101193786
16726 101193786 105084031 109001473 113115685 117132787 120962440 124757792 128620140 131557682
16718 131557682 134546281 137225342 139214976 141119798 142171027 142925308 143081937 142705836
16710 142705836 141695355 140124011 138028742 135609512 132627564 129675192 126173727 122547831
16702 122547831 118402775 114624775 110393099 105930523 101959718 98037266 93933793 89708299
16694 89708299 86138385 82147410 78295193 75175319 71660511 68341761 65792638 62527422
16686 62527422 59995212 57223579 54409390 52387885 50226108 48059944 46038664 43864751
16678 43864751 42441675 40147189 39075815 37223835 35688138 34436841 32968417 31721483
16670 31721483 30862191 29354425 28793839 27269439 26455677 25459921 24523735 23576599 22835776
16661 22835776 22139041 21392937 20741931 20041029 19234780 18941344 18076951 17770420 17187480
16652 17187480 16793938 16008659 15751770 15329045 14451502 14548069 13575542 13648309 13269788 12858521
16642 12858521 12473475 12088110 11742451 11591124 11405431 10752806 10768681 10421849 10097197
16633 10097197 9979630 9799898 9265826 9296686 8916289 8590645 8789019 8373212 8310188 8020168
16623 8020168 7837493 7582465 7363887 7122071 7246494 7246413 7095030 6754906 6854274 6544281
16613 6544281 6403241 6207538 6036762 6225498 5755609 5737893 5689117 5426618 4943754 5288323
16603 5288323 5257860 4900295 5017415 4904091 4943782 5114410 4950647 4743595 4720332 4428818
16593 4428818 4448007 4408984 4028540 3988234 4104594 3854790 4110697 3889822 3917834 3768914
16583 3768914 3625147 3671517 3589583 3392242 3293958 3542256 3481599 3382551 3361964 3177918
16573 3177918 3356295 3263672 2897416 2854778 3170093 2940057 2786785 2637461 2641864 2775118
16563 2775118 2723660 2179147 2288931 2697728 2461137 2383122 2549383 2702861 2141959 2354580
16553 2354580 2148162 2140737 2390329 2647966 2198317 2154563 2288791 2103141 1917143 2355171
16543 2355171 2266167 2216210 2299076 2130702 1768187 1964233 1992881 1996587 1648338 1939081
16533 1939081 1888516 1885913 1839411 1863166 1320346 1769262 1636741 1576964 1519609 1512751 1631850
16522 1631850 1573011 1669215 1085649 1240152 1605668 1810351 1254530 1551000 1781310 1208987
16512 1208987 1517107 1432086 1368614 1204114 1190646 1317577 1157310 1706146 1218709 1139358
16502 1139358 1013834 1254607 1288251 1446650 1345664 1211116 1151653 1021261 1478503 1176936
16492 1176936 1318521 1230121 1038959 946733 1015734 855837 910606 1054764 1210922 1093414
16482 1093414 937488 778175 1169872 1157737 696842 709067 945559 986900 885299 801186
16472 801186 992066 736386 645345 1025433 932204 1088372 949951 936660 1070126 827866
16462 827866 1152344 980548 842730 991292 776377 1030919 715820 674518 766622 532505
16452 532505 709360 639468 726579 971491 727168 859743 591857 802238 751102 966816
16442 966816 610969 1018745 631601 795850 890869 998839 780162 642876 673053 362587
16432 362587 735964 570238 622056 351897 627849 106044 779314 522555 830016 876562
16422 876562 593830 624062 37145 629691 452729 738575 531140 519938 423000 637535
16412 637535 474581 549001 701641 500335 786429 507079 410391 669556 479629 634005
16402 634005 196365 476870 786502 316746 471995 574811 491952 241230 344993 537159
16392 537159 700063 796824 466818 151805 704101 427893 375830 204529 471717 533893
16382 533893 263683 725393 160836 371999 267776 755089 318796 406796 474031 403651
16372 403651 648740 252977 486863 404389 465042 449843 412283 466010 416028 797272 455321
16361 455321 330366 436183 265795 323341 212534 202782 291421 617554 20686 199040
16351 199040 557867 -56158 332332 408345 169240 228365 231701 276096 373646 444786 571026
16340 571026 244279 335772 382258 300393 237423 203663 159798 478472 508910 263319 473059
16329 473059 214273 627612 157400 480168 -266 649940 401099 -49448 587560 351316
16319 351316 168923 293960 451961 240372 235528 65508 407884 364227 102621 299691
16309 299691 351434 485097 26900 197671 284300 382067 91445 561178 187523 252561 237132
16298 237132 211375 -83595 97651 119338 380751 275470 200896 103832 -70193 237380 409907
16287 409907 449541 370311 217656 726767 877529 927060 665423 822059 89335 200724
16277 200724 393010 113407 385436 -6135 203739 205758 -82531 174501 -50068 287157 186229
16266 186229 229440 421996 621657 148262 643571 181305 38972 330761 228864 290644
16256 290644 197821 282298 94181 -63057 348429 161814 -145971 45944 164396 394212
16246 394212 89209 -70677 297393 366865 41937 95379 189531 165860 38572 -181634 319026
16234 186491 276279 -55814 363860 5427 2349 -28940 305475 375793 236564 222324 -78475
16222 134628 270158 -88095 31869 177036 180623 -78388 -7466 134956 101363 341915 70502
16210 217007 167591 52784 50431 317806 42806 -115476 90607 68755 275085 315189 397189
16199 397189 -52931 7643 5810 58878 193681 237024 41350 27267 117927 117583 -169883 -105024
16187 -105024 986 111715 -15585 233456 -230171 87332 46511 139075 75040 215929 -72349
16175 538219 30600 -247774 -261647 -160966 84557 3140 417686 12650 -231319 -100248 -92213
16164 -92213 57735 125451 135552 30895 132110 -147855 -165761 -220844 -123011 -195411 408110
16152 536287 234887 -188280 43980 -5963 130393 -51216 154330 -165128 272218 417361
16142 417361 40260 109029 41128 108701 -62678 296644 -339726 -150421 202613 134068 -143006
16130 135829 223997 58291 429703 318223 61148 6831 -161337 93732 112175 135180 188122
16119 188122 66792 205044 215330 150243 97938 211128 239694 319105 -43921 -256394 -29875
16107 288736 -149207 80197 33009 124395 165570 68842 170649 38912 -41151 260204 51418
16095 -279043 45619 163279 85390 390392 216867 266748 265266 274259 -7290 27787 -49470
16083 -37981 359433 232344 190620 -60046 -126971 -263424 304384 105473 562946 88050
16072 118487 82716 74408 -14623 -164818 66025 323693 -144444 293734 -74651 181013 121927
16061 121927 -25389 255076 -186324 87862 167701 332743 30275 -5152 -100294 187432 277546
16050 277546 214253 331804 77779 55653 199052 257346 103246 330106 216576 -21753
16039 98637 253308 116686 -62462 143431 178712 122439 -61918 -59610 -238735 -19776 -239681
16028 -239681 -301015 27095 -27321 -34273 113860 -148286 -41507 84872 6428 504617 -160363
16016 -240609 190790 -451519 -59593 19295 247040 55960 105855 -111832 -36375 -33682 -93323
16005 -93323 -238626 -19278 46773 86501 -92015 -118278 -267849 42674 361432 -246714 -112463
15993 -46817 142532 87905 -94047 -39304 186655 -70604 -42800 340276 147957 -130479 216416
15981 74584 227144 148598 -124578 15459 55473 67277 -6039 15500 -44436 20090 -179238
15969 27097 -58660 51783 93721 299272 -381270 -291288 -123647 100514 53296 24388 26452
15958 26452 123119 -61100 -52491 -303942 -70093 -133580 22543 120769 130637 -107983 92637 80234
15946 80234 73342 -24262 126365 -27432 53773 120497 122915 -1872 -96854 77341 -60804 118861
15933 27519 -157320 55108 -82465 59743 14466 -87243 -63190 161227 246539 -178586 180124
15921 273702 -12122 -57026 -54856 -240113 -212595 14406 246855 -309763 -345768 -252439 120049
15909 -23141 -87905 -128793 -343617 83989 13138 -358663 3349 113371 -37918 -99901 389527
15897 167368 -2087 152285 -53231 235619 189938 88687 121773 198704 -161561 -189521 156889
15885 311602 230560 -43201 200976 -201428 199806 -267711 -29619 -23094 67745 -83979 -88716
15874 -88716 159411 375078 92731 -51318 171953 -101494 -281271 124682 -314697 202461
15863 -19841 -86145 109897 5343 284295 97194 79240 -82523 -115184 -162524 4456 -2726 31259
15850 12054 -316371 13202 -18475 -89650 320453 203357 377413 277060 41970 2947 318694
15839 318694 -143234 2186 -74567 13015 97991 175854 -68729 101078 -192458 -6489 -60415
15828 -60415 -109684 -93125 -30231 -25567 258625 259302 -283386 13090 -1792 -46892 170088 -63551
15815 -68075 -103244 -69020 94885 34902 557106 -204701 76084 200550 -75185 -271952 20142
15803 95332 7353 88429 154572 -192100 -64836 14845 79246 7976 227786 -356770 16335
15791 -36190 -103569 -100344 275073 -11940 -76011 -35602 -53129 354632 -335766 29673 87166
15780 87166 -268118 -79639 -27029 106063 13468 -34638 -173301 223546 -1078 59186 188030
15769 188030 111244 194947 121123 -249880 18502 371544 -295102 -101355 -161890 47482 342538
15758 342538 18726 -144187 266251 -18405 118687 252397 361793 -210613 -104690 -74453
15748 -74453 205882 -73701 197131 40821 112678 58018 61656 -190775 218816 -87317 283982
15736 -50872 -41159 -167351 -31263 -282153 455847 25504 80746 -82288 315509 137335 77783
15725 77783 -45826 31398 -56288 -138376 -216888 389695 -213380 50221 -98436 -4917 122820
15713 -265327 -154841 -20641 -66085 -159465 -31659 2999 52921 408448 -166322 81699 25459
15701 -393151 167208 139640 154411 -14805 -366527 59758 -50576 181000 92758 52974 -110865
15689 94606 -117892 87451 92069 -469 54033 57896 -62408 -233610 -233323 -79580 39136 -80856
15676 -101223 17649 478235 -43937 -114488 108565 -220622 -89815 -192521 18774 -162831
15665 -137921 -56943 326183 -25730 -12918 -7893 -181315 99370 128858 28877 29302 -7703 160885
15652 -220375 28405 97957 91772 146126 -21996 118588 -148075 303111 272107 -6223 68637
15640 210907 -244077 -39601 215364 -58656 84931 151887 -69886 -197809 84623 -122787 -96805
15629 -96805 -280921 -19686 152997 -108300 240640 105136 83764 -3948 -152561 237605
15618 -111127 -155678 -19760 -7933 70756 -66689 124668 -237366 -125540 -138524 364260 -19906
15606 -45282 100087 -48921 -68383 91020 57604 35759 208182 -269162 161077 103264 149744
15595 149744 77190 27377 112268 -2765 163525 251042 100931 358750 -77728 318196 56829
15583 189825 32655 203193 -119947 -216034 19858 6344 46189 176050 133744 261245 -63490
15571 -59615 23835 -254493 138693 380497 256077 91169 -45141 100283 64607 18192 -58097
15559 -87083 81968 -195516 -55022 34125 -47576 -7828 -87061 30588 -64527 202127 -28736
15547 30103 79390 31714 42602 -212446 108321 144618 211831 -120346 280798 -22138 -131788
15536 -131788 300242 348213 -31115 434199 133398 -71314 -72900 198497 47455 100059 205857
15525 205857 72158 303769 224885 99306 32842 -77586 -12291 128305 197646 -139210 236422
15513 350224 67650 -48816 205944 336739 140471 10954 68042 297231 233229 163741 60318
15501 47083 40321 91233 -21853 -89234 71668 13884 75910 10898 238662 216 142745 27020
15488 289692 47896 53117 -28179 110380 173638 -151886 2779 -99258 -144038 132683 -38378
15476 333390 391084 291447 98666 -111205 223942 -5538 -166429 -190515 44222 426999 -8745
15464 -204331 -47784 277668 74206 224456 195220 190046 52030 -239743 89059 298347 304715
15453 304715 157274 31819 258000 184477 -89232 -116374 78220 -160082 287158 261690 146754
15442 146754 -133276 101157 166284 208983 260968 43730 -51667 -26844 152285 184707 -165786
15430 72811 94031 4886 135642 377912 214167 529435 284323 323147 176687 116070 3886
15418 26850 194363 -62127 32241 100300 182968 94226 11260 312227 138443 164183 40378
15406 -3504 343952 154366 265813 205388 33957 129790 241130 41067 -243505 68786 -7107
15394 209846 62697 -60407 118635 -73045 151288 143347 1656 14071 32188 -67931 193724
15382 263142 290691 248648 283036 381522 158010 305406 152367 408195 -100505 236518
15371 177438 80700 327898 317939 -166166 377075 37145 72174 282128 -2363 258697 41538
15359 367975 278410 363445 26254 98834 258607 168357 123723 502943 133310 50011 247374
15348 247374 122382 171655 366733 383672 139892 -171223 76280 -152025 -7900 133948
15337 104247 22157 154965 133613 211035 149933 117536 210336 194141 235321 237073 227862 198477
15325 198477 237168 155466 -114546 325115 243103 223255 169935 227292 216694 40650 113126
15314 113126 -112227 243218 42301 118578 207604 58273 -59588 513027 320684 463766
15304 463766 145747 72811 541330 392538 342604 365097 -34121 285460 -91566 206777
15293 177026 209164 369436 215777 203229 226635 219583 83597 117368 48534 -165219 -22849
15281 156164 -6627 81774 -47549 332246 332561 73037 -170153 658455 159333 106292 315562
15270 315562 -146305 113689 -29124 -195258 41349 279135 133241 279215 407398 -55575
15259 194652 209105 -65397 49799 179958 587100 380782 343051 340692 333611 300389 496359
15248 496359 570494 882572 1760778 1934531 1436377 1898749 1146598 482667 396936 171819
15237 270944 467955 218809 212022 433709 42981 67491 447594 294485 398023 118970
15226 393977 172898 505824 315383 397658 300508 298436 350978 -58035 69470 162386 254134
15215 254134 -80351 213622 508223 450905 -13579 32066 218337 78785 -44692 175449 124885
15204 124885 224580 74330 39668 159122 46471 335967 69412 7242 221857 296454 70728
15192 336860 -184208 32606 70923 260452 268017 193393 -73215 518347 -18601 202639 176357
15181 176357 52126 114201 2043 36237 306427 365877 60776 395901 349836 322247 206073
15170 206073 -161268 184221 -206107 396760 403894 119429 458120 199033 228766 93299
15159 227391 254801 440268 250704 351272 3619 401842 206850 250133 203396 87589 116351
15148 116351 -157357 127847 305621 67117 178401 105291 253226 423561 165986 -167766
15137 9020 265798 308663 277322 286232 -114916 324846 225396 524560 311259 -30858 327667
15125 252874 171752 629487 193491 439730 354099 317123 344502 295670 135942 119274 199747
15114 199747 422256 474282 200789 177341 -18218 329420 133535 256220 378062 359993
15104 359993 275206 -27392 425704 225291 298598 200653 703523 314515 301506 347804 654179
15093 654179 204863 458661 327201 550685 243486 345977 199962 127058 351031 472074
15083 472074 285268 14880 286474 355243 261095 399640 154461 285060 300580 336563
15073 336563 153683 284497 444495 17479 182773 165937 32009 158296 509195 451033
15063 451033 362945 430283 270855 338291 388398 300557 355969 584896 207206 366922 488835
15052 488835 156034 669498 621541 498089 348059 648290 554739 495949 730804 410000
15042 410000 26461 626091 829608 299082 367087 344281 305562 199606 300065 466080
15032 466080 413563 350189 336968 467274 658520 188130 632214 417652 638905 537670
15022 537670 673418 -43383 285790 93332 530487 168023 602000 108694 371529 125208
15011 125890 264170 448086 407504 332134 263338 366257 321449 588881 390517 533822
15001 533822 355912 164727 107995 446548 178690 471005 373261 295079 128252 368062
14991 368062 294892 321570 500709 557114 150376 183373 450421 424207 466579 573416 735195
14980 735195 323383 532938 290424 491949 564882 10202 312461 535242 554686 327209
14970 327209 492229 547262 446113 730483 501124 345350 555393 494717 132501 715174
14960 715174 1075648 553850 616378 887790 1074239 928884 475946 644691 547761 769633
14950 769633 525326 602351 261517 585713 504550 414756 640575 394610 377033 529980
14940 529980 816519 589162 588124 616471 629518 995900 638316 825814 666387 528838
14930 528838 630702 273028 634223 478616 534184 675652 429313 699296 443174 683395
14920 683395 471122 217731 513352 788274 528146 438962 107338 408214 500310 392072
14910 392072 493926 455351 460757 450102 481311 374963 779411 515463 381034 310756 785489
14899 785489 466182 958527 440868 444289 506895 231174 664640 635870 383717 344611
14889 344611 442084 552900 422141 689940 195397 360766 669128 248424 310414 393772
14879 393772 484598 363790 542606 527854 440367 670765 603470 739991 546130 607301
14869 607301 602727 617358 611351 475231 697939 742166 627371 767400 616504 855420 683911
14858 683911 957459 763101 734972 432449 550590 559831 581282 361834 701778 464616
14848 464616 621290 431657 602135 889202 779261 836673 827100 859805 714240 690517
14838 690517 604803 735370 626011 633960 448781 837656 758112 448266 435612 594213
14828 594213 731882 701211 996454 593617 653342 801331 1202453 766707 727378 695783
14818 695783 583073 801503 940702 799185 1096254 680328 473417 781561 715218 745973
14808 745973 500399 949512 651138 582324 428757 1073718 645832 993022 831103 601282
14798 601282 913389 961656 938258 888541 755242 702363 728023 958502 712757 842618
14788 842618 318135 740638 834327 666518 802795 750174 1134578 992466 934086 919209
14778 919209 1180608 1314077 549919 1058191 465520 928925 699343 873439 954935 887341
14768 887341 783920 596200 876298 644454 958755 968654 536473 951125 923315 665720
14758 665720 894453 943403 827096 801471 827888 806461 786119 886634 725640 749928 747630
14747 747630 1098833 1059664 1077674 1076599 1108682 848672 842871 838445 968249 860645 862099
14736 862099 1044140 1181238 748655 704916 912326 739717 943013 1323695 1113882 1055689
14726 1055689 846891 945569 695313 1006012 898662 1287792 1322120 1153306 1031945 1055057
14716 1055057 1304703 1038912 1100740 799756 890144 897765 731919 999738 1118135 1102302
14706 1102302 1011884 1019042 819786 936816 1171254 1086882 1140355 1063306 1077826 1077050 1163721
14695 1163721 1187703 1062267 897572 993801 957525 1138838 1117970 1192020 938246 1212468
14685 1212468 896755 993147 1069103 994867 1196868 1027864 1141788 1087078 1249383 1128406
14675 1128406 1184596 1524886 880139 1147501 918345 1192051 1233029 1235873 558333 1263604
14665 1263604 1132007 1213859 1457744 1286832 1164460 985279 1311980 865469 1132692 1003729
14655 1003729 1205692 1254210 1199669 1280951 965486 1132869 1402739 1259492 1087428 1282756
14645 1282756 1441912 1374481 1332068 1183948 1397798 1345118 1185677 1531831 1484635 1165150
14635 1165150 1157742 1308294 1108248 1387080 1675585 1417386 1273522 1006953 1688793 1352820
14625 1352820 1288088 1171971 1156347 1277616 1446730 1449466 1112358 1669163 1485611 1316037
14615 1316037 1591577 1449852 1720712 1560702 1558516 1713393 1384907 1371830 1533074 1771564
14605 1771564 1321987 1429198 1631617 1522938 1680202 1991376 1728268 1766817 1807601 1762429
14595 1762429 1772442 1667240 1613401 1573973 1585554 1866983 1860958 1641361 1738583 1740452 2128860
14584 2128860 1738177 1889782 1661726 2070883 1986831 1889193 2120651 2206288 2268406 1776794
14574 1776794 1828059 1965395 2329025 2073099 1865627 2129021 2480511 2362952 2238945 2255234
14564 2255234 2242497 2340987 2454036 2579495 2823629 2545568 2647742 2896699 2995977 3338486
14554 3338486 2977533 3310004 4039299 4703202 5384050 7326387 12172273 22096363 39642232
14545 39642232 47069241 16483116 6575907 5632357 4950565 2790890 2041342 1895864
14537 1895864 2011918 2093820 1946681 1925869 1815781 1976390 2191550 2240001 2079953 2157705
14527 2157705 2213850 2195316 2246461 2500495 2129363 2155575 2295818 2690434 2526476 2408729
14517 2408729 2226426 2673711 2660011 2514927 2808606 2551438 2692771 2471934 2856112 3059874
14507 3059874 2737781 2857588 3324610 3051363 3099495 3027525 3254594 3185967 3276454 3189369
14497 3189369 3265357 3160936 3159838 3401852 3568645 3070099 3377789 3385244 3454666 3369102 3406868
14486 3406868 3541333 3429134 3479704 3771682 3602573 3666857 3937379 4012473 4104286 4041156
14476 4041156 3707779 4102170 3932568 4250215 4001555 4072070 4370462 4355089 4395242 4360139
14466 4360139 4236613 4455731 4675267 4602795 4464421 4498454 4366007 4694961 4966489 5241861
14456 5241861 4770240 5045687 4898838 5055625 5250553 5201481 4900783 5490055 5484972 5431442
14446 5431442 5509984 5548982 5633119 5673293 5976362 6014678 5829727 5831509 5951409 6127003 6146968
14435 6146968 6037774 6163826 6414008 6549987 6503376 6777618 6735951 7086440 6813160 6900213
14425 6900213 7307910 7386970 7287588 7161979 7381666 7772407 7620438 7638084 7968394 8076296
14415 8076296 8317380 8180476 8449387 8479102 8909397 8845208 8917683 9071930 9003165 9361814
14405 9361814 9042006 9383959 9805290 9818633 9703375 10023895 10544898 10321135 10867927 11014038
14395 11014038 10978106 11053176 11477505 12021979 11936970 11670071 12304294 12518962 12813399 13090068
14385 13090068 13003592 13222147 13602432 13479506 13889772 14386700 14237594 14520265 15013568
14376 15013568 15261031 15582956 16041762 16339744 16709092 16972546 17365719 17535279 18035837
14367 18035837 18329262 18675940 19283637 19339387 19678953 20610549 20811971 21320668 21494498
14358 21494498 22394754 22618036 22964158 23935389 24494274 24762208 25725300 26473214 26910205
14349 26910205 27721490 28171430 28835521 29538268 30575117 31486785 32153393 33334056 34052431
14340 34052431 34762984 35485364 36824236 37716245 38435810 39740568 41340033 42378738 43285009
14331 43285009 44946594 46414421 47792783 49511553 51125503 52656381 54056698 56296912
14323 56296912 57993976 60677738 62524739 64597859 67126970 69444547 72120155 74901560
14315 74901560 77814115 81096778 84105048 87607512 91028221 94836034 98680823 103053070
14307 103053070 107669855 112650815 117223595 122814478 128550344 134696801 140985674 147755838
14299 147755838 154768598 162805310 170725553 179446184 188801648 198514608 208591222 219570674
14291 219570674 231284568 243137172 255429163 268499480 282127500 295993092 310457201
14284 310457201 325433064 340030111 354977367 369402350 383662512 397058990 410012484
14277 410012484 421709772 431906155 440520089 447015226 449734072 448210952 445686935 443581178
14269 443581178 443109701 439971415 434320096 424858924 413121672 400802667 387442064 372852314
14261 372852314 358192497 343131942 328076227 312837468 298315343 283884953 269906989
14254 269906989 256442082 244026181 232291234 221428388 210305910 199744356 189800841
14247 189800841 180169688 171372116 163321055 156089624 148791082 141778268 135003396 128843868
14239 128843868 122999252 117915740 113009477 108066012 103282381 99143454 94918198 91075290
14231 91075290 87819543 84385592 80896025 77994140 74837014 72155209 69417872 67007495
14223 67007495 64602267 62163202 60228915 58313548 56312192 54311384 52760707 50764178
14215 50764178 49311889 48126506 46421250 45095808 43502885 42236979 40868060 39878291
14207 39878291 39307972 38497835 36898982 35820548 34796076 33884478 32947444 32553745 31472536
14198 31472536 30429872 29853418 28972844 28523097 27950143 27174137 26624919 25776239 25310012
14189 25310012 24703725 24002412 23594063 23316669 22156268 21974983 21422494 20984937 20345912
14180 20345912 19899745 19449538 19425054 18926962 18613740 18098462 17866173 17682213 17204356
14171 17204356 16905884 16393865 16352135 15924068 15714247 15721170 15173820 14671553 14854136 14290478
14161 14290478 14215016 13451715 13458293 13143226 12911975 13099827 12778112 12294259 12728169 11816291
14151 11816291 11882262 11626806 11512553 11530511 11107156 11139523 10609983 10787365 10500232 10239309
14141 10239309 10413809 9795272 10024746 9545424 9536816 9461157 9339886 9091501 8998599 8606539
14131 8606539 8667661 8366442 8539920 8281159 8354147 7950433 8132959 7692998 7990762 7786848
14121 7786848 7722849 7714665 7458411 7186812 7336162 7015068 6771473 6599731 6804089 6680612
14111 6680612 6829203 6684912 6398289 6543175 6314700 6281635 5932511 5979193 6039633 5857340
14101 5857340 5972654 5673728 5596802 5504686 5673217 5483797 5328894 5430279 5733923 5309675
14091 5309675 5232384 5208396 5159737 4871779 5038581 4903786 4976675 4627178 4696081 4678608
14081 4678608 4987291 4704416 4647204 4373887 4537374 4599693 4320621 4529801 4416088 4348177
14071 4348177 3972181 4089175 4053967 4120785 4161992 4195908 3931700 3695250 3937086 3879413
14061 3879413 4061772 4065480 3463666 3688726 3399537 3594535 3662452 3792006 3565492 3323453
14051 3323453 3717975 3168233 3491064 3413406 3394368 3411724 3430771 3478431 3154098 3145964 3040254
14040 3040254 3059112 2992094 2693337 3055239 3174829 3035593 3082364 2935089 3106281 2901163
14030 2901163 2962692 2718353 3127307 2973523 2563434 2521916 2661031 2847623 2563146 2546642
14020 2546642 3289870 2313356 2628954 2533239 2478256 2744536 2572643 2517913 2642420 2277898
14010 2277898 2180663 2268368 2237456 2159045 2396697 1906606 2159144 2115955 2078638 2026466 1768163
13999 1768163 1769594 2055620 1784668 1652730 1729846 1887907 2056944 1993587 2177277 2288083
13989 2288083 3087033 6115123 14114316 30074196 51105532 25274632 10780376 6544644
13981 6544644 5225069 4511886 3679668 3588825 3271997 2701119 2741246 2592986 2789072 2505799
13971 2505799 2298652 2593981 2106929 2321115 2179117 2497844 2053340 2213211 2010175
13962 2010175 2166854 2247373 2138722 2029275 2059337 2156195 1914960 2019158 1930347 1840090
13952 1840090 1895006 1599211 2182863 1735346 1774117 2032469 1829500 1961135 1644986 2041781
13942 2041781 2153611 1912533 1892387 1937978 1938248 1757735 1780959 1682407 1960695 1421893 1592899
13931 1592899 1304072 1398380 1494405 1472115 1617792 1656193 1613678 1488351 2273737 1367149
13921 1367149 1410244 1605483 1256912 1150755 1658395 1376686 1564073 1314753 1527080 1412365
13911 1412365 1811720 1680430 1354807 1532609 1369555 1857670 1724340 1500615 1168204
13902 1168204 1186235 1641004 1220156 1341719 1450441 892746 1002353 1382846 1212961 1153726
13892 1153726 1283570 1324770 1363626 1077948 1168843 778603 1349311 1374503 1076360 1318057
13882 1318057 1106639 1000890 1391460 1060368 1277607 1184022 1308466 1566703 1253052 1266288
13872 1266288 1162215 1033020 865058 1096449 1523521 1188187 833505 1084476 1259907
13863 1259907 885057 875953 1426997 1054087 1050623 746371 765249 1184487 921078 1213734
13853 1213734 818215 1114290 1223026 798485 950986 1221011 905327 889025 838165 1208454
13843 1208454 1023465 1255042 1246008 842058 787545 1050557 571606 843428 751380 717733
13833 717733 1174681 903291 749324 805308 889230 795725 840682 708583 769051 779926 884662
13822 884662 1115022 852888 823251 616057 791461 895890 641296 1047223 931309 553768
13812 553768 1071587 822406 736381 818143 672852 853347 625837 799891 697901 659030
13802 659030 803757 818566 657439 923458 875966 724239 570263 740883 1113794 634394
13792 634394 691131 653869 383271 538733 923275 808228 1059479 358972 596321 348630
13782 348630 806096 1148317 638372 865474 784424 775781 737759 417673 934976 661278
13772 661278 683640 807168 640780 819429 923125 883834 461550 1000801 349221 608164
13762 608164 565285 777575 694776 1007018 218924 605444 211393 639809 762628 637593
13752 637593 746884 660390 608704 603074 501285 449509 679266 427880 589994 515535 653449
13741 653449 627869 492125 642521 858424 429869 780743 821115 731979 611101 458759
13731 458759 516971 568636 834985 649175 821705 241698 510091 709959 723923 440984
13721 440984 729029 630827 436141 328736 513796 491703 252240 682333 561861 326889
13711 326889 480577 1000897 453733 783241 686411 457622 398277 403819 525755 496601
13701 496601 387567 239533 476544 528853 331263 631959 435294 215843 184421 251700
13691 251700 553042 421289 486230 274997 607847 595048 528328 648220 567608 579817
13681 579817 484172 668227 359748 336107 460367 409036 627444 561463 514510 545142 642423
13670 642423 458412 543415 251269 823024 356098 478013 378798 405482 594281 284790
13659 402398 273267 200604 427288 324638 519273 634858 329465 305873 305330 622690
13649 622690 576845 655055 273145 357683 561122 167467 387073 514045 321427 102501
13638 470281 285274 112765 311112 496505 700425 268199 410772 294392 374923 486504
13628 486504 544943 328119 228726 368325 55324 442371 335939 425958 379563 274235
13618 274235 662133 497363 390163 485217 454962 234692 187728 512109 427554 101445
13607 112620 107952 268034 405535 245817 342277 552714 240953 594453 335568 163955
13596 443752 441776 417828 504370 217093 423320 430783 260015 276432 405745 460653 513459
13585 513459 104270 569259 451592 353966 416570 365283 432797 4349 318619 209007 292786
13574 292786 187563 5010 147072 601282 439203 452463 216212 -137691 256616 554528
13564 554528 434774 591885 228009 436266 535842 59650 138636 633076 250760 321501
13554 321501 4876 104636 83750 154318 80253 176508 349563 279225 432339 360375 71704
13542 197383 535684 54778 494415 460246 -105311 -28992 373692 204538 419869 455418
13532 455418 253024 355337 252357 255372 238496 501452 389590 363162 218718 360464
13522 360464 358463 248527 75480 229361 409327 66197 455829 336578 530595 -7056 462359
13510 439567 443894 51948 76622 436320 170647 -1080 455839 398560 57251 421641 -14073
13498 179095 316507 270632 14614 288830 406164 241779 231031 91520 429031 302595
13488 302595 269923 -45398 198957 32901 22954 501007 197975 210909 747 348052 215769
13477 215769 415119 172943 -13131 218745 289812 177797 306168 -153185 212547 235322
13467 235322 441934 9861 332097 136570 494535 94454 284805 161395 241487 184167
13457 184167 315826 238844 214815 -156468 227736 115351 308168 108962 305792 -203623
13446 417525 107565 185334 438476 50653 270927 295715 320901 315302 180886 330837 203509
13435 203509 61679 281284 9344 269905 169779 53375 380437 235206 287574 57429 338781
13424 338781 -198380 371710 228590 24438 -139761 298794 101529 124882 186838 -172519
13413 140955 142282 673237 57968 394817 -213217 43372 20009 138097 132040 103686 183542
13402 183542 174914 341234 313885 205543 246649 233303 241521 396885 98784 73860 -41020
13390 202336 -42885 74885 328817 172540 119916 -25451 55841 319720 184476 -58880 -41378
13379 -41378 169613 27661 190791 242980 3888 195970 423786 20282 219731 457159 208332
13367 230463 365615 81681 487373 468048 45524 142058 529537 199441 8215 83745 -53594
13355 22405 121286 35158 418203 239303 70698 276309 -33642 -24349 -78162 260765 214023
13344 214023 259694 -41275 595554 309496 209734 403145 200921 122038 325990 102056
13333 440455 63270 142068 -131910 181247 78452 325633 -10760 -84891 218668 -65817 224319
13321 337214 388728 350135 213910 -113764 111373 13538 452341 233697 152673 154364 91827
13310 91827 41599 53585 -125589 413752 310688 249421 -12303 -85468 90334 -91824 293162
13298 173050 97779 127578 299711 188837 93257 295179 -29365 -90247 198427 242498 -63677
13286 111341 -25910 57869 117160 294845 114684 140086 127015 -60752 108769 60472 219121
13275 219121 -73309 391393 9466 -2404 249665 -159207 271251 -86597 3048 403508 263304
13264 263304 212516 -305609 87435 82720 184841 139978 -17920 -149444 -237303 96972 -387759
13252 -16348 150416 45555 313438 191345 300515 -33310 288741 159714 172620 179613 28219
13240 193726 133057 28622 400361 158413 195124 -15561 123823 412795 112586 149905
13230 149905 -170840 236532 203634 -158622 37445 -15735 233160 -26725 -129530 678333
13219 -130445 249196 -146131 14768 -163553 -212376 37534 336582 -12257 -9832 -227581 265899
13207 342617 205305 174458 -216576 -23907 422833 -21129 269440 -28126 52008 315180
13197 315180 151592 103110 151359 186692 53909 153062 183838 103641 136622 173618 319073
13186 319073 -43059 33234 -147188 360647 267907 -99826 107103 123424 52292 73262 50180
13175 50180 -73398 339657 125809 87403 127561 45728 227082 107873 -192583 43023 189498
13164 189498 74960 127273 292064 122773 264688 303584 186573 164095 89518 -35283 -287618
13153 -287618 3373 94308 -62355 189168 324752 331957 76895 39093 -196426 300876 116110
13141 -52130 266196 -1784 117665 -14549 54919 110447 4266 -52040 -304551 31256 -92482
13129 -84917 188980 192509 41090 60587 174410 73690 245203 132389 88186 -18786 -286247
13118 -286247 264950 315904 165207 -93671 219917 48592 224948 67862 211541 64180
13107 386896 -1979 -66585 -155369 -514 67155 166562 293983 -163425 -86196 -111039 65770 -60960
13094 -91049 -68412 -94952 169321 -35962 -110431 114703 224226 113709 -12988 -25888 -158162
13083 -158162 -202248 470141 -19139 139252 168300 -109743 230815 9381 19503 -306653 219813
13071 196548 -419893 -76121 -8163 -243205 -35197 -312289 -193613 -73718 199403 -22162 -143169
13060 -143169 -159552 -273957 -36018 -48980 129895 239835 -84696 76151 291633 -111179
13049 -76949 160816 75870 100651 89244 175665 136770 159533 318672 121932 -49585 141983
13037 115507 158395 191788 229531 343503 -44959 -38350 77879 -56003 7352 7926 19285 16080
13025 16080 -43627 -297907 507012 6331 41889 286599 -149059 138399 15191 292835 137507
13013 -55403 286532 129610 151067 29483 58426 83069 10298 59696 204215 264975 -275269
13001 -111292 146342 150404 65719 32354 72897 12728 98522 -199705 12085 212853 246331
12990 246331 -157004 -227982 285996 235551 359094 -97777 143376 -111527 -21915 75770
12979 305412 234282 151864 -221235 190236 -155557 -91487 -46268 -19896 265269 321938 330038
12968 330038 -9107 301574 157710 121315 222965 153224 37856 -37883 -152571 -204026 149909
12956 -57802 186596 302936 -1197 -117536 140799 -263805 87479 18871 114389 245780 8047
12944 49744 178827 -75779 137875 78306 -145788 -88713 136112 -81412 35456 211191 -170139
12932 20625 163047 -365784 132913 344548 60826 105527 149617 173649 369248 166319
12921 47375 150584 93922 -3188 -7481 58754 166412 386449 68399 -54655 248586 102757
12909 310459 -180077 -26061 -343398 -41882 -197690 -206023 90516 -11306 -87294 -219833 -178991
12898 -178991 -18865 73438 128311 137535 -63332 8501 -124716 -134613 -43361 115076 117265 73641
12886 73641 -76078 178546 -153455 344426 -32732 -246667 72888 168243 -21459 34475 206617
12875 206617 223137 13193 -106255 -25706 71813 -282361 180098 40246 92077 245053 -171352
12863 24230 6829 38365 97237 166358 138963 -69985 89843 -74479 -30337 -224347 4223 14887
12851 14887 -9800 243703 -65777 -323314 -88205 -128315 367035 265128 -295592 192386 -203248
12839 -124469 99893 62883 170581 62487 -2932 -232339 96833 52569 51155 111633 182939
12828 182939 1245 20072 -58144 58515 -108632 -259096 313990 58875 -186793 45456 -179448
12816 173167 60042 -217167 -36794 -143687 -189057 -223546 183835 -161568 340266 91649
12805 128325 18466 251337 202677 169985 102564 -33923 -7434 -37416 -251725 128877 -71075
12793 -109547 -4519 -54824 41693 172363 5409 -123829 -72962 -33447 46455 86836 233412
12782 233412 -486249 -100264 -119121 351796 -4166 98564 224434 107933 54559 222253
12772 222253 40622 -40295 -100946 80939 -376059 -34342 -358413 -35677 38638 96857 303299
12761 303299 172459 120689 -254387 356853 -111492 183357 -82188 65000 98502 99688 -79083
12749 40400 237197 27712 -166583 65756 342756 -124027 -53704 97279 -21447 197698 270078
12738 270078 21293 -193681 17387 -283037 29888 62186 152713 258935 112926 189248 57313
12726 19235 75924 7085 -105145 66338 264395 27690 394319 215488 319692 -338043 -84360
12714 -162938 65782 95943 35684 199152 -56481 -135032 297436 201711 45946 -215831 -201633
12703 -201633 -216770 -250553 401250 -54645 79923 221736 91436 -193425 -64588 -265796 118894
12691 -79508 -173045 22876 157569 222637 -21678 151039 151026 81748 14160 -13444 209524 61264
12678 11291 84977 17912 236293 21478 48076 64563 -238799 61836 -132186 -38423 147230
12666 -54861 113334 15815 219592 298254 -554776 435116 100565 29740 12354 -33570 4452
12654 -143868 11933 141027 290696 36990 -34179 127905 94870 -77609 -80619 90765 -211318
12642 134338 233780 65193 -150649 55200 -142277 412727 33470 107736 222330 336717
12632 336717 44292 -270464 61312 95421 348335 259219 67510 117696 -43287 -18225 288403
12620 347817 -7889 20454 75823 68202 -31254 203331 -36924 47729 147722 -137448 -341928
12609 -341928 241179 -134960 32491 -104756 200099 -396521 248131 224576 -247775 -50300
12598 -281783 57288 154698 -163113 193973 994 -97027 -188586 29643 -46013 183465 298932
12587 298932 898 -193067 -140085 62175 -23000 -60681 141673 207197 246859 -164590 -171754
12576 -171754 277381 378428 162686 47146 -95676 -352842 185414 60507 351227 132378
12565 183794 4270 -80164 127619 298865 122130 -90557 -181358 -74933 18467 -100410 139027
12553 -23378 -31573 -96300 57016 8880 206924 255820 -194637 -127426 -4353 258476 -164631
12541 183581 71414 -135807 -93648 -127263 155348 -29659 364539 -213044 78487 73458 207260
12530 207260 357842 145444 122005 -71661 10750 455988 191225 265706 -60472 30051 308828
12519 308828 153039 330392 -58604 53255 -114736 -173232 132070 -7980 100121 -174511
12508 25471 -87699 -273051 202077 119499 -139835 151480 -51819 230032 7666 144870 -89094
12496 -85867 53482 117685 -73265 253952 42898 -159429 74173 150540 37759 227136 89229
12484 -263391 154088 -13048 87205 51066 -177106 -315471 126072 207330 -312216 293029
12473 -135942 -173146 9365 -53967 -219537 165658 271888 -272428 -112204 -34342 -122758 -41934
12461 143652 374929 270288 32936 230371 146452 -76459 -119507 -53037 -289975 -106698
12450 396453 293826 2160 -251586 -154526 -144910 100086 950 -14706 -171342 44498 11297
12438 90406 -110333 3267 212020 -206870 -84147 29753 -232554 120495 -53697 173000 135148
12427 135148 -24634 117294 -142278 8843 -122855 138138 209687 -73716 143396 -164392
12416 -78509 -226442 34409 38858 129109 94800 63963 -163898 -204038 -76397 61944 57566 188908
12404 188908 -212260 -27651 -10243 -135671 -93443 -172356 248743 -85356 40067 346829 -96001
12392 40687 -6926 -88965 243732 -459591 233681 -56479 -161346 -21259 109898 31681 -43200
12380 19018 4797 120277 79752 37710 -93885 15199 288970 227949 201072 94044 69291
12369 69291 82793 168041 -63213 166100 54635 -93092 215243 -291838 -74602 89377 -89806
12357 289836 265863 69803 80151 95316 -148128 -12677 -96678 214784 -41743 -255466 -117985
12345 -2242 149508 57825 -150700 99307 32855 42396 44566 -37081 -9438 83881 275979 -109
12332 -33473 -20296 11842 3624 93349 87182 102106 -198819 -53974 -266170 214386 229503
12321 229503 -4511 -196375 -155927 -19705 -154245 -201892 -434429 -225360 -145863 -298473 -240743
12310 -240743 -67483 -80264 -46484 -110009 73701 236436 111154 -205531 -229963 107146 376193
12299 376193 -45989 -106897 -231392 -27140 107984 121768 55719 64846 90858 189449 168365
12288 168365 -204775 48493 101462 301328 -40735 2405 -83842 -57363 109012 229861 -70956
12276 -123236 -12796 -18538 23798 73098 2769 -220340 -76495 35905 17676 9786 -258596 171377
12263 122895 -154304 144833 192254 -122713 -61567 -133703 182036 -111117 12841 140486
12253 140486 337328 100566 86796 -64522 -1399 273963 26722 -16409 195898 256664 -42245
12241 156421 -308948 71403 15336 -108952 -11750 -28921 17910 23953 -208472 1554 323701
12230 323701 195448 239199 170376 171893 -232730 209600 387316 148671 -185381 200413
12219 -67065 88548 102969 104415 74701 155943 -384883 117969 46867 97897 -69808 -103576
12208 -103576 -228450 92 339106 -169949 -96956 88133 93670 143122 -178371 -78579 54229
12196 192931 220502 295199 249135 -28752 374969 133045 294580 152864 404652 -42767
12185 282938 176242 -142749 -65401 330640 99302 163235 -258023 -242046 129329 462225
12175 462225 -94196 85602 230575 162423 -279314 105982 468340 74287 260765 144162
12165 144162 275565 230602 158049 -74344 -219103 332296 131292 -109293 387042 25685
12154 481846 -246845 155582 -29755 114953 -81538 30934 -112360 88389 219928 128953
12144 128953 -13342 -218142 89097 -113516 21929 -169153 153091 -127124 189782 341135
12134 341135 -445638 180067 -44880 -8917 -118945 -44760 146463 -170045 153750 -113190
12123 343764 21942 6457 190944 -56016 93372 -29509 -284093 132339 305640 -374213 52496
12111 -24874 241914 36674 -53239 250756 59307 93078 -48588 -168119 17889 -31079 258078
12099 176011 -23641 -69247 -73753 -7586 -23946 -110205 23360 -35060 -79236 -70142 149127 -231617
12086 -202018 -161367 31299 -38219 50752 -65433 -170962 -32256 -178229 -29069 -34 57968 -134817
12073 45302 163904 -194376 -51433 150897 -58405 294466 434873 1514312 1022893 273846
12062 281790 144647 25623 66389 180298 492367 -155692 -264229 38766 32117 142528
12052 142528 6885 -87223 -125476 82374 48038 -72724 78514 102298 74954 -187802 85560
12040 -7376 -22286 251642 118659 306966 38036 -121585 -291588 90637 89469 -86223 -245636
12029 -245636 -54834 -168991 -140749 -152813 133590 58467 98866 -92487 25298 -112621 256452
12017 -201927 -72425 -263303 80112 51126 -40135 -8065 187844 -62163 -68029 -47294 281805
12005 12143 1287 76663 12135 -108429 -536727 91194 -99651 27283 2382 14032 -191810
11993 166886 -344072 87901 200805 -124576 -127195 -51956 -232654 171732 -41175 -22180 -16764
11982 -16764 -108750 -330240 26167 -9639 196135 -79567 -299371 -241128 9766 72051 -45315
11970 -307727 159784 -124073 67464 124568 -476666 55879 -15285 -38790 -150295 -325460
11960 -325460 33513 -288782 89208 -268296 21420 -147420 -292106 251127 335 367761 106936
11948 155328 112190 -80291 -86076 91789 108456 -51102 -68280 32604 -177086 -311202 82921
11936 178169 -51074 155039 -510729 -78693 -506 -6315 -129280 -100127 343474 -32288 186473
11924 34703 -324275 -50723 121944 -253459 -115405 59553 -82431 240234 129211 -67624
11913 -153212 76860 41112 46916 126947 -77087 6928 -10971 163344 -81679 -151551 -10782 -49113
11901 -49113 400920 -215607 -37504 241389 -49473 -83492 52515 -15753 177578 26075 -122044
11889 -12627 -43584 -72789 250227 -88453 127235 -281815 47385 -225700 96606 87044 30534
11877 -1571 -155272 199477 47856 130875 160054 -333857 -276182 229631 -259432 234602 85003
11865 -228311 -58203 354421 169735 -382959 5217 134717 -107471 -117070 -195616 78281 16728
11853 -121205 53450 -105492 150360 -129688 -397923 -194228 152754 -372282 104718 -80490
11842 -304481 -68583 9960 41780 -414332 95420 -42178 85630 12346 37152 225576 119820
11831 119820 -39452 -353583 243468 -138376 25484 -129597 -191641 -155624 -646 48436 25864
11820 25864 205960 -256751 107455 -241870 206627 215111 -49260 109132 -12405 -21166 -237562
11809 -237562 13908 221717 115318 3360 -160755 -14156 178784 66431 12241 -52896 -10444
11797 192917 92209 192039 157357 22088 -138647 92088 -188422 -57214 -44195 153765 -245946
11785 -244745 -33446 -75790 204940 -81609 -244273 35170 94756 -405842 -84322 95921 75724
11774 75724 186881 -165157 -364217 78474 -167847 -188221 -324722 153786 -171807 -67741
11763 151618 112384 43843 303956 337129 -252692 43931 98855 -334616 75551 227238 -269038
11751 1699 -240988 -86702 -21062 -242604 -125361 -172012 85203 -34568 -67783 -417710 -51087
11739 -14015 197009 209921 -158251 150075 -3315 388160 -422632 -175828 -38735 -92668 -335870
11728 -335870 56641 -31209 -30877 -80590 78334 -103820 91277 67899 -206452 62370 103242
11717 103242 -159677 -3114 -33179 -56783 1007 -236106 37248 165813 -111681 107986 81565
11706 81565 6622 36882 246846 27205 10918 85301 92193 379967 -2069 6073 -39416 -236122
11694 -236122 -263546 -25977 60107 67245 -40846 -338361 -74782 -266302 -452449 -101121 226207
11682 168649 20530 -105543 128957 206873 24578 -175477 66823 87331 -300115 97262 -207165
11670 271605 6006 -17875 90605 54642 -7280 303564 -93287 -249787 -305752 44531 233583
11659 233583 35285 42717 -455715 -294546 -204855 19868 20882 190500 -209587 49359 162479
11648 162479 286532 -68931 26511 -325709 11998 115263 -13728 10509 -198839 51926 -43055
11636 -33087 -426483 -11238 56719 65907 148841 -16052 155205 43456 306195 -51599 -132374
11625 -132374 -150277 -278636 110337 -136353 -117410 41155 103934 177579 -36871 251476 -60537
11613 -19445 104823 -318477 149869 -81534 -245960 -163544 115243 80 683 -177216 19783
11601 -72745 -44191 -281910 66409 141106 -164041 76275 -160710 -156112 -11971 -115720 103509
11589 -93886 48874 -25073 63224 -86511 -308821 -93682 -94890 -166293 98212 -111461 -14618
11577 12250 -32635 116394 -99943 4314 37542 -61585 -212497 190467 136526 -169543 -278693
11566 -278693 -13086 23255 -122731 -136853 -252952 124247 216718 -38083 63954 -218409 35643
11554 3151 39599 79802 -77425 -118948 -48593 165772 -208444 -33853 42736 142585 -225912
11542 78497 -50057 270825 -13603 102461 213167 58745 -172716 78266 102617 -109193 116147
11530 148167 -54470 -317151 85142 244899 209551 141530 -71813 -76821 246255 -102182 -186913
11519 -186913 -464420 -96328 -11344 -108115 52117 -84656 139710 196451 203213 -81463 -206392
11508 -206392 -109306 39779 -119519 -154652 -215379 -70350 -414077 -83775 1145 -54446 9127
11496 60799 62064 217150 160862 115447 67474 268138 75855 222100 322787 142569 -77517
11484 -1640 199850 178386 209898 154111 327144 47643 -257724 109038 305513 -52261 -45707
11473 -45707 105897 162410 325615 -129035 -60189 104904 294874 164546 153582 -283084
11462 33951 420608 279529 59745 -84035 -87809 113546 -138510 113758 -42415 229452 107705
11450 -52020 218224 201067 358371 42533 -289301 -173710 201200 37410 113504 80476 -53876
11438 149833 152229 -105395 -127389 29449 166615 -182800 -34935 355 -78310 72981 137792
11427 137792 44669 -23968 -240042 245097 329028 -244395 106261 312112 -314093 -67870
11416 -42843 -302154 -85351 72264 298454 -154578 -76170 140371 143360 180726 52768 27139
11405 27139 71102 -165437 -236948 -169528 -187617 -369944 77519 93316 -8111 12927 -238389
11393 68180 252241 40931 86145 -69255 62362 -180692 -68527 -38500 141618 78292 84729
11382 84729 -121049 152172 142070 -171408 -41467 -186 -151074 137558 -123785 -143933 -207452
11371 -207452 -45999 -17094 68120 -202249 -164359 -72213 106185 -113715 177037 63842 112971
11360 112971 158354 242224 41510 -298827 129290 12530 252639 -22022 -123528 26847 -212970
11348 172671 -166812 -67650 -275286 -205922 173569 -275655 -15278 -41714 13786 -474515
11337 -46733 61571 -52294 -186869 208686 38631 -24809 -157277 150294 3169 -56769 -214405
11326 -214405 -246085 -63310 36726 33842 -137166 -114485 -113608 -181818 42795 -177577 -128076 -191240
11314 -191240 -299771 -6428 -201539 187121 -158635 -6120 101820 -236548 -280709 -165676
11304 -165676 92017 41096 287175 -248667 -208524 -361600 41087 406495 87771 -325761
11293 13016 22895 -243547 -134753 -282146 249104 109260 150636 98227 -39741 -71385 -135813
11282 -135813 -175283 -93554 -25431 50175 106386 77844 -163872 13262 -313983 -68779 -22321
11270 -61651 -118411 -15844 -137224 214228 -179636 -29887 -153547 -25790 -36049 153978 322166
11259 322166 -133301 -676948 106039 178451 214480 -264674 -111205 -107087 185921 -49349
11248 -506961 -87900 -39779 22107 127409 -71401 65465 -212806 -159490 39735 -104740 -29482
11236 262228 203619 -27080 -142072 -80339 -118461 151638 -160707 -42024 31172 -164851 9779
11224 -8536 -362540 -33695 226971 -111928 14468 -221269 7346 58950 4403 239012 -509336
11212 -161924 49345 -123286 181975 -28664 -190789 277283 -80312 -47167 -83465 -24352 251321
11200 -188356 -58963 -533283 126949 -188394 278129 -185706 37694 -31391 -190171 -55007
11189 140456 -132204 -33345 -5653 4058 -171317 -106006 53453 -242760 -213281 91038 -28494
11177 -69618 -246241 -106205 -139013 88537 26893 -307180 -49513 -56911 43181 117210 -208176
11165 77092 141323 107805 -241018 -160233 126499 111917 -222021 220636 172870 -177391 131338
11153 -357144 -1414 -323543 158038 34096 -474120 -25257 -22525 -161255 312217 27783 -25135
11141 -143917 -180002 -112601 94057 -71149 344649 -111969 -236206 179351 5236 81276 138664
11130 138664 201761 55899 9101 108279 -85438 -162464 165275 88187 -129098 -244521 -135790
11119 -135790 129676 -4198 55277 -184391 37745 330092 37312 232419 -75311 162224 59550
11107 179278 65405 141081 116417 -111221 71849 -54386 181417 309664 62046 21460 232565
11096 232565 -150191 86440 64643 60395 -7792 -51957 5899 63386 9769 241499 -69492 274752
11083 -77710 224723 188084 120312 329284 136875 -41215 70949 -224004 325462 -241336
11072 356324 -13914 327820 155461 493511 -11863 344294 -46991 134549 70671 190338
11062 190338 530915 313373 277330 54157 87998 420807 264247 212789 386803 285902
11052 285902 632766 204688 450164 390254 463991 398147 630292 575143 641461 57238 696521
11041 696521 505222 412896 550954 505739 724169 657784 470185 729574 606760 576231
11031 576231 411212 390069 771662 411965 528635 530376 605154 106566 368872 545095
11021 545095 666689 564234 518690 458805 372932 223915 358560 359150 181967 583829 256823
11009 444627 300070 477269 545141 411354 228952 525041 169670 708681 366693 491567
10999 491567 297504 508392 471043 159292 438943 383840 416573 684649 649269 295939
10988 424041 355091 594451 605755 574054 782875 493203 653341 738654 730248 581130 768421
10977 768421 1030870 749619 960354 929958 1176741 1267079 1500614 1770237 2147718 1951505
10967 1951505 2196298 2037378 1789084 1656246 1534786 1400987 1204406 729872 860666
10958 860666 660462 847087 1051421 715748 384075 384141 480784 608319 442375 -39301 212758
10946 116067 56072 91058 165368 175427 160816 186743 195609 -108023 56826 -96619 -162632
10935 -162632 -209957 2433 432382 264786 290570 -16983 -111799 -99381 441501 -157748 -207548
10924 -207548 -50672 -180553 243262 -12891 223424 67702 -34466 -251356 346960 191790
10914 191790 -82984 242117 -6815 -196967 143944 -23246 37084 60080 73293 121540 -61952
10902 100321 -52580 -36210 -4064 -131239 -7524 180586 -376650 -62559 64386 232797 -218958
10890 -62527 -129664 77615 35157 -41388 40673 -37911 96774 341162 -92237 241216 -182332
10878 75666 49334 161335 306277 -234201 -255111 -393167 -7574 -390263 -6131 -126327 -404595
10867 -404595 79636 50472 30967 -143884 -177906 5659 -158545 -42577 -256432 95498 232969
10856 232969 62039 -164877 -56217 272264 -73473 -211345 -91022 -288380 207931 -90626
10845 -110303 9486 45391 -137515 -125385 -165968 -140020 -152201 -22 -186282 110878 112335 9190
10832 230111 101484 63937 -188511 43482 -302233 130203 -16162 252073 214022 8492 -86798
10820 -174951 -373118 -101892 30802 175070 -64278 89934 26557 -134018 -27994 77257 -95611
10808 126998 391305 42626 -48025 -206642 93168 4096 -225737 -151711 -215607 -269371 -52385
10796 100140 -70453 153482 -148051 -41878 -288494 -40350 -77980 124807 -149727 -72194
10785 -111705 -478573 127710 245143 38405 -17109 -14529 -81864 -160750 -67073 -133438 6813
10773 95285 24854 -72956 -65532 -110593 40542 52942 102813 115133 52952 153538 -137004
10761 146984 -83101 -211945 -55175 -88929 -162088 138068 -142445 -30607 -190642 -13027 -269525
10750 -269525 -185340 70306 -218015 76570 -201064 110718 31597 152933 16456 -130698
10739 113801 -24520 -127326 233544 -54507 28665 -290388 -98064 84613 -153684 -195545 79527
10727 -37050 -133845 -106061 -57446 -296269 -184584 -102180 -54872 -245474 -12126 -54997 461003
10715 -47979 -52823 -10808 -93121 55146 -30169 -163214 84774 -140754 24901 -59016 20216
10703 -22390 -352590 49782 120716 -324438 124250 -284889 97472 -394179 -76697 -41040 124733
10691 -12274 145828 340539 101369 -95335 -238872 150136 180239 -336373 -79185 -48886
10681 -48886 -209427 3628 33012 -250767 -78821 -134133 -21048 43494 -106939 -123900 31301
10669 -221921 -169972 -124778 -89901 -51339 89376 97452 -68086 -164934 -391673 -508293 355681
10657 -300520 -128820 -223345 -88710 -345447 -157104 67211 -7951 -346584 -342961 -23193 -213939
10646 -213939 -213940 -85252 -193458 320632 -135089 29567 -74342 258949 -24091 34063 -198872
10634 -116515 -266897 213969 96990 41950 -160091 -110640 -127234 153892 142757 -70463 -169213
10623 -169213 -92896 -240523 -458950 -37010 -244918 203785 -164458 -199847 -361239 55389
10612 -336751 62102 16671 209268 322187 -57556 -51108 179389 116784 -287044 -137212 16666
10600 141433 68270 -36088 58757 -127399 -77730 2205 -90668 132251 -50757 5867 -54057
10588 207682 -210346 100481 220910 -239757 -117460 -275175 -165751 -65794 -367339 -8163
10577 -46528 7744 -28418 104082 -6994 -34936 -239436 1342 -160094 126271 125316 121896 182807
10565 182807 -210002 -267067 -47755 -83043 11353 -103711 -195311 -146931 54978 -66329 21180
10553 407794 -71693 477287 -93541 -101880 140009 73164 -60765 22190 -126276 -161909 106694
10541 -86516 -230212 -216294 -320196 104554 -51624 351999 286056 271698 139794 -192009
10530 -176340 -205662 -188679 -13775 -35610 263339 -252458 30753 132476 145131 -425831 -388298
10519 -388298 -67933 -103000 -3223 -337685 -214236 -73588 -20464 -111117 148847 -288710 34813
10507 3153 -75155 20271 -366167 27443 -45967 190934 105988 -302850 73089 83226 213437
10496 213437 -101555 31693 -10217 10556 -101313 69520 -160312 -7162 98098 -523616 -151026
10484 -211938 -26183 4741 237545 -128388 -165238 131766 206018 -181733 -67812 379404 -80257
10472 154572 -41799 -25851 -146663 89412 -171281 -128598 10451 252601 86080 151836 128243
10461 128243 26269 142652 -236047 -254095 68030 -195205 -58674 118883 -27833 57952 -342620
10449 86455 79847 -164443 -43781 150134 -224817 160525 -167508 -148641 216960 -82636 278234
10437 140596 184082 90056 -149785 -61933 -116192 34126 235675 33430 -135978 -14679 35453
10425 108549 -58525 6442 -270649 9619 -139876 32586 -344824 111969 112659 123830 -62175
10413 -197304 -26462 -228513 -252180 -12554 71542 -14043 -204634 -150912 2872 -211912 55535
10401 -137242 -225814 274862 -121414 53046 -87784 -67416 227457 -198435 58627 214054
10391 214054 20102 221786 215146 131874 -246022 155378 399460 179149 81453 -157597
10380 -217594 170545 21932 284787 145640 74811 2757 354211 298212 -79277 457829 307343
10369 307343 442635 243414 -72585 335256 263330 365765 421303 59697 371054 249855
10359 249855 114230 420406 398042 -90425 232957 142197 -8192 277576 437967 577397
10349 577397 119776 225800 239117 81774 88447 392735 42258 -102756 -75853 -122041 -37010
10337 236280 360970 83020 -58508 229553 141165 119033 -120813 12752 -126343 -2714 285197
10325 31110 90101 -3501 7400 -225681 8592 273325 308276 232381 60408 82727 -214678 214645
10312 13427 -106219 264258 -164929 148838 -153257 132170 90918 -78273 -9736 -296745
10302 -296745 -20647 49526 -21868 301022 164560 -299149 -140550 238701 -42255 10671
10291 235255 -460870 -108202 -284523 -49734 -190305 295555 -245191 -70585 -8574 99225
10280 107429 -153704 -107545 -239485 -248332 104275 -80097 -20892 38299 27474 4906 -106150
10268 -17721 28368 -258088 244422 129389 190378 -215222 -317823 50036 -127266 177531
10257 165896 12081 248685 -70034 68400 -26251 -177216 453800 -68652 -82127 248348 132492
10246 132492 46315 -205765 325740 -243121 322011 167256 -38718 -137772 87226 23756
10235 -5142 141682 143067 -108888 124311 6228 -92672 -106584 -40840 227713 252878 -290051
10223 -107083 17156 -154159 130185 -75388 45855 7503 -139310 159299 -426780 -157668
10212 -65670 75416 -95287 -103341 -118905 111482 -147776 -30319 -69215 -247661 -63438 -249801
10201 -249801 -17667 -229839 45131 -124124 227281 -95236 -68579 -99755 -175229 40317 -146420
10189 69828 -95501 -22782 93617 -265534 118713 -111047 131793 -225151 -269164 -33564 192232
10177 19121 -220174 -570113 -139164 256777 198991 -410357 -80807 -36908 56437 -230001
10166 -72458 -170374 -158447 -96545 -12821 -199809 -186404 -327241 -59859 -17237 27906 -144582
10154 -82794 -389372 -312295 14979 -110762 -138921 22523 46744 -114931 -160879 -174391 -137015
10143 -137015 -257695 71893 87551 -86919 -213770 35780 -298190 46260 130984 -229117 230303
10131 -59172 -37051 -163193 -242926 -138503 253592 139964 -160598 -27936 -252198 -127914
10121 -127914 -23737 28418 -429712 -1209 13916 -224305 -78010 117403 47208 -159534 -400270
10110 -400270 90976 -245765 33123 -224642 -138203 156728 -195330 6791 -1980 1951 25261
10099 25261 -36576 -506043 -132651 -44092 95474 -150690 -68924 -16897 1502 -95558 -246185
10088 -246185 -23327 206899 -202039 -43352 -168656 -442015 -168088 -248382 -117090 -200503
10078 -200503 281742 72141 -156404 -92114 90846 39440 -170226 65087 77014 156596 -71630
10066 -32470 -39592 -48831 -141141 2314 -325252 92944 318899 -34445 -25640 -56015 -142228 39247
10053 171232 -14740 -231866 -81705 -20302 -86196 -436979 -156160 -346790 228889 -1931 -32034
10042 -32034 -64039 -156226 -145340 84973 -116203 -58655 22967 286815 46134 -222384 -230467
10031 -230467 -105384 -436821 76552 69213 15367 103655 52267 -164388 -83493 15025 -98905
10019 -64729 -193251 -275091 33977 69008 -189596 88859 -212778 170316 57640 -327773 78666
10007 24311 -33976 -35466 -148710 -211215 49989 -93294 -103869 -127466 -377270 63853 -45336
9995 -246469 45896 -336325 79330 -166908 -78684 100318 -20097 92033 6524 -71367 -44893
9984 -44893 120877 -66460 205674 -235659 -133656 42177 -757056 208757 -142878 133358
9973 -148400 -368022 104363 -49318 157923 129723 -248749 -39448 -66220 -170132 -70083 -193941
9962 -193941 -38872 -175846 -61301 -190143 -15595 7392 -11152 -55489 -213402 -141079 194625
9950 -28591 35428 -218987 318119 138294 -223145 -101847 -210632 -390396 55181 172430
9940 172430 -253336 -255222 -107082 -241484 -18966 -229137 -93998 -93896 280308 42952 -486192
9928 132483 -7701 -66227 -445462 -35519 39964 -245477 110188 -243883 -112912 -132439 -159386
9917 -159386 -124937 -28001 -120321 -3302 72153 346706 -270607 -136355 -307694 -282504 3530
9905 -144591 -36754 -277675 -177722 -66242 -77063 -502922 36020 111907 -103974 222954 -308512
9893 22359 -96501 133172 -271522 -114052 133973 85481 -12885 -82917 110721 -76859 -55441
9882 -55441 -150662 -80370 -149984 -52950 -143710 -82289 -352989 1052 252476 -149748 -55669
9870 21700 13820 10762 -27871 -33703 220918 -100894 -101267 67243 -3293 -408987 -56789 -43077
9858 -43077 -307082 -224030 -80748 -374300 -153729 97140 -4110 -498053 -183399 -96088 -223758
9847 -223758 -180897 111026 -142886 -182204 -236601 -255220 40911 172708 -401643 214485 48341
9835 100410 -385240 -24552 -84607 15856 -439879 -71338 62434 -61518 -152276 -158428 -301114
9824 -301114 -133380 -281536 20168 -375280 -569668 -52981 -332670 -134162 -82761 -18700
9813 -22209 -263835 -60906 2246 100894 -16649 -310837 -234398 92297 160558 36439 -104744
9801 72057 -103116 -150397 103431 78407 80634 110992 -110458 -181488 118509 -77290 900 -222999
9788 -248777 -362176 -235213 -64745 93906 -3211 121269 55345 -55780 -315733 42501 239784
9777 239784 -420523 96 197343 108264 166184 52911 124100 -18959 -379499 21877 -271585
9765 -178246 -63292 159884 -75672 -101758 328547 -4971 -198682 42003 -91249 106283 -254157
9753 -513658 26932 -212824 225960 272917 -106453 -37335 51493 -69108 227386 -28859 -60794
9742 -60794 -116621 -71194 92221 -92506 -176185 -154055 26057 -287524 -81104 -81489 -195644 212240
9729 -44756 -103399 -444709 193167 -143887 -56728 -241763 38737 -279784 -143915 -143477 167164
9717 -158896 -146846 -177987 -107829 384921 -142918 -256093 -125582 -222322 108441 -261246
9706 -359465 130284 -102473 -132900 -386774 -193594 89145 110263 -412050 -94276 145974
9695 -249199 -341096 -26602 -49996 -122658 -76222 -119395 29564 -238875 -122569 -153420 -178331
9684 -178331 -55630 19386 33695 -599371 -68666 38778 75627 -8299 -52449 102925 -24560
9672 -134380 -107175 -139585 19227 -159225 -84887 -75730 -111019 -7455 127919 46580 125674 -453077
9659 -100552 -218242 313906 -209469 -51263 -57357 -66844 -426090 55235 -100449 88876 -38755
9647 -86805 -84581 -325025 212006 228842 -445014 -23095 -81789 339453 126625 -136436 126030
9635 -94752 -117983 48259 44950 131058 5888 -198129 -199801 -198431 -20138 122334 -106135 -267996
9623 -267996 125749 -198185 -285915 23994 29315 228217 7358 -281454 132194 -117839 -98996
9612 -98996 -484135 -297271 -307651 -345230 -42204 115713 32809 259145 -58483 -105779 -154461
9601 -154461 38744 278545 -358709 173343 -211706 157278 122306 -91642 -198021 -39444
9590 60166 -183474 -473434 33978 15872 -92946 -256860 -252347 -126303 117322 -322210 51215
9578 45913 -165492 -182462 41803 171177 -30450 -321455 -13412 -27164 317453 21196 -21342
9566 -224891 157507 -120726 -226489 103686 -45818 22111 260257 -55559 280908 -119829
9555 71418 56864 314719 83967 236522 -206284 100990 -207588 144856 239798 177832 3101
9543 -103567 -78753 -197222 -44854 -30347 -66831 334894 -150723 -117120 -230300 -197668 -245232
9532 -245232 -72609 24123 -98751 -340820 -112439 -23393 -191103 -151753 -107566 -8562 73333
9520 142132 -177620 -535623 -112033 227465 -1030 -237819 -31762 -138374 125994 -191644
9509 -287308 -218685 -279424 -155399 -95685 -81845 -205759 -23860 209503 -151808 183131 -23072
9497 -134363 -54486 -124344 -157221 190382 -40771 -145430 -150322 -96650 -11702 192121 -113669
9485 -288721 143092 -192285 -156290 -414989 212012 273195 32298 82461 -113605 -240192
9475 -240192 -51074 -52643 84383 50483 -260651 37640 -153558 -100054 -248185 -152406 -145437
9464 -145437 651744 -129890 -25719 421978 -31906 66055 -139268 -91012 22178 21816 -174410
9452 194059 119235 24998 -70418 54872 81676 10527 -122617 140009 -251620 13465 -105244
9440 4668 -69935 -81118 -169282 -48764 -278809 -66647 104808 212159 -31687 220597 -36562
9428 144553 -165654 -372192 -23531 -197543 -172114 13253 -65506 52619 -120628 317124 38433
9416 56190 -42109 77643 -250824 -105792 136366 -500508 214035 116458 -200033 -296601 -58418
9404 -213817 -39599 153212 1045 186382 -430413 -225572 8722 -278517 24600 187365 -349975
9392 -94622 -277215 108638 -192357 -116589 -222891 -31361 -120228 -365415 -240524 106385
9381 -47272 -145524 408850 -168842 -96630 -145585 -57245 -21675 -150240 -82412 -243881 -125136
9370 -125136 115254 5231 340499 221377 -367732 -97474 -469737 -254455 -95599 194794
9359 216928 -25933 -42762 -430987 -120263 -399955 -40847 -20098 282441 -63404 -195253 -127482
9348 -127482 -157906 -348833 108517 -205001 18635 -285486 -96542 -84685 2237 169388 -20864
9336 335360 -65464 -17501 75098 -315968 -273418 246337 -85892 112319 131262 -118668 101978
9324 163894 -111786 -115065 -113888 -40036 -200833 43734 28691 -143942 -238071 -30536 -126163
9313 -126163 -555650 -203588 142069 36534 -119975 -168254 -118373 -8875 -348547 130682 119279
9302 119279 -131162 31081 -136618 -162729 3606 31348 62594 27396 -258564 -177134 -218933
9291 -218933 44971 -195717 -350990 -269162 -122304 -84943 232555 -356310 -227105 -244032
9281 -244032 131796 3063 -29336 -37818 -113482 -70748 -119197 175151 -238616 -275628 71422
9269 -312961 -45101 -8271 27898 50488 -44817 -140642 -161871 -164023 -3948 3124 -53828 402658
9256 -134368 -163598 -207798 116263 -287839 -301512 -289557 42257 -175285 -245687 -123954 -390048
9245 -390048 38769 54645 -297202 130305 -340573 -195678 -166763 244119 -232891 152723
9234 -328995 83524 198905 178226 -284423 32832 137519 -89021 -160822 -244529 -132598 126053
9222 -54909 142060 -107618 -264889 135002 -227649 77820 -197442 -400683 -394658 -61161 149267
9210 -225900 -120881 -207498 -148605 -19422 -332375 -41097 -134757 11410 -201846 -50903 29162
9198 -327749 -262867 147247 -24490 -138357 -84874 -79486 -98415 21259 -53345 -80255 257958
9186 -158284 45825 47598 -12059 -168715 -159271 -300261 116789 -56903 124293 -93150 35164
9174 -441137 -394660 -185916 -156778 5487 -62821 -145698 -51374 -101830 136388 -10052 -164784
9163 -164784 29993 100427 221010 -41936 147063 -375305 -30181 6670 -129741 329886 -28629
9151 20685 129270 97978 -222244 140422 -66770 195996 175858 131255 54991 -149967 -100214
9140 -100214 -84901 -32342 -340216 -318507 3032 192 144917 -122227 -150921 -9534 54056 -78246
9127 101698 -231372 -16002 122400 -55437 -62403 53076 78544 176816 19521 -25650 131055
9115 33017 -278368 -299050 -37688 -181522 -28770 -151308 -168889 16915 -34794 -161157 -44505
9103 50261 -219008 -77532 52096 -151311 46000 91201 -230134 -369316 -33400 -223900 -95199
9091 -121194 171730 167394 -23773 -11550 106602 72934 -159908 -418165 -14954 -37889 -7929
9079 -252349 -185705 242497 138787 -122356 188437 70623 -4732 -246244 -2681 -316775 38156
9067 -182407 62753 -69872 -41720 -238963 -200443 -69204 135195 49825 -174439 -134318 -74195
9056 -74195 -177645 -36181 -13469 -197328 -292340 106520 -105889 219289 82833 -29894 -257309
9045 -257309 94870 -11338 -166918 201516 -210743 -140827 -359350 -114667 -142745 -243686
9035 -243686 -150077 122150 58514 147300 -238544 -255634 -4053 -71916 220276 -112814 51011
9023 50655 -5145 57992 -97808 -122865 -77202 213197 -15967 -32737 -44288 -148265 -97461 -123602
9011 -123602 -123130 136055 -60206 24096 -31026 -112405 122315 257059 51485 -137196 -165663
9000 -165663 -69734 -61636 -332061 35797 79269 -162208 80582 96321 98803 -46010 -166986
8989 -166986 -52338 35591 58240 -142745 -216688 -108064 29454 12151 34956 -35417 94561
8977 71019 129376 -65652 -216631 56557 -201843 76331 -163204 112008 -134193 326901 -140647
8965 -39370 -186245 -129424 -163793 -123631 -7562 -148459 20314 78202 28487 20056 -63057 -209359
8953 -209359 -108307 146838 -236522 -49970 1766 -99151 44784 -174260 -61982 -165194 -11421
8941 59071 -125807 -100082 -241712 220463 122116 -216610 -43574 36240 69346 -167066 32467
8929 -119181 53093 -158777 -129832 -20991 -229994 96770 183815 76230 -17687 690609 -33853
8917 225830 25889 -3469 -427487 61057 303467 -240395 -209837 -74542 -7597 57201 95579
8906 95579 -68350 -189964 -114938 -379277 81078 -274317 -405626 -41924 -381197 -192381 89274
8894 -173765 -29475 254 157531 -273158 -253415 -418602 6512 143277 31219 35845 -40622 -145468
8882 -145468 137581 116577 -117024 -16919 -288401 -188886 192656 -181817 53486 99029 -48494
8870 -213000 289402 145622 1123 -350107 111242 -126608 -238352 73725 -271517 -236820
8860 -236820 31401 -58226 388706 -5983 -337464 78649 -104707 115178 -62847 -174080 -58601
8848 -207242 -124719 -133624 -246476 -5913 -14116 -321562 -131364 31 39955 19787 197598 185117
8836 185117 -335645 -81154 212214 -177050 -99935 88714 -81594 -279743 -337436 -134425 -425757
8825 -425757 23335 -208217 -451991 -5878 -131174 -464007 44618 -71039 -138926 -3906 5688
8813 -108777 -28389 -128118 370979 -68967 -398012 49560 24638 243697 190633 43454 -406527
8801 -3483 86477 155401 -342993 50856 -116194 323688 89962 92055 275710 86081 -412812
8789 -195055 -57532 -45042 241825 13758 226701 -320365 -138745 -247955 -401762 -108489
8778 -465817 -237444 -214818 -106909 -79510 22516 -100655 -48863 15066 222324 58931 9851
8766 151698 -197378 -128134 -87967 -257184 158537 -25200 -74727 -337677 124496 -146521
8755 -345144 -404775 -68920 138250 -321453 -123810 91100 147703 -52364 -134863 -164871 18257
8743 -137608 265865 120873 25415 -203252 289908 -376605 -204527 -92415 -223165 -31393
8732 186472 -20355 50922 -157581 615564 114172 -239777 58592 -100605 93165 -161464
8721 242893 24614 34648 -139797 32900 -117926 -405910 -236213 -126378 -44200 -214347
8711 -214347 86853 -88828 -87184 207669 44897 282618 64182 -41614 82393 -274822 -136620
8699 264162 -130190 9618 -242526 -164103 -208808 -103554 -133040 175459 -126293 -20905 -25756
8688 -25756 -133028 83262 56636 104764 -32497 -64491 140717 264551 -9512 -7089 -255648
8677 -255648 -133209 -162942 -7733 -56648 15885 -274918 -89481 -308587 60468 -310226 -18645
8665 -101766 136214 -114823 -5384 -86701 93250 204639 92830 -365065 152872 -408291 52471
8653 -9687 -188698 110994 58463 -59920 -84832 -296444 -154814 -184696 -70992 -115566 -89288
8642 -89288 -157452 -184826 87479 -108738 -173840 75484 -66528 -42358 -415393 -228416 200769
8630 160840 -80686 70215 -125166 -239096 102416 -68784 -57546 -115132 56939 75132 -82624
8618 -125701 -50297 55683 -111412 31329 9239 -259207 185972 -78582 -11621 -68714 -54344
8607 -54344 -159984 63683 46888 28057 113037 139816 -46235 -136223 -182056 -31237 235266
8595 72682 -47104 15187 241681 151123 -56081 -110618 -130749 -326406 37568 -52944 81999
8583 -16536 -113307 141207 -141144 -227107 87981 -49808 -162145 -3153 -217816 52874 -246768
8571 148637 95059 -104507 -315963 -81488 34261 488352 -52010 262405 55221 87880 7848
8559 -83674 -299741 -278878 41624 41588 134545 -148371 -155357 -173474 96328 53182 88583 78036
8547 78036 21967 63458 -257168 -99676 -33521 96834 -14775 -137771 44851 -192058 61002
8535 -80217 82994 -180839 104689 -64937 -343165 30556 177534 -194336 422630 123397
8524 -223082 -206982 125488 4469 -275711 108722 29304 -365957 -296362 104080 97321 3014
8512 -194570 -49780 10944 -95109 33888 91914 -265311 -11682 -233704 -436533 -653644 8611
8500 -102595 105800 -146778 -173617 -134516 78425 145495 -36776 104068 -268373 70695 -48416
8488 5141 -341720 -290476 -28739 52946 403658 -135355 10461 -256443 -129643 -274598 103056
8476 7378 279275 -253618 -42153 116541 -165701 -285958 -13807 -16225 -9242 171192 -120062
8464 107609 -126981 -8994 236894 -35819 -89876 254797 -20990 252595 -84358 -679048 76123
8452 -109180 26814 -215041 -108601 50454 112647 28521 -35124 -323578 -234020 -94705 -318893
8441 -318893 -30920 76335 -71935 -132637 -254004 135813 161716 279336 -388242 27085 10660
8429 21328 5375 -96313 242712 6982 96924 -118278 -79237 -141709 100939 -53694 -43446 -235727
8417 -235727 -221502 -4074 21427 -231939 -306687 248395 -73905 -73596 -86460 234407 -221399
8405 11920 199648 -28156 -34580 96912 -339539 -16747 43143 87817 -128941 252822 -173948
8393 -131887 -104413 9836 104273 114272 87941 -257465 -537987 66786 206225 -280031 180377
8381 -70109 -103855 -145552 144529 -225795 89539 36805 80485 40476 -78092 -126402 267696
8369 73037 -35872 132921 46255 -248563 76518 -29916 198816 115419 -156910 44461 -160980
8357 -164606 5721 -377908 133903 265943 -55572 223847 -186051 201927 -301392 182858
8346 402070 -140999 -348085 -137205 -204318 -382189 -165464 -187792 -167383 -296738 144641
8335 -211066 -105435 -30000 8568 9228 3196 -70536 282601 -66129 -235626 -87666 -26943 -138758
8323 -138758 185774 221159 -93633 156949 56808 45989 -213383 227574 -51760 -110403 -174053
8312 -174053 -386590 -87538 3502 8509 -433961 -161046 -61420 3855 -331134 -307279 -151463
8300 -110157 11335 -105306 146565 -82466 -32430 61617 -140488 79520 10335 21726 -258476
8288 123047 11824 36746 -77373 -152715 101454 -44140 207809 2515 11386 -252130 110147
8276 59586 -44151 16044 210827 484192 122271 109026 4790 -8017 -60973 -28094 39826 170470
8264 170470 136071 269155 -111362 96486 -183751 194043 -12479 155357 -275270 -93294
8253 -249668 -151807 -33123 -130062 -246957 121625 136205 178879 -205639 340022 335689 73035
8241 -66418 -191316 267356 -111938 4898 -257125 -383522 -205046 106569 -44708 -47545 -61119
8230 -61119 -123732 -330884 -38937 -83034 107023 81817 16446 -81262 335415 -64670 -124373
8219 -124373 -50095 -58791 199325 98763 -195564 380809 -57417 -45327 -149128 -93185 -24831
8207 -440672 -266169 -263658 -231790 -557265 -160192 275325 193261 -196902 -70319 -110214 -16364
8195 -120301 -44419 -184203 74589 165818 -30787 -81700 -234800 -168380 21875 17600 -1340 213373
8182 -128555 80398 230485 34507 -16784 -33567 -52909 -300747 121925 -13142 1672 47155
8171 47155 -388626 -17764 -410817 81744 -224268 -73805 35214 -5279 -34198 -146957 -47674
8159 55061 -273585 -355262 -289880 -72262 -240268 163160 89799 95564 -86868 125307 -218472
8147 -131014 224058 264557 -321152 174238 -35491 -26541 -61694 -51535 17515 -105786 41481
8135 -56894 245505 -456417 147994 339180 -309903 -51070 5264 28115 -63593 -21381 -137530
8124 -137530 -276061 -146414 -61141 198627 -165268 36497 358820 -445247 -85162 -392524
8114 -392524 -79726 -42609 -141890 -59252 -256123 36951 -88269 -134427 -156363 57411 -142815
8102 -154037 -245643 -8217 154167 77472 -457931 -88188 -146277 -211369 181374 -47250 -124129
8091 -124129 -54082 -33573 -224046 64694 -103626 -103667 -225385 353695 -221570 58448 -166188
8079 -179517 -68591 -72773 -79036 276335 272620 -146032 -12321 -29480 -232997 -143530 -119392 -6460
8066 379396 -347819 -144676 -3783 -79283 -251933 5757 119140 -163321 -58274 72488 9816
8054 17819 -86798 -166121 -238759 7883 194784 173066 -123749 213425 202428 70776 -154476
8042 66832 46193 185243 -56781 197205 4510 288029 -234341 -12507 -30993 -93408 -37978
8030 289117 117253 -239882 -142362 159631 -248986 -67959 -79560 -114575 -57733 124018 183086
8019 183086 -1347 106330 275889 46625 -80665 80414 170684 -228689 -38285 -230679 75860
8007 -144513 -201108 41875 -339386 -216027 -166507 -70645 -124743 -202319 -6635 15218 348510
7996 348510 -218148 289860 -191954 14630 -435838 88671 -1352 -2835 -281543 103784 142183
7985 142183 226895 12712 -139019 -209996 -81022 -357588 -326595 32745 -112428 -151967 -183858
7974 -183858 -16481 -199114 -161216 172649 -55238 121439 -92150 -13661 -41221 -78950 -43114
7963 -43114 -136060 -11146 24451 98456 -191186 -113353 -22866 128018 -91655 -12177 -102984
7952 -102984 -152946 12095 -184223 -9764 -183002 -20420 212931 -144710 179790 -80918 208149
7940 -249281 -302759 -77286 99753 70550 382 4365 -135023 71769 46424 -291408 -197932 -122645
7928 -122645 -210225 -3465 198131 118000 -225939 -234665 -222263 193936 -125001 -33031 -181803
7917 -181803 177230 -86215 195258 -42849 81512 134665 -145223 -283437 129255 -142840
7906 248924 -349352 -298181 -172833 82089 -234367 -16240 -227621 141087 205665 -87397 148240
7894 -422153 29093 42692 172215 -248563 -8513 163709 -213962 -82812 -120126 -418263 -58395
7882 77777 -43746 -108838 -140629 87249 -48526 -37928 -1264 -266539 102118 -312417 -160981
7871 -160981 -158785 -198202 -194101 188979 -299420 -76414 67306 -328163 -157905 61764 -16308
7859 41977 -165851 29273 -54388 70550 -23771 211436 163876 130765 286198 217022 -66390
7847 -158356 -146943 -56706 206155 -3047 16157 349616 -268872 -164398 76410 73362 17407
7835 163557 -256163 372512 -40744 67599 -23171 -181363 69496 -56440 -59746 -215223 -37121
7823 53470 -94346 -188490 227861 -185345 -117769 -87805 -74259 -179177 -161055 131128 -63308
7811 78017 -250897 410430 -25946 49550 -253251 92913 218557 8766 -16473 48849 102771
7800 102771 -228230 -370397 -199896 -112463 151343 173431 130968 -80597 141878 26693 -61189
7788 66613 -118125 141807 213576 -128899 -48339 120529 -9557 -224284 240531 162865 -334295
7776 -338405 210532 118865 -124534 -228248 -94412 101854 -130 179104 -237738 113338 190266
7765 190266 190859 13311 239283 -114559 46598 -174314 -84068 -215704 305256 -203772 271045
7753 -154868 -100429 -109469 106155 -116067 592301 90481 53138 8087 -93356 277382 -158545
7741 -505835 20895 -90396 35944 -166170 153986 42467 34578 -288536 -202707 33106 290589
7730 290589 104130 -192253 -178593 -21606 -117345 -101643 168043 83139 144980 -237641 -213387
7719 -213387 -193841 -241364 26857 166062 -302344 -131278 -336155 7903 -331229 47718 63258
7708 63258 -27315 -75089 246074 -40810 -170228 -246776 99472 -263229 91418 347157 -180006
7696 -111895 -146510 -277049 129144 -305589 -24244 160530 -209596 -235389 -88907 88941 -12647
7684 82671 515265 -221276 -217826 71149 -155062 -235806 121416 -310758 2970 -90670 15664
7672 -45232 -72791 324312 -220298 16187 -22761 153967 -416059 -273300 200853 162587 61350
7660 -262922 -106491 -44209 2223 36453 -192723 141466 -328134 69401 -49569 -142291 -444713
7649 -444713 -11519 73204 46135 268147 -56910 -186101 -3414 -90391 255272 -105434 -45338
7637 -17327 79049 -246044 109862 19706 -174968 153379 -82867 -112150 -196522 110621 4266
7625 131951 -192912 117307 -17683 69545 -92696 -124041 150634 23658 167693 -158982 122849
7613 -177142 -53937 -21909 115632 -106425 -94940 -285213 77632 53461 -356 162848 59667
7601 -96910 -130692 -187724 -34478 -46386 12701 -68221 -371645 27300 -183009 243031 31857
7589 -27800 62220 44641 -142715 -140554 203215 239431 -441632 -420387 82534 230961 102672
7577 77911 -39887 -190395 52071 -250912 61738 234003 251021 -121139 469017 86312 -95808
7565 -92798 -153987 -27198 -168308 20691 167753 259807 -128156 -104446 -176315 280399 -344936
7553 72901 54041 240327 -126667 -25999 -27094 281746 178147 -255743 358771 -88385 -141209
7542 -141209 -93709 26621 184144 3680 -199074 -7526 53054 128592 -73019 -131477 -349489
7531 -349489 -442432 8744 -61772 125317 -3020 -147902 -250706 76198 -62891 -124765 -257206
7520 -257206 229583 80949 -12043 44614 -243666 93788 -448031 154470 -220154 226610
7509 158615 -282166 31522 129148 171722 -81137 84777 -123487 -225047 -176385 252563 -104780
7497 104296 48885 67482 92155 -25788 222112 -26431 101235 -348944 146899 -149637 99666
7485 -218970 -95662 -52680 -203049 -143005 -118631 -7887 210275 60365 -236652 -103383 -45695
7473 18259 -65581 -79377 42348 60887 458716 295983 -19303 106863 358849 70015 -196304
7461 261762 -215359 67119 -167910 -37248 -103702 -160559 -132743 407941 89336 -164296 168217
7449 -38528 -93623 19474 -178985 61554 -64717 -268241 429507 -200316 -51317 78798 217219
7438 217219 16795 -272700 -53314 277410 -180705 -287946 -63151 319390 149491 3105 11017
7427 11017 233575 26246 -177959 -114786 4696 -133798 -124169 73135 -79250 -142440 -179823 44181
7414 -117730 209007 129985 -169069 224451 -150846 139308 -124708 -114612 90991 -30330
7403 -141386 7172 87991 -258873 -217317 -70893 41121 27560 -134706 51380 -27853 -34856 -229909
7391 -229909 87018 -70019 -103747 -81015 115708 -101678 39015 -145987 -236113 98803 11480
7379 -271431 -327019 26929 -144728 34796 -57941 -202935 -108490 -8084 9646 30361 -206971
7367 80168 -192881 218573 -59339 166530 -344522 -189737 55464 465248 180762 -295357
7356 -108139 28655 -170384 26637 -192227 -208111 143457 308978 28499 -139888 -227193 57709
7344 228463 60479 -95735 92161 -21564 -69796 -167624 199109 80874 -102978 -95576 76062
7332 62182 -465686 38806 -173606 46312 68049 -68427 -165388 30010 -32809 -158917 -98576
7321 -98576 -169683 -46668 174288 -28957 139170 74942 29495 -204023 50098 -28832 -35838
7310 -35838 162491 58744 -57667 40735 -93692 32398 -105381 158852 272291 -124952 145216
7298 33121 362550 64474 655 290943 -101490 -91256 -215200 400872 -151164 -165741 -124918
7287 -124918 -46728 26370 37640 94054 -249209 -27041 -40235 -45289 119967 -66399 -35356
7276 -35356 99348 -108049 -99510 37780 92001 134852 157209 1128 -23176 -161210 -42846 -195290
7264 -195290 -43256 -37793 -314637 104765 5568 -196312 -210630 208173 -49071 97164 -158512
7252 -121480 -183884 48035 18879 -138819 -98366 -30636 25798 -24849 -38444 35528 83653
7241 83653 208826 -151172 27493 -112452 -228986 -273030 396419 -169697 -8826 -96507 -178484
7230 -178484 10193 -30665 220070 -219278 209467 -229285 269948 240656 -121257 -238826
7220 -238826 -195382 76680 132719 -52113 55014 -97320 -493536 -235262 87477 -236754 413058
7208 -15359 48852 126114 55803 -5535 -121872 182165 171087 -258303 -219972 44723 -253284
7196 -185677 -83869 -359466 -100691 -38187 198313 35490 209606 77349 307130 -325439
7185 191319 -43154 -39058 305607 -161668 -161499 95192 -218300 -262624 238653 -159231 54313
7173 125751 213704 47944 14780 262993 100471 274043 -78755 58127 -31853 372929 -36214
7161 94150 126098 -83644 219646 -50471 1190 -357535 -216419 19432 145861 145282 22808 372325
7149 372325 152934 -318448 -194432 -122606 115459 111093 149146 100986 2667 32135 -151866
7137 -104700 63492 -10793 -90679 163091 -88105 11712 -163126 152703 27880 -1526 -22895
7126 -22895 188762 56958 -15807 -110005 -266536 25176 63828 -71962 -323182 -111008 -46883
7114 -40699 7111 -430875 272542 -110000 -15192 183705 -160344 -128737 105585 75910 -5060
7102 12968 62050 -69664 136948 -100949 -72893 -45772 -305134 -235250 -87924 113383 253306
7091 253306 -138125 -506085 -72339 -96869 -61905 -359871 -113516 -125683 140828 -34966 -308751
7080 -308751 -73413 202587 402477 -46334 259224 364598 312524 38441 -139992 -74596 75839
7068 -70626 93633 -252581 25685 -53229 210642 17813 -35273 -30216 86625 119661 106711 190773
7056 190773 153792 -319589 -47941 65939 -134361 165780 -272358 -10591 -170028 -119836 -188980
7045 -188980 -117127 -29414 356501 -63005 -137269 -18471 179501 97600 -290255 -21757 -67010
7034 -67010 -205361 -102695 63929 -22053 150438 -241771 149680 -135039 218938 36447
7023 34329 48466 -49235 19539 104873 -137863 -495433 -216550 -72350 64731 -70308 87050
7011 62769 58308 67775 -85389 -215304 175198 133516 -392673 173216 -211652 178548 -40768
6999 9528 -90328 -29977 -275687 -181408 -485636 -45425 -18115 168357 153662 -121317 131396
6987 50768 -13374 -29562 -16349 44936 -21820 153918 -174850 -142052 10845 134036 71797
6976 71797 37666 -402462 -59846 -10020 -80457 -28479 59588 -32878 184108 -135711 -52906
6964 42816 -290774 -215635 -113223 -220284 -274001 78257 237109 209992 -9099 -38410 152918
6952 -9867 -443295 -350131 -246481 199715 13246 -254790 -286690 -6955 99593 -105102 -49999
6940 -123741 -83454 -353218 -50227 9000 -79783 108088 -76133 -124114 145541 -121628 -36996
6928 138778 182456 3311 -103771 -252572 -255360 -136630 49444 115255 76876 -62499 -32778
6917 -32778 296116 -247825 -64952 -48776 238578 -85565 121588 108404 69982 -77787 -9615
6905 -49003 -147053 144085 12347 -272980 34806 -293439 185414 260094 -277329 78653 -288432
6893 105099 -358125 232397 -61366 -91466 -6595 -224860 -38889 -4827 28920 178664 360182
6882 360182 -297696 -101941 97332 24757 -30166 -93697 -248571 221979 -282782 -92730 332245
6870 -76416 -137542 -189968 -240902 -54540 -48345 119318 -23650 -194346 -24210 -8249 -27179 264120
6857 2624 71784 332663 -165912 -283812 -11871 135754 -28680 -49826 296559 65153 59801
6846 59801 -178377 14073 -122427 111962 -59425 210732 115524 -145037 57545 36787 -154384
6834 108955 -228039 -285531 120932 -92582 -2215 -25738 -122851 -45396 194629 -250515 -5257
6822 204828 -365380 -122294 -97276 -186511 -190296 -183035 186033 95560 99071 -38574 243856
6810 63244 154926 -76314 161435 133135 222858 -344140 43677 8242 -99054 190414 150379
6799 150379 -119583 -277792 192538 114314 267320 291973 -59646 -41190 208949 -84908 162323
6787 47860 -73234 -250502 -195277 115137 15686 113088 40105 -260750 -20061 -56215 -30266
6776 -30266 280193 -97799 -178867 -99675 -51519 -29358 72698 -181458 -124970 -362126 -40660
6764 21044 183444 -238936 -85831 -91503 109020 107948 -39549 74231 -61603 218007 67688
6752 23244 -202036 371795 203399 -16766 81532 198236 9206 -440065 -231304 -337063 232046
6740 114903 -128338 105341 -596311 -41739 215833 -52799 -125751 -93717 -91498 121616 28341
6728 149946 149052 -332931 86773 217036 -56786 148978 -4978 300120 -256173 -35225 -66404
6717 -66404 -237842 -95591 -85684 -32261 221877 -215013 -4929 21307 135139 -49433 -35269
6706 -35269 -144744 -113901 -58898 -49583 -14631 33171 -117237 -151343 74463 -128075 -176304
6695 -176304 20123 -83157 83970 -125308 231172 129753 60800 94542 233555 14918 -119958
6683 169636 120104 51626 246141 -241401 423047 158368 -253770 165517 -51820 -27293
6673 -27293 81165 22451 30071 -315699 159275 -175597 -336397 -257963 104793 -273243 -108362
6661 -43605 183661 -72855 -67856 24758 -114906 5394 -36482 -105798 59162 62209 -231028 132062
6648 -69208 244970 323505 257920 55271 -176147 68418 50741 494764 52875 -218520 328058
6636 -53204 293655 54418 111872 -74615 -45441 -12850 513347 -87382 -70781 -102758 63792
6624 46032 -107469 43181 -149964 -347939 -76623 -104374 -216525 109366 138640 241730 -153321
6612 -168214 112437 46309 -191698 -212725 -59942 -254483 -47631 324158 56520 -113095 -8918
6600 247711 190385 156262 -258825 -356828 266389 10571 -317285 207388 -132361 -93542 81623
6588 -239653 19071 -209250 202259 57268 -167414 -165338 -188897 -139692 111298 -48692 138188
6576 -19315 -296954 -107049 133403 -108361 314046 180203 9456 292805 1154 -4492 -25779
6565 -25779 -135474 -188357 -38372 -66930 48798 -186686 -96022 -94478 62799 -83938 -71732 -199228
6553 -199228 -308362 -351547 -341598 41580 -45080 145133 259912 40514 -495 -51252 59395 -45197
6540 -98110 -387164 17740 43639 49921 42817 -49234 46288 -373213 -174206 39696 -123183
6528 176203 104834 137149 248357 318994 206709 -197044 -27979 -359070 -173880 -30621 11621
6516 -137815 -161777 151125 -353730 189819 132724 -243078 74261 5813 179229 -266782 -22221
6504 87973 -229722 -146558 -35473 27245 -99845 -340888 -9306 179254 -171554 22891 77877
6493 77877 -121146 -152908 -57926 -166735 -70328 -259834 42858 -160245 -93204 151227 -144370
6481 22733 -57280 -237602 110240 -92724 200124 4570 -326056 -173316 -107836 92846 -173523
6469 -98343 148475 -266476 -228205 -91608 -243825 292948 -129828 259564 -160774 -269302
6459 -269302 -284932 39466 -66736 -289045 -109460 -291684 -151975 -545 34753 -101009 150244
6447 -273186 5335 15258 -231283 210241 152984 1214 375289 -27531 -214567 -249096 -302926
6436 -302926 -26427 42243 -221245 10033 332785 -91701 -188205 174645 -26421 -100157 131808
6424 322078 -69740 -346898 64475 -41759 43808 198204 175665 181432 -127479 266568 -46730
6412 -7992 -16818 31580 49515 -376304 -136112 53045 -37557 445144 17422 -72151 -98749 -16723
6399 -294759 227260 -40664 -145972 -88216 -109618 68144 129160 -68057 -266957 184718 -148341
6387 -69414 -172862 114214 -39411 -78967 -214256 -118134 308504 -6106 151419 -20345 -73081
6376 -73081 128798 161900 71530 59191 -170777 221250 16204 -36982 -90903 22220 -194125
6364 419958 81906 -59901 -291623 -336301 236051 -186266 -209949 194956 19892 -60233 84386
6352 11678 -252085 232532 -226171 -144066 -164635 -191340 -199385 -105506 -17366 -208686 185721
6340 -277454 39256 -283005 265867 -73910 308406 536954 -5544 -8235 -32621 185426 64799
6328 21096 15085 -83787 -54766 -236454 186321 -204334 -336480 -68375 10402 60006 43060
6317 43060 -160685 99179 -3028 -39990 -123782 73091 -6172 -183321 194115 16829 -220611
6305 -57872 81853 -121778 152002 -156498 -137032 -192730 6492 23926 -326801 165817 -100783
6293 -225368 -147087 -27951 -321790 63560 -315736 79360 -25091 -135107 -345694 -29371 -346388
6282 -346388 -89987 77100 -71021 76590 -38135 -116243 244858 -140240 8161 -133809 -137740
6271 -137740 170495 -74794 -176981 -43710 46708 -42878 -279476 81832 311946 -50119 87382
6259 5540 5870 158895 30560 110058 15943 -35393 -97865 68259 -148920 -196890 98339 215459
6247 215459 173400 -16043 -85773 52743 44351 157773 163084 88162 129464 32506 160983 50484
6234 -26147 -85733 244893 85174 19940 -65055 -129692 -405014 -80364 -71388 -308673 -365007
6223 -365007 164857 -195431 -89305 -124523 -124944 2922 3207 -76798 254429 83554 -191456 151525
6210 98272 -194442 59231 -43276 308764 101018 139180 58064 -59955 -96579 -52706 -72706
6199 -72706 54039 69775 -167318 -140113 -212758 -28956 -187288 305387 209635 89794 -9446
6187 -265153 -149952 40051 -217927 104135 69294 -126710 -48748 11393 64499 25085 241418
6176 241418 -201070 -196330 206868 170482 -273268 335485 -74666 -98457 -87038 287987 16523
6164 140345 53356 122831 379705 -68264 131612 -161666 124232 -115360 -381367 -73194
6153 186378 -35520 -79339 -161912 -29195 7132 265841 30410 -359399 364986 -75002 -91837
6142 -91837 -105726 -124825 -34047 -111528 224484 -363610 -44724 -139645 110083 80852 -201507
6130 -55103 60670 130215 -333119 -184263 47502 -215960 -14237 -200948 -29915 144979 -359562
6118 -6182 -91463 -8920 -92668 144515 -8563 244122 -78783 90312 255766 -56357 -202070 -464834
6106 -464834 109948 -74197 -63775 374487 244955 175700 49761 62065 116951 -175299 76320
6094 -144606 -38907 -89060 230120 130620 77567 -31882 -196372 107352 60598 -34821 -11502
6082 -405206 -177352 143500 -239765 -100421 53128 123395 -74205 278159 -155271 -80432
6072 -80432 -222315 193242 178064 -105278 4259 44307 -176240 111977 -25532 -92137 -177530
6061 -177530 -131150 -289445 209826 -190510 -267252 -10368 -24492 -337336 -77974 -213145 93189
6049 37407 -213738 -12932 -260619 -153960 -44061 -3871 -337620 142352 223457 124915 -111192
6037 36292 -27598 17347 -210604 183755 117227 200079 189506 84228 -382518 -5871 -15319 124937
6024 6460 8542 166700 146544 186291 -317133 39094 -185580 -42926 -111892 -207358 -55922 -79368
6012 -79368 122402 20236 -10867 35511 -102893 4231 22178 46141 82756 6412 -31131 239175
5999 -51601 124747 6363 -9872 -195658 -57874 144162 -295886 30601 -181780 -133891 -190739
5988 -190739 304320 -285037 167202 54802 19709 183748 225125 107501 -64261 -55694 -91214
5977 -91214 -96111 43303 164260 95570 113218 31485 8794 200800 -145145 -142065 -13873 -31558
5965 -31558 -128294 28951 -71065 -135272 -118387 76883 147654 -60393 -331013 -46965 -18323 503316
5952 -162937 23652 250687 -15023 -7163 -297454 120605 134434 -151513 -95615 144645 -181350
5940 291913 -389155 100460 47366 75753 -119731 -4502 -922 -34389 153570 -141706 26749
5928 304507 -70456 38859 100067 -234640 175836 346754 -74014 -61987 -77702 -165091 -267788
5917 -267788 27289 165865 132094 -175157 84364 -13358 51199 103413 -22838 73725 -53737
5905 224654 -42026 120194 -79262 145463 41228 74716 184770 199302 46938 -40568 -215678
5894 -215678 29344 49304 -116531 -193275 -86223 86007 -252114 -52132 -49595 -116416 -133606
5883 -133606 101410 329734 128614 305168 32553 32470 -74314 -121524 249910 200762 328404
5872 328404 29050 -94571 128866 -444479 -46822 130981 119314 181979 -215854 329335 45466
5860 -88490 26598 41666 33151 196570 189221 -201683 -30004 90578 -106938 27768 -67123 214532
5847 -8926 56900 161688 75557 5505 -11369 181986 63357 -174085 -147121 -181162 -33321 31228
5834 224000 -140678 -182846 -119236 -266183 -124674 -39142 -298261 -155951 114876 190927
5824 190927 105807 -45333 -10315 -311641 -315614 286105 18407 -41561 -70310 -213722 -8642
5812 131444 35056 -67890 11912 195072 -82956 -251612 325398 165860 179040 177536 297838
5801 297838 -27116 -212766 70015 131281 -18937 40078 -214186 101263 -35491 14738 -327743
5789 -64928 248238 97815 -452758 -204665 116891 -334277 129269 -161086 99244 -687483
5778 -92021 -70330 -219805 40604 -44367 -25411 72213 94197 -162175 143101 192050 36712
5766 81774 140677 -221565 -48144 201923 -381620 39891 51284 260475 13282 92342 59372
5755 59372 -189515 -132897 30749 183438 77845 -3302 -14322 30501 -212966 222722 -67937
5743 18983 191630 209627 41681 347840 -42883 -134140 180871 106274 -6999 129359 144662
5732 144662 -281129 -12580 -272693 -302213 162238 -133757 -129613 -328610 -164121 36460 -173614
5720 48691 203546 27454 -137368 107023 -171712 -126370 198903 -142603 77356 323895
5710 323895 -319701 151534 99418 -66206 -6440 174650 -87075 -177921 132076 -56609 284212
5698 -249687 80820 -133821 173417 -114769 213413 25098 171017 -356581 104705 -26052
5687 -213799 -50794 -13366 -118129 398494 -60654 169742 -242941 -309542 -127463 29740 56871
5676 56871 -70155 42773 -121218 212915 120263 222271 -117033 163889 -231986 -83771 -70101
5665 -70101 24471 76890 -231529 -14789 -6025 165179 -383300 289463 -255125 -507950 182285
5653 -321741 -79267 116667 -138992 -38629 -177302 175001 -113714 -309317 -198594 -36810
5642 -192846 -77923 63846 305950 -3510 197944 -142070 295623 44617 -23338 -259433 123815
5630 6769 -31296 -86062 314468 92644 100686 -105314 301007 -25492 -181483 127769 -44226
5618 -9997 45022 -23962 157636 129624 -44300 113069 192404 35091 96531 35210 219613
5607 219613 58824 251297 191266 -197719 189915 80601 53964 157070 129507 -267596 284694
5595 1082 72981 -210798 74860 120652 349693 146918 -258497 -6750 366738 177996 156160
5584 156160 33971 -87042 -59786 30187 -112888 -288134 1118 145508 124237 -71556 -72227 120412
5571 -124687 103023 145602 124247 -235057 -263651 40788 -155930 -213503 253631 -161719 216846
5559 258899 -121545 123515 -106975 -14338 -115226 -53256 107065 -107602 380718 -137198
5548 -340686 -5539 77809 125239 -89692 25572 -157890 170393 -204399 98393 39007 -120728
5536 306385 -189262 160274 -176917 239090 -35122 -134506 -161697 104644 -103743 -86455
5526 -86455 135599 -168610 -136761 38251 278307 155612 -64405 115222 -275452 25902 -152577
5514 -153395 -390908 -157168 -150107 -85343 206942 -28456 -169777 -95318 -47340 29853 156357
5503 156357 62180 340710 79247 56894 -135579 -141455 -448805 -388586 -38001 -58761 -100915
5492 -100915 299772 253787 117719 96856 2218 45752 40552 238055 -49575 295389 -141915
5480 -5454 -137677 -268705 90579 -367247 -140378 244500 -145400 85773 -52935 223694 -132568
5468 -92632 118441 306826 7555 156613 -90841 -13949 -138020 -61000 33573 -77514 111162
5456 153545 -68100 -10369 -120791 4432 -118856 151636 -148182 -173002 150630 151799 -38701
5444 125278 -114106 142927 -79541 -134270 -133122 269424 124967 204317 45758 353424 135387
5432 -15480 -63370 -144113 -289413 -216008 22847 82601 -21310 40933 48637 102105 339259 -4446
5419 241297 -16591 -123266 123806 113116 -213145 119870 -54626 78957 -62741 192954 -261023
5407 -168628 -137124 29782 -300826 512 -40234 253429 -90111 24095 75405 132223 40778 -49126
5394 -85514 -77937 88569 350102 90651 132987 -271353 -175575 10050 -82095 -8560 26676 -23039
5381 -171791 143166 -122519 -239321 279984 323882 172784 237944 135645 -60486 134790
5370 71614 -73965 -214080 -37546 226638 111865 295447 171973 28827 73207 -208447 205162
5358 343415 -8416 -279710 -259008 167935 -146426 144525 114551 18593 407330 55054 201461
5347 201461 97196 -157400 5381 -336205 73037 132452 -134873 -9623 148257 -107241 -3492
5335 239408 -36730 -133096 -185648 34190 -146139 -51188 -57462 83904 182105 -251842 -68813
5323 -108840 -29022 -239542 76547 213429 126122 36718 -20409 -49783 -7860 90346 74136
5312 74136 85930 -147591 149366 222412 -94173 342670 7308 -196722 65956 292266 -21872
5300 -39079 -171835 -13045 122825 202289 -176130 255542 89984 225215 27534 4305 559685
5289 559685 91969 -183756 -212308 -44360 -336969 31739 -91165 75349 3820 -218018 97459
5277 116911 224196 252661 -112858 133806 -238791 -308916 -119526 -83212 44182 21652 -3639
5265 216351 -215616 185037 129541 212502 34505 -87159 22712 -112135 276935 -77971 2041
5253 5947 -252568 317594 -8768 -136671 -179284 194153 -199470 257736 52972 -15362 -265094
5242 -265094 -195330 -85586 -115260 -138362 -171772 -82697 16231 168818 -235405 -84871 96097
5230 -203877 255354 120715 77543 -160414 114280 38062 -51699 -229574 266420 -110611
5219 -140620 319542 301675 167542 195960 253953 -13776 -69187 -331009 250081 29832 -215631
5207 -10688 -111391 236997 -375277 -8689 -93996 161209 64105 -132307 -28540 -12164 -198516
5196 -198516 20936 212273 -220030 134130 51780 229907 143803 -117651 279860 245772
5186 245772 -286580 153983 -57191 55067 159660 3904 -125219 152876 -95418 88974 -21560
5174 -156649 -266982 -170498 84129 113059 73873 -140072 -173109 2633 -95184 95964 -127021
5162 -53297 -449658 -370685 103494 123148 94203 -160418 -180054 45746 -24477 -110769 -37534
5150 59740 116674 -59885 15987 -148551 -124334 -158399 245652 320609 -10850 -152905 7884
5138 -283636 -249906 -71283 107724 37195 342667 40500 9430 65430 37908 166526 -120114
5126 44864 -48028 -23989 282672 -18461 86408 -52920 -37028 423033 -47250 -9224 -193617
5115 -193617 86805 -24779 -87238 -4785 225696 -372614 245810 127603 124917 -119232 -226335
5104 -226335 84564 348950 183914 -157990 326065 -253096 13941 -101656 -170059 -108415
5094 -108415 -95810 32516 -193212 -111188 -27705 -40529 293634 -10254 26333 -96739 211681
5082 -178989 49607 -57743 -7673 308435 104344 -127864 22237 -22822 276401 7259 35949
5071 35949 114506 61858 -16546 -62105 32726 58517 -48444 8357 145848 156499 88914 -206056
5058 204615 343458 6277 84186 -200237 36912 -121482 116818 -66743 103436 104186 -118558
5046 -178477 -128653 -245726 80996 225524 -59398 -110371 -334476 -174585 155013 -9661 34430
5034 95267 221519 195356 45676 117006 181176 -110146 -187284 58617 95982 130157 -96496
5022 136469 -95888 221845 116122 -193867 -92391 207233 -272193 -202811 -2160 -116255 -130398
5011 -130398 275026 -244056 271423 95510 104206 -348288 72471 -141255 41522 76956 82421
5000 82421 -7367 57804 -102111 54176 -164267 -118720 -327445 465830 -163328 -175853 -20590
4988 205456 19019 -324132 -235499 -150538 -31469 33057 304679 -282583 25250 -5850 36894
4976 159919 -171123 -35317 192188 129856 52084 135352 6295 -34280 131365 179824 122155
4965 122155 -28130 91573 -269910 -267867 -113837 136055 -4208 -24454 -116337 133077 -191532
4953 -234548 -188063 -110513 127482 -22810 -23729 245576 219661 -18669 67314 249508 183507
4942 183507 -67537 32182 -46810 -95812 -239599 201895 277087 -92936 81794 -267317 -11107
4930 9128 11890 -63345 -68335 275351 -117345 47711 14893 -315087 190110 40748 -48571 -132623
4918 -132623 -25335 242790 69347 -161340 73395 70965 13564 -175087 32456 -162516 -194527
4907 -194527 -114838 -81227 -10085 135593 -248975 -378292 55670 125874 153468 2131 246497
4896 246497 -242038 353423 386560 -105192 -29697 -67069 -8910 -109457 155486 25747 254021
4885 254021 83481 27286 93695 -6795 222808 185446 376796 46609 -152237 -273780 -190452
4874 -190452 -3014 -505178 154057 187415 40366 -153866 -2888 172159 -4106 124536 208249
4863 208249 -53999 163705 161222 6258 -64713 23158 -75523 -2897 268045 -6313 -389680 -15361
4850 -399550 -4315 -218310 -276098 19628 99502 406673 -135917 -297041 -34953 -99315 21573
4838 -147028 48334 -150388 103737 -100163 -133042 217230 305065 522472 -305451 179020
4827 -54338 -73636 286123 -35661 361502 150930 17557 -18599 75411 160516 -72944 124129
4815 -34669 -113473 133337 -186722 -106401 -116417 18636 115328 -221995 346291 -19904 -125289
4804 -125289 18161 -85141 109293 140978 -176050 41115 -249296 113142 120502 -123320 83745
4792 -227420 242487 131571 24398 -4659 -95611 -23903 383288 187373 -65132 7304 33249
4781 33249 -68466 -123290 233502 56578 -379839 69805 -69282 10965 -149165 49033 -158041
4769 -15608 275500 -242902 88156 52542 85858 305534 243909 317773 -219659 -126248 406018
4757 177152 192498 32749 21585 157364 334317 15757 -359244 40897 87427 -166279 -307975
4746 -307975 301288 -452800 -254844 72539 83616 227538 -46611 87534 -126730 -65601 266175
4734 107577 -269254 -1454 28652 -173398 12875 -95469 -38943 102226 -224583 -72332 27563
4722 1499 17391 -138072 152603 -125673 168919 64688 -3569 439714 174103 -113471 222130
4710 -57374 120069 191290 -389538 319546 49792 18560 21469 332705 -52772 123494 -138557
4698 72025 194067 -173729 -55893 275236 -6491 -49498 45641 96665 18046 -172609 131259
4686 207212 103214 136682 147453 -24180 -49247 -86320 130751 46829 170737 -124622 -125498
4675 -125498 72840 21622 -119197 147056 146852 -217746 -85966 10226 -138542 -139052 123635
4663 167356 14211 145787 -353684 24739 -155400 -43909 -71319 138655 -87762 -168412 105794
4651 -10483 162134 -32604 47082 -126016 -214925 -75088 -144532 80100 -20679 -69467 -155970
4640 -155970 11371 -89918 -58680 -22446 8853 -114166 430832 163621 58093 54001 104420
4629 104420 -6228 197441 31314 -165409 -202925 85689 15281 -26798 97853 -141882 -104695
4618 -104695 -98210 117746 162457 45646 -216989 -173025 300635 -228557 169227 56249 -70768
4606 -23155 -205819 -120954 222073 206402 156086 -139850 46068 121656 413478 -138957 70000
4594 196739 -132966 285762 -298021 -229338 266338 -91530 -42428 31853 -160453 -210948 90162
4582 359786 -199680 -124725 -32975 -42298 312343 -17684 141126 128587 142184 -8349 81068
4570 86154 81629 45087 -86479 -357317 -247893 221654 150043 -4311 -48671 63251 127474 -23959
4557 -262849 -35359 -244602 87675 -76521 -78769 -73257 -100912 103053 112619 48416 -87064 -167333
4545 -167333 11748 -19004 -346856 -15551 30580 -97099 -142889 -51057 191992 -157906 -189193
4534 -189193 164737 107017 -454808 107270 143298 58282 305250 258826 -52726 228835 129470
4523 129470 -250521 -119186 56522 -81449 292444 -22153 200286 -234382 97821 117960 86470
4512 86470 120360 -25302 356162 30891 -150529 23959 -41489 -16808 -54163 273489 2529
4500 62174 -37345 6339 -16327 -8516 184181 182407 -467720 29165 285783 -114982 -228712
4489 -228712 -143752 98986 349117 -67074 -180788 167678 -185857 -198870 -274268 -195575 -176558
4478 -176558 -129783 -170515 296423 315602 248153 -23571 -366826 460882 64709 -167288 200787
4466 98812 -120026 -141287 -33025 -137123 -38073 -62072 12834 44922 -131565 -34037 67782
4454 388836 -287889 160770 154125 80608 39870 -138260 -126038 -207639 -94145 226733 36332
$$ [...]
##END NTUPLES=NMR SPECTRUM
##END=
