##TITLE=AC1751_05000195609115FOTR0001_9275067_Bt7wbmRs15
##JCAMPDX= 6.0         $$ Bruker NMR JCAMP-DX V2.0
##DATA TYPE= NMR SPECTRUM
##DATA CLASS= NTUPLES
##ORIGIN= BRUKER
##OWNER= Administrator
$$ 1.72 TOPSPIN		Version 2.1
$$ 2015-07-19 00:42:51.338 -0700  Administrator@X
$$ Compression mode = diff/dup
##.OBSERVE FREQUENCY= 400.02188249412
##.OBSERVE NUCLEUS= ^1H
##.ACQUISITION MODE= SIMULTANEOUS (DQD)
##.ACQUISITION SCHEME= undefined
##.AVERAGES= 64
##.DIGITISER RES= 22
##SPECTROMETER/DATA SYSTEM= spect
##.PULSE SEQUENCE= noesygpps1d.comp
##.SOLVENT NAME= COFFEE_meoh
##.SHIFT REFERENCE= INTERNAL, COFFEE_meoh, 1, 14.96202
##AUDIT TRAIL= $$ (NUMBER, WHEN, WHO, WHERE, PROCESS, VERSION, WHAT)
$$ ##TITLE= Audit trail, TOPSPIN		Version 2.1
$$ ##JCAMPDX= 5.01
$$ ##ORIGIN= Bruker BioSpin GmbH
$$ ##OWNER= Administrator
$$ $$ E:\/data/COFFEE/nmr/AC1751_05000195609115FOTR0001_9275067_Bt7wbmRs15/32/pdata/1/auditp.txt
$$ ##AUDIT TRAIL=  $$ (NUMBER, WHEN, WHO, WHERE, PROCESS, VERSION, WHAT)
(   1,<2015-07-19 00:42:45.104 -0700>,<Administrator>,<X>,<go>,<TOPSPIN 2.1>,
      <created by zg
	started at 2015-07-19 00:31:14.869 -0700,
	POWCHK enabled, PULCHK disabled,
       configuration hash MD5:
       21 0F 79 D6 B3 7B B4 F6 88 20 88 DB 03 48 BD 9F
       data hash MD5: 64K
       AA 63 A0 F8 A0 05 D3 FD 46 68 FA EB 91 04 7F 6D>)
(   2,<2015-07-19 00:42:48.369 -0700>,<Administrator>,<X>,<proc1d>,<TOPSPIN 2.1>,
      <Start of raw data processing
       efp LB = 0.3 FT_mod = 6 PKNL = 1 PHC0 = 0 PHC1 = 0 SI = 128K 
       data hash MD5: 128K
       6E 21 66 97 A9 CD DD C7 A1 70 AE 17 51 AD B6 29>)
(   3,<2015-07-19 00:42:49.307 -0700>,<Administrator>,<X>,<proc1d>,<TOPSPIN 2.1>,
      <pk PHC0 = -89.69238 PHC1 = 0 
       data hash MD5: 128K
       6E 49 11 68 AD E6 02 8A E4 90 C4 99 96 8B C9 5A>)
(   4,<2015-07-19 00:42:50.010 -0700>,<Administrator>,<X>,<proc1d>,<TOPSPIN 2.1>,
      <abs ABSG = 1 
       data hash MD5: 128K
       A1 F2 D3 C8 BC EC 90 33 40 76 E1 03 40 7E E1 50>)
(   5,<2015-07-19 00:42:50.494 -0700>,<Administrator>,<X>,<proc1d>,<TOPSPIN 2.1>,
      <abs ABSG = 2 
       data hash MD5: 128K
       EE 7F 70 82 D8 23 1D 43 DB C8 DD A8 0E C9 C5 72>)
(   6,<2015-07-19 00:42:50.697 -0700>,<Administrator>,<X>,<proc1d>,<TOPSPIN 2.1>,
      <abs ABSG = 3 
       data hash MD5: 128K
       CD 37 AF 44 2B BE 85 D5 AD 31 3E F2 C5 C2 A2 A3>)
(   7,<2015-07-19 00:42:50.807 -0700>,<Administrator>,<X>,<proc1d>,<TOPSPIN 2.1>,
      <abs ABSG = 4 
       data hash MD5: 128K
       6C C5 CD 4A DE AA 79 59 AA 0C DE 4A E6 70 5F 80>)
(   8,<2015-07-19 00:42:51.010 -0700>,<Administrator>,<X>,<proc1d>,<TOPSPIN 2.1>,
      <abs ABSG = 5 
       data hash MD5: 128K
       27 A7 D1 79 E0 87 4A 76 72 85 1F 44 7B 74 27 CF>)
$$ ##END=
$$ 
$$ $$ hash MD5
$$ $$ 3E E5 0D 8D 73 06 55 81 46 37 30 4D 52 2A 6C AC
##$RELAX= 
##$RELAX= 
##$RELAX= 
##$RELAX= 
##$RELAX= 
##$RELAX= 
##$RELAX= 
##$RELAX= 
$$ Bruker specific parameters
$$ --------------------------
##$DU= <E:\>
$$ [...]
##$TP07= 0
##$TPNAME0= <>
##$TPNAME1= <>
##$TPNAME2= <>
##$TPNAME3= <>
##$TPNAME4= <>
##$TPNAME5= <>
##$TPNAME6= <>
##$TPNAME7= <>
##$TPOAL= (0..7)
0.5 0.5 0.5 0.5 0.5 0.5 0.5 0.5
##$TPOFFS= (0..7)
0 0 0 0 0 0 0 0
##$TUNHIN= 0
##$TUNHOUT= 0
##$TUNXOUT= 0
##$USERA1= <user>
##$USERA2= <user>
##$USERA3= <user>
##$USERA4= <user>
##$USERA5= <user>
##$V9= 5
##$VALIST= <valist>
##$VCLIST= <CCCCCCCCCCCCCCC>
##$VD= 0
##$VDLIST= <DDDDDDDDDDDDDDD>
##$VPLIST= <PPPPPPPPPPPPPPP>
##$VTLIST= <TTTTTTTTTTTTTTT>
##$WBST= 2048
##$WBSW= 25
##$XGAIN= (0..3)
0 0 0 0
##$XL= 0
##$YL= 0
##$YMAX_a= 6825639
##$YMIN_a= -16359695
##$ZGOPTNS= <>
##$ZL1= 120
##$ZL2= 120
##$ZL3= 120
##$ZL4= 120
##$ABSF1= 14.96202
##$ABSF2= -5.596162
##$ABSG= 5
##$ABSL= 3
##$ALPHA= 0
##$AQORDER= 0
##$ASSFAC= 0
##$ASSFACI= 0
##$ASSFACX= 0
##$ASSWID= 0
##$AUNMP= <proc_prof1d_extract.lims>
##$AXLEFT= 0
##$AXNAME= <>
##$AXNUC= <1H>
##$AXRIGHT= 0
##$AXTYPE= 0
##$AXUNIT= <>
##$AZFE= 0.1
##$AZFW= 0.1
##$BCFW= 0
##$BC_mod= 0
##$BYTORDP= 0
##$COROFFS= 0
##$CY= 15
##$DATMOD= 1
##$DC= 0
##$DFILT= <>
##$DTYPP= 0
##$F1P= 0
##$F2P= 0
##$FCOR= 0.5
##$FTSIZE= 131072
##$FT_mod= 6
##$GAMMA= 0
##$GB= 0
##$INTBC= 1
##$INTSCL= 1
##$ISEN= 128
##$LB= 0.3
##$LEV0= 0
##$LPBIN= 0
##$MAXI= 10000
##$MC2= 0
##$MEAN= 0
##$ME_mod= 0
##$MI= 0
##$NCOEF= 0
##$NC_proc= -2
##$NLEV= 6
##$NOISF1= 0
##$NOISF2= 0
##$NSP= 0
##$NTH_PI= 0
##$NZP= 0
##$OFFSET= 14.96202
##$PC= 1
##$PHC0= -89.69238
##$PHC1= 0
##$PH_mod= 1
##$PKNL= yes
##$PPARMOD= 0
##$PPDIAG= 0
##$PPIPTYP= 0
##$PPMPNUM= 2147483647
##$PPRESOL= 1
##$PSCAL= 4
##$PSIGN= 0
##$PYNMP= <proc.py>
##$REVERSE= no
##$SF= 400.020009227932
##$SI= 131072
##$SIGF1= 0
##$SIGF2= 0
##$SINO= 400
##$SIOLD= 131072
##$SPECTYP= <>
##$SREGLST= <1H.CDCl3>
##$SSB= 0
##$STSI= 131072
##$STSR= 0
##$SW_p= 8223.68421052631
##$SYMM= 0
##$S_DEV= 0
##$TDeff= 65536
##$TDoff= 0
##$TI= <>
##$TILT= no
##$TM1= 0
##$TM2= 0
##$TOPLEV= 0
##$USERP1= <user>
##$USERP2= <user>
##$USERP3= <user>
##$USERP4= <user>
##$USERP5= <user>
##$WDW= 1
##$XDIM= 131072
##$YMAX_p= 444632303
##$YMIN_p= -10616
##$CURPLOT= <Network HP LaserJet P1505>
##$CURPRIN= <$Network HP LaserJet P1505>
##$DFORMAT= <normdp>
##$LAYOUT= <+/1D_H.xwp>
##$LFORMAT= <normlp>
##$PFORMAT= <normpl>
##$SURQMSG= 1
$$ End of Bruker specific parameters
$$ ---------------------------------
##NTUPLES= NMR SPECTRUM
##VAR_NAME=  FREQUENCY,     SPECTRUM/REAL,   SPECTRUM/IMAG
##SYMBOL=    X,             R,               I
##VAR_TYPE=  INDEPENDENT,   DEPENDENT,       DEPENDENT
##VAR_FORM=  AFFN,          ASDF,            ASDF
##VAR_DIM=   131072,        131072,          131072
##UNITS=     HZ,            ARBITRARY UNITS, ARBITRARY UNITS
##FACTOR=    0.0627417313425164, 1,          1
##FIRST=     8223.62146879497, 794,          -52244
##LAST=      0,             2880,            -52077
##MIN=       0,             -10616,          0
##MAX=       8223.62146879497, 444632303,    0
$$ Real data points
##PAGE= N=1
##DATA TABLE= (X++(R..R)), XYDATA
$$ [...]
63194A404599k5121k3028k0215j6783j2825q866n573l016p35J316K664L290M002
63181A299709N410P120Q358Q990R441R958J0318J0186R503Q557P712P007O238
63168A408507N552N497O111O442N728M617M403N224O017O024N368M088J867j084
63154A474361l860n953p645r041r700r467q807p914o464m525k604m20L144Q182
63140A409287J3109J6711J9809K3809K8493L2456L4910L5816L4748L1037K4931
63129A705116J7443R115j2r293j7367k3355k7300k9383k9464k7700k4894k1844
63117A521062j8821j5881j3225j0900q550n802k877n14P04R11Q06R07J111J123
63103A450054J127J595K478L085L018K689K676K992L296L485L705M033M521N339
$$ plain form
63194 1404599 1379478 1356450 1336235 1319452 1306627 1297761 1292188 1289172 1288437 1289753 1292417 1295707 1299709
63181 1299709 1305119 1312239 1320597 1329587 1339028 1348986 1359304 1369490 1378993 1387550 1395262 1402269 1408507
63168 1408507 1414059 1419556 1425667 1432109 1437837 1442454 1446857 1452081 1458098 1464122 1469490 1473578 1475445 1474361
63154 1474361 1470501 1464548 1456903 1447862 1438162 1428695 1419888 1411974 1405510 1400985 1398381 1397961 1401105 1409287
63140 1409287 1422396 1439107 1458916 1482725 1511218 1543674 1578584 1614400 1649148 1680185 1705116
63129 1705116 1722559 1731674 1731662 1722369 1705002 1681647 1654347 1624964 1595500 1567800 1542906 1521062
63117 1521062 1502241 1486360 1473135 1462235 1453685 1447883 1445006 1444492 1445196 1446107 1446913 1447820 1448931 1450054
63103 1450054 1451181 1452776 1455254 1458339 1461357 1464046 1466722 1469714 1473010 1476495 1480200 1484233 1488754 1494093
63089A494093O522P772Q685R032Q711P789O743O238O306O059M605K068n87k569
63075A571467l789m529m906m821m342m034m560n804o762o677n947n321m644l276
63061A502055j553o33p51o69O99K973N133O847Q408R951J1392J2743J4118J5664
63047A586377J7666K0219K2763K4617K6089K8131L0597L1766L0071K5432J8556
63036A862284J0054R85o801j1980j4845j6302j6530j5483j3938j2853j2102j0972
63024A741517r556q644q442q443q433q712r287r623r329q450p095n259l066p81
63010A636397J383L316N122P287J0220J3305J5191J5487J5450J6298J7573J8049
62998A775078J7602J7122J7014J6872J6432J5803J4868J3321J1351R519P987O572
$$ plain form
63089 1494093 1500615 1508387 1517072 1526104 1534815 1542604 1549347 1555585 1561891 1567950 1572555 1574623 1574036 1571467
63075 1571467 1567678 1563149 1558243 1553422 1549080 1545046 1540486 1534682 1527920 1521243 1515296 1509975 1505331 1502055
63061 1502055 1500502 1499869 1499118 1498449 1499148 1502121 1507254 1514101 1522509 1532460 1543852 1556595 1570713 1586377
63047 1586377 1604043 1624262 1647025 1671642 1697731 1725862 1756459 1788225 1818296 1843728 1862284
63036 1862284 1872338 1873323 1866522 1854542 1839697 1823395 1806865 1791382 1777444 1764591 1752489 1741517
63024 1741517 1731961 1723317 1714875 1706432 1697999 1689287 1680000 1670377 1661048 1652598 1645503 1640244 1637178 1636397
63010 1636397 1637780 1641096 1646218 1653505 1663725 1677030 1692221 1707708 1723158 1739456 1757029 1775078
62998 1775078 1792680 1809802 1826816 1843688 1860120 1875923 1890791 1904112 1915463 1924982 1932969 1939541
62986A939541N362M630M264L963L770L796L646K859J670N88m99j999l735n323
62972A962533p111r698j2650j4802j5843j6523j7272j7672j7504j7232j7062j6450
62960A782714j5029j3233j1512r623p155m308j600P96L087N460P883J0088J1683
62947A759251J2546J3024J3349J2993J1217Q271N443L768L292L648M705O320Q002
62934A865829R221R765R496Q026M945K96n135r935j2647j2673j0650p674m177
62921A844687N9M997R931J4038J6862J8231J8043J6291J3056Q416K573l971j0614
62908A952599j6891k2357k6441k8763k9473k9028k7799k6058k4023k1646j8732
62897A681388j5551j2860j0959r243p179n175l816k841j680n11J61N72J368K365
$$ plain form
62986 1939541 1944903 1949533 1953797 1957760 1961530 1965326 1968972 1971831 1973501 1974089 1973590 1971591 1967856 1962533
62972 1962533 1955422 1945724 1933074 1918272 1902429 1885906 1868634 1850962 1833458 1816226 1799164 1782714
62960 1782714 1767685 1754452 1742940 1733317 1726162 1721854 1720254 1721050 1724137 1729597 1737480 1747568 1759251
62947 1759251 1771797 1784821 1798170 1811163 1822380 1830651 1836094 1839862 1843154 1846802 1851507 1857827 1865829
62934 1865829 1875050 1884815 1894311 1902337 1907282 1907578 1902443 1892508 1879861 1867188 1856538 1848864 1844687
62921 1844687 1844746 1849743 1859674 1873712 1890574 1908805 1926848 1943139 1956195 1964611 1967184 1963213 1952599
62908 1952599 1935708 1913351 1886910 1858147 1828674 1799646 1771847 1745789 1721766 1700120 1681388
62897 1681388 1665837 1652977 1642018 1632775 1625596 1620421 1616605 1613764 1612084 1611573 1611734 1612306 1613674 1616039
62883A616039K746K443K248K531K772K575K275K264K370K216J700R52L25L15J023
62868A644794J790K038K256L355N184O633P248P728Q684R800J0541J0874J0887
62855A731812J0397R281P707N771L437R58j242l200n256p184q187p842o409m120
62841A725923j057K127M296N060N193N421N514M908L476J311j501m364o137o224
62827A743946n223m071l087k256j825k007k557l222m115n173n675n018l604k349
62813A693764j469l83J322L317M961N877O115N994N829N622N084L991K484R14
62799A743422m54j613k753m008n121n528n031m149l512l063k268r10Q20K826N094
62784A713752P369R372J1243J3197J4903J5902J6484J7314J8316J8905J9224K0095
$$ plain form
62883 1616039 1618785 1621228 1623476 1626007 1628779 1631354 1633629 1635893 1638263 1640479 1642179 1643131 1643456 1643771 1644794
62868 1644794 1646584 1648622 1650878 1654233 1659417 1666050 1673298 1681026 1689710 1699510 1710051 1720925 1731812
62855 1731812 1742209 1751490 1759197 1764968 1768405 1769363 1768121 1764921 1759665 1752481 1744294 1736452 1730043 1725923
62841 1725923 1724866 1726993 1731289 1736349 1741542 1746963 1752477 1757385 1760861 1762172 1760671 1756307 1750170 1743946
62827 1743946 1738723 1734652 1731565 1729309 1727484 1725477 1722920 1719698 1715583 1710410 1704735 1699717 1696113 1693764
62813 1693764 1692295 1691912 1693234 1696551 1701512 1707389 1713504 1719498 1725327 1730949 1736033 1740024 1742508 1743422
62799 1743422 1742968 1741355 1738602 1734594 1729473 1723945 1718914 1714765 1711253 1708190 1705922 1705012 1705832 1708658 1713752
62784 1713752 1721121 1730493 1741736 1754933 1769836 1785738 1802222 1819536 1837852 1856757 1875981 1896076
62772A896076K1614K3006K4204K6360L0159L4678L8700M2292M6151N0081N3182
62761B286503N5155N6395N6780N5026M9404L8825K3589N561j2515k8358m0971
62750B545394n0249n6278n9294n9899n8825n6508n3155m9015m4493m0096l6283
62739A981299l3112l0117k6842k3414k0113j6683j2771q943o289m899l718k142
62727A792256q04l04j83K57Q95J302J566J957K315K499K883L667M344M517M748
62712A821915N601O363N676L350O09j379k393k638k190j230k20N48J258K254L541
62697A841065M782N744O649P959R686J1135J1808J2329J3811J6193J8078J8449
62685A977688J7694J6476J4550J1481P784M311R54k954p191j0675j2951j4748
$$ plain form
62772 1896076 1917690 1940696 1964900 1991260 2021419 2056097 2094797 2137089 2183240 2233321 2286503
62761 2286503 2341658 2398053 2454833 2509859 2559263 2598088 2621677 2627238 2614723 2586365 2545394
62750 2545394 2495145 2438867 2379573 2319674 2260849 2204341 2151186 2102171 2057678 2017582 1981299
62739 1981299 1948187 1918070 1891228 1867814 1847701 1831018 1818247 1809304 1803015 1798116 1794398 1792256
62727 1792256 1791452 1791148 1790965 1791222 1792117 1793419 1794985 1796942 1799257 1801756 1804639 1808306 1812650 1817167 1821915
62712 1821915 1827516 1833879 1839555 1842905 1843514 1842135 1839742 1837104 1834914 1833684 1833464 1834012 1835270 1837524 1841065
62697 1841065 1845847 1851591 1858240 1866199 1875885 1887020 1898828 1911157 1924968 1941161 1959239 1977688
62685 1977688 1995382 2011858 2026408 2037889 2045673 2049984 2050938 2047984 2040793 2030118 2017167 2002419
62673B002419j6776j8805k0231k1007k1571k2215k2782k2847k2029k0260j7895
62662A776001j5465j3352j1667j0317r046p600o045m833m299m145l644k331m68
62649A682789J217K296L137M452O195P337P136O205N639N367M376K605J412J800
62635A741963L106M048M249M143L982L747L513L305K895K254J681J115p9k068
62621A777854l953m893n222n683o159o063n407m528l202j133R47J927J980K446
62607A738911L915N493O247O414O705P224P585P564P160O481N988O400P874R601
62593A833562J0639J0981J1412J2353J3298J3546J3232J3326J4511J6360J7932
62582A981152J9065K0577K3121K6334K9495L2585L6275M1052M6736N2618N7806
$$ plain form
62673 2002419 1985643 1966838 1946607 1925600 1904029 1881814 1859032 1836185 1814156 1793896 1776001
62662 1776001 1760536 1747184 1735517 1725200 1716154 1708554 1702509 1697676 1693377 1689232 1685588 1683257 1682789
62649 1682789 1684006 1686302 1689439 1693891 1700086 1707423 1714559 1720764 1726403 1731770 1736146 1738751 1740163 1741963
62635 1741963 1745069 1749117 1753366 1757509 1761491 1765238 1768751 1772056 1774951 1777205 1778886 1780001 1779922 1777854
62621 1777854 1773901 1769008 1763786 1758103 1751944 1745881 1740474 1735946 1732744 1731611 1732558 1734485 1736465 1738911
62607 1738911 1742826 1748319 1754566 1760980 1767685 1774909 1782494 1790058 1797218 1803699 1809687 1816087 1823961 1833562
62593 1833562 1844201 1855182 1866594 1878947 1892245 1905791 1919023 1932349 1946860 1963220 1981152
62582 1981152 2000217 2020794 2043915 2070249 2099744 2132329 2168604 2209656 2256392 2309010 2366816
62571B366816O1633O4052O5244O4598O0429N1223L6923J8760j620k2191m0372
62560B725495n3945o2318o6312o6794o4326n9913n5024n0427m5803m0871l6188
62549B123574l2278k8730k4937k1341j9050j8258j7894j7038j5922j5156j4503
62538A898467j3230j1380r864r052q146o408m457l581m056m915n218m826l877
62525A809457k347l66J655L540N582Q002J0608J3072J5148J6505J7014J7356J8661
62512A933887K1185K4012K6288K8045K9503L0439L0830L1236L1802L1632L0125
62501B248984K8231K7193K6412K3684J7619R007m0p496j2185j4364j5835j8660
62489B312550k3294k8334l2128l4022l4187l3109l1618l0611l0198k9360k6973
$$ plain form
62571 2366816 2428449 2492501 2557745 2622343 2682772 2733995 2770918 2789678 2788058 2765867 2725495
62560 2725495 2671550 2609232 2542920 2476126 2411800 2351887 2296863 2246436 2200633 2159762 2123574
62549 2123574 2091296 2062566 2037629 2016288 1997238 1978980 1961086 1944048 1928126 1912970 1898467
62538 1898467 1885237 1873857 1863993 1854941 1846795 1840387 1835930 1832349 1828293 1823378 1818160 1813334 1809457
62525 1809457 1807110 1806744 1808399 1811939 1817521 1825523 1836131 1849203 1864351 1880856 1897870 1915226 1933887
62512 1933887 1955072 1979084 2005372 2033417 2062920 2093359 2124189 2155425 2187227 2218859 2248984
62501 2248984 2277215 2304408 2330820 2354504 2372123 2381130 2381090 2373594 2361409 2347045 2331210 2312550
62489 2312550 2289256 2260922 2228794 2194772 2160585 2127476 2095858 2065247 2035049 2005689 1978716
62478A978716k2962j8300j4041j0625p834n200k467K04K443M014M876N040M616
62465A918480L912L293K882K570K390K724L997O222Q881J1359J3525J5696J8014
62452B013945K0116K1603K2407K2334K0737J7317J2931Q699M529m20n798r907
62440B148493j1898j2904j4352j6109j7176j7287j6867j6109j5095j4355j4280
62429A982061j4321j3671j2398j1161j0097q903p695o882o335n500m284l068j940
62416A875806o77O36J744K883M625O983R313J1155J2619J3867J4812J5458J6138
62403A985362J7191J8500J9483J9605J9031J8649J9024J9559J9435J9215K0338
62392B195392K2903K5327K6785K8452L1374L4468L6072L6263L5951L4687L1358
$$ plain form
62478 1978716 1955754 1937454 1923413 1912788 1904954 1899754 1897287 1897491 1899934 1903948 1908824 1913864 1918480
62465 1918480 1922392 1925685 1928567 1931137 1933527 1936251 1940248 1946470 1955351 1966710 1980235 1995931 2013945
62452 2013945 2034061 2055664 2078071 2100405 2121142 2138459 2151390 2160089 2164618 2164198 2158400 2148493
62440 2148493 2136595 2123691 2109339 2093230 2076054 2058767 2041900 2025791 2010696 1996341 1982061
62429 1982061 1967740 1954069 1941671 1930510 1920413 1911510 1903815 1896933 1890598 1885098 1880814 1877746 1875806
62416 1875806 1875129 1875765 1877509 1880392 1885017 1892000 1901313 1912468 1925087 1938954 1953766 1969224 1985362
62403 1985362 2002553 2021053 2040536 2060141 2079172 2097821 2116845 2136404 2155839 2175054 2195392
62392 2195392 2218295 2243622 2270407 2298859 2330233 2364701 2400773 2437036 2472987 2507674 2539032
62381B539032K6641K2714K0548J9198J7920J7305J7920J9315K0954K2913K5078
62370B769538K6556K6470K4769K2145J9833J9266K1112K4638K8892L4235M1665
62359C059119N0909O0542O9769P8541Q5923Q9998Q9766Q5558P7174O3398M4108
62348C854805K1445k115k5493m7998o7950q3688r5080j02867j07229j08092j06147
62337C129591j02417r7216r0548q3088p5715o8428o0652n2545m5123l9115l4319
62326B380425l0094k5999k1954j8205j5076j2538j0273q286p078o869p049o758
62314B210246n721m080j879Q64L835O651R338J2189J5284J8353K1058K3269K5180
62301B334587K7187K9445L1445L2310L1458K8702K3883J6922Q295j077j0466j9449
$$ plain form
62381 2539032 2565673 2588387 2608935 2628133 2646053 2663358 2681278 2700593 2721547 2744460 2769538
62370 2769538 2796094 2822564 2847333 2869478 2889311 2908577 2929689 2954327 2983219 3017454 3059119
62359 3059119 3110028 3170570 3240339 3318880 3404803 3494801 3584567 3670125 3747299 3810697 3854805
62348 3854805 3876250 3874135 3848642 3800644 3732694 3649006 3553926 3451059 3343830 3235738 3129591
62337 3129591 3027174 2929958 2839410 2756322 2680607 2612179 2551527 2498982 2453859 2414744 2380425
62326 2380425 2350331 2324332 2302378 2284173 2269097 2256559 2246286 2238000 2230922 2224053 2217004 2210246
62314 2210246 2204525 2200445 2198566 2199430 2203265 2209916 2219254 2231443 2246727 2265080 2286138 2309407 2334587
62301 2334587 2361774 2391219 2422664 2454974 2486432 2515134 2539017 2555939 2564234 2563157 2552691 2533242
62289B533242k7379l3392l7083l8685l8464l6548l3355k9575k5471k0826j5779
62278B196685j1026o973l324J72L178N354O915Q267R546J0862J2530J4665J6958
62265B263809J9151K1456K4235K7558L1220L4896L8195M0901M3182M5162M6382
62254B636147M6208M4634M2040L8241L2653K5472J7901J0951M702j073o461j1778
62242B879637j7628k4084l0350l5504l9038m0586l9895l7303l3652k9425k4544
62231B527628j9037j3226p190r43M778Q833J1039J2273J3000J2657J0794P775
62219B568381M016l99m921q460j0678j2365j3986j4886j4563j3628j2669j1210
62207B454632q707n763l423j890p62J99J198K575M109M873M560M238N033O784
$$ plain form
62289 2533242 2505863 2472471 2435388 2396703 2358239 2321691 2288336 2258761 2233290 2212464 2196685
62278 2196685 2185659 2178686 2175362 2175534 2178712 2184066 2190981 2199248 2208794 2219656 2232186 2246851 2263809
62265 2263809 2282960 2304416 2328651 2356209 2387429 2422325 2460520 2501421 2544603 2589765 2636147
62254 2636147 2682355 2726989 2769029 2807270 2839923 2865395 2883296 2894247 2898949 2897876 2891415 2879637
62242 2879637 2862009 2837925 2807575 2772071 2733033 2692447 2652552 2615249 2581597 2552172 2527628
62231 2527628 2508591 2495365 2488175 2487232 2492010 2500843 2511882 2524155 2537155 2549812 2560606 2568381
62219 2568381 2572397 2571998 2567077 2558617 2547939 2535574 2521588 2506702 2492139 2478511 2465842 2454632
62207 2454632 2445925 2440162 2436739 2434849 2434087 2434286 2435484 2438059 2442168 2447041 2451601 2455839 2460872 2467656
62193B467656Q721J0586J2226J2945J2289J0817R285P784O473O255P637R809J1965
62180B594448J4639J8531K2866K6551L0252L5637M2904N0677N8194O5885P3666
62169C034250Q0248Q4457Q5959Q4225P7998O6340M9558K8851N904j6989l7394
62158C543407n3787o5786p3327p6435p5978p3721p1194o8924o6905o5203o3741
62147B788406o2070n9737n6671n3026m8941m4624m0448l6769l3653l0787k7728
62136B293952k4474k1702j9988j8855j7215j4851j2634j1038r367p064m790l369
62124B128605k442j142N52K204M010O328Q557R734J0089J0876J2717J5158J7783
62111B223029K0596K3240K4902K5271K4774K3666K1528J7851J2665O624R72k842
$$ plain form
62193 2467656 2476377 2486963 2499189 2512134 2524423 2535240 2544525 2552309 2558782 2565037 2572674 2582483 2594448
62180 2594448 2609087 2627618 2650484 2677035 2707287 2742924 2785828 2836505 2894699 2960584 3034250
62169 3034250 3114498 3198955 3284914 3369139 3447137 3513477 3563035 3591886 3597790 3580801 3543407
62158 3543407 3489620 3423834 3350507 3274072 3198094 3124373 3053179 2984255 2917350 2852147 2788406
62147 2788406 2726336 2666599 2609928 2556902 2507961 2463337 2422889 2386120 2352467 2321680 2293952
62136 2293952 2269478 2247776 2227788 2208933 2191718 2176867 2164233 2153195 2143828 2136764 2131974 2128605
62124 2128605 2126163 2125021 2125573 2127777 2131787 2138115 2146672 2156406 2166495 2177371 2190088 2205246 2223029
62111 2223029 2243625 2266865 2291767 2317038 2341812 2365478 2387006 2404857 2417522 2424146 2425118 2422276
62099B422276m187l846l069k418k049k487m097o111p281p304o661n351k878O02
62085B365139M318P990J1787J5239J7501J8785K0283K2434K4477K6005K7696K9928
62073B591582L1876L2629L2381L1897L1536L1333L1288L1077L0044K7979K5272
62062B928894K1988J7504J1446M406k686r175j4402j7617j8742j8603j8039j7341
62050B867633j6889j7437j9152k1041k2087k2427k2823k3538k4403k5447k6692
62039B625697k7635k7694k6951k5907k4664k2982k0871j8560j5918j2558q569
62028B393388m716j769R6J201J992K731L393L740L550K816J755P74K79K72J54
62013B409656p22k211l490m075m250m284l652j650J387M054N226N116M775M778
$$ plain form
62099 2422276 2418089 2414243 2411174 2408756 2406707 2404220 2400123 2394012 2386731 2379427 2372766 2367415 2364537 2365139
62085 2365139 2369457 2377447 2389234 2404473 2421974 2440759 2461042 2483476 2507953 2533958 2561654 2591582
62073 2591582 2623458 2656087 2688468 2720365 2751901 2783234 2814522 2845599 2875643 2903622 2928894
62062 2928894 2950882 2968386 2979832 2984238 2981552 2972377 2957975 2940358 2921616 2903013 2884974 2867633
62050 2867633 2850744 2833307 2814155 2793114 2771027 2748600 2725777 2702239 2677836 2652389 2625697
62039 2625697 2598062 2570368 2543417 2517510 2492846 2469864 2448993 2430433 2414515 2401957 2393388
62028 2393388 2388672 2386903 2386999 2388200 2390192 2392923 2396316 2400056 2403606 2406422 2408177 2408951 2409230 2409502 2409656
62013 2409656 2408934 2406723 2403233 2399158 2394908 2390624 2386972 2385322 2386709 2390763 2395989 2401105 2405880 2410658
61999B410658M741M159L200K332J458O4j796l416m541n851p855r936j1189j1693
61985B370335j2196j2859j3223j3209j3181j3054j2268j0840r563q901q398p515
61973B235128o358n271m253l224k395j926j581r84J3J456L356N406P011P916Q540
61958B242834R397J0451J1304J1830J2264J2796J3290J3503J3514J3858J5046
61947B380087J6943J8803K0216K1667K3846K6620K9177L1049L2493L3876L5198
61936B669975L6231L6762L6648L5959L5063L4156L2778L0174K6086K0826J4709
61925C009367P961J109n110j0306j4468j7358j8486j7711j5507j2387q509l975
61913B894620Q71N645J0180J4484J8501K1891K3947K3900K1669J8024J3782R023
$$ plain form
61999 2410658 2415399 2419558 2422758 2425090 2426548 2426612 2424816 2421400 2416859 2411008 2403153 2393217 2382028 2370335
61985 2370335 2358139 2345280 2332057 2318848 2305667 2292613 2280345 2269505 2259942 2251041 2242643 2235128
61973 2235128 2228770 2223499 2219246 2216022 2213627 2211701 2210120 2209136 2209149 2210605 2213961 2219367 2226378 2234294 2242834
61958 2242834 2252231 2262682 2273986 2285816 2298080 2310876 2324166 2337669 2351183 2365041 2380087
61947 2380087 2397030 2415833 2436049 2457716 2481562 2508182 2537359 2568408 2600901 2634777 2669975
61936 2669975 2706206 2742968 2779616 2815575 2850638 2884794 2917572 2947746 2973832 2994658 3009367
61925 3009367 3017328 3018437 3013327 3003021 2988553 2971195 2952709 2934998 2919491 2907104 2898595 2894620
61913 2894620 2895491 2901136 2911316 2925800 2944301 2966192 2990139 3014039 3035708 3053732 3067514 3076537
61901C076537L414l018r851j6557k2418k6595k8966l0491l2021l3122l2863l1355
61889B812694k9455k7246k4076k0183j6903j4891j3245j1037q788p698p890q192
61877B623090p441n575l488k062j238j61J706L917N789P329Q863J0179J0902J1463
61863B663273J2692J4583J6486J8476K1406K5428K9580L3196L6780M0949M5347
61852B958196M9141N1952N3801N4674N4505N3229N0608M6439M0985L4719K7641
61841C475890J9507J0640J910n993j2621j7336j9742k0313j9567j6853j1233l424
61829C380865M624J2128J9821K7704L4246L8438M0888M2070M1055L7042L0597
61818C709478K2157J0831l952k0688l7134n2305o5639p5403p9858p9516p6468
$$ plain form
61901 3076537 3079951 3076933 3067082 3050525 3028107 3001512 2972546 2942055 2910034 2876912 2844049 2812694
61889 2812694 2783239 2755993 2731917 2711734 2694831 2679940 2666695 2655658 2646870 2639172 2631282 2623090
61877 2623090 2615649 2610074 2606586 2604524 2603286 2603125 2604831 2608748 2614537 2621866 2630729 2640908 2651810 2663273
61863 2663273 2675965 2690548 2707034 2725510 2746916 2772344 2801924 2835120 2871900 2912849 2958196
61852 2958196 3007337 3059289 3113090 3167764 3222269 3275498 3326106 3372545 3413530 3448249 3475890
61841 3475890 3495397 3506037 3507947 3501954 3489333 3471997 3452255 3431942 3412375 3395522 3384289 3380865
61829 3380865 3385489 3397617 3417438 3445142 3479388 3517826 3558714 3600784 3641839 3678881 3709478
61818 3709478 3731635 3742466 3738514 3717826 3680692 3628387 3562748 3487345 3407487 3327971 3251503
61807C251503p1839o5483n7809n0147m3219l6835l1167k6893k3811k0662j6796
61796B806842j2948j0027q070o711n766m904l652k171j359j696k547k965k743
61783B741283k259j837j659j887k436k821k673k302k450l447m738n395n072m344
61769B697963m004m197m506m773n297o177p052p736q517r484j0193j0360j0392
61756B605275j0658j0803j0417r851r632r466q737p679p184p421p603p191o574
61743B492059o304o332o261n901n319m588l731k665j205O34K385L522M119M738
61729B465151N735P010Q400R861J1139J1701J1297J0328R500R140Q981Q493P389
61716B584125N873M390L162J985N38j285l376n506p383q734r556j0016j0027r206
$$ plain form
61807 3251503 3179664 3114181 3056372 3006225 2963006 2926171 2895004 2868111 2844300 2823638 2806842
61796 2806842 2793894 2783867 2775797 2769086 2763320 2758416 2754764 2752593 2751234 2749538 2746991 2744026 2741283
61783 2741283 2739024 2737187 2735528 2733641 2731205 2728384 2725711 2723409 2720959 2717512 2712774 2707379 2702307 2697963
61769 2697963 2693959 2689762 2685256 2680483 2675186 2669009 2661957 2654221 2645704 2636220 2626027 2615667 2605275
61756 2605275 2594617 2583814 2573397 2563546 2553914 2544448 2535711 2528032 2520848 2513427 2505824 2498633 2492059
61743 2492059 2485755 2479423 2473162 2467261 2461942 2457354 2453623 2450958 2449753 2450387 2452772 2456294 2460413 2465151
61729 2465151 2470886 2477896 2486296 2496157 2507296 2518997 2530294 2540622 2550122 2559262 2568243 2576736 2584125
61716 2584125 2589998 2594388 2597550 2599535 2600073 2598788 2595412 2589906 2582523 2573789 2564233 2554217 2544190 2534984
61702B534984p483n508m116l478l036k263j265n31k25J43J225L022M856O240P483
61687B530048Q987J0279J0295Q538N501K002j256l567m456m330m240m655m888
61674B548258l929j428K280O500J0457J3730J6679J9820K2721K4154K3490K1184
61662B703916J7790J3480Q976N946N644P731J0936J4210J6745J7750J7181J6190
61650B856495J5987J6553J7030J6988J6678J6606J7472J9898K3284K5404K4022
61639C066417J8771J0736P59j0754k2626l2834m0052m4587m7565m9684n0882n0754
61627B746945m9011m5775m1502l6530l0898k4892j9343j5044j2017r761p942o562
61615B447668n680n337n451n521m841l433k309k271k835k892k151j343j150j507
$$ plain form
61702 2534984 2527501 2521993 2517877 2514399 2511363 2509100 2507835 2507304 2507079 2507222 2508447 2511469 2516325 2522565 2530048
61687 2530048 2539035 2549314 2559609 2568147 2573648 2575650 2574394 2570827 2566371 2562041 2557801 2553146 2548258
61674 2548258 2544329 2542901 2545181 2551681 2562138 2575868 2592547 2612367 2635088 2659242 2682732 2703916
61662 2703916 2721706 2735186 2744162 2750108 2755752 2763483 2774419 2788629 2805374 2823124 2840305 2856495
61650 2856495 2872482 2889035 2906065 2923053 2939731 2956337 2973809 2993707 3016991 3042395 3066417
61639 3066417 3085188 3095924 3096683 3085929 3063303 3030469 2990417 2945830 2898265 2848581 2797699 2746945
61627 2746945 2697934 2652159 2610657 2574127 2543229 2518337 2498994 2483950 2471933 2462172 2454230 2447668
61615 2447668 2441988 2436651 2431200 2425679 2420838 2417405 2415096 2412825 2409990 2407098 2404947 2403604 2402454 2400947
61601B400947j874j797j204m52R6N52J313K299L015L457M311N851P362Q125Q287
61586B440288Q298Q216Q192Q868J0538J2471J3843J4853J6266J8377K1135K4566
61574B605911K8429L2033L5365L9598M5512N2007N7324O1117O4038O5668O4301
61563C151303N8741M9123L6083K0420L777j1541k3893l2844l8480m0983m0921
61552C130785l9011l5395k9842k2768j5286q141j234N674J2396J8497K3388K6220
61540C065283K6270K3626J9188J4033R045M701O52m033r499j4312j6740j6465
61528C101749j4231j0371m803J733P617J1600J3259J2454R396N292J765o76k869
61515C131915n601q724j1539j3141j2418q765l033L104Q953J5278K2847L1280
$$ plain form
61601 2400947 2399073 2397276 2396072 2395620 2395716 2396268 2397581 2399880 2402895 2406352 2410663 2416514 2423876 2432001 2440288
61586 2440288 2448586 2456802 2464994 2473862 2484400 2496871 2510714 2525567 2541833 2560210 2581345 2605911
61574 2605911 2634340 2666373 2701738 2741336 2786848 2838855 2896179 2957296 3021334 3087002 3151303
61563 3151303 3210044 3259167 3295250 3315670 3319447 3307906 3284013 3251169 3212689 3171706 3130785
61552 3130785 3091774 3056379 3026537 3003769 2988483 2980342 2979108 2984782 2997178 3015675 3039063 3065283
61540 3065283 3091553 3115179 3134367 3148400 3157445 3162146 3162798 3158765 3149266 3134954 3118214 3101749
61528 3101749 3087518 3077147 3072344 3074077 3081694 3093294 3106553 3119007 3128403 3133695 3135460 3134784 3131915
61515 3131915 3126314 3117590 3106051 3092910 3080492 3071727 3068694 3071798 3080751 3096029 3118876 3150156
61503C150156L9488M6616N2515N7976O4383P2394Q1060Q8986R5965J02358J06946
61492C958843J06850R9990Q6759O9145M9405K9910J3044M07p405j0042p180O70
61480D390396J2065K5628M0388N4797O6485P3601P5740P3053O5138N1422L2010
61469D960723P632k0708n1379q1665j08320j28713j41550j46911j45762j39261
61459D004086j28473j14903j00766q7939p6719o6247n6042m6403l7393k8457j9211
61448C241533r876p00Q447J7789K7497L7843M8839N9762O9663P8091Q4405Q6528
61436C749821Q1543O7933M6699K0641o402k9920m6186n4243n5717n2484m5410
61425C676275l5417k4139j2654o16J2537K6293L9667N2237O3718P2977P8105P7037
$$ plain form
61503 3150156 3189644 3236260 3288775 3346751 3411134 3483528 3564588 3653574 3749539 3851897 3958843
61492 3958843 4065693 4165683 4252442 4321587 4370992 4400902 4413946 4414353 4406948 4396906 4389726 4390396
61480 4390396 4402461 4428089 4468477 4523274 4589759 4663360 4739100 4812153 4877291 4928713 4960723
61469 4960723 4968355 4947647 4896268 4814603 4706283 4577570 4436020 4289109 4143347 4004086
61459 4004086 3875613 3760710 3659944 3572005 3495286 3429039 3372997 3326594 3289201 3260744 3241533
61448 3241533 3231657 3230957 3239404 3257193 3284690 3322533 3371372 3431134 3500797 3578888 3663293 3749821
61436 3749821 3831364 3899297 3945996 3966637 3960235 3930315 3884129 3829886 3774169 3721685 3676275
61425 3676275 3640858 3616719 3604065 3603449 3615986 3642279 3681946 3734183 3797901 3870878 3948983 4026020
61413D026020O7828M9348K2784p679l6483n9337p4670q3265q6909q7030q4270
61402C646337p9274p3367o7791o2562n6967n1068m5671m0868l5809l0091k4316
61391C078553j8905j3436p607j873L285P969J2336J6313K0105K4145K8297L1911
61379C181093L4743L6829L7418L5466L1432K7099K3115J8252J1853N428P27k462
61367C440993n356q149j0223j1508j2220j1906j0010o925l440L27M478Q367J1203
61354C385631J3229J5241J7260J8636J9242J9710K0694K2566K5543K9450L3561
61343C620763L7275M0681M4065M7314N0172N2454N3355N1312M5226L5404K2780
61332D100801Q039p848k3002l5566m4808n0751n3507n3767n2975n1861m9514m5062
$$ plain form
61413 4026020 4093848 4143196 4165980 4158301 4121818 4062481 3987811 3904546 3817637 3730607 3646337
61402 3646337 3567063 3493696 3425905 3363343 3306376 3255308 3209637 3168769 3132960 3102869 3078553
61391 3078553 3059648 3046212 3038605 3036732 3040017 3047986 3060322 3076635 3096740 3120885 3149182 3181093
61379 3181093 3215836 3252665 3290083 3325549 3356981 3384080 3407195 3425447 3437300 3442728 3443455 3440993
61367 3440993 3435637 3427488 3417265 3405757 3393537 3381631 3371621 3364696 3361256 3361583 3366061 3374428 3385631
61354 3385631 3398860 3414101 3431361 3449997 3469239 3488949 3509643 3532209 3557752 3587202 3620763
61343 3620763 3658038 3698719 3742784 3790098 3840270 3892724 3946079 3997391 4042617 4078021 4100801
61332 4100801 4108840 4100992 4077990 4042424 3997616 3946865 3893358 3839591 3786616 3734755 3685241 3640179
61320C640179l9538l4725l0759k6372k1242j6481j2671q914m345N42M555P120
61308C457349Q451Q897Q505O978M059K08l295n310n720n006l294m46L231P131
61294C481738J1053J5153J9331K3345K7460L2342L8195M4435N0251N5110N8782
61283C857195O1128O1842O0137N4966M5830L3256J8493L124j0942k1856k8781
61272D134392l2144l2706l0865k7059k2030j6150r122r02P610J5334K1797K6680
61260D034835K9418K9944K9089K7474K4742K0716J6538J3643J2296J2206J3948
61249D264849J8530K5985L5643M7465O1771P7751R3445J07234J18106J24361J23193
61238E098333J12208R1104O2161K9804p37k5623m3857n6238o3308o4982o1719
$$ plain form
61320 3640179 3600641 3565916 3535157 3508785 3487543 3471062 3458391 3449477 3445132 3445674 3450229 3457349
61308 3457349 3465800 3474697 3483202 3490180 3494239 3494447 3491152 3485842 3480122 3475116 3471822 3471376 3474607 3481738
61294 3481738 3492791 3507944 3527275 3550620 3578080 3610422 3648617 3693052 3743303 3798413 3857195
61283 3857195 3918323 3980165 4040302 4095268 4141098 4174354 4192847 4195971 4185029 4163173 4134392
61272 4134392 4102248 4069542 4038677 4011618 3989588 3973438 3964316 3963414 3971024 3986358 4008155 4034835
61260 4034835 4064253 4094197 4123286 4150760 4175502 4196218 4212756 4226399 4238695 4250901 4264849
61249 4264849 4283379 4309364 4345007 4392472 4454243 4531994 4625439 4732673 4850779 4975140 5098333
61238 5098333 5210541 5301645 5363806 5393610 5392873 5367250 5323393 5267155 5203847 5138865 5077146
61227E077146n4689m4633l1635j6228J94J6332L1496M4855N4826N9467N6959M5790
61215E239880K5657j097k9451n3920p1080q0332q2941q0775p5641o9221o3105
61204D657974n8286n4523n0740m6439m2277l8830l5504l1463k7171k4012k2534
61193D226195k2011k1734k1796k2505k3774k5433k7618l0579l4412l8935m3507
61182C913891m7129m9119m9544m8632m6215m2421l8459l5720l4128l2363k9771
61171C460390k7119k5180k3439k0762j6857j2522q621n225j697K551P484J2564
61159C341567J7288K1363K4500K6557K8057K9940L2491L4972L6645L7525L7788
61148C668693L7132L5370L2979L0349K7138K3192J9572J7580J7187J7430J8081
$$ plain form
61227 5077146 5022457 4977824 4946189 4929961 4930155 4946487 4977983 5022838 5077664 5137131 5194090 5239880
61215 5239880 5265537 5264440 5234989 5181069 5109989 5029657 4946716 4865941 4790300 4721079 4657974
61204 4657974 4599688 4545165 4494425 4447986 4405709 4366879 4331375 4299912 4272741 4248729 4226195
61193 4226195 4204184 4182450 4160654 4138149 4114375 4088942 4061324 4030745 3996333 3957398 3913891
61182 3913891 3866762 3817643 3768099 3719467 3673252 3630831 3592372 3556652 3522524 3490161 3460390
61171 3460390 3433271 3408091 3384652 3363890 3347033 3334511 3325890 3320665 3318968 3321519 3329003 3341567
61159 3341567 3358855 3380218 3404718 3431275 3459332 3489272 3521763 3556735 3593380 3630905 3668693
61148 3668693 3705825 3741195 3774174 3804523 3831661 3854853 3874425 3892005 3909192 3926622 3944703
61137C944703J9820K2796K6047K8550L0020L0533L0003K8152K4571J8941J1778
61126D215914M687p55m275o567q001q441q047p451p179p610r284j2481j6572k0551
61112D103387k4002k6925k8947k9532k8840k7493k5721k3585k1796k1236k1710
61101C823600k2201k2434k3160k4688k6098k6229k4836k2534k0236j8725j8160
61090C574299j7832j6928j5506j4153j2883j1134q757o173l535n23K882O199R130
61077C485086J1851J4424J6470J7560J7556J6645J5416J4591J4184J3338J1656
61066C648777J0266J0674J2822J5268J7015J8298J9695K1511K3856K6406K8208
61055C852796K8679K8630K9406L1216L3273L5324L7755M0454M2930M5554M9256
$$ plain form
61137 3944703 3964523 3987319 4013366 4041916 4071936 4102469 4132472 4160624 4185195 4204136 4215914
61126 4215914 4220601 4219846 4215571 4209004 4201003 4192562 4184515 4177064 4169885 4162275 4152991 4140510 4123938 4103387
61112 4103387 4079385 4052460 4023513 3993981 3965141 3937648 3911927 3888342 3866546 3845310 3823600
61101 3823600 3801399 3778965 3755805 3731117 3705019 3678790 3653954 3631420 3611184 3592459 3574299
61090 3574299 3556467 3539539 3524033 3509880 3496997 3485863 3477106 3470933 3467398 3466875 3469757 3475956 3485086
61077 3485086 3496937 3511361 3527831 3545391 3562947 3579592 3595008 3609599 3623783 3637121 3648777
61066 3648777 3659043 3669717 3682539 3697807 3714822 3733120 3752815 3774326 3798182 3824588 3852796
61055 3852796 3881475 3910105 3939511 3970727 4004000 4039324 4077079 4117533 4160463 4206017 4255273
61044D255273N3909N8341O2078O5668O9026P0879P0285O7347O2007N3555M2066
61033D930434K9174J6727N705l035q204r160o600j505N640J3968K1707K7598L1978
61020E054427L5579L8058L8685L7809L6635L6024L6509L9005M4420N2787O3592
61009E513530P6837R2922J11510J31290J51001J70425J90561K13557K42473K80568
60999G174674L30410L93819M72401N67661O80486Q11365R61664J134062J330722
60990A3857264J551788J796353K059747K317218K501089K503912K232792J687438
60982C0507601R90920L32618j32566l44169l24774j44803Q7169K25070J26328
60973C1323394k68853q87045j555434k097318k413348k497792k402647k194412
$$ plain form
61044 4255273 4309182 4367523 4429601 4495269 4564295 4635174 4705459 4772806 4834813 4888368 4930434
61033 4930434 4959608 4976335 4982040 4979005 4970801 4961641 4955041 4953536 4959176 4973144 4994851 5022449 5054427
61020 5054427 5090006 5128064 5166749 5204558 5241193 5277217 5313726 5352731 5397151 5449938 5513530
61009 5513530 5590367 5683289 5794799 5926089 6077090 6247515 6438076 6651633 6894106 7174674
60999 7174674 7505084 7898903 8371304 8938965 9619451 10430816 11392480 12526542 13857264
60990 13857264 15409052 17205405 19265152 21582370 24083459 26587371 28820163 30507601
60982 30507601 31498521 31831139 31698573 31354404 31029630 30884827 30971996 31197066 31323394
60973 31323394 31054541 30167496 28612062 26514744 24101396 21603604 19200957 17006545
60965A7006545j930939j655565j396421j167161r70935q06031o69291n56752m64222
60956G389228l88543l27768k79908k42222k11994j87429j67519j51403j38042
60947E294400j26313j15495j05778r7876r1732q6287q1018p6940p5060p4458p3056
60936D290387o9845o5219n9638n3485m7930m4172m1724l8852l4903l0811k7170
60925C776638k3442j9314j5373j1955q745o000m768n308o573p815r448j1760j4119
60912C632018j6018j7590j8508j7762j5209j2131r484o966m504l208l796n333
60900C501509o598p533q341q286o616l673j28L928Q137J1223J2358J2342J2340
60887C520662J2384J2196J2430J3790J5675J7027J7961J9400K1737K4758K8147
$$ plain form
60965 17006545 15075606 13420041 12023620 10856459 9885524 9079493 8410202 7853450 7389228
60956 7389228 7000685 6672917 6393009 6150787 5938793 5751364 5583845 5432442 5294400
60947 5294400 5168087 5052592 4946814 4848938 4757206 4670919 4589901 4512961 4437901 4363443 4290387
60936 4290387 4220542 4155323 4095685 4042200 3994270 3950098 3908374 3869522 3834619 3803808 3776638
60925 3776638 3753196 3733882 3718509 3706554 3697809 3691809 3687041 3681733 3675160 3667345 3657897 3646137 3632018
60912 3632018 3616000 3598410 3579902 3562140 3546931 3534800 3525316 3518350 3513846 3510638 3506842 3501509
60900 3501509 3494911 3487378 3479037 3470751 3464135 3460462 3460334 3464262 3472399 3483622 3495980 3508322 3520662
60887 3520662 3533046 3545242 3557672 3571462 3587137 3604164 3622125 3641525 3663262 3688020 3716167
60876C716167L1051L1926L0019K6272K1766J6132Q801R49n355r322j1389j1551
60864C845466r413n653j796J507M792Q330J1592J4203J6442J8547K0339K1552
60852C945908K2004K1536K0251J8603J6714J4167J1026Q353O725M948J334m189
60840D087380j0328j6363k2562k8845l4281l8076m0187m0897m0498l9413l8012
60829C737918l6392l4707l3344l2182l0255k7010k3344k0543j8608j6707j4873
60818C449953j4034j4460j5309j5889j6412j7299j8435j9334j9522j8748j7304
60807C263207j6016j5446j5237j4651j3528j2211j0853r355p804o422n244m229
60795C132211l447k829k176j695k049l494n572p898j0467j2780j3802j3443j3060
$$ plain form
60876 3716167 3747218 3779144 3809163 3835435 3857201 3873333 3882134 3883083 3877728 3868406 3857017 3845466
60864 3845466 3836053 3830400 3828604 3830111 3834903 3843233 3854825 3869028 3885470 3904017 3924356 3945908
60852 3945908 3967912 3989448 4009699 4028302 4045016 4059183 4070209 4078562 4085287 4090235 4091569 4087380
60840 4087380 4077052 4060689 4038127 4009282 3975001 3936925 3896738 3855841 3815343 3775930 3737918
60829 3737918 3701526 3666819 3633475 3601293 3571038 3544028 3520684 3500141 3481533 3464826 3449953
60818 3449953 3435919 3421459 3406150 3390261 3373849 3356550 3338115 3318781 3299259 3280511 3263207
60807 3263207 3247191 3231745 3216508 3201857 3188329 3176118 3165265 3155910 3148106 3141684 3136440 3132211
60795 3132211 3128764 3125935 3123759 3122064 3120015 3116521 3110949 3103051 3092584 3079804 3066002 3052559 3039499
60782C039499j3636j4447j4496j4108j3897j3208j1174q531o683n440l441n44
60770B919894J950L505N095P440R936J1873J3593J5805J8486K0911K2294K2222
60758C073004K0904J8945J6506J2926P746J782l517p492j0343j2189j2901j2642
60746C092729j1758j0328q577p373p438q357r186r665j0046j0075r309q083p135
60733B975399o408n276l842k929k804k918k878k779k527j704k19J604L522N405
60719B951646O965Q124R330J0882J2320J3266J4254J5829J7360J7931J7972J8715
60707C114594K0315K1738K2395K2563K2289K1156J9309J7543J6252J5282J4895
60696C328331J5900J8600K2626K7769L4087M1072M7598N2853N6501N7996N6524
$$ plain form
60782 3039499 3025863 3011416 2996920 2982812 2968915 2955707 2944533 2936002 2929319 2923879 2920438 2919894
60770 2919894 2921844 2925349 2930444 2937884 2947820 2959693 2973286 2989091 3007577 3028488 3050782 3073004
60758 3073004 3093908 3112853 3129359 3142285 3150031 3151813 3148296 3140804 3130461 3118272 3105371 3092729
60746 3092729 3080971 3070643 3062066 3054693 3047255 3038898 3029712 3020047 3010001 2999926 2990617 2982534 2975399
60733 2975399 2968991 2963715 2959873 2956944 2954140 2951222 2948344 2945565 2943038 2941334 2941115 2942719 2946241 2951646
60719 2951646 2958611 2966735 2976065 2986947 2999267 3012533 3026787 3042616 3059976 3077907 3095879 3114594
60707 3114594 3134909 3156647 3179042 3201605 3223894 3245050 3264359 3281902 3298154 3313436 3328331
60696 3328331 3344231 3362831 3385457 3413226 3447313 3488385 3535983 3588836 3645337 3703333 3759857
60685C759857N1674M3572L2549J9509O323n067j3848j9963k3080k2977k0571j7395
60673C790583j4233j1261r051q236q495r229j0846j3996j7766k0257k0857k0403
60661C625953j9201j6537j2328p596k938J948O931J1113J4251J7049J9610K1087
60649C659342K1385K1840K3507K6084K9209L3505L9503M6566N3739O0750O7459
60638D082889P3093P6684P7490P4465O6254N2454L4348J4054o394k4882l9252
60627D481203m8273n2203n2082m9111m4698m0175l5980l1868k8142k5889k5734
60616D047048k7170k9374l1829l4042l5721l7527m0672m5285m9982n3305n4782
60605C607359n4431n2312m8950m5197m1210l6422l0872k5559k1172j7390j3825
$$ plain form
60685 3759857 3811531 3855103 3887652 3907161 3913484 3908417 3894569 3874606 3851526 3828549 3807978 3790583
60673 3790583 3776350 3765089 3756038 3747802 3739307 3730078 3719232 3705236 3687470 3667213 3646356 3625953
60661 3625953 3606752 3590215 3577887 3570291 3567353 3569301 3576232 3587345 3601596 3618645 3638255 3659342
60649 3659342 3680727 3702567 3726074 3752158 3781367 3814872 3854375 3900941 3954680 4015430 4082889
60638 4082889 4155982 4232666 4310156 4384621 4450875 4503329 4537677 4551731 4545337 4520455 4481203
60627 4481203 4432930 4380727 4328645 4279534 4234836 4194661 4158681 4126813 4098671 4072782 4047048
60616 4047048 4019878 3990504 3958675 3924633 3888912 3851385 3810713 3765428 3715446 3662141 3607359
60605 3607359 3552928 3500616 3451666 3406469 3365259 3328837 3297965 3272406 3251234 3233844 3220019
60594C220019j0683q156o066m497l707l124j526J209L699N032O065Q069J0985
60581C217319J3939J6655J9424K2207K4521K5989K6523K6218K5341K4048K2111
60570C464295J9347J6318J3876J2167J0876J0348J1358J3699J6098J7645J8288
60559C624315J7809J5596J1614O440K15p118j4321j9259k1319k1966k2342k1809
60547C547855j9674j6705j3840j0665o386j283L918R169J4496J9250K3053K6777
60535C575965L1383L6473M0982M4725M8055N0460N0500M6976L9527K8503J5078
60524D008627J138j1599k2203l0009l4212l4570l2008k7865k2889j7366j1644
60513C765400o015n02M816R617J3710J7075J9407K0251J9701J8303J6240J3519
$$ plain form
60594 3220019 3209336 3201180 3195114 3190617 3186910 3183786 3182260 3183469 3187168 3192200 3198265 3206334 3217319
60581 3217319 3231258 3247913 3267337 3289544 3314065 3340054 3366577 3392795 3418136 3442184 3464295
60570 3464295 3483642 3499960 3513836 3526003 3536879 3547227 3558585 3572284 3588382 3606027 3624315
60559 3624315 3642124 3657720 3669334 3675774 3675989 3668871 3654550 3635291 3613972 3592006 3569664 3547855
60547 3547855 3528181 3511476 3497636 3486971 3480585 3479302 3483220 3492389 3506885 3526135 3549188 3575965
60535 3575965 3607348 3643821 3684803 3729528 3777583 3828043 3878543 3925519 3965046 3993549 4008627
60524 4008627 4009765 3998166 3975963 3945954 3911742 3877172 3845164 3817299 3794410 3777044 3765400
60513 3765400 3759385 3758883 3763699 3773316 3787026 3804101 3823508 3843759 3863460 3881763 3898003 3911522
60501C911522J1003J0137J1373J3995J7701K3027K9861L6940M3500N0083N6853
60490D215995O2384O5133O5102O3044N8987N2538M3928L3831K2791J1542J141
60479D696416q005j6549k5028l3069m0306m7153n3923o0091o5098o8994p1527
60468D206673p1693o9029o4540n9491n4114m8210m2108l6122k9989k3655j7898
60457C689824j3326r595o234l282n39K668O200Q851J0272J1798J4353J6839J7972
60444C745801J8454J9792K1957K3719K4562K4770K4321K3140K1832K0881J9748
60433C988977J8013J6634J6665J7359J7081J5523J3525J1068P113J342n211j1266
60421D106823j5957j8567j8694j6642j3060q506l948q82J26M14J741M495Q265
$$ plain form
60501 3911522 3922525 3932662 3944035 3958030 3975731 3998758 4028619 4065559 4109059 4159142 4215995
60490 4215995 4278379 4343512 4408614 4471658 4530645 4583183 4627111 4660942 4683733 4695275 4696416
60479 4696416 4688411 4671862 4646834 4613765 4573459 4526306 4472383 4412292 4347194 4278200 4206673
60468 4206673 4134980 4065951 4001411 3941920 3887806 3839596 3797488 3761366 3731377 3707722 3689824
60457 3689824 3676498 3666903 3660669 3657387 3656848 3659516 3665716 3674567 3684839 3696637 3710990 3727829 3745801
60444 3745801 3764255 3784047 3806004 3829723 3854285 3879055 3903376 3926516 3948348 3969229 3988977
60433 3988977 4006990 4023624 4040289 4057648 4074729 4090252 4103777 4114845 4121958 4123300 4118089 4106823
60421 4106823 4090866 4072299 4053605 4036963 4023903 4015397 4011449 4010567 4010693 4011107 4012848 4017343 4025608
60408D025608J3374K0452K9055L8155M7598N7909O9083Q0775R3180J06465J19694
60397D701348J31527J41598J50003J55748J56978J52363J41180J22660R6847O6041
60387F016293L4065M195k1409m0875n2937n8047n7989n4346m8252m1208l4801
60376E644689k9707k5972k3996k4130k5598k7030k7822k7852k6259k1922j5098
60365E369303p378j02O139J0631J2413J0891N633m142j8662l6217n3821o9066
60353E225622q0611q7457q9272q7125q2574p6103o7661n8352n0153m4016l9564
60342D462734l6465l4793l4131l3728l3569l3973l4357l3688l2085l0513k8933
60331D096499k6307k2480j8516j5023j1572q085n220l133j204N71J400J255J331
$$ plain form
60408 4025608 4038982 4059434 4088489 4126644 4174242 4232151 4301234 4382009 4475189 4581654 4701348
60397 4701348 4832875 4974473 5124476 5280224 5437202 5589565 5730745 5853405 5950252 6016293
60387 6016293 6050358 6054553 6033144 5992269 5939332 5881285 5823296 5768950 5720698 5679490 5644689
60376 5644689 5614982 5589010 5565014 5540884 5515286 5488256 5460434 5432582 5406323 5384401 5369303
60365 5369303 5361925 5361823 5367962 5378593 5391006 5401897 5407530 5403388 5384726 5348509 5294688 5225622
60353 5225622 5145011 5057554 4968282 4881157 4798583 4722480 4654819 4596467 4546314 4502298 4462734
60342 4462734 4426269 4391476 4357345 4323617 4290048 4256075 4221718 4188030 4155945 4125432 4096499
60331 4096499 4070192 4047712 4029196 4014173 4002601 3994516 3989296 3986163 3984959 3985530 3986930 3988185 3989516
60318C989516K348L605M263M417M364L862K805J675Q17mr04j541j813k012j900
60303D009498n68K248N479P935R641J1382J3336J4589J3961J1147P103L095p74
60290D108072n475j1150j6156j8802j9264j8742j7426j4666j0652o451k571J138
60278C967855M369O624Q471J0988J3944J5953J6600J6884J7363J7289J6016J3887
60266D126243J1405Q700O256M880M513M203L679L778M947O416P391P959Q301Q097
60252D216768P305O647O738P471Q609J0243J2294J4361J6339J8429K0408K1614
60240D367226K1896K1736K1478K1214K1428K2672K4703K6922K9567L3205L7196
60229D649243M0199M2372M5420N0097N5252N9919O4731P0406P6233Q1196Q5532
$$ plain form
60318 3989516 3991864 3995469 3999732 4004149 4008513 4012375 4015180 4016855 4017672 4017668 4016764 4015223 4013410 4011398 4009498
60303 4009498 4008930 4011178 4016657 4024592 4034233 4045615 4058951 4073540 4087501 4098648 4105751 4108846 4108072
60290 4108072 4102597 4091447 4075291 4056489 4037225 4018483 4001057 3986391 3975739 3969288 3966717 3967855
60278 3967855 3972224 3978848 3987319 3998307 4012251 4028204 4044804 4061688 4079051 4096340 4112356 4126243
60266 4126243 4137648 4146348 4152604 4157484 4161997 4166200 4169879 4173657 4178604 4185020 4192411 4200370 4208671 4216768
60252 4216768 4224073 4230720 4237458 4244929 4253538 4263781 4276075 4290436 4306775 4325204 4345612 4367226
60240 4367226 4389122 4410858 4432336 4453550 4474978 4497650 4522353 4549275 4578842 4612047 4649243
60229 4649243 4689442 4731814 4777234 4827331 4882583 4942502 5007233 5077639 5153872 5235068 5320600
60218E320600R0127R5145J00194J05213J10328J15385J20247J25258J30908J37426
60208F450831J44853J52798J60034J64953J66532J64199J56992J44164J26816
60199G832172J07726Q9281P2568N8562M8405M1828L6661L0831K3903J6106P116
60188H365159l126j3449k2452k9869l6063m0800m3405m3709m2230l9690l6777
60177H013589l3835l0526k6506k2777k1579k4536l1658m2510n7232p5685r6300
60166G550445j16534j33987j46734j53434j54055j50101j43573j35865j27737
60157F288425j19538j11007j01445r0527p8525o5662n1981l8005k4741j2794k241
60146E591959O493J2669J6382J8627J9683J8510J4352Q143J658m051q842j2773
$$ plain form
60218 5320600 5410727 5505872 5606066 5711279 5821607 5936992 6057239 6182497 6313405 6450831
60208 6450831 6595684 6748482 6908516 7073469 7240001 7404200 7561192 7705356 7832172
60199 7832172 7939898 8029179 8101747 8160309 8208714 8250542 8287203 8318034 8341937 8358043 8365159
60188 8365159 8362033 8348584 8326132 8296263 8260200 8219400 8175995 8132286 8090056 8050366 8013589
60177 8013589 7979754 7949228 7922722 7899945 7878366 7853830 7822172 7779662 7722430 7646745 7550445
60166 7550445 7433911 7299924 7153190 6999756 6845701 6695600 6552027 6416162 6288425
60157 6288425 6168887 6057880 5956435 5865908 5787383 5721721 5669740 5631735 5606994 5594200 5591959
60146 5591959 5598452 5611121 5627503 5646130 5665813 5684323 5698675 5706818 5708476 5704425 5695583 5682810
60134E682810j5872j8209j9897k1526k4589l0527l8997m7907n5502o1639o6741
60123E281404p0459p2001p0999o7538o1864n4520m6266l7639k9164k1775j6176
60112D733003j1754p143k049K670O836J1562J7543K3877K9153L2742L4558L4578
60100D905576L3233L1413K9482K6890K3008J7615J0499J611q132j7311k5337l2337
60088D996210l7697m0230m0095l9042l8251l7249l5508l3562l1933l0442k9280
60077D602921k9382l0847l2371l3061l3552l4431l4862l3711l0823k6357k0171
60066D263353j2944o510j865K121O943J2450J7651K2385K6919L0872L3804L6120
60054D431299L8369M0375M1891M3183M4052M3294M0159L5437L0170K4292J7501
$$ plain form
60134 5682810 5666938 5648729 5628832 5607306 5582717 5552190 5513193 5465286 5409784 5348145 5281404
60123 5281404 5210945 5138944 5067945 5000407 4938543 4884023 4837757 4800118 4770954 4749179 4733003
60112 4733003 4721249 4714106 4712057 4714727 4721563 4733125 4750668 4774545 4803698 4836440 4870998 4905576
60100 4905576 4938809 4970222 4999704 5026594 5049602 5067217 5077716 5079327 5071195 5053884 5028547 4996210
60088 4996210 4958513 4918283 4878188 4839146 4800895 4763646 4728138 4694576 4662643 4632201 4602921
60077 4602921 4573539 4542692 4510321 4477260 4443708 4409277 4374415 4340704 4309881 4283524 4263353
60066 4263353 4250409 4243899 4242034 4244155 4251098 4263548 4281199 4303584 4330503 4361375 4395179 4431299
60054 4431299 4469668 4510043 4551934 4595117 4639169 4682463 4722622 4758059 4788229 4812521 4830022
60043D830022J0351L380l747j1026j7169k1165k3785k6181k7904k7710k5544k2267
60031D637255j8084j2708o537l61N622J1318J5733J7657J6858J3579P507j461
60019D686378j1843k1216k8056l2220l4065l4045l2700l0227k6507k1989j7824
60008D395686j4424j0966p077l890k371j773r45p8J75K56Q93J709K150K914M717
59993D366976O427O240M280K358J570J724K702M679P188R631J2582J7122K3022
59980D466501K9005L4733M1085M8554N6730O5292P4048Q1980Q7661R0772R1880
59969E168241R0555Q4999P3995N8209L9269J8651k123k1162l6796m8326n6028
59958E369484o0677o2997o3232o1337n7644n2864m7131l9710l0070j8686o341
$$ plain form
60043 4830022 4840373 4843753 4840006 4828980 4811811 4790646 4766861 4740680 4712776 4685066 4659522 4637255
60031 4637255 4619171 4606463 4599926 4599565 4605187 4616505 4632238 4649895 4666753 4680332 4687839 4686378
60019 4686378 4674535 4653319 4625263 4593043 4558978 4524933 4492233 4462006 4435499 4413510 4395686
60008 4395686 4381262 4370296 4363219 4359329 4356958 4355185 4354240 4354162 4354337 4354593 4355486 4357195 4359345 4362259 4366976
59993 4366976 4373403 4379643 4383923 4386281 4387851 4389575 4392277 4396956 4404144 4413775 4426357 4443479 4466501
59980 4466501 4495506 4530239 4571324 4619878 4676608 4741900 4815948 4897928 4985589 5076361 5168241
59969 5168241 5258796 5343795 5417790 5475999 5515268 5533919 5531796 5510634 5473838 5425512 5369484
59958 5369484 5308807 5245810 5182578 5121241 5063597 5010733 4963602 4923892 4893822 4875136 4868795
59947D868795O564J9610L2201M4454N7197P0381Q2640R3284J03441J13998J23729
59936E616294J30920J35647J38606J38618J33366J22095J05713Q4656N8795K9518
59926F694228K1k6821m9580o7295p9045q4891q5972q3281p7308o9005n9907n0969
59914E960175m2171l3510k5681j9665j6273j6015j8626k2816k7047l0439l2572
59903E675360l2942l1410k8583k4929j9990j3249n143L722J3694K5258L7539M8639
59891E647966N7170O2615O4923O4754O3496O2031N9895N6383N1624M5706L7961
59880F274524K8508J9458J3170J0221J0559J5366K5695M0037N5269O9294Q0643
59869F642744Q6006Q0797O2628L2897m563m4389p9851j05013j17822j20001j13985
$$ plain form
59947 4868795 4875359 4894969 4927170 4971624 5028821 5099202 5181842 5275126 5378567 5492565 5616294
59936 5616294 5747214 5882861 6021467 6160085 6293451 6415546 6521259 6605915 6664710 6694228
59926 6694228 6694249 6667428 6617848 6550553 6471508 6386617 6300645 6217364 6140056 6071051 6011144 5960175
59914 5960175 5918004 5884494 5858813 5839148 5822875 5806860 5788234 5765418 5738371 5707932 5675360
59903 5675360 5642418 5611008 5582425 5557496 5537506 5524257 5519114 5522836 5536530 5561788 5599327 5647966
59891 5647966 5705136 5767751 5832674 5897428 5960924 6022955 6082850 6139233 6190857 6236563 6274524
59880 6274524 6303032 6322490 6335660 6345881 6356440 6371806 6397501 6437538 6492807 6562101 6642744
59869 6642744 6728750 6809547 6872175 6905072 6900509 6856120 6776269 6671256 6553434 6433433 6319448
59858F319448j01568q5231o8315n2996l9333k6595j4291j857J1088K3976L6099
59847F000425M8212O1901P7404R3414J08763J22764J34204J42127J47683J53437
59837G090334J60777J69687J80835J95527K13158K30712K45216K54784K57006
59828H998036K48627K27835J95285J52454J01204M5818o779n0494q2799j03546
59818I725641j13169j13484j08681j03618j01438j03355j09356j17852j25589
59809H729099j29532j28854j24769j19125j13695j09932j08422j08768j10256
59800G675746j12193j13647j13681j12014j08778j03690r6460q7930p9659p2285
59790F675409o5393n8750n2244m4547l3573j8757j541J6780L6196N6550P6489
$$ plain form
59858 6319448 6217880 6132649 6064334 6011338 5972005 5945410 5931119 5929262 5940350 5964326 6000425
59847 6000425 6048637 6110538 6187942 6281356 6390119 6512883 6647087 6789214 6936897 7090334
59837 7090334 7251111 7420798 7601633 7797160 8010318 8241030 8486246 8741030 8998036
59828 8998036 9246663 9474498 9669783 9822237 9923441 9969259 9962480 9911986 9829187 9725641
59818 9725641 9612472 9498988 9390307 9286689 9185251 9081896 8972540 8854688 8729099
59809 8729099 8599567 8470713 8345944 8226819 8113124 8003192 7894770 7786002 7675746
59800 7675746 7563553 7449906 7336225 7224211 7115433 7011743 6915283 6827353 6747694 6675409
59790 6675409 6610016 6551266 6499022 6454475 6420902 6402145 6400604 6417384 6453580 6510130 6586619
59779F586619R4554J09995J21870J28637J29545J25427J17537J06671R4034Q1708
59769G696597P1259O2518N4107M4348L1322J3363r471l4793n9063p8852r1213
59758G700122r4297q8265p4944n6288l3882r694J4040L5918N5347P1288Q2228
59747G601573Q7443Q7018Q0508O7068M7198K2909m103l3148o3085r1823j17706
59736G683852j40105j58182j70595j77102j79124j78155j74771j69430j62845
59727F173543j55084j45749j35535j26146j18147j10393j02080r3847q6253p8826
59717E021483p1290o4160n7315m9610m0785l2290k5197j8728j1738m277L272J1178
59705D660543J9467K7305L4303M1204M8366N4827N9836O4174O8916P4086P9338
$$ plain form
59779 6586619 6681173 6791168 6913038 7041675 7171220 7296647 7414184 7520855 7614889 7696597
59769 7696597 7767856 7830374 7884481 7928829 7960151 7973514 7964043 7929250 7870187 7791335 7700122
59758 7700122 7605825 7517560 7442616 7386328 7352446 7342752 7356792 7392710 7448057 7519345 7601573
59747 7601573 7689016 7776034 7856542 7923610 7970808 7993717 7989614 7956466 7893381 7801558 7683852
59736 7683852 7543747 7385565 7214970 7037868 6858744 6680589 6505818 6336388 6173543
59727 6173543 6018459 5872710 5737175 5611029 5492882 5382489 5280409 5186562 5100309 5021483
59717 5021483 4950193 4886033 4828718 4779108 4738323 4706033 4680836 4662108 4650370 4646093 4649365 4660543
59705 4660543 4680010 4707315 4741618 4782822 4831188 4886015 4945851 5010025 5078941 5153027 5232365
59694E232365Q4639Q9308R1814R1776R0966R1141R1970R2166R1377Q9595Q5769
59683F222886P8609O8319N6556M5223L6092L0526K8364K7629K6199K3213J8430
59672F662046J1384K154p881j7002k4251k9165l1464l1666l0958k9764k7614k4954
59660F420865k3718k5099k8013l0781l3105l5318l6907l7121l6120l4351l1634
59649F068698k7846k3659j9630j5490j1296q282p514q480r989j1727j4072j7274
59637E893439k1613k7530l4809m2469n0021n7717o4939o9663p0434o7697o2492
59626E324055n5109m5906l5984k6054j5937n998K335Q466J3363J7401J9171J7793
59614E217596J4599J1064O735J003m620q147r803j1210j2890j4407j5922j7605
$$ plain form
59694 5232365 5317004 5406312 5498126 5589902 5680868 5772009 5863979 5956145 6047522 6137117 6222886
59683 6222886 6301495 6369814 6426370 6471593 6507685 6538211 6566575 6594204 6620403 6643616 6662046
59672 6662046 6673430 6675584 6667703 6650701 6626450 6597285 6565821 6534155 6503197 6473433 6445819 6420865
59660 6420865 6397147 6372048 6344035 6313254 6280149 6244831 6207924 6170803 6134683 6100332 6068698
59649 6068698 6040852 6017193 5997563 5982073 5970777 5962495 5954981 5946501 5936512 5924785 5910713 5893439
59637 5893439 5871826 5844296 5809487 5767018 5716997 5659280 5594341 5524678 5454244 5386547 5324055
59626 5324055 5268946 5223040 5187056 5161002 5145065 5139067 5141402 5149868 5163231 5180632 5199803 5217596
59614 5217596 5232195 5243259 5249994 5250997 5246377 5238230 5228427 5217217 5204327 5189920 5173998 5156393
59602E156393j8392j7282j5083j3081j0840p258l031nJ411K212K681K229J027
59589E080981l6q67j952k886k733j660o43J67J292K358K324J082o79l102p087
59574E066559j2546j8100k2567k5628k7056k6494k4037k0083j4713q090j023N855
59562D872077J2952K0651K7903L3242L6746L9534M1599M1663L9229L5400L1405
59551E232401K7390K2892J7628J1708N721N93l158n704o981o118k656K298P159
59538E303173J1705J6751K2103K5593K4224J6075J991j4037k7028l4610l8233
59527E307707m0611m2973m5436m8408n2147n5772n8106n8968n8587n6559n2531
59516D737609m7211m1540l5523k8998k2678j7277j2389p402k685J236M740Q026
$$ plain form
59602 5156393 5138001 5120719 5105636 5092555 5081715 5074457 5071426 5071421 5072832 5075044 5077725 5079954 5080981
59589 5080981 5080945 5080078 5078126 5075240 5072507 5070847 5070204 5070371 5071663 5074021 5076345 5077427 5076748 5073646 5066559
59574 5066559 5054013 5035913 5013346 4987718 4960662 4934168 4910131 4890048 4875335 4867245 4866222 4872077
59562 4872077 4885029 4905680 4933583 4966825 5003571 5043105 5084704 5126367 5165596 5200996 5232401
59551 5232401 5259791 5282683 5300311 5312019 5317740 5318333 5315175 5309471 5302490 5296372 5293716 5296014 5303173
59538 5303173 5314878 5331629 5353732 5379325 5403549 5419624 5421615 5407578 5380550 5345940 5307707
59527 5307707 5267096 5224123 5178687 5130279 5078132 5022360 4964254 4905286 4846699 4790140 4737609
59516 4737609 4690398 4648858 4613335 4584337 4561659 4544382 4531993 4524591 4521906 4523142 4527882 4535908
59504D535908J0024R795Q207O730N493L971K596J940J190o34k541k511k38K778
59490D582708N510Q203J1306J5107K0150K6490L2928L8312M3099M8242N3218N6818
59478D942091N9193O1403O3359O4032O3337O2062O0281N7679N5119N4051N4345
59467E596952N4365N3177N1091M8060M3168L5842K6361J5294L579p146j5708k2480
59455E882555k8128l1828l2247k9635k5229j9305j1916n171k387m747j0603j8217
59443E663142k7034l6051m3044m6317m5896m2549l7061l0871k5823k2483j9708
59432E286305j6319j2178p360j582M885J0631J4168J5120J4192J2495J1079J0527
59420E341963J0719J1291J2354J4449J7912K2618K8594L6932M9445O5569P8532
$$ plain form
59504 4535908 4545932 4555727 4563934 4570664 4576157 4580128 4582724 4584664 4585854 4585220 4582679 4580168 4579930 4582708
59490 4582708 4588218 4596421 4607727 4622834 4642984 4669474 4702402 4740714 4783813 4832055 4885273 4942091
59478 4942091 5001284 5062687 5126046 5190078 5253415 5315477 5375758 5433437 5488556 5542607 5596952
59467 5596952 5651317 5704494 5755585 5803645 5846813 5882655 5909016 5924310 5927889 5920743 5905035 5882555
59455 5882555 5854427 5822599 5790352 5760717 5735488 5716183 5704267 5699096 5696709 5691962 5681359 5663142
59443 5663142 5636108 5600057 5557013 5510696 5464800 5422251 5385190 5354319 5328496 5306013 5286305
59432 5286305 5269986 5257808 5250448 5248866 5253751 5264382 5278550 5293670 5307862 5320357 5331436 5341963
59420 5341963 5352682 5363973 5376327 5390776 5408688 5431306 5459900 5496832 5546277 5611846 5690378
59409E690378P7052N4844J9002j4023l1745l2977k2712m778J8524M4476P1569
59398E869610R9601J24027J33731J20594R0473N9730M0882L5318L8631M6963N6893
59387F716453O4378O7054O5445O0483N2048M0821K9075J8486R073Q99n319r933
59375G108963j4652k0600k7899l7087m8484n9950o7933p1287p1798p0627o7055
59364F551591o1302n5629n1467m7884m4008m0592l8039l5173l1358k7873k5884
59353F092382k4736k3519k2666k2923k4188k6248k9239l2573l4890l5797l6182
59342E779421l6336l5285l2622k9313k6094k2588j8483j4133r567m540K52L779
59330E554491O673J0704J5943K0422K2823K3279K1278J5370N871m486j3491k0971
$$ plain form
59409 5690378 5767430 5822274 5841276 5827253 5795508 5762531 5739819 5735041 5753565 5798041 5869610
59398 5869610 5969211 6093238 6226969 6347563 6438036 6497766 6538648 6573966 6612597 6659560 6716453
59387 6716453 6780831 6847885 6913330 6973813 7025861 7066682 7095757 7114243 7123316 7124215 7118896 7108963
59375 7108963 7094311 7073711 7045812 7008725 6960241 6900291 6832358 6761071 6689273 6618646 6551591
59364 6551591 6490289 6434660 6383193 6335309 6291301 6250709 6212670 6177497 6146139 6118266 6092382
59353 6092382 6067646 6044127 6021461 5998538 5974350 5948102 5918863 5886290 5851400 5815603 5779421
59342 5779421 5743085 5707800 5675178 5645865 5619771 5597183 5578700 5564567 5555000 5550460 5550712 5554491
59330 5554491 5561164 5571868 5587811 5608233 5631056 5654335 5675613 5690983 5696854 5692368 5678877 5657906
59318E657906k6565k8493k5910k0550j4523q102p68P242J5586K4645L4631M5158
59306E660257N6400O9184Q3237R6788J08635J19044J28088J34598J37246J35149
59296F728626J27043J11813R0494O6033M0700J5515p527k4974l4570l6666l2599
59285G043888k3691j2059J55J3184K9026M7666O5952Q0716R0472R3577Q7796P3169
59273G589851N2801K9427L361k5025n3418p9733j03693j24643j40120j48406j50555
59262F849847j48379j42442j33541j23901j14990j05957r5910q5923p7147o8879
59252E752778o0218n1913m4744l7828l0320k3181j7678j3586j0513r257j0280
59241E443260j2425j4725j7881k2415k7050l0538l3402l6266l8108l7933l6471
$$ plain form
59318 5657906 5631341 5602848 5576938 5556388 5541865 5533763 5532995 5540237 5555823 5580468 5615099 5660257
59306 5660257 5716657 5785841 5869078 5965866 6074501 6193545 6321633 6456231 6593477 6728626
59296 6728626 6855669 6967482 7057976 7124009 7164709 7180224 7172697 7147723 7113153 7076487 7043888
59285 7043888 7020197 7008138 7008293 7021477 7050503 7098169 7164121 7244837 7335309 7428886 7516682 7589851
59273 7589851 7642652 7672079 7675440 7650415 7596997 7517264 7413571 7288928 7148808 7000402 6849847
59262 6849847 6701468 6559026 6425485 6301584 6186594 6080637 5984727 5898804 5821657 5752778
59252 5752778 5692560 5640647 5595903 5558075 5527755 5504574 5486896 5473310 5462797 5453540 5443260
59241 5443260 5430835 5416110 5398229 5375814 5348764 5318226 5284824 5248558 5210450 5172517 5136046
59230E136046l4513l1270k6165k0673j6403j2766q384l442J175N796J1136J6687
59218E017224K1576K6012L0545L5012L9464M4743N0767N5793N8715O0660O2916
59207E503427O4929O5765O5931O6260O6537O6645O7401O8813O9273O7998O6293
59196F239272O4778O1347N3752M2457K9102J4060k479j8827l3300m5778n5915
59185F348469o1652o1706n7784n2119m4421l3501k0343p082N690J8394L0594M1837
59173F106376N2996O4605P5171Q3237Q9676R5704R9978R9912R4454Q3551O6535
59162G012195M3744J8575m510k3109l6340m2938m2393l6513k7444j5481j135J2480
59150F857131K2205K8390L3097L6220L6442L4847L4393L6570M1620N1128O7142
$$ plain form
59230 5136046 5101533 5070263 5044098 5023425 5007022 4994256 4985872 4982430 4983605 4989401 5000537 5017224
59218 5017224 5038800 5064812 5095357 5130369 5169833 5214576 5265343 5321136 5379851 5440511 5503427
59207 5503427 5568356 5634121 5700052 5766312 5832849 5899494 5966895 6035708 6104981 6172979 6239272
59196 6239272 6304050 6365397 6419149 6461606 6490708 6504768 6502289 6483462 6450162 6404384 6348469
59185 6348469 6286817 6225111 6167327 6115208 6070787 6037286 6016943 6009861 6015551 6033945 6064539 6106376
59173 6106376 6159372 6223977 6299148 6382385 6472061 6567765 6667743 6767655 6862109 6945660 7012195
59162 7012195 7055939 7074514 7070004 7046895 7010555 6967617 6925224 6888711 6861267 6845786 6844651 6857131
59150 6857131 6879336 6907726 6940823 6977043 7013485 7048332 7082725 7119295 7160915 7212043 7279185
59139G279185Q9031J13973J40129J66539J90465K07885K16673K17131K09844J95472
59129I026327J76065J53738J28150R7645O2653K5826j0506m4620p3877r5956j11722
59118I333723j24471j36373j47560j58016j67673j74836j77101j73955j66568
59109G907170j55489j40875j24528j09072r5205q2024o9924o0703n4850n1069
59099F963431m8602m7819m8454m9323m9887n0265m9851m7798m4758m2212m0257
59088F444205l7829l4774l1811k8750k4636j9357j3316o001L242J3411K2617L0029
59076F317030L5428L7744L6177L2029K7264K2020J5559Q730L066j754p059j2397
59064F513837j5955j7031j5785j1560m219L594Q319R005O455j32j2302k8643m5164
$$ plain form
59139 7279185 7368216 7482189 7622318 7788857 7979322 8187207 8403880 8621011 8830855 9026327
59129 9026327 9202392 9356130 9484280 9581925 9644578 9670404 9659898 9615278 9541401 9445445 9333723
59118 9333723 9209252 9072879 8925319 8767303 8599630 8424794 8247693 8073738 7907170
59109 7907170 7751681 7610806 7486278 7377206 7282001 7199977 7130053 7069350 7014500 6963431
59099 6963431 6914829 6867010 6818556 6769233 6719346 6669081 6619230 6571432 6526674 6484462 6444205
59088 6444205 6406376 6371602 6339791 6311041 6286405 6267048 6253732 6247731 6250973 6264384 6287001 6317030
59076 6317030 6352458 6390202 6426379 6458408 6485672 6507692 6523251 6531981 6535047 6533293 6526234 6513837
59064 6513837 6497882 6480851 6465066 6453506 6449287 6452881 6461200 6470205 6476660 6476528 6464226 6435583 6390419
59051F390419n9378p1150p9970q4659q5821q5462q3978q0334p5193p0795o7579
59040E546100o3960n9650n6055n3060m8633m2351l6313l1746k7522k2879j8933
59029E084998j6387j4134j1187p935m733j226K372N242P651J0683J4106J6516
59017E085966J7890J9745K2557K5253K7418K9744L2054L3249L3615L4871L7628
59006E399990M0949M4604M9443N5389O1531O8413P7676Q9168J00912J12316J24829
58995F225220J38999J53458J67400J81442J95279K06775K14162K16860K13643
58986G913238K02454J82951J57211J27239R3755N7903K2053j1768m2512o9201
58976H633323r1451j11081j30800j50802j68454j81159j87375j85263j73558j54203
$$ plain form
59051 6390419 6331041 6259891 6179921 6095262 6009441 5923979 5840001 5759667 5684474 5613679 5546100
59040 5546100 5482140 5422490 5366435 5313375 5264742 5222391 5186078 5154332 5126810 5103931 5084998
59029 5084998 5068611 5054477 5043290 5035355 5030622 5029396 5031768 5037010 5044661 5055344 5069450 5085966
59017 5085966 5103856 5123601 5146158 5171411 5198829 5228573 5260627 5293876 5327491 5362362 5399990
59006 5399990 5440939 5485543 5534986 5590375 5651906 5720319 5797995 5887163 5988075 6100391 6225220
58995 6225220 6364219 6517677 6685077 6866519 7061798 7268573 7482735 7699595 7913238
58986 7913238 8115692 8298643 8455854 8583093 8676848 8734751 8756804 8745036 8702524 8633323
58976 8633323 8541872 8430791 8299991 8149189 7980735 7799576 7612201 7426938 7253380 7099177
58966G099177j31572j08642q6281o6218n1589m3887m2109m5408n3802o5683p7527
58955F326459q7098r4674j00596j04086j04989j03994j00505r2882q1459o8674
58945E387502n5737m1725k6499j1607K266J5939K8950L8981M4868M7728M8440
58934E479106M6773M3606M1187M0354M0106M0467M2963M7710N3020N8450O4964
58923E998706P1293P3448O8964N8735M4089K5525N350j2248k5282l5080m2193
58912F231307m4800m2563l8246l3469k6194j4587k21J4664L0136M6540O2367P6406
58900F261340Q9543J02336J13304J21498J28343J34853J39521J40674J38312J31742
58890G501466J18256R6569O9304M0098J0583j7947m2778o2237p7745r1090j01665
$$ plain form
58966 7099177 6967605 6858963 6772682 6706464 6654875 6610988 6568879 6523471 6469669 6403986 6326459
58955 6326459 6239361 6144687 6044091 5940005 5835016 5731022 5630517 5537635 5456176 5387502
58945 5387502 5331765 5290040 5263541 5251934 5254200 5270139 5299089 5338070 5382938 5430666 5479106
58934 5479106 5525879 5569485 5610672 5651026 5691132 5731599 5774562 5822272 5875292 5933742 5998706
58923 5998706 6069999 6143447 6212411 6271146 6315235 6340760 6346110 6333862 6308580 6273500 6231307
58912 6231307 6186507 6143944 6105698 6072229 6046035 6031448 6031227 6045891 6076027 6122567 6184934 6261340
58900 6261340 6350883 6453219 6566523 6688021 6816364 6951217 7090738 7231412 7369724 7501466
58890 7501466 7619722 7716291 7785595 7825693 7836276 7818329 7775551 7713314 7635569 7544479 7442814
58879G442814j08252j11216j10892j06159r6914q5795p5167o4469n2788m2028
58869F589134l5237l3450l6114m2666n1758o0753o8206p5239q2870q9820r4516
58858E918505r7260r8704r8373r6348r4270r2946r1109q8094q5222q2879p8948
58847D914352p2211o4710n8562n2979m6790m1182l7389l4056k9714k5680k3623
58836D427456k2265j9372j5337j2035r659p244m901l052q08K720O753J0477J4755
58823D367488K0332K6046L0754L5168L9682M2242M0575L4877K6374J5183J804
58812D680525j1140k1036k7707l1827l2831l0455k6495k2776j9033j4549r952
58801D432724n496K13P722J5116K1013K6834L3768L9912M3085M4249M5386M5955
$$ plain form
58879 7442814 7334562 7223346 7112454 7006295 6909381 6823586 6748419 6683950 6631162 6589134
58869 6589134 6553897 6520447 6484333 6441667 6389909 6329156 6260950 6185711 6102841 6013021 5918505
58858 5918505 5821245 5722541 5624168 5527820 5433550 5340604 5249495 5161401 5076179 4993300 4914352
58847 4914352 4842141 4777431 4718869 4665890 4619100 4577918 4540529 4506473 4476759 4451079 4427456
58836 4427456 4405191 4385819 4370482 4358447 4348788 4341544 4336643 4333591 4332783 4335503 4342256 4352733 4367488
58823 4367488 4387820 4413866 4444620 4479788 4519470 4561712 4602287 4637164 4663538 4678721 4680525
58812 4680525 4669385 4648349 4620642 4588815 4555984 4525529 4499034 4476258 4457225 4442676 4432724
58801 4432724 4427228 4427441 4435163 4450279 4471292 4498126 4531894 4571806 4614891 4659140 4704526 4750481
58789D750481M4251M0474L5726K9830K2719J6290J2254R892Q368R284J4156K1220
58777E014945K7509L2418L6595L9178L9071L7356L5659L3608L0449K7387K5610
58766E379785K3659J9551J3980Q665L175l864j1971k0031k8725l9035m9698n8834
58754E236657o6582p3615p8723q0590q0272p9231p6588p1103o4136n7679n1054
58743D457084m2505l2620k3299j4707o023K174Q932J4990K1335K7306L2400L8084
58731D483151M5336N2510N8222O4018P1103P6671P6722P0452N8785M1021J6811
58720E114802j0406l5826n7726p6365r0438r8379j01457j01863r9198r2430q3577
58709D267137p5579o8018n8786m8431l8893k9413j7850m938O781J7151K7597L7166
$$ plain form
58789 4750481 4794732 4835206 4870932 4900762 4923481 4939771 4952025 4961917 4970285 4979569 4993725 5014945
58777 5014945 5042454 5074872 5111467 5150645 5189716 5227072 5262731 5296339 5326788 5354175 5379785
58766 5379785 5403444 5422995 5436975 5445640 5448815 5444951 5432980 5412949 5384224 5345189 5295491 5236657
58754 5236657 5170075 5096460 5017737 4937147 4856875 4777644 4701056 4629953 4565817 4508138 4457084
58743 4457084 4414579 4381959 4358660 4343953 4337930 4340104 4349036 4364026 4385361 4412667 4445067 4483151
58731 4483151 4528487 4580997 4639219 4703237 4774340 4851011 4927733 4998185 5056970 5097991 5114802
58720 5114802 5104396 5068570 5010844 4934479 4844041 4745662 4644205 4542342 4443144 4350714 4267137
58709 4267137 4191558 4123540 4064754 4016323 3977430 3948017 3930167 3925229 3932010 3949161 3976758 4013924
58697D013924M3369M6126M6853M4460L6164K1888M325j4524l3320m8917n7865
58686D102483o0036n7552n1035m0286k7481j5772n383N306J5613K3144K7703L0930
58674C947634L2746L1757K8445K4504J9706J2838M739l042j1483k2233l3545m1908
58662C990158m6871n0544n3298n3846n2715n1712n0601m7971m4553m2062l9753
58651C456232l5907l1574k8988k7409k4539k0842j8357j6446j3091r232p332o735
58639C215780n014k832k648l608k719l93K48r43j315p69j725l896m330k790k022
58624C181024k399j273J890M471N345O063O938O350M387K956K052P2k186k153
58610C213537q9J413K317M898Q691J0585J0199J0289J1584J1938J1059J1152J2424
$$ plain form
58697 4013924 4057293 4103419 4150272 4194732 4230896 4252784 4257109 4242585 4209265 4160348 4102483
58686 4102483 4042447 3984895 3933860 3893574 3866093 3850321 3844938 3850244 3865857 3889001 3916704 3947634
58674 3947634 3980380 4012137 4040582 4065086 4084792 4097630 4102369 4099327 4087844 4065611 4032066 3990158
58662 3990158 3943287 3892743 3839445 3785599 3732884 3681172 3630571 3582600 3538047 3495985 3456232
58651 3456232 3420325 3388751 3359763 3332354 3307815 3286973 3268616 3252170 3239079 3229847 3222515 3215780
58639 3215780 3210766 3207934 3205286 3201678 3198959 3198566 3198814 3197871 3196556 3195787 3194062 3190166 3185836 3183046 3181024
58624 3181024 3178625 3177352 3179242 3183713 3189058 3195121 3202059 3208409 3212796 3215752 3217804 3217876 3215690 3213537
58610 3213537 3213448 3214861 3217178 3222076 3230767 3241352 3251551 3261840 3273424 3285362 3296421 3307573 3319997
58597C319997J2677J1947J2921J6155J9432K2234K6182L0724L3199L3748L5306
58586C574522L8114L9141L7550L5943L5466L4491L2950L3040L4854L5951L6055
58575C968077L7438L9918M0367L7996L5275L2700K7449J8158O418p054k2844l8840
58563D175058n0742n7515o1531o2979n9411n1477m3530l7486l1395k4969k0983
58552C673040k0026j9490j9089k1872k8318l4893l9927m5433n1542n4722n3327
58541C284401m9744m5366l8848l0768k4513k0664j5914r258l780p25K662P525
58529C055008J1302J3119J5497J8710J9190J5674J1397Q134L851j746n430o549
58517C158157q741j3031j5377j3859j2154j2747j2723r728o292m602k505J731
$$ plain form
58597 3319997 3332674 3344621 3357542 3373697 3393129 3415363 3441545 3472269 3505468 3539216 3574522
58586 3574522 3612636 3651777 3689327 3725270 3760736 3795227 3828177 3861217 3896071 3932022 3968077
58575 3968077 4005515 4045433 4085800 4123796 4159071 4191771 4219220 4237378 4243796 4236742 4213898 4175058
58563 4175058 4124316 4066801 4005270 3942291 3882880 3831403 3787873 3750387 3718992 3694023 3673040
58552 3673040 3653014 3633524 3614435 3592563 3564245 3529352 3489425 3443992 3392450 3337728 3284401
58541 3284401 3234657 3189291 3150443 3119675 3095162 3074498 3058584 3049326 3045546 3044821 3047483 3055008
58529 3055008 3066310 3079429 3094926 3113636 3132826 3148500 3159897 3168031 3171882 3170136 3164706 3158157
58517 3158157 3149416 3136385 3121008 3107149 3094995 3082248 3069525 3059797 3053505 3048903 3046398 3048129
58505C048129N840Q263J1196J5604J8221J6929J4187J1947Q275K300k602l933
58493C154356l413k283J537Q428J4461J7126J8472J9392J6385P497l820j4277
58481C233861k4799l5664m3289m5785m6345m7211m5716m0157l4028l0196k6251
58470B814420j9959j4000j0809p798k358L235O359Q714J2151J4494J3794J2087
58458B830330J0787P095p96r662j6448k2655k9573l4275l4781l4196l5236l5504
58446B595086l2569k8821k6911k5131k1700j8717j7559j5325j0143n019k162J223
58434B392252P165J2406J4209J5132J7351J7798J3974R143O605M164n17m513m848
58421B500321l981m794n344l620k303l566m588l406l716q436j4076j6834j8674
$$ plain form
58505 3048129 3053969 3062232 3073428 3089032 3107253 3124182 3138369 3150316 3158591 3160891 3158289 3154356
58493 3154356 3150943 3148660 3150197 3158625 3173086 3190212 3208684 3228076 3244461 3251958 3248138 3233861
58481 3233861 3209062 3173398 3130109 3084324 3037979 2990768 2945052 2904895 2870867 2840671 2814420
58470 2814420 2794461 2780461 2769652 2761854 2759496 2762731 2769090 2777804 2789955 2804449 2818243 2830330
58458 2830330 2841117 2848212 2847416 2837754 2821306 2798651 2769078 2734803 2700022 2665826 2630590 2595086
58446 2595086 2562517 2533696 2506785 2481654 2459954 2441237 2423678 2408353 2398210 2393191 2391029 2392252
58434 2392252 2399417 2411823 2426032 2441164 2458515 2476313 2490287 2499430 2506035 2510199 2509682 2505169 2500321
58421 2500321 2496340 2491546 2486202 2482582 2480279 2476713 2472125 2468719 2465003 2456567 2442491 2425657 2406983
58408B406983k1803k3144k0134j6300j5102j3922j0054o699o791o894l708p24
58396B261708j717l502k028J95l44r15J947N341N595N419Q240J1122J0606R870
58382B311537J2516J4863J2333P985O804O939M625K372L947O447N691M276O029
58369B406364P594M169j459m110n447r393j3398j3130j1131j1978j3504j1501
58357B323076q363q304q841n830k057j894k404J104N763O605O228R531J3907J4301
58343B342822J3090J5141J8024J7004J4796J6324J8713J6650J2719J2146J2394
58332B509823Q495L632L686O255N907N178R221J4673J5420J4391J7887K3103K3294
58319B660965K0537K1163K3184K0521J5185J2801J0600K539q021j3469j5295j9638
$$ plain form
58408 2406983 2385180 2362036 2341902 2325602 2310500 2296578 2286524 2279825 2273034 2266140 2262432 2261708
58396 2261708 2259991 2256489 2254461 2254656 2254312 2253397 2255344 2260685 2266280 2271699 2279939 2291061 2301667 2311537
58382 2311537 2324053 2338916 2351249 2359234 2366038 2372977 2377602 2379974 2383921 2390368 2396059 2400335 2406364
58369 2406364 2413958 2418127 2416668 2412558 2407111 2397718 2384320 2371190 2360059 2348081 2334577 2323076
58357 2323076 2314713 2306409 2297568 2291738 2289681 2287787 2285383 2286487 2292250 2298855 2305083 2314614 2328521 2342822
58343 2342822 2355912 2371053 2389077 2406081 2420877 2437201 2455914 2472564 2485283 2497429 2509823
58332 2509823 2518318 2521950 2525636 2531891 2537798 2542976 2552197 2566870 2582290 2596681 2614568 2637671 2660965
58319 2660965 2681502 2702665 2725849 2746370 2761555 2774356 2784956 2787495 2779474 2766005 2750710 2731072
58307B731072k4112k2407j7460j6619j7894j4413q308o476o872k779L505N209
58295B602446M733Q767J4384J4464J2208J5465K1411K2080K0199K3783K9901L0024
58283B819865K6805K8955L4108L3804L0864L4325M1460M2723M0221M3125M8959
58272C225214M8108M2802M2661M5507M1951L4969L4964L9368L7389L1089L1062
58261C655084L5194L3104K7678L0231L8160L9699L6982M1382N0176N1628M9088
58250D088406N5263O6700O9621O6996P3185Q5675Q9898Q8407R6337J11139J16809
58239E008436J15315J22997J38310J44966J44862J54957J73398J82670J84729
58230F370640J97863K20360K33675K40118K59408K89162L08475L19511L44113
$$ plain form
58307 2731072 2706960 2684553 2667093 2650474 2632580 2618167 2609859 2603383 2596511 2593732 2597237 2602446
58295 2602446 2607179 2615946 2630330 2644794 2657002 2672467 2693878 2715958 2736157 2759940 2789841 2819865
58283 2819865 2846670 2875625 2909733 2943537 2974401 3008726 3050186 3092909 3133130 3176255 3225214
58272 3225214 3273322 3316124 3358785 3404292 3446243 3481212 3516176 3555544 3592933 3624022 3655084
58261 3655084 3690278 3723382 3751060 3781291 3819451 3859150 3896132 3937514 3987690 4039318 4088406
58250 4088406 4143669 4210369 4279990 4346986 4420171 4505846 4595744 4684151 4780488 4891627 5008436
58239 5008436 5123751 5246748 5385058 5530024 5674886 5829843 6003241 6185911 6370640
58230 6370640 6568503 6788863 7022538 7262656 7522064 7811226 8119701 8439212 8783325
58221H783325L80380M06365M25772M63732N17934N62699O01110O61386P41794
58212A3544497Q14498Q84430R85174J115704J244929J380644J565479J802669
58204B3338024K061259K358751K757381L274880L889979M641664N619935O848308
58196E4790181Q289815R982410J2039897J4503196J7334743K0567022K4278876
58189A61786140K8440426L3032802L8207835M3616612M7118574M4801526L3530803
58182D30534718J4097585q425844k7805015m0241913m5402541m4988157m1050122
58175B36718711l5312818k9084817k3167219j7861304j3247348r484196o848083
58168A01712926n552469n534874o357524p344003p928064p925981p473684o765051
$$ plain form
58221 8783325 9163705 9570070 9995842 10459574 10977508 11540207 12141317 12802703 13544497
58212 13544497 14358995 15243425 16228599 17344303 18589232 19969876 21535355 23338024
58204 23338024 25399283 27758034 30515415 33790295 37680274 42321938 47941873 54790181
58196 54790181 63079996 73062406 85102303 99605499 116940242 137507264 161786140
58189 161786140 190226566 223259368 261467203 305083815 352202389 397003915 430534718
58182 430534718 444632303 436206459 408401444 368159531 322756990 277768833 236718711
58175 236718711 201405893 172321076 149153857 131292553 118045205 108561009 101712926
58168 101712926 96160457 90625583 84268059 76924056 68995992 61070011 53596327 46831276
58160D6831276n922896n051285m257602l586008l010184k513801k115938j811539
58152A8562023j556994j330588j149182j013532q92951p76265o85467o25946n71588
58143I959510n11445m65210m39941m14509l79260l50554l33945l11524k77667
58134F475455k50765k37784k21808j95991j76301j69274j59217j39113j23929
58125D801273j21736j20252j12959j11026j18476j21851j15171j10274j12612
58116C756916j10996j00784r3454r3848r0937q0316p3345p4903p3983o5368n9278
58105B839704o0588n9295n0692m4770m6543m6492l9456l4075l4814l3170k5310
58094B364499k0227k1835k0782j2655o790q419r227m352j899o579j0243p933p501
$$ plain form
58160 46831276 40908380 35857095 31599493 28013485 25003301 22489500 20373562 18562023
58152 18562023 17005029 15674441 14525259 13511727 12618776 11842511 11157044 10531098 9959510
58143 9959510 9448065 8982855 8542914 8128405 7749145 7398591 7064646 6753122 6475455
58134 6475455 6224690 5986906 5765098 5569107 5392806 5223532 5064315 4925202 4801273
58125 4801273 4679537 4559285 4446326 4335300 4216824 4094973 3979802 3869528 3756916
58116 3756916 3645920 3545136 3451682 3357834 3266897 3186581 3113236 3038333 2964350 2898982 2839704
58105 2839704 2779116 2719821 2669129 2624359 2577816 2531324 2491868 2457793 2422979 2389809 2364499
58094 2364499 2344272 2322437 2301655 2289000 2282210 2273791 2264564 2260212 2258313 2251734 2241491 2233558 2226057
58081B226057j4105k0237k0323k0557k5244k7660k3569k0074k2119k3476j9785
58070A988908j7512k1153k4321k2127k0188k2817k4376k0768j7796j9646k0588
58059A757616j6394j2846j4574j6356j3588j0927j2489j3761j1042q910j0649
58048A616080j1232p305m317o315q410o585n231p619q730n067j980l697n430k892
58034A531270l50j677k590M45K657P0k575q52J073q91k403R18M828M439L169N568
58018A543099Q525P832O510Q584J1091J0090Q306R435J1057J0326J0401J4112
58006A659368J7607J7331J7015K0757K5496K7327K8929L3529L7832L8347L8684
57995A962222M3157M8968N2120N5284O2296P0411P5678Q0757Q9698R9809J06200
$$ plain form
58081 2226057 2211952 2191715 2171392 2150835 2125591 2097931 2074362 2054288 2032169 2008693 1988908
58070 1988908 1971396 1950243 1925922 1903795 1883607 1860790 1836414 1815646 1797850 1778204 1757616
58059 1757616 1741222 1728376 1713802 1697446 1683858 1672931 1660442 1646681 1635639 1626729 1616080
58048 1616080 1604848 1597543 1593226 1586911 1578501 1571916 1566685 1559066 1550336 1545269 1543289 1539592 1534162 1531270
58034 1531270 1530920 1529243 1526653 1527098 1529755 1529825 1527250 1526398 1527471 1526580 1524177 1525095 1529923 1534362 1537531 1543099
58018 1543099 1551624 1559456 1565966 1574550 1585641 1595731 1604037 1613472 1624529 1634855 1645256 1659368
58006 1659368 1676975 1694306 1711321 1732078 1757574 1784901 1813830 1847359 1885191 1923538 1962222
57995 1962222 2005379 2054347 2106467 2161751 2224047 2294458 2370136 2450893 2540591 2640400 2746600
57984B746600J09724J12919J12545J03811Q8356P1387N4695L8940K8404K6550
57974C493931L0457L5596M1948M9273N1018M0044J6971j2999m7147q2884j13110
57963C503098j31517j39562j42027j39205j29507j15892j02875r0328p6447o3488
57953B372250n4379m6917l7563k7890k1288j6488j0393m075n1L266Q414J3379
57941B178265J5125J5442J7499J9754J9375J8320J9947K2706K3483K4147K8320
57930B402383L4441L8530M1363M6415N3074N8057O1293O3939O2572N1896L1872
57919B945835O664k1443n1338p8458r7311j07595j12459j12338j05958r5635q5663
57908B084301p6637o6583n6279m8182m1648l4455k7639k3722k1661j8667j5430
$$ plain form
57984 2746600 2856324 2969243 3081788 3185599 3273955 3345342 3400037 3438977 3467381 3493931
57974 3493931 3524388 3559984 3601932 3651205 3702223 3742267 3759238 3746239 3699092 3616208 3503098
57963 3503098 3371581 3232019 3089992 2950787 2821280 2705388 2602513 2512185 2435738 2372250
57953 2372250 2317871 2270954 2233391 2205501 2184213 2167725 2157332 2153257 2153206 2156472 2164886 2178265
57941 2178265 2193390 2208832 2226331 2246085 2265460 2283780 2303727 2326433 2349916 2374063 2402383
57930 2402383 2436824 2475354 2516717 2563132 2616206 2674263 2735556 2799495 2862067 2913963 2945835
57919 2945835 2952499 2931056 2879718 2801260 2703949 2596354 2483895 2371557 2265599 2169964 2084301
57908 2084301 2007664 1941081 1884802 1836620 1794972 1760517 1732878 1709156 1687495 1668828 1653398
57897A653398j4387j4479j2807r923q307p119l763Q48L818N635Q820J2616J4182
57884A628532J3838J3985J4203J2411R530P854O220K084l031n617o401q959j3280
57871A671369j6329j8026k0844k4046k4223k1587k0218k1691k3457k3826k3993
57860A433129k4704k5119k5249k5855k6151k5086k3979k4331k4397k1947j8784
57849A167527j7976j8223j6024j1988r710r394q164n863m984n203l640m57J214
57836A057115J056J895M097M872L754L577N259O429O123O215P308P550O541O309
57822A128100P530Q510Q618R029R737R508Q963R970J1884J2275J1356J1635J3272
57809A260387J3975J3640J4718J7647K0361K2711K7101L4065M1425M8530N7182
$$ plain form
57897 1653398 1639011 1624532 1611725 1601802 1593495 1586376 1582613 1583461 1587279 1592914 1601734 1614350 1628532
57884 1628532 1642370 1656355 1670558 1682969 1692499 1700353 1706573 1708657 1705626 1700009 1693608 1684649 1671369
57871 1671369 1655040 1637014 1616170 1592124 1567901 1546314 1526096 1504405 1480948 1457122 1433129
57860 1433129 1408425 1383306 1358057 1332202 1306051 1280965 1256986 1232655 1208258 1186311 1167527
57849 1167527 1149551 1131328 1115304 1103316 1093606 1084212 1076048 1070185 1065201 1059998 1056358 1055901 1057115
57836 1057115 1058171 1060066 1064163 1069035 1072789 1076366 1081625 1088054 1094177 1100392 1107700 1115250 1121791 1128100
57822 1128100 1135630 1144140 1152758 1161787 1171524 1181032 1189995 1199965 1211849 1224124 1235480 1247115 1260387
57809 1260387 1274362 1288002 1302720 1320367 1340728 1363439 1390540 1424605 1466030 1514560 1571742
57798A571742O7619P7537Q5754R2775R6893R3755Q0931N9701L2101R2l1935n8101
57786B168864p5824q6474r1047q8979q1626p2778o4604n6578m8922m3322l9598
57775A419112l5534l0901k7937k7165k6452k4939k4136k4297k3590k1640k0230
57764A132291j9731j8555j6807j6538j7580j7248j5043j3571j3788j3437j1457
57753I58536r795r395q423o053m199l884l467j976o06M17K722O209Q450R050J0656
57738I48242J4021J6151J5142J2747J0189N624j688q665j2720j5248j8031j9569
57726I46195j8081j5141j3134j1577q966n986m079k756r23Q49J677K301L671N253
57712H79303O339P297Q063P599O269O450R189J2510J4629J6453J9190K1949K3588
$$ plain form
57798 1571742 1639361 1716898 1802652 1895427 1992320 2086075 2167006 2226707 2258808 2258900 2226965 2168864
57786 2168864 2093040 2006566 1915519 1826540 1744914 1672136 1607532 1550954 1502032 1458710 1419112
57775 1419112 1383578 1352677 1324740 1297575 1271123 1246184 1222048 1197751 1174161 1152521 1132291
57764 1132291 1112560 1094005 1077198 1060660 1043080 1025832 1010789 997218 983430 969993 958536
57753 958536 948741 939346 930923 924870 920671 916787 913320 911344 910738 911155 913877 920086 928536 937586 948242
57738 948242 962263 978414 993556 1006303 1016492 1022116 1020428 1011763 999043 983795 965764 946195
57726 946195 928114 912973 899839 888262 879296 873310 869231 866475 865552 866401 868078 870379 874050 879303
57712 879303 885642 892939 901002 908601 914870 921320 930509 943019 957648 974101 993291 1015240 1038828
57699A038828K4662K5646K5455K3434K0735J8020J4111Q518K997j164n052r565
57687A186625j3459j5775j7832k0712k3067k3417k2413k0767j7276j1105l936
57676I96866K427Q735J6472K5254L4051M3168N2970O2444P0619P7067P8865O9739
57664A538677M5548R798k8364o0548q2268r2408r2739q7079p8628o8488n7584
57653I45917m8110m1336l5876l0040k4315j9809j6056j2368r593q427p608n898
57641F86481m311m244m853m461l269k538k304j896j572j771j907j650k072l797
57627F45836n402n427m581m196l985l225k638l041l515k960k137k167k359j660
57613E98543r21j495k715k939k201j683j479r18l15m22q56p53k74Q0O97J897K806
$$ plain form
57699 1038828 1063490 1089136 1114591 1138025 1158760 1176780 1190891 1199409 1202406 1201242 1196190 1186625
57687 1186625 1173166 1157391 1139559 1118847 1095780 1072363 1049950 1029183 1011907 1000802 996866
57676 996866 999293 1008028 1024500 1049754 1083805 1126973 1179943 1242387 1313006 1390073 1468938 1538677
57664 1538677 1584225 1594023 1565659 1505111 1422843 1330435 1237696 1150617 1071989 1003501 945917
57653 945917 897807 856471 820595 790555 766240 746431 730375 718007 708414 699987 692379 686481
57641 686481 682170 677926 673073 668612 665343 662805 660501 658605 657033 655262 653355 651705 649633 645836
57627 645836 640434 635007 630426 626230 622245 619020 616382 613341 609826 606866 604729 602562 600203 598543
57613 598543 597622 596127 593412 590473 588272 586589 585110 584192 583877 583455 582599 581846 581572 581652 582349 584246 587052
57596E87052K689K293K416K445J847J661K746L940L759K594J466J27j643k541
57582F10851j674o27j191k459k497j622j404j596p55R35K078K538K976K680N13
57567F08746k464l943l668l325l444k904j442k76k9p3m7k66n74n27n41j230j926
57550E82067j527m18K10N91J963M176N657N677M879L711K132P01J22k85j893m507
57534F03256o474p043p069p291p452p285o901o105m600k876j788j278o70M3L00
57519E36767J80K98P92J396K228L385M338M729N101N747N687M177K361J820K289
57504E81295K531K683L780N371N684M036J366j456m155o099o537n843n040m208
57490E73408k719q19N47J368K508M113N458O243O751O891O359N579N294N453N645
$$ plain form
57596 587052 589741 592034 594450 596895 598742 600403 603149 607089 610848 613442 614908 615035 613392 610851
57582 610851 609177 608550 607359 604900 602403 600781 599377 597781 597026 597961 600039 602577 605553 608233 608746
57567 608746 606282 602339 598671 595346 591902 588998 587556 587280 587251 587178 587131 586865 586291 585764 585223 583993 582067
57550 582067 580540 580122 580332 580923 582886 587062 592719 598396 603275 606986 609118 609819 609941 609656 607763 603256
57534 603256 596782 589739 582670 575379 567927 560642 553741 547636 543036 540160 538372 537094 536424 536467 536767
57519 536767 536947 537245 538037 539433 541661 545046 549384 554113 559214 564961 570648 574825 577186 579006 581295
57504 581295 583826 586509 590289 595660 601344 605380 606746 605290 601135 595036 588499 582656 577616 573408
57490 573408 570689 569870 570417 571785 574293 578406 583864 590107 596858 603749 610108 615687 620981 626434 632079
57475F32079O035O639O409M528K094R12J085J415J651K614M448O592R136J2342
57461F97979J4951J4780J1152N343j233p677j2792j5313j5189j3325j0234o198
57449F62244k245O07K915O015R948J3677J7036K0828K5172K9244L2098L2138K6530
57436H76207J3612m006k0709l2468l8732m0369l8105l3254k7742k2568j7609j3091
57424F01166r732p279m559j234J900M550P288J0355J3578J7498K2915K9249L5109
57411G20804M0693M7847N7201O6215P0101O3860M4590J4273j9548m7970o6334
57400I91732p4976p5714p0080o0672n0986m2801l5474k8445k2487j8147j4853
57389D97097j2306j0903j0219q893o540m195k391o39Q59J022j1o10k28k23j269
$$ plain form
57475 632079 638114 644753 651162 655690 657784 658696 659781 661196 662847 665461 669909 676501 685637 697979
57461 697979 712930 727710 738862 744205 742972 735295 722503 707190 692001 678676 668442 662244
57449 662244 659999 660606 663521 669536 679484 693161 710197 731025 756197 785441 817539 849677 876207
57436 876207 889819 885813 865104 832636 793904 753535 715430 682176 654434 631866 614257 601166
57424 601166 591434 584155 579596 578362 580262 584812 592100 602455 616033 633531 656446 685695 720804
57411 720804 761497 809344 866545 932760 1002861 1066721 1111311 1125584 1106036 1058066 991732
57400 991732 916756 841042 770962 710290 659304 616503 581029 552584 530097 511950 497097
57389 497097 484791 473888 463669 454776 448236 444041 441650 441011 441870 442892 442881 442271 442043 441820 440551
57374D40551j995j287j13J59l28q43j439k222k578k249k048k488k898k675k275
57359D15272k132j819j138p86j043j009m5J105J496J341J375J811K608L785M845
57344D25666M776L245R68j315l250m141l242j125N53J064J014O36p05k769m044
57329D17331l867l339l335l251k590k133k394k433j445k38L9l93o72o95p22n74
57313C89289j53R5jJ42P77J286J265J142J153Q96N04Q80K133L047K949K675K907
57296D10986K948K126J038M03p5o63p38m5L61l10j267j482j335j669k275k493
57280D05510k378k184j547l61L74k28j616k642l069l317l447l319l063k673j797
57265C74243n62K27K62K32O31J101J447K034K635K241Q10j43L93J581K259K525
$$ plain form
57374 440551 438556 437269 437156 437315 436987 436144 434705 432483 429905 427656 425608 423120 420222 417547 415272
57359 415272 413140 411321 410183 409397 408354 407345 407300 408405 409901 411242 412617 414428 417036 420821 425666
57344 425666 430442 433687 434655 433340 430090 425949 422707 421582 422135 423199 424213 424849 424144 421375 417331
57329 417331 413464 410125 406790 403539 400949 398816 396422 393989 392544 392306 392345 391952 391280 390585 389863 389289
57313 389289 389136 389231 389230 389372 390149 391435 392700 393842 394995 395891 396395 397275 399408 402455 405404 408079 410986
57296 410986 413934 416060 417098 417501 417426 416763 416025 415980 416341 416031 414764 413282 411947 410278 408003 405510
57280 405510 403132 400948 399401 399040 399414 399186 397570 394928 391859 388542 385095 381776 378713 376040 374243
57265 374243 373681 373908 374170 374402 375033 376134 377581 379615 382250 384491 385301 385158 385551 387132 389391 391916
57249C91916K806K783K287K090K655L327L691M451N964P219P395P172P372P661
57235D58789P676P991Q777R017Q324Q050R128J0293J0038Q810P617N881K610j519
57221E61482n096p884j0046j0747r548q050p932q295p140m674k859k264j729q04
57207D74414k76j86N01K103L728M725N261N449N246N125N594O266O550O854P839
57192E39193Q970R181Q539P882P297O426N803O341P764R044J0047J1338J2737
57179F50562J3557J4066J5188J6888J8203J8769J9089J9474J9849K0326K0881
57168H46852K0845J9798J8448J7521J6502J4726J2918J2202J2324J2437J2928
57157A017501J4758J7482J9684K1018K2204K3473K4601K6016K8106K9955L0539
$$ plain form
57249 391916 394722 397505 399792 401882 404537 407864 411555 416006 421970 429189 436584 443756 451128 458789
57235 458789 466465 474456 483233 492250 500574 508624 517752 528045 538083 546893 554510 560391 563001 561482
57221 561482 556386 548502 538456 527709 518161 510111 502179 493884 486744 482070 479211 476947 475218 474414
57207 474414 474138 473952 474453 476556 480284 485009 490270 495719 500965 506090 511684 517950 524500 531354 539193
57192 539193 548163 557344 565883 573765 581062 587488 593291 599632 607396 616440 626487 637825 650562
57179 650562 664119 678185 693373 710261 728464 747233 766322 785796 805645 825971 846852
57168 846852 867697 887495 905943 923464 939966 954692 967610 979812 992136 1004573 1017501
57157 1017501 1032259 1049741 1069425 1090443 1112647 1136120 1160721 1186737 1214843 1244798 1275337
57146A275337L0774L2441L5406L7821L8913L9621M0558M1264M1680M2574M4275
57135A700664M6454M9217N2927N7023O0592O4109O9095P6003Q3731R0890R5970
57124B446675R6743R1713Q2456P2941O6208O2932O2893O5917P1279P7936Q5819
57113C283512R5634J07297J19831J32776J46318J60286J74565J90443K10143K35106
57103D855911K66205L05403L55613M19141M97874N95002P15120Q62472J040162
57094I912903J250445J494286J770501K075949K405626K751136L099164L431381
57086B8191391L724411L950526M081983M095122L965815L662588L159357K469911
57078E7301104J666510Q47481P6624o43916j343062k032793k690757l274714l740988
$$ plain form
57146 1275337 1306111 1338552 1373958 1411779 1450692 1490313 1530871 1572135 1613815 1656389 1700664
57135 1700664 1747118 1796335 1849262 1906285 1966877 2030986 2100081 2176084 2259815 2350705 2446675
57124 2446675 2543418 2635131 2717587 2790528 2856736 2919668 2982561 3048478 3119757 3197693 3283512
57113 3283512 3379146 3486443 3606274 3739050 3885368 4045654 4220219 4410662 4620805 4855911
57103 4855911 5122116 5427519 5783132 6202273 6700147 7295149 8010269 8872741 9912903
57094 9912903 11163348 12657634 14428135 16504084 18909710 21660846 24760010 28191391
57086 28191391 31915802 35866328 39948311 44043433 48009248 51671836 54831193 57301104
57078 57301104 58967614 59815095 59891719 59247803 57904741 55871948 53181191 49906477 46165489
57069D6165489m054572m197249m173958m009850l739813l400338l026173k646858
57061A6916678k283231j948253j650369j393886j177372r95337q42386p14573
57053E911271o07838n17799m41314l76625l22075k75996k37316k05043j77700
57044B749565j54386j35494j21128j09872j00368r2904q7976q4388q0390p5647
57034A707012p0567o4863n8398n2354m7753m3800l9296l4719l1153k8180k4651
57023A211278k0604j6537j1698n020L037J1480K0774L1888M4175N6301O8277P9635
57011A472986Q5574P8012N2231J1887l2674p0271r3965j03007j01269r3532q2792
57000A123180p0631n8713m8493m0196l3283k7623k3231j9441j5531j1676q330
$$ plain form
57069 46165489 42110917 37913668 33739710 29729860 25990047 22589709 19563536 16916678
57061 16916678 14633447 12685194 11034825 9640939 8463567 7468230 6625844 5911271
57053 5911271 5303433 4785634 4344320 3967695 3645620 3369624 3132308 2927265 2749565
57044 2749565 2595179 2459685 2338557 2228685 2128317 2035413 1947437 1863049 1782659 1707012
57034 1707012 1636445 1571582 1513184 1460830 1413077 1369277 1329981 1295262 1264109 1235929 1211278
57023 1211278 1190674 1174137 1162439 1157419 1160456 1171936 1192710 1224598 1268773 1325074 1393351 1472986
57011 1472986 1558560 1636572 1688803 1700690 1668016 1597745 1503780 1400773 1299504 1205972 1123180
57000 1123180 1052549 993836 945343 905147 871864 844241 821010 801569 786038 774362 766032
56989G66032n225j974R67L092M930P263R795J1496J1534R020K994o019j5259k1971
56975G76675k5705k7454k7613k6230k4141k2125j9627j5880j1567p857m506m76
56963E63494M236Q896J3413J7852K1513K4182K7300L1772L5119L3049K3853R853
56951H14532m995j7207k4375k6064k4317k1685j8711j4680j0061o254l334j55
56939F42694L427O501R221J2957J8145K3811K9528L6023M3443N0282N4220N2916
56927I83168M4332K8298Q142j0809k4943l3924l9141m2090m4030m5457m5650m3948
56915G33948m1202l8688l6068l2178k7456k3570k0750j7559j3416r294n663j733
56903D66371K754O827R973J2817J5496J6925J6394J4501J1865Q225L479j432n256
$$ plain form
56989 766032 760807 758833 759800 762892 767822 775085 784880 796376 807910 816930 819924 813905 798646 776675
56975 776675 750970 723516 695903 669673 645532 623407 603780 587900 576333 568476 563970 563494
56963 563494 567730 576626 590039 607891 629404 653586 680886 712658 747777 780826 804679 814532
56951 814532 809537 792330 767955 741891 717574 695889 677178 662498 652437 646183 642849 642694
56939 642694 646121 652622 661843 674800 692945 716756 746284 782307 825750 876032 930252 983168
56927 983168 1027500 1055798 1063940 1053131 1028188 994264 955123 913033 869003 823546 777896 733948
56915 733948 692746 654058 617990 585812 558356 534786 514036 496477 483061 473767 468104 466371
56903 466371 469125 475952 485925 498742 514238 531163 547557 562058 573923 582148 585627 584195 578939
56890E78939p199o817m263p64K222M417O157O591M000j865r096j5536k0147k2537
56876E14102k2580k0848j8231j4888j0640o187k603L02L626P516J1254J5047J9942
56863D75812K5751L0933L4911L8761M2979M5828M4462L6704K2001K315j7703l3082
56851G49672m1721m4460m2562l6810k8790k0809j4042q092k509K900Q968J6429
56839E38174K4357L1336L8050M6496N6641O6401P4767Q1645Q3875P4963N1200
56828A167905J6471k0264n0673o9883p6801p4047o6213n6378m5077l2815k1380
56817F70845j1613k213P724J6891K4192L1043L9306M8446N6713O3952P1133P7527
56805A093946P9737P3330N5279K6544o578l5128n3155o0495o0028n4220m5161
$$ plain form
56890 578939 571740 564923 560660 559896 562118 566535 572692 579283 583283 581418 572322 556786 536639 514102
56876 514102 491522 470674 452443 437555 426915 420728 418125 418427 422053 429569 440823 455870 475812
56863 475812 501563 532496 567407 606168 649147 694975 739437 776141 798142 800457 782754 749672
56851 749672 707951 663491 620929 584119 555329 534520 520478 512386 509877 512777 521745 538174
56839 538174 562531 593867 631917 678413 735054 801455 876222 957867 1041742 1116705 1167905
56828 1167905 1184376 1164112 1113439 1043556 966755 892708 826495 770117 725040 692225 670845
56817 670845 659232 657019 664743 681634 705826 736869 776175 824621 881334 945286 1016419 1093946
56805 1093946 1173683 1247013 1302292 1328836 1322258 1287130 1233975 1173480 1113452 1059232 1014071
56794A014071l5460k6840j8907j0862l387K585P608J2786J8150K3269K8348L3372
56782A044733L7343L9582M0511L9736L4878K4004Q348q703k4178l5843m1783m1806
56770A116822l8458l4763l1579k8500k6151k5703k6901k8420k9675l0771l1254
56759G84647l0546k9089k7684k6154k3953k1493j9580j8123j6568j4959j3462
56748E43036j1614r204p110o085n582m939m690n367o077n753m870m436m217l551
56734D59541k915l066l380k859j973j818k080j601m48L67P32J317J953J833J073
56719D46676O14P68J220K072L463M593M585M033M299N600P051Q250R493J0763
56705E13480J1855J3145J5094J7392J9651K2429K6355L0906L5302L9943M5504
$$ plain form
56794 1014071 978611 951771 932864 922002 918615 921200 928808 941594 959744 983013 1011361 1044733
56782 1044733 1082076 1121658 1162169 1201905 1236783 1260787 1269135 1260432 1236254 1200411 1158628 1116822
56770 1116822 1078364 1043601 1012022 983522 957371 931668 904767 876347 846672 815901 784647
56759 784647 754101 725012 697328 671174 647221 625728 606148 588025 571457 556498 543036
56748 543036 531422 522218 515108 509023 503441 498502 493812 488445 482368 476615 471745 467309 463092 459541
56734 459541 456626 453560 450180 447321 445348 443530 441450 439849 439401 439768 440500 441817 443770 445603 446676
56719 446676 447290 448058 449278 451350 454813 459406 463991 468024 472323 477923 484974 493224 502717 513480
56705 513480 525335 538480 553574 570966 590617 613046 639401 670307 705609 745552 791056
56694G91056N1382N6536O1319O6804P2696P7383P9662P8993P4654O6205N4690
56683A531380M2030K9542J8136R142L466M73r07o39J404L807M966N361O638Q874
56669A663673J0830J2442J4861J8014K0234K0533J9435J7265J3395P491Nq826
56657A809352j9080l0001m0046m8242n4437n8241n9085n7318n3933m9160m2597
56646A297212l4636k6507j8932j2007o362l005j901j911k290l085m039m239l055
56633A175243n46L030P292J1531J5261J8723K2018K4223K4277K2232J8667J3491
56621A355442O422j828r920j6842k1608k3094k1446j8743j6828j5431j3787j2895
56609A189442j4164j6859j8933j9744j9849j8910j6043j1815p631l365K202Q809
$$ plain form
56694 791056 842438 898974 960293 1027097 1099793 1177176 1256838 1335831 1410485 1476690 1531380
56683 1531380 1573410 1602952 1621088 1630230 1633696 1634169 1633262 1632623 1634027 1637834 1642800 1648161 1654799 1663673
56669 1663673 1674503 1686945 1701806 1719820 1740054 1760587 1780022 1797287 1810682 1818173 1818178 1809352
56657 1809352 1790272 1760271 1720225 1671983 1617546 1559305 1500220 1442902 1388969 1339809 1297212
56646 1297212 1262576 1236069 1217137 1205130 1198768 1195763 1193862 1191951 1189661 1186576 1182537 1178298 1175243
56633 1175243 1174697 1177727 1185019 1196550 1211811 1230534 1252552 1276775 1301052 1323284 1341951 1355442
56621 1355442 1361864 1360036 1350116 1333274 1311666 1288572 1267126 1248383 1231555 1216124 1202337 1189442
56609 1189442 1175278 1158419 1139486 1119742 1099893 1080983 1064940 1053125 1045494 1042129 1044331 1053140
56597A053140J4772J9455K3607K7246K9323K9582K8805K7117K3951J9719J5651
56586A312368J1920P799L635P57o52j665k577k604j671n62P35K920N499O937O767
56571A349606N803M220J437j985m486n735o875q232q795q177p151n900l675o74
56557A299381J583K165J392o01m226r114j4208j9325k5076l1104l6261m0428m4274
56544A079904m7236m7922m6608m5124m4034m2134l9055l6068l3742l1100k7743
56533F39138k4758k2742k0841j8468j6213j4426j2582j0642r355q780q182p604
56521D64545p763q192p462n565m093l716l462k813k411k397k136j883k603l799
56507D06250l786k532j934k718l396k908j999j362o51J4k08j003j004k80m06j537
$$ plain form
56597 1053140 1067912 1087367 1110974 1138220 1167543 1197125 1225930 1253047 1276998 1296717 1312368
56586 1312368 1324288 1332087 1335722 1336479 1335827 1334162 1331585 1328981 1327310 1326748 1327483 1330403 1335902 1342839 1349606
56571 1349606 1355409 1359629 1361066 1359081 1354595 1348860 1341985 1333753 1324958 1316781 1309630 1303730 1300055 1299381
56557 1299381 1300964 1303129 1304521 1303920 1299694 1290580 1276372 1257047 1231971 1200867 1164606 1124178 1079904
56544 1079904 1032668 984746 938138 893014 848980 806846 767791 731723 697981 666881 639138
56533 639138 614380 591638 570797 552329 536116 521690 509108 498466 489111 480331 472149 464545
56521 464545 456782 448590 441128 435563 431470 427754 424292 421479 419068 416671 414535 412652 410049 406250
56507 406250 402464 399932 397998 395280 391884 388976 386977 385615 384964 384978 384770 383767 382763 382483 382077 380540
56491C80540j932j024l37n44k68J115K144J910J626K246K805K408J787J655J546
56476C95677J265J426J677P55q74r64Q39J955P86r50j277q55j076j614j654j581
56460C93535j801j646r14o01q72l14J479K760K450J941K605L659M036M289N046
56445D15652N458M849M057L772L328K423K075K557K432Q97r03k065l253m652n056
56430D31571m285m069n073n493m247k954l018l240k255r74o38o20p4L14N2J00
56414C95097Q23R18P0Q9J651K585J461K04P66J823J320Ql06R5K8j46K94O00J28
56395D07508n9O95R88j16j071n83m3q54j678r43J56j50j135j390j606k744l428
56378C93547k156k83J14l96j62M07M9n35m4Q09O88K18N41Q73J13p01j35R86J155
$$ plain form
56491 380540 378608 377584 377247 376703 376435 377550 379694 381604 383230 385476 388281 390689 392476 394131 395677
56476 395677 396942 398368 400045 400800 399926 398962 399801 401756 402542 401592 400315 399460 398384 396770 395116 393535
56460 393535 391734 390088 389174 388573 387701 387387 388866 391626 394076 396017 398622 402281 406317 410606 415652
56445 415652 421110 425959 430016 433788 437116 439539 441614 444171 446603 447500 446597 444532 441279 436627 431571
56430 431571 427286 423217 418144 412651 408404 405450 402432 399192 396937 395963 395325 394705 394631 394945 394997 395097
56414 395097 395920 396838 396908 396997 398648 401233 402694 402898 403664 405487 406807 406815 406509 406604 406632 406486 406780 407380 407508
56395 407508 407449 408144 409132 409016 407945 407362 407319 406465 404787 403844 404000 403850 402715 401325 399719 396975 393547
56378 393547 391391 391108 391222 390826 390664 391071 391120 390585 390541 391350 392038 392256 392797 393670 393783 393082 392947 393933 395088
56359C95088Q83J281J730J407J325K357L088K239J268J872K942K826K475L368
56345D24149M363L828K867L177L633K446R01J317K865L011J748Q91N09m86j441
56330D53778j042j76m96j312j044m11r91j919j333J95Q48Q55J427J857J035L48
56314D51619J605L497L602K595K829M014M057L050K771L187K967K546L245M355
56300D95939M453M468O022P855P444N019K666N99k148m613n056m138l581k950
56286E11979j126N79M21k38Q86K815L192K681L387M504L884K494K917M558M823
56271E47756L968M298N630N940N549O269P436P145O366P311Q863Q340O705P172
56257F38748R462J0425R643R512J0315J0165R370J0037J1686J1910J0921J0875
$$ plain form
56359 395088 395971 397252 398982 400389 401714 404071 407159 409398 410666 412538 415480 418306 420781 424149
56345 424149 428512 432340 435207 438384 442017 444463 445364 446681 449546 452557 454305 455196 455705 455219 453778
56330 453778 452736 452560 452064 450752 449708 449297 448306 446387 445054 445249 446097 446952 448379 450236 451271 451619
56314 451619 453224 456721 460323 462918 465747 469761 473818 476868 479639 482826 485793 488339 491584 495939
56300 495939 500392 504860 510882 518737 526181 531200 533866 534465 532317 527704 522648 518510 514929 511979
56286 511979 510853 511432 511853 511615 512501 515316 518508 521189 524576 529080 532964 535458 538375 542933 547756
56271 547756 551724 556022 561652 567592 573141 579410 586846 593991 600357 607668 616531 624871 631576 638748
56257 638748 648210 658635 668278 677790 688105 698270 707640 717677 729363 741273 752194 763069
56245G63069J1307R967P462O240N706L274n29l000m467p233j0358j0960j0044
56232G60434j1098j3539j3545j1127j0175j1354j1256q992p494p584o723m560
56220F42987l857m956m941l230k535l300k750l75J055R56J883M079M548K734J705
56205F34003K544K757J393N13O25j98j745j513R9p7j954j882P87K541K050J908
56189F41851K974K850J244J055K753L310K029J701K831K554N38p4J146Q94j292
56174F66364j721N61J850N98m7J486K537J890K105L972M598L231L155N609P439
56159G03627O988O724P991Q781Q615R972J3037J4659J4227J4834J7223J8590J8746
56146H64014K1070K5906K9532L1206L4548M0328M4978M7878N2943O1053O8190
$$ plain form
56245 763069 774376 784343 791805 798045 803751 807025 806496 803496 799029 791796 781438 770478 760434
56232 760434 749336 735797 722252 711125 700950 689596 678340 669348 661854 654270 647547 642987
56220 642987 639130 634174 629233 626003 623468 620168 617418 617043 618098 619054 620937 625016 629564 632298 634003
56205 634003 636547 639304 640697 641210 641835 641637 639892 638379 638478 638401 636447 634565 635352 637893 639943 641851
56189 641851 644825 647675 648919 649974 652727 656037 658066 659767 662598 665152 665690 665616 666762 667656 666364
56174 666364 664643 665204 667054 667652 667605 669091 671628 673518 675623 679595 684193 687424 690579 696188 703627
56159 703627 710615 717339 725330 734111 742726 752698 765735 780394 794621 809455 826678 845268 864014
56146 864014 885084 910990 940522 971728 1006276 1046604 1091582 1139460 1192403 1253456 1321646
56135A321646P2921P8174Q3591Q4073P8362P1305O5110N6502M5302L7323L5215
56124B029524L4284L0806K6706K2745J5368M208n314j0641j5698k2502k7507l0035
56112B051944l5696m6949n8521o6478p3591q1252q4726q1376p5490p0049o1918
56101A315898m9984l9645l4004k8799k1154j4992j2668r848m131j47n43n79K597
56088A102001M143R36k042r18K20j939l216n84J211j437l930k145J21p97j327
56073A090297J621M165L361L242O387Q174N973N019Q454J0780Q179N894Q221J0778
56059A180545R979J0281J4509J7092J4658J3181J6671J9247J6578J4395J7202
56048A344338J9537J7207J5996K0073K3143K0580J8779K2668K5797K2929K0452
$$ plain form
56135 1321646 1394567 1472741 1556332 1640405 1718767 1790072 1855182 1911684 1956986 1994309 2029524
56124 2029524 2063808 2094614 2121320 2144065 2159433 2163641 2158327 2147686 2131988 2109486 2081979 2051944
56112 2051944 2016248 1969299 1910778 1844300 1770709 1689457 1604731 1523355 1447865 1377816 1315898
56101 1315898 1265914 1226269 1192265 1163466 1142312 1127320 1114652 1104804 1100673 1100526 1099983 1099404 1102001
56088 1102001 1106144 1107080 1105038 1104120 1104340 1102401 1099185 1098601 1099812 1098375 1094445 1092300 1092421 1091624 1090297
56073 1090297 1091918 1096083 1099444 1102686 1109073 1117247 1123220 1128239 1136693 1147473 1155652 1161546 1169767 1180545
56059 1180545 1190524 1200805 1215314 1232406 1247064 1260245 1276916 1296163 1312741 1327136 1344338
56048 1344338 1363875 1381082 1397078 1417151 1440294 1460874 1479653 1502321 1528118 1551047 1571499
56037A571499K3698K6221K2676J9892K3663K7120K4184K1834K6639L1901L0966
56026A850293L0326L6370M2178M1091M0086M5796N0745M7862M4796M9093N3275
56015B331911N0023M7517N3710O0241N8650N7341O5090P3334P2881P2302Q0843
56004C023843Q9407Q8343Q7433R7404J08469J08993J08444J18992J31678J34420
55994D097426J36312J49451J64483J69500J74896J93162K13027K21076K29145
55985E748478K51566K75987K87196K98290L26093L58229L78535M01552M45539
55976H771465M95771N33203N73951O39404P14206P77936Q49904R55453J078283
55967A5389576J197300J338374J534325J769056K022733K335235K758566L288506
$$ plain form
56037 1571499 1595197 1621418 1644094 1663986 1687649 1714769 1738953 1760787 1787426 1819327 1850293
56026 1850293 1880619 1916989 1959167 2000258 2040344 2086140 2136885 2184747 2229543 2278636 2331911
56015 2331911 2381934 2429451 2483161 2543402 2602052 2659393 2724483 2797817 2870698 2943000 3023843
56004 3023843 3113250 3201593 3289026 3386430 3494899 3603892 3712336 3831328 3963006 4097426
55994 4097426 4233738 4383189 4547672 4717172 4892068 5085230 5298257 5519333 5748478
55985 5748478 6000044 6276031 6563227 6861517 7187610 7545839 7924374 8325926 8771465
55976 8771465 9267236 9800439 10374390 11013794 11728000 12505936 13355840 14311293 15389576
55967 15389576 16586876 17925250 19459575 21228631 23251364 25586599 28345165 31633671
55959C1633671L918360M713848N748291P012842Q488481J0253084J2406892J4952600
55951I9128069J7869699K1223563K5061542K9339602L4124118L9484340M4451868
55944C10682801M6036995M0292708K5458346M248148j7385720l3988580m3302350
55937C32042348m6061612m4224480l9709966l4067124k8394404k3259055j8833944
55930I7491763j5161042j2233604r938984q110743o650942n518989m638343l911872
55922C1327244l304490k824876k445376k113827j822499j593970j415242j249041
55914A4557923j093939r73858q82107p90454p00430o34318n87018n34445m78489
55905G882865m38933m11374l75493l34964l08957k93511k69615k40392k23516
$$ plain form
55959 31633671 35552031 40265879 46014170 53027012 61515493 71768577 84175469 99128069
55951 99128069 116997768 138221331 163282873 192622475 226746593 266230933 310682801
55944 310682801 356719796 397012504 422470850 426718998 409333278 375344698 332042348
55937 332042348 285980736 241756256 202046290 167979166 139584762 116325707 97491763
55930 97491763 82330721 70097117 60158133 52047390 45396448 39877459 35239116 31327244
55922 31327244 28022754 25197878 22752502 20638675 18816176 17222206 15806964 14557923
55914 14557923 13463984 12490126 11608019 10817565 10117135 9482817 8895799 8361354 7882865
55905 7882865 7443932 7032558 6657065 6322101 6013144 5719633 5450018 5209626 4986110
55896D986110k15514j99074j77446j67210j64704j52905j34487j25764j24446
55887C524560j14719r8361r0307q8645p8527o1289n1154m7115l5616j7550n940
55876B835337n8J2450L0587M1960M6678N4968O3372N7074L4354O699k2931n9699
55864C100791r7216j20859j30004j36299j41259j36030j21996j10825j04419r4340
55854A907544q0679p2367o9029o1317m9308m2641m2299l9707l3921l2401l4727
55843A349148l2409k5241k1520k1782j8303j0990p901r618q439l488j537k686
55831A185234k06N119N425Q99k02K908K528k438m922m082o929j4337j9125j9437
55817A130435k0807k3808k2823j8234j6798j8702j7112j1614r218j0799r537m315
$$ plain form
55896 4986110 4770596 4571522 4394076 4226866 4062162 3909257 3774770 3649006 3524560
55887 3524560 3409841 3311480 3221173 3132528 3054001 2992712 2941558 2894443 2858827 2841277 2835337
55876 2835337 2835279 2847729 2878316 2920276 2966954 3021922 3085294 3142368 3176722 3183421 3160490 3100791
55864 3100791 3003575 2882716 2752712 2616413 2475154 2339124 2217128 2106303 2001884 1907544
55854 1907544 1826865 1754498 1685469 1624152 1574844 1532203 1489904 1450197 1416276 1383875 1349148
55843 1349148 1316739 1291498 1269978 1248196 1229893 1218903 1211002 1201384 1192945 1189457 1187920 1185234
55831 1185234 1185028 1190147 1195572 1196471 1196269 1199177 1201705 1199267 1194345 1190263 1183334 1168997 1149872 1130435
55817 1130435 1109628 1085820 1062997 1044763 1027965 1009263 992151 980537 971319 960520 950983 946668
55805I46668j765l171k138K660M798K591K191N710P789O536O636R092Q928N605
55791A002130M935Q175R720Q024Q450J2894J6830J8991K3880L2373L9713M4979
55779A231094N2756O3364P1488P6669Q5129R8885J12944J25495J40715J58602
55769B217141J71759J75115J69673J54243J23527P7917K6355k3692p0851j12527
55759B908660j42637j59793j69158j73303j69647j59096j47895j38083j25140
55750A523908j08210r3497q4123p5464o4319n4133m7365m0874l2926k6965k4555
55739H71477k2055j7794j5175j5341j4252j0458q208r382r841p336n615o991q111
55726G20918o869o362q198q889o735n511p389q833p359n919o755p237n540m338
$$ plain form
55805 946668 944903 941732 939594 942254 947052 949643 951834 957544 965333 971869 978505 987597 996525 1002130
55791 1002130 1007065 1015240 1024960 1032984 1041434 1054328 1071158 1090149 1114029 1146402 1186115 1231094
55779 1231094 1283850 1347214 1418702 1495371 1580500 1679385 1792329 1917824 2058539 2217141
55769 2217141 2388900 2564015 2733688 2887931 3011458 3089375 3115730 3092038 3021187 2908660
55759 2908660 2766023 2606230 2437072 2263769 2094122 1935026 1787131 1649048 1523908
55750 1523908 1415698 1322201 1238078 1162614 1098295 1044162 996797 955923 922997 896032 871477
55739 871477 849422 831628 816453 801112 786860 776402 768194 758812 748971 741635 736020 729029 720918
55726 720918 714049 707687 699489 690600 683865 678354 670965 662132 654773 648854 642099 634862 629322 624984
55712F24984n193n258l054j587k368k332O0J718J088J212L420M200J748m73j57
55697F18008oj780k600o99J098J053J718M180N202L532K907N224O924N876N537
55682F56174Q245J0669J0141R520J1277J2563J0773Q508Q383Q161N629L221L340
55669G66604L928L109L375O755J0585J2411J4478J9038K3888K6904L0413L6754
55657I58242M3852M9554N6046O5742P7062Q8319J01474J17873J34563J49012J63160
55646B004899J78428J90815J95019J89415J73198J43584J00872N2410O748l2736
55636C202652o4773q5614r2618q8706p8227o1615l8538j2668J1406L2885N1814
55625B775998O4799O8276O2976N0476K8335o264n0040r5120j35070j66042j84932
$$ plain form
55712 624984 619791 614533 611479 609892 607524 605192 605252 606970 608058 609270 612690 616890 618638 618165 618008
55697 618008 618002 616222 613622 612923 614021 615074 616792 620972 626174 629706 632613 637837 644761 650637 656174
55682 656174 664419 675088 685229 694749 706026 718589 729362 737870 746253 754414 760043 763264 766604
55669 766604 770532 773641 777016 783771 794356 806767 821245 840283 864171 891075 921488 958242
55657 958242 1002094 1051648 1107694 1173436 1250498 1338817 1440291 1558164 1692727 1841739 2004899
55646 2004899 2183327 2374142 2569161 2758576 2931774 3075358 3176230 3228640 3235388 3202652
55636 3202652 3137879 3052265 2959647 2870941 2792714 2731099 2692561 2679893 2691299 2724184 2775998
55625 2775998 2840797 2909073 2972049 3022525 3050860 3044596 2994556 2899436 2764366 2598324 2413392
55614B413392j90919j87200j77677j63602j45894j27822j12124r8217q5096p4030
55604A050811o5587n7507m8654m1603l8017l5133l0337k5503k2996k1102j7512
55593F46860j3878j2626j2421j1061r714j0085j0379q471o216o279p347o743n193
55580E26447m876n142m355l565m305n106m113k723k883l284k007l44j39qJ894
55565D85491L975M087L598M522N333L854J668J286J459k31k524k802j976k519
55551E05221l668l226k194l006m766m789l422k954l211k347q14m10o19L02J874
55536D71971K509K647L425L903L036K487M003O015O321O069P368R272R969J0597
55522E49592J2890J5412J6348J7584K1563K6473K9365L1863L7619M6003N3567
$$ plain form
55614 2413392 2222473 2035273 1857596 1693994 1548100 1420278 1308154 1209937 1124841 1050811
55604 1050811 985224 927717 879063 837460 799443 764310 733973 708470 685474 664372 646860
55593 646860 632982 620356 607935 596874 587160 577075 566696 558225 552009 545730 538383 531640 526447
55580 526447 521571 516429 512074 508509 504204 499098 494985 492262 489379 486095 484088 483744 483605 483597 485491
55565 485491 489466 493553 497151 501673 507006 510860 512528 513814 515273 515042 512518 509716 507740 505221
55551 505221 501553 498327 496133 493127 488361 483572 480150 477196 473985 471638 470824 470414 469795 470097 471971
55536 471971 474480 477127 480552 484455 487491 489978 493981 499996 506317 512386 519754 529026 538995 549592
55522 549592 562482 577894 594242 611826 633389 659862 689227 721090 758709 804712 858279
55511H58279O0275O8960P9730R0133J00020J11152J22538J30995J35848J38466
55501A896396J37693J30207J14925R2654O2234K2011k4842p0871j10360j41123
55491B108924j61219j68781j65400j55557j42262j26488j10233r6087q3883p1640
55481H27374n9671n0170m3229l6978l1308k7586k5084k1643j7583j5138j4284
55470D84700j2980j1197j0678j0929r532o546m655m771n161m996n109n188l893
55457C89065j951j557k646l118k719l137m400m734m071m091m771m390k988k396
55443C42096k851l009l019m009m889l547j041o09k444l515k638j636j207O1J959
55428C09702K129K92r07k85K73m04r29m30n6k75J03J239J611J001J160K554L501
$$ plain form
55511 858279 918554 987514 1067244 1157377 1257397 1368549 1491087 1622082 1757930 1896396
55501 1896396 2034089 2164296 2279221 2371875 2434109 2456120 2431278 2360407 2250047 2108924
55491 2108924 1947705 1778924 1613524 1457967 1315705 1189217 1078984 982897 899014 827374
55481 827374 767703 717533 674304 637326 606018 578432 553348 531705 514122 498984 484700
55470 484700 471720 460523 449845 438916 429384 422838 418183 413412 408251 403255 398146 392958 389065
55457 389065 387114 385557 382911 379793 377074 373937 369537 364803 360732 356641 351870 347480 344492 342096
55443 342096 339245 336236 333217 329208 324319 320772 319731 319122 316678 313163 310525 308889 307682 307743 309702
55428 309702 311831 312123 311216 310931 311204 310800 309871 309441 309385 309110 309213 310452 312063 313064 314224 316778 320279
55411C20279L337L500M492M713L286J411j5j444k778l111k897l716n336n766m696
55396C11259l981m260m024k691j609j342q06K16N21O8K82J208J184r1j009j108
55380B93817j670k753k692j336o66j298j427k72M38m16j493j507j091r76o56M3
55364B76045K64j20j18M87Q93J227K298L352K660O28m80j55j5l86K53J878K381
55347B91092J260N98J335J716O33n23n94m04n93l90L06K56o29q23o1K9r15j166
55329B91127k34N2j067j801j096l46m61k18Q10P23j352l127k489o36J89o4k12
55312B79798j81m12n39k81k44o22o04K6L06o7j51L19M05l8M2O41M73m80n64N63
55292B78390J233P59M80Q73N42p95j191K49J711J787J516J810J585J64r79o86
$$ plain form
55411 320279 323616 327116 331608 336321 339607 341018 341003 339559 336781 333670 330773 327057 321721 315955 311259
55396 311259 307278 303018 298994 296303 294694 293352 292546 292762 293283 293351 293633 294841 296025 295934 294925 293817
55380 293817 292147 289394 286702 285366 284700 283402 281975 281703 282141 281725 280232 278725 277634 276658 276002 276045
55364 276045 276309 276189 276071 276558 277451 278678 280976 284328 286988 287616 287136 286981 286966 286580 286833 288711 291092
55347 291092 292352 292950 294285 296001 296634 296111 295517 295113 294520 294130 294436 294692 294063 293240 293179 293208 292293 291127
55329 291127 290893 290945 289878 288077 286981 286635 286174 285956 286766 287489 286137 283010 280521 279885 280074 280010 279798
55312 279798 279617 279205 278666 278385 278141 277519 276915 276941 277247 277180 277029 277348 277753 277715 277757 278398 278871 278391 277827 278390
55292 278390 279623 280382 280862 281735 282277 281482 280291 280540 282251 284038 285554 287364 288949 289113 288134 287448
55276B87448o1k47n25k27k73j125j469n69K28j09n85l64l68j082j196j45L87p08
55258B79010j859j435k72L17Q37J924K452J478J95m3J04l23n67J43O95j53j596
55241B80907k244k193j989j185L32J239P03j32j58o6o30j027n44j20n34q69m06
55224B71084j46p08p30P53K223J998Q42K36j05r40j473q16M0j21n42J7R29R43
55206B73484M36M93R28J025J031J197P28o06j333n09M85K10m17M2Q65N49n51j135
55188B76922j237j494j345j38J039Q27j03k25L76N89M29N77P15J80m42j64O94
55171B77200J209J358J437J031L1m63K49J176J346J497K388K996K209R74P66J208
55155B96612J123P20P25M68r72k690l067k250j621j542j392j117j077j026o84
$$ plain form
55276 287448 287387 287140 286615 286388 286115 284990 283521 282952 283180 283071 282486 282122 281754 280672 279476 279331 279718 279010
55258 279010 277151 275716 275444 275761 276598 278522 280974 282452 282647 282604 282708 282385 281818 281961 282656 282503 280907
55241 280907 278663 276470 274481 273296 273628 274867 275570 275438 275280 275214 274584 273557 273013 272893 272359 271490 271084
55224 271084 270938 270230 269500 270253 272476 274474 275316 275552 275447 274507 273034 272218 272258 272137 271595 271612 272541 273484
55206 273484 273920 274413 275341 276366 277397 278594 279322 278716 277383 276874 277359 277569 277152 277194 278059 278608 278057 276922
55188 276922 275685 274191 272846 272708 273747 274574 274471 274246 274622 275211 275640 276217 276932 277112 276670 276506 277200
55171 277200 278409 279767 281204 282235 282266 281803 282052 283228 284574 286071 288459 291455 293664 294638 295404 296612
55155 296612 297735 298455 299180 299648 298676 295986 292919 290669 289048 287506 286114 284997 283920 282894 282210
55140B82210n48q53p67R4O10j4p45n08k1k26m62Q0N31p8q86p65l59o57r50k93
55120B75393N17M93M89J418K005Q73o08k59J270J634O10n1R0j49r87j419j244
55103B80075j114q51J43J202J236P33Q09R38j32j751k072j014j98j35J84J004
55087B79057J389J076P72N24k72j293j441o16K10N93Q35R47P52O60R68R75K22
55070B85358k91K89Q33q1j523j471k3R10O62L36M79M67N6k54m28p78q35N9J284
55051B85049J668J256R30P50K67j40Q8L70q2p06o43m02p27q48J05J010L89p99
55033B87535n27R00J461Q61O04R73P44j37l15L08K89o87j222p41l37o03o58K7
55015B88475O76O62L49J60R8L29R71J363R57N58J188K192K217J549J506K013J844
$$ plain form
55140 282210 281662 280809 280042 280136 280746 280732 279987 279479 279458 279232 278770 278850 279381 279303 278417 277652 277293 276636 275686 275393
55120 275393 275910 276403 276892 278310 280315 281188 280580 280321 281591 283225 283835 283784 283874 283725 282738 281319 280075
55103 280075 278961 278110 278253 279455 280691 281424 282233 283171 283039 281288 279216 278202 278004 277869 278053 279057
55087 279057 280446 281522 282294 282818 282546 281253 279812 279196 279406 279999 280834 281781 282533 283193 284161 285136 285358
55070 285358 285067 285356 286189 286108 284585 283114 283091 284001 284663 284999 285478 285945 286001 285747 285319 284541 283706 283765 285049
55051 285049 286717 287973 288903 289653 289920 289780 289868 290238 290156 289450 288807 288405 287678 286830 286935 287945 288334 287535
55033 287535 287008 287908 289369 290230 290834 291807 292551 292414 292099 292407 292696 292009 290787 290046 289709 289106 288448 288475
55015 288475 289151 289813 290162 290322 290420 290749 291720 293083 294040 294598 295786 297978 300195 301744 303250 305263 307107
54998C07107J034P34Q73J58j433k389k041j291q22m03j14l75p57m52R4j79r18
54981B98826q40m1K14j72j03M73N23O6K56J185J678J441J357J537J076q5r84j326
54963C05081j524j175L94K224K575J665J313J926K223J951K287L298L614L064
54949C28916L130M211M936M859N363P082Q665Q991Q489P450N183J722j558l872
54935C93567n731p176p346o519o328p202p593o643n480m979m331k958j752j277
54921C18252o59M94R49k5j066p08M72J034Q14O29R06J620K688L663L970L942M598
54904C41573O007P139P615Q101Q651Q296O787N112L681J663j207l743n013n532
54890C89130o074o686p336q130q406p179m947l423l109k780j809j074j060j023
$$ plain form
54998 307107 308141 308875 309748 309906 308473 306084 304043 302752 301930 301527 301413 301038 300281 299829 299923 299744 298826
54981 298826 297986 297945 298159 297987 297884 298357 298880 298946 299202 300387 302065 303506 304863 306400 307476 307391 306407 305081
54963 305081 303557 302382 302776 305000 307575 309240 310553 312479 314702 316653 318940 322238 325852 328916
54949 328916 332046 336257 341193 346052 351415 358497 367162 376153 384642 392092 397275 398997 397439 393567
54935 393567 387836 380660 373314 366795 360467 353265 345672 339029 333549 328570 324239 321281 319529 318252
54921 318252 317593 318087 319036 319011 317945 317237 317709 318743 319557 320186 321092 322712 325400 329063 333033 336975 341573
54904 341573 347580 354719 362334 370435 379086 387382 394169 399281 402962 404625 403418 399675 394662 389130
54890 389130 383056 376370 369034 360904 352498 345319 340372 336949 333840 331060 329251 328177 327117 326094
54876C26094p27j040k003k303j591j295k138k725j827k98N33P04O65R2j042j618
54860C09481r98j80k02n51l39J86M09N14Q22R48N74J14j41n17j042j138p84p04
54842C06452q97m18P84J343N39n73q29m14N4M44N04k13j133r48L88J440J537J542
54824C09602J806J439K83l81n0J23l25q3J420K569K081J071R52J132N54j05L32
54807C22420J439K048K129K194J929J001K07M09J212J868K521L385L880L786M065
54792C54493N291O451O576O351O721P053O189M298K338M98j483l308m587n585
54778C91296o528o946o542n777m912l663k400k251l168l485k407j266j167j181
54764C39603k20R78J372J565K500L541L643L270L394L611K981J836J234J418K200
$$ plain form
54876 326094 325367 324327 322324 320021 318430 317135 314997 312272 310445 310147 310680 311384 312049 312141 311099 309481
54860 309481 308483 308303 308101 307550 307211 307397 307806 308320 309142 310090 310664 310778 310637 310120 309078 307940 307156 306452
54842 306452 305555 305137 305921 307264 307803 307230 306401 305987 306041 306485 306989 306776 305643 304695 305083 306523 308060 309602
54824 309602 311408 312847 313130 312749 312699 312822 312497 312414 313834 316403 318484 319555 320507 321639 322193 322088 322420
54807 322420 323859 325907 328036 330230 332159 333160 333367 333776 334988 336856 339377 342762 346642 350428 354493
54792 354493 359784 366235 372811 379162 385883 392936 399125 403423 405761 406259 404776 401468 396881 391296
54778 391296 384768 377822 371280 365503 360591 356928 354528 352277 349109 345624 343217 341951 340784 339603
54764 339603 339383 340361 341733 343298 345798 349339 352982 356252 359646 363257 366238 368074 369308 370726 372926
54749C72926L809N985P268O736N417M656M108K794R93n39k164m398o418p158p097
54734C86918p295p489o795n523m673m247l615k981k928l139k903k340j910j460
54720C29620r07r84j953k556j687k45J52m63q58o61m68m60l37j68j10J62O99P66
54702C19542N1n34l00R6M4J59Q03R14j68j133o93J72n2p40l38Q12J104M26M5K50
54682C20460K23r6J6M71M89R9l2O0q6k33KJ00l84n95K61J213R39O5N0N58J10j124
54660C22566j487n90K09J93J42O11J074J105J000R98R87R46P64Mj163j432n1J701
54642C27577K128J420R11Q00L55k94m21k33m14o32k25J90l48j242j184m14j36
54625C27838k61K23J134J450J434K076K783K023K24m48O16J680J548J010Q71O36
$$ plain form
54749 372926 376735 382720 389988 396724 402141 406797 410905 413699 414692 414153 411989 407591 401173 394015 386918
54734 386918 379623 372134 365339 359816 355143 350896 347281 344300 341372 338233 335330 332990 331080 329620
54720 329620 328713 327729 325776 323220 321533 321288 321440 320977 320119 319458 318990 318530 318193 318025 317915 318077 318776 319542
54702 319542 319593 319059 318759 318855 318899 319058 319861 320775 320607 319474 318781 318953 318901 318161 317823 318635 319739 320165 320210 320460
54682 320460 320683 320587 320603 321074 321563 321662 321630 321690 321604 321371 321373 321473 321089 320494 320755 321968 322907 322972 323022 323580 323690 322566
54660 322566 321079 320489 320698 320891 321033 321644 322718 323823 324823 325821 326808 327754 328518 328522 327359 325927 325876 327577
54642 327577 329705 331125 332036 332836 333191 332897 332476 332243 331829 331197 330972 331162 330814 329572 328388 327974 327838
54625 327838 327577 327800 328934 330384 331818 333894 336677 338700 338924 338476 339092 340772 342320 343330 344201 344837
54609C44837p7o32o22n20n29j75M76O12Q9l27m22q24j573j769j134n30m96n04
54591C35880p6M49O54N75L21KJ7N28Q29K53n80n89J23O16P23R50J211J088R33
54572C43907J224J330N45k81O1Q61N16o71r49j86Mp52r99k40J96k93m59M55J358
54553C45627J365J254J819K349J982J144O24L34n1k84j60PJ17N80J391J940K064
54536C62102K218K299J536n3j282j358p43j80J31R0l82p64l75L92M36l20q45p21
54518C62181o22q72r39o22m09l21K01R96J127M34j74k39k33k42L72J536K111J550
54500C65835O93M42P16J046J238J153Q15Q13J583K494K732K740L312L808L118
54485C92538J999K243L666M357M095M858P243Q996Q319O340M901L885K384Q42
$$ plain form
54609 344837 344760 344128 343506 342986 342457 342282 342758 343370 343459 343132 342710 341886 340313 338544 337410 336880 336384 335880
54591 335880 335804 336253 336907 337482 337803 337805 337822 338350 339179 339432 338852 338263 338386 339002 339725 340675 341886 342974 343907
54572 343907 345131 346461 347006 346725 346786 347647 348163 347492 346543 346357 346361 345609 344610 344370 344566 344273 343814 344269 345627
54553 345627 346992 348246 350065 352414 354396 355540 356164 356498 356447 356163 356003 356010 356127 356707 358098 360038 362102
54536 362102 364320 366619 368155 368102 366820 365462 364719 364539 364670 364760 364378 363614 363239 363631 364067 363747 362902 362181
54518 362181 361559 360687 359748 359126 358717 358396 358597 359593 360720 361154 360980 360741 360508 360266 360638 362174 364285 365835
54500 365835 366528 366970 367686 368732 369970 371123 371938 372751 374334 376828 379560 382300 385612 389420 392538
54485 392538 394537 396780 400446 404803 408898 413756 420999 429995 438314 444654 449555 453440 455824 456666
54471D56666K34J95m08j775l253m464n425o055o259o029n211l898l002l356m224
54456D03736m082k938k302k666k781j920j017r03j084j046j136j395j065j30K60
54441C79531l20p27k06L48L4o16q59r55j189j022k43K91L4l64l77m90q96p36L44
54422C71582J213R40J99n2q2m77q76p07k41N8K98N37M64K72O89J490J423K64n69
54403C76425k44K05k17r15j068r90j013n36N74J179O98K15N15O94Q1j39J008K236
54385C78708J932Q76R21K015K598K279K015K207K386K473K798L135L088L080L747
54370D14258M735N258N255N025M320K960J622Q42q0j939m157n637o379o934p029
54355D12120o118m708l768l267k524j558q48k86M38R06N99qj15R8p7o46j152j549
$$ plain form
54471 456666 456900 457095 456687 454912 451659 447195 441770 435715 429456 423427 418216 414318 411316 407960 403736
54456 403736 399654 396716 394414 391748 388967 387047 386030 385127 384043 382997 381861 380466 379401 379271 379531
54441 379531 379211 378484 378278 378626 378660 378044 377185 376230 375041 374019 373776 374067 374101 373737 373360 372870 371974 371238 371582
54422 371582 372795 373735 373934 373882 373800 373323 372447 371740 371499 371557 371855 372392 372856 373128 373817 375307 376730 376994 376425
54403 376425 376181 376386 376169 375254 374186 373196 372183 371647 372221 373400 374098 374313 374828 375522 375603 375464 376472 378708
54385 378708 380640 381516 382437 384452 387050 389329 391344 393551 395937 398410 401208 404343 407431 410511 414258
54370 414258 418993 424251 429506 434531 438851 441811 443433 444275 444195 442256 438099 432462 426083 419149 412120
54355 412120 406002 401294 397526 394259 391735 390177 389329 389043 389481 390387 390986 390978 390863 390961 390884 390238 389086 387537
54337C87537j842j555o76l31j245k276j919o76l28j251k083j935j429j368j628
54322C66995j653j164k23P73J225R35M48K76K45P2M8M96J056J225J090R06N69
54305C73319P5j10K23N58M59J57j26n73r66n68N43J148O16k03n41q65j548j824
54287C69774j214p31j339k369k801k867l025k629j201J16J10m59r7J031J686J651
54271C55636J525J179L06k62L67J327J150J88n5M95N74j4j53M78R64R09R20J158
54253C66692J015L88j13l44o92r76o45kR1k99l46n7k11p29n82M64J329J156K55
54234C66394o30j055q49k86j30o63r77k34P98P66j49n40KN08M42L35M83M07j08
54215C64514n70o65n75l37K03P54Q47O73P83J077J044P78P34P66M55J33N05J497
$$ plain form
54337 387537 385695 384140 383464 383133 381888 379612 377693 377017 376689 375438 373355 371420 369991 368623 366995
54322 366995 365342 364178 363955 364728 365953 366888 367336 367612 367857 367929 367977 368473 369529 370754 371844 372750 373319
54305 373319 373394 373284 373507 374065 374524 374681 374555 373982 373016 372448 372991 374139 374755 374552 374011 373146 371598 369774
54287 369774 368560 367829 366490 364121 361320 358453 355428 352799 351598 351714 351824 351365 351268 352299 353985 355636
54271 355636 357161 358340 358646 358384 358751 360078 361228 361416 361361 361856 362430 362416 362263 362741 363705 364614 365534 366692
54253 366692 367707 368095 367982 367638 366946 365970 365325 365323 365414 365115 364769 364712 364501 363772 363190 363654 364983 366139 366394
54234 366394 365764 364709 363860 363574 363444 362781 361804 361570 362368 363134 362985 362445 362447 362955 363397 363732 364215 364622 364514
54215 364514 363944 363279 362704 362367 362570 363324 364171 364844 365627 366704 367748 368526 369260 370026 370481 370614 371119 372616
54197C72616K553L710N248O653P194P230P572P885P124N347L660K498J352O6j053
54182D39655k316m359o720q097q086p441o624n463m219l570l383k819j712p24
54168C74122j08L81M55m10j639j977j341r32j334j876j999j903j608p47M49J106
54152C60639R36M40j01p44j059m65N99J120J049J135J396J206Q80J501L000M005
54136C75537L790K964K011P45n33r79o77p25j391j717j307r87j194j234p20l28
54120C73255m43m84j44j9l13k30O78J682K098K124J991J457P69Q76J923K689K295
54103C90204J410J075J378J900K470K760K150P59k74k28L29P08J209K342L789
54088D11981M891N605O357P472R108J1122J2732J3083J2416J1964J2441J3439
$$ plain form
54197 372616 375169 378879 384127 390780 397974 405204 412776 420661 427785 433132 436792 439290 440642 440708 439655
54182 439655 437339 432980 426260 418163 410077 402636 396012 390549 386330 382760 379377 376558 374846 374122
54168 374122 374014 374395 374850 374440 372801 370824 369483 368551 367217 365341 363342 361439 359831 359084 359533 360639
54152 360639 361575 362015 361914 361170 360111 359646 360245 361365 362414 363549 364945 366151 367031 368532 371532 375537
54136 375537 379327 382291 384302 385047 384514 383535 382858 382133 380742 379025 377718 376731 375537 374303 373583 373255
54120 373255 372812 372328 372184 372165 371852 371622 372300 373982 376080 378204 380195 381652 382421 383297 385220 387909 390204
54103 390204 391614 392689 394067 395967 398437 401197 403347 404106 403832 403604 403933 404641 405850 408192 411981
54088 411981 416872 422477 428834 436306 445414 456536 469268 482351 494767 506731 519172 532611
54076E32611J4396J5285J6135J6818J7481J8142J7684J4436Q079P4p944j5136
54064F48061k0803k4230k5574k5742k4991k2840j9555j6348j3700j0986q131o154
54052D29007n373m643l241k081k090k646k663k141j603j008k46J61j81p27q60
54037C99665p29n95j15R17J876K171K128K341K786L166L462L548L080K259J976
54022D27936K583L306L382L004K648K267J750J310R70M44p1Q6P84R18L0r73j301
54005D49073j406j931k579k824k793k638j942n81O80J216J393J743K073K124K223
53990D43831K558K526J534j53j962l617m792n033m553m185m127l689k784k345
53976D13209k699k806k004j213j374j873j700j121r80j136r09l43O0L28O99Q64
$$ plain form
54076 532611 547007 562292 578427 595245 612726 630868 648552 662988 671067 671141 663197 648061
54064 648061 627258 603028 577454 551712 526721 503881 484326 467978 454278 443292 435161 429007
54052 429007 423634 418991 415750 413669 411579 408933 406270 404129 402526 401518 401272 401433 401252 400525 399665
54037 399665 398936 398341 398226 399143 401019 403190 405318 407659 410445 413611 417073 420621 423701 425960 427936
54022 427936 430519 433825 437207 440211 442859 445126 446876 448186 449156 449600 449529 449615 450399 451317 451347 450374 449073
54005 449073 447667 445736 443157 440333 437540 434902 432960 432379 433059 434275 435668 437411 439484 441608 443831
53990 443831 446389 448915 450449 450296 448334 444717 439925 434892 430339 426154 422027 418338 415554 413209
53976 413209 410510 407704 405700 404487 403113 401240 399540 398419 397439 396303 395394 395051 395111 395439 396138 397002
53960C97002N51L18Q32J848K616K837K526J595L51k99J5M90M01K39P68J657K065
53943D15812K016K140K513K646K262J428K52r08j435j210q47p21m88l4Qo16j029
53926D21789m05Q34J824K522L315M056M328M239M177M328M927O286Q030R142R368
53911D88760R741J1053J2769J4123J5257J6294J6298J4177J0059M871o53n839
53899F06910r779j2077j3210j3533j2783j1113r557q671p800o484n410n038m646
53886D86809l805l428m115m729m104k949k497k407j730r95j385k603l307l199
53872D45556k947k559j639q63j369k801l586l140k347j896j576j248j219j525
53858D16841j829k002k022j538n09K15m1o22n00J21L55J80J09o6p38j172l48J193
$$ plain form
53960 397002 397553 397871 398703 400551 403167 406004 408530 410125 410476 410177 410192 410682 411083 411322 412090 413747 415812
53943 415812 417828 419968 422481 425127 427389 428817 429069 428161 426726 425516 424669 423948 423460 423426 423434 422818 421789
53926 421789 421384 422218 424042 426564 429879 433935 438263 442502 446679 451007 455934 462220 470250 479392 488760
53911 488760 498501 509554 522323 536446 551703 567997 584295 598472 608531 613402 612749 606910
53899 606910 597131 585054 571844 558311 545528 534415 524858 516187 508387 501903 496493 491455 486809
53886 486809 483004 479576 475461 470732 466628 463679 461182 458775 457045 456050 454665 452062 448755 445556
53872 445556 442609 440050 438411 437548 436179 433378 429792 426652 424305 422409 420833 419585 418366 416841
53858 416841 415012 413010 410988 409450 408941 409156 409115 408493 407993 408114 408469 408649 408758 408692 407954 406782 406434 407627
53840D07627J938J656J473J781J716R21K36K56N10N29O17J058J413J099J60q08
53824D22182j121n21L97O25J4m42r9K95j02p68o97M1P64J536K755L976M481M534
53806D37850M722M624L562K163J629J799J483M30n79j275j961k225j318K01Q15
53791D51920K02l94l4R85K077K941L165K604K099K534L280K977J676P17O05N87
53775D77941K91O3l59j734l713m863m690m038l416k559j822k148l227l477k500
53760D39749j757k178k746k377j532j029o41N8O64P83Q42J137J106L77l78m96
53744D31582k93k40o0M73P87L88k64n20m75m82m34k02n5j06oK64J29n28q94m31
53724D28633K48M70O41J503K872L951M435M647M860N098N303N276M777L891K955
$$ plain form
53840 407627 409565 411221 412694 414475 416191 417112 417348 417604 418114 418643 419260 420318 421731 422830 422990 422182
53824 422182 421061 420540 420937 421562 421576 421134 421035 421330 421228 420460 419763 419804 420568 422104 424859 428835 433316 437850
53806 437850 442572 447196 450758 452921 454550 456349 457832 458262 457683 456408 454447 452222 450904 451105 451920
53791 451920 452122 451728 451694 452679 454756 457697 460862 463466 465565 468099 471379 474356 476032 476749 477354 477941
53775 477941 478232 478295 477936 476202 472489 467626 462936 458898 455482 452923 451101 448953 445726 442249 439749
53760 439749 437992 435814 433068 430691 429159 428130 427489 427547 428211 428994 429836 430973 432079 432456 432078 431582
53744 431582 431289 431049 430989 431462 432249 432637 432373 431853 431378 430896 430462 430260 430205 430099 430093 430357 430486 429958 429064 428633
53724 428633 428881 429351 429992 431495 434367 438318 442753 447400 452260 457358 462661 467937 472714 476605 479560
53709D79560J995P90m44j179j516k133l094l598l291k869k916k999k501j609q18
53694D53378j96K97L72o1m76m01l1K62N69J103J714K174K562K955L087K664J746
53677D71718O15l41o33q2P27R85O54L17N4n56j290j210j28Q19O47k01o82n42k79
53658D70592j72l7L16Q37J299J437J207R38R07Q52L62l92r12j120j271j334j208
53641D72301j274j838k258j703o02j68m98n12J60O72N69M88Q38J084R76J153J830
53624D71218K057J187M6k04M02J009J148R29O17N72R41J117L30r52j191J82J986
53607D81394K976L214L154K700J988J969L071M192M071K950J924J436J364J830
53593E18233K816L578L491K923K499K076J412J158J996L264L663L108K725L142
$$ plain form
53709 479560 481555 482345 481901 480722 479206 477073 473979 470381 467090 464221 461305 458306 455805 454196 453378
53694 453378 453182 453479 453851 453790 453314 452913 452882 453144 453713 454816 456530 458704 461266 464221 467308 469972 471718
53677 471718 472333 471992 471359 471277 472004 472989 473643 473960 474014 473458 472168 470958 470830 471649 472296 472095 471413 470871 470592
53658 470592 470420 470383 470699 471536 472835 474272 475479 476417 477324 478176 478538 478146 477234 476114 474843 473509 472301
53641 472301 471027 469189 466931 465228 464626 464458 463960 463448 463608 464280 464849 465337 466175 467259 468235 469388 471218
53624 471218 473275 474462 474508 474304 474706 475715 476863 477792 478409 478981 479922 481039 481369 480417 479226 479408 481394
53607 481394 484370 487584 490738 493438 495426 497395 500466 504658 508729 511679 513603 515039 516403 518233
53593 518233 521049 524627 528118 531041 533540 535616 537028 538186 540182 543446 547109 550217 552942 556084
53579E56084L780L886L400K706K122J771J486Q65k11j342k193k974l873m488m354
53564E56665l759l380l329l187k778k386k227k170j992j623j152p51n01k47J25
53549E27308L83K70L4J59N63P42P00R26J428J620J400J331J526J361P33N53J344
53532E42381K384K927L410M523N925O839P314P903Q586Q914Q870Q709Q284P346
53518F34315O275N674N475N122M530M186M407N070O030P240Q471R325R609R568
53504G25297R820J1031J3318J5835J7418J7823J7932J8535J9417J9862J9620J9026
53492I24934J8573J8510J8603J8304J7515J7088J7793J8988J9254J8340J7484
53481A125386J7544J7903J7665J6932J6333J6076J5998J5863J5253J3885J2289
$$ plain form
53579 556084 559864 563750 567150 569856 571978 573749 575235 576100 575889 574547 572354 569380 565507 561019 556665
53564 556665 552906 549526 546197 543010 540232 537846 535619 533449 531457 529834 528682 527931 527430 527183 527308
53549 527308 527691 527961 527995 528154 528717 529459 530159 531085 532513 534133 535533 536864 538390 539751 540484 541037 542381
53532 542381 544765 547692 551102 555625 561550 568389 575703 583606 592192 601106 609976 618685 626969 634315
53518 634315 640590 646264 651739 656861 661391 665577 669984 675054 681084 688324 696795 706120 715729 725297
53504 725297 735117 746148 759466 775301 792719 810542 828474 847009 866426 886288 905908 924934
53492 924934 943507 962017 980620 998924 1016439 1033527 1051320 1070308 1089562 1107902 1125386
53481 1125386 1142930 1160833 1178498 1195430 1211763 1227839 1243837 1259700 1274953 1288838 1301127
53470A301127J1372J1125J0724J0064R985J0639J0904R953Q179O052L387M68j566
53457A402413k393l323n396p911r848j1512j3448j4969j5217j4791j4847j5353
53445A273405j5667j6127j7498j9368k0504k0525j9998j9260j8326j7493j6873
53434A071766j5757j3624j1375j0331j0417j0490j0085r601r159q575q134q152
53422I46066q045p054n651m864m492l335j153J031K680M473P014R839J2067J3295
53408I61871J3672J3805J4582J6368J8436J9867K0797K2071K3900K5738K7244
53397A178351K8439K9172K9403K9837L1251L3379L5332L6956L8772M0784M2422
53386A554098M3611M4750M5725M6010M5830M6091M6953M7560M7372M6833M6394
$$ plain form
53470 1301127 1312499 1323624 1334348 1344412 1354397 1365036 1375940 1385893 1394072 1400124 1403511 1403979 1402413
53457 1402413 1400020 1396697 1391301 1383390 1373542 1362030 1348582 1333613 1318396 1303605 1288758 1273405
53445 1273405 1257738 1241611 1224113 1204745 1184241 1163716 1143718 1124458 1106132 1088639 1071766
53434 1071766 1056009 1042385 1031010 1020679 1010262 999772 989687 980086 970927 962352 954218 946066
53422 946066 938021 930967 925316 920452 915960 912625 911472 912503 915183 919656 926670 936509 948576 961871
53408 961871 975543 989348 1003930 1020298 1038734 1058601 1079398 1101469 1125369 1151107 1178351
53397 1178351 1206790 1235962 1265365 1295202 1326453 1359832 1395164 1432120 1470892 1511676 1554098
53386 1554098 1597709 1642459 1688184 1734194 1780024 1826115 1873068 1920628 1968000 2014833 2061227
53375B061227M5795M4693M3251M1723L9989L7766L4930L1495K7686K4019K0872
53364B453446J8093J5349J2597R795O579K806j027m681q955j4774k1872k9273
53352B438083l6559m3512m9059n1986n2695n2969n3877n5011n5772n6204n6276
53341A874163n5543n3940n2014n0046m7847m5621m4153m3722m3577m2884m1572
53330A353244l9977l8314l6744l5314l3639l1179k8151k5533k3897k2709k1088
53319A016699j8829j6438j4381j2527j0259p287m400k934l195l857l435j895k38
53306I17024R67J905K804L761M972O327P119O958O701P553R490J1401J2545J3093
53292A012620J3512J4282J5825J7850J9198J9275J9176K0236K2061K3306K3937
$$ plain form
53375 2061227 2107022 2151715 2194966 2236689 2276678 2314444 2349374 2380869 2408555 2432574 2453446
53364 2453446 2471539 2486888 2499485 2509280 2515859 2518665 2517638 2512957 2504002 2489228 2467356 2438083
53352 2438083 2401524 2358012 2308953 2256967 2204272 2151303 2097426 2042415 1986643 1930439 1874163
53341 1874163 1818620 1764680 1712666 1662620 1614773 1569152 1524999 1481277 1437700 1394816 1353244
53330 1353244 1313267 1274953 1238209 1202895 1169256 1138077 1109926 1084393 1060496 1037787 1016699
53319 1016699 997870 981432 967051 954524 944265 936978 932578 929644 926449 922592 919157 917262 917024
53306 917024 917991 919896 922700 926461 931433 937760 944879 951837 958538 966091 975581 986982 999527 1012620
53292 1012620 1026132 1040414 1056239 1074089 1093287 1112562 1131738 1151974 1174035 1197341 1221278
53281A221278K5093K6841K7841K7476K6676K6204K5502K3877K1671J9598J7850
53270A489907J6341J5087J3901J2386J0449Q230N520K105j368l851n295o641q397
53257A548374j0365j2705j5893j9431k2020k3466k5079k7577k9889l0787l0632
53246A300530l0504l0635l0645l0621l0851l0940l0043k8012k5654k3873k2878
53235I85874k2179k1294k0501k0631k1840k2973k2819k1601k0419j9567j8477
53224G53573j7084j6009j5329j4484j3497j3000j2774j1656r369p223o271n943
53212F10934n266m424m127m310m315l946l530l322l395l733m044l906l387l005
53198E56224k877k582k045j833k194k626k759k862l073k936k235j525j204q10
$$ plain form
53281 1221278 1246371 1273212 1301053 1328529 1355205 1381409 1406911 1430788 1452459 1472057 1489907
53270 1489907 1506248 1521335 1535236 1547622 1558071 1566301 1571821 1573926 1572558 1568707 1563412 1556771 1548374
53257 1548374 1538009 1525304 1509411 1489980 1467960 1444494 1419415 1391838 1361949 1331162 1300530
53246 1300530 1270026 1239391 1208746 1178125 1147274 1116334 1086291 1058279 1032625 1008752 985874
53235 985874 963695 942401 921900 901269 879429 856456 833637 812036 791617 772050 753573
53224 753573 736489 720480 705151 690667 677170 664170 651396 639740 630371 623148 616877 610934
53212 610934 605668 601244 597117 592807 588492 584546 581016 577694 574299 570566 566522 562616 559229 556224
53198 556224 553347 550765 548720 546887 544693 542067 539308 536446 533373 530437 528202 526677 525473 524663
53184E24663Q3R09Q44R2l15J04P10N32o53k037k511j795p05r5J14L99N44n0j225
53165E19608k174k554k611k308j430n18m90j234j740j773k122k892k993j932p92
53150D92045o48j093j191r40q54r42r49j020j289j362r36l87k02l31n52q87j132
53133D77330o58O49J844J954J093J22l42j52O03J565K287K748L260L722L643L073
53117E02741K739K866K749J865O58k30p66j138j272j207j300j673k056k381k846
53102D98749l225l022k460k239k183j374M7N86l75j483j371n40k36n43p08n48
53086D79075m40n09o91j028j205n85O93J461J125N41N65P91O47O53J387K134J884
53069D86498R55L45J54j31l63j02K21j58r60j279j108j266j939k502k669k728
$$ plain form
53184 524663 524746 525655 526499 526591 526276 526380 527090 527622 526969 524932 522421 520626 519921 519826 519940 520339 520883 520833 519608
53165 519608 517434 514880 512269 509961 508531 508013 507523 506289 504549 502776 500654 497762 494769 492837 492045
53150 492045 491397 490304 489113 488173 487319 486377 485428 484408 483119 481757 480821 480434 480232 479901 479349 478462 477330
53133 477330 476672 477321 479165 481119 482212 482334 481992 481840 482443 484008 486295 489043 492303 496025 499668 502741
53117 502741 505480 508346 511095 512960 513618 513388 512622 511484 510212 509005 507705 506032 503976 501595 498749
53102 498749 495524 492502 490042 487803 485620 484246 484293 484879 484504 483021 481650 481110 480874 480331 479623 479075
53086 479075 478635 478126 477435 476407 475202 474617 475310 476771 477896 478437 479002 479793 480440 481093 482480 484614 486498
53069 486498 487453 487798 487952 487821 487458 487356 487577 487419 486459 485180 484072 482806 480867 478365 475696 472968
53053D72968k657k059j106o05r14j475j584j103l89O1r3p07j280j624k020k422
53037D52991k180j053R3L05j76m29j90J0j86n83q34p27k90M8k35r55j264p96j73
53018D43376J9OJ20J27j30j92K48P26P91P14P34M99r3l41J24N43K32k48j14L07
52998D47448L40J85L01K92l29r93r11m25k87k18M67J354J468R25O51Q20Q55P38
52980D52681R19J191J045R08J640K873L278K462J364O75K10j12O9N80O53J98O3
52963D70697O66J224Q12m70j763k381k286j937j837j939j790j411j473k097k293
52948D51722j341k7N30N80J046J734J573M16p47j270j374j265q55l17O5N20J312
52931D52302J919J672R87P53Q66N44j48m43l37n56j071j052l19M45R19J311J351
$$ plain form
53053 472968 470311 468252 467146 466541 465627 464152 462568 461465 461076 461137 461044 460337 459057 457433 455413 452991
53037 452991 450811 449758 449851 450156 449980 449551 449361 449371 449185 448602 447768 447041 446751 446799 446564 445609 444345 443549 443376
53018 443376 443395 443401 443521 443648 443518 443326 443574 444300 445091 445805 446539 447038 446945 446604 446728 447271 447503 447255 447141 447448
52998 447448 447788 447973 448274 448566 448237 447244 446333 445908 445621 445403 445870 447224 448692 449617 450268 451088 451943 452681
52980 452681 453600 454791 455836 456744 458384 461257 464535 466997 468361 469036 469246 469134 469203 469783 470436 470634 470697
52963 470697 471363 472587 473399 472929 471166 468785 466499 464562 462725 460786 458996 457585 456112 454015 451722
52948 451722 450381 450354 450884 451464 452510 454244 455817 456233 455486 454216 452842 451577 450722 450405 450470 450990 452302
52931 452302 454221 455893 456880 457633 458499 459043 458895 458452 458115 457559 456488 455436 455117 455562 456481 457792 459143
52914D59143N44n12n81L03Q40O17O43J412K001J749J341J380J250K79r51j480
52898D67978j287r90q57p61n36O6J085J753J058o95j815j295o7M11J1l89l49j56
52880D63165n0J19N56J239J821J811J130M62N04J008J195J027J160J694J949J657
52864D80447J387J493J486R24L6q03j544k060k114j989k362l168l449k766j891
52849D63627j645j827j819j513j067l89M49Q87N63k9j16L81R35J123R80Q16R03
52832D62259J232J559J880K639L985N135N216M578M458N405O891Q367R572R685
52818E32861P455K865k257n930p740q471q685q306p223n712m325l533l291l012
52804D74696k278j420j016j080j304j698k319k632k072r75j11M33R82J256Q31
$$ plain form
52914 459143 459687 459175 458594 458897 459737 460354 460997 462409 464410 466159 467500 468880 470130 470409 469458 467978
52898 467978 466691 465701 464844 464083 463547 463613 464698 466451 467509 466814 464999 463704 463637 464048 464059 463670 463321 463165
52880 463165 463115 463234 463790 465029 466850 468661 469791 470253 470757 471765 472960 473987 475147 476841 478790 480447
52864 480447 481834 483327 484813 485737 485773 484970 483426 481366 479252 477263 474901 471733 468284 465518 463627
52849 463627 461982 460155 458336 456823 455756 455367 455816 456703 457266 457237 457121 457502 458437 459560 460540 461356 462259
52832 462259 463491 465050 466930 469569 473554 478689 483905 488483 492941 498346 505237 513604 523176 532861
52818 532861 540316 543181 540924 534994 527254 518783 510098 501792 494569 488857 484532 480999 477708 474696
52804 474696 472418 470998 469982 468902 467598 465900 463581 460949 458877 457902 457791 458224 459206 460462 461293
52789D61293K79N21J235J344R40J101J807J818R49N74J300J905J417N98L66K87
52773D77734k91r24j100j319j989k295j559o53p33j383j356o05j66l88n26M8J116
52756D63611K029K144J196k27r71o64k29n42j191j256o50J1L45L28l9m52k97N33
52738D63679J314J512J443J415J110N14M70J352K072J553M32Q6N10N39k23r30
52722D76848r44n76l02j70k6K38P08J155J014J52o62p38m66o64j285j677j759
52705D70846j984k262j922p91M93J343J764J860J485O03l51q07n71j1L02K27K87
52688D70511R95K003K441K109J693J638J591J246R01P59M36k55p68o70l48k92
52672D83990k96m8K09K35L49P39Q84M81J66M97Q97O13N6J62Q52J287J234J104
$$ plain form
52789 461293 461572 462093 463328 464672 465612 466713 468520 470338 471287 471861 473161 475066 476483 477081 477447 477734
52773 477734 477443 476519 475419 474100 472111 469816 468257 467604 466871 465488 464132 463527 463361 462973 462447 462495 463611
52756 463611 465640 467784 468980 468753 467782 467118 466889 466347 465156 463900 463250 463261 463606 463934 463895 463443 463146 463679
52738 463679 464993 466505 467948 469363 470473 470987 471457 472809 474881 476434 476866 476952 477462 478001 477778 476848
52722 476848 475904 475328 475026 474856 474830 475068 475776 476931 477945 478097 477435 476697 476231 475567 474282 472605 470846
52705 470846 468862 466600 464678 463887 464380 465723 467487 469347 470832 471435 471084 470277 469706 469695 469997 470224 470511
52688 470511 471506 473509 475950 478059 479752 481390 482981 484227 485128 485887 486323 486068 485300 484630 484282 483990
52672 483990 483694 483646 483855 484090 484439 485178 486062 486543 486709 487206 488103 488716 488772 488934 489786 491073 492307 493411
52654D93411R03K92n10q54o54l64r9L80R55J254J396J775K277K506K732L757N686
52637E14843P449P670N675J910k174m907n709n455n171m854m040k938k120j576
52623D98603r50l66j15O7N07P09L3j026j319o51Q7K69K6m39j016j178n08K98K3
52604D93054j246k017j415k20M45N18M93L85l0n43p51o90o78o90l88K94R11J017
52586D88449P72Q15J418J926J481L40k46L50J261J350P17K68L45N75P11P99P02
52569E02033K57k02j92J14J00m25j077j529j682j442q23j47L86R70J624J805J276
52552E01046P62R47J322J000K18oN41J115J217R56M44j10L7J260K422K029N25
52535E15725k0J263K892L262K612K115K097K089J879J621J341R93P40P38R22J256
$$ plain form
52654 493411 494314 494606 494096 493242 492588 492224 492125 492505 493460 494714 496110 497885 500162 502668 505400 509157 514843
52637 514843 522292 529962 535637 537547 535373 530466 524757 519302 514131 509277 505237 502299 500179 498603
52623 498603 497653 497287 497172 497239 497746 498455 498488 497462 496143 495492 495579 495848 495874 495435 494419 493241 492733 493031 493054
52604 493054 491808 489791 488376 488156 488601 489119 489612 489997 489967 489424 488673 487983 487305 486615 486227 486521 487432 488449
52586 488449 489221 490036 491454 493380 494861 495201 494955 495305 496566 497916 498633 498901 499246 499821 500532 501331 502033
52569 502033 502290 502088 501896 502010 502110 501685 500608 499079 497397 495955 495132 494985 495371 496341 497965 499770 501046
52552 501046 501808 502755 504077 505077 505295 505289 505830 506945 508162 509118 509562 509452 509489 510749 513171 515200 515725
52535 515725 515705 516968 519860 523122 525734 527849 529946 532035 533914 535535 536876 537869 538609 539347 540269 541525
52519E41525J819K539L210L827M460M820M544L823L094K122K50k365m668n910
52505E63090o179n600m102k261j335j771k541k496j705r39n44m83q05j409j749
52490E29171j438p49j18M68J133J612J610J339J194J191J169J197J425J753K059
52475E43016K489L162L794M015L889L801M000M437M875M963M347K940R11j483
52461E89156l874n607o186n898n547n456n193m467l653l202l001k751k501k380
52447E29440k159j486m34N25R66P70K09j58J11Q78J559J785J650J267N90j61m02
52430E34950J99J297K280K817K845K389J653R69M61j4m53n27k9Q27J619K019J785
52413E55087J000M38J100L002M820N239M448L808M289N601O739O900N783L464
$$ plain form
52519 541525 543344 545883 549093 552920 557380 562200 566744 570567 573661 575783 576033 573668 569000 563090
52505 563090 556911 551311 547209 544948 543613 541842 539301 536805 535100 534161 533617 533134 532329 530920 529171
52490 529171 527733 526984 526866 527334 528467 530079 531689 533028 534222 535413 536582 537779 539204 540957 543016
52475 543016 545505 548667 552461 556476 560365 564166 568166 572603 577478 582441 586788 589728 590639 589156
52461 589156 585282 579675 573489 567591 562044 556588 551395 546928 543275 540073 537072 534321 531820 529440
52447 529440 527281 525795 525361 525886 526852 527622 527831 527673 527784 528662 530221 532006 533656 534923 535513 535352 534950
52430 534950 535149 536446 538726 541543 544388 546777 548430 549399 549860 549846 549393 548866 548837 549664 551283 553302 555087
52413 555087 556087 556525 557625 560627 565447 570686 575134 578942 583231 588832 595571 602471 608254 611718
52399F11718K49l372o723q981r489q240o092m259l390l068k437j249j32L26M57
52384E55318J034K104K912L083L137L586M208M663N189O002O480N844M236K440
52370F10236P15j224l243m758n611o160o379n743m262k842k249k269k225j814
52356E62172j136l66K55M54K56J1m7n1j40j70j3J83J98R9K73J081K453L726M220
52337E73458M020L860M062M070L533L196L983N583O765O931O456N627M201K165
52323F37910J40j263j963k135j890j363o79K13J356K496L408M234N092N654N735
52308F56945N886O628P508P717P446P480P676O977N006K526K18j916l710m529
52294G11858m227l521l012k587k046j522j031m05J01R1k8O79K143L113K946K442
$$ plain form
52399 611718 611967 608595 601872 592891 583402 575162 569070 564811 561421 558353 555916 554667 554535 554861 555318
52384 555318 556352 558456 561368 564451 567588 571174 575382 580045 585234 591236 597716 603560 607796 610236
52370 610236 610951 609727 606484 601726 596115 589955 583576 577833 573571 570729 568480 566211 563986 562172
52356 562172 561036 560670 560925 561379 561635 561646 561599 561548 561408 561238 561225 561408 561606 561705 561978 563059 565512 569238 573458
52337 573458 577478 581338 585400 589470 593003 596199 600182 605765 612530 619461 625917 631544 635745 637910
52323 637910 638050 636787 634824 632689 630799 629436 628757 628970 630326 632822 636230 640464 645556 651210 656945
52308 656945 662831 669459 676967 684684 692130 699610 707286 714263 719269 721795 722013 720097 716387 711858
52294 711858 707631 704110 701098 698511 696465 694943 693912 693507 693608 693699 693671 694350 696493 699606 702552 704994
52278G04994K482K816K834K600K400K161J901K008K468K571K036J623J950K510
52264G37354K569K301K293K646L288M466O069P135O945O043N286M474K876O81
52250G94426j182k390l365m187m380l861l228k901k616k018j204n02J5N14J090
$$ plain form
52278 704994 707476 710292 713126 715726 718126 720287 722188 724196 726664 729235 731271 732894 734844 737354
52264 737354 739923 742224 744517 747163 750451 754917 760986 768121 775066 781109 786395 790869 793745 794426
52250 794426 793244 790854 787489 783302 778922 775061 771833 768932 766316 764298 763094 762592 762607 763121 764211
$$ [...]
##END NTUPLES=NMR SPECTRUM
##END=
