##TITLE=AC1752_VAR00024_9319539_HdL8ScnUwj
##JCAMPDX= 6.0         $$ Bruker NMR JCAMP-DX V2.0
##DATA TYPE= NMR SPECTRUM
##DATA CLASS= NTUPLES
##ORIGIN= BRUKER
##OWNER= Administrator
$$ 1.72 TOPSPIN		Version 2.1
$$ 2015-08-12 00:07:28.210 -0700  Administrator@X
$$ Compression mode = diff/dup
##.OBSERVE FREQUENCY= 400.02188249412
##.OBSERVE NUCLEUS= ^1H
##.ACQUISITION MODE= SIMULTANEOUS (DQD)
##.ACQUISITION SCHEME= undefined
##.AVERAGES= 8
##.DIGITISER RES= 22
##SPECTROMETER/DATA SYSTEM= spect
##.PULSE SEQUENCE= zg30
##.SOLVENT NAME= COFFEE_meoh
##.SHIFT REFERENCE= INTERNAL, COFFEE_meoh, 1, 14.98509
##AUDIT TRAIL= $$ (NUMBER, WHEN, WHO, WHERE, PROCESS, VERSION, WHAT)
$$ ##TITLE= Audit trail, TOPSPIN		Version 2.1
$$ ##JCAMPDX= 5.01
$$ ##ORIGIN= Bruker BioSpin GmbH
$$ ##OWNER= Administrator
$$ $$ E:\/data/COFFEE/nmr/AC1752_VAR00024_9319539_HdL8ScnUwj/10/pdata/1/auditp.txt
$$ ##AUDIT TRAIL=  $$ (NUMBER, WHEN, WHO, WHERE, PROCESS, VERSION, WHAT)
(   1,<2015-08-12 00:07:21.007 -0700>,<Administrator>,<X>,<go>,<TOPSPIN 2.1>,
      <created by zg
	started at 2015-08-12 00:06:15.148 -0700,
	POWCHK enabled, PULCHK disabled,
       configuration hash MD5:
       21 0F 79 D6 B3 7B B4 F6 88 20 88 DB 03 48 BD 9F
       data hash MD5: 64K
       0A F4 DD F3 F5 F2 83 72 87 A8 09 77 49 00 1D 4E>)
(   2,<2015-08-12 00:07:24.101 -0700>,<Administrator>,<X>,<proc1d>,<TOPSPIN 2.1>,
      <Start of raw data processing
       efp LB = 0 FT_mod = 6 PKNL = 1 PHC0 = 0 PHC1 = 0 SI = 32K 
       data hash MD5: 32K
       A0 B1 CE 28 25 B0 44 9D A5 D1 16 AF D8 04 FB 49>)
(   3,<2015-08-12 00:07:24.398 -0700>,<Administrator>,<X>,<proc1d>,<TOPSPIN 2.1>,
      <pk PHC0 = 87.45667 PHC1 = 0 
       data hash MD5: 32K
       7B C4 57 2C B0 53 91 9B 09 5D B5 84 BD CA 67 83>)
(   4,<2015-08-12 00:07:24.507 -0700>,<Administrator>,<X>,<proc1d>,<TOPSPIN 2.1>,
      <abs ABSG = 1 
       data hash MD5: 32K
       E0 45 4F A6 A9 BE 46 88 06 1B C9 3B A1 9F 41 46>)
(   5,<2015-08-12 00:07:24.585 -0700>,<Administrator>,<X>,<proc1d>,<TOPSPIN 2.1>,
      <abs ABSG = 2 
       data hash MD5: 32K
       B9 6A 0C F1 61 43 77 13 77 70 EB D4 8C 6A ED B7>)
(   6,<2015-08-12 00:07:24.648 -0700>,<Administrator>,<X>,<proc1d>,<TOPSPIN 2.1>,
      <abs ABSG = 3 
       data hash MD5: 32K
       7B A4 CA AA 15 1F 61 7A AD 77 56 75 50 35 BF 7B>)
(   7,<2015-08-12 00:07:24.695 -0700>,<Administrator>,<X>,<proc1d>,<TOPSPIN 2.1>,
      <abs ABSG = 4 
       data hash MD5: 32K
       C8 D9 3D 1A 31 43 6F A4 7F 82 62 45 50 65 32 95>)
(   8,<2015-08-12 00:07:24.757 -0700>,<Administrator>,<X>,<proc1d>,<TOPSPIN 2.1>,
      <abs ABSG = 5 
       data hash MD5: 32K
       50 66 C0 82 B1 40 CC 0E CA 2D 33 9B A6 50 99 C9>)
$$ ##END=
$$ 
$$ $$ hash MD5
$$ $$ 06 BD 21 F0 58 B3 29 34 A4 86 95 2C FF 40 D9 00
##$RELAX= 
##$RELAX= 
##$RELAX= 
##$RELAX= 
##$RELAX= 
##$RELAX= 
##$RELAX= 
$$ Bruker specific parameters
$$ --------------------------
##$DU= <E:\>
##$EXPNO= 10
##$NAME= <AC1752_VAR00024_9319539_HdL8ScnUwj>
$$ [...]
150 150 150 150 150 150 150 150
##$TP07= 0
##$TPNAME0= <>
##$TPNAME1= <>
##$TPNAME2= <>
##$TPNAME3= <>
##$TPNAME4= <>
##$TPNAME5= <>
##$TPNAME6= <>
##$TPNAME7= <>
##$TPOAL= (0..7)
0.5 0.5 0.5 0.5 0.5 0.5 0.5 0.5
##$TPOFFS= (0..7)
0 0 0 0 0 0 0 0
##$TUNHIN= 0
##$TUNHOUT= 0
##$TUNXOUT= 0
##$USERA1= <user>
##$USERA2= <user>
##$USERA3= <user>
##$USERA4= <user>
##$USERA5= <user>
##$V9= 5
##$VALIST= <valist>
##$VCLIST= <CCCCCCCCCCCCCCC>
##$VD= 0
##$VDLIST= <DDDDDDDDDDDDDDD>
##$VPLIST= <PPPPPPPPPPPPPPP>
##$VTLIST= <TTTTTTTTTTTTTTT>
##$WBST= 2048
##$WBSW= 25
##$XGAIN= (0..3)
0 0 0 0
##$XL= 0
##$YL= 0
##$YMAX_a= 525331
##$YMIN_a= -465324
##$ZGOPTNS= <>
##$ZL1= 120
##$ZL2= 120
##$ZL3= 120
##$ZL4= 120
##$ABSF1= 14.98509
##$ABSF2= -5.573092
##$ABSG= 5
##$ABSL= 3
##$ALPHA= 0
##$AQORDER= 0
##$ASSFAC= 0
##$ASSFACI= 0
##$ASSFACX= 0
##$ASSWID= 0
##$AUNMP= <proc_prof1d_extract_pilot.lims>
##$AXLEFT= 0
##$AXNAME= <>
##$AXNUC= <1H>
##$AXRIGHT= 0
##$AXTYPE= 0
##$AXUNIT= <>
##$AZFE= 0.1
##$AZFW= 0.1
##$BCFW= 0
##$BC_mod= 0
##$BYTORDP= 0
##$COROFFS= 0
##$CY= 15
##$DATMOD= 1
##$DC= 0
##$DFILT= <>
##$DTYPP= 0
##$F1P= 0
##$F2P= 0
##$FCOR= 0.5
##$FTSIZE= 32768
##$FT_mod= 6
##$GAMMA= 0
##$GB= 0
##$INTBC= 1
##$INTSCL= 1
##$ISEN= 128
##$LB= 0
##$LEV0= 0
##$LPBIN= 0
##$MAXI= 10000
##$MC2= 0
##$MEAN= 0
##$ME_mod= 0
##$MI= 0
##$NCOEF= 0
##$NC_proc= -8
##$NLEV= 6
##$NOISF1= 0
##$NOISF2= 0
##$NSP= 0
##$NTH_PI= 0
##$NZP= 0
##$OFFSET= 14.98509
##$PC= 1
##$PHC0= 87.45667
##$PHC1= 0
##$PH_mod= 1
##$PKNL= yes
##$PPARMOD= 0
##$PPDIAG= 0
##$PPIPTYP= 0
##$PPMPNUM= 2147483647
##$PPRESOL= 1
##$PSCAL= 4
##$PSIGN= 0
##$PYNMP= <proc.py>
##$REVERSE= no
##$SF= 400.02
##$SI= 32768
##$SIGF1= 0
##$SIGF2= 0
##$SINO= 400
##$SIOLD= 32768
##$SPECTYP= <>
##$SREGLST= <1H.CDCl3>
##$SSB= 0
##$STSI= 32768
##$STSR= 0
##$SW_p= 8223.68421052631
##$SYMM= 0
##$S_DEV= 0
##$TDeff= 65536
##$TDoff= 0
##$TI= <>
##$TILT= no
##$TM1= 0
##$TM2= 0
##$TOPLEV= 0
##$USERP1= <user>
##$USERP2= <user>
##$USERP3= <user>
##$USERP4= <user>
##$USERP5= <user>
##$WDW= 1
##$XDIM= 32768
##$YMAX_p= 441278173
##$YMIN_p= -694401
##$CURPLOT= <Network HP LaserJet P1505>
##$CURPRIN= <$Network HP LaserJet P1505>
##$DFORMAT= <normdp>
##$LAYOUT= <+/1D_H.xwp>
##$LFORMAT= <normlp>
##$PFORMAT= <normpl>
##$SURQMSG= 1
$$ End of Bruker specific parameters
$$ ---------------------------------
##NTUPLES= NMR SPECTRUM
##VAR_NAME=  FREQUENCY,     SPECTRUM/REAL,   SPECTRUM/IMAG
##SYMBOL=    X,             R,               I
##VAR_TYPE=  INDEPENDENT,   DEPENDENT,       DEPENDENT
##VAR_FORM=  AFFN,          ASDF,            ASDF
##VAR_DIM=   32768,         32768,           32768
##UNITS=     HZ,            ARBITRARY UNITS, ARBITRARY UNITS
##FACTOR=    0.250966925370066, 1,           1
##FIRST=     8223.43324360094, 30303,        131293
##LAST=      0,             111032,          -218749
##MIN=       0,             -694401,         0
##MAX=       8223.43324360094, 441278173,    0
$$ Real data points
##PAGE= N=1
##DATA TABLE= (X++(R..R)), XYDATA
$$ [...]
$$ plain form
19585 153890 228403 -106925 -76065 308441 248267 -232275 43737 118429 -156081 21776 -354203
19573 34709 140452 242802 -97304 -123509 -195074 -85153 -79954 -128774 160756 75086 -102948
19561 -4445 -322025 -317234 -164995 -194640 -112723 -52181 -190781 -67554 15415 33928 -43603
19549 -237821 195455 -163139 83527 -22343 -168777 -170784 -18011 -93992 17068 475709 22508
19537 -9579 70046 -347635 18822 115131 -69371 -285268 -217099 21797 -177012 18799 -196693
19525 -43584 -422513 -133493 243030 83242 28246 475953 -119337 -88255 212429 264455
19515 264455 -204769 18955 136279 -146187 -261123 82667 -54311 253018 -25517 60160
19504 -18615 72745 85056 -22145 -192947 -249588 84806 106697 302872 78276 -291623 190183
$$ packed form
19585A53890P4513a06925L0860C08441o0174b32275D3737P4692a56081B1776c54203
19573C4709J05743J02350i7304k6205p1565h5153N199m8820A60756G5086a02948
19561d445l17580M791J52239k9645Q1917e2181j38600f7554A5415J8513d3603
19549b37821A95455a63139H3527b2343j46434k007a8011p5981A7068M58641B2508
19537i579G0046c47635A8822R6309f9371k15897O8169B1797a77012A8799a96693
19525d3584l78929a33493B43030H3242B8246M47707a19337L1082B12429N2026
19515B64455b04769A8955J17324a46187j14936H2667e4311B53018b5517F0160
19504a8615G2745J2311b2145j70802n6641H4806K1891J96175G8276b91623A90183
$$ plain form
19492 -186801 -157016 113159 -244060 152953 57627 -339071 -7116 53449 -190636 54474 132677
19481 132677 -19992 -129240 -190506 -47053 -130403 391258 -62330 -84438 57071 34389 94555
19470 94555 -220749 154829 -184432 -126292 -2267 -271952 86501 163007 33154 -68640 -207539
19459 -207539 -237519 -1274 -109139 -123420 -142158 335194 -275179 297165 78469 156278 -210081
19447 18841 -129552 138632 86052 -267388 -200327 -263778 -113825 -2053 -282383 274840 -26897
19435 190319 -210247 -63743 242604 -405 29630 -138857 4333 -125150 122506 -142439 63761
19423 -93833 -250551 -458684 -63465 28271 -96052 -141189 -261295 -16267 -187543 46987 119165
19412 119165 -158754 118983 -42828 -78443 -172887 -81460 -73626 28905 -110012 -144101 -111241
$$ packed form
19492a86801K9785A13159b44060A52953E7627c39071g116E3449a90636E4474P8203
19481A32677a9992j09248o1266d7053q3350C91258f2330k2108E7071k2682O0166
19470I4555b20749A54829a84432N8140b267k69685H6501P6506C3154f8640j38899
19459b07539k9980a274j07865j4281j8738C35194b75179B97165G8469P7809b10081
19447A8841a29552A38632n2580b67388O7061o3451a13825b053k80330B74840b6897
19435A90319b10247f3743B42604d05B9630a38857D333a25150A22506a42439F3761
19423i3833j56718k08133f3465B8271i6052m5137j20106a6267j71276D6987P2178
19412A19165a58754A18983d2828l5615r4444h1460P834B8905a10012l4089L2860
$$ plain form
19401 -111241 -14656 -112218 -99555 174613 -178325 41193 -273050 -253056 -275211 11711 -82592
19389 86781 -33796 -349019 -262423 -174092 -132793 160804 37673 -93956 -112429 -100254 -59774
19378 -59774 -182820 13505 -74759 43828 177436 -50608 -23844 -139202 -186330 46332 33454
19367 33454 -238979 65190 51261 -276508 191521 82196 -291168 107306 140839 -284574
19356 65860 -354038 -168797 -22757 -37871 -399519 -57832 23537 151333 -157119 21654 252010
19345 252010 33028 -22598 34325 -364477 -143682 -51502 -329774 -123173 -254369 41370
19334 -92356 49918 340375 133813 -79498 15220 -201671 -139412 195364 -133055 -372818
19324 -372818 -57454 -14670 -3560 -139055 -52535 125768 -347998 107364 265469 14754 -251029
$$ packed form
19401a11241a4656r7562J2663A74613a78325D1193b73050J9994k2155A1711h2592
19389H6781c3796l15223Q6596Q8331M1299A60804C7673i3956j8473J2175M0480
19378e9774j23046A3505g4759D3828J33608e0608b3844j15358m7128D6332j2878
19367C3454b38979F5190j3929b76508A91521H2196b91168A07306L3533b84574
19356F5860c54038a68797b2757j5114l61648e7832B3537J27796a57119B1654K30356
19345B52010C3028b2598C4325c64477a43682e1502k78272a23173j31196D1370
19334i2356D9918K90457A33813g9498A5220b01671O2259A95364a33055k39763
19324c72818e7454a4670c560j35495e2535A25768c47998A07364J58105A4754b51029
$$ plain form
19312 -59431 65198 -45042 85784 -296832 48138 170946 -224033 -127813 156196 -169625 -286732
19301 -286732 -88119 -15621 -175392 58446 42152 277014 409636 -177339 312017 52344
19290 -377769 30205 -139260 -129105 80194 -160776 -4738 3515 -14285 186620 115944 248229
19279 248229 -231540 79302 -236430 -136053 173312 247492 -147616 64980 -380958 -122459
19268 -85628 49375 -34661 -156626 8314 -40287 -194731 -14246 -11919 -252048 76504 -28301
19256 -206523 -327179 292610 -14919 -14260 -305699 2668 352014 -42385 59553 -198437 -44363
19244 223784 -130640 7379 23492 -321294 -314676 -221368 -48027 76250 -401600 -95781 125498
19232 -88989 -96711 34221 -2443 21225 -745 -123414 -150757 -411342 219907 377252 -27628 22768
$$ packed form
19312e9431F5198d5042H5784b96832D8138J22808b24033R6220A56196a69625j17107
19301b86732h8119a5621j59771E8446j6294K34862J32622a77339C12017E2344
19290c77769C0205a39260J0155H0194a60776d738C515a4285A86620p0676J32285
19279B48229b31540G9302b36430J00377A73312P4180a47616F4980c80958a22459
19268h5628D9375c4661j21965H314d0287j54444a4246K327k40129G6504b8301
19256b06523j20656B92610a4919O59k91439B668L49346d2385E9553a98437d4363
19244B23784a30640G379J6113c21294O618R3308d8027G6250d01600i5781A25498
19232h8989p722C4221b443B1225g45j22669k7343k60585B19907J57345b7628B2768
$$ plain form
19219 -341846 16668 36672 34750 -130629 100466 91201 15708 -446908 58694 -176527 -95777
19208 -95777 -74596 -69068 -47709 3852 -339028 -165930 89231 -206587 -121620 -176854 -284404
19197 -284404 -118837 423289 -15222 -74221 44855 -191375 -279759 -211958 -301904 179991 -122365
19185 -93681 -91700 -71440 -78490 102990 -315014 229359 210363 -114227 -78067 -165206 -336412
19174 -336412 -102378 188846 -140464 22247 179267 69174 -167611 126565 257544 27523
19163 -327502 -191683 -259778 -57875 145950 95306 -207508 -39140 -103986 153424 -84634 -7583
19151 200242 121872 -175385 53021 25113 105827 95847 251496 90856 444411 -116110 -191861
19140 -191861 -131122 -28355 107405 37579 47730 -277404 -213550 -154275 -196127 -22733 -128523
$$ packed form
19219c41846A6668K0004j922a30629A00466r265A5708d46908E8694a76527Q0750
19208i5777K1181N528K1359C852c39028a65930H9231b06587Q4967n5234j07550
19197b84404a18837D23289a5222n8999D4855a91375q8384O7801q9946A79991a22365
19185i3681J981K0260p050A02990c15014B29359j8996a14227L6160q7139j71206
19174c36412a02378A88846a40464B2247J57020F9174a67611A26565J30979B7523
19163c27502J35819o8095e7875A45950n0644b07508c9140o4846A53424h4634g583
19151B00242p8370a75385E3021B5113Q0714r980J55649I0856L53555a16110p5751
19140a91861O0739b8355A07405C7579J0151b77404O3854N9275m1852b2733j05790
$$ plain form
19129 -128523 265892 136638 -35241 -42345 9168 -233384 123534 -47472 131624 -88577 -270197
19118 -270197 59581 32083 64868 -282867 1029 2330 -37207 -147368 -164391 130451 -142134
19106 103002 -67916 -122891 -131378 -208768 121836 67978 -90461 -287644 100121 268471 -255724
19094 -79216 116760 -58370 -160344 29813 31456 -249543 46199 359718 -25367 -219430 -333227
19083 -333227 -10047 -146423 -309612 -184268 121755 -182852 93529 -109323 222985 111582
19073 111582 -91171 39781 363233 128299 -204089 42935 81053 -68139 -13760 194669 -27633
19061 -322804 203576 -268305 -103451 181825 126469 -154424 -173931 135167 94838 -83036
19050 -97837 -245487 278672 153295 -179779 11225 -12402 254589 392762 -407657 382443
$$ packed form
19129a28523B65892j29254c5241p104I168b33384A23534d7472A31624h8577j81620
19118b70197E9581k7498L2785b82867A029J301c7207j10161j7023A30451a42134
19106A03002f7916n4975q487p7390A21836n3858i0461j97183A00121J68350b55724
19094g9216A16760e8370j01974B9813J643b49543D6199L13519b5367j94063j13797
19083c33227a0047j36376j63189J25344A21755a82852I3529a09323B22985j11403
19073A11582i1171C9781L23452A28299b04089D2935L8118f8139a3760A94669b7633
19061c22804B03576b68305a03451A81825n5356a54424j9507A35167m0329h3036
19050i7837j47650B78672j25377a79779A1225a2402B54589J38173d07657C82443
$$ plain form
19039 116472 -29088 10751 47439 -190551 -98513 -156689 -65064 -76990 71206 169894 -124120
19027 -168878 -122552 381644 -158867 109795 416087 224306 -102310 116487 343577 -122630
19016 -134045 -13303 -290580 24020 -8752 -116565 142386 -246417 -307345 30854 145086 -234357
19004 -458426 -153160 -335182 -89532 -349107 351862 118118 -91010 105320 21618 -106906
18993 187036 -258662 -470242 -282888 -443024 -80792 47667 -31092 -137371 357723 -210866
18982 -211526 -27683 -49521 -315647 103708 23468 58620 -15735 -190392 85682 -370793 -195343
18971 -195343 -201261 160800 174398 -63901 30142 5488 -95930 39658 106475 -223261 -179205
18960 -179205 89504 89815 -377832 68295 -274185 -405689 132692 -265275 -156084 -87066 208431
$$ packed form
19039A16472b9088A0751L6688a90551R2038n8176f5064j1926G1206R8688a24120
19027a68878M6326C81644a58867A09795L06292j91781a02310A16487K27090a22630
19016a34045a3303k77277B4020h752j07813A42386b46417o0928C0854J14232b34357
19004d58426a53160j82022h9532k59575C51862A18118i1010A05320B1618a06906
18993A87036b58662k11580J87354j60136h0792D7667c1092j06279C57723b10866
18982b11526b7683k1838k66126A03708B3468L5152a5735j74657H5682c70793J75450
18971a95343n918A60800J3598f3901C0142E488i5930C9658O6817b23261M4056
18960a79205H9504L11c77832F8295b74185j31504A32692b65275J09191O9018B08431
$$ plain form
18948 -21361 120189 128446 21768 -286930 189329 46312 80863 438627 298113 -217552 -48799
18936 146814 -273615 -310398 -294569 -23491 1364 277974 204761 -117876 -292017 15610 -30788
18924 -206212 51863 149544 -127996 -131892 -186655 -132121 -268527 12607 42279 -63978 -60134
18913 -60134 337798 114304 73655 19427 -191062 233867 -121479 -72707 -438490 32166
18902 136346 316910 92489 173214 131993 -197176 149730 -89086 -3270 342090 -243455 92848
18890 -124189 17388 -145136 -152968 11962 88464 245540 155034 -207465 -212106 -6820 189342
18878 -140947 -109011 109663 -90378 85377 -82253 96466 -245604 -448616 -411380 156529 -7438
18866 114468 -282582 195031 -171091 -382236 -87064 -289084 -3988 -67779 159335 -268374
$$ packed form
18948b1361A20189Q257B1768b86930A89329D6312L4551L57764j40514b17552d8799
18936A46814b73615l6783J5829b3491A364K76610p3213a17876j74141A5610c0788
18924b06212E1863R7681a27996l896n4763N4534j36406A2607K9672f3978L844
18913f0134C37798A14304m0649A9427a91062B33867a21479M8772l65783C2166
18902A36346J80564I2489Q0725m1221a97176A49730h9086c270C42090b43455I2848
18890a24189A7388a45136p832A1962P6502J57076r0506b07465m641f820A89342
18878a40947L1936A09663i0378H5377h2253I6466b45604k03012L7236A56529g438
18866A14468b82582A95031a71091k11145h7064k02020c988o3791A59335b68374
$$ plain form
18855 -144880 66560 170030 28921 220439 -54938 -84584 102127 -134255 166626 -129492
18844 -364498 119890 -289986 27904 415141 45646 -276365 73989 14711 -328475 123354
18833 -86556 -121244 -160991 118382 101903 -415980 -430629 -226856 -186475 -24688 -205627 -138812
18822 -138812 296149 -253097 217350 111541 199119 -102590 210287 76914 -30067 -178083
18812 -178083 176155 165601 433884 -121171 -122133 -884 -172556 107007 155053 -275076 -77246
18800 -526102 -166929 -158056 -15530 99803 -261683 203916 -161093 273172 100741 -290933
18789 -177603 -44707 -224046 -160257 257169 -77672 -16102 -264040 -76373 -81676 -112054 217336
18777 -276247 55600 -188333 318869 67598 18155 55122 -208967 113881 -112892 -144441
$$ packed form
18855a44880F6560J03470B8921J91518e4938k9646A02127a34255A66626a29492
18844c64498A19890b89986B7904L87237D5646b76365G3989A4711c28475A23354
18833h6556l4688l9747A18382j6479d15980j4649K03773M0381b4688j80939O6815
18822a38812B96149b53097B17350j05809Q7578a02590B10287G6914c0067j48016
18812a78083A76155j0554K68283a21171r62h84j71672A07007M8046b75076g7246
18800e26102a66929Q873a5530I9803b61683B03916a61093B73172A00741b90933
18789a77603d4707j79339O3789B57169g7672a6102k47938g6373n303l0378B17336
18777b76247E5600a88333C18869F7598A8155L6967b08967A13881a12892l1549
$$ plain form
18767 -144441 -236782 74616 -148303 -120490 23696 84382 -153083 112221 34885 -125481 249207
18755 -322083 69170 -115923 -227937 7647 -113556 264304 -19838 -1089 -184896 83073 -282245
18743 -56746 212456 -24247 -20364 293804 73768 -267037 85957 13876 10020 -90982 -154541
18732 -154541 -197500 289640 -165763 -172254 63861 8988 -69306 -221682 -151693 104023 -192784
18720 -59496 81514 -25124 -238643 -104312 -203737 -15021 123794 172564 -62807 110069 -345088
18708 60876 -28810 219898 -93142 128347 -93631 -58995 4331 -43364 50184 77695 -14720
18696 -88514 234457 -268209 -44418 476467 -39839 -202115 246061 -211509 -105400 -372088
18686 -372088 -340693 -71797 335829 57530 -34517 -15569 -225225 7763 -69532 -208582 -134175
$$ packed form
18767a44441r2341G4616a48303K7813B3696O0686a53083A12221C4885a25481B49207
18755c22083F9170a15923j12014G647a13556B64304a9838a089j83807H3073b82245
18743e6746B12456b4247L883B93804G3768b67037H5957A3876l856i0982o3559
18732a54541m2959B89640a65763o491F3861H988f9306j52376O9989A04023a92784
18720e9496H1514b5124k13519a04312r9425a5021A23794M8770f2807A10069c45088
18708F0876b8810B19898i3142A28347i3631L4636D331d3364E0184K7511a4720
18696h8514B34457b68209d4418D76467c9839j62276B46061b11509a05400k66688
18686c72088L1395g1797C35829E7530c4517a5569k09656G763f9532j39050P4407
$$ plain form
18675 -134175 -50828 -260816 56691 103518 -114688 -226117 238205 449584 -204454 -222982
18665 -222982 130829 -68629 -136057 -476167 -29771 154784 -113577 -161193 120912 -366019
18654 96641 200925 -11865 -100129 -174734 -152055 -323154 175156 -35984 87156 -111499 -201002
18643 -201002 -342855 -193389 -84509 -99055 224999 187660 -32779 -210548 38269 -35169 -79350
18632 -79350 -209872 217738 -95387 -6520 -78777 33694 32948 364275 9916 -46542 107098 19568
18619 112641 67482 -193623 -77495 -171989 -62853 91709 435951 -121544 140970 -143498
18608 8829 14089 139377 -50960 -19193 -275023 -122509 -82643 264236 -212894 129133 -512732
18596 9919 77131 137498 -151888 -56645 23340 183503 537 25039 -157072 -217636 -302484 119726
$$ packed form
18675a34175e0828k09988E6691M6827a14688j11429B38205K11379b04454j8528
18665b22982A30829f8629o7428l40110b9771A54784a13577m7616A20912c66019
18654I6641J04284a1865q8264p4605K2679j71099A75156c5984H7156a11499q9503
18643b01002j41853J49466h4509j4546B24999l7339c2779j77769C8269c5169m4181
18632g9350j30522B17738i5387f520p2257C3694p46L31327I916d6542A07098A9568
18619A12641m5159a93623g7495r4494f2853I1709L44242a21544A40970a43498
18608H829N260J25288e0960a9193k55830a22509L9866B64236b12894A29133e12732
18596I919O7212O0367a51888e6645B3340J60163E37K4502a57072o0564q4848A19726
$$ plain form
18583 37103 130261 -82065 -74878 -185238 -34042 -67303 -410452 -142568 -162742 -66509 -58973
18572 -58973 -266602 87445 -236785 -36846 -244645 -153996 18720 -105210 91018 -35993 -321364
18561 -321364 205951 51096 243172 -293848 14778 -222573 -145135 -159110 -235747 43763 8723
18549 151548 -114607 181112 52071 -106896 291430 -142907 -368654 -155761 -127053 70393
18538 -294698 -104335 -178329 49850 -220919 -16611 73464 -328652 -181693 -338670 153643
18527 -276161 -193554 -99184 -53242 117805 -142944 -212530 -39742 137588 38783 -186287 -91814
18515 -117130 -7959 110441 44736 -64706 147255 32952 -316890 -173388 -186165 88418 165717
18504 165717 -111827 -244740 131607 14853 -24077 -96472 68247 -16008 122595 -229478
$$ packed form
18583C7103R3158h2065P187j10360c4042l3261l43149a42568k0174f6509P536
18572e8973k07629H7445b36785c6846k07799R0649A8720a05210I1018c5993k85371
18561c21364B05951E1096J92076b93848A4778b22573P7438j3975p6637D3763H723
18549A51548a14607A81112E2071a06896B91430a42907k25747a55761K8708G0393
18538b94698a04335p3994D9850b20919a6611G3464c28652J46959j56977A53643
18527b76161Q2607R4370M5942A17805a42944o9586c9742A37588C8783a86287i1814
18515a17130g959A10441D4736f4706A47255C2952c16890J43502j2777H8418P7299
18504A65717a11827j32913A31607A4853b4077p2395F8247a6008A22595b29478
$$ plain form
18493 -100288 129632 -69066 -111085 -210739 -83711 156847 -158556 -401053 200068 26071
18482 -78425 -5218 -151409 73481 48456 235151 18879 183994 -27220 -40546 -213032 -122593
18471 -122593 -271149 223363 68920 -230289 -53968 198678 112728 -279650 58641 -76919
18460 90569 -93964 -136109 262739 -60224 -116856 137897 -32943 68614 -182173 -37110 248592
18448 24704 177775 67983 -115257 -161610 -198899 -216864 -89775 -19656 -110766 -93678 -227145
18437 -227145 44716 -91443 105351 13653 -123758 10364 -224665 -37863 -218801 18534 54778
18426 54778 -404346 239851 -57638 -198253 183473 -278433 -192543 -236155 54119 25481 16279
18415 16279 -158138 145833 362154 123125 -213577 182937 -217348 -4318 -47438 103110
$$ packed form
18493a00288A29632f9066m2019r9654h3711A56847a58556k42497B00068B6071
18482g8425e218j46191G3481k5025J86695A8879J65115b7220j3326j72486R0439
18471a22593j48556B23363F8920b30289e3968A98678q5950b79650E8641g6919
18460I0569i3964m2145B62739f0224n6632A37897c2943F8614a82173c7110B48592
18448B4704J53071F7983a15257m6353l7289j7965h9775a9656r1110J7088j33467
18437b27145D4716i1443A05351A3653a23758A0364b24665c7863j80938A8534L6244
18426E4778d04346B39851e7638j40615A83473b78433Q5890m3612E4119B5481r202
18415A6279a58138A45833K16321A23125b13577A82937b17348d318m3120A03110
$$ plain form
18404 -16916 235826 130178 285603 -82181 -235530 20295 -7234 143659 98007 -107999 -204191
18393 -204191 158499 -35350 -29454 8132 72015 80639 -178115 116611 -134022 -266686 178522
18381 -213219 363251 82836 170192 -163550 -57625 49597 -137676 91207 -20462 -10630 156805
18369 24002 -157088 -97564 -22910 62931 -66864 170490 156138 -175436 -167568 210875 -241909
18357 -195129 -90482 70425 149498 -356747 -321802 -195037 -235036 12428 -221571 -282881 -321074
18346 -321074 -18221 143301 -394126 -228104 -18903 -318234 -127108 -44748 -245837 -39658
18335 -163289 -110732 -153582 -39428 -239227 87015 -186594 -21346 -231198 -286241 93036 -44208
18323 -150456 -108473 58356 -61850 -85729 -347204 33668 -263344 -11867 361653 -14237 -53486
$$ packed form
18404a6916B35826j05648J55425h2181j53349B0295g234A43659m5652a07999r6192
18393b04191A58499c5350N896H132O3883Q624a78115A16611a34022j32664A78522
18381b13219C63251H2836Q7356a63550e7625D9597a37676I1207b0462R832A56805
18369B4002a57088N9524b2910F2931f6864A70490j4352a75436P868B10875b41909
18357a95129i0482G0425P9073c56747L4945J26765l9999A2428b21571o1310l8193
18346c21074a8221A43301c94126J66022a8903k99331a27108d4748k01089c9658
18335a63289N2557m2850c9428j99799H7015a86594b1346k09852n5043I3036d4208
18323a50456M1983E8356f1850k3879k61475C3668b63344a1867C61653a4237l9249
$$ plain form
18312 -53486 -198237 -2271 -82297 -181989 -199115 8551 -111712 -104306 -160518 -56703 98007 66213
18300 66213 47724 -192502 -253039 -285704 -177228 116783 15917 -142140 -12131 25209 -82602
18288 264422 122722 46184 74170 145952 -191693 131395 238296 -72710 160428 210088
18278 210088 242418 248928 169664 -59140 -203020 -134689 -143675 -142977 -351528 -272605 -249513 63356
18265 -71794 88846 -403346 244985 -34129 220899 98985 -19162 122307 271410 27853 -15421
18253 -20819 -36969 -42009 73097 -120822 59407 7358 -151827 66193 -90577 -266909 -145601
18242 -145601 -6764 44710 -237202 -173948 362595 -29701 -61039 -18657 -325078 179509 -5232
18230 -83865 -151475 -31954 130069 -192036 -153344 -74879 64313 -90173 -78737 -175853 25258
$$ packed form
18312e3486j44751b271q0026r9692j7126H551a11712P406n6212e6703I8007l1794
18300F6213j8489a92502o0537l2665J08476A16783A5917a42140a2131B5209h2602
18288B64422A22722D6184K7986P1782a91693A31395J06901g2710A60428M9660
18278B10088L2330O510p9264e9140j43880O8331q986O98k08551P8923K3092F3356
18265g1794H8846d03346B44985c4129B20899I8985a9162A22307J49103B7853a5421
18253b0819j6150n040G3097a20822E9407G358a51827F6193i0577j76332J21308
18242a45601f764D4710b37202O3254C62595b9701l1338a8657l06421A79509e232
18230h3865o7610c1954A30069a92036L8692g4879F4313i0173J1436r7116B5258
$$ plain form
18218 -342614 151330 -119592 -369396 87231 -26548 -8279 -125564 -330574 -76006 305851
18207 -356454 -152402 51082 -71010 133225 -8039 -40826 188486 85080 283577 -400016 27373
18195 -255024 32740 -23175 -9594 -194147 -20865 103970 54028 197143 253958 -320564 45976
18183 58186 -368417 -13348 -7093 -54415 -24531 -21762 46706 -278563 -38164 108459 64240
18172 64240 -100467 277916 77993 -266558 63222 28744 132767 -152156 -143080 -350140 -8365
18160 -286843 -320263 -107637 -36499 -109710 -226755 141979 -341701 -76252 73347 77485 -141855
18148 -156136 87417 -111224 -137232 -121361 116975 -44759 -65487 -207055 -153103 276972 139794
18137 139794 76624 -97745 25522 47277 21401 91018 25360 -286480 -195782 -8897 -36670
$$ packed form
18218c42614A51330a19592k49804H7231b6548h279j17285k05010g6006C05851
18207c56454a52402E1082g1010A33225h039l2787A88486H5080J98497d00016B7373
18195b55024C2740b3175i594j84553b0865A03970m9942J43115N6815c20564D5976
18183E8186c68417a3348O255m7322b4531K769D6706b78563c8164A08459m4219
18172F4240a00467B77916G7993b66558F3222B8744J04023a52156R076k07060h365
18160b86843l3420a07637c6499p3211j17045A41979c41701g6252G3347M138a41855
18148a56136H7417a11224k6008J5871A16975d4759k0728j41568N3952B76972j37178
18137A39794o3170i7745B5522K1755B1401O9617B5360b86480R0698h897k7773
$$ plain form
18126 -36670 20728 114237 20942 -115812 47458 145912 72940 -189094 280850 74190 57715
18115 57715 -22633 93358 -49082 -106631 -213711 -214082 -337675 76980 35981 44746 -123391 152645
18102 129245 -125482 -67756 -313443 -121654 -30828 208397 -130620 273413 108341 -1759
18091 -86488 328501 -35631 -31362 93315 38235 -230411 -121640 221857 2748 -46492 26640
18079 -12707 9519 115822 178169 81703 -178410 -28546 101169 -20886 183205 -23742 -68348
18068 -68348 -83257 178038 -51455 28207 50490 -159084 -15999 149513 29088 129398 169040
18057 169040 -138037 17833 -321393 -86480 156304 -276328 -221677 -159892 65507 397032
18047 397032 114862 17790 -114183 -79576 -95488 82339 222486 -239023 105260 -200061
$$ packed form
18126c6670B0728R3509B0942a15812D7458R8454G2940a89094B80850G4190j6475
18115E7715b2633I3358d9082n7549j07080l71j23593G6980C5981Q765a23391A52645
18102A29245a25482N7726k45687a21654c0828B08397a30620B73413A08341a759
18091h6488C28501c5631M269I3315C8235b30411J08771B21857B748d6492B6640
18079a2707I519J06303O2347H1703a78410b8546A01169b0886A83205b3742m4606
18068f8348j4909A78038e1455B8207K2283a59084a5999A49513B9088J00310L9642
18057A69040a38037A7833c21393h6480A56304b76328N4651O1785F5507L31525
18047C97032A14862A7790a14183L4607j5912H2339J40147b39023A05260b00061
$$ plain form
18036 -71366 -124103 163996 -277628 -58793 -177463 -26942 -43732 73818 -114149 -6502 -340077
18025 -340077 -259041 51148 -240161 449154 -41651 -83082 -74069 20965 152619 172529 337499
18014 337499 -148632 -148023 -345929 -194381 -206199 -161600 28972 37248 -89481 -191918 -305174
18003 -305174 -50342 -336490 -633334 21298 -127815 -185647 88804 241183 -99952 -132134 116809
17991 -28570 184621 52666 22920 -84801 -206970 194991 23852 148580 -19152 216381 -124600
17979 -76934 -103324 137988 316052 -56337 -91016 -14797 -12007 -19906 114914 -108746 -114279
17968 -114279 114830 -17101 251384 -259222 -117119 -273970 -259856 44551 103973 -140712
17957 -133794 -119503 193063 -141443 -140649 -85761 57275 198543 378802 -152921 132729 -121215
$$ packed form
18036g1366n2737A63996b77628e8793j18670b6942j6790G3818a14149f502l33575
18025c40077Q1036E1148b40161D49154d1651m1431R013B0965J31654J9910J64970
18014C37499a48632O09j97906J51548j1818M4599B8972Q276h9481j02437j13256
18003c05174e0342k86148k96844B1298a27815n7832H8804J52379i9952l2182A16809
17991b8570A84621E2666B2920h4801j22169A94991B3852J24728a9152B16381a24600
17979g6934k6390A37988J78064e6337l4679a4797K790p899A14914a08746n533
17968a14279A14830a7101B51384b59222a17119j56851J4114D4551N9422a40712
17957a33794J4291A93063a41443P94N4888E7275J41268J80259a52921A32729a21215
$$ plain form
17945 -103950 70300 -361517 97248 222003 -61085 -416005 -23894 53524 50036 269535 -205344
17933 -186758 43256 -61520 -46297 -11371 -99939 -151963 -88540 162130 314927 185325 28372
17921 -169374 -302251 -328958 -101979 -243092 38714 -13536 -100033 -133859 88284 29449 -251183
17909 171536 -85294 21953 -96897 19203 -3217 -289534 -87699 -294740 -564527 48309 -147615
17897 184198 236199 -185074 -101693 -225966 -15840 93268 -99247 -223502 96765 52869 -260900
17885 130084 46391 184375 188984 -129924 -247878 -45150 116368 8763 174777 -46235 -20530
17873 284313 173312 176508 108076 -66587 -160006 -183242 -70659 -195662 -63811 278014 125138
17861 251200 104003 -97003 -98591 178355 70480 264533 439339 -185330 -162172 -144813 166948
$$ packed form
17945a03950G0300c61517I7248J24755f1085l54920b3894E3524l488K19499b05344
17933a86758D3256f1520J5223a1371q8568n2024O3423A62130J52797j29602B8372
17921a69374j32877k6707a01979j41113C8714a3536q6497l3826H8284B9449b51183
17909A71536h5294B1953i6897A9203c217k86317h7699k07041k69787D8309a47615
17897A84198N2001a85074Q3381j24273a5840I3268i9247j24255I6765m3896b60900
17885A30084D6391J37984M609a29924j17954d5150A16368H763J66014d6235b0530
17873B84313j11001L196o8432f6587r3419k3236g0659j25003f3811B78014A25138
17861B51200A04003i7003j588A78355G0480J94053J74806a85330K3158J7359A66948
$$ plain form
17849 -53251 -377932 -96091 1956 -47307 -345862 272742 36891 -47146 -160294 4053 20126
17838 20126 84329 11073 -85298 -108765 174769 292335 -234504 82227 38636 90453 -85548
17826 -82455 -110372 -83755 -13178 -531938 -214350 -44935 -312933 -168049 -61423 260755 124314
17814 -3852 -119735 250456 -330666 -367044 -43486 228214 -24904 -66297 -109623 -283286 65159
17802 -21367 -11175 -34863 -102248 -360063 -80971 45055 -103576 -199559 79680 -21966 -147696
17791 -147696 63698 -41603 81027 -94554 252388 -147163 138658 -68127 -12836 105045 -128680
17779 236026 25862 -67352 280585 115167 306331 131441 10527 -186365 -140211 -124304
17769 -124304 45426 284423 -14263 241605 -271122 -218496 -86063 56773 9104 86671 183025
$$ packed form
17849e3251l24681i6091A956d7307k98555B72742C6891d7146j13148D053J6073
17838B0126O4203A1073h5298k3467A74769J17566b34504H2227C8636N1817h5548
17826h2455k7917K6617a3178n18760b14350d4935k67998J44884f1423B60755A24314
17814c852j15883B50456c30666l6378d3486B28214b4904m1393m3326j73663F5159
17802b1367J0192k3688o7385k57815h0971D5055a03576r5983G9680b1966j25730
17791a47696F3698d1603H1027i4554B52388a47163A38658f8127a2836A05045a28680
17779B36026B5862f7352B80585A15167J91164A31441A0527a86365M6154J5907
17769a24304D5426K38997a4263B41605b71122N2626h6063E6773I104P7567R6354
$$ plain form
17758 183025 98802 5535 129610 -53164 -83920 -166734 139872 -331060 -23668 -146986 -4981
17746 -60673 199842 159957 -229121 294647 -114609 -50666 113104 -319797 199982 9769
17735 -150952 -111298 159257 -100569 -51779 140298 35692 -240419 -206530 81021 -21477 99549
17723 -20758 -122365 -294804 135189 209068 156558 -246321 181497 25038 -48638 -25687 -241779
17712 -241779 -9367 -172970 141949 -13379 -131853 -174188 24938 85654 -132581 21048 57510
17701 57510 28781 152922 65082 -12742 -72234 19849 70860 120188 -415769 -210091 360749
17689 248708 269212 -189901 19002 -83624 82793 103284 -111056 81037 -10442 -75971 -1708
17677 -234619 -137675 206563 275752 248018 -64918 -41324 -16942 72453 -103179 89171 -90502
$$ packed form
17758A83025q4223E535J24075e3164l0756q2814A39872c31060b3668j23318d981
17746f0673A99842l9885b29121B94647a14609e0666A13104c19797A99982I769
17735a50952L9654A59257a00569M8790A40298C5692b40419L3889H1021b1477I9549
17723b0758j01607j72439A35189P3879n2510b46321A81497B5038d8638K2951k16092
17712b41779i367j63603A41949a3379j18474m2335B4938O0716a32581B1048L6462
17701E7510k8729J24141F5082a2742n9492A9849N1011M9328d15769K05678C60749
17689B48708K0504a89901A9002h3624H2793K0491a11056H1037a0442o5529a708
17677b34619R6944B06563O9189k7734f4918K3594a6942G2453a03179H9171i0502
$$ plain form
17665 100365 96468 83143 213940 233286 -62627 24747 -128631 117179 166792 -226782 -73630
17653 75027 58753 -51856 -285773 -239151 -89577 -113894 -201196 -312548 126124 -420991 -209641
17641 78952 371655 218241 -103838 -70663 251203 175272 228281 211969 -318444 14553 123349
17630 123349 -60096 -2123 6181 218882 -132630 107083 -32815 72397 -108243 413165 -371265
17618 -36625 -288723 -14456 47319 351149 -32808 -203258 72984 -329983 -32088 44328 112900
17607 112900 -78920 -212909 -248994 -197310 192188 -123693 61973 -279664 -125280 209286
17596 -13945 281488 -139085 203159 -126661 -49532 -60407 17658 -59416 -69768 4838 130186
17585 130186 -73575 -3288 -56645 114415 374470 125027 -171096 67716 -327449 -90524 22752
$$ packed form
17665A00365l897j3325J30797J9346f2627B4747a28631A17179M9613b26782g3630
17653G5027j6274e1856k33917M6622h9577k4317q7302j11352A26124d20991b09641
17641G8952K92703j53414a03838L3175B51203p5931N3009j6312c18444A4553J08796
17630A23349f0096b123F181K12701a32630A07083c2815G2397a08243D13165c71265
17618c6625k52098a4456D7319L03830c2808j70450G2984c29983c2088D4328O8572
17607A12900g8920j33989l6085N1684A92188a23693F1973b79664a25280B09286
17596a3945B81488a39085B03159a26661d9532j0875A7658e9416j0352D838J25348
17585A30186g3575c288n3357A14415K60055A25027a71096F7716c27449i0524B2752
$$ plain form
17573 192835 -170757 21891 337872 -365724 -405375 -149463 -50557 233745 -258625 -109542
17562 181699 43980 -167149 89404 46960 175677 107713 68990 126592 193867 112820 381783
17551 381783 146412 119650 -133301 -116210 91090 -96788 169520 -183161 -38796 295947
17540 186759 47278 -142206 390238 -41579 -100591 140650 90037 -151720 221787 97689
17529 149663 -184771 -14618 -3488 5059 -98267 84286 19669 89427 -150555 -92768 -98809 -70666
17517 -70666 -6964 14347 160062 -47086 -116206 3015 -232986 11620 175096 -19127 264241
17505 -5024 171001 375849 -142185 125866 147065 15219 -125119 -44066 114131 133817 157664
17494 157664 123596 16950 119023 -82579 216062 -139616 23950 310612 87381 235950
$$ packed form
17573A92835a70757B1891L15981c65724l9651a49463e0557B33745b58625a09542
17562A81699D3980a67149H9404m2444J28717o7964l8723N7602O7275q1047K68963
17551C81783A46412k6762a33301J7091I1090i6788A69520a83161c8796B95947
17540A86759D7278a42206C90238d1579n9012A40650n0613a51720B21787I7689
17529A49663a84771a4618c488E059i8267H4286A9669O9758a50555N7787o041K8143
17517g0666f964A4347J45715d7086o9120C015b32986A1620J63476a9127B64241
17505e024A71001K04848a42185A25866K1199A5219a25119d4066A14131J9686K3847
17494A57664l4068A6950J02073h2579B16062a39616B3950K86662H7381J48569
$$ plain form
17484 235950 -200678 3217 -4400 260665 -9171 -80960 -20419 260059 69868 209672 -106787
17472 508638 429652 151204 300430 -122058 219828 9971 52598 -54817 92255 277580 65960
17460 235561 152695 174614 226430 -11885 -32177 -91997 -203379 66731 40381 57514 179665
17449 179665 53982 68420 -41939 547197 307260 7637 291963 276628 304527 217203 23187
17437 233707 191554 54648 116117 245498 -111626 352563 347897 3643 197516 540663 192844
17425 210727 247195 19021 89827 -81637 111120 212930 -203407 88126 119265 302898 154303
17414 154303 -398143 224761 15681 136682 342440 25311 232718 33256 43794 200314
17404 200314 248937 141293 113963 126097 235240 -109945 -119180 39435 88371 -192828 -164
$$ packed form
17484B35950b00678C217d400B60665i171p1789b0419B60059F9868J39804a06787
17472E08638p8986A51204J49226a22058B19828I971M2627e4817I2255J85325F5960
17460B35561q2866K1919N1816a1885k0292n9820j11382F6731k6350J7133J22151
17449A79665E3982J4438d1939E47197k39937G637K84326j5335K7899q7324B3187
17437B33707m2153E4648O1469J29381a11626C52563m666C643J93873L43147A92844
17425B10727L6468A9021P0806h1637A11120J01810b03407H8126L1139J83633j48595
17414A54303c98143B24761A5681J21001K05758B5311K07407C3256J0538J56520
17404B00314M8623j07644k7330J2134J09143a09945r235C9435M8936a92828a64
$$ plain form
17392 60924 224054 -141028 41213 264255 456804 175448 111647 -288153 -108131 303870
17381 90760 -117149 -92339 -92295 -139931 2667 218543 201846 -79381 230258 202905 72357 -109132
17368 2068 163728 77152 67879 250927 -98273 -72835 78208 -43298 207642 -153343 54229
17356 379453 39197 225467 -135185 -92085 265323 87437 -69786 -125384 -101577 -32757 406558
17344 129724 9768 42459 139409 337084 -26703 393309 805 -35645 102511 84856 77134 -47942
17331 163137 -93780 345566 -196095 230817 106077 150424 -14833 211956 -204750 39611
17320 368670 126632 196839 -98508 -80229 212419 55195 200059 -24700 25704 3204 62795
17309 62795 14401 -253202 214733 108072 407471 261088 111257 -16468 -26654 22417
$$ packed form
17392F0924J63130a41028D1213K23042J92549A75448o3801b88153a08131C03870
17381I0760a17149K4810M4m7636B667K15876j6697g9381B30258k7353G2357a09132
17368B068J61660G7152r273J83048i8273K5438G8208d3298B07642a53343E4229
17356C79453C9197J86270a35185M3100B65323H7437f9786n5598K3807c2757D06558
17344A29724I768L2691R6950J97675b6703C93309H05c5645A02511j7655p722d7942
17331A63137i3780C45566a96095B30817A06077M4347a4833B11956b04750C9611
17320C68670A26632P0207i8508J8279B12419E5195J44864b4700B5704C204N9591
17309F2795A4401b53202B14733j06661K99399j46383A11257a6468j0186B2417
$$ plain form
17298 -131930 150263 119584 -168474 17991 -163158 221766 164945 154745 -27990 412299
17287 95359 -2392 53508 45453 109810 313868 -18034 451045 403901 232478 -60488 219881
17275 269538 385863 391080 196278 -45683 54403 -116195 -264106 217078 370121 -259154
17264 54162 -25739 199603 145143 144110 3504 144991 -129861 295595 -123554 232214 332923
17253 332923 17793 -119702 124299 181419 175894 287953 335510 -48228 190457 282597 184696
17242 184696 140081 -100403 102626 -130594 166183 178801 -105242 190932 -20670 346869
17231 -226245 77753 94577 104477 -36040 63471 452246 -12659 -191600 162597 442589 212252
17219 270769 264927 152847 -82319 82342 4909 -7456 237148 -150137 286457 -167889 12391
$$ packed form
17298a31930A50263l0679a68474A7991a63158B21766n6821j0200b7990D12299
17287I5359b392E3508q055O4357K04058a8034D51045m7144j71423f0488B19881
17275B69538J16325N217j94802d5683E4403a16195j47911B17078J53043b59154
17264E4162b5739A99603n4460j033C504J41487a29861B95595a23554B32214J00709
17253C32923A7793a19702A24299N7120n525J12059M7557d8228A90457R2140r7901
17242A84696m4615a00403A02626a30594A66183J2618a05242A90932b0670C46869
17231b26245G7753J6824R900c6040F3471L88775a2659j78941A62597K79992B12252
17219B70769n842j12080h2319H2342D909g456B37148a50137B86457a67889A2391
$$ plain form
17207 180973 172466 397061 172280 -51818 221322 354716 222634 120855 -100788 146730
17196 134073 526422 229056 264559 95449 330734 286148 196476 438242 348943 297016 142911
17184 261267 37412 -25816 52262 106610 446279 151138 314670 -243957 -38669 298905
17173 -111958 372867 45276 83049 236310 176666 356809 105526 118026 70165 348340
17163 348340 302465 13853 307790 226182 270017 291218 294931 252723 205328 207744 262179 400613
17151 400613 43278 249018 232437 357574 273658 205934 202653 133267 56851 379997 -29723
17139 10761 165692 242385 482680 153780 309767 -35850 8856 59962 99907 316351 -151852
17127 334009 480708 542823 310828 22673 -109357 622365 390557 102617 313537 38135
$$ packed form
17207A80973q507K24595A72280e1818B21322J33394j32082j01779a00788A46730
17196A34073L92349B29056L5503I5449K35285m4586q9672K41766q9299n1927A42911
17184B61267C7412b5816E2262N4348L39669A51138J63532b43957c8669B98905
17173a11958C72867D5276L7773J53261n9644J80143A05526J2500m7861K78175
17163C48340m5875A3853K93937q1608M3835K1201L713m2208m7395K416N4435J38434
17151D00613D3278K05740j6581J25137q3916o7724l281o9386E6851L23146b9723
17139A0761J54931P6693K40295A53780J55987c5850H856N1106L9945K16444a51852
17127C34009J46699O2115k31995B2673a09357F22365k31808A02617K10920C8135
$$ plain form
17116 218874 342793 -327145 41146 324031 143522 156300 295682 258827 279151 354855
17106 354855 488341 453085 155615 243508 159107 -92843 257310 -27073 152712 339547
17096 339547 319607 358433 417740 367457 287808 296839 267996 -84987 -49291 324804 526 320240
17084 320240 497528 240083 229693 449841 123145 208580 143594 47500 207799 268381
17074 268381 293626 422820 241734 401702 336558 -40762 363312 416747 375047 -46741 325526
17062 432149 472330 -26943 684716 207040 91820 549072 168798 483919 373708 586254
17052 586254 455205 309042 277081 151893 398739 135708 306602 364483 428062 603336
17042 603336 644421 382017 299877 58196 340104 428955 404516 395133 483961 788106 626511
$$ packed form
17116B18874J23919c27145D1146K82885A43522J2778J39382l6855K0324P5704
17106C54855J33486l5256A55615Q7893q4401i2843B57310b7073A52712J86835
17096C39547j9940L8826N9307n0283p9649R031k8843h4987L5696C24804E26L19714
17084C20240J77288B40083j0390K20148A23145Q5435o4986D7500J60299O0582
17074B68381K5245J29194j81086J59968o5144d0762C63312N3435m1700d6741C25526
17062D32149M0181b6943F84716B07040I1820M57252A68798L15121j10211K12546
17052E86254j31049j46163l1961j25188K46846A35708J70894N7881O3579J75274
17042F03336M1085k62404q2140E8196K81908Q8851k4439r383Q8828L04145j61595
$$ plain form
17031 626511 221617 440462 416267 215358 370346 532899 383560 396028 694308 169025
17020 761388 181318 414226 553803 572894 420278 528502 289274 384879 632513 620746
17010 620746 415814 281899 485463 462085 601488 744801 480646 671459 435909 411434
17000 411434 552331 609571 605478 588149 678250 726382 591360 464510 308198 666094 605202
16989 605202 244147 919754 379609 276683 631216 823627 576072 953708 897524 962056
16979 962056 606661 420533 827090 271829 736032 717396 422163 553249 255120 977135
16969 977135 423124 826197 914340 671141 438859 847574 642350 460950 808922 928754
16959 928754 601419 825683 676786 954046 888525 586173 906706 678486 606769 1107663
$$ packed form
17031F26511B21617K18845k4195k00909J54988J62553j49339J2468K98280A69025
17020G61388A81318K32908J39577J9091j52616J08224k39228R5605K47634j1767
17010F20746k04932j33915K03564k3378J39403J43313k64155J90813k35550k4475
17000D11434J40897N7240m093j7329R0101M8132j35022j26850j56312L57896o0892
16989F05202B44147O75607C79609j02926L54533J92411k47555L77636n6184O4532
16979I62056l55395j86128M06557B71829M64203j8636k95233J31086B55120P22015
16969I77135D23124M03073Q8143k43199k32282M08715k05224j81400L47972J19832
16959I28754l27335K24264j48897K77260o5521l02352L20533k28220p1717N00894
$$ plain form
16949 1107663 981132 702994 753358 633270 1043143 894241 959730 620675 1224517 782681
16939 782681 890219 854309 669083 881937 974212 1092977 1321158 700380 670252 945796
16929 945796 1070937 1032413 750514 1458432 919759 869712 966875 1376533 718258 1132936
16919 1132936 1073478 1175759 1259521 1289450 1264083 992475 930135 1455656 1023519 1197058
16909 1197058 1301198 893161 1346161 1221683 1030679 1193147 1162328 1126628 1242479 1432023
16899 1432023 1369049 1037803 1039729 1343751 1334977 1520480 1498106 1643052 1417778 1578135
16889 1578135 1558575 1406504 1457311 1527049 1696096 1542261 1529025 1769922 1372672 1776529
16879 1776529 1701115 1799696 1580287 1562770 1850241 1762439 1460110 1736547 1883829 1858396
$$ packed form
16949A107663j26531k78138N0364j20088M09873j48902O5489l39055O03842m41836
16939G82681J07538l5910j85226K12854R2275J18765K28181o20778l0128K75544
16929I45796J25141l8524k81899P07918n38673n0047R7163M09658o58275M14678
16919A132936n9458J02281Q3762K9929k5367k71608o2340N25521m32137J73539
16909A197058J04140m08037M53000j24478j91004J62468l0819l5700J15851J89544
16899A432023o2974l31246J926L04022q774J85503k2374J44946k25274J60357
16889A578135j9560j52071N0807O9738J69047j53835j3236K40897l97250M03857
16879A776529p5414R8581k19409j7517K87471q7802l02329K76437J47282k5433
$$ plain form
16869 1858396 1966672 1818559 1811866 2077061 1841245 2026195 2039552 2058398 2042466 1976383
16859 1976383 2222425 2204191 2486407 2459246 2429876 2496519 2413970 2352922 2503683 2576541 2504043
16848 2504043 2466376 2667312 2588973 2760484 2941708 2839738 2926996 3060255 2729633 3070727
16838 3070727 3094036 2891931 3154031 3269236 3031558 2936167 3364822 3615258 3245300 3550683
16828 3550683 3427560 3806200 3756279 3887130 3761708 3988642 4010438 3991809 4160040 4139915
16818 4139915 4343297 4323035 4563478 4325684 4626661 4781692 4948614 5208925 5199290 5281497
16808 5281497 4986605 5626222 5692326 5790545 6035637 6288410 6375250 6524755 6318351 6659381
16798 6659381 6724964 6885067 7362148 7375408 7039351 7362489 7690272 8260128 8152087 8429379
$$ packed form
16869A858396J08276j48113o693K65195k35816J84950J3357J8846j5932o6083
16859A976383K46042j8234K82216k7161k9370O6643q2549o1048J50761P2858p2498
16848B504043l7667K00936p8339J71511J81224j01970Q7258J33259l30622L41094
16838C070727K3309k02105K62100J15205k37678r5391M28655K50436l69958L05383
16828C550683j23123L78640m9921J30851j25422K26934K1796j8629J68231k0125
16818D139915K03382k0262K40443k37794L00977J55031J66922K60311r635Q2207
16808E281497k94892O39617O6104R8219K45092K52773Q6840J49505k06404L41030
16798F659381O5583J60103M77081J3260l36057L23138L27783N69856j08041K77292
$$ plain form
16788 8429379 8867580 9237830 9553273 9524043 10084654 10166566 10549803 10720566 11332986 11358123
16778 11358123 11832412 12464105 12660941 12848595 13266304 13746290 14575031 14837477 15251590
16769 15251590 15637526 16792651 17351287 17747473 18464139 18832489 20110645 20812736 21559025
16760 21559025 22645483 23574652 24323181 25572691 26699297 28107561 29358514 30740665
16752 30740665 32438727 34073186 35517757 37863040 39647331 41694586 43842711 46508417
16744 46508417 49190195 52052358 55389309 58498351 62186784 66185657 70102375 74745172
16736 74745172 79653499 84773431 90293032 96143977 102417006 108652445 115457743 122307317
16728 122307317 129029934 136162626 142936359 149897714 155252031 161550112 165634804 169279752
$$ packed form
16788H429379M38201L70250L15443k9230N60611Q1912L83237J70763O12420K5137
16778A1358123M74289O31693J96836J87654M17709M79986Q28741K62446M14113
16769A5251590L85936J155125N58636L96186P16666L68350J278156P02091P46289
16760B1559025J086458R29169P48529J249510J126606J408264J250953J382151
16752C0740665J698062J634459J444571K345283J784291K047255K148125K665706
16744D6508417K681778K862163L336951L109042L688433L998873L916718M642797
16736G4745172M908327N119932N519601N850945O273029O235439O805298O849574
16728A22307317O722617P132692O773733O961355N354317O298081M084692L644948
$$ plain form
16720 169279752 171744223 172732804 172539137 170764725 168444118 164784644 159743848 153977733
16712 153977733 147870255 141068372 134170566 127555818 120185910 113128793 106664723 100336222
16704 100336222 94323159 88103118 82794661 77702492 72884635 68456177 64204489 60692353
16696 60692353 56805541 54016261 50927010 47655263 45130106 42760067 40420153 38138460
16688 38138460 36269433 34391927 32742171 31175400 29584602 27821798 26962335 25402631
16680 25402631 24178790 23376005 22412652 21787415 20749892 19579303 18788825 18253490 17670809
16671 17670809 16843335 16407426 15649287 14720869 14570779 14220838 13368373 13185253 12327681
16662 12327681 12344634 11876787 11289271 11319883 10534407 10445372 9896973 9499945 9331995 8875140
$$ packed form
16720A69279752K464471R88581j93667j774412k320607l659474n040796n766115
16712A53977733o107478o801883o897806o614748p369908p057117o464070o328501
16704A00336222o013063o220041n308457n092169m817857m428458m251688l512136
16696F0692353l886812k789280l089251l271747k525157k370039k339914k281693
16688C8138460j869027j877506j649756j566771j590798j762804q59463j559704
16680B5402631j223841q02785r63353o25237j037523j170589p90478n35335n82681
16671A7670809q27474m35909p58139r28418j50090l49941q52465j83120q57572
16662A2327681J6953m67847n87516L0612p85476q9035n48399l97028j67950m56855
$$ plain form
16652 8875140 9070440 8814874 8096500 8506482 7891316 7541729 7532154 7283326 7154444 6955238
16642 6955238 7018216 6623463 6377964 6538705 6239098 5754887 5929081 5682983 5609769 5429210
16632 5429210 5073250 5452454 5151751 4947647 5062789 4906569 4838334 4616197 4420783 4440692
16622 4440692 4276052 4276753 4089645 3839537 4124099 3620747 3976136 3873322 3556957 3571492
16612 3571492 3494747 3563464 3322417 3252047 3340921 3239092 3174296 2995863 3124962 2913011
16602 2913011 2861860 2900362 2950416 2829132 2709240 2457152 2745021 2539905 2408389 2600096
16592 2600096 2260822 2181416 2167411 2138982 2538532 2377909 2036118 1955165 2000872 2397755
16582 2397755 1996372 2052346 1917582 1929004 1726877 1992306 2031592 1607813 1655357 1792482
$$ packed form
16652H875140J95300k55566p18374M09982o15166l49587r575k48828j28882j99206
16642F955238O2978l94753k45499J60741k99607m84211J74194k46098p3214j80559
16632E429210l55960L79204l00703k04104J15142j56220o8235k22137j95414J9909
16622D440692j64640P01j87108k50108K84562n03352L55389j02814l16365J4535
16612C571492p6745O8717k41047p0370Q8874j01829o4796j78433J29099k11951
16602B913011n1151L8502N0054j21284j19892k52088K87869k05116j31516J91707
16592B600096l39274p9406j4005k8429L99550j60623l41791q0953M5707L96883
16582B397755m01383N5974j34764J1422k02127K65429L9286m23779M7544J37125
$$ plain form
16572 1792482 1776681 1861535 1500538 1497194 1784213 1915812 1748093 1581016 1643126 1558727
16562 1558727 1563197 1956371 1483111 1501003 1403317 1585050 1501901 1795033 1396642 1403165 1320591
16551 1320591 1267135 1439133 1451069 1269942 1138094 1491731 1077834 1091485 1152638 1112435
16541 1112435 1150014 1320620 1063826 851387 1090174 742586 1373809 1345537 1183974 864294
16531 864294 1062170 537578 933133 1149063 1117496 1284766 864726 902740 811591 1296181
16521 1296181 1038784 900158 848646 1094690 887389 1214554 969732 834717 664992 761418
16511 761418 480611 825011 1024343 944167 898818 769401 560535 813274 703921 855907
16501 855907 477662 634314 767267 951840 736482 808373 792650 399072 673781 820095
$$ packed form
16572A792482j5801Q4854l60997l344K87019J31599j67719j67077O2110q4399
16562A558727M470L93174m73260J7892r7686J81733q3149K93132l98391O523q2574
16551A320591n3456J71998J1936j81127j31848L53637m13897J3651O1153m0203
16541A112435L7579J70606k56794k12439K38787l47588O31223k8272j61563l19680
16531H64294J97876n24592L95555K15930l1567J67270m20040L8014r1149M84590
16521A296181k57397j38626n1512K46044k07301L27165k44822j35015j69725R6426
16511G61418k80807L44400J99332q0176m5349j29417k08866K52739j09353J51986
16501H55907l78245J56652J32953J84573k15358P1891j5723l93578K74709J46314
$$ plain form
16491 820095 717214 552610 913595 546754 825166 737605 737385 704753 341759 714921
16481 714921 928581 448060 233835 630210 473835 925394 682413 738227 602560 496474
16471 496474 411636 62107 134554 422906 770265 535893 234302 536457 683515 973456
16461 973456 583916 134204 369731 544725 617522 312883 576041 107166 372173 369598
16451 369598 339286 390079 565694 626729 681055 593087 627392 713912 429480 672085 571287
16440 571287 343816 330829 611550 338042 267673 293865 263440 317424 745973 365916
16429 302952 655052 279403 451098 417805 264506 153680 491812 437798 374343 402508
16419 402508 320051 684395 503344 293752 407223 283291 -16975 416048 653033 895171
$$ packed form
16491H20095j02881j64604L60985l66841K78412q7561k20l2632C41759L73162
16481G14921K13660D48060k14225L96375j56375M51559k42981N5814j35667j06086
16471D96474q4838F2107P2447K88352L47359k34372B34302L02155J47058K89941
16461I73456l89540A34204K35527J74994P2797l04639K63158A07166K65007k575
16451C69598l0312N0793J75615O1035N4326q7968L4305Q6520k84432K42605j00798
16440E71287k27471j2987K80721k73508p0369K6192l0425N3984M28549C65916
16429C02952L52100B79403J71695l3293j53299j10826L38132n4014o3455K8165
16419D02508q2457L64344j81051k09592J13471j23932a6975D16048K36985K42138
$$ plain form
16409 895171 239213 337472 267912 519299 579 367821 317574 376400 332955 198460 205178
16398 205178 194411 139334 554811 273082 -305597 441140 199690 480129 252689 804953
16388 804953 300800 353494 349546 311748 476966 345333 9337 247262 299020 207496 473443
16377 473443 424050 395920 711029 124839 184281 136997 329319 373442 356938 293523 169295
16366 169295 284195 507503 224026 296071 189216 75843 -35374 114543 347389 394731
16356 394731 64127 141862 358503 329938 329876 141706 477497 229042 217233 232508 284636
16345 284636 134680 -74706 140858 188367 411191 359108 354100 274972 368262 154190 137413
16334 137413 137129 226187 63684 197989 129979 45781 226998 231097 -11193 265525 -3904 468096
$$ packed form
16409H95171B39213R8259o9560K51387E79L67242n0247N8826m3445j34495O718
16398B05178j0767n5077M15477B73082c05597D41140A99690K80439k27440N52264
16388H04953C00800N2694l948l7798J65218j31633I337K37925N1758r1524K65947
16377D73443m9393k8130L15109A24839N9442m7284J92322M4123j6504o3415j24228
16366A69295J14900K23308B24026P2045j06855G5843c5374A14543K32846M7342
16356C94731F4127P7735K16641k8565o2A41706L35791B29042j1809J5275N2128
16345B84636A34680g4706A40858M7509K22824n2083n008p9128R3290A54190j6777
16334A37413k84Q9058F3684J34305o8010D5781J81217M099a1193B65525c904D68096
$$ plain form
16321 48915 140953 22935 378871 37255 198142 -184840 344634 303681 19611 502672 -115483
16309 75977 266055 241220 253953 212211 113408 143802 -91472 65789 698367 -50947 315780
16297 175776 59538 180931 71494 123754 -51490 280244 255488 99342 78657 89534 136577
16286 136577 236064 15598 241961 37976 245743 74528 96951 91247 218247 186636 -85225
16274 180004 -48637 276860 -8276 343957 159961 -80385 -219111 368526 18295 -99273 49474
16262 281101 263589 -115024 -26857 88181 158391 548612 59411 -32735 58132 -56186 50335
16250 97222 314366 -23058 65229 235886 127323 -8936 87089 195314 -5531 339789 277950
16239 277950 203408 384606 180284 -174971 258953 102707 7964 -302255 165724 162540
$$ packed form
16321D8915R2038B2935L55936C7255J60887a84840C44634m0953A9611M83061a15483
16309G5977J90078k4835J2733m1742r8803L0394i1472F5789O32578e0947C15780
16297A75776E9538J21393G1494N2260e1490B80244k4756I9342k0685J0877M7043
16286A36577R9487A5598K26363C7976K07767G4528K2423n704J27000l1611h5225
16274A80004d8637B76860h276C43957A59961h0385j38726C68526A8295i9273D9474
16262B81101j7512a15024b6857H8181P0210L90221E9411c2735E8132e6186E0335
16250I7222K17144b3058F5229J70657j08563h936H7089J08225e531C39789o1839
16239B77950p4542J81198A80284a74971B58953A02707G964c02255A65724l184
$$ plain form
16229 162540 137632 303953 -185230 216109 -86134 225417 197332 -194964 214196 -43607
16218 -22880 128094 373357 102709 -245419 471329 -271529 44068 -183874 337833 33890
16207 234958 53134 -43785 196220 -14847 126114 126244 -6242 98532 -121525 283925 139945
16195 206059 132451 -194156 41435 180207 -2884 66989 -91777 210586 93909 39036 118599
16184 118599 -157072 1605 57143 315869 -310829 -93070 161980 220098 215064 7901 -20929
16172 -31597 -225523 25996 274929 117804 129608 286203 298849 -156750 -136838 88961 -63443
16160 61047 -39382 -278565 -241783 13927 81813 126708 229623 -42359 373232 -75173 266217
16148 -290083 -83853 -172699 224201 -76319 5056 -259335 -263285 -3771 214938 -219459 352128
$$ packed form
16229A62540k4908J66321a85230B16109h6134B25417k8085a94964B14196d3607
16218b2880A28094K45263A02709b45419D71329b71529D4068a83874C37833C3890
16207B34958E3134d3785A96220a4847A26114J30f242I8532a21525B83925A39945
16195B06059p3608a94156D1435J38772b884F6989i1777B10586I3909C9036P9563
16184A18599a57072A605N5538K58726c10829i3070A61980N8118n034G901b0929
16172c1597j93926B5996K48933A17804J1804J56595J2646a56750J9912H8961f3443
16160F1047c9382k39183L6782A3927O7886M4895J02915d2359C73232g5173B66217
16148b90083h3853q8846B24201g6319E056b59335l950c771B14938b19459C52128
$$ plain form
16136 134224 69473 22993 -26504 -85536 174157 233677 -73379 -122148 -16 -118438 -356709
16125 -356709 -16174 126079 -34652 -108979 -205703 110115 42398 -315924 -110229 -129137 155816
16113 94640 -6547 69314 -203643 -36604 36622 151487 468412 31980 -59394 -481773 -437558
16102 -437558 -9154 368965 183790 92109 63253 405012 28581 130597 120909 163940 -270621
16090 -51288 -15405 -89190 52930 10259 -953 -56039 -139598 -120210 -167739 -408425 -275806 -305482
16078 -305482 -39051 100278 359490 162991 78390 249059 -74138 190303 -94685 153212
16067 15793 100237 213249 -193389 -130618 -67435 61451 36346 -1867 36029 -56578 -337521
16056 -337521 10115 -51003 -35498 -326846 68509 62817 -168358 -138476 -171316 -66472 -61543
$$ packed form
16136A34224o4751B2993b6504n9032A74157N9520g3379m8769a6j18422k38271
16125c56709a6174A26079c4652p4327r6724A10115D2398c15924a10229j8908A55816
16113I4640f547F9314b03643c6604C6622J14865L16925C1980e9394m22379M4215
16102d37558i154C68965A83790r1681k8856L41759B8581J02016r688M3031b70621
16090e1288a5405p3785E2930A0259i53n5086q3559J9388m7529k40686J32619k9676
16078c05482c9051A00278K59212A62991G8390J70669g4138A90303i4685A53212
16067A5793Q4444J13012a93389O2771O3183F1451k5105a867C6029e6578k80943
16056c37521A0115e1003J5505k91348F8509n692a68358K9882l2840f6472M929
$$ plain form
16045 -61543 203316 36275 269265 79132 -10588 29829 -312149 -5623 -62966 -61021 -252538
16034 -252538 67272 -114709 21586 107300 81933 219787 193546 278963 -122448 175214 -357393
16022 -156507 331516 -46590 190158 91058 221424 50104 -33723 -209022 -181460 -4714 13516
16010 -6190 -137836 -57919 -22737 -122200 157737 123355 -130323 -150315 44815 83472 334358
15999 334358 178455 -107161 -197789 194804 112322 230489 -469637 -252814 128239 -155305
15988 65835 -231057 43266 21344 -145666 276221 -35896 239740 433887 150978 216754
15978 216754 128411 79616 -36070 -100426 243315 -60719 154279 -3670 335639 -62746 -97010
15967 -97010 290075 -145759 11875 263643 -283082 5541 69605 -222811 -91348 449399 252693
$$ packed form
16045f1543B03316C6275K32990G9132a0588B9829c12149e623n7343J945j91517
16034b52538F7272a14709B1586Q5714k5367J37854k6241Q5417a22448A75214c57393
16022a56507C31516d6590A90158I1058J30366E0104c3723j75299K7562d714A3516
16010f190j31646e7919b2737r9463A57737l4382a30323j9992D4815L8657K50886
15999C34358j55903a07161r0628A94804q2482J18167d69637K16823A28239a55305
15988F5835b31057D3266B1344a45666B76221c5896B39740J94147A50978O5776
15978B16754q8343m8795c6070o4356B43315f0719A54279c670C35639f2746l4264
15967i7010B90075a45759A1875K51768b83082E541O4064b22811i1348D49399j96706
$$ plain form
15956 252693 364889 -153076 -44616 22619 2436 164046 -225980 93790 -15128 -385983 116738
15944 -344829 -91814 -738 -61315 161075 -243960 52949 -63435 -233881 53987 -186066 150633
15932 -257555 78436 -35625 -162169 -68313 -58138 -63619 97628 2612 -71485 279254 58380
15920 214871 -121163 -329592 -65899 -105659 -328561 -310869 -223122 -210554 23107 85105 107367
15909 107367 -140343 -98372 -193685 2556 -167141 202497 18116 227868 44279 142999 162935
15898 162935 22260 -283181 -136575 92582 -2663 -8849 -422957 -159777 8770 -135370 -297758
15887 -297758 -48459 -132640 24054 -29429 87954 -88848 -108083 211550 366755 -178231 -31284
15875 -62822 -29936 -170428 -39862 -53269 -379352 -13406 -269879 -230905 -103 -41589 -209634
$$ packed form
15956B52693J12196a53076d4616B2619B436J61610b25980I3790a5128l70855A16738
15944c44829i1814g38o0577A61075b43960E2949f3435j70446E3987a86066A50633
15932b57555G8436c5625j26544f8313J0175n481I7628B612g1485B79254E8380
15920B14871a21163k08429f5899l9760k22902J7692Q7747J2568B3107O1998K2262
15909A07367a40343M1971r5313B556a67141B02497A8116K09752D4279R8720J9936
15898A62935B2260b83181a36575I2582b663o186m14108a59777H770a35370j62388
15887b97758d8459q4181B4054b9429H7954h8848j9235B11550J55205a78231c1284
15875f2822b9936j40492c9862j3407l26083a3406k56473L8974a03m1486j68045
$$ plain form
15864 -209634 99942 -76481 145502 -183176 -130104 200318 -34632 350273 59193 307888
15854 307888 -77144 262289 319395 -367278 243609 -425937 85140 20152 227026 314772
15844 314772 81377 69672 -250549 82441 -18376 -197633 -120948 77713 -82915 -214733 -260652
15833 -260652 -151990 -251177 -188962 -153690 40375 -68393 245156 -151233 -172640 48598 -199846
15821 -83907 22925 -9660 -135837 252404 -193929 -44399 -1509 -78764 7918 76864 -16787 70633
15808 -154914 -517593 6496 -173941 -340740 -326808 115128 28052 73446 101066 -95173 -184327
15797 -184327 -150765 55299 93601 -227710 -237222 -78015 17101 -100492 -323802 -82052 119432
15785 54863 57080 40128 -151186 188908 -100345 -266455 -129626 -51471 -15499 1092 -89765
$$ packed form
15864b09634I9942g6481A45502a83176N3072B00318c4632C50273E9193K48695
15854C07888g7144B62289N7106c67278B43609d25937H5140B0152K06874Q7746
15844C14772H1377j1705b50549H2441a8376j79257P6685G7713h2915j31818m5919
15833b60652J08662r9187O2215L5272D0375f8393B45156a51233k1407D8598a99846
15821h3907B2925i660j26177B52404a93929d4399a509p7255G918O8946a6787G0633
15808a54914l62679F496a73941j66799J3932A15128B8052M5394K7620i5173q9154
15797a84327L3562E5299L8302b27710r512g8015A7101a00492k23310h2052A19432
15785E4863K217j6952a51186A88908a00345j66110a29626e1471a5499A092h9765
$$ plain form
15773 166903 208550 111459 -76835 -150538 104787 56483 239512 -93498 46797 -11961 -18062
15762 -18062 -136340 -87078 72002 64664 -145446 128963 -422647 -99111 150467 150445 24483
15750 -240412 -289651 215400 84970 -329171 259896 296139 -177393 136481 -123977 226392
15739 -111088 200667 213320 -69662 -299713 136878 90385 -124211 21232 -93017 199941
15728 -137817 -181776 -79540 57688 82008 210250 -31169 -12806 14186 -61115 -126448 -82533
15717 -82533 -20426 102332 118503 48052 -178139 -56301 142920 -172409 31719 -48296 -193965
15706 -193965 -5270 -5879 121177 212016 81628 -266900 -38508 -7033 81601 -232608 -450611
15695 -450611 2340 48419 147428 -135259 106409 25573 227075 -98374 -156187 -112098 -212620
$$ packed form
15773A66903M1647r7091g6835p3703A04787m8304J83029i3498D6797a1961o101
15762a8062j18278M9262G2002p338a45446A28963d22647i9111A50467k2B4483
15750b40412m9239B15400H4970c29171B59896L6243a77393A36481a23977B26392
15739a11088B00667J2653f9662k30051A36878m6493a24211B1232i3017A99941
15728a37817m3959g9540E7688K4320J28242c1169a2806A4186f1115o5333M3915
15717h2533b0426A02332J6171D8052a78139e6301A42920a72409C1719d8296j45669
15706a93965e270o09A21177R0839H1628b66900c8508g033H1601b32608k18003
15695d50611B340M6079R9009a35259A06409B5573K01502i8374n7813M4089j00522
$$ plain form
15684 -212620 -21011 -209123 97222 139847 -247581 -80099 -93903 -19248 -13840 117913 -191950
15672 -40600 -4145 301331 -77634 -423408 -89488 -109468 -201678 112753 251758 -173990 28670
15660 56651 301541 94388 87342 44468 -46752 -63006 -86860 -223205 -11136 148299 -224453
15648 -33271 21221 -205692 275825 348283 -76204 -227707 -78159 -224005 -17235 46611 -6787
15636 328741 -215871 -97029 -208357 -47292 133391 -1185 17287 -222867 -147608 110567 236167
15625 236167 -54145 -113651 226160 -89578 -46830 212509 174558 106651 169061 210233 -121646
15613 -116539 -163153 107571 -160793 -48232 -188713 -31772 -218275 -28375 -328395 -362516
15603 -362516 -111150 -106452 289959 -90453 -321320 -44696 11529 -357841 -29937 121140 219119
$$ packed form
15684b12620b1011j88112I7222M2625b47581h0099j3804a9248N408A17913a91950
15672d0600d145C01331g7634l45774h9488j9980r2210A12753J39005a73990B8670
15660E6651K44890I4388p046m2874d6752j6254k3854j36345a1136A48299b24453
15648c3271B1221b05692B75825P2458g6204j51503g8159j45846a7235D6611f787
15636C28741b15871i7029j11328d7292A33391a185A7287b22867P5259A10567J25600
15625B36167e4145n9506B26160h9578M2748B12509l7951o7907O2410M1172a21646
15613a16539m6614A07571a60793d8232j40481c1772j86503b8375l00020l4121
15603c62516a11150M698B89959i0453k30867d4696A1529c57841b9937A21140R7979
$$ plain form
15592 219119 -14666 -176443 -215282 160433 -19166 99580 96415 70431 139825 -95591 216328
15580 -167708 -225216 20709 183084 68716 107663 -13018 -56010 62860 170918 69032 -11485
15568 -271140 -97539 -8060 -198790 27003 124739 -79248 47412 40279 69233 -2744 -1778 -95657
15556 -95657 71066 48245 209530 5481 110014 -177197 233157 -95358 -78367 -97951 -236965
15545 -236965 63720 92646 92489 83307 -206205 244531 -30025 -78470 -84252 -15170 163198 156788
15533 156788 -47170 -17759 265150 -200547 -33439 -83048 309535 3623 -336250 -218731 -2026
15521 -131678 -71782 -19977 74546 -10511 -114772 189165 -54410 -112018 75146 -170084 227894
15509 -96698 105632 -221367 -150232 -288508 293152 336353 -233079 122223 -284870 135213
$$ packed form
15592B19119a4666j61777l8839A60433a9166I9580l165k5984O9394i5591B16328
15580a67708n7508B0709J62375F8716L8947a3018m2992F2860J08058F9032a1485
15568b71140i7539h060j90730B7003R7736g9248D7412p133K8954b744R66r3879
15556i5657G1066k2821J61285E481J04533a77197B33157i5358J6991j9584j39014
15545b36965F3720K8926j57r182b06205B44531c0025m8445n782a5170A63198o410
15533A56788d7170a7759B65150b00547c3439m9609C09535C623c36250J17519b026
15521a31678N9896a9977G4546a0511j04261A89165e4410n7608G5146a70084B27894
15509i6698A05632b21367P1135j38276B93152M3201b33079A22223b84870A35213
$$ plain form
15498 -364017 336889 29939 53894 -351327 -319007 190440 -298659 -62165 -126496 -54313 -52942
15487 -52942 280430 -53958 2903 -82040 -239451 -19881 10632 213201 216152 -314002 -245263
15476 -245263 -110257 29163 42024 177798 31828 77168 -85040 267832 70492 43462 -67709
15464 -389981 -46674 -94203 -189142 92685 95459 -333348 -90987 2609 103205 -456211 -246988
15453 -246988 -20097 -90213 -208128 24730 -20738 -121012 18533 37297 115477 -129798 341965
15441 168542 -19465 134566 -83264 -71046 239664 -226799 -55411 19202 -97610 161820 363786
15430 363786 -222508 -52305 441082 74790 -168329 -298336 -190960 -46572 -209244 103372
15419 81477 -81728 142597 -117601 21545 153300 104530 9650 111663 -65162 -53423 -186199
$$ packed form
15498c64017C36889B9939K3955c51327L2320A90440b98659f2165o4331e4313J371
15487e2942B80430e3958B903h2040j57411a9881A0632K02569K951c14002O8739
15476b45263a10257B9163J2861J35774C1828M5340h5040B67832G0492k7030f7709
15464c89981d6674m7529r4939I2685K774c33348i0987B609J00596d56211K09223
15453b46988b0097p0116j17915B4730b0738j00274A8533J8764P8180a29798C41965
15441A68542a9465A34566h3264J2218B39664b26799e5411A9202i7610A61820K01966
15430C63786b22508e2305D41082G4790a68329j30007J07376d6572j62672A03372
15419H1477h1728A42597a17601B1545J31755m8770I650J02013f5162J1739j32776
$$ plain form
15408 -186199 -28967 -127878 214801 -371803 -181772 -56145 -172224 286867 77156 -275223
15397 328641 -142077 216927 -322566 99270 -29520 123985 30697 113532 90839 -171183
15386 139357 289932 191974 -79170 -168708 82320 -244252 -32382 -205307 -330031 -205200
15376 -205200 219944 99723 -21924 144475 -126397 -41415 -119054 -122388 129859 -43775 -58360
15365 -58360 260631 127772 -93739 -189126 164697 157795 -78698 236874 165694 -163413 499342
15353 -61152 141899 -21225 -71617 115209 -116865 -137159 -157458 82850 -221132 -97995 -47857
15341 -74267 -91554 912 -116176 -321003 -422474 -119095 -199108 129838 -82864 -282216 6367
15329 324479 -18766 -188428 -74741 77693 -127633 -121039 192976 49884 349134 57676 -194136
$$ packed form
15408a86199b8967r8911B14801c71803a81772e6145j16079B86867G7156b75223
15397C28641a42077B16927c22566I9270b9520A23985C0697Q2835k2693a71183
15386A39357J50575r7958g9170q9538H2320b44252c2382j72925j24724J24831
15376b05200B19944I9723b1924A44475a26397d1415p7639l334A29859d3775j4585
15365e8360B60631A27772i3739r5387A64697o902g8698B36874p1180a63413D99342
15353f1152A41899b1225n0392A15209a16865k0294k0299H2850b21132i7995d7857
15341g4267j7287I12a16176k04827j01471a19095q0013A29838h2864j99352F367
15329C24479a8766j69662g4741G7693a27633O594A92976D9884K99250E7676a94136
$$ plain form
15317 82230 234602 -145362 -192043 42061 -130952 72085 -197299 -221389 143154 -156349
15306 -261868 -322679 -78902 126662 -189345 147152 38369 191551 29711 -207523 278126
15295 30057 39013 252971 -286503 -98718 -131023 -200785 -125462 95434 154769 -8327 38147 -52370
15282 516950 -67408 -92768 206120 -36418 114616 101114 -249009 -81633 -122022 101461 -11118
15270 174441 306911 156655 -52747 44913 32775 -134903 -165707 -168831 -90191 71465 -42272
15258 218873 -307316 -281339 -222895 155116 14188 271494 9973 615233 407139 995248
15248 995248 1187807 647230 1360898 615761 329559 5546 -114185 -243152 -131218 95397
15237 163465 200222 -329958 -148407 -131925 -13930 -63099 132905 -227912 -42044 119833
$$ packed form
15317H2230J52372a45362m6681D2061a30952G2085a97299k4090A43154a56349
15306b61868o0811g8902A26662a89345A47152C8369J53182B9711b07523B78126
15295C0057Q956K13958b86503i8718l2305o9762P5323I5434N9335h327C8147e2370
15282E16950f7408k5360B06120c6418A14616j3502b49009h1633m0389A01461a1118
15270A74441J32470j50256e2747D4913j2138a34903l0804l124P8640G1465d2272
15258B18873c07316K5977N8444A55116A4188K57306I973O05260k08094N88109
15248I95248J92559n40577P13668F15761k86202E546a14185j28967J11934I5397
15237A63465L6757c29958a48407J6482a3930m9169A32905b27912d2044A19833
$$ plain form
15226 122234 270135 37328 -261209 269200 34677 -27607 83734 -93823 -164667 -102548 250086
15214 120556 110673 103594 107178 94646 -15249 -118886 -236634 -84078 -42169 456442 71527
15202 -96945 -191237 -141569 150489 -139637 16930 -32551 292048 -103010 42934 -71808 21228
15190 -194855 -82973 168107 -127636 220274 -108699 240005 -113076 826 -21240 -92293 262055
15178 -194172 -186489 89608 18605 -102373 -19808 175753 206559 152649 -172380 260140 8371
15166 93555 -236989 388335 65915 -111868 -445409 78985 239622 2529 460473 -157117
15155 160717 -93894 431082 17289 -21354 70091 205681 -163372 149744 195234 -25714 -48900
15144 -48900 54783 392269 -91725 -61160 187213 16186 275920 142123 117274 82305 287061
$$ packed form
15226A22234J47901C7328b61209B69200C4677b7607H3734i3823p0844O2119B50086
15214A20556r883p079L584j2532a5249j03637j17748h4078M1909D56442G1527
15202i6945r4292M9668A50489a39637A6930c2551B92048a03010D2934g1808B1228
15190a94855h2973A68107a27636B20274a08699B40005a13076H26b1240p1053B62055
15178a94172P683H9608A8605a02373a9808A75753L0806n3910a72380B60140H371
15166I3555b36989C88335F5915a11868l33541G8985J60637B529M57944a57117
15155A60717i3894D31082A7289b1354G0091J35590a63372A49744M5490b5714k3186
15144d8900E4783L37486i1725L0565A87213A6186K59734j33797k4849l4969K04756
$$ plain form
15133 287061 82721 116446 -52446 -34332 242199 -399570 230114 102339 -80327 151486
15122 159942 103884 -98821 210304 164153 -42868 151792 161724 -92477 7240 328109 -251429
15110 135206 383459 -369141 -52863 42605 275018 79709 -20910 113265 46969 146186 -227369
15098 92268 -39022 228754 356070 373539 83099 23874 -80119 161433 -88221 -9062 20962
15086 -110281 -384294 107150 260305 109054 -122899 -202263 103251 -179068 323736 -154576
15075 -19351 120622 -117362 55953 323360 80383 -121787 352461 12092 81452 185405
15065 185405 19986 124090 446 180933 -120858 218250 225428 -444862 -47366 258868 53546
15053 64026 102538 97092 424371 113775 85579 -281419 -167843 75076 135260 115999 -258787
$$ packed form
15133B87061H2721L3725e2446J8114B42199c99570B30114A02339h0327A51486
15122A59942n6058i8821B10304m6151d2868A51792R932i2477G240L20869b51429
15110A35206K48253c69141e2863D2605K32413G9709b0910A13265D6969R9217b27369
15098I2268c9022B28754J27316J7469H3099B3874h0119A61433h8221i062B0962
15086a10281k74013A07150J53155A09054a22899p9364A03251a79068C23736a54576
15075a9351A20622a17362E5953K67407H0383a21787C52461A2092O9360J03953
15065A85405A9986J04104D46J80487a20858B18250P178d44862d7366B58868E3546
15053F4026L8512n446L27279A13775k8196b81419J13576G5076O0184j9261b58787
$$ plain form
15041 117783 226548 172487 532206 14957 -112773 -43694 -42954 84510 246401 290644 -16583
15029 -22577 161122 190084 4985 94885 -178739 192824 -100332 -49502 -55865 146626 22156
15017 181753 -305688 279172 50564 197762 -1743 -67264 458431 5450 228799 -145241 -100442
15006 -100442 172356 121197 -283192 249262 223411 195501 529607 504317 82483 147444 150136
14995 150136 18501 -169995 310135 152693 331007 -67997 257389 -117777 423050 99280
14984 64282 74612 55624 135839 1873 -90574 185708 -100817 -157300 327088 10064 -100551
14972 60623 289344 157746 346407 154514 109882 130487 330805 61255 -131920 81727
14961 158146 1076 306716 418010 76308 247281 38500 238780 259897 276534 212537 -6308
$$ packed form
15041A17783J08765n4061L59719A4957a12773d3694P40H4510J61891M4243a6583
15029b2577A61122K8962D985Q9900a78739A92824a00332d9502o363A46626B2156
15017A81753c05688B79172E0564J47198a743o5521D58431E450K23349a45241M4799
15006a00442A72356n1159b83192B49262k5851k7910L34106k5290H2483O4961K692
14995A50136A8501a69995C10135A52693J78314f7997B57389a17777D23050I9280
14984F4282J0330j8988Q0215A873i0574A85708a00817n6483C27088A0064a00551
14972F0623K28721j31598J88661A54514m4632K0605K00318F1255a31920H1727
14961A58146A076L05640J11294G6308J70973C8500K00280K1117J6637o3997f308
$$ plain form
14949 188582 24607 322379 197341 266534 367224 285383 113247 352724 315648 56921
14938 294280 373864 84356 134583 166805 287233 260655 255718 102842 -48265 220518 130722
14927 130722 122271 200815 -116286 510264 281995 426592 252193 517922 352254 -152965
14916 -15863 239159 251839 512137 226821 388024 136306 105878 263250 -50530 441737
14905 139325 326764 -148451 345702 -41028 156646 209385 -245256 127912 113620 400951
14895 400951 187656 173981 -197953 228842 148430 55219 246434 336399 188797 309260
14885 309260 415105 291045 186166 291593 5713 216706 327295 -55899 179175 481113
14875 481113 88462 343700 437967 18076 400957 15500 284550 508723 244354 -27229
$$ packed form
14949A88582B4607K97772j25038O9193J00690q1841A13247K39477l7076E6921
14938B94280P9584H4356N0227L2222J20428k6578m937A02842d8265B20518q9796
14927A30722q451P8544a16286E10264k28269J44597j74399K65729j65668a52965
14916a5863B39159J2680K60298B26821J61203A36306l0428J57372e0530D41737
14905A39325J87439a48451C45702d1028A56646N2739b45256A27912j4292K87331
14895D00951A87656j3675a97953B28842q0412E5219J91215Q9965j47602J20463
14885C09260J05845j24060j04879J05427E713K10993J10589e5899A79175L01938
14875D81113H8462K55238R4267A8076L82881A5500K69050K24173B44354b7229
$$ plain form
14864 425951 307333 390923 385621 501741 508328 126184 348568 568014 438499 346130 316950
14853 316950 212752 86791 162934 312662 382859 304667 267581 145108 185831 288428 282513
14842 282513 306493 385024 180996 700128 198042 234168 541989 150805 102661 253389
14832 253389 273819 84722 605729 140850 335562 327775 154784 553086 145232 176604
14822 176604 193065 383186 251541 265015 618108 -3527 306742 77027 108790 592638 264641
14810 277794 145468 140585 229402 212076 67054 358887 274721 487126 427086 382426 286913
14799 286913 122536 -34920 23971 176666 416443 323576 497247 40111 -32782 430577
14788 334311 233171 271326 508131 372379 236227 588035 311380 199860 328618 546999
$$ packed form
14864D25951j18618Q3590n302J16120O587A26184K22384K19446j29515r2369k9180
14853C16950j04198H6791P6143J49728P0197p8192l7086j22473M0723J02597n915
14842B82513K3980P8531A80996N19132A98042L6126L07821A50805m8144J50728
14832B53389K0430H4722N21007A40850J94712p787A54784L98302A45232L1372
14822A76604J6461J90121j31645J3474L53093c527C06742G7027L1763M83848B64641
14810B77794j32326m883Q8817j7326F7054K91833q4166K12405o0040m4660r5513
14799B86913A22536c4920B3971J52695K39777r2867J73671D0111c2782D30577
14788C34311j01140L8155K36805j35752j36152L51808k76655j11520J28758K18381
$$ plain form
14778 546999 476500 331702 147413 722635 646758 476209 544256 100413 250655 369662
14768 369662 414441 315995 540416 247034 388733 810864 421280 344664 405558 476279
14758 476279 327452 330680 523128 620801 555790 391199 631735 675123 689976 231128 381620
14747 381620 331908 323967 247231 380920 405574 498080 339898 753526 660766 354683 755367
14736 755367 737158 389365 578628 651425 629200 458598 539205 615570 483841 654132
14726 654132 527751 673032 732501 470386 576740 536578 680568 428780 378058 587226
14716 587226 617801 533596 289120 677785 415086 1015222 568465 638710 388326 536348
14706 536348 369518 615976 1062950 416817 771084 766199 689857 545679 592921 396648
$$ packed form
14778E46999p0499j44798A47413N75222p5877j70549O8047A00413J50242J19007
14768C69662M4779r8446K24421B47034J41699M22131l89584p6616O0894P0721
14758D76279j48827L228J92448R7673o5011j64591K40536M3388J4853B31128J50492
14747C81620m9712p941p6736J33689K4654R2506j58182M13628r2760l06083M00684
14736G55367j8209l47793J89263P2797k2225j70602Q0607P6365j31729J70291
14726F54132j26381J45281N9469k62115J06354m0162J43990k51788n0722K09168
14716E87226L0575q4205k44476L88665k62699O00136m46757P0245k50384J48022
14706E36348j66830K46458M46974D16817L54267m885p6342j44178M7242j96273
$$ plain form
14696 396648 638980 745071 518187 556757 934803 690191 786439 648404 609162 317253
14686 317253 475537 643686 448715 556665 877278 839092 775615 329386 615374 796859
14676 796859 764152 1143367 617988 755868 416705 792925 924785 299506 665202 612528
14666 612528 550549 550665 948793 681773 582014 625330 721161 542874 902637 648638 662205
14655 662205 744010 504095 674473 936526 802948 839831 614199 1033080 835537 773890
14645 773890 926962 1069083 1111368 857009 892465 915583 785744 905233 718197 1142118
14635 1142118 857965 1011674 798205 893653 928219 1127446 937160 842478 657085 917737
14625 917737 1031425 988538 853712 745638 1261917 1190715 1087213 899711 1108081 894107
$$ packed form
14696C96648K42332J06091k26884L8570L78046k44612R6248j38035l9242k91909
14686C17253J58284J68149j94971J07950L20613l8186o3477C29386K85988J81485
14676G96859l2707L79215n25379J37880l39163L76220J31860B99506L65696n2674
14666F12528o1979J16L98128k67020r9759M3316R5831j78287L59763k53999J3567
14655F62205Q1805k39915J70378K62053j33578L6883k25632M18881j97543o1647
14645G73890J53072J42121M2285k54359L5456K3118j29839J19489j87036M23921
14635A142118k84153J53709k13469R5448L4566J99227j90286r4682j85393K60652
14625I17737J13688m2887j34826j08074N16279p1202j03502j87502K08370k13974
$$ plain form
14615 894107 1338007 1083136 1044753 1434543 1473761 1283334 896200 1479978 1098021 1398455
14605 1398455 930363 1263763 985751 1048943 1440476 1045840 1139863 1272669 1440138 1204105
14595 1204105 1046273 1287123 1556063 936855 1290543 1363015 1275341 1393153 1294484 1293106
14585 1293106 1263162 1509438 1135691 1369338 1480820 1689093 1748027 1850408 1440688 1548556
14575 1548556 1749294 1534419 1330802 1234632 1749076 1697726 1913369 1715255 1911672 1566562
14565 1566562 1673603 1571831 1599822 1721741 1737522 1883569 2109331 2044664 2101262 2364082
14555 2364082 2431551 2570537 2897759 3253545 3391285 4352169 6558103 10810218 19220060
14546 19220060 36305926 38983943 14766322 5368219 2900754 1892972 1878596 1578817
$$ packed form
14615H94107M43900k54871l8383L89790L9218j90427l87134N83778l81957L00434
14605A398455m68092L33400k78012O3192L91533l94636R4023J32806J67469k36033
14595A204105j57832K40850K68940o19208L53688P2472q7674J17812r8669j378
14585A293106k9944K46276l73747K33647J11482K08273N8934J02381m09720J07868
14575A548556K00738k14875k03617r6170N14444n1350K15643j98114J96417l45110
14565A566562J07041j01772K7991J21919J5781J46047K25762o4667N6598K62820
14555B364082O7469J38986L27222L55786J37740R60884K205934M252115Q409842
14546A9220060J7085866K678017A4766322E368219k467465j007782j4376k99779
$$ plain form
14538 1578817 1601982 1317942 1743383 1480159 1621901 1755796 1376609 1466617 1560512 1775251
14528 1775251 1755419 1733784 1912426 1536106 1943959 1916349 1801614 2174691 1915606 1873465
14518 1873465 1627840 1959810 1773016 2100451 2034752 2132776 1515869 1935027 2319071 2142721
14508 2142721 2085557 2247541 1993260 2613125 2000363 2377468 2237531 2190876 2156012 2232306
14498 2232306 2283120 2446518 2119442 2550926 2604403 2583691 2964188 2939965 2514326 2469768
14488 2469768 2590955 2382799 2527661 2931584 2997574 2968391 2735200 2688469 2852576 2796731
14478 2796731 3166800 2849512 3100336 3116767 3241146 3104153 3326868 3057625 3175367 2752271
14468 2752271 3292606 3297301 3327633 3348781 3332334 3526952 3571044 3854353 3761600 3671587 3502052
$$ packed form
14538A578817K3165k84040M25441k63224J41742J33895l79187R0008R3895K14739
14528A775251j9832k1635J78642l76320M07853k7610j14735L73077k59085m2141
14518A873465k45625L31970j86794L27435o5699R8024o16907M19158L84044j76350
14508B142721n7164J61984k54281O19865o12762L77105j39937m6655l4864P6294
14498B232306N0814J63398l27076M31484N3477k0712L80497k4223m25639m4558
14488B469768J21187k08156J44862M03923O5990k9183k33191m6731J64107n5845
14478B796731L70069l17288K50824J6431J24379j36993K22715k69243J17742m23096
14468B752271N40335M695L0332K1148j6447J94618M4092K83309r2753r0013j69535
$$ plain form
14457 3502052 3613087 3805057 3441337 4106586 3687796 3973261 3850215 4003770 4327597
14448 4327597 3839912 4090443 4397024 4613254 4263138 4202323 4519586 4455520 4519977 4849758
14438 4849758 4671476 4721362 5104578 4637405 4914261 4955092 5140646 5089274 4955799 5133779
14428 5133779 5093291 5180363 5037163 5701340 5375671 5779432 5581289 5914975 5629808 5724880
14418 5724880 6332280 6480648 6431404 6522005 6059989 6215873 6392413 6732519 6955221 6697077
14408 6697077 6845499 7070781 7172565 7094459 7187663 7358817 7730937 7840345 7662887 7829577
14398 7829577 8595034 8291120 8236444 8385971 8674237 8900366 8779814 9102759 9261479 9616227
14388 9616227 9454477 9706473 9939752 10197471 10472797 10506803 10347682 10338938 11032070 11394406
$$ packed form
14457C502052J11035J91970l63720O65249m18790K85465j23046J53555L23827
14448D327597m87685K50531L06581K16230l50116o0815L17263o4066O4457L29781
14438D849758j78282M9886L83216m67173K76856M0831J85554n1372j33475J77980
14428E133779m0488Q7072j43200O64177l25669M03761j98143L33686k85167R5072
14418E724880O07400J48368m9244R0601m62016J55884J76540L40106K22702k58144
14408F697077J48422K25282J01784p8106R3204J71154L72120J09408j77458J66690
14398G829577P65457l03914n4676J49527K88266K26129j20552L22945J58720L54748
14388I616227j61750K51996K33279K57719K75326L4006j59121q744O93132L62336
$$ plain form
14378 11394406 11153731 11591592 11844104 12157107 12440621 12558672 12776899 13370336 13282250
14369 13282250 13849145 13604918 14176968 14114993 14906846 15420265 15043321 15625576 16150532
14360 16150532 16549541 16501012 17468810 17532579 18113265 18620580 18963961 19698484 20025906 20489272
14350 20489272 21037316 21727005 22294763 22678557 23172256 23716858 24297596 25221665 25859029
14341 25859029 26638934 27257494 28168094 28638469 29897918 30464354 31443142 32570120 33302971
14332 33302971 34245313 35326291 36591973 37677498 38975870 40202997 41546742 43201685
14324 43201685 44115710 46035937 47660609 49472354 51197726 53008203 55043709 57221329
14316 57221329 59287023 61738673 64336352 66612163 69641346 72869582 75698355 79157346
$$ packed form
14378A1394406k40675M37861K52512L13003K83514J18051K18227N93437q8086
14369A3282250N66895k44227N72050o1975P91853N13419l76944N82255N24956
14360A6150532L99009m8529R67798O3769N80686N07315L43381P34523L27422M63366
14350B0489272N48044O89689N67758L83794M93699N44602N80738R24069O37364
14341B5859029P79905O18560R10600M70375J259449N66436R78788J126978P32851
14332C3302971R42342J080978J265682J085525J298372J227127J343745J654943
14324D3201685R14025J920227J624672J811745J725372J810477K035506K177620
14316E7221329K065694K451650K597679K275811L029183L228236K828773L458991
$$ plain form
14308 79157346 82577616 86312526 90677995 94606868 99550527 104168368 108954652 114763634
14300 114763634 120420342 126974634 133860667 141037083 148699766 157121486 165909850 175232450
14292 175232450 185405327 196009742 207681476 219844423 232647662 246869924 261025023
14285 261025023 276024979 291650711 307691558 324354119 340573819 357279023 373353919
14278 373353919 388896437 403024784 416128111 427142692 435620293 441278173 440948532
14271 440948532 438737152 437883045 436930913 433068199 426006829 415359744 403147470 388783460
14263 388783460 373238785 356973259 340358335 323612880 307140392 290924078 274985989
14256 274985989 260717410 246681792 232914468 219850974 207503516 195874043 185316346
$$ packed form
14308G9157346L420270L734910M365469L928873M943659M617841M786284N808982
14300A14763634N656708O554292O886033P176416P662683Q421720Q788364R322600
14292A75232450J0172877J0604415J1671734J2162947J2803239J4222262J4155099
14285B61025023J4999956J5625732J6040847J6662561J6219700J6705204J6074896
14278C73353919J5542518J4128347J3103327J1014581Q477601N657880l29641
14271D40948532k211380q54107r52132l862714p061370j0647085j2212274j4364010
14263C88783460j5544675j6265526j6614924j6745455j6472488j6216314j5938089
14256B74985989j4268579j4035618j3767324j3063494j2347458j1629473j0557697
$$ plain form
14249 185316346 174993354 165743039 156545818 148554597 140909798 133868654 126813767 120348564
14241 120348564 114557967 108709025 103638256 99242101 94622393 90161202 86363105 82267334
14233 82267334 78970957 75651261 73051514 69628169 66815529 63818493 61498219 59085602
14225 59085602 56878770 54501747 52587856 50621620 49003270 47063460 45886368 44080651
14217 44080651 42244280 40912142 39920566 38761615 37891330 36381801 35366603 34052858
14209 34052858 32995351 32069452 31785498 30724659 29628096 28388657 27998408 27160874 26176582
14200 26176582 26313931 25210639 24147791 23977343 23305116 22436862 22194391 21730853 21404076
14191 21404076 20210993 20043132 19676637 19141854 18372186 18204938 17722812 17337960 17052519
$$ packed form
14249A85316346j0322992r250315r197221p991221p644799p041144p054887o465203
14241A20348564n790597n848942n070769m396155m619708m461191l798097m095771
14233H2267334l296377l319696k599747l423345k812640k997036k320274k412617
14225E9085602k206832k377023j913891j966236j618350j939810j177092j805717
14217D4080651j836371j332138r91576j158951q70285j509529j015198j313745
14209C4052858j057507r25899k83954j060839j096563j239439l90249q37534r84292
14200B6176582J37349j103292j062848j70448o72227q68254k42471m63538l26777
14191B1404076j193083j67861l66495n34783p69668j67248m82126l84852k85441
$$ plain form
14182 17052519 16563819 16566037 16413960 15647614 15277234 15131466 14661676 14431052 14018812 14027200
14172 14027200 13900052 13383960 13583070 12762449 12782632 12406011 12252887 11916431 12011176 11644176
14162 11644176 11268083 10824220 10723402 10716271 10372303 10625971 10142455 10104201 9440553 9770778
14152 9770778 9512003 9213667 8999751 9103949 8961109 8826609 8631681 8335342 8454645
14143 8454645 8177412 8033651 7798568 7628429 7894731 7577701 7680149 7052873 7163899
14134 7163899 7214024 6921737 6794024 6988888 6701367 6815394 6398991 6591959 6221958 6443804
14124 6443804 6274121 6104179 6049202 5893857 5643005 5669157 5892430 6009565 5435726 5374423
14114 5374423 5078893 5510517 5448260 5314890 5226207 5118369 5152387 4678619 4723899 4848292
$$ packed form
14182A7052519m88700K218j52077p66346l70380j45768m69790k30624m12240Q388
14172A4027200j27148n16092J99110q20621K0183l76621j53124l36456R4745l67000
14162A1644176l76093m43863j00818p131l43968K53668m83516l8254o63648L30225
14152I770778k58775k98336k13916J04198j42840j34500j94928k96339J19303
14143H454645k77233j43761k35083j70139K66302l17030J02448o27276J11026
14134G163899N0125k92287j27713J94864k87521J14027m16403J92968l70001K21846
14124F443804j69683j69942n4977j55345k50852K6152K23273J17135n73839o1303
14114E374423k95530M31624o2257j33370q8683j07838L4018m73768M5280J24393
$$ plain form
14104 4848292 4874252 4859419 4738642 4299956 4479758 4590082 4416327 4726303 4443440 4296337
14094 4296337 4140405 3943063 4282044 3879543 3947105 3995943 3989698 3765013 3789614 3915880
14084 3915880 3550748 3505793 3783716 3722754 3531226 3477253 3458471 3321232 3156339 3577830
14074 3577830 3642208 3319528 3265589 3158911 3197257 3320191 3366652 2766293 3214701 3279866
14064 3279866 2874498 2925307 3208826 3250879 2739709 3007836 3464208 3357408 2729511 2915733
14054 2915733 2988163 2573189 2720133 2776612 2716992 2594967 2584980 2701771 2722939 2665089 2333289
14043 2333289 2429347 2327309 2511784 2586451 1979771 2631382 2372816 2569331 2511784 2240363
14033 2240363 2435160 2279330 2569886 2564154 2390913 2248901 2130012 1626112 1868753 2042116
$$ packed form
14104D848292K5960j4833j20777m38686J79802J10324j73755L09976k82863j47103
14094D296337j55932j97342L38981m02501O7562M8838o245k24685K4601J26266
14084C915880l65132m4955K77923o0962j91528n3973j8782j37239j64893M21491
14074C577830O4378l22680n3939j06678L8346J22934M6461o00359M48408O5165
14064C279866m05368N0809K83519M2053n11170K68127M56372j06800o27897J86222
14054B915733P2430m14974J46944N6479n9620j22025r987J16791K1168n7850l31800
14043B333289R6058j02038J84475P4667o06680O51611k58566J96515n7547k71421
14033B240363J94797j55830K90556n732j73241j42012j18889n03900K42641J73363
$$ plain form
14023 2042116 2037315 2063613 1843053 1666897 2186822 2048967 2159649 2037254 1977209 1943170
14013 1943170 1863835 1998946 1851787 2016507 1783430 2057522 1872364 1424547 1550921 1587584
14003 1587584 1705273 1650720 1629345 1395228 1661618 1435314 1582401 1391048 1341924 1337963
13993 1337963 1701316 2101950 1935804 2010365 3429848 6235214 14037016 30306748 39429669
13984 39429669 18703570 8766691 5740419 4135435 3549872 2967670 2642988 2783883
13976 2783883 2387146 2328446 2161995 1730126 1882480 1912896 1983773 2089913 1954465 1836017
13966 1836017 1656794 1886134 1748245 1939316 1898853 1697721 1263812 1692035 1853184 1417448
13956 1417448 1470744 1449593 1470287 1414497 1493036 1746753 1667375 1283896 1486665 1278362
$$ packed form
14023B042116m801K6298k20560j76156N19925j37855J10682j22395o0045l4039
14013A943170p9335J35111j47159J64720k33077K74092j85158m47817J26374L6663
14003A587584J17689n4553k1375k34117K66390k26304J47087j91353m9124l961
13993A337963L63353M00634j66146P4561J419483K805366P801802J6269732R122921
13984C9429669A8703570H766691l026272j604984n85563n82202l24682J40895
13976B783883l96737n8700j66451m31869J52354L0416P0877J06140j35448j18448
13966A836017j79223K29340j37889J91071m0463k01132m33909M28223J61149m35736
13956A417448N3296k1151K0694n5790P8539K53717p9378l83479K02769k08303
$$ plain form
13946 1278362 1199705 1624501 1398347 1396375 1337548 1312165 1350093 1243369 1433576 1463570 1160407
13935 1160407 1120095 1611617 1688863 1585876 1193072 1414608 1240376 1061964 1443909 960630
13925 960630 1258812 1077171 878553 1377780 1159416 1004961 1118252 1101370 1300192 1057360
13915 1057360 1219145 1300591 1367213 1208444 1035152 1016660 1162123 834533 1049310 1058328
13905 1058328 885467 1365590 1054654 1010949 1129858 1087462 1006320 980355 1010977 1216404
13895 1216404 946654 994343 823056 1299974 795800 1198239 696516 1004493 926010 872343
13885 872343 1095820 932766 859214 853831 933483 1047019 784604 664806 1053801 735762
13875 735762 1208704 969308 868739 512744 977183 882849 1021387 839299 677217 796690
$$ packed form
13946A278362p8657M24796k26154j972n8827k5383L7928j06724J90207K9994l03163
13935A160407m0312M91522P7246j02987l92804K21536j74232j78412L81945m83279
13925I60630K98182j81641j98618M99227k18364j54455J13291j6882J98822k42832
13915A057360J61785Q1446O6622j58769j73292j8492J45463l27590K14777R018
13905A058328j72861M80123l10936m3705J18909m2396q1142k5965L0622K05427
13895A216404k69750M7689j71287M76918n04174M02439n01723L07977p8483n3667
13885H72343K23477j63054p3552n383P9652J13536k62415j19798L88995l18039
13875G35762M72942k39396j00569l55995M64439r4334J38538j82088j62082J19473
$$ plain form
13865 796690 746387 960068 887398 1018077 932147 767270 893826 819951 1122626 736626
13855 736626 676417 776175 600782 919974 993793 784751 967622 941570 747503 521621
13845 521621 974450 703426 794400 1055830 380039 697944 938999 677376 735345 629686
13835 629686 937336 657685 870399 723788 861424 692350 572105 743414 581071 462240
13825 462240 562018 740742 709901 728927 832079 688701 837411 719931 683737 1076399
13815 1076399 189576 606671 602627 640537 569523 785638 601563 440032 493778 506138
13805 506138 562287 781868 594764 590052 810153 837790 521394 703857 785725 605380
13795 605380 426637 409089 533337 610962 776123 681506 452893 458027 730071 649428 683666
$$ packed form
13865G96690n0303K13681p2670J30679q5930j64877J26556p3875L02675l86000
13855G36626o0209R9758j75393L19192P3819k09042J82871k6052j94067k25882
13845E21621M52829k71024R0974K61430C80039L17905K41055k61623N7969j05659
13835F29686L07650k79651K12714j46611J37636j69074j20245J71309j62343j18831
13825D62240R9778J78724l0841J9026J03152j43378J48710j17480l6194L92662
13815A076399A89576M17095m044L7910p1014K16115j84075j61531N3746J2360
13805E06138N6149K19581j87104m712K20101K7637l16396J82463Q1868j80345
13795F05380j78743j7548J24248P7625J65161r4617k28613N134K72044q0643L4238
$$ plain form
13784 683666 341519 646800 622692 632368 340223 752292 306130 450488 330925 588072
13774 588072 423593 651807 575430 514142 680162 590888 342206 608498 609445 492015 646390
13763 646390 575824 404496 365292 447286 814966 238990 486220 579049 829839 640465
13753 640465 384302 585313 379664 443873 217745 309375 419664 596458 792952 545913
13743 545913 383848 535784 319196 473406 506857 707319 575278 274642 670482 325208
13732 485431 446753 337321 233140 378088 655632 372785 482327 218299 221606 450309
13722 450309 239524 370823 305242 445637 452947 234665 733408 318413 394379 256558
13712 256558 196167 473299 805571 453772 503875 461477 238717 388254 634849 503225
$$ packed form
13784F83666C41519L05281k4108R676k92145M12069C06130J44358j19563K57147
13774E88072j64479K28214p6377o1288J66020q9274k48682K66292R47j17430J54375
13763F46390p0566j71328l9204Q1994L67680B38990K47230R2829K50790j89374
13753F40465k56163K01011k05649O4209B17745R1630J10289J76794J96494k47039
13743E45913j62065J51936k16588J54210L3451K00462j32041B74642L95840C25208
13732D85431l8678j09432j04181J44948K77544k82847J09542B18299L307K28703
13722D50309k10785J31299o5581J40395P310k18282M98743C18413P5966j37821
13712B56558o0391K77132L32272l51799N0103m2398k22760J49537K46595j31624
$$ plain form
13702 503225 582000 453168 170815 635539 348833 263964 398841 93157 671635 175465
13691 234301 330831 119418 394500 417740 691018 123526 490668 384886 331647 402722
13681 402722 534894 244763 390055 189459 493096 516698 517489 553489 323134 313034 311174
13670 311174 84876 170668 507901 281056 253586 474921 377618 171508 499057 100960
13659 208505 370472 -23613 550779 380798 425304 32868 42682 344313 369628 85690 112912
13648 112912 278472 190947 -8986 336282 136573 242666 679367 231500 147251 163090
13638 163090 336076 -115014 388631 248186 205423 191331 310885 527643 270393 410650
13628 410650 383117 258632 533750 157077 229555 607673 640287 313024 310629 527894
$$ packed form
13702E03225P8775j28832A70815M64724k86706q4869J34877I3157N78478A75465
13691B34301R6530A19418K75082K3240K73278A23526L67142j05782n3239P1075
13681D02722J32172B44763J45292A89459L03637K3602P91L6000k30355j0100j860
13670C11174H4876Q5792L37233k26845k7470K21335r7303A71508L27549A00960
13659B08505J61967b3613E50779j69981M4506C2868R814L01631K5315H5690K7222
13648A12912J65560q7525h986C36282A36573J06093M36701B31500q4249J5839
13638A63090J72986a15014C88631j40445m2763j4092J19554K16758k57250J40257
13628D10650k7533j24485K75118A57077P2478L78118L2614C13024k395K17265
$$ plain form
13618 527894 377766 505349 373871 338457 606108 423233 341532 235027 599711 348062
13608 348062 333817 193324 260973 199943 53037 551200 193703 407157 193510 542489
13598 542489 272617 480623 145280 -28241 145970 322994 474752 361435 333720 180665
13588 180665 308414 69025 433797 431352 569658 465631 643965 396476 -296597 227604
13577 457786 419380 395910 315378 442779 338060 311974 260557 280968 242536 484850 -80767
13565 120661 108384 344698 -10282 165282 493705 190184 53003 233091 149401 74937
13555 74937 317565 80789 389236 427143 -9600 262361 497010 381771 161197 61084 -30190
13543 189654 -54754 108265 134024 -88134 407745 120732 -913 411344 -47776 387568 72181
$$ packed form
13618E27894j50128J27583j31478l5414K67651j82875q1701j06505L64684k51649
13608C48062j4245j40493O7649o1030E3037M98163A93703K13454A93510L48979
13598E42489k69872K08006A45280b8241A45970J77024J51758j13317k7715j53055
13588A80665J27749F9025L64772k445J38306j04027J78334k47489b96597B27604
13577D57786l8406k3470q0532J27401j04719k6086n1417K0411l8432K42314h0767
13565A20661j2277K36314a0282A65282L28423A90184E3003J80088q3690p4464
13555G4937K42628H0789L08447L7907i600B62361K34649j15239A61197F1084c0190
13543A89654e4754A08265K5759h8134D07745A20732i13D11344d7776C87568G2181
$$ plain form
13531 16705 253885 93384 110029 119183 77538 188775 412469 232995 429100 118991 497178
13520 497178 284743 253790 361130 60375 420371 141038 295509 122311 200724 389924
13510 389924 108750 476268 72814 226270 185904 230266 104327 154792 34593 120987 352155
13499 352155 415942 447614 89172 16177 548378 237230 380229 83323 259343 343515 181502
13488 181502 118316 123620 148698 203626 339281 213756 331237 163855 28655 509720 465085
13477 465085 209328 -17319 -60203 102313 132589 304326 212356 -106418 368732 347250
13467 347250 287608 389336 505535 307134 77626 171484 120985 213323 195133 111903 213582
13456 213582 39983 363854 35081 455698 388612 -5929 259032 -36173 281275 198883 -1951
$$ packed form
13531A6705K37180I3384J6645R154m1645J11237K23694j79474J96105A18991L78187
13520D97178k12435l0953J07340F0375L59996A41038J54471A22311P8413J89200
13510C89924A08750L67518G2814J53456m0366M4362A04327N0465C4593Q6394K31168
13499C52155O3787L1672H9172A6177N32201B37230J42999H3323J76020Q4172j62013
13488A81502o3186N304K5078N4928J35655j25525J17481A63855B8655M81065m4635
13477D65085B09328a7319m2884A02313L0276J71737r1970a06418C68732k1482
13467C47250n9642J01728J16199j98401G7626R3858n0499R2338j8190q3230J01679
13456B13582C9983L23871C5081M20617o7086e929B59032c6173B81275q2392a951
$$ plain form
13444 67766 77022 -61818 175723 67338 83024 131479 8260 277741 48505 -110976 370129
13432 10769 122037 225245 288543 -10311 232873 -93265 73154 112690 120401 269958 147726
13421 147726 111801 -194942 95322 31271 383178 455983 239661 95054 262938 -12412 292138
13409 112952 -218773 101113 362170 170142 113742 254166 59051 -23984 -7698 216627
13398 -43339 272780 234149 86467 113817 282591 335572 272071 -72585 -58598 -24283 168080
13386 203241 229622 163353 -67217 72181 -18014 105144 -93409 -25356 250871 210975 406776
13375 406776 251299 192254 418377 238309 261759 -213777 253751 -72499 254381 152309
13365 152309 501999 470818 56248 27509 88316 225256 232271 38780 177818 -63207 253091
$$ packed form
13444F7766R256f1818A75723F7338J5686M8455H260K69481D8505a10976C70129
13432A0769J11268J03208O3298a0311B32873i3265G3154L9536P711J49557j22232
13421A47726l5925a94942I5322C1271L51907P2805k16322I5054J67884a2412B92138
13409A12952b18773A01113K61057A70142n6400J40424E9051b3984g698B16627
13398d3339B72780l8631H6467K7350J68774N2981o3501g2585J3987b4283A68080
13386B03241K6381o6269f7217G2181a8014A05144i3409b5356B50871l9896J95801
13375D06776j55477n9045K26123j80068K3450b13777B53751g2499B54381j02072
13365A52309L49690l1181E6248B7509O0807J36940P015C8780J39038f3207B53091
$$ plain form
13353 283404 227741 63755 5854 -43962 -130331 338677 341914 274392 246169 363074 213539
13342 213539 268403 523858 340644 183636 576326 95896 13927 237158 -150842 524923
13331 181737 213508 -33909 318743 258122 362925 40615 233352 286844 315235 -30833 177245
13319 94620 163291 -41355 -159482 284992 369810 160999 68509 253991 41639 94264 100462
13308 100462 -265048 -12834 -76025 83130 175406 117251 -172291 307509 -37585 236771 -166334
13296 -382229 481935 122898 21308 235214 146988 208967 189124 -115910 -103563 31843 311962
13285 311962 -156779 96513 -20856 128114 5098 136265 -54464 191419 271462 82399 -82921
13273 -75959 178623 -169866 71204 207026 -75242 343416 -75070 -116944 172592 177428 -183847
$$ packed form
13353B83404n5663F3755E854d3962q6369C38677L237o7522k8223J16905j49535
13342B13539N4864K55455j83214j57008L92690I5896A3927K23231a50842E24923
13331A81737L1771c3909C18743o0621J04803D0615J92737N3492K8391c0833A77245
13319I4620O8671d1355j18127B84992Q4818A60999F8509J85482D1639N2625O198
13308A00462b65048a2834o3191H3130R2276n8155a72291C07509c7585B36771a66334
13296c82229D81935A22898B1308K13906q8226O1979j9843a15910J2347C1843K80119
13285C11962a56779I6513b0856A28114E098J31167e4464A91419Q0043H2399h2921
13273g5959A78623a69866G1204J35822g5242C43416g5070m1874A72592M836a83847
$$ plain form
13261 44888 -101143 186376 157580 175474 -180534 343518 111786 -316023 -137498 290551
13250 -31439 27730 -17385 -24412 -8719 -482766 359926 140863 156965 -67513 96355 439083
13239 439083 131666 -89421 355775 -94306 -9757 98570 -247192 -241543 129093 223537 -31009
13227 -192635 42520 360134 280252 163083 6777 332321 214139 9171 -135952 3698 355473
13216 355473 -340680 76895 227443 106241 -5842 202903 169549 -20079 6504 71427 39337
13205 39337 -29337 -145205 27196 -6653 -82710 82089 63406 443576 -60690 -293173 179232
13193 33760 -52081 -155312 129330 219105 -223145 90602 -17025 157299 61070 270511 -121462
13181 324625 205367 134490 -158879 -162380 239336 193794 -85891 118446 108792 178831 211435
$$ packed form
13261D4888a01143A86376k8796J7894a80534C43518A11786c16023a37498B90551
13250c1439B7730a7385p027h719m74047C59926A40863J6102f7513I6355L42728
13239D39083A31666h9421C55775i4306i757I8570b47192N649A29093R4444c1009
13227a92635D2520L17614p9882j17169F777L25544j18182I171a35952C698L51775
13216C55473c40680G6895J50548A06241e842B02903l3354b0079F504O4923l2090
13205C9337b9337j15868B7196f653p6057H2089j8683L80170f0690k32483A79232
13193C3760e2081j03231A29330Q9775b23145I0602a7025A57299F1070K09441a21462
13181C24625j19258p0877a58879l501B39336m5542h5891A18446r654P0039L2604
$$ plain form
13170 211435 -112344 -108109 -79530 -157103 187679 148735 66391 -77020 84926 -16794 -17180 -211174
13158 -211174 -4594 235651 34369 27228 186112 191843 40589 112359 -76069 143598 199852
13147 199852 135532 65097 132332 -182992 42198 62892 -111227 74652 -54627 -178903 95172
13135 175238 76808 21115 66918 -162276 -67651 -26935 -2578 204082 -183473 -59558 -79544
13124 -79544 -50714 -202957 147835 373087 429338 53381 26198 -100678 -172801 -69272 84540
13112 -236044 171837 87765 77770 212861 105391 -38257 12856 -175414 -59379 173381 130948
13101 130948 -65076 105753 87684 -77522 159973 2317 -15561 -20998 -185797 -184112 -66749
13089 20585 -69605 -121621 121424 195655 73187 2165 264869 247513 -7246 -2340 144539 232250
$$ packed form
13170B11435a12344M235K8579p7573A87679l8944F6391g7020H4926a6794l86j93994
13158b11174d594B35651C4369p141J58884N731D0589P1770g6069A43598N6254
13147A99852o4320F5097O7235a82992D2198K0694a11227G4652e4627j24276I5172
13135A75238G6808B1115M5803a62276f7651b6935b578B04082a83473e9558j9986
13124g9544K8830j52243A47835K25252N6251E3381B6198a00678p2123f9272H4540
13112b36044A71837q4072r995J35091A05391c8257A2856a75414e9379A73381m2433
13101A30948f5076A05753j8069g7522A59973B317a5561n437j64799J685f6749
13089B0585f9605n2016A21424P4231G3187B165K62704j7356g246b340A44539Q7711
$$ plain form
13077 232250 165587 288103 230383 359278 -2598 -39652 4631 181463 166837 -109093 138849
13065 125172 85490 108608 122770 -63554 -41716 206080 32511 349846 415173 -226022 164910
13053 328346 80464 136024 -2719 192458 23837 -338239 11924 194603 -83558 139673 361752
13042 361752 190762 236478 -63456 240000 -83251 -272815 152167 -376081 135751 -131087
13031 -64140 -97165 -91238 154837 174154 10646 22961 187088 -250563 289838 -92132 -3238
13019 185223 222764 522988 38890 -99955 145333 76058 226589 30092 155517 -150411
13008 382145 93292 -142199 38499 46034 -359789 -98326 180925 124103 315586 287182 -67904
12996 9872 17633 -124731 -103501 95949 -40368 88937 -177227 -96048 -82432 126054 51169
$$ packed form
13077B32250o6663J22516n7720J28895b598l7054D631J76832j4626a09093A38849
13065A25172l9682K3118J4162f3554K1838B06080C2511L17335O5327b26022A64910
13053C28346H0464N5560b719A92458B3837c38239A1924J82679h3558A39673K22079
13042C61752j70990M5716f3456B40000h3251j89564A52167c76081A35751a31087
13031f4140l3025N927A54837J9317A0646J2315J64127b50563B89838i2132c238
13019A85223L7541L00224C8890i9955A45333o9275J50531C0092J25425a50411
13008C82145I3292a42199C8499P535c59789i8326A80925n6822J91483k8404f7904
12996I872P761a24731K1230I5949d0368H8937a77227Q1179J3616A26054E1169
$$ plain form
12984 75699 75351 64517 98191 139257 119573 -43681 107819 -10420 -212244 59825 60861 -222388
12971 353240 -62361 95419 -280087 -6659 247189 -187435 199728 -5557 -150744 57540 344890
12960 344890 93414 65274 208574 111093 139662 13584 142203 152659 -96938 -209134 139612
12948 151290 185070 -58324 -65298 -21522 344008 81531 64063 415590 -270457 201493 -27440
12936 132844 -234497 162530 198718 -351136 -9797 -100908 -159816 67605 158591 106547 -134852
12924 -18446 -12762 44265 -53493 85358 -32526 -108378 -120645 108546 77135 299660 45546
12912 97735 222255 -92314 65341 13523 -47341 -17428 -46878 -78857 182990 -33317 142917
12900 189296 86779 -279776 1728 48215 215545 -177267 -133348 313674 -67929 -87699 -175786
$$ packed form
12984G5699l48j0834L3674M1066j9684d3681A07819a0420k01824E9825J036b22388
12971C53240f2361I5419b80087f659B47189a87435A99728e557j45187E7540K87350
12960C44890I3414k8140J43300r7481K8569A3584J28619J0456i6938j12196A39612
12948A51290L3780e8324o974b1522C44008H1531j7468L51527b70457B01493b7440
12936A32844b34497A62530L6188c51136i797r1111n8908F7605R0986n2044a34852
12924a8446N684D4265e3493H5358c2526p5852j2267A08546l1411K22525D5546
12912I7735J24520i2314F5341A3523d7341a7428k9450l1979A82990c3317A42917
12900A89296H6779b79776A728M6487J67330a77267M3919C13674f7929j9770q8087
$$ plain form
12889 -175786 6693 291055 -115235 -24365 19179 102211 284 -170357 79417 209488 31798
12877 214589 -313095 21772 -94235 -133412 149630 -163819 90121 -27877 -246708 112264
12866 -79993 -189771 40918 -227820 -151710 73885 238928 55509 -13505 -116294 232497 59205
12854 294040 -182973 265548 -286150 87943 272704 41222 139193 281554 -141955 193000
12843 -179643 -183013 124924 9635 -321450 163118 -42822 99340 173357 -77769 -47329 1095
12831 165271 -20538 -29363 -25691 96128 -135600 -5857 -129278 -206042 9695 -265014 368997
12819 58604 -265 -193003 -17059 145503 146274 233800 12505 -250269 -294814 -249064 -62055 319351
12806 130998 -41174 191118 133874 95856 -18304 120868 311195 144627 -79790 90582 -26298
$$ packed form
12889a75786F693K84362a15235b4365A9179Q3032B84a70357G9417J30071C1798
12877B14589c13095B1772i4235l9177A49630a63819I0121b7877k18831A12264
12866g9993j09778D0918b27820P6110G3885J65043E5509a3505j02789B32497E9205
12854B94040a82973B65548b86150H7943J84761D1222R7971J42361a41955A93000
12843a79643l370A24924I635c21450A63118d2822I9340P4017g7769L0440A095
12831A65271b0538q825L672I6128a35600e857j23421p6764I695b65014C68997
12819E8604b65j92738a7059A45503P71Q7526A2505b50269m4545M5750f2055C19351
12806A30998d1174A91118n7244l8018a8304A20868J90327A44627g9790I0582b6298
$$ plain form
12794 302622 -213560 154889 91650 181591 -313233 48662 -62127 163863 -44074 12022 -475777
12782 16460 53159 -108051 -125481 -37320 137457 -387647 43364 -297029 233322 -40294 132815
12770 63624 -231995 32994 147430 -5035 114475 -54945 200178 -46332 44964 -99611 -139229
12759 -139229 95514 -218986 -39649 -202311 137221 -16342 212000 16994 -116317 4075 -85574
12747 -31607 119910 -82386 -112200 70628 -177912 -18037 -326081 100096 304130 -19432 336102
12735 478751 163091 113400 361773 131926 -202370 204690 -271099 33 190664 -501 69835
12723 -8932 -156476 118049 -28587 111328 145033 33111 -112377 134965 94533 -67132 -166199
12712 -166199 -282386 241802 98267 385511 188911 258739 181245 516728 167575 13898
$$ packed form
12794C02622b13560A54889o3239Q9941c13233D8662f2127A63863d4074A2022d75777
12782A6460L6699a08051j7430c7320A37457c87647D3364b97029B33322d0294A32815
12770F3624b31995C2994J14436e035A14475e4945B00178d6332D4964i9611l9618
12759a39229I5514b18986c9649j62662A37221a6342B12000A6994a16317D075h5574
12747c1607A19910h2386k9814G0628a77912a8037l08044A00096K04034a9432C36102
12735D78751A63091m9691K48373A31926b02370B04690b71099C3J90631e01F9835
12723h932j47544A18049b8587A11328L3705C3111a12377A34965m0432f7132r9067
12712a66199j16187B41802I8267K87244A88911O9828p7494L35483A67575A3898
$$ plain form
12701 128078 122914 141803 222466 115887 25853 9423 28168 -165239 147881 -127316 -10762
12689 -31029 -86258 -93797 135263 -177592 -38225 171243 -288244 -120915 -24207 133054 -114447
12677 -256303 -176036 295282 284918 74128 -86137 206801 149588 169929 186676 -182919 114481
12665 293626 -12968 98604 180526 -78323 -84186 -33909 -65118 154160 271676 173121 63675
12653 -127881 172546 -715 136335 -153325 -58289 52868 -42589 22037 -159371 -22272 77658
12641 33474 20329 232872 -78787 174832 319984 108449 47258 214629 97701 188724 -14420
12629 511179 -54289 145520 111018 -1205 309316 142153 -64707 60181 -14752 106866 19378
12617 -40170 203092 298974 202709 153466 15859 287844 -145315 440041 233364 -263988
$$ packed form
12701A28078n164J8889Q0663j06579B5853I423J8745a65239A47881a27316a0762
12689c1029n5229p539A35263a77592c8225A71243b88244a20915b4207A33054a14447
12677b56303Q0267B95282j0364G4128h6137B06801n7213K0341J6747a82919A14481
12665B93626a2968I8604Q1922g8323n863c3909l1209A54160J17516r8555F3675
12653a27881A72546g15A36335a53325e8289E2868d2589B2037a59371b2272G7658
12641C3474j3145K12543g8787A74832J45152A08449D7258J67371I7701R1023a4420
12629E11179e4289A45520l4502a205C09316A42153f4707F0181a4752A06866A9378
12617d0170B03092R5882r6265m9243A5859K71985a45315D40041k06677b63988
$$ plain form
12606 -51351 -120359 142354 -32773 231746 282619 75096 249985 96955 116983 42082 252603
12595 252603 342121 190304 -146758 285338 63993 32024 105702 -4465 -55123 362550 -32355
12583 -390224 -141781 67930 269882 80184 -108710 -29473 270440 148461 32510 160114
12573 160114 234223 -95429 192041 -47653 87222 6530 -49244 29623 -280331 85701 -94819
12561 -200514 -220927 66121 312481 7208 -16356 75866 -64512 216671 -115620 97961 -89754
12549 31859 -178016 -26109 153942 225850 169189 -25717 -207314 -203101 59363 -109031 -176047
12538 -176047 80816 83481 -77214 -203920 158702 -195197 124765 14982 -64420 -32881 144118
12526 141208 -96024 76059 230116 27135 -4296 -3313 121897 -227755 -67925 353957 212296
$$ packed form
12606e1351o9008A42354c2773B31746N0873G5096J74889I6955K0028D2082K10521
12595B52603Q9518j51817a46758B85338F3993l1969P3678d465n0658C62550c2355
12583c90224a41781F7930K01952H0184a08710b9473B70440j21979C2510J27604
12573A60114P4109i5429A92041d7653H7222F530d9244B9623b80331H5701i4819
12561b00514k0413F6121K46360G208a6356G5866f4512B16671a15620I7961h9754
12549C1859a78016b6109A53942P1908n6661b5717j81597M213E9363a09031o7016
12538a76047H0816K665g7214j26706A58702a95197A24765A4982f4420L1539A44118
12526A41208i6024G6059J54057B7135d296R83A21897b27755f7925C53957j41661
$$ plain form
12515 212296 70561 88969 -136857 127142 284459 252657 -11156 -31492 7781 1773 82442
12504 82442 -53915 75865 -149135 -251234 23490 204204 119074 307436 -441082 229882
12493 -33757 -47915 -409967 14618 17683 -200131 163357 -209241 -56014 -247386 -25701 -55687
12482 -55687 252160 257774 75531 -97527 158060 -86687 102909 292020 159383 179214 -75560
12470 -123680 137617 -102193 203159 142086 -116976 55854 103438 -104337 -18902 128940
12459 119883 219728 -105487 4517 -9719 -6077 -205405 -102972 -210815 6507 225393 -22517
12447 70060 -294595 -193593 -18789 -280100 122518 43750 -187281 -147249 -165222 -109986 -272436
12436 -272436 304690 151182 -195182 -196733 -114359 -7763 99825 258942 -78099 -134853 91022
$$ packed form
12515B12296G0561J8408a36857A27142J57317l1802a1156k0336G781A773Q0669
12504H2442e3915G5865a49135j02099B3490J80714q5130J88362d41082B29882
12493c3757j4158l62052A4618L065b00131A63357b09241e6014j91372b5701k9986
12482e5687B52160N614G5531i7527A58060h6687A02909J89111j32637J9831g5560
12470a23680A37617a02193B03159o1073a16976E5854M7584a04337a8902A28940
12459A19883R9845a05487D517i719L642j99328J02433j07843F507K18886b2517
12447G0060b94595J01002a8789k61311A22518D3750a87281M0032j7973N5236j62450
12436b72436C04690A51182a95182j551Q2374g763I9825J59117g8099n6754I1022
$$ plain form
12424 168279 280572 299709 -185016 -180924 159692 -164481 -41322 264816 -180732 159824
12413 80661 -134140 -12198 16731 64642 201614 -135974 60645 -115848 -40821 14408 -32024
12401 18652 -35993 -248619 123046 -250099 -47794 26561 193752 329859 192749 81912
12390 -180266 -241855 -63373 -7289 -4476 -52786 29188 -252274 181783 -285481 -114640 53598
12378 265706 19921 -55611 -277768 2497 -2579 64520 -286559 -387505 -87590 70162 -16992
12366 41250 -157574 -315856 -91412 -427637 -475855 22054 60401 -176514 -170907 -371075 -44461
12354 -40365 -7617 56629 70430 92526 137949 -63970 100243 134305 160108 -41249 109283
12342 -93953 253596 -186288 -212592 -64818 -94146 7762 -226903 -78305 173001 150774 -221217
$$ packed form
12424A68279J12293J9137a85016M092A59692a64481d1322B64816a80732A59824
12413H0661a34140a2198A6731M7911J36972a35974F0645a15848d0821A4408c2024
12401A8652c5993k12626A23046b50099d7794B6561J67191J36107j37110H1912
12390a80266o1589f3373g289K813m8310B9188b52274A81783b85481a14640E3598
12378B65706A9921e5611k22157B497b579F4520b86559j00946h7590G0162a6992
12366D1250a57574j58282i1412l36225m8218B2054L8347a76514N607k00168d4461
12354d0365g617E6629J3801K2096M5423f3970A00243L4062K5803d1249A09283
12342i3953B53596a86288k6304f4818k9328G762b26903g8305A73001k2227b21217
$$ plain form
12330 -34669 -184084 194658 -236120 185882 -74873 130680 -181003 147506 105137 -207849
12319 -287967 102812 -121802 85386 -28697 -69427 54340 266014 137522 419174 -194713
12308 97634 89826 -253642 -119237 213118 151269 80387 36484 -6470 -47289 229822 87610
12296 120557 -30336 -145466 -214870 128106 -66667 -143718 44205 -127948 946 -62901 39101
12284 -33641 -6061 99824 -137963 341719 340830 114894 -14789 76599 132584 297035 358198
12273 358198 135648 83168 -21496 195451 278614 173481 -62661 -130771 -459983 63120 187355
12262 187355 364751 -31610 46151 -75187 364741 173163 -140600 200242 129742 436352
12252 436352 237809 283928 95864 143853 244478 100202 17406 61931 -21462 59453 209905
$$ packed form
12330c4669j49415A94658b36120A85882g4873A30680a81003A47506m2369b07849
12319b87967A02812a21802H5386b8697m0730E4340K11674j28492K81652a94713
12308I7634p808b53642a19237B13118o1849p0882C6484f470m0819B29822H7610
12296A20557c0336j15130o9404A28106f6667p7051D4205a27948I46f2901C9101
12284c3641f061I9824a37963C41719q89A14894a4789G6599N5985J64451O1163
12273C58198A35648n2480b1496A95451Q3163j05133f2661o8110l29212F3120J24235
12262A87355J77396c1610D6151g5187C64741A73163a40600B00242p0500L06610
12252D36352j98543M6119I5864M7989J00625A00202A7406M4525b1462E9453J50452
$$ plain form
12241 209905 92002 116488 90951 235178 508095 179198 -74731 64069 399157 49136 124092
12230 124092 78596 285297 -66294 -42621 298449 317558 343239 383510 68966 223036 202459
12219 202459 357220 467141 52957 86500 -54519 141121 138947 128929 92951 240422 -65090
12207 417241 70990 -107006 -180032 136291 23043 161912 231463 80357 362731 1238 202959
12196 202959 293967 2704 373915 -168288 138793 124452 -231085 -18208 -124410 -9675 230300
12184 27674 111426 345887 220869 43758 178796 453964 80717 221571 -60189 369347
12173 168756 199121 -237852 185716 -5332 110971 260910 294298 -325284 126644 -131414
12162 89166 115737 -17281 -45921 -282300 39187 45297 18242 240480 120492 -229146 -69034
$$ packed form
12241B09905I2002K4486k5537J44227K72917A79198g4731F4069L35088D9136P4956
12230A24092m5496K06701f6294K3673B98449J9109K5681M0271F8966J54070k0577
12219B02459J54761J09921E2957L3543e4519A41121k174j0018l5978J47471f5090
12207D17241G0990a07006p3026A36291B3043J38869O9551H0357K82374A238K01721
12196B02959R1008B704L71211a68288A38793j4341b31085a8208j06202i675B30300
12184B7674Q3752K34461j25018D3758J35038K75168H0717J40854f0189C69347
12173A68756L0365b37852A85716e332A10971J49939L3388c25284A26644a31414
12162H9166K6571a7281k8640k36379C9187O110A8242K22238j19988b29146f9034
$$ plain form
12150 152847 -145828 -84931 -201960 -79583 10889 114324 70370 -207986 -121051 -353873
12140 -353873 128557 -334935 -54438 -25498 -1258 113576 82837 -68646 110236 -237375 241324
12128 -183977 -347200 92062 -40243 190108 353736 267613 256275 60494 -28102 -174767 -36266
12116 -39678 -164523 67594 -147402 -105660 -7485 219604 18718 -55862 85646 -9822 -326436
12105 -326436 51724 50041 29803 -230599 -45584 -61365 -234740 196129 -115724 40948 123323
12094 123323 -124489 397079 189782 -129973 116763 36356 -47766 -122396 91476 50552
12084 50552 8831 89426 -17393 -209704 200388 204982 -54365 27722 -258444 -97963 -140808
12073 -140808 -28453 2513 203671 235276 1442843 1557954 516944 338585 184306 87903
$$ packed form
12150A52847a45828O0897j17029g9583A0889J03435m3954b07986Q6935k32822
12140c53873A28557c34935e4438b5498a258A13576l0739f8646A10236b37375B41324
12128a83977j63223I2062d0243A90108J63628q6123j1338F0494b8102j46665c6266
12116c9678j24845F7594a47402M1742g485B19604A8718e5862H5646i822l16614
12105c26436E1724j683k0238b30599d5584j5781j73375A96129a15724D0948Q2375
12094A23323a24489C97079A89782a29973A16763C6356d7766p4630I1476m0924
12084E0552H831Q0595a7393j92311B00388M594e4365B7722b58444i7963m2845
12073a40808b8453B513K01158L1605J207567J15111E16944j78359j54279H7903
$$ plain form
12062 83383 -61426 40124 26046 172742 278478 168711 251987 92141 108280 32341 33067
12051 33067 -135307 -8738 -166786 14785 279613 99460 -79511 -162001 -121083 63644 101967
12040 101967 -63933 239963 63880 -28041 52115 -19871 -95005 301130 -88932 43493 -94921
12028 -574165 83064 1154 -55340 -257645 4137 -271284 64432 -131241 -130639 294384 246735
12017 246735 76898 202764 75077 -117560 -61901 -108063 -165426 581554 315621 86855 -215890
12005 313882 252822 -292520 -154240 179397 -253880 -146957 -63692 -25447 200783 101919
11995 101919 -61642 -138561 151863 -286772 217696 -261206 81730 -9515 -425565 156968
11984 -78368 68332 72299 -290584 -178162 15605 -115980 7623 99465 6712 14759 -163332 -28649
$$ packed form
12062H3383f1426D0124j4078J46696J05736j09767Q3276I2141J6139C2341P26
12051C3067a35307h738j58048A4785K64828I9460g9511q2490M0918F3644L8323
12040A01967f3933B39963F3880b8041E2115a9871p5134C01130h8932D3493i4921
12028e74165H3064A154e5340k02305D137b71284F4432a31241O02B94384m7649
12017B46735G6898J25866G5077a17560N5659m6162n7363E81554k65933H6855b15890
12005C13882o1060b92520J38280A79397b53880J06923f3692b5447B00783r8864
11995A01919f1642p6919A51863b86772B17696b61206H1730i515m16050A56968
11984g8368F8332L967b90584J12422A5605a15980G623R1842F712Q047a63332b8649
$$ plain form
11971 -137883 -49912 -133490 -233965 -153627 -68715 421024 126664 -139287 224091 -66233
11960 -214769 -433350 -178457 -355119 169823 443574 145959 -226192 -60466 132903 118138
11950 118138 96962 -203074 -57980 53072 -123238 72217 19431 -120245 20186 189608 5188
11938 -27005 -96846 -157475 -93786 22846 -53191 -105633 -347359 -135157 -123141 -49525 -351768
11927 -351768 41225 42469 45812 -363876 -80041 -325105 -299482 -175800 -83 138168 190261 164345
11915 164345 4331 230101 -92759 -54256 9944 3417 -131172 146131 -446209 -82022 -133230
11904 -133230 60762 83821 82681 11201 26229 -120759 -127715 -131616 -93979 104354 146963 -159332
11891 -201118 -328636 35677 66312 -206264 341224 -244278 231409 -196066 184068 -129303
$$ packed form
11971a37883d9912q3578j00475Q0338f8715D21024A26664a39287B24091f6233
11960b14769k18581a78457j76662A69823K73751A45959b26192f0466A32903j4765
11950A18138k1176b03074e7980E3072a23238G2217A9431a20245B0186J69422E188
11938b7005o9841o0629O3689B2846e3191n2442k41726a35157J2016d9525l02243
11927c51768D1225J244L343c63876h0041k45064K5623J23682h3A38168N2093k5916
11915A64345D331K25770i2759L8503I944C417a31172A46131d46209h2022n1208
11904a33230F0762K3059j140A1201J5028a20759o956l901L7637A04354M2609a59332
11891b01118j27518C5677L0635b06264C41224b44278B31409a96066A84068a29303
$$ plain form
11880 -23057 -291226 -292048 -82649 197065 286942 1366 435130 180876 -440635 -236349 -142272
11869 -142272 199027 86809 96735 -7846 39829 -238000 -120446 9738 130272 -115784 -452160
11858 -452160 38083 148502 6 -391991 -231931 -111561 17678 62541 13098 218555 494946
11847 494946 9303 324397 196081 -97451 -188888 86693 -627 -111065 -38153 30080 5897 -196201
11834 -320156 -59951 23307 -67556 -23022 -65395 135785 30624 -74433 -170607 67191 -219152
11822 95140 -101487 193717 99349 -73366 -327924 -176370 -166269 -35560 -216540 437718
11811 -12650 296105 -134661 90563 305090 310369 -14518 -88541 -17780 -291055 -159080 25594
11799 -97553 -54280 -178285 78929 -337931 152399 131812 171294 -164956 52771 -166249 78530
$$ packed form
11880b3057k68169q22h2649A97065Q9877A366M33764A80876d40635K04286R4077
11869a42272A99027H6809R926g846C9829b38000J17554I738J20534a15784l36376
11858d52160C8083J10419Fc91991J60060a11561A7678M4863A3098K05457K76391
11847D94946I303L15094j28316i7451r1437H6693f27j10438c8153C0080E897a96201
11834c20156e9951B3307f7556b3022m2373A35785C0624g4433r6174F7191b19152
11822I5140a01487A93717r4368g3366k54558J51554J0101c5560j80980D37718
11811a2650B96105a34661I0563K14527N279a4518p4023a7780k73275J31975B5594
11799i7553M3273j24005G8929c37931A52399k0587L9482a64956E2771a66249G8530
$$ plain form
11787 -4219 4384 -44370 71631 -109192 96948 226240 94 45967 -51218 -30009 56811 -171208
11774 108217 131682 -40679 -79485 175098 142144 -224731 -14506 -12861 235569 -262213 23960
11762 -122592 -134555 -154777 140583 211778 -111093 124190 -127562 -274026 -83073 113422
11751 -90425 -261691 238710 -66901 -22248 127062 2854 168533 134708 -69345 187666 26375
11739 -3999 -22815 201781 -62154 68109 -408893 199078 55196 207494 319098 13081 42072
11728 42072 -233655 -76277 78927 155783 307602 -132677 55899 307037 -167787 -14180 118666
11716 379197 -94945 -21749 -185188 -316371 82053 236204 -130095 -317161 -230142 -129047
11706 -129047 29349 -102401 -277718 -54648 -46333 -34370 -239614 170920 -35455 -332615 -100096
$$ packed form
11787d219D384d4370G1631a09192I6948J29292I4M5873e1218K1209E6811a71208
11774A08217K3465d0679l8806A75098l2954b24731a4506J645B35569b62213B3960
11762a22592j1963k0222A40583P1195a11093A24190a27562j46464h3073A13422
11751i0425j71266B38710f6901b2248A27062B854J65679l3825f9345A87666B6375
11739c999j8816B01781f2154F8109d08893A99078E5196J52298J11604A3081K8991
11728D2072b33655g6277G8927P6856J51819a32677E5899K51138a67787a4180A18666
11716C79197i4945b1749j63439j31183H2053J54151a30095j87066Q7019J01095
11706a29047B9349a02401j75317e4648Q315J1963k05244A70920c5455k97160a00096
$$ plain form
11694 333821 307975 57022 -86256 -68771 150124 308798 -174499 161650 39270 111892 59160
11683 59160 -58346 50349 -121734 342064 -334473 -120553 99829 158740 171044 -129813 41663
11671 -18988 -4457 316883 226650 -190156 203540 -140927 -225146 -15909 -17586 -237173 -74652
11659 -216744 -7185 140425 -165836 3029 -52979 169845 380575 -317322 82747 68388 116817
11648 116817 5021 -179772 80166 -17045 201804 168052 281148 215108 -84889 -160651 228870
11636 30787 -168838 -66249 -40404 319194 151893 -99705 206692 148173 254634 -75590 -36562
11624 158308 37530 190918 -23637 82683 196350 -57155 -299570 -140369 -169602 87538 373629
11613 373629 -260377 53603 236688 66063 151565 -73200 -359643 35033 -33504 133830 335280
$$ packed form
11694C33821k5846E7022h6256J7485A50124J58674a74499A61650C9270P2622n2732
11683E9160e8346E0349a21734C42064c34473a20553I9829N8911J2304a29813D1663
11671a8988d457C16883r0233a90156B03540a40927q4219a5909j677k19587g4652
11659b16744g185A40425a65836C029e2979A69845K10730c17322H2747j4359M8429
11648A16817E021a79772H0166a7045B01804l3752J13096o6040h4889p5762B28870
11636C0787a68838f6249K5845C19194A51893i9705B06692n8519J06461g5590c6562
11624A58308C7530J53388b3637H2683J13667e7155k42415a40369k9233H7538K86091
11613C73629b60377E3603J83085F6063Q5502g3200k86443C5033c3504A33830K01450
$$ plain form
11602 335280 8095 265495 -213793 175728 351603 -128976 172639 84610 -173177 56971
11591 -193797 -70670 -165277 -223370 -1712 -82766 58182 71375 82784 242615 45728 112871
11580 112871 163465 338959 309250 320690 -106052 323593 269911 46861 39954 -63660 -128314
11569 -128314 -300023 216715 111502 -295924 6378 230411 258941 301980 109035 32823
11558 -110385 -40775 163622 -18643 -9473 94504 53728 -182428 98338 218701 -242816 -162491
11547 -162491 -21910 5198 -28392 241138 -226535 236836 -340207 90932 -108516 247432
11536 319819 66105 -129880 111117 -172684 -13450 269618 42446 324284 287657 -58002
11525 111177 -159589 -71661 -77161 -23663 333009 -210861 -107247 337645 -9087 118185 124548
$$ packed form
11602C35280H095K57400b13793A75728J75875a28976A72639H4610a73177E6971
11591a93797g0670r4607n8093a712q1054E8182J3193J1409J59831D5728O7143
11580A12871N0594J75494k9709J1440a06052C23593n3682D6861o907f3660o4654
11569a28314j71709B16715j05213b95924F378K24033K8530M3039A09035C2823
11558a10385d0775A63622a8643R170I4504m0776a82428I8338J20363b42816Q0325
11547a62491b1910E198b8392B41138b26535B36836c40207I0932a08516B47432
11536C19819F6105a29880A11117a72684a3450B69618D2446K81838l6627e8002
11525A11177a59589g1661n500b3663C33009b10861J03614C37645i087A18185O363
$$ plain form
11514 124548 53122 -127487 -5940 164497 163125 -223152 140144 -275437 -54676 175348 271312
11503 271312 71878 166900 81240 294019 246484 201977 462538 20056 440971 32258 74701
11492 74701 -45322 285757 79462 -79537 91794 213062 101939 296380 111148 63919 132548
11481 132548 -24922 429719 284383 120859 -32790 39448 142364 137539 18723 -46895 -4977
11469 138686 -74840 274384 355745 86731 114423 -183787 202071 47487 39335 195694 -7291
11457 -25615 -16993 71906 9076 209156 -28930 98680 10599 -103636 -229086 -82378 -138125
11446 -138125 71010 170198 395929 137805 -117175 33369 89631 15400 37560 -20224 233413
11434 -63284 66347 -90748 62697 293188 282663 -182276 -9470 113879 1182 30712 137838
$$ packed form
11514A24548E3122a27487e940A64497j372b23152A40144b75437e4676A75348R5964
11503B71312G1878R5022H1240K12779m7535m4507K60561B0056M20915C2258M2443
11492G4701d5322B85757G9462g9537I1794J21268A01939J94441A11148m7229O8629
11481A32548b4922D29719j45336A20859c2790C9448J02916m825A8723d6895d977
11469A38686g4840B74384Q1361H6731K7692a83787B02071D7487q152J56359g291
11457b5615Q622G1906I076K00080b8930I8680A0599a03636j25450h2378n5747
11446a38125G1010R9188K25731A37805a17175C3369N6262A5400K2160b0224B33413
11434f3284F6347i0748F2697K30491j0525a82276i470A13879A182K9530J07126
$$ plain form
11423 137838 112128 11225 -53977 103460 -211458 55365 215523 -72813 4772 13428 149399
11412 149399 -191046 -227019 434558 122532 61707 -125981 115093 117006 10582 -66201 29802
11400 145823 239407 -84189 301432 -178450 118948 413108 387552 114030 10898 195770
11390 195770 1336 -42004 6366 76820 47949 -16523 -321996 -240497 -112524 38962 65549
11379 65549 115469 267840 104136 -124411 159524 -49404 92209 104993 -302899 -134933
11368 96940 41104 161277 -6143 108771 156615 31620 -3395 -279676 155487 -130328 136771
11356 19048 123851 334055 205848 -169931 -62547 -40555 272991 253540 104680 -28941
11345 -285832 72667 176276 -53396 81496 270399 153675 65980 -140737 170804 -137699
$$ packed form
11423A37838k5710A1225e3977A03460b11458E5365J60158g2813D772Q656J35971
11412A49399a91046l5973D34558A22532o0825a25981A15093J913A0582f6201B9802
11400A45823R3584h4189C01432a78450A18948K94160k5556A14030A0898J84872
11390A95770A336d2004F366P0454k8871a6523l05473Q1499a12524C8962K6587
11379F5549M9920J52371A04136a24411A59524d9404I2209J2784c02899a34933
11368I6940D1104J20173f143A08771M7844C1620c395k76281A55487a30328A36771
11356A9048J04803K10204j28207a69931f2547K1992B72991j9451A04680b8941
11345b85832G2667J03609e3396H1496J88903j16724F5980a40737A70804a37699
$$ plain form
11334 -245353 383876 69068 -193088 184782 213952 151559 8304 -39929 -47185 -158026 60421
11322 -517355 154218 83482 45341 -243178 -95215 39339 175528 192428 237104 -62879 148557
11310 -25055 138806 29780 68469 -110693 -190858 45670 119676 -71353 -38488 28049 142098
11299 142098 30174 -113980 56246 -255120 279380 193147 -1097 -114038 187495 -144484
11288 -155485 -82871 24441 -132184 161073 -61987 1284 99906 -225904 17789 -173395 10968
11276 -221465 -122546 153418 -12748 17470 -393554 -181100 -197104 -91246 95993 208477 147378
11265 147378 -245564 -183319 283834 137099 -21461 166983 185887 43690 -179635 346250
11254 -198309 -135044 -46248 101749 52646 82902 -139709 -256293 -49471 -113215 22632 31792
$$ packed form
11334b45353C83876F9068a93088A84782K9170o2393H304c9929p256j10841F0421
11322e17355A54218p0736l8141b43178i5215C9339J36189J6900M4676f2879A48557
11310b5055A38806B9780L8689a10693q0165D5670P4006g1353L2865B8049J14049
11299A42098C0174a13980E6246b55120B79380q6233a097j12941A87495a44484
11288a55485P2614B4441a32184A61073f1987A284R8622b25904A7789a73395A0968
11276b21465R8919A53418a2748A7470c93554a81100j6004i1246I5993J12484o1099
11265A47378b45564O2245B83834A37099b1461A66983J8904D3690a79635C46250
11254a98309O3265d6248A01749m9103L0256a39709j16584d9471o3744B2632R160
$$ plain form
11243 31792 277644 -80756 128324 -130296 309100 90633 -345205 336473 291195 376478
11233 376478 405701 -4846 59106 -42271 15830 74061 -130349 27715 -22485 -79 89455 -197889
11220 208123 -186364 -79101 -280599 163292 -24152 -73503 100884 143055 59406 -185866
11209 -136210 4407 177904 -325948 182576 -384181 -64745 98928 215771 -25988 -296820
11199 -296820 21266 298916 -133674 -108256 -277056 -127970 -5580 41824 79876 -307011 -49328
11187 -111359 16692 -345811 289520 -22412 -59698 -284572 -376343 -23053 173448 89149 -82733
11175 -104608 -193989 -18786 -181296 -136313 80310 -216004 -19612 -93935 -188726 62715 351673
11164 351673 -32960 -105302 -12644 -76989 -163103 -132136 -202065 -57287 -14889 -85409 -150756
$$ packed form
11243C1792K45852h0756A28324a30296C09100I0633c45205C36473m5278Q5283
11233C76478K9223d846E9106d2271A5830N8231a30349B7715b2485g9H9455a97889
11220B08123a86364g9101k01498A63292b4152m9351A00884M2171E9406a85866
11209a36210D407J73497c25948A82576c84181f4745I8928J16843b5988k70832
11199b96820B1266K77650a33674K5418j68800a27970e580D1824L8052c07011d9328
11187a11359A6692c45811B89520b2412l7286k24874r1771b3053A73448q4299h2733
11175a04608q9381a8786j62510M4983H0310b16004a9612p4323r4791F2715K88958
11164C51673c2960p2342a2644o4345q6114L0967o9929e7287a4889p0520o5347
$$ plain form
11153 -150756 166293 153916 -206884 -191733 -33230 -103868 143870 152158 -242245 108742 -59902
11141 186198 -210032 -155146 -53384 9971 -174902 225990 -51180 70474 2656 44693 -65971
11129 187623 -155849 -44815 139009 -153149 -6298 -163618 -239690 -153344 -327999 118975
11118 179533 -122214 -341758 101395 -223404 126203 210572 25048 159347 345651 148350
11107 -18097 114693 182762 388010 96449 128755 452660 105086 -56767 260024 197548 284498
11096 284498 237710 133998 528576 214080 60074 117733 -64339 84240 132384 261307 256143
11085 256143 -133782 372635 409293 370356 174378 204510 78966 229212 316524 132650
11074 212723 276996 61694 563089 585245 5065 515394 245327 321115 538421 404429 345822
$$ packed form
11153a50756A66293j2377b06884J5151c3230p0638A43870Q288b42245A08742e9902
11141A86198b10032N4886e3384I971a74902B25990e1180G0474B656M2037f5971
11129A87623a55849d4815A39009a53149f298j57320p6072Q6346j74655A18975
11118A79533a22214k19544A01395b23404A26203Q4369B5048J34299J86304A48350
11107a8097A14693O8069K05248I6449L2306L23905A05086e6767B60024o2476Q6950
11096B84498m6788j03712L94578B14080F0074N7659f4339H4240M8144J28923n164
11085B56143a33782C72635L6658l8937A74378L0132G8966J50246Q7312A32650
11074B12723O4273F1694N01395K2156E065N10329B45327P5788K17306j33992n8607
$$ plain form
11063 345822 778410 560820 326734 543819 440342 617176 584209 488587 350898 173833
11052 464357 465332 680515 506130 563748 792105 559259 654721 773332 530492 1067743
11042 1067743 761170 598847 590427 486185 409706 814712 813445 512362 566318 278509
11031 744277 450374 576513 660653 555367 794644 740194 817138 895550 618269 157956
11020 737341 581379 628050 432836 335320 420423 684226 623847 699657 520002 574126 515844
11009 515844 297099 479311 537683 727485 733746 631834 740784 791840 223843 467309
10999 467309 727343 350067 750831 548354 886691 576044 699501 704989 645477 727522
10989 727522 1124390 976862 534234 742604 1094328 953454 1012233 1335051 1142368 1095493
$$ packed form
11063C45822M32588k17590k34086K17085j03477J76834l2967r5622j37689A73833
11052D64357R75K15183j74385N7618K28357k32846R5462J18611k42840N37251
11042A067743l06573j62323q420j04242p6479M05006j267l01083N3956B78509
11031G44277k93903J26139Q4140j05286K39277n4450P6944P8412k77281A57956
11020G37341j55962M6671j95214r7516Q5103K63803o0379P5810j79655N4124n8282
11009E15844k18745J82212N8372J89802O261j01912J08950N1056B23843K43466
10999D67309K60034C50067M00764k02477L38337l10647J23457N488n9512Q2045
10989G27522L96868j47528m42628K08370L51724j40874N8779L22818j92683m6875
$$ plain form
10979 1095493 1246355 1855595 1683915 2252545 2487764 2837527 2830732 2778706 2646781 3007126
10969 3007126 2823604 2276426 1925656 1824634 1580211 1610872 1687445 1887515 2023048 1615083
10959 1615083 2027275 2079576 2430098 1864153 1571254 1182209 1137834 1177488 896358 1170440
10949 1170440 840281 865825 289178 311024 425633 313959 219703 458539 294241 91762
10938 249454 275843 196075 139469 371963 -115665 54246 98288 -50128 -102359 121247 -139407
10926 -37311 368493 56125 95573 105446 76717 361609 94286 -244554 3445 -264808 237686
10914 -67255 115946 -66576 -231382 -362762 71271 -298927 -133414 -59358 210157 -182791
10903 -4620 -60460 -9370 305753 -401946 -1425 -109157 -61198 94567 -107652 -231188 42955
$$ packed form
10979A095493J50862O09240j71680N68630K35219L49763o795n2026j31925L60345
10969C007126j83522n47178l50770j01022k44423L0661P6573K00070J35533m07965
10959A615083M12192N2301L50522n65945k92899l89045m4375L9654k81130K74082
10949A170440l30159K5544B89178K1846J14609j11674r4256K38836j64298I1762
10938B49454K6389p9768n6606K32494a15665E4246M4042e0128n2231A21247a39407
10926c7311C68493E6125L9448R873k8729K84892I4286b44554C445b64808B37686
10914f7255A15946f6576j64806j31380G1271b98927a33414e9358B10157a82791
10903d620n5840i370C05753d01946a425j07732M7959I4567a07652j23536D2955
$$ plain form
10891 151718 85248 10745 378712 104641 78910 -125194 -221338 116576 59189 151699 54132
10879 116916 -86037 -208815 -69679 -21346 -308526 8002 -255393 -145745 39238 22823 -11821
10867 -199604 157633 122810 74019 98835 -13746 46841 -43153 -101280 -161727 202890 378495
10856 378495 -255657 25387 243808 108290 98568 9341 -111718 127643 148156 3648 -102448
10844 -2850 -29856 -144049 144471 -210496 116268 -160126 -279166 19303 -29098 -13464 75830
10832 436800 -235124 -198669 151556 -58483 -240098 241847 190577 94587 -128365 185223
10821 -171428 167895 -178405 108363 -137477 -223089 -5300 -75677 -345206 -87062 165689
10810 219487 224758 142272 324853 215448 -196804 -10424 -87901 48702 -32203 -148703 -300606
$$ packed form
10891A51718o6470A0745L67967A04641k5731a25194r6144A16576n7387R2510E4132
10879A16916h6037j22778f9679b1346k87180H002b55393J09648C9238j6415a1821
10867a99604A57633l4823m8791K4816a3746D6841d3153n8127o0447B02890J75605
10856C78495b55657B5387K18421A08290r722I341a11718A27643K0513C648a02448
10844b850k7006j14193A44471b10496A16268a60126j19040A9303b9098a3464G5830
10832D36800b35124L6455A51556e8483j81615B41847n1270I4587a28365A85223
10821a71428A67895a78405A08363a37477q5612e300p0377k69529h7062A65689
10810B19487N271q2486J82581j09405a96804a0424p7477D8702c2203j16500j51903
$$ plain form
10799 -300606 219976 -84898 41284 -84473 81295 -4720 -219842 19075 417227 36174 894
10787 -31590 -276050 -199152 84112 99890 -105986 37118 -231179 139076 -93560 28676 187171
10776 187171 -52579 43917 -403945 -97977 22701 -296383 196865 142586 -220663 -133673 -78719
10765 -78719 -369760 -289840 -241353 106650 15561 -558047 -34033 74149 235541 -66155 401973
10753 125660 137026 -54417 65211 -149857 -97625 -218470 164566 -191021 253890 -69051
10742 -40042 134371 -174649 -122058 -133294 5390 125802 -22792 162072 -225995 -184805 -86111
10730 -26720 -247267 59665 -76042 31801 -223227 35548 77352 -128495 134433 106344 167366
10719 167366 -48755 61986 -34777 -115581 -134600 4021 166940 -239694 -231760 -78746 -378234
$$ packed form
10799c00606B19976h4898D1284h4473H1295d720k15122A9075L98152C6174H94
10787c1590k44460P6898H4112J5778a05986C7118b31179A39076i3560B8676J58495
10776A87171e2579D3917d03945i7977B2701b96383A96865n4279b20663Q6990N4954
10765g8719k91041P9920M8487A06650A5561e58047c4033G4149J61392f6155D01973
10753A25660J1366e4417F5211a49857N2232j20845A64566a91021B53890f9051
10742d0042A34371a74649N2591j1236E390J20412b2792A62072b25995M1190h6111
10730b6720k20547E9665g6042C1801b23227C5548M1804a28495A34433k8089O1022
10719A67366d8755F1986c4777q0804j9019D021J62919b39694P934g8746k99488
$$ plain form
10708 -378234 -233251 -221056 -175129 -108424 -81851 -42041 -35913 -68450 -12840 -159042 -90993
10697 -90993 -25870 -149529 -102871 9749 -1683 -102283 -10152 -420573 -144127 -156499 34098
10685 130534 -42435 -70990 -127451 157646 136109 -194989 -307254 -243602 -228030 -121884 300225
10673 124908 299233 -180498 -126503 -197551 -140927 -111205 -38376 191364 129478 -104290 17608
10661 78740 -194724 202168 -55866 18732 122411 -197282 -204297 222947 299677 125498 169113
10650 169113 -172814 -55298 277029 182651 23652 780 -11774 -107130 -33345 -229970 75250
10638 -156767 -223935 197676 -105826 -221949 29358 -166763 -130503 96553 -442165 -101211
10627 10433 -24338 78001 -23685 82119 55180 -127235 -27445 -29110 -33639 49306 -34623 -491805
$$ packed form
10708c78234J44983J2195M5927O6705K6573L9810O128l2537a2840j46202O8049
10697i0993b5870j23659M6658I749a683j00600a0152m10421a44127j2372C4098
10685A30534d2435k8555n6461A57646k1537a94989j12265O3652J5572J06146C00225
10673A24908J74325a80498N3995p1048N6624K9722c8376A91364o1886a04290A7608
10661G8740a94724B02168e5866A8732J03679a97282p015B22947P6730A25498M3615
10650A69113a72814e5298B77029r4378B3652G80a1774r5356c3345j96625G5250
10638a56767o7168A97676a05826j16123B9358a66763L6260I6553d42165a01211
10627A0433b4338G8001b3685H2119k6939a27235b7445j665m529D9306c4623m57182
$$ plain form
10615 -491805 -209086 -17222 34825 -75911 37975 -2012 -347466 -53010 209741 365214 97155
10603 17553 -26806 -276447 147047 -125773 -72846 164514 105520 -208808 2928 16854 -231133
10591 110909 146300 126948 -229573 -244978 -117789 -22987 198299 16073 249853 -12524 129568
10579 -259527 -57340 -176987 -112834 -19850 -78262 -330026 -112656 -230151 384931 25404
10568 141543 -58811 -125397 202939 12835 -226586 -169553 -22509 -93720 306368 -156544 -68900
10556 -39910 -80174 97610 -13943 -28829 -13339 -97089 179419 -22904 -312177 -74262 -37756
10545 -37756 37110 -74047 140935 -26848 -341092 9887 -67042 -210773 -8705 234783 74932
10533 272342 109368 -451835 -92027 -416496 95936 -2551 -194456 -76109 -166477 -113045 86296
$$ packed form
10615d91805b09086a7222C4825g5911C7975b012l45454e3010B09741J55473I7155
10603A7553b6806k49641A47047a25773N2927A64514n8994b08808B928J3926b31133
10591A10909L5391j9352b29573j5405a17789b2987A98299A6073K33780a2524A29568
10579b59527e7340j19647O4153a9850n8412k51764a12656j17495C84931B5404
10568A41543e8811o6586B02939A2835b26586N7033b2509p1211C06368a56544f8900
10556c9910m0264I7610a3943j4886a3339q3750A79419b2904k89273g4262L6506
10545c7756C7110g4047A40935b6848l14244I887f7042j43731h705B34783G4932
10533B72342A09368d51835i2027l24469I5936b551j91905g6109r0368N3432H6296
$$ plain form
10521 -193771 -265548 -115724 24238 114539 61026 444686 24516 -7583 -286326 -261187 10699
10509 73741 -4205 4808 -152653 -84468 -88017 10800 -91450 23923 27815 -99202 -363429 342011
10496 -53336 71238 -145057 269094 -78835 68221 -46930 -55201 334546 -31664 175947 -15205
10484 -83426 220755 357521 611145 43624 231304 75775 -182493 -13603 -115640 -128232
10474 -128232 -3276 -13563 47091 186167 387250 -154057 146956 -15982 -24210 460670 185172
10462 171954 83543 -42071 -324502 -55241 -39968 -498440 38410 102044 59458 -430205 182140
10450 -288595 -132403 -155975 -218389 41240 2447 -35714 385600 -56932 -128710 -46177 -165317
10439 -165317 187829 59980 111401 50486 -11960 148413 -75242 186629 -61586 -231484 -85605
$$ packed form
10521a93771p1777a15724B4238R0301n3513L83660B4516g583k78743K5139A0699
10509G3741d205D808a52653O8185l549A0800i1450B3923L892i9202k64227C42011
10496e3336G1238a45057B69094g8835F8221d6930q271C34546c1664A75947a5205
10484h3426B20755J36766K53624D3624J87680G5775a82493a3603j02037j2592
10474a28232c276j0287D7091J39076K01083a54057A46956a5982q228D60670A85172
10462A71954H3543d2071k82431e5241J5273m58472C8410O3634m2586d30205A82140
10450b88595a32403k3572o2414D1240B447c5714C85600e6932p1778d6177j19140
10439a65317A87829E9980N1421E0486a1960A48413g5242A86629f1586j69898h5605
$$ plain form
10427 19588 6414 -156180 194658 83968 -375 -21995 -102134 28950 116268 -178257 343196
10415 -15530 -148368 -103808 253480 -6788 34301 81582 -41946 67562 -126137 -214951 158589
10403 -20358 51362 -59920 322 52375 103232 -159295 170609 -136875 294042 135917 165812
10392 165812 54482 -54561 13129 131909 21298 298840 199326 -55934 -387 -198363 90455
10380 110575 219928 265378 316554 310584 123582 153654 320822 79964 41545 161326 217992
10369 217992 420583 332914 583406 637541 209932 223348 323370 189552 470158 160670
10358 -16603 37246 -4553 536728 -195681 590710 -48009 315019 413540 403675 552021 385268
10347 385268 209202 397243 452436 125067 35676 98958 365661 261763 89080 37227
$$ packed form
10427A9588F414a56180A94658H3968c75k1620q0139B8950Q7318a78257C43196
10415a5530j32838M4560B53480f788C4301M7281d1946F7562a26137q8814A58589
10403b0358E1362e9920C22N2053N0857a59295A70609a36875B94042A35917K9895
10392A65812E4482e4561A3129J18780B1298K77542r9514e5934c87j97976I0455
10380A10575J09353M5450N1176n970A23582L0072J67168G9964l8419J19781N6666
10369B17992K02591q7669K50492N4135B09932J3416J00022j33818K80606A60670
10358a6603C7246d553E36728a95681E90710d8009C15019R8521r865J48346j66753
10347C85268j76066J88041N5193A25067C5676O3282K66703j03898H9080C7227
$$ plain form
10336 425501 -197589 -137765 -16397 120687 24270 64683 -110024 53812 205318 341063
10326 341063 -209439 83001 289933 110138 -70410 253459 -123158 382690 260312 180211
10316 180211 156518 132827 145132 -11874 -328648 7294 106537 -244109 173324 -71040 -117974
10305 -117974 150252 247694 -140499 -203956 240003 -58756 713045 -307185 -268187 -98812
10294 -85478 412322 -98347 33469 53749 88382 89213 50644 -103792 255987 41539 -206328
10282 -267558 -63049 33119 -63164 72974 87296 112813 33819 -59842 -388018 -124420 56667
10270 105769 7354 -252621 -386332 -14899 75111 -13951 -50700 227047 583148 385675 425147
10259 425147 377027 394437 420355 381379 99455 155068 -144947 78572 162323 93800 89978
$$ packed form
10336D25501a97589N9824a6397A20687B4270M0413a10024E3812J51506J35745
10326C41063b09439H3001K06932A10138g0410B53459a23158C82690j22378q0101
10316A80211k3693k3691J2305a1874l16774G294R9243b44109A73324g1040m6934
10305a17974A50252R7442a40499o3457B40003e8756G13045c07185L8998i8812
10294h5478D12322i8347C3469K0280L4633Q31l8569a03792B55987D1539b06328
10282b67558f3049C3119f3164G2974J4322K5517C3819e9842l28176a24420E6667
10270A05769G354b52621j33711a4899G5111a3951l6749B27047L56101j97473L9472
10259D25147m8120J7410K5918l8976I9455N5613a44947G8572Q3751o8523l822
$$ plain form
10248 89978 211054 22779 147448 -170924 32653 240811 -241124 36859 -160606 206220
10237 -293457 -40613 163117 -99648 -160532 -217185 -93348 -430829 -128649 114854 -359186
10226 -192744 -279512 -51471 -456855 -60009 13127 164352 192406 -117694 -145044 -57 -40617
10215 -40617 -14317 -117114 35668 -22167 261935 -303127 26855 239338 318156 251477 114431
10203 -255397 137013 -9735 327356 51819 -108746 -27720 -314414 -208826 14487 46900 177272
10192 177272 -169639 152110 -8227 -9138 288845 -108287 -69557 -101343 141224 124734 82796
10181 82796 109631 -107214 -78942 350788 44658 27041 -257574 -294052 -31701 -43524 -138961
10170 -138961 -304866 -103520 -35255 235856 -300918 -24669 -372786 188134 -164305 -318445
$$ packed form
10248H9978J21076B2779J24669a70924C2653K08158b41124C6859a60606B06220
10237b93457d0613A63117i9648o0884n6653i3348l37481a28649A14854c59186
10226a92744q6768e1471m05384f0009A3127J51225K8054a17694k7350e7m0560
10215d0617a4317j02797C5668b2167B61935c03127B6855K12483P8818o6679A14431
10203b55397A37013i735C27356E1819a08746b7720k86694J05588A4487L2413J30372
10192A77272a69639A52110h227r11B88845a08287L8730l1786A41224j6490m1938
10181H2796K6835a07214K8272C50788D4658j7617b57574l6478c1701j1823r5437
10170a38961j65905a03520c5255B35856c00918b4669l48117A88134a64305j54140
$$ plain form
10160 -318445 64063 -121649 -59139 -163584 184734 -40278 115333 -143891 -113574 -134959
10150 -134959 -180441 -185458 120500 -56389 123528 -40498 -74628 -70402 120056 -99383 -215790
10139 -215790 -201949 77646 -8321 -133117 -139695 365081 74617 -110253 -341874 117104 -93048
10127 -28808 213437 -74860 -22221 -80709 -187557 10578 -35273 85713 14198 172727 162148
10116 162148 -58703 -364619 268655 -243086 -72180 -165863 348351 -133160 -352715 18198
10105 10866 -242198 -148601 -194095 -266595 -190093 79379 49611 263115 223940 160135 -4883
10093 -195761 120704 60717 120485 182504 -58081 -346141 -138519 38208 215626 143839 -234715
10081 -405717 170891 -9189 205191 19303 -28650 94719 -123956 -399052 -176260 -137422 237234
$$ packed form
10160c18445F4063a21649e9139j04445A84734d0278A15333a43891L0317k1385
10150a34959m5482n017A20500e6389A23528d0498l4130M226A20056i9383j16407
10139b15790J3841G7646h321j24796o578C65081G4617a10253k31621A17104i3048
10127b8808B13437g4860b2221n8488j06848A0578c5273H5713A4198J58529j0579
10116A62148e8703l05916B68655b43086g2180r3683C48351a33160k19555A8198
10105A0866b42198R3597m5494p2500P6502G9379k9768K13504l9175o3805d883
10093a95761A20704n9987N9768O2019e8081k88060a38519C8208J77418p1787b34715
10081d05717A70891i189B05191A9303b8650I4719a23956k75096a76260L8838B37234
$$ plain form
10069 207836 -183962 -129278 -284594 -23883 -156339 -187781 -61612 85638 138097 -36272 -54168
10058 -54168 -36308 -353508 -242112 -31707 -123175 -210336 64948 149008 344389 -126612 -35015
10046 -38566 -32424 121024 -224543 -64406 32063 -77992 47987 -238113 -243020 -183953 -41251
10034 -167158 -133559 252927 149588 52387 -363009 -183954 199070 51698 340976 184096
10024 184096 37055 -40357 -270430 -195432 -65507 -69970 31143 -155501 27697 130167 245587
10013 245587 -44898 139007 -77540 140293 233675 -110885 -142430 265821 -427214 -126668
10002 -68001 102745 16371 94340 -13326 297833 -162692 -201369 -107947 -80126 -111029 -23342
9990 -159369 -255401 -421280 260850 -158813 -418571 -395004 94374 331592 -124920 -362645
$$ packed form
10069B07836a83962N4684j55316b3883j32456l1442f1612H5638N2459c6272j7896
10058e4168J7860l17200J11396c1707r1468q7161F4948Q4060J95381a26612c5015
10046c8566O142A21024b24543f4406C2063g7992D7987b38113m907N9067d1251
10034a67158L3599B52927j03339E2387c63009J79055A99070E1698K89278j56880
10024A84096C7055d0357k30073P4998f5507m463C1143a55501B7697J02470J15420
10013B45587d4898A39007g7540A40293R3382a10885l1545B65821d27214a26668
10002f8001A02745A6371P7969a3326B97833a62692l8677R3422K7821l0903b3342
9990a59369r6032j65879B60850a58813k59758K3567I4374K37218a24920k37725
$$ plain form
9980 -362645 -31241 -27396 -79959 -138972 261181 -235480 -133664 -135416 101385 -239100 -69617
9968 121571 -90156 21199 121218 -280938 16660 -36823 -104106 -131767 204615 -76311 -64785
9957 -64785 -199794 -499481 -113586 -139314 128559 -241293 59222 103517 63388 -237444 -172608
9946 -172608 -32250 19560 -18663 -108162 210856 20835 18433 -67691 -177925 -30236 5087 34355
9934 34355 138013 -254559 -95782 93897 -156690 -144282 90963 22772 -74436 -236148 2427
9922 52018 147432 -303630 183423 -64843 365485 299137 -49688 159054 97346 -20633 56935
9910 -4863 -125535 119378 -67280 -70760 -4219 32989 75324 53959 -257270 40914 57058 58330
9898 58330 -310457 326210 -93529 -273738 -63385 -55894 -238210 -13060 -224448 -587842 -7817
$$ packed form
9980c62645c1241L845n2563n9013B61181b35480J01816j752A01385b39100f9617
9968A21571i0156B1199J00019b80938A6660c6823o7283k7661B04615g6311J1526
9957f4785j35009k99687a13586k5728A28559b41293E9222M4295m0129b37444O4836
9946a72608c2250A9560a8663q9499B10856B0835k402f7691j10234c0236E087K9268
9934C4355J03658b54559i5782I3897a56690J2408I0963B2772g4436j61712B427
9922E2018R5414c03630A83423f4843C65485o6348d9688A59054o1708b0633E6935
9910d863j20672A19378f7280l480d219C2989M2335k1365b57270D0914J6144J272
9898E8330c10457C26210i3529j80209f3385P491j82316a3060k11388l63394g817
$$ plain form
9886 -24068 -3679 20709 -248272 -100077 61222 -242479 64594 -16526 280403 -146322 23315
9874 48165 -181283 -129672 163122 -292428 -72085 -248538 124224 -405617 -219133 -113123
9864 -113123 -296618 2088 305174 -50911 -41534 135982 33479 124439 -131729 -77397 -184099
9853 -184099 -531802 -272866 -229797 178565 -112581 -130111 122273 130558 74507 -148439 5700
9841 61662 278275 -246162 -124780 173882 -195516 -31388 75535 253484 -493917 -249713
9831 -249713 54880 126979 -238047 197120 -403120 147065 9756 137615 123684 -43671 -158190
9820 -158190 -320605 9472 -73975 -112485 -233982 144866 206568 174104 145035 -99173 247687
9808 98861 -146961 -42986 -140655 -112750 72058 -170169 -34198 -138111 -232068 183423 -384641
$$ packed form
9886b4068c679B0709b48272a00077F1222b42479F4594a6526B80403a46322B3315
9874D8165a81283N1611A63122b92428g2085j76453A24224d05617J86484J06010
9864a13123j83495B088L03086e0911R377A35982C3479R0960a31729N4332j06702
9853a84099l47703K58936M3069A78565a12581j7530A22273Q285n6051a48439E700
9841F1662K16613b46162J21382A73882a95516c1388G5535J77949d93917K44204
9831b49713E4880P2099b38047A97120d03120A47065I756J27859j3931d3671j14519
9820a58190j62415I472g3975l8510j21497A44866O1702l2464k9069i9173B47687
9808I8861a46961d2986r7669K7905G2058a70169c4198j03913r3957A83423c84641
$$ plain form
9796 -6621 -91880 -88029 30926 -213980 -121280 -106722 -2808 -113432 195480 27817 277152 -155231
9783 -298418 -24822 -368331 28713 109427 -121698 183935 193776 86850 -63514 -15527 -142416
9772 -142416 -55648 -192274 -45001 -42504 179775 -166910 -102766 -56900 -43389 -17963 81884
9760 186899 -12117 101713 -91967 -96467 -123925 -206914 -247341 107491 8926 -221251 66124
9748 -166446 178737 -111211 -182702 -126722 -509095 -38987 132194 -120485 -66034 -171449
9738 -171449 81691 86239 -69921 -176173 -135177 -313129 -317154 57872 188987 -150173 9304
9726 296778 -11715 -256561 -64344 71566 -52097 19185 159477 -23514 -217392 98696 276170
9715 276170 -252853 -174521 -29708 -53456 -262012 -55771 249279 -24682 -19862 35094 18699
$$ packed form
9796f621q5259L851C0926b13980R2700J4558b808j10624A95480B7817K49335a55231
9783b98418b4822l43509B8713Q0714a21698A83935R841H6850f3514a5527j26889
9772a42416e5648j36626d5001K497A79775a66910O4144M5866J3511a7963H1884
9760A86899a2117A01713i1967m500k7458q2989m0427A07491H926b21251F6124
9748a66446A78737a11211p1491N5980l82373c8987A32194a20485N4451j05415
9738a71449H1691M548f9921j06252M0996j77952m025E7872J31115a50173I304
9726B96778a1715k44846f4344G1566e2097A9185J40292b3514j93878I8696J77474
9715B76170b52853P8332b9708k3748k08556e5771B49279b4682M820C5094j6395
$$ plain form
9704 18699 23097 10888 -99041 -151104 -110927 1939 49341 3005 -51693 -125149 -71263 121307
9691 109531 -345180 -308205 100006 -482613 -125857 -84629 57605 -487748 -160874 56775
9680 -212015 -194878 -301592 -84785 -428311 -201150 3600 182949 -271313 -38061 -272398 -110292
9668 -220903 -60141 -144503 126109 -162918 -322608 -89987 144575 82748 -7893 -3022 -233873
9657 -233873 -213455 300098 -127729 -82411 -298258 -178153 -90898 246099 -387484 19874
9646 9828 -16655 147752 56731 -78408 -83911 -82273 -52542 -59766 159388 -109461 202662 84366
9633 -322800 -39793 -200647 -112326 -144857 -37563 -217396 -103047 243352 77589 -211928 -24101
9621 -10164 -175333 -159318 48265 -35137 203807 -20299 -96416 43154 -189863 176094 101497
$$ packed form
9704A8699M398A0888i9041n2063M0177A939M7402C005e1693p3456N3886A21307
9691A09531c45180L6975A00006d82613a25857M1228E7605d87748a60874E6775
9680b12015J7137j06714h4785l43526b01150C600J79349b71313c8061k34337a10292
9668b20903f0141q4362A26109a62918j59690h9987A44575o1827g893c022k30851
9657b33873K0418C00098a27729M5318k15847J20105Q7255B46099c87484A9874
9646I828a6655A47752E6731g8408n503J638K9731p224A59388a09461B02662H4366
9633c22800c9793j60854Q8321l2531c7563j79833a03047B43352G7589b11928b4101
9621a0164j65169J6015D8265c5137B03807b0299p6117D3154a89863A76094p4597
$$ plain form
9610 101497 179319 -16837 57225 -116321 271097 39829 111042 -423409 -37829 35049 -153813
9598 -42065 -109939 -6371 -184230 -33809 -21601 -506562 -98994 149441 -149832 81662 -184407
9586 -8851 -228215 -415963 39144 86365 318099 -34063 -15372 -176322 3527 15135 240339
9575 240339 -362789 52224 -149885 198151 -100628 35007 65792 -19056 186173 -18259 84660
9563 -228657 -361900 166314 31961 79050 11041 -55646 -105389 -204259 -138034 -221818 -309148
9552 -309148 41936 -250050 -65236 -24942 -18745 -40097 -19136 65119 -101996 -153513 -101150
9541 -101150 22869 -172702 146487 114792 -45882 28023 43957 -88168 63417 -67644 -73861
9530 -73861 177846 -43180 175166 -242349 -242746 -7654 164455 108832 -4488 -8198 150049 291041
$$ packed form
9610A01497P7822a6837E7225a16321B71097C9829P1213d23409c7829C5049a53813
9598d2065o7874f371j77859c3809J2208m84961i8994A49441a49832H1662a84407
9586h851k19364j87748C9144M7221K31734c4063a5372j60950C527J1608K25204
9575B40339c62789E2224a49885A98151a00628C5007L0785a9056A86173a8259H4660
9563b28657j33243A66314C1961M7089A1041e5646m9743r8870O6225q3784q7330
9552c09148D1936b50050f5236b4942O197k1352a9136F5119a01996n1517N2363
9541a01150B2869a72702A46487l1695d5882B8023J5934h8168F3417f7644o217
9530g3861A77846d3180A75166b42349l97g654A64455n5623d488l710A50049J40992
$$ plain form
9518 291041 -81013 -238651 -27816 -72954 -138120 281220 -143359 -89384 148253 -230397 -58774
9506 236124 -2666 -289426 -138964 -263063 -81783 -31270 -62291 -144148 -114103 -338804 6627
9494 237242 -300507 29529 -289209 314074 -307837 -259380 48951 -105786 -196111 23394 71715
9483 71715 191269 -53820 280730 26707 -181186 32228 -233538 -132161 -44051 54969 130640
9472 130640 -143661 37067 -217147 34879 238417 -350346 27592 97200 -250285 -203562 -77889
9460 -202300 75536 39378 57901 -143691 21677 116586 -61982 -1201 -95236 -294990 -194972
9449 -194972 105733 107077 74415 181790 24495 -118577 47332 -47022 -1184 -145445 -551625
9438 -551625 129610 -57351 -22492 -32589 -94719 250302 123216 226287 372871 40282 129101
$$ packed form
9518B91041h1013j57638b7816m5138o5166B81220a43359N3975A48253b30397e8774
9506B36124b666k86760a38964j24099h1783c1270l1021q1857L0045k24701F627
9494B37242c00507B9529b89209C14074c07837M8457D8951a05786r0325B3394M8321
9483G1715J19554e3820B80730B6707a81186C2228b33538J01377d4051E4969P5671
9472A30640a43661C7067b17147C4879K03538c50346B7592O9608b50285M6723g7889
9460b02300G5536l6158J8523a43691B1677R4909f1982a201r4035j99754J00018
9449a94972A05733J344l2662J07375B4495a18577D7332d7022a184j44261m06180
9438e51625A29610e7351b2492j0097o2130B50302A23216J03071J46584D0282Q8819
$$ plain form
9427 129101 -77574 -145730 -207044 -579996 -221388 -204922 7012 -116499 106367 -230663 60595
9415 243608 95883 -413780 -106417 108881 117659 4714 23820 -223877 -243920 -62971 -15280
9403 -28477 -13021 -238244 45334 383826 -12206 -36666 -15646 -25452 -122908 -55425 -352817
9392 -352817 -168272 209052 -204500 -107947 -133566 16956 476125 -132949 -218490 -102880
9381 -152336 -255870 63420 152233 -314765 -151944 172624 -144935 63468 44075 -162507
9370 -81538 -255722 316970 521234 35522 -17889 -180611 195183 -48473 193128 -62657 312551
9358 -74078 2005 -98815 -11812 -238487 -123358 -266474 -97137 -278663 -340568 -40183 -103794
9347 -103794 153909 85017 -153748 154765 436727 -7276 96179 -48453 71870 -65485 10041
$$ packed form
9427A29101g7574o8156o1314l72952b21388J6466G012a16499A06367b30663F0595
9415B43608I5883d13780a06417A08881Q778D714J9106b23877k0043f2971a5280
9403b8477a3021k25223D5334L38492a2206k4460a5646r806r7456e5425k97392
9392c52817a68272B09052b04500R6553k5619A6956M59169a32949q5541a02880
9381a52336j03534F3420Q8813c14765a51944A72624a44935F3468j9393a62507
9370h1538j74184C16970K04264C5522a7889j62722A95183d8473A93128f2657C12551
9358g4078B005i8815a1812k26675J15129j43116i7137j81526o1905d0183o3611
9347a03794A53909o8892a53748A54765K81962g276I6179d8453G1870f5485A0041
$$ plain form
9335 257813 -28455 -26093 -154684 -49880 -136425 -358068 -162465 -52256 -107465 -270758 -184635
9324 -184635 63869 -86141 -121337 -2672 237152 83211 -135569 -78781 -168179 -342115 -590530
9313 -590530 243111 104076 -223938 25090 -101066 51455 123846 164097 150678 -76225 -110979
9302 -110979 -152555 -48997 -279052 -85344 -137100 -36783 4081 -125426 15212 16772 -140179
9290 75735 607467 70768 94423 -2730 -217478 -274949 2210 111698 243996 -34186 10452
9278 -243008 37483 28554 131166 177777 -135271 -112493 41409 -39842 -278118 436684 -206859
9266 -282074 46455 -19621 -222792 10044 491693 100097 -328236 -207380 68256 -26003 93787
9254 72491 -17333 -63996 -91594 -85853 -48253 114098 -212313 -64939 -203447 -95174 14537
$$ packed form
9335B57813b8455K362j28591d9880q6545k21643a62465e2256n5209j63293Q6123
9324a84635F3869h6141l5196b672B37152H3211a35569N6788q9398j73936k48415
9313e90530B43111A04076b23938B5090a01066E1455P2391M0251j3419g6225l4754
9302a10979m1576d8997k30055h5344n1756c6783D081a25426A5212J560a40179
9290G5735N31732G0768K3655b730k14748n7471B210J09488J32298c4186A0452
9278b43008C7483q929J02612M6611a35271K2778D1409c9842k38276D36684b06859
9266b82074D6455a9621k03171A0044M81649A00097c28236J20856F8256b6003I3787
9254G2491a7333m6663k7598N741L7600A14098b12313f4939j38508i5174A4537
$$ plain form
9242 -109564 113282 -138750 -6047 -245404 100283 -119443 88069 -18315 -119270 -131171 186726
9230 -168961 -426496 38877 -104726 -199922 42500 -144703 -113578 -308076 -269633 92042 -83115
9218 -117374 -154964 36610 -43964 -271856 205549 194643 -236942 -76079 -31979 -315895 -190823
9207 -190823 -184275 -212254 15660 -42559 -29773 -338362 -74952 -412389 -200358 -372383 70932
9195 -371298 134817 -161172 -80293 -1346 -67725 -92705 214855 -225357 -89233 -305100 -85680
9183 -360210 -7831 203314 3602 233106 -168789 -73322 -41370 117699 -41066 -165358 193042
9171 -122911 -200410 43593 104241 -1654 -53608 -211416 -91488 -252944 -24146 -122562 -84252
9160 -84252 -259197 35466 -90273 -120019 -116819 -166850 -212841 162190 23938 -224488 -18656
$$ packed form
9242a09564A13282a38750f047k39357A00283a19443H8069a8315j00955j1901A86726
9230a68961k57535C8877a04726r5196D2500a44703L1125j94498L8443I2042h3115
9218a17374l7590C6610d3964k27892B05549j0906b36942g6079c1979k83916J25072
9207a90823O548k7979A5660d2559J2786l08589g4952l37437b00358j72025G0932
9195c71298A34817a61172h0293a346o6379k4980B14855b25357h9233k15867h5680
9183c60210g831B03314C602K29504a68789g3322L1952A17699d1066j24292A93042
9171a22911p7499D3593O0648a654n1954j57808i1488j61456b4146r8416L8310
9160h4252j74945C5466i0273k9746L200n0031m5991A62190B3938b24488a8656
$$ plain form
9148 -29859 -252501 -207184 -341419 20633 25916 -114402 206989 149941 -49029 -85244 -47637
9137 -47637 -97006 -55054 -117838 -335301 -163360 -191748 113389 -75222 -145672 -130540 -266738
9126 -266738 -129703 -257031 332549 -290989 -131934 202493 -47392 -111018 231764 -209499
9115 82773 253547 -113170 -256528 -266673 -49488 -292749 515479 72245 -119064 66621 -136595
9103 130036 -75927 362816 69484 -402055 62917 -93301 -10135 119873 -91253 -260790 149515
9091 -259997 73430 -137098 -180233 -239266 71151 98534 93598 61512 -96890 -273456 90717
9079 237978 -240496 -252242 -249772 -43864 338068 140271 -43768 88934 -91186 -296957 64566
9067 82600 -417414 64254 -248095 44971 103551 -164446 -235239 -94727 -84787 149720 156082
$$ packed form
9148b9859k22642M5317j34235B0633N283a14402B06989n7048d9029l6215L7607
9137d7637m9369M1952o2784k17463a63360k8388A13389g5222p0450J5132j36198
9126b66738a29703j27328C32549b90989a31934B02493d7392o3626B31764b09499
9115H2773J70774a13170j43358j0145d9488k43261E15479G2245a19064F6621a36595
9103A30036g5927C62816F9484d02055F2917i3301a0135A19873i1253j69537A49515
9091b59997G3430a37098m3135n9033G1151K7383m936l2086i6890j76566I0717
9079B37978b40496j1746K470d3864C38068A40271d3768H8934i1186k05771F4566
9067H2600d17414F4254b48095D4971N8580a64446p0793i4727R940A49720O362
$$ plain form
9056 156082 -64316 33922 -236944 -168194 72131 37465 309401 -41619 50677 42745 37251 -102704
9043 31053 -60039 4259 90940 251893 33450 -93946 -58172 169423 -9272 -155644 42205 29800
9031 29800 -65153 137397 113553 -18496 -80879 -233400 88712 -309090 59139 -231718 -119565
9020 -119565 119415 -275646 -186470 -25791 42237 -298056 -87460 -56148 107414 -127029 -113207
9009 -113207 -96602 -28510 -234638 58205 -54647 -142547 -208080 3923 -356443 -197055 -12398
8997 83556 -55246 166292 -68994 -402980 -143997 -91534 309748 -76618 -72289 -64510 -90916
8986 -90916 -137715 -126441 -7850 282300 -440804 140629 -159767 -307307 274338 135331 113293
8975 113293 -506007 287632 149563 -190957 166421 44605 139761 304625 -20318 -25536 97
$$ packed form
9056A56082f4316C3922b36944O8750G2131l4666K71936d1619E0677p932n494a02704
9043C1053f0039D259Q6681J60953C3450i3946L5774A69423i272j46372D2205j2405
9031B9800f5153A37397k3844a8496o2383j52521H8712c09090E9139b31718J12153
9020a19565A19415b75646Q9176b5791D2237b98056h7460L1312A07414a27029J3822
9009a13207J6605b8510k06128E8205e4647q7900o5533C923c56443J59388a2398
8997H3556e5246A66292f8994l33986a43997N2463C09748g6618M329P779k6406
8986i0916m6799J1274g850B82300d40804A40629a59767j47540B74338A35331k2038
8975A13293e06007B87632j38069a90957A66421D4605R5156J64864b0318n218I7
$$ plain form
8963 6680 10400 -134992 -253425 17855 8012 -43543 -186184 83179 -276351 -259822 -63258 -233547
8951 -233547 -85205 -104784 155833 -244345 -37158 -166467 -11156 -219800 -54000 -295656 126855
8939 -37616 -481493 118694 -202451 -140264 -222454 -275456 234250 -447 1297 -138984 91459
8927 119577 29175 102763 182623 665165 2999949 2784675 466468 150742 142359 151607 123842
8916 123842 -93861 69522 308045 215533 -80964 -57920 -184 303667 -255443 149092 151310
8905 151310 -26956 -81294 -75447 -278345 -121563 209317 92154 119122 -298245 155300 -167249
8893 -185913 -246762 -220201 43065 -511510 -39490 -37900 -54831 194488 115563 -29550 -184798
8882 -184798 -60677 -204894 -135051 190720 41044 180139 30622 -54366 60129 -98947 -22397
$$ packed form
8963F680L720a34992j18433A7855H012d3543j42641H3179b76351J6529f3258j70289
8951b33547h5205j9579A55833b44345c7158j29309a1156k08644e4000k41656A26855
8939c7616m43877A18694b02451O2187q2190n3002B34250d47A297a38984I1459
8927A19577B9175P3588P9860M82542K334784k15274D66468A50742q383R248k7765
8916A23842i3861F9522K38523r2512h0964K3044a84C03667b55443A49092K218
8905A51310b6956n4338N847k02898a21563B09317I2154K6968b98245A55300a67249
8893a85913o0849K6561D3065e11510c9490J590j6931A94488p8925b9550j55248
8882a84798f0677j44217O9843A90720D1044J39095C0622e4366F0129i8947b2397
$$ plain form
8870 -305648 -81503 118481 79900 3700 -46454 -160568 -44865 -118627 74739 91679 63111
8859 63111 -232753 -262504 27473 -14106 -69795 -30628 -145287 -164505 -16354 125058 10224
8847 138584 -42115 -418846 -97439 31147 144465 -359521 -137772 -199959 -70496 -237872 210188
8835 -249342 -339052 144075 -212406 -145807 275213 -131566 -66255 98274 -216624 -234198 25342
$$ packed form
8870c05648h1503A18481l8581C700d6454j14114d4865p3762G4739J6940k8568
8859F3111b32753k9751B7473a4106n5689c0628j14659j9218a6354A25058A0224
8847A38584d2115l76731i7439C1147J13318c59521a37772o2187g0496j67376B10188
8835b49342q9710A44075b12406O6599B75213a31566O5311I8274b16624j7574B5342
$$ [...]
##END NTUPLES=NMR SPECTRUM
##END=
