##TITLE=AC1752_VAR00024_9319539_HdL8ScnUwj
##JCAMPDX= 6.0         $$ Bruker NMR JCAMP-DX V2.0
##DATA TYPE= NMR SPECTRUM
##DATA CLASS= NTUPLES
##ORIGIN= BRUKER
##OWNER= Administrator
$$ 1.72 TOPSPIN		Version 2.1
$$ 2015-08-12 00:20:33.070 -0700  Administrator@X
$$ Compression mode = diff/dup
##.OBSERVE FREQUENCY= 400.02188249412
##.OBSERVE NUCLEUS= ^1H
##.ACQUISITION MODE= SIMULTANEOUS (DQD)
##.ACQUISITION SCHEME= undefined
##.AVERAGES= 64
##.DIGITISER RES= 22
##SPECTROMETER/DATA SYSTEM= spect
##.PULSE SEQUENCE= noesygpps1d.comp
##.SOLVENT NAME= COFFEE_meoh
##.SHIFT REFERENCE= INTERNAL, COFFEE_meoh, 1, 14.96021
##AUDIT TRAIL= $$ (NUMBER, WHEN, WHO, WHERE, PROCESS, VERSION, WHAT)
$$ ##TITLE= Audit trail, TOPSPIN		Version 2.1
$$ ##JCAMPDX= 5.01
$$ ##ORIGIN= Bruker BioSpin GmbH
$$ ##OWNER= Administrator
$$ $$ E:\/data/COFFEE/nmr/AC1752_VAR00024_9319539_HdL8ScnUwj/12/pdata/1/auditp.txt
$$ ##AUDIT TRAIL=  $$ (NUMBER, WHEN, WHO, WHERE, PROCESS, VERSION, WHAT)
(   1,<2015-08-12 00:20:27.851 -0700>,<Administrator>,<X>,<go>,<TOPSPIN 2.1>,
      <created by zg
	started at 2015-08-12 00:08:58.367 -0700,
	POWCHK enabled, PULCHK disabled,
       configuration hash MD5:
       21 0F 79 D6 B3 7B B4 F6 88 20 88 DB 03 48 BD 9F
       data hash MD5: 64K
       E8 8B CA DE 96 D5 DC 13 96 07 08 17 4C EA 97 08>)
(   2,<2015-08-12 00:20:30.992 -0700>,<Administrator>,<X>,<proc1d>,<TOPSPIN 2.1>,
      <Start of raw data processing
       efp LB = 0.3 FT_mod = 6 PKNL = 1 PHC0 = 0 PHC1 = 0 SI = 128K 
       data hash MD5: 128K
       B7 3E B1 A8 FB 4E 89 62 7B 0E 97 E2 EB 8A FA 43>)
(   3,<2015-08-12 00:20:31.882 -0700>,<Administrator>,<X>,<proc1d>,<TOPSPIN 2.1>,
      <pk PHC0 = -89.46716 PHC1 = 0 
       data hash MD5: 128K
       F7 61 BF E5 C7 5A 9F 0F 07 EC B0 E6 3C EE C7 AA>)
(   4,<2015-08-12 00:20:32.257 -0700>,<Administrator>,<X>,<proc1d>,<TOPSPIN 2.1>,
      <abs ABSG = 1 
       data hash MD5: 128K
       6A 62 3F 1F 38 63 46 B8 83 15 DA DF 36 2E 5D 53>)
(   5,<2015-08-12 00:20:32.367 -0700>,<Administrator>,<X>,<proc1d>,<TOPSPIN 2.1>,
      <abs ABSG = 2 
       data hash MD5: 128K
       19 88 22 B2 E9 01 A2 69 39 B6 22 5D EE EF 96 FE>)
(   6,<2015-08-12 00:20:32.445 -0700>,<Administrator>,<X>,<proc1d>,<TOPSPIN 2.1>,
      <abs ABSG = 3 
       data hash MD5: 128K
       AE DD 98 A2 E2 6F D7 5E 9B CB 9D 14 90 BC 4C 1E>)
(   7,<2015-08-12 00:20:32.539 -0700>,<Administrator>,<X>,<proc1d>,<TOPSPIN 2.1>,
      <abs ABSG = 4 
       data hash MD5: 128K
       1D A0 06 CD 8E D6 39 EE ED 21 3C 75 A6 1F 82 45>)
(   8,<2015-08-12 00:20:32.617 -0700>,<Administrator>,<X>,<proc1d>,<TOPSPIN 2.1>,
      <abs ABSG = 5 
       data hash MD5: 128K
       B1 8A BB 6F D9 1C 21 7C F8 19 8E 7C 7C 7C 2E A4>)
$$ ##END=
$$ 
$$ $$ hash MD5
$$ $$ 4C 92 C1 D9 DA AD 82 4A 11 F7 8A 20 44 43 FD 02
##$RELAX= 
##$RELAX= 
##$RELAX= 
##$RELAX= 
##$RELAX= 
##$RELAX= 
##$RELAX= 
##$RELAX= 
$$ Bruker specific parameters
$$ --------------------------
##$DU= <E:\>
##$EXPNO= 12
$$ [...]
##$TP07= 0
##$TPNAME0= <>
##$TPNAME1= <>
##$TPNAME2= <>
##$TPNAME3= <>
##$TPNAME4= <>
##$TPNAME5= <>
##$TPNAME6= <>
##$TPNAME7= <>
##$TPOAL= (0..7)
0.5 0.5 0.5 0.5 0.5 0.5 0.5 0.5
##$TPOFFS= (0..7)
0 0 0 0 0 0 0 0
##$TUNHIN= 0
##$TUNHOUT= 0
##$TUNXOUT= 0
##$USERA1= <user>
##$USERA2= <user>
##$USERA3= <user>
##$USERA4= <user>
##$USERA5= <user>
##$V9= 5
##$VALIST= <valist>
##$VCLIST= <CCCCCCCCCCCCCCC>
##$VD= 0
##$VDLIST= <DDDDDDDDDDDDDDD>
##$VPLIST= <PPPPPPPPPPPPPPP>
##$VTLIST= <TTTTTTTTTTTTTTT>
##$WBST= 2048
##$WBSW= 25
##$XGAIN= (0..3)
0 0 0 0
##$XL= 0
##$YL= 0
##$YMAX_a= 5666746
##$YMIN_a= -10757376
##$ZGOPTNS= <>
##$ZL1= 120
##$ZL2= 120
##$ZL3= 120
##$ZL4= 120
##$ABSF1= 14.96021
##$ABSF2= -5.597972
##$ABSG= 5
##$ABSL= 3
##$ALPHA= 0
##$AQORDER= 0
##$ASSFAC= 0
##$ASSFACI= 0
##$ASSFACX= 0
##$ASSWID= 0
##$AUNMP= <proc_prof1d_extract.lims>
##$AXLEFT= 0
##$AXNAME= <>
##$AXNUC= <1H>
##$AXRIGHT= 0
##$AXTYPE= 0
##$AXUNIT= <>
##$AZFE= 0.1
##$AZFW= 0.1
##$BCFW= 0
##$BC_mod= 0
##$BYTORDP= 0
##$COROFFS= 0
##$CY= 15
##$DATMOD= 1
##$DC= 0
##$DFILT= <>
##$DTYPP= 0
##$F1P= 0
##$F2P= 0
##$FCOR= 0.5
##$FTSIZE= 131072
##$FT_mod= 6
##$GAMMA= 0
##$GB= 0
##$INTBC= 1
##$INTSCL= 1
##$ISEN= 128
##$LB= 0.3
##$LEV0= 0
##$LPBIN= 0
##$MAXI= 10000
##$MC2= 0
##$MEAN= 0
##$ME_mod= 0
##$MI= 0
##$NCOEF= 0
##$NC_proc= -2
##$NLEV= 6
##$NOISF1= 0
##$NOISF2= 0
##$NSP= 0
##$NTH_PI= 0
##$NZP= 0
##$OFFSET= 14.96021
##$PC= 1
##$PHC0= -89.46716
##$PHC1= 0
##$PH_mod= 1
##$PKNL= yes
##$PPARMOD= 0
##$PPDIAG= 0
##$PPIPTYP= 0
##$PPMPNUM= 2147483647
##$PPRESOL= 1
##$PSCAL= 4
##$PSIGN= 0
##$PYNMP= <proc.py>
##$REVERSE= no
##$SF= 400.020009951423
##$SI= 131072
##$SIGF1= 0
##$SIGF2= 0
##$SINO= 400
##$SIOLD= 131072
##$SPECTYP= <>
##$SREGLST= <1H.CDCl3>
##$SSB= 0
##$STSI= 131072
##$STSR= 0
##$SW_p= 8223.68421052631
##$SYMM= 0
##$S_DEV= 0
##$TDeff= 65536
##$TDoff= 0
##$TI= <>
##$TILT= no
##$TM1= 0
##$TM2= 0
##$TOPLEV= 0
##$USERP1= <user>
##$USERP2= <user>
##$USERP3= <user>
##$USERP4= <user>
##$USERP5= <user>
##$WDW= 1
##$XDIM= 131072
##$YMAX_p= 355628388
##$YMIN_p= -10690
##$CURPLOT= <Network HP LaserJet P1505>
##$CURPRIN= <$Network HP LaserJet P1505>
##$DFORMAT= <normdp>
##$LAYOUT= <+/1D_H.xwp>
##$LFORMAT= <normlp>
##$PFORMAT= <normpl>
##$SURQMSG= 1
$$ End of Bruker specific parameters
$$ ---------------------------------
##NTUPLES= NMR SPECTRUM
##VAR_NAME=  FREQUENCY,     SPECTRUM/REAL,   SPECTRUM/IMAG
##SYMBOL=    X,             R,               I
##VAR_TYPE=  INDEPENDENT,   DEPENDENT,       DEPENDENT
##VAR_FORM=  AFFN,          ASDF,            ASDF
##VAR_DIM=   131072,        131072,          131072
##UNITS=     HZ,            ARBITRARY UNITS, ARBITRARY UNITS
##FACTOR=    0.0627417313425164, 1,          1
##FIRST=     8223.62146879497, 773,          -52307
##LAST=      0,             2282,            -52886
##MIN=       0,             -10690,          0
##MAX=       8223.62146879497, 355628388,    0
$$ Real data points
##PAGE= N=1
##DATA TABLE= (X++(R..R)), XYDATA
$$ [...]
63906A223336r1879p9160o8425n9636n1988m4742l7813l1686k6774k2880j9489
63895F88864j6523j4433j3404j2885j2249j1485j0836j0124q968p448n926m351
63883E60232k313J86K604M616O457Q381J0178J1512J2398J3083J3760J4633J6005
63870F71732J8039K0472K2801K4657K5952K6741K7082K6951K6240K4888K3061
63859I38616K1025J8874J6470J3666J0375O532K265j941n591q772j2091j5858
63847I83570j9703k3126k6092k8790l1130l2829l3868l4430l4497l3876l2606
63836F52623l1080k9639k8338k7071k5801k4542k3268k1897k0348j8582j6703
63825C85354j4910j3298j1862j0755j0257j0275j0060q934p236o054n843n870
$$ plain form
63906 1223336 1131457 1052297 983872 924236 872248 827506 789693 758007 731233 708353 688864
63895 688864 672341 657908 644504 631619 619370 607885 597049 586925 577957 570509 564583 560232
63883 560232 557919 558105 560709 565325 571782 580163 590341 601853 614251 627334 641094 655727 671732
63870 671732 689771 710243 733044 757701 783653 810394 837476 864427 890667 915555 938616
63859 938616 959641 978515 994985 1008651 1019026 1025558 1027823 1025882 1020291 1011519 999428 983570
63847 983570 963867 940741 914649 885859 854729 821900 788032 753602 719105 685229 652623
63836 652623 621543 591904 563566 536495 510694 486152 462884 440987 420639 402057 385354
63825 385354 370444 357146 345284 334529 324272 313997 303937 295003 287767 281713 275870 270000
63813B70000n268m194l460l263k966k139j236j001j570k468l146l274k745j793
63799B31477j006q45j160j449j523j588j717j664j320j003j083j561k176k687
63785B10695k868k492j632p95m82o73r46r96q38o21m81m66m47j84K96N63K47m57
63767A97423j049j316j337j109n52J15M53L22j3k71l40j07M92J160J347Q63K7
63750A96108p47j224j204n90K83Q83J133J420J799J847J511J448K033K698K816
63735B10214K699K941L318L173K640K502K916L281L408L836M601M794L927K969
63721B57219L133M125M512L636K266J304P05Rp43j201j448j957k796l397l229
63706B62138k417j503q74o10o55q17p21j75M55O20M16O12J576K687L200L336L881
$$ plain form
63813 270000 264732 260538 257078 253815 250849 248710 247474 246473 244903 242435 239289 236015 233270 231477
63799 231477 230471 229626 228466 227017 225494 223906 222189 220525 219205 218202 217119 215558 213382 210695
63785 210695 207827 205335 203703 202908 202426 201753 200807 199811 198973 198352 197871 197405 196958 196774 197070 197633 197880 197423
63767 197423 196374 195058 193721 192612 192060 192175 192628 192950 192937 192666 192326 192219 192711 193871 195218 196081 196108
63750 196108 195361 194137 192933 192343 192626 193509 194642 196062 197861 199708 201219 202667 204700 207398 210214
63735 210214 212913 215854 219172 222345 224985 227487 230403 233684 237092 240928 245529 250323 254250 257219
63721 257219 260352 264477 268989 272625 274891 276195 276900 276909 276166 274965 273517 271560 268764 265367 262138
63706 262138 259721 258218 257344 256734 256079 255262 254541 254366 254821 255441 255857 256469 258045 260732 263932 267268 271149
63689B71149M845N296M677L595K975K902K775K281J629J005L36l30o75n20l9N27
63673C02428J114J561J481P63pj17L65O54L12k65o60j227k505m126n066n013m829
63656B84863n327o123o225n344m114l116k329j520p21n6M97R97J352J513J662
63641B56009K066K761L528M099M356M367M330M443M808N387N967O210N973N661
63627C19965N959P041Q242Q858R091R774J1252J2973J4305J5329J6665J8679K1064
63614D79197K3116K4417K5320K6633K8663L0768L2143L2718L2707L1586K8390
63603G95658K3116J6966J0914M886j197o392r542j0616j0524j0047r648r900j1134
63590G72540j2855j4386j6055j8798k2519k5747k7216k7009k5830k3985k1581
$$ plain form
63689 271149 275994 281290 285967 289562 292537 295439 298214 300495 302124 303129 303465 303135 302460 301940 301901 302428
63673 302428 303542 305103 306584 307347 307340 307223 307588 308242 308554 308289 307629 306402 303897 299771 294705 289692 284863
63656 284863 279536 273413 267188 261844 257730 254614 252285 250765 250044 249988 250485 251482 252834 254347 256009
63641 256009 258075 260836 264364 268463 272819 277186 281516 285959 290767 296154 302121 308331 314304 319965
63627 319965 325924 332965 341207 350065 359156 368930 380182 393155 407460 422789 439454 458133 479197
63614 479197 502313 526730 552050 578683 607346 638114 670257 702975 735682 767268 795658
63603 795658 818774 835740 846654 851540 850343 843951 834409 823793 813269 803222 793574 783674 772540
63590 772540 759685 745299 729244 710446 687927 662180 634964 607955 582125 558140 536559
63579E36559j9072j6887j4854j2613j0357q538p053n279k943m51J699L441M974
63566D48626O357P497Q379R164J0052J1034J1822J2130J2114J2385J3433J5184
63554E78177J7245J9452K1965K4938K8371L2219L6360M0407M3709M5456M4669
63543I32968M0249L1651J9771O939m361j2808j8301k1051k1147j9063j6091j3761
63531I04995j2789j2891j3621j5150j7959k2071k6799l1171l4331l5716l5283
63520F47214l3709l1939l0291k8282k5488k2374j9858j8258j7073j5782j4358
63509C89802j2920j1351r569p892o721n972n181m165l248k796k807l040l289l355
63495C07496l023k299j468p37Q9J243K465L142K966K189J282O99Q61J861L090
$$ plain form
63579 536559 517487 500600 485746 473133 462776 454238 447185 441906 438963 438512 440211 443652 448626
63566 448626 454983 462480 470859 480023 490075 501109 512931 525061 537175 549560 562993 578177
63554 578177 595422 614874 636839 661777 690148 722367 758727 799134 842843 888299 932968
63543 932968 973217 1004868 1024639 1031578 1027217 1014409 996108 975057 953910 934847 918756 904995
63531 904995 892206 879315 865694 850544 832585 810514 783715 752544 718213 682497 647214
63520 647214 613505 581566 551275 522993 497505 475131 455273 437015 419942 404160 389802
63509 389802 376882 365531 355962 348070 341349 335377 330196 326031 322783 319987 317180 314140 310851 307496
63495 307496 304473 302174 300706 299969 300058 301301 303766 306908 309874 312063 313345 314044 314905 316766 319856
63480C19856L687L589L600M095M254L218J482L20L2l26j411k722l524l837m019
63465C28294m007l562k869k277j697q40J47Q14J138J555K231K781K809K387J944
63450C28848J905K575L998N808P438Q656R731J0986J2381J3716J5073J6866J9467
63437D57448K2904K6860L0859L4326L6591L6947L4871L0349K4002J6952J0495
63426G62604N743L308L163M859P942J2101J6966K1969K6616L0718L4192L6571
63414I66752L6926L4378K8752K0851J2031L471m172j0402j4512j6012j5453j4341
63402A028269j4000j4759j6362j8726k1917k5634k9233l2221l4416l5736l6132
63391G49133l5617l4204l1895k8995k6180k3891k1826j9430j6674j3996j1536
$$ plain form
63480 319856 323543 327132 330732 334827 339081 342299 343781 344101 344133 343807 342396 339674 336150 332313 328294
63465 328294 324287 320725 317856 315579 313882 313042 313189 314003 315141 316696 318927 321708 324517 326904 328848
63450 328848 330753 333328 337326 343134 350572 359228 368959 379945 392326 406042 421115 437981 457448
63437 457448 480352 507212 538071 572397 608988 645935 680806 711155 735157 752109 762604
63426 762604 768347 771655 774818 779677 787619 799720 816686 838655 865271 895989 930181 966752
63414 966752 1003678 1038056 1066808 1087659 1099690 1103161 1098989 1088587 1074075 1058063 1042610 1028269
63402 1028269 1014269 999510 983148 964422 942505 916871 887638 855417 821001 785265 749133
63391 749133 713516 679312 647417 618422 592242 568351 546525 527095 510421 496425 484889
63380D84889r047o489m216k435q82Q50K945N345P783R772J1027J1924J3205J5184
63366E39855J7524J9866K2146K4361K6472K8661L1216L3979L6374L8122L9370
63355H57946L9995L9348L6961L2947K7411K0164J1538K939m148r358j3130j5559
63343A027054j6342j5700j4634j4122j4573j6026j8448k1634k5167k8553l1335
63332H10520l3170l4009l4020l3145l0931k7200k2599j8107j4161j0568p043l477
63320E42090j0K538K616p91o758j2855j7134j9320k0133k0221j9890j9200j7921
63307C93011j5816j3237j1051r706q738p481n907m557l854l770l937l924l571
63294B97462l166k995k836k226j303p90j011j474j694j873k366k880k769j809
$$ plain form
63380 484889 475842 469353 465137 462702 461820 462670 465615 470960 478743 488515 499542 511466 524671 539855
63366 539855 557379 577245 599391 623752 650224 678885 710101 744080 780454 818576 857946
63355 857946 897941 937289 974250 1007197 1034608 1054772 1066310 1069249 1065101 1055743 1042613 1027054
63343 1027054 1010712 995012 980378 966256 951683 935657 917209 895575 870408 841855 810520
63332 810520 777350 743341 709321 676176 645245 618045 595446 577339 563178 552610 545567 542090
63320 542090 542080 544618 547234 546443 539685 526830 509696 490376 470243 450022 430132 410932 393011
63307 393011 377195 363958 352907 343201 334463 326982 321075 316518 312664 308894 304957 301033 297462
63294 297462 294296 291301 288465 286239 284936 284146 283135 281661 279967 278094 275728 272848 270079 268270
63280B68270l83R20J522J117J41l92j0N71M43j73k50N55J458J680J293Q86Q31
63263B78479J201J900K697L361L927M494M781M284L076K020J922K727L791M661
63249C23321N301N770O084O304O527O805P178P738Q534R551J0854J2535J4382
63236D30884J5824J6497J6716J7079J7702J8203J8418J8644J9054J9277J8901
63225F27199J8162J7727J7951J8627J9453K0323K1103K1478K1177K0161J8462
63214H41823J6125J3393J0607P618L702j471p034j1651j4940j7616k0151k2067
63202G98338k2681k2028k0592j8699j6563j4492j2467r876o320k372J095M181
63190F57524P710J1768J5407J8078K0472K3346K6191K7944K8625K9380L0858L2310
$$ plain form
63280 268270 267887 268807 270329 271446 271587 271195 271185 271756 272199 272026 271776 272331 273789 275469 276762 277648 278479
63263 278479 279680 281580 284277 287638 291565 296059 300840 305124 308200 310220 312142 314869 318660 323321
63249 323321 328622 334392 340476 346780 353307 360112 367290 375028 383562 393113 403967 416502 430884
63236 430884 446708 463205 479921 497000 514702 532905 551323 569967 589021 608298 627199
63225 627199 645361 663088 681039 699666 719119 739442 760545 782023 803200 823361 841823
63214 841823 857948 871341 881948 889566 893268 891797 884763 873112 858172 840556 820405 798338
63202 798338 775657 753629 733037 714338 697775 683283 670816 660940 654620 652248 653343 657524
63190 657524 665234 677002 692409 710487 730959 754305 780496 808440 837065 866445 897303 929613
63178I29613L2638L1779L0682L0156L0137L0000K9232K7746K5703K3122J9715
63167A240523J5136R408K936l980j1442j9541k7730l5023m0825m5290m8660n0680
63155I84832n0998m9872m7991m5740m3082m0135l7225l4250l0660k6458k2630
63144E55791k0003j8057j5629j2612j0184r221r158q758p548o000m642l473k305
63131D28201j303q66j032j167n43Q07K036K505K483K605K887K882K583K539K932
63116D47549L265L159K940L015L159K916K405K172K420K774K810K440J829J248
63102D84101R39R24J011J115J387J827K091J940J611J423J296J090J035J256J191
63087E04237K59j029j504r30k84j79J3R21J932K084J699J996L332M792N593O059
$$ plain form
63178 929613 962251 994030 1024712 1054868 1085005 1115005 1144237 1171983 1197686 1220808 1240523
63167 1240523 1255659 1265067 1268003 1264023 1252581 1233040 1205310 1170287 1129462 1084172 1035512 984832
63155 984832 933834 883962 835971 790231 747149 707014 669789 635539 604879 578421 555791
63144 555791 535788 517731 502102 489490 479306 470085 460927 452169 444621 438621 433979 430506 428201
63131 428201 426898 426032 425000 423833 423290 424097 426133 428638 431121 433726 436613 439495 442078 444617 447549
63116 447549 450814 453973 456913 459928 463087 466003 468408 470580 473000 475774 478584 481024 482853 484101
63102 484101 485040 485964 486975 488090 489477 491304 493395 495335 496946 498369 499665 500755 501790 503046 504237
63087 504237 504496 503467 501963 501033 500749 500570 500583 501504 503436 505520 507219 509215 512547 517339 522932 528991
63071E28991O805P696Q211Q405Q884R959J1346J2712J4155J5972J8167K0392K2266
63058F93961K3700K4978K6596K8942L1982L5197L7955M0042M1831M3784M5796
63047A074764M7227M7651M7442M7366M7683M7994M7998M8048M8616M9474M9849
63036A604112M9433M8754M8215M7148M4275L9059L2081K4074J5145N223n206j5383
63024A936930k5050l4327m2821m9472n3552n5393n5747n4777n2109m7712m2213
63013A423757l6188k9528k1788j3031m143L846J0720J7244K4307L1905L9130M5072
63001A491303M9490N2597N4596N5672N6231N6725N7297N7792N8053N7985N7464
62990B105205N6440N5029N3109M9887M4319L6098K5868J4452K164j0911k4410
$$ plain form
63071 528991 535796 543492 551703 560108 568992 578951 590297 603009 617164 633136 651303 671695 693961
63058 693961 717661 742639 769235 798177 830159 865356 903311 943353 985184 1028968 1074764
63047 1074764 1121991 1169642 1217084 1264450 1312133 1360127 1408125 1456173 1504789 1554263 1604112
63036 1604112 1653545 1702299 1750514 1797662 1841937 1880996 1913077 1937151 1952296 1957519 1952313 1936930
63024 1936930 1911880 1877553 1834732 1785260 1731708 1676315 1620568 1565791 1513682 1465970 1423757
63013 1423757 1387569 1358041 1336253 1323222 1319079 1322925 1333645 1350889 1375196 1407101 1446231 1491303
63001 1491303 1540793 1593390 1647986 1703658 1759889 1816614 1873911 1931703 1989756 2047741 2105205
62990 2105205 2161645 2216674 2269783 2319670 2363989 2400087 2425955 2440407 2442571 2431660 2407250
62979B407250l7841n0961o3601p5196q4866r1969r6337r8064r7375r4735r0789
62968A525516q5982q0405p4137o7562o1237n5448n0129m5174m0688l6802l3422
62957H94530l0370k7711k5711k4325k3057k1627k0486k0194k0341j9706j7744
62946F43258j5405j4043j3866j3932j3477j2619j1781j1028j0214r382q666q000
62934E00845p208o332n665n447n563n536m865l565k309j799j957k010j454o10
62920D46525o2J24L11N45L83m93j732k590k685k354k264k689l202l141k360j377
62904D22939p93p26r06j166j528j892j908j346m62J69J69l42r34j220j016l57
62888D08681M44Q36M90k16m85k4N98P63O53P93J130J154Q84R41J442J608R02q0
$$ plain form
62979 2407250 2369409 2318448 2254847 2179651 2094785 2002816 1906479 1808415 1711040 1616305 1525516
62968 1525516 1439534 1359129 1284992 1217430 1156193 1100745 1050616 1005442 964754 927952 894530
62957 894530 864160 836449 810738 786413 763356 741729 721243 701049 680708 661002 643258
62946 643258 627853 613810 599944 586012 572535 559916 548135 537107 526893 517511 508845 500845
62934 500845 493637 487305 481640 476193 470630 465094 460229 456664 454355 452556 450599 448589 447135 446525
62920 446525 446463 446587 446898 447443 447826 447333 445601 443011 440326 437972 435708 433019 429817 426676 424316 422939
62904 422939 422146 421420 420514 419348 417820 415928 414020 412674 412212 412381 412550 412208 411274 410054 409038 408681
62888 408681 409125 409961 410451 410235 409750 409726 410324 411087 411740 412533 413663 414817 415701 416642 418084 419692 420594 420514
62870D20514m46j99k4j63k95k96l92n94o69o49q15j032p31K24J224J671J650J579
62852D20557J596J588J503J384J350J631K257K677K176Q57k95o18m62m36n32m82
62836D34751m30o22q55q83r70j420j831j582q19j76L11J117K153K733K703K702
62820D36882L014L072K520J956K005K364K420K306K551L065L246K955K669K777
62806D73802L251L949M747N382N683N963O705P834Q756R185R453J0005J0954J2268
62792E77937J3874J5494J6841J8316K1002K5497L1021L6115M0118M3598M7443
62781H87256N1987N7068O2402O7540P1748P4358P5368P5326P4457P2081O7126
62770A636717N9191M8871L7180K4836J2134q53j3998k6885l8669m8561n6466o2898
$$ plain form
62870 420514 420068 419869 419845 419682 419387 419091 418699 418105 417436 416787 415972 414940 414209 414433 415657 417328 418978 420557
62852 420557 422153 423741 425244 426628 427978 429609 431866 434543 436719 437576 437281 436663 436201 435765 435233 434751
62836 434751 434321 433699 432844 431961 430991 429571 427740 426158 425339 425163 425474 426591 428744 431477 434180 436882
62820 436882 439896 442968 445488 447444 449449 451813 454233 456539 459090 462155 465401 468356 471025 473802
62806 473802 477053 481002 485749 491131 496814 502777 509482 517316 526072 535257 544710 554715 565669 577937
62792 577937 591811 607305 624146 642462 663464 688961 719982 756097 796215 839813 887256
62781 887256 939243 996311 1058713 1126253 1198001 1272359 1347727 1423053 1497510 1569591 1636717
62770 1636717 1695908 1744779 1781959 1806795 1818929 1818076 1804078 1777193 1738524 1689963 1633497 1570599
62758A570599o8062p1410p2423p1456o9460o7058o4335o1252n7783n3828m9414
62747H64118m4983m1004l7416l3887l0402k7090k3655j9800j6138j3761j2722
62736E63260j1830j0260q504p276o318m996l362j842l96J078K056K086J918K828
62722E18442M826O539P136P437Q755J1330J4385J7120J9204K0681K1927K3619
62710F81401K6347L0266L5169M0609M6000N0937N5666O0982O7462P4967Q2886
62699A252692R0501R7162J02480J06546J09606J11429J11318J08744J03501R5203
62689B289182Q3351O8139N0606L1594J1233j0063l0868m9749o6544q1787r5155
62678B199939j05420j11778j14470j14117j11337j06975j01909r6356r0004q3013
$$ plain form
62758 1570599 1502537 1431127 1358704 1287248 1217788 1150730 1086395 1025143 967360 913532 864118
62747 864118 819135 778131 740715 706828 676426 649336 625681 605881 589743 575982 563260
62736 563260 551430 541170 532666 525390 519072 514076 510714 508872 508476 509554 511610 513696 515614 518442
62722 518442 523268 529807 536943 544380 553135 564465 578850 595970 615174 635855 657782 681401
62710 681401 707748 738014 773183 813792 859792 910729 966395 1027377 1094839 1169806 1252692
62699 1252692 1343193 1440355 1542835 1649381 1758987 1870416 1981734 2090478 2193979 2289182
62689 2289182 2372533 2440672 2491278 2522872 2534105 2524042 2493174 2443425 2376881 2295094 2199939
62678 2199939 2094519 1982741 1868271 1754154 1642817 1535842 1433933 1337577 1247573 1164560
62668A164560p6181o9935o3891n7753n1919m6782m2107l7616l3593l0247k7053
62657F27483k3516k0157j7887j6572j5193j3405j1988j1505j1341j0598r293q139
62645D57889p465o922o112n011l833k839k270k126j971j239N9J159J202R6j373
62630D19244k294k416k154j955j828j541j085o77l88n4M41R57J333J589J829K119
62614D13120K539L220M163N144N950O589P206P834Q377Q815R368J0439J2319J4799
62600E19882J7164J8925K0503K2806K6045K9381L2024L4099L6057L7660L8176
62589H32722L7287L5159L1765K6879K0777J4271P833J277n566j2327j8501k3818
62577I47758k8055l0972l2756l4037l5089l5455l4700l3100l1173k8991k6452
$$ plain form
62668 1164560 1088379 1018444 954553 896800 844881 798099 755992 718376 684783 654536 627483
62657 627483 603967 583810 565923 549351 534158 520753 508765 497260 485919 475321 466028 457889
62645 457889 450424 443502 437390 432379 428546 425707 423437 421311 419340 418101 418160 419319 420521 420617 419244
62630 419244 416950 414534 412380 410425 408597 407056 405971 405294 404906 404852 405293 406250 407583 409172 411001 413120
62614 413120 415659 418879 423042 428186 434136 440725 447931 455765 464142 472957 482325 492764 505083 519882
62600 519882 537046 555971 576474 599280 625325 654706 686730 720829 756886 794546 832722
62589 832722 870009 905168 936933 963812 984589 998860 1006693 1007970 1002404 990077 971576 947758
62577 947758 919703 888731 855975 821938 786849 751394 716694 683594 652421 623430 596978
62566E96978k3874k1750k0061j8345j6314j3994j1454q882o726n323m505l946
62554D41804l683l820m032l887l465l072k588j732p87k39J01P73J548J669J350
62539D19940J820L441M779M368K636J283J279K261L546M814O023P344R200J1799
62525D84533J4675J7202J9411K1836K4694K7749L0936L4508L8560M2940M7633
62514H04677N2646N7428O0951O2699O3183O3095O2239N9606N4407M6753L7393
62503A425077K7080J6242N166n737j5904k4796l1994l7199m0322m1600m1387l9821
62491A194805l6846l2538k7155k0832j3655o134Q58O910J2461J8039K3468K8265
62479A147646L2424L6166L9039L9864L7649L2288K4479J5395O298k089r986j8075
$$ plain form
62566 596978 573104 551354 531293 512948 496634 482640 471186 462304 455578 450255 445750 441804
62554 441804 438121 434301 430269 426382 422917 419845 417257 415525 414738 414499 414600 415373 416921 418590 419940
62539 419940 421760 425201 429980 434348 436984 438267 439546 441807 445353 450167 456190 463534 472734 484533
62525 484533 499208 516410 535821 557657 582351 610100 641036 675544 714104 757044 804677
62514 804677 857323 914751 975702 1038401 1101584 1164679 1226918 1286524 1340931 1387684 1425077
62503 1425077 1452157 1468399 1473565 1467828 1451924 1427128 1395134 1357935 1317613 1276013 1234626 1194805
62491 1194805 1157959 1125421 1098266 1077434 1063779 1057645 1058503 1065413 1077874 1095913 1119381 1147646
62479 1147646 1180070 1216236 1255275 1295139 1332788 1365076 1389555 1404950 1411248 1409159 1399173 1381098
62467A381098k6648l5403m3768n0954n5975n8365n8884n8858n8654n7415n4481
62456H21693n0408m6178m1968l7304l2115k7060k2809j9400j6357j3318j0403
62445E04373p957o047m312k481p90L62J042J640K205K368J993J384P73k8j209
62430D93316k626m067n493o779p572p670p312o888o568o449o659p070p162o566
62416D04435n525m548l758k915j971j314j343j957k520k380j580q84r19j315j149
62401C70357k30N44L11o94j487j401m92P86J891K429K417K253K229K237K146K161
62385C85457K523L129L652L898L852L690L858M740O005O800O916P197Q278R543
62371D59538J0065J0152J0975J2851J4854J6266J7499J9338K2026K5415K9438
$$ plain form
62467 1381098 1354450 1319047 1275279 1224325 1168350 1109985 1051101 992243 933589 876174 821693
62456 821693 771285 725107 683139 645835 613720 586660 563851 544451 528094 514776 504373
62445 504373 496416 490369 486057 483576 482786 483148 484190 485830 488035 490403 492396 493780 494553 494525 493316
62430 493316 490690 486623 481130 474351 466779 459109 451797 444909 438341 431892 425233 418163 411001 404435
62416 404435 398910 394362 390604 387689 385718 384404 383061 381104 378584 376204 374624 373740 372821 371506 370357
62401 370357 370127 370671 370982 370288 368801 367400 366908 367694 369585 372014 374431 376684 378913 381150 383296 385457
62385 385457 387980 391109 394761 398659 402511 406201 410059 414799 420804 427604 434520 441717 449995 459538
62371 459538 469603 479755 490730 503581 518435 534701 552200 571538 593564 618979 648417
62360F48417L3928L8477M2843M7211N1681N5774N8752O0210O0019N7887N3326
62349A208525M6178L7013K6959J7057P642j528j0453j8418k4714k9597l3968l8147
62337A186549m1566m3789m5115m5822m5478m3584m0459l6920l3360k9738k6203
62326G54515k3108k0454j7968j5797j4611j4774j5819j6938j7721j8202j8449
62315E60674j8364j7768j6568j4898j3094j1450j0006q728p766p246o857o065
62303D21864m830l699l019k452j635q58p09j138j446j143l89M10J053J484J702
62288D05195J894K360L127L829M183M274M289M202L983L807L890M221M667N166
62274D59087N603N782N776O087P118Q692J0399J2229J4467J7106J9835K2588K5662
$$ plain form
62360 648417 682345 720822 763665 810876 862557 918331 977083 1037293 1097312 1155199 1208525
62349 1208525 1254703 1291716 1318675 1335732 1343374 1341846 1331393 1312975 1288261 1258664 1224696 1186549
62337 1186549 1144983 1101194 1056079 1010257 964779 921195 880736 843816 810456 780718 754515
62326 754515 731407 710953 692985 677188 662577 647803 631984 615046 597325 579123 560674
62315 560674 542310 524542 507974 493076 479982 468532 458526 449798 442032 434786 427929 421864
62303 421864 417034 413335 410316 407864 406229 405371 404662 403524 402078 400935 400546 400956 402009 403493 405195
62288 405195 407089 409449 412576 416405 420588 424862 429151 433353 437336 441143 445033 449254 453921 459087
62274 459087 464690 470472 476248 482335 489453 498145 508544 520773 535240 552346 572181 594769 620431
62261F20431K9279L3333L7638M2122M6736N1368N5770N9327O1177O0975N9368
62250A157524N7004N3292M6842L7287K5955J4570L970n659j4160k1657k8812l6121
62238A290035m3214m9303n4020n7313n8995n8983n7732n5778n3029m9050m3987
62227G08631l8668l3832k9723k6316k3442k0716j7813j4933j2574j0887r591q520
62215D61616p793p370o845n890m659l598l005k763k422j624n35L19Q15J536L013
62200D20795M868O193O602O586O887P864R327J0715J1495J1811J2485J4048J5913
62187E45589J6986J6895J6116J5138J4044J2857J1597J0001P747N114K907J672
62175F76663J351J685K498L663N343Q143J2426J7522K2341K6752L1456L6490M0774
$$ plain form
62261 620431 649710 683043 720681 762803 809539 860907 916677 976004 1037181 1098156 1157524
62250 1157524 1214528 1267820 1314662 1351949 1377904 1392474 1396444 1390785 1376625 1354968 1326156 1290035
62238 1290035 1246821 1197518 1143498 1086185 1027190 968207 910475 854697 801668 752618 708631
62227 708631 669963 636131 606408 580092 556650 535934 518121 503188 490614 479727 470136 461616
62215 461616 453823 446453 439608 433718 429059 425461 422456 419693 417271 415647 415112 415431 416246 417782 420795
62200 420795 425663 431856 438458 445044 451931 459795 469122 479837 491332 503143 515628 529676 545589
62187 545589 562575 579470 595586 610724 624768 637625 649222 659223 666970 672084 674991 676663
62175 676663 678014 679699 682197 685860 691203 699346 711772 729294 751635 778387 809843 846333 887107
62162H87107M3474M4763M4681M2292L6863K9314K1454J4101O780q40q124j4187
62150A147678j8936k3043k7173l1373l5116l7830l9327l9616l8526l5957l2454
62139G88327k8979k5887k2697j9141j5804j3246j1085q635o065m150l059k135
62127F27444r39J63O95Q27J222K428M499O992R086R976R331P447N005K714J068
62112F87958J43l61p92j255j730k377l488n196p300r360j0811j1109r982p646
62098F16694m665j611J182L525N287O417P096P665Q281Q802R196R898J1307J2967
62084G02041J3886J3903J4045J5058J6407J7388J8535K0704K3364K5162K5991
62073I06484K6975K8309K8763K7837K6780K6661K6847K6549K6599K8150L0481
$$ plain form
62162 887107 930581 975344 1020025 1062317 1099180 1128494 1149948 1164049 1170829 1169989 1161865 1147678
62150 1147678 1128742 1105699 1078526 1047153 1012037 974207 934880 895264 856738 820781 788327
62139 788327 759348 733461 710764 691623 675819 662573 651488 642853 636788 632638 629579 627444
62127 627444 626505 626668 627363 628190 629412 631840 636339 643331 652417 662393 671724 679171 684176 686890 687958
62112 687958 688101 687740 686948 685693 683963 681586 678098 672902 665602 656242 645431 634322 624340 616694
62098 616694 612029 610418 611600 615125 620412 626829 633925 641590 649871 658673 667869 677767 689074 702041
62084 702041 715927 729830 743875 758933 775340 792728 811263 831967 855331 880493 906484
62073 906484 933459 961768 990531 1018368 1045148 1071809 1098656 1125205 1151804 1179954 1210435
62062A210435L1635L0891K9155K7121K4354K0269J4908Q744K510k771o561r564
62050A381126j2902j6650k0022k2943k6315l0613l5158l9046m1936m3747m4383
62039A047411m4100m3392m2260m0285l7604l5080l3254l1784l0168k8295k6024
62028F55165k3067j9709j6974j5498j4764j3899j2696j1465j0373r480q963q830
62016D89447q674q185p565p111o715o105n250m201k954j776j248j520j849j343
62002D24951J9J555K701L317L381K939K287J780J540J504J571J487Q15o48k487
61987D46712m062n137n886o484o927p191p341p505p737p793p168n681m041l221
61973C60538l228l081k259j453j426j861j985j785j695j560q09M90J648K431L158
$$ plain form
62062 1210435 1242070 1272961 1302116 1329237 1353591 1373860 1388768 1397512 1400022 1397251 1390690 1381126
62050 1381126 1368224 1351574 1331552 1308609 1282294 1251681 1216523 1177477 1135541 1091794 1047411
62039 1047411 1003311 959919 917659 877374 839770 804690 771436 739652 709484 681189 655165
62028 655165 632098 612389 595415 579917 565153 551254 538558 527093 516720 507240 498277 489447
62016 489447 480773 472588 465023 457912 451197 445092 439842 435641 432687 430911 429663 428143 426294 424951
62002 424951 424970 426525 429226 432543 435924 438863 441150 442930 444470 445974 447545 449032 449847 449199 446712
61987 446712 442650 437513 431627 425143 418216 411025 403684 396179 388442 380649 373481 367800 363759 360538
61973 360538 357310 354229 351970 350517 349091 347230 345245 343460 341765 340205 339396 339886 341534 343965 347123
61958C47123L719L465K361J410J407J982K387K624L147L889M405M781N611P065
61944C95376Q570R570J0085J0432J0853J1640J3056J4777J5796J5361J3862J2375
61932E41753J1477J0951J0449R888R125P865O100M237K475N05j854m079n445n896
61918E97551n980o075o024n450m123k029O64L680O750R580J1710J2855J3388J3914
61904F40411J4145J2953J0036O701M226K112r10m676p769r633j1076j2558j3418
61891F30544j3253j2705j2296j1622j0382r218q746q629q363q140q138p855p091
61878E04106o782p704r026r303q451p508o868o081n190m866n070m759l264j088
61864D18146R51K515L538M084M653N882P644R178J0320J1817J4096J6519J8380
$$ plain form
61958 347123 350842 354307 356668 358078 359485 361467 363854 366478 369625 373514 377919 382700 388311 395376
61944 395376 403946 413516 423601 434033 444886 456526 469582 484359 500155 515516 529378 541753
61932 541753 553230 564181 574630 584518 593643 601508 607608 611845 614320 614825 612971 608892 603447 597551
61918 597551 591571 585496 579472 574022 569899 567870 568534 572214 578964 588544 600254 613109 626497 640411
61904 640411 654556 667509 677545 684246 688472 690584 689674 684998 677229 667596 656520 643962 630544
61891 630544 617291 604586 592290 580668 570286 561068 552322 543693 535330 527190 519052 511197 504106
61878 504106 497324 489620 480594 471291 462840 455332 448464 442383 437193 432327 427257 422498 419234 418146
61864 418146 419097 421612 425150 429234 433887 439769 447413 456591 466911 478728 492824 509343 527723
61851E27723J9891K1566K3216K4190K4255K3674K2629K1075J9030J6557J3619
61840G57425J0219O554K821r57m590p457q925r003q257p123n513l146q0L176O077
61825G31221Q466J0543J2320J3332J3031J1362Q664N114O91m302r085j2975j5890
61812G72492j8190k0145k1673k2462k2273k1260j9927j8678j7451j5986j4319
61801E60128j2754j1547j0802j0566j0625j0399r466q102o907o033n244m582m335
61788D48766m340m038l265k483k043j859j901k294k748k620j909j484j892k522
61774D13368k528j966j414r76l78L10P64J020J322J554J458J277J536K199K713
61759D20259K859K996L330L507L167K463J781J268Q38L79k18j041j992k787l246
$$ plain form
61851 527723 547614 569180 592396 616586 640841 664515 687144 708219 727249 743806 757425
61840 757425 767644 774198 777019 776062 771472 764015 755090 746087 737830 730707 725194 722048 721968 725144 731221
61825 731221 739687 750230 762550 775882 788913 800275 808939 814053 814744 810442 801357 788382 772492
61812 772492 754302 734157 712484 690022 667749 646489 626562 607884 590433 574447 560128
61801 560128 547374 535827 525025 514459 503834 493435 483969 475867 468960 462927 457683 453101 448766
61788 448766 444426 440388 437123 434640 432597 430738 428837 426543 423795 421175 419266 417782 415890 413368
61774 413368 410840 408874 407460 406484 406106 406416 407180 408200 409522 411076 412534 413811 415347 417546 420259
61759 420259 423118 426114 429444 432951 436118 438581 440362 441630 442468 442847 442629 441588 439596 436809 433563
61744D33563l445l519l477l250k836k287j642r52l62j26l88q26o91M80K106K959
61728D15307K549J719J560K057K287J745Q61K81J78M16Q74J350J543J397J243
61713D35367J329J369Q61j89j120j282p79m07p99j776k646l035l151l191k923
61698D17628k116j085m28l81p22j193j683k065k242k334k516k685k562k095j527
61683C91994j095r20j098j516j720j375p47l07K5O58J369J313K39r83j471j401
61667C82965j444j655j550j036n69m29m48m24l80l25j79m9j51m12l77K20J063
61650C74820J502J186L94j22K70J420K389K380J645J131J238J355P67l69j258
61635C88748j425j097q16r36j432j965k175k058j990k267k715k934k755k282j702
$$ plain form
61744 433563 430118 426599 423122 419872 417036 414749 413107 412155 411793 411667 411279 410453 409762 410242 412348 415307
61728 415307 417856 419575 421135 423192 425479 427224 428085 428366 428544 428960 429834 431184 432727 434124 435367
61713 435367 436696 438065 438926 438737 437617 436335 435556 435149 434350 432574 429928 426893 423742 420551 417628
61698 417628 415512 414427 413999 413618 412896 411703 410020 407955 405713 403379 400863 398178 395616 393521 391994
61683 391994 390899 389979 388881 387365 385645 384270 383523 383216 383241 383899 385268 386581 386820 385837 384366 382965
61667 382965 381521 379866 378316 377280 376711 376282 375834 375410 375030 374705 374526 374477 374326 373914 373537 373757 374820
61650 374820 376322 377508 377902 377780 378050 379470 381859 384239 385884 387015 388253 389608 390375 390006 388748
61635 388748 387323 386226 385410 384474 383042 381077 378902 376844 374854 372587 369872 366938 364183 361901 360199
61620C60199j226j120j421j771j864j927k336k822k660j815j215j580k461k948
61606C33033k937l033l407l544l156k680k563k601k372j997k025k658l429l705
61592B92926l282k492j832j547j548j681j946k284k348j837j072p36r65j170j010
61577B67176j007j670k470k434j546p97p78r54o34PL05P6k92m32k73J30O05Q48
61559B55860P68P49J161J744J835J280O79O12J018J416J476J192P59M50M40N46
61543B71985M36J72K62R07J536J427O44r0l25k44j56q4k7j09k94k54J58N48M71
61524B76963K4l31m64p03j251j764j722j075l48o9k09k79j8K63J70j04j1M63O93
61505B70228L28k41n98r42j511j874j519q34o18p78m43N44J230R76L40J00J71
$$ plain form
61620 360199 358973 357853 356432 354661 352797 350870 348534 345712 343052 341237 340022 338442 335981 333033
61606 333033 330096 327063 323656 320112 316956 314276 311713 309112 306740 304743 302718 300060 296631 292926
61592 292926 289644 287152 285320 283773 282225 280544 278598 276314 273966 272129 271057 270321 269356 268186 267176
61577 267176 266169 264499 262029 259595 258049 257252 256474 255520 254886 254893 255198 255274 254982 254550 254277 254407 255012 255860
61559 255860 256628 257377 258538 260282 262117 263397 264076 264688 265706 267122 268598 269790 270549 270999 271439 271985
61543 271985 272421 272593 272855 273762 275298 276725 277369 277279 276954 276710 276554 276470 276443 276334 276040 275786 275944 276492 276963
61524 276963 276987 276656 276192 275489 274238 272474 270752 269677 269329 269260 269051 268772 268754 269017 269187 269083 269072 269535 270228
61505 270228 270556 270315 269717 268775 267264 265390 263871 263037 262419 261641 261198 261742 262972 263948 264288 264388 264559
61488B64559J63K77P98J220Q73J27L8Q00J537J652J563J781K079K013J653J276
61472B82409P87oq35j161q64l10J65N08O95N79O0p26j483j900j732r36J86J031
61454B76467J091M62j50j37K84L84Nr1O70J672J846J162O28Q47J364J665J922
61437B90091K281K195J295L33M08J412K108J784J050Q27J209J614J637J370J142
61422C10756J195J458J552J213P36P03J239J901K358K708K920K506J184m83j638
61407C30308k187k734l540m048l661k578j531r33n73j27L12L28k52j069j503j256
61391C04956o04m2K33M29Q01J262J451J184P31N75Q68J304J583J801K174K502
61375C21208K305J549Q46O66P38N24K3k45j9M37Q03J047J161J003N41J01J21P33
$$ plain form
61488 264559 264722 264999 265797 267017 267890 268017 268055 268855 270392 272044 273607 275388 277467 279480 281133 282409
61472 282409 283196 283190 282355 281194 280330 280020 280185 280693 281388 281967 282027 281301 279818 277918 276186 275250 275436 276467
61454 276467 277558 278020 277870 277733 278017 278401 278406 278315 278985 280657 282503 283665 284293 285140 286504 288169 290091
61437 290091 292372 294567 295862 296195 296603 298015 300123 301907 302957 303784 304993 306607 308244 309614 310756
61422 310756 311951 313409 314961 316174 316910 317613 318852 320753 323111 325819 328739 331245 332429 331946 330308
61407 330308 328121 325387 321847 317799 314138 311560 310029 309096 308523 308396 308708 309036 308784 307715 306212 304956
61391 304956 304352 304310 304543 304972 305773 307035 308486 309670 310401 310976 311844 313148 314731 316532 318706 321208
61375 321208 323513 325062 325908 326574 327312 327836 327859 327614 327595 328032 328835 329882 331043 332046 332587 332688 332809 333542
61357C33542J683K488K713K392K245L065M706O113O594O621O890P101O463N185
61343C97801M457M762N142M643L700L349L579L443K592J734J408J215N88k80q55
61328D37278j147j516j890j788j173p07r86j760k129j393L25K143L117L080K804
61313D34258L184M252N267N706N827O179O932P910Q998J0176J1321J2243J2789
61300E35042J2660J1357Q684N256K069m60k626m635o144o888p252p779q356q391
61286E22537p757p085o940p091o840n966m991m506m397l998k977j804j154r66
61272D56065n21N39J747K499K785K861K640J979J315J317J981K710L318M261N622
61257D91118O700O956O756O632O339N360L943K859K339J957J447R04K31q74k221
$$ plain form
61357 333542 335225 337713 340426 342818 345063 348128 352834 358947 365541 372162 379052 386153 392616 397801
61343 397801 402258 407020 412162 416805 420505 423854 427433 430876 433468 435202 436610 437825 438413 438133 437278
61328 437278 436131 434615 432725 430937 429764 429057 428071 426311 424182 422789 423114 425257 428374 431454 434258
61313 434258 437442 441694 446961 452667 458494 464673 471605 479515 488513 498689 510010 522253 535042
61300 535042 547702 559059 567743 572999 575068 574608 571982 567347 561203 554315 547063 539284 530928 522537
61286 522537 514780 507695 500755 493664 486824 480858 475867 471361 466964 462966 459989 458185 457031 456065
61272 456065 455544 456083 457830 460329 463114 465975 468615 470594 471909 473226 475207 477917 481235 485496 491118
61257 491118 497818 504774 511530 518162 524501 529861 533804 536663 539002 540959 542406 543310 543541 542667 540446
61242E40446l136l357l376l637l923l826l306k486j384j95N82P09N63O26J007
61227E15307J704K871M423N865O927P911Q891R198Q414P386P293P972Q139P247
61213F09548O078N405N031M530M076L948L889L427K529J501O33J90M14J174K025
61198F54398K840L971N595P374R058J0819J2607J3740J3763J3152J2483J1362
61186G71162R001N675K731J106N84N40O64P48L44q23k396l687m396m842n557o670
61170G64184p747q321q578r215j0455j1598j1875j1414j0948j0857j1077j1675
61158F40424j2784j3911j4087j2939j1181r768q900q027o592m566k461q93m2L82
61144E34655N45J39j058k619l894m812n640o171n822m507k804j244m6N28L91K56
$$ plain form
61242 540446 537310 533953 530577 526940 523017 519191 515885 513399 512015 511820 512402 513111 513674 514300 515307
61227 515307 517011 519882 524305 530170 537097 545008 553899 563097 571511 578897 586190 594162 602301 609548
61213 609548 615626 621031 626062 630592 634668 638616 642505 645932 648461 649962 650595 650785 651199 652373 654398
61198 654398 657238 661209 666804 674178 683236 694055 706662 720402 734165 747317 759800 771162
61186 771162 780163 785838 788569 789675 790259 790799 791463 792211 792555 791732 789336 785649 781253 776411 770854 764184
61170 764184 756437 748116 739538 730323 719868 708270 696395 684981 674033 663176 652099 640424
61158 640424 627640 613729 599642 586703 575522 565754 556854 548827 542235 537669 535208 534315 534273 534655
61144 534655 535200 535339 534281 531662 527768 522956 517316 511145 505323 500816 498012 496768 496722 497250 497641 497897
61128D97897J255L596O264Q276R654J0965J2595J4701J7155J9247K0214K0413
61116F42232K1122K2838K4599K5506K5943K6458K6449K5075K2919K1433K0988
61105I05562K0508J9042J6705J4047J1328Q650O094L482M34l149o978j0688j4005
61092I71032j6775j9122k1401k3604k5124k5527k5239k4926k4518k3530k2085
61081G19181k0824j9926j8914j7524j6068j4866j3817j2653j1201r468p803o786
61069E49331o497o126m867l068j765j269r22j73Q40J857K908L982M868N482N969
61054E50550O427O995P962R349J0503J0774J0534J0855J2259J4416J6861J9306
61042F86791K1349K2730K3847K5290K6879K7939K8462K9189L0574L2437L4611
$$ plain form
61128 497897 499152 502748 509012 517288 526942 537907 550502 565203 582358 601605 621819 642232
61116 642232 663354 686192 710791 736297 762240 788698 815147 840222 863141 884574 905562
61105 905562 926070 945112 961817 975864 987192 995842 1001936 1005418 1005852 1002703 995725 985037 971032
61092 971032 954257 935135 913734 890130 865006 839479 814240 789314 764796 741266 719181
61081 719181 698357 678431 659517 641993 625925 611059 597242 584589 573388 563920 556117 549331
61069 549331 542834 536708 531841 528773 527008 525739 524817 524644 525484 527341 530249 534231 539099 544581 550550
61054 550550 556977 563972 571934 581283 591786 602560 613094 623949 636208 650624 667485 686791
61042 686791 708140 730870 754717 780007 806886 834825 863287 892476 923050 955487 990098
61031I90098L7013L9128M0311M0585M0376L9761L8910L8970M1093M4834M8967
61020A440046N3686O0352O9034P8208Q7249R7467J10403J27099J49442J79970
61010B452956K19565K67503L24593L93817M77315N76108O94039Q37607J008856
61001G252359J201722J405930J602752J744463J746593J530597J098860N66277
60993A8149553J00615j80078k57551j79974q662J87936L10785K47271n5652n33922
60983A7780321j035919j418630j621555j664288j597298j464966j299646j125765
60975F552254r58604q04013o64337n42896m41749l58981k91170k36733j94976
60966B058795j63747j39951j21230j05911r2617q1128p2288o5886n9881n2768
$$ plain form
61031 990098 1027111 1066239 1106550 1147135 1187511 1227272 1266182 1305152 1346245 1391079 1440046
61020 1440046 1493732 1554084 1623118 1701326 1788575 1886042 1996445 2123544 2272986 2452956
61010 2452956 2672521 2940024 3264617 3658434 4135749 4711857 5405896 6243503 7252359
61001 7252359 8454081 9860011 11462763 13207226 14953819 16484416 17583276 18149553
60993 18149553 18250168 18070090 17812539 17632565 17623903 17811839 18122624 18369895 18314243 17780321
60983 17780321 16744402 15325772 13704217 12039929 10442631 8977665 7678019 6552254
60975 6552254 5593650 4789637 4125300 3582404 3140655 2781674 2490504 2253771 2058795
60966 2058795 1895048 1755097 1633867 1527956 1435339 1354211 1281923 1216037 1156156 1103388
60956A103388m5386l9139l3796k8537k3971k1415k0825k0947k0957k0684j9726
60945H08005j7779j5545j4033j3166j2066j0510r120q345q155q580r619j0738
60933F70349j1202j0974j0573j0274r962r602r279q886q296p613o914o073n189
60920E55512m714m726m665m269m116m533m705l682j839l73J61Q7k09l73J84J648
60904E19388L212L979M220M792N717O394O899P824Q900R075Q118P014O552O513
60890F08597O563O878P482P864P826P987Q928J0317J1361J1724J1712J1942J2958
60877G32139J4744J6486J7264J7148J7028J7375J7778J7843J7771J7657J7050
60866I20283J5687J4117J2990J2084J0638Q327N444K288j104m645q047j0958j3078
$$ plain form
60956 1103388 1058002 1018863 985067 956530 932559 911144 890319 869372 848415 827731 808005
60945 808005 790226 774681 760648 747482 735416 724906 715786 707441 699286 690706 681087 670349
60933 670349 659147 648173 637600 627326 617364 607762 598483 589597 581301 573688 566774 560701 555512
60920 555512 550798 546072 541407 537138 533022 528489 523784 520102 518263 517890 518051 518138 517929 517556 517740 519388
60904 519388 522600 526579 530799 535591 541308 547702 554601 562425 571325 580400 588518 595532 602084 608597
60890 608597 615160 622038 629520 637384 645210 653197 662125 672442 683803 695527 707239 719181 732139
60877 732139 746883 763369 780633 797781 814809 832184 849962 867805 885576 903233 920283
60866 920283 935970 950087 963077 975161 985799 994126 999570 1001858 1000754 996109 988062 977104 964026
60853I64026j4247j4645j4896j5661j7116j8861k0304k1128k1430k1520k1549
60842G62669k1418k1032k0495j9924j9255j8436j7641j7093j6757j6388j5744
60831E58486j4612j2957j1178r930r348q821p950p230p197p377o863n680m727
60818D44616m459m446m230l797l171k375j928k460l580m003l143j848j100p64
60804D03312k13N50J061J247J444J761J992J996J792J471J201J084Q34Q2q68j139
60788D17607m83K10K5q96j858k626l304l667l353k538j807j521j789k718m090
60773C87192n066m872l728k546j880j650j687j855j858j569j517k256l318l528
60759C49862k504j162n15o55j145j733k232k238j518m17N10J108J603K165K793
$$ plain form
60853 964026 949779 935134 920238 904577 887461 868600 848296 827168 805738 784218 762669
60842 762669 741251 720219 699724 679800 660545 642109 624468 607375 590618 574230 558486
60831 558486 543874 530917 519739 509809 500461 491640 483690 476460 469263 461886 455023 449343 444616
60818 444616 440157 435711 431481 427684 424513 422138 420210 417750 414170 410167 407024 405176 404076 403312
60804 403312 403099 403649 404710 405957 407401 409162 411154 413150 414942 416413 417614 418698 419532 419614 418746 417607
60788 417607 417124 417334 417359 416463 414605 411979 408675 405008 401655 399117 397310 395789 394000 391282 387192
60773 387192 382126 377254 373526 370980 369100 367450 365763 363908 362050 360481 358964 356708 353390 349862
60759 349862 347358 346196 345681 345026 343881 342148 339916 337678 336160 335743 336253 337361 338964 341129 343922
60744C43922L404L821L808L292K427J358J60r34j603j895k241k697k646j659m18
60729C48099j17j020k148k514k150j761j730j884j994k091k291k555k754k860
60715C20230k940l046l098k965k632k266k093k146k234k153j885j535j159p96
60701B89282o11q02j260j510j195n46j41j99l70k61R1M74R32J620K351K683K531
60684B93069K338K500K877L076K959K636K197J764J662K146K923L395L388L332
60670C30262L564L801L540K704J674Q48M55N36Q06P38J58l55o2R63J905K217K128
60653C55882K030J893J510R46M63K03K21N28R50J132R07M26k68j403k984m511
60637C57925n497n972o058n500m196k828k246k294k044j191m20k02l5O26J326
$$ plain form
60744 343922 347326 351147 354955 358247 360674 362032 362192 361258 359655 357760 355519 352822 350176 348517 348099
60729 348099 347982 346962 344814 342300 340150 338389 336659 334775 332781 330690 328399 325844 323090 320230
60715 320230 317290 314244 311146 308181 305549 303283 301190 299044 296810 294657 292772 291237 290078 289282
60701 289282 288671 287869 286609 285099 283904 283358 283217 283018 282648 282387 282478 282952 283884 285504 287855 290538 293069
60684 293069 295407 297907 300784 303860 306819 309455 311652 313416 315078 317224 320147 323542 326930 330262
60670 330262 333826 337627 341167 343871 345545 346393 346848 347384 348190 348928 349086 348731 348669 349632 351537 353754 355882
60653 355882 357912 359805 361315 362261 362724 362927 363148 363676 364626 365758 366665 367091 366823 365420 362436 357925
60637 357925 352428 346456 340398 334898 330702 327874 325628 323334 321290 320099 319679 319477 319442 320068 321394
60622C21394J177J47q44j062o34j06K13L07K15n3l89n45k67M44J179J320O46l22
60604C22820p38k91N08R14P43M40M90R19J427J837K159K336K172J591Q18P6o70
60587C37551j526k250k357j688o98kK97O40J370K212K616K502K434K925L916N122
60571C53064O544Q210R642J0277J0311J0459J0777J0421Q885O732M654K490j10
60558D52356k702m530n640o605p252o691m680k164j80J152K320L622M984O239
60544D30229P326Q396R737J1331J2600J2979J2631J2109J1439J0142Q128N826
60532E52873L427O86k267m687o059o658o913o793o219n537n109m737l979k769
60518D95259j459m58j8m1J4O86J700K192J937J853K906M947P133R144J1421J4397
$$ plain form
60622 321394 322571 322718 321874 320812 320178 320072 320285 320592 320807 320754 320365 319820 319553 319997 321176 322496 323142 322820
60604 322820 322082 321791 322299 323213 323956 324396 324886 325805 327232 329069 331228 333564 335736 337327 338145 338221 337551
60587 337551 336025 333775 331418 329730 329032 329030 329327 329967 331337 333549 336165 338667 341101 344026 347942 353064
60571 353064 359608 367818 377460 387737 398048 408507 419284 429705 438590 445322 449976 452466 452356
60558 452356 449654 445124 439484 432879 425627 418936 414256 412092 411912 413064 415384 419006 423990 430229
60544 430229 437555 445951 455688 467019 479619 492598 505229 517338 528777 538919 547047 552873
60532 552873 556300 556986 554719 550032 543973 537315 530402 523609 517390 511853 506744 502007 498028 495259
60518 495259 493800 493342 493324 493283 493297 493983 495683 497875 499812 501665 504571 509518 516651 525795 537216 551613
60502E51613J7940K1516K4723K7700L1028L4959L8744M1188M1912M1434L9912
60491I12669L6517L0497K2189J2541K155q594j9074k8595l6765m3047m6530m6818
60479G87145m4870m2222l9525l6437l2683k8621k4791k1524j8872j6568j4229
60468D66803j1899j0108q994p897o365n036m791n331n565n180m889n103n243m633
60454C75769l370k131j507j665k195k362j840j156r33r27m93K11L33l02q25n62
60438C56045R2L47no08j091j278j239j327j830k455k518j813q23q8K83L22k4n78
60420C41412q43n10J83Q08J242J663K264L025L581L413K444J293O38M88N02P04
60404C62307J259J749J492N97j3J83P46J093J165J141J100J219J729K476L072
$$ plain form
60502 551613 569553 591069 615792 643492 674520 709479 748223 789411 831323 872757 912669
60491 912669 949186 979683 1001872 1014413 1016568 1007974 988900 960305 923540 880493 833963 787145
60479 787145 742275 700053 660528 624091 591408 562787 537996 516472 497600 481032 466803
60468 466803 454904 444796 435802 427905 421540 416504 411713 406382 400817 395637 390748 385645 380402 375769
60454 375769 372399 370268 368761 367096 364901 362539 360699 359543 358610 357683 357190 357401 357734 357432 356607 356045
60438 356045 356137 356484 356479 355871 354780 353502 352263 350936 349106 346651 344133 342320 341497 341409 341692 342014 341990 341412
60420 341412 340569 340059 340242 341050 342292 343955 346219 349244 352825 356238 358682 359975 360613 361101 361603 362307
60404 362307 363566 365315 366807 367404 367391 367574 368320 369413 370578 371719 372819 374038 375767 378243 381315
60389C81315L457L747L579K499J120Q13J835K800K607J893J829K380K689K530
60375D15093K323K129J723J404J727K473K777K297J605J334J515J804J859J470
60361D41533Q12N65J245K412L057K819K425K824M267O265Q134R411R965R811Q877
60346E14422P137N087L612K950K131M7l105n982p589q013p721o890n683m562l924
60331D81917l687l571l551l744m024m031l577k902k452k441k623k548k024j268
60317D39474n30K25J120K070K925L779M929O541Q494J0595J2756J5078J7778K0805
60303E46039K3429K4467K3186J9876J5255R575K711m978j2305j7926k1170k2280
60291E85879k1948k0690j8569j5594j2300r612p919o734n518m487m118m230m110
$$ plain form
60389 381315 384772 388519 392098 394597 395717 396530 398365 401165 403772 405665 407494 409874 412563 415093
60375 415093 417416 419545 421268 422672 424399 426872 429649 431946 433551 434885 436400 438204 440063 441533
60361 441533 442345 442910 444155 446567 449624 452443 454868 457692 461959 468224 476358 485769 495734 505545 514422
60346 514422 521559 526646 530258 533208 535339 535386 532281 526299 518710 510697 502976 496086 490403 485841 481917
60331 481917 478230 474659 471108 467364 463340 459309 455732 452830 450378 447937 445314 442766 440742 439474
60317 439474 438944 439169 440289 442359 445284 449063 453992 460533 469027 479622 492378 507456 525234 546039
60303 546039 569468 593935 617121 636997 652252 661827 664538 659560 647255 629329 608159 585879
60291 585879 563931 543241 524672 509078 496778 487166 479247 472513 466995 462508 458390 454160 450050
60278D50050l501k875k694k952l420l908m141l821l007k143j623j588k068k928
60264D09381l663l681k958k113j677j590j516j286q72k36N53J224J530J447J122
60249C95665Q24Q41J134J113K52r96j470p28K87M61n3k23L49R87J087R77J333
60232D01840K171K852K935K568K092J590J043O37O49J074J630K102K487K751K813
60217D31234K819L168L977M801N159N181N372N917O578P122P472P521P184O718
60203E10223O503O506O348N952N660N595N408M857M178L607K968K063J114L97
60189E71379k16r81j807k494l127l809m229m133m003m552n600o169n863n412n475
60174E13509n548m650k764r34q5k79j069j979k596k587k010j307q55o53n75o63
$$ plain form
60278 450050 446549 443674 440980 438028 434608 430700 426559 422738 419731 417588 415965 414377 412309 409381
60264 409381 405718 402037 399079 396966 395289 393699 392183 390897 390025 389789 390342 391566 393096 394543 395665
60249 395665 396489 397330 398464 399577 399829 398833 397363 396635 396922 397383 397330 397107 397456 398443 399530 400507 401840
60232 401840 404011 406863 409798 412366 414458 416048 417091 417728 418377 419451 421081 423183 425670 428421 431234
60217 431234 434053 437221 441198 445999 451158 456339 461711 467628 474206 481328 488800 496321 503505 510223
60203 510223 516726 523232 529580 535532 541192 546787 552195 557052 561230 564837 567805 569868 570982 571379
60189 571379 571163 570182 568375 565881 562754 558945 554716 550583 546580 542028 536428 530259 524396 518984 513509
60174 513509 507961 503311 500547 499613 499528 499249 498180 496201 493605 491018 489008 487701 486846 486193 485618 484955
60158D84955r17j033p10o2M88P00O65M89J77j32j08L71R89J369J531J815K390
60141D92977L057L565L928M405N184O095O642O455N709N032M816M747M200K965
60127E59777J497L83j84l90m07j12O68J695K264J900J050P57J421K299K509K139
60111E77266J842J613Q33n13j478j465j144j478k335k794k585k357k596l011l201
60096E56597l215l154k776j951j057m11L14J499K681K947K218J400J145J108Q17
60081E58162N42P01Q55J43j330k387k228j479j377k405m088n809p268q231q442
60066E15359p945p228o761o573o389o086n823n780n897n932n636m894l795k597
60052D34023j537o42K07R47J324J294J305J848K774L451L698M118N235O618P323
$$ plain form
60158 484955 484038 483005 482295 482233 482721 483421 484086 484575 484752 484620 484512 484883 485872 487241 488772 490587 492977
60141 492977 496034 499599 503527 507932 513116 519211 525853 532308 538017 543049 547865 552612 556812 559777
60127 559777 561274 561657 561473 561083 560676 560564 561232 562927 565191 567091 568141 568898 570319 572618 575127 577266
60111 577266 579108 580721 581554 581041 579563 578098 576954 575476 573141 570347 567762 565405 562809 559798 556597
60096 556597 553382 550228 547452 545501 544444 544033 544347 545846 548527 551474 553692 555092 556237 557345 558162
60081 558162 558704 559405 560260 560403 559073 556686 554458 552979 551602 549197 545109 539300 532032 523801 515359
60066 515359 507414 500186 493425 486852 480463 474377 468554 462774 456877 450945 445309 440415 436620 434023
60052 434023 432486 431844 432051 432998 434322 435616 436921 438769 441543 444994 448692 452810 458045 464663 471986
60037D71986P071O444N966N434M354K660P80p42j574j792j923k572l780n014n869
60022D81429o514p227p818p883p392o675n909n002l942k917k074j457j131j150
60008D14338j370j526j561j606j708j801j972k346k628k176q35O06J208R85Q20
59993C98428J318K133K576K525K404K495K628K604K534K614K751K694K383J980
59979D32067J583J057K21r26k123k961l206l127l300l855m085l199j433P6O08
59964D07397O12R30J703K435K815K940K847K403J764J493J899K499K508J824J137
59949D37206R91J106R08M59K96M36K39m43p16Q1J139J076j45j210j373j283j643
59932D37124k089k019j658j540j506j116n25j71Q1O38J252J387J301J811K915
$$ plain form
60037 471986 479057 485501 491467 496901 501255 503915 504695 503953 502379 500587 498664 496092 492312 487298 481429
60022 481429 474915 467688 459870 451987 444595 437920 432011 427009 423067 420150 418076 416619 415488 414338
60008 414338 412968 411442 409881 408275 406567 404766 402794 400448 397820 395644 394809 395415 396623 397608 398428
59993 398428 399746 401879 404455 406980 409384 411879 414507 417111 419645 422259 425010 427704 430087 432067
59979 432067 433650 434707 434928 434002 431879 428918 425712 422585 419285 415430 411345 408146 406713 406789 407397
59964 407397 408009 408939 410642 413077 415892 418832 421679 424082 425846 427339 429238 431737 434245 436069 437206
59949 437206 438197 439303 440211 440670 440966 441402 441641 441198 440482 440563 441702 442778 442633 441423 440050 438767 437124
59932 437124 435035 433016 431358 429818 428312 427196 426671 426500 426581 427219 428471 429858 431159 432970 435885
59917D35885L624L424L080L537M708N808O430O694O715O423N825N085M312L509
59903E05059K655J695N79o10j604k165k291k148j879j500r76l53K00N95J060J930
59887E00247L158M232M762M817M502L667K428J564J757K677L373L436L175K816
59873E46611K205J309L12q52k404m012m859m662m050l667l472l178k827k528k165
59858E11761j723j505j514j160O2J898L757N483P171Q507Q791P599N144K188k24
59843E56235j283j054m27j11L2L96P88O21l59j965l917n753o725o479n698n371
59827E18930n458n015l727k469k044k083j821j414j738l008m345m780m184k981
59813D73863j552j79P71J146J310J603J642P66p90j820j579p31m06p79j248j529
$$ plain form
59917 435885 439509 442933 446013 449550 454258 460066 466496 473190 479905 486328 492153 497238 501550 505059
59903 505059 507714 509409 509988 509378 507774 505609 503318 501170 499291 497791 496815 496462 496662 497257 498317 500247
59887 500247 503405 507637 512399 517216 521718 525385 527813 529377 531134 533811 537184 540620 543795 546611
59873 546611 548816 550125 550437 549585 547181 543169 538310 533648 529598 525931 522459 519281 516454 513926 511761
59858 511761 510038 508533 507019 505859 505921 507819 511576 517059 524230 532737 541528 549127 554271 556459 556235
59843 556235 554952 553898 553471 553360 553392 553788 554576 555197 554838 552873 548956 543203 536478 529999 524301 518930
59827 518930 513472 508457 504730 502261 500217 498134 496313 494899 493161 490153 485808 481028 476844 473863
59813 473863 472311 472132 472903 474049 475359 476962 478604 479370 478580 476760 475181 474450 474044 473265 472017 470488
59797D70488j802j963j687j284j543k461l001k530j777j737k242k347j758j096
59783D43260r36j221j632j933j892j318m11K59K65k30n77j93P98J473R24o25j816
59766D34195j525oJ619K590K877K716K371K220K437K635K362J948K284L590M984
59751D67297N576N531N643O160O510O156N299M618M527M778M788M189L168K293
59737E36533J985K140K211J813J161Q39J039J321J220Q30N08K72o8l76l83l08
59721E50737o84j407j672j161n81o15r44q72m30j64j43O0N76J115J540J965K250
59704E49570K087J662J638K264L035L415L520L833M510N253N607N237M111K548
59690E98290R38n20j678k166j697o60J5j26o09p52n69n90j076j803k525l251l970
$$ plain form
59797 470488 468686 466723 465036 463752 462209 459748 456747 454217 452440 450703 448461 446114 444356 443260
59783 443260 442324 441103 439471 437538 435646 434328 433917 434176 434441 434211 433634 433441 434239 435712 436636 436011 434195
59766 434195 432670 432664 434283 436873 439750 442466 444837 447057 449494 452129 454491 456439 458723 462313 467297
59751 467297 472873 478404 484047 490207 496717 502873 508172 512790 517317 522095 526883 531072 534240 536533
59737 536533 538518 540658 542869 544682 545843 546682 547721 549042 550262 551092 551600 551872 551804 551428 551045 550737
59721 550737 550053 548646 546974 545813 545232 544617 543673 542801 542371 542207 542064 542124 542700 543815 545355 547320 549570
59704 549570 551657 553319 554957 557221 560256 563671 567191 571024 575534 580787 586394 591631 595742 598290
59690 598290 599228 598708 597030 594864 593167 592507 592522 592396 591787 591035 590466 589876 588800 586997 584472 581221 577251
59673E77251m463m570m484m549m790m880m627m236l956l687l170k494k031j849
59659E23465j586j000k75L81J062J842K471K735K896L341L933M130L656K711J507
59644E51269J4j727l347m372m650m465m275m328m431m132l187j804m93K60K35
59629E10567l18q11r37j147k062l465m419m557m503m739m838m426m159m785n648
59614D59753n268l343j209j60j26k33N3P28J571K260K483K214J698J010K3j126
59598D60328j880j845j246o30k43P8O04J321J836J704R87K38k32p98j813k829
59582D55580l059k525k049k157k591k972l292l580l660l453l116k672k030j405
59568D17019j209j362j242n99L4J08k02l84k39J53P61J499K059K214K094J953
$$ plain form
59673 577251 572788 568218 563734 559185 554395 549515 544888 540652 536696 533009 529839 527345 525314 523465
59659 523465 521879 520879 520604 520985 522047 523889 526360 529095 531991 535332 539265 543395 547051 549762 551269
59644 551269 551283 549556 546209 541837 537187 532722 528447 524119 519688 515556 512369 510565 510072 510332 510567
59629 510567 510249 509438 508501 507354 505292 501827 497408 492851 488348 483609 478771 474345 470186 465401 459753
59614 459753 454485 451142 449933 449773 449647 449414 449467 450195 451766 454026 456509 458723 460421 461431 461454 460328
59598 460328 458448 456603 455357 454727 454484 454562 455166 456487 458323 460027 461014 461252 461020 460222 458409 455580
59582 455580 452521 449996 447947 445790 443199 440227 436935 433355 429695 426242 423126 420454 418424 417019
59568 417019 415810 414448 413206 412607 412641 412749 412547 412163 411924 412077 412838 414337 416396 418610 420704 422657
59552D22657J926K136K688L386L746L555L131K929L239M301O175Q289R772J0617
59538D88547J1919J4276J6358J5780J1452M639k114o753q659q467p219n553l566
59525E20640j372N76J955K999M084N100N511N032L952K790J790P18q32k832m605
59510E45506n539n891o452p386q034q039p900q076q117p354n923m485l287k132
59496D56891j027j54N88J382J999K139K112K487L154L404L053K720K881L264L452
59481D88345L587M053M904N917O927P806Q290Q081P062N357L317J449N9j079k358
59466E51717l610m105l458k165j003j41Q14K175L822N412O620P344P874Q830J0576
59451E90702J2735J4461J5232J5165J4560J3407J1435Q434M409l92n408r752j2548
$$ plain form
59552 422657 424583 426719 429407 432793 436539 440094 443225 446154 449393 453694 459869 468158 477930 488547
59538 488547 500466 514742 531100 546880 558332 562971 560857 554104 545445 536978 529759 524206 520640
59525 520640 519268 519844 521799 524798 528882 533982 539493 544525 548477 551267 553057 553775 552943 550111 545506
59510 545506 539967 534076 527624 520238 512204 504165 496265 488189 480072 472718 466795 462310 459023 456891
59496 456891 455864 455710 456298 457680 459679 461818 463930 466417 469571 472975 476028 478748 481629 484893 488345
59481 488345 491932 495985 500889 506806 513733 521539 529829 537910 544972 550329 553646 555095 555154 554075 551717
59466 551717 548107 544002 540544 538379 537376 537235 538049 540224 544046 549458 556078 563422 571296 580126 590702
59451 590702 603437 617898 633130 648295 662855 676262 687697 696131 700540 700148 694740 684988 672440
59438F72440j3484j3040j2150j1558j1413j1382j1129j0657j0207r842r308q297
59426E39973o686m457j646J473M361O696Q718J0823J3016J5136J7434K0361K3827
59413F49029K7174K9718L0470K7548J9343P017n234j3441j6874j7152j5446j1829
59401G10323o632q11M812R119R748M506n674j6617k4463k8268k8880k7024k3521
59388E76618j9879j7002j4226j0835p783o462o369n632l621j551m69n2L83Q98
59374D84018J380J945K458K467K067K081K914L850M057L747L746M269M731M611
59360E28341M097L766M007M755N740O808P947R046R922J0658J1661J3096J4519
59347F34363J5449J6067J6887J7924J8629J8641J8063J7034J5450J3254J0582
$$ plain form
59438 672440 658956 645916 633766 622208 610795 599413 588284 577627 567420 557578 548270 539973
59426 539973 533287 528830 527184 528657 533018 539714 548432 559255 572271 587407 604841 625202 649029
59413 649029 676203 705921 736391 763939 783282 790299 785065 771624 754750 737598 722152 710323
59401 710323 703691 702880 707692 716811 726559 731065 725391 708774 684311 656043 627163 600139 576618
59388 576618 556739 539737 525511 514676 506893 500431 494062 488430 484809 483258 482789 482737 483120 484018
59374 484018 485398 487343 489801 492268 494335 496416 499330 503180 507237 510984 514730 518999 523730 528341
59360 528341 532438 536204 540211 544966 550706 557514 565461 574507 584429 595087 606748 619844 634363
59347 634363 649812 665879 682766 700690 719319 737960 756023 773057 788507 801761 812343
59336H12343P595M420J282j633m466p375j0064j2030j3313j4496j5798j6679j6592
59323G13194j5746j4842j4265j3816j3040j1673r869q107o734n578m249k783j748
59310E90744j523j691j316K26K700N257P251Q865J0781J3067J4530J3502R318
59297F71711K948l707q959j2047j3166j3049j2377j1493j0520r450q075o239m311
59284E61266l020k591k448k038j484j020l92O12J569K151K955M747P115Q872R668
59269E85962J0213J0917J1309J1015J0324R463Q174O293M082J627j266m277o476
59256F57360p533q225r256j0224j0425r936r267q413p103n550m258l305k485j885
59242E59495j676j516q48L06J402K157K721L162L333L226L006K621J924J156Q48
$$ plain form
59336 812343 819938 824358 825640 824007 819541 812166 802102 790072 776759 762263 746465 729786 713194
59323 713194 697448 682606 668341 654525 641485 629812 619943 611836 605102 599524 595275 592492 590744
59310 590744 589221 587530 586214 586440 589140 594397 601648 610513 621294 634361 648891 662393 671711
59297 671711 674659 670952 661993 649946 636780 623731 611354 599861 589341 579891 571816 565577 561266
59284 561266 558246 555655 553207 551169 549685 548665 548273 548885 550454 552605 555560 560307 567422 576294 585962
59269 585962 596175 607092 618401 629416 639740 649203 657377 663670 667752 669379 668113 663836 657360
59256 657360 649827 641602 632346 622122 611697 601761 592494 584081 576978 571428 567170 563865 561380 559495
59242 559495 557819 556303 555455 555761 557163 559320 562041 565203 568536 571762 574768 577389 579313 580469 581317
59227E81317J073J210N70r30k846m638n929o541o492n924n057m222l758l666l494
59212E30673k825j825j060p48n12N4Q52J374J255N60l50j077j350j095m58K61
59196E23729Q09J133J335J460J512J635J997K375K229J471Q44J047J742J967J466
59181E46751J027J361K237K921L021K686K327K325K652K719K062J228J373K768
59167E77458M381N286N843O875Q299R284R364Q704P482N773L977K644J805R26
59153F58101l86k009l610m948n888o455o896p336p496p078o308n729n506n429
59139E83027n480n877o491o788o527o089n931o016n971n471m317k590r09j56n42
59124E13872j206j066K0J285K136K825L933N514O961P683P699P555P705Q118Q466
$$ plain form
59227 581317 582390 583600 584170 583240 580394 575756 569827 563286 556794 550870 545813 541591 537833 534167 530673
59212 530673 527848 526023 524963 524215 523703 523757 524609 525983 527238 527798 527448 526371 525021 523926 523468 523729
59196 523729 524538 525671 527006 528466 529978 531613 533610 535985 538214 539685 540529 541576 543318 545285 546751
59181 546751 547778 549139 551376 554297 557318 560004 562331 564656 567308 570027 572089 573317 574690 577458
59167 577458 581839 587125 592968 599843 608142 617426 626790 635494 642976 648749 652726 655370 657175 658101
59153 658101 657715 655706 652096 647148 641260 634805 627909 620573 613077 605999 599691 593962 588456 583027
59139 583027 577547 571670 565179 558391 551864 545775 539844 533828 527857 522386 518069 515479 514570 514414 513872
59124 513872 512666 511600 511620 512905 515041 517866 521799 527313 534274 541957 549656 557211 564916 573034 581500
59109E81500Q473Q092P431O769O407O351O137N304M033L071K839K851K247Q03
59095F52308q31j857k132k098k098k008j554q30k78k17n62j033j493j945k362
59080F31010k684l000l548m481n667o747p384p431o948o117n176m344l763l459
59066E60261l392l447l401l037k452k137k448l008l069k484j972k151k704k907
59052E21652k578k070j591j125q44j024j470j629j381j203j429j816j969j764
59038D99759j179j64J028J836J965J723J576J705K127K882L869M835N796O998
59024E34756Q312R121R182R114R566J0330J0740J0638J0314R759Q612O806M699
59011F51949K584N02j380k688l253l272k958k321j346j53J160K627M212N606O374
$$ plain form
59109 581500 589973 598065 605496 612265 618672 625023 631160 636464 640497 643568 646407 649258 651505 652308
59095 652308 651477 649620 647488 645390 643292 641284 639730 638900 638622 638405 637843 636810 635317 633372 631010
59080 631010 628326 625326 621778 617297 611630 604883 597499 590068 583120 577003 571827 567483 563720 560261
59066 560261 556869 553422 550021 546984 544532 542395 539947 536939 533870 531386 529414 527263 524559 521652
59052 521652 519074 517004 515413 514288 513444 512420 510950 509321 507940 506737 505308 503492 501523 499759
59038 499759 498580 498416 499444 501280 503245 504968 506544 508249 510376 513258 517127 521962 527758 534756
59024 534756 543068 552189 561371 570485 580051 590381 601121 611759 622073 631832 640444 647250 651949
59011 651949 654533 655035 653655 650967 647714 644442 641484 639163 637817 637664 638824 641451 645663 651269 657643
58996F57643O360N854N308M873M294L345K204J191L51m34j049j328j531k180l331
58981F81570m460n108n158m459k839o31J517L534N901Q428R982J0021R547R735
58967G17580J0328J0350R874R822J0303J0314R195P438N794M436L193J971N96
58954H11194j206l510o175r158j2270j4722j5604j5004j4044j3577j3373j2729
58942F79822j1345r480p716o740o824p304p087n849m198k649j157J28N68L5n23
58927F09681k59M46P15N41N08N69J46o11p31J53J198J586J672K329L689N132O165
58910F32929O726O842O652O654P361Q634R844J0704J1344J1508J0531Q524O750
58897G45003O151O012N049L463K904M306O789Q977J0608J2331J4502J6785J8608
$$ plain form
58996 657643 664003 669857 675165 680038 684332 687677 689881 691072 691423 690989 689940 688612 687081 684901 681570
58981 681570 677110 672002 666844 662385 659546 658915 660432 663966 669867 678295 688277 698298 707845 717580
58967 717580 727908 738258 748132 757954 768257 778571 787766 795204 800998 805434 808627 810598 811194
58954 811194 809988 806478 800303 791145 778875 764153 748549 733545 719501 705924 692551 679822
58942 679822 668477 658997 651281 644541 637717 630413 623326 617477 613279 610630 609473 609601 610169 610204 609681
58927 609681 609422 609868 610583 611124 611632 612201 612347 611736 611005 611158 612356 613942 615614 617943 621632 626764 632929
58910 632929 639655 646497 653149 659803 667164 675798 685642 696346 707690 719198 729729 738253 745003
58897 745003 751154 757166 762215 765678 768582 772888 779677 788654 799262 811593 826095 842880 861488
58884H61488J9594J9727J9261J8395J6884J4368J1052P558M114N72k740n043o323
58871I78907p669r855j2326j4190j5374j6097j5961j4603j2713j1416j0967j0927
58859H26809j1190j1890j2631j2895j3010j3669j4656j5060j4627j3830j2783
58848F80568j1295r887r391r444q780p293o391o777p327o969o321o476p154p345
58834E69718o950o550o094n062l614k435j619p43O2K11j60o4R85K336L215L637
58818E46873L940M090L935L699L707L824L667L178K558J765N81p73j559j373p45
58803E77367n48r78j518j854k276l020l667l649l044k485k414k826l545m358m879
58788E36306m735l924k759j470j29J213K572M051N422O001N473M633M550N100
$$ plain form
58884 861488 881082 900809 920070 938465 955349 969717 980769 988327 992441 993013 990273 985230 978907
58871 978907 971238 961383 949057 934867 919493 903396 887435 872832 860119 848703 837736 826809
58859 826809 815619 803729 791098 778203 765193 751524 736868 721808 707181 693351 680568
58848 680568 669273 659386 649995 640551 631771 624478 618087 611310 603983 597014 590693 584217 577063 569718
58834 569718 562768 556218 550124 545062 541448 539013 537394 536651 536713 536924 536764 536700 537685 540021 543236 546873
58818 546873 550813 554903 558838 562537 566244 570068 573735 576913 579471 581236 581817 581044 579485 578112 577367
58803 577367 576819 575841 574323 572469 570193 567173 563506 559857 556813 554328 551914 549088 545543 541185 536306
58788 536306 531571 527647 524888 523418 523289 524502 527074 531125 536547 542548 548021 552654 557204 562304
58774E62304N081L937K494J646J034l33k605m913o427p067p207p113o851o474
58760E27506o156o014n865n302m178k850j738q64K0R68J828K505K876K738K240
58745E07714K061K645L525L970M086M486N132N361M979M432L900L214K752L288
58731E61545M645N580N425M938M959N228N164M937M938N019N021N384O318P073
58717F36174O996O765P446Q723R221Q413P111O036N001L652K128N58j336l714
58703G03174o160q146r717j1378j3500j5967j8185j9383j9158j7892j6461j5465
58691E31762j4826j4063j2804j0988q840o747n050l896l277l125l315l642l920
58678D37269m013l818l300k546j640n49O80J706K230K483K989L858M761N637O857
$$ plain form
58774 562304 567385 571322 573816 575462 576496 576163 573558 568645 562218 555151 547944 540831 533980 527506
58760 527506 521350 515336 509471 504169 499991 497141 495403 494539 494559 495527 497355 499860 502736 505474 507714
58745 507714 509775 512420 515945 519915 524001 528487 533619 538980 543959 548391 552291 555505 558257 561545
58731 561545 566190 571770 577195 582133 587092 592320 597484 602421 607359 612378 617399 622783 629101 636174
58717 636174 643170 649935 657381 666104 675325 683738 690849 696885 701886 705538 707666 708224 706888 703174
58703 703174 697014 688868 679151 667773 654273 638306 620121 600738 581580 563688 547227 531762
58691 531762 516936 502873 490069 479081 470241 463494 458444 454548 451271 448146 444831 441189 437269
58678 437269 433256 429438 426138 423592 421952 421403 422083 423789 426019 428502 431491 435349 440110 445747 452604
58663D52604Q514J0035J0832J0774R741P256L200j397m865o255n932n008m422
58650D85077m460m799m950m749m380l979l510l021k704k595k487k229j810j164
58636D38240k49O54J153J337J724K523L414M023M167L576K089K88p82p85m17k97
58620D60658k49J44Q87J881L108M159M374L899L874M916O140O327N409M092K684
58605E12303J186j0m68n39r35j652k031j822j441j290j368j574j849k045j964
58590D94501j593r75m9J235K787M539O383P862Q396Q130P932Q260Q548Q126P190
58575E71272O432O205O482P161P976Q630R410J1072J3680J6213J7744J8444J8998
58562G19719J9802K1146K3228K5391K6195K5085K3116K1285J9089J5638J1211
$$ plain form
58663 452604 461118 471153 481985 492759 502500 509756 512956 511559 506694 500439 494507 489499 485077
58650 485077 480617 475818 470868 466119 461739 457760 454250 451229 448525 445930 443443 441214 439404 438240
58636 438240 437991 438645 439798 441135 442859 445382 448796 452819 456986 460562 462651 462939 462157 461372 460955 460658
58620 460658 460409 460553 461440 463321 466429 470588 474962 478861 482735 487651 493791 500118 505527 509619 512303
58605 512303 513489 513479 513011 512472 511537 509885 507854 506032 504591 503301 501933 500359 498510 496465 494501
58590 494501 492908 491933 491884 493119 495906 500445 506828 514690 523086 531216 539148 547408 555956 564082 571272
58575 571272 577704 583909 590391 597552 605528 614158 623568 634640 648320 664533 682277 700721 719719
58562 719719 739521 760667 783895 809286 835481 860566 883682 904967 924056 939694 950905
58551I50905O622J956k782o629q648r421j0056j0335r386p817p468r033j1417
58538H66491j3560j5500j7414j8973k0058k1039k1876k1799k0324j7928j5434
58527F62586j3279j1459r740p849n866m263l168k099r14l70r02j582j359p90j129
58512E97817k156k441j602q05q37j161j128r99j257j869k553l019k844j894r06
58497E72346q05j445j827j509q70j33Q53J834K203J971J785J992K478L322M662
58482E86857O055O983P808R281J1281J3115J4704J6221J6876J5633J3015J0586
58470G28415Q638O019K412q72k881m201n523o434o343n508m441l214j868o65M11
58455G03945J672L033M199N436P107Q540Q564P142N113K492j379n893r227j0647
$$ plain form
58551 950905 957527 959483 956701 950072 941424 932003 921947 911612 902226 894409 886941 877908 866491
58538 866491 852931 837431 820017 801044 780986 759947 738071 716272 695948 678020 662586
58527 662586 649307 637848 628108 620259 614393 610130 606962 604863 603949 603579 602677 601095 599736 598946 597817
58512 597817 595661 593220 591618 590813 589976 588815 587687 586688 585431 583562 581009 577990 575146 573252 572346
58497 572346 571541 570096 568269 566760 565890 565757 566610 568444 570647 572618 574403 576395 578873 582195 586857
58482 586857 592912 599895 607703 616984 628265 641380 656084 672305 689181 704814 717829 728415
58470 728415 737053 743072 745484 744612 741731 737530 732007 725573 719230 713722 709281 706067 704199 703534 703945
58455 703945 705617 708650 712849 718285 725392 733932 742496 749638 754751 757243 755864 749971 740744 730097
58441G30097j1141j1404j0985r851q886q180o630m075k104j696j705p77P41J964
58427F55368L080M505N739O347P030Q446R900J0294R518P956N607K685R2j707
58413G34860l351n235o509o458n876n904o428o738o950p622q546q954q478p098
58399F40713m802k000L59J737K485K926K862K327J896J729J408J105J589K592
58385F56926K714J711J212K279L792M494M966O151P327P256O279N644N554N394
58371G21699N079M844M407L676L534M673O297P177P336P617Q307R229J0442J1741
58357H16058J2273J1669J0763J0225R424P699N733M468L634K546J516J155J135
58344H98298Q23M65O31J202J908L062M781O394P531Q745J0256J1285J1565J2191
$$ plain form
58441 730097 718956 707552 696567 686716 677830 669650 663020 658945 656841 655145 653440 652663 653404 655368
58427 655368 658448 662953 668692 675039 682069 690515 700415 710709 720227 728183 733790 736475 736567 734860
58413 734860 731509 726274 719765 713307 707431 701527 695099 688361 681411 673789 665243 656289 647811 640713
58399 640713 635911 633911 634270 636007 638492 641418 644280 646607 648503 650232 651640 652745 654334 656926
58385 656926 659640 661351 662563 664842 668634 673128 678094 684245 691572 698828 705107 710751 716305 721699
58371 721699 726778 731622 736029 739705 743239 747912 754209 761386 768722 776339 784646 793875 804317 816058
58357 816058 828331 840000 850763 860988 870412 878111 883844 888312 891946 894492 896008 897163 898298
58344 898298 899121 899586 900217 901419 903327 906389 911170 917564 925095 933840 944096 955381 966946 979137
58330I79137J3784J5227J5457J5059J4742J3770J1504R021P520O363M516K669
58318A108769K068K325K285K105K624L561M069M312M889N602O194P303R125J0348
58304A175579J0077R593J0457J2118J3204J3954J5277J6626J6823J6187J5828
58293A325723J5749J5458J5445J6310J7443J8286J9604K1836K3625K3910K3917
58282A537306K5001K6206K6207K6041K7265K8970K9328K8812K9109L0083L0578
58271A844906L1082L2817L5088L6347L6887L8054L9787M1377M3384M6353M8965
58260B275047N0135N1340N4114N6980N7821N7626N8622O0305O0754O0435O1302
58249B904481O3409O5708O8727P3237P7898Q1546Q5955R2900J00599J06682J12344
$$ plain form
58330 979137 992921 1008148 1023605 1038664 1053406 1067176 1078680 1087701 1095221 1101584 1106100 1108769
58318 1108769 1110837 1113162 1115447 1117552 1120176 1123737 1127806 1132118 1137007 1142609 1148803 1156106 1165231 1175579
58304 1175579 1185656 1195249 1205706 1217824 1231028 1244982 1260259 1276885 1293708 1309895 1325723
58293 1325723 1341472 1356930 1372375 1388685 1406128 1424414 1444018 1465854 1489479 1513389 1537306
58282 1537306 1562307 1588513 1614720 1640761 1668026 1696996 1726324 1755136 1784245 1814328 1844906
58271 1844906 1875988 1908805 1943893 1980240 2017127 2055181 2094968 2136345 2179729 2226082 2275047
58260 2275047 2325182 2376522 2430636 2487616 2545437 2603063 2661685 2721990 2782744 2843179 2904481
58249 2904481 2967890 3033598 3102325 3175562 3253460 3335006 3420961 3513861 3614460 3721142 3833486
58238C833486J19649J27232J33150J39374J48646J59298J68312J77107J88990
58229E195244K03211K17119K31777K49594K68894K87051L06462L30956L58900
58220G649208L86774M16827M53859M97204N43699N95753O58070P29379Q06410
58211A2737183Q93192R97010J118330J255014J413160J602991J828251K092557
58203B3937688K413102K815271L317791L936688M697615N627350O740136Q053012
58195F1538653R608555J1459973J3640953J6172940J9081065K2349991K5847896
58188A79700026K9289032L2173824L3621662L2311160K6942914J7194196M395574
58181C55628388q853506j9960381k7479094l1325098l2226940l1098468k8727530
$$ plain form
58238 3833486 3953135 4080367 4213517 4352891 4501537 4660835 4829147 5006254 5195244
58229 5195244 5398455 5615574 5847351 6096945 6365839 6652890 6959352 7290308 7649208
58220 7649208 8035982 8452809 8906668 9403872 9947571 10543324 11201394 11930773 12737183
58211 12737183 13630375 14627385 15745715 17000729 18413889 20016880 21845131 23937688
58203 23937688 26350790 29166061 32483852 36420540 41118155 46745505 53485641 61538653
58195 61538653 71147208 82607181 96248134 112421074 131502139 153852130 179700026
58188 179700026 208989058 241162882 274784544 307095704 334038618 351232814 355628388
58181 355628388 346774882 326814501 299335407 268010309 235783369 204684901 175957371
58174A75957371k5709361k2454489j9227623j6206112j3509766j1193675r252578
58167E8403767p652468o352408n303101m450853l754196l187143k725776k344712
58159B2633110k027463j766845j552865j371281j214817j084214r76432q82121
58151A1757072p96203p20877o56210n97023n41028m91314m48589m08784l70512
58142F726532l37616l12193k91539k73611k59174k47003k33246k17369k03028
58133D351753j91558j80013j67041j55151j45556j36027j25646j16849j10877
58124C023035j05590r9461r3737q9140q4362p9129p5128p2553o9370o5037o1485
58113B128043n9459n7281n4199n1632n0133m8324m5768m3823m2897m1781m0233
$$ plain form
58174 175957371 150248010 127793521 108565898 92359786 78850020 67656345 58403767
58167 58403767 50751299 44398891 39095790 34644937 30890741 27703598 24977822 22633110
58159 22633110 20605647 18838802 17285937 15914656 14699839 13615625 12639193 11757072
58151 11757072 10960869 10239992 9583782 8986759 8445731 7954417 7505828 7097044 6726532
58142 6726532 6388916 6076723 5785184 5511573 5252399 5005396 4772150 4554781 4351753
58133 4351753 4160195 3980182 3813141 3657990 3512434 3376407 3250761 3133912 3023035
58124 3023035 2917445 2817984 2724247 2635107 2550745 2471616 2396488 2323935 2254565 2189528 2128043
58113 2128043 2068584 2011303 1957104 1905472 1855339 1807015 1761247 1717424 1674527 1632746 1592513
58102A592513l9291l8691l7006l4711l3821l4233l3684l1746l0397l0115k8965
58091A219853k6301k3956k2812k1475j9343j7749j7095j5943j4094j3450j4652
58080A012983j5812j5818j5997j7174j7879j6999j5708j5277j5204j4818j4575
58069H37722j4646j4269j3505j3445j3881j3113j0940r375r318r128p675o375
58057G02052o642p660q182q558r368r878r385q513p902p157o138n621n663n088
58043E96297l649k896l746m953n242n124n458n837n787n859o307o232n349n022
58029E24836o167p647q135q063q314q373p442o206n846o152o060n349m557l866
58015D32659l228k940l175l493l544l529l438k730j369j82M14R13J434J154j82
$$ plain form
58102 1592513 1553222 1514531 1477525 1442814 1408993 1374760 1341076 1309330 1278933 1248818 1219853
58091 1219853 1193552 1169596 1146784 1125309 1105966 1088217 1071122 1055179 1041085 1027635 1012983
58080 1012983 997171 981353 965356 948182 930303 913304 897596 882319 867115 852297 837722
58069 837722 823076 808807 795302 781857 767976 754863 743923 734548 725230 716102 708427 702052
58057 702052 695410 687750 679568 671010 661642 651764 642379 633866 625964 618807 612669 607048 601385 596297
58043 596297 592648 589752 586006 581053 575811 570687 565229 559392 553605 547746 541439 535207 529858 524836
58029 524836 518669 511022 502887 494824 486510 478137 470695 464489 458643 452491 446431 441082 436525 432659
58015 432659 429431 426491 423316 419823 416279 412750 409312 406582 405213 405031 405445 406358 407792 408946 408764
58000D08764j429j655j400j476j561j035k74j7j94k14J60Q78J877K782L027K614
57984D10847K033J240k46k109l304l611l764l822k987j470q23j667k680k691k225
57969C82721k029j658o41K65J92n40j221j770k153j913j135o87p39l93M69N67
57953C69335n79j494j068m20r11j775j445p7J001J483J983K557K915L477M691
57938C79673N856O106O014O803Q437R770J0219J0063R469Q394P119N882M334K216
57924D80355j0k004m314p287r985j1325j1551j1509j1197j0313r469r466r829
57911C72096r434q135o554m772k593o25K93M88R61J719J936J479R75N13m07j584
57895C46356k036j354j04J112K103K642K547K218K171K107J380K53k63J12N59
$$ plain form
58000 408764 407335 405680 404280 402804 401243 400208 399934 399917 399723 399509 399669 400547 402424 405206 408233 410847
57984 410847 412880 414120 413874 411765 408461 404850 401086 397264 394277 392807 391984 390317 387637 384946 382721
57969 382721 380692 379034 378393 378658 378850 378310 377089 375319 373166 371253 370118 369431 368692 368299 368768 369335
57953 369335 368756 367262 366194 365774 364863 363088 361643 361566 362567 364050 366033 368590 371505 374982 379673
57938 379673 385529 391635 397649 404452 412889 422659 432878 442941 452410 460804 467923 473805 478139 480355
57924 480355 480345 478341 474027 466740 456755 445430 433879 422370 411173 400860 391391 381925 372096
57911 372096 362662 354527 347973 343201 340608 339983 340276 340764 341725 343444 345380 346859 347834 348347 347940 346356
57895 346356 344320 342966 342862 343974 346077 348719 351266 353484 355655 357762 359142 359395 359132 359244 359803
57880C59803L45m80j557k648l445l682l577l597l817m000m116m241m164l708l321
57865C13795l573m187m220l259j871r15p06q07k99J442L936N833O263N518M254
57850C21204K754J401R62J644K525K621J942Q40p42k573l586l209k512k781l580
57835C16910l524k473j536j194q69k98O4J10M01J162J970K552L062L428L356L029
57819C26150L018L375L625L572L290K439N39j966l863m659n039n624o022n497
57805C13338m071k545j685j572j595j094r9P39J012R23O32o3j045j587j420j324
57789B98544j944k618k313j135M6R18J697K212K156J957K312L095L611L706L674
57774C15918L475K931K389K152J700N96l74k84J36o75k578l705l100j957j786
$$ plain form
57880 359803 360148 359668 358111 355463 352018 348336 344759 341162 337345 333345 329229 324988 320824 317116 313795
57865 313795 310222 306035 301815 298556 296685 295770 295064 294257 293958 295400 299336 305169 311432 316950 321204
57850 321204 323958 325359 326321 327965 330490 333111 335053 335893 335151 332578 328992 325783 323271 320490 316910
57835 316910 313386 310913 309377 308183 307314 307016 307080 307190 307591 308753 310723 313275 316337 319765 323121 326150
57819 326150 329168 332543 336168 339740 343030 345469 346008 344042 340179 335520 330481 324857 318835 313338
57805 313338 309267 306722 305037 303465 301870 300776 300677 301416 302428 303351 303983 303920 302875 301288 299868 298544
57789 298544 296600 293982 291669 290534 290580 291498 293195 295407 297563 299520 301832 304927 308538 312244 315918
57774 315918 319393 322324 324713 326865 328565 329161 328787 328503 328639 327964 325386 321681 318581 316624 314838
57759C14838k609l443l591k949j862r45m70Q5J188K175K040J124P36J184J443
57744C08944R22K30j10l70p09p40n02p12j509k054j856j499j492j468j128r98
57728B94949j414j638q67M90J365J423J202J164J218R70J96q42j465j328j017
57713B94406j356k226k785k766k662k597k011p65L92Q65R11R70J063J254J875
57698B84568K840L485L464L129K615J389q16l329n330o669p414p304o218m725
57684B59685l547k801k169j335M3K267N105P779R842J1675J3995J7168K1205K5909
57670C64821L0900L5816M0386M3593M3019L6154K2838N827j1216k5544l5437m0077
57658E11080m0154l7640l4163l0072k5390k0746j6788j3537j0909r217q412p608
$$ plain form
57759 314838 312229 308786 305195 302246 300384 299439 298969 299054 300242 302417 304457 305581 306317 307501 308944
57744 308944 309866 310096 309986 309616 308907 308167 307665 306953 305444 303390 301534 300035 298543 297075 295947 294949
57728 294949 293535 291897 291030 291520 292885 294308 295510 296674 297892 298862 299058 298216 296751 295423 294406
57713 294406 293050 290824 288039 285273 282611 280014 278003 277238 277630 278495 279406 280376 281439 282693 284568
57698 284568 287408 290893 294357 297486 300101 301490 300674 297345 292015 285346 277932 270628 264410 259685
57684 259685 256138 253337 251168 249833 249876 252143 257248 265027 274869 286544 300539 317707 338912 364821
57670 364821 395721 431537 471923 515516 558535 594689 617527 623354 612138 586594 551157 511080
57658 511080 470926 433286 399123 369051 343661 322915 306127 292590 281681 272464 264052 256444
57646B56444o088m202k657j487m61K18L51M16R11J416J153K60k39L12J453K113
57630B49913J565P1j231j418q43o88j412k267k472k105j584j071q45j345k299
57615B31969k588j699n90m08r87j423j462j433j288p28O3N74P12O76L69l59j152
57598B20246j536j672k012k470k585k394k387k678k877k797k704k717k582k135
57584A86700j649j519j811k235k444k318k002j648j258q34n83o77r79j390k171
57569A63182l353m063l293j393Q2J94n05j094j311j224p96l24l82q33o69N74K005
57552A46797K561K277J782J318R49R49J263J240O24J19K30L86N3j35O13J693J872
57535A64591J114M69L95L25j42o68q14n32pM08K67l89p97l99L56Q28J233K053
$$ plain form
57646 256444 250356 246154 243497 242010 241549 241767 242118 242534 243445 244861 246014 246274 246035 246347 247800 249913
57630 249913 251478 251549 250318 248900 248057 247369 245957 243690 241218 239113 237529 236458 235613 234268 231969
57615 231969 229381 227682 227092 226684 225697 224274 222812 221379 220091 219363 219426 220000 220712 221388 221757 221398 220246
57598 220246 218710 217038 215026 212556 209971 207577 205190 202512 199635 196838 194134 191417 188835 186700
57584 186700 185051 183532 181721 179486 177042 174724 172722 171074 169816 168982 168399 167722 166743 165353 163182
57569 163182 159829 155766 152473 151080 151162 151356 150851 149757 148446 147222 146426 146102 145720 144887 144218 144792 146797
57552 146797 149358 151635 153417 154735 155684 156633 157896 159136 159760 159879 160109 160495 160548 160413 161026 162719 164591
57535 164591 165705 166174 166569 166894 166752 166084 165270 164738 164731 165139 165406 165017 164220 163821 164177 165005 166238 168291
57517A68291K834K646J574P03O84J178J610J713J329N22j63k72j64n17j250j765
57501A78953k045k537l093l024k336j879k104k441k252j635j055p74r25j534k251
57486A49068k515k210j729j378j115q87o92l65J94N47J82o48j158j193j403k114
57470A32584k749k698k137j568j019j73R35J831K096J692Q43j65j030j413j109
57455A25920l66J80J67NL20R36J035M20j08J8K62j11q93j288j017m46K0J23k29
57436A24948o52m32M96J265J281J037J046P83l17j500j543n80J58J84J24M05O62
57419A27365N85K84k24r41j322p28M25R61M88k44n70n78m27K4O16Q45O18M13L98
57400A27988K38j11k72k63o03j302j583r68O9Q99J494K048K494K685K572J999
$$ plain form
57517 168291 171125 173771 175345 176048 176732 177910 179520 181233 182562 183084 182921 182649 182485 181968 180718 178953
57501 178953 176908 174371 171278 168254 165918 164039 161935 159494 157242 155607 154552 153778 152853 151319 149068
57486 149068 146553 144343 142614 141236 140121 139234 138542 138177 138371 138918 139100 138452 137294 136101 134698 132584
57470 132584 129835 127137 125000 123432 122413 122240 123175 125006 127102 128794 129637 129472 128442 127029 125920
57455 125920 125554 125734 125901 125906 126226 127162 128197 128617 128509 128527 128789 128678 127785 126497 125480 125034 125054 125177 124948
57436 124948 124296 123864 124360 125625 126906 127943 128989 129772 129455 127955 126412 125832 125990 126174 126298 126703 127365
57419 127365 127950 128234 128010 127069 125747 125019 125444 126405 126893 126649 126079 125501 125074 125098 125714 126559 127177 127590 127988
57400 127988 128226 128115 127843 127580 126977 125675 124092 123124 123193 124092 125586 127634 130128 132813 135385 137384
57384A37384R21j01k85K74O43L47r7j55m9j44l59n17p69j158j337j061n61j46
57366A32830J73M82P57J018J283J348J097R36J275J762J796J667K168L072L194
57351A54858K287J623K083K736K215O98m45n07m3J23k01o47p57m25M4L41N80R59
57333A65522J132O36j54l24J79L46l82j297j583j404j265j090o75m09p04j178
57317A57350j196q69p75r05o80R0Q78J159R98Q21Q43Q51N14p1l44K0N39N13rl98
57297A59329m79o44r22p82q9N96R40J236J545J270K13p96r02l02L02P21J095J283
57279A63614J189J217J629J925J578J082J355K327K925K507J660J350J882K720
57265A88960L088K582J457L83j33p1K91O48P59O31O49J162J805J780J010L98O71
$$ plain form
57384 137384 138305 138204 137919 138193 138836 139183 139086 138931 138882 138738 138379 137862 137093 135935 134598 133537 132976 132830
57366 132830 133003 133485 134242 135260 136543 137891 138988 139924 141199 142961 144757 146424 148592 151664 154858
57351 154858 157145 158768 160851 163587 165802 166500 166055 165548 165505 165628 165427 164780 164023 163598 163642 163983 164563 165522
57333 165522 166654 167290 167136 166812 166991 167337 166955 165658 164075 162671 161406 160316 159641 159232 158528 157350
57317 157350 156154 155285 154510 153605 152925 153015 153893 155052 156050 156871 157714 158565 159079 159008 158664 158684 159223 159736 159727 159329
57297 159329 158850 158206 157284 156502 156413 157009 157949 159185 160730 162000 162213 161417 160515 160213 160515 161236 162331 163614
57279 163614 164803 166020 167649 169574 171152 172234 173589 175916 178841 181348 183008 184358 186240 188960
57265 188960 192048 194630 196087 196470 196337 196266 196557 197205 197964 198595 199244 200406 202211 203991 205001 205399 206070
57248B06070J479K005K000J692J182M84q9k07JJ28Q1J40N38J247K014K464K353
57231B23582J886J562J580J702J829K234K962L458L204K453J910J928K236K396
57217B54922K209J839J628J699J813J773J837K321K923L024K654K478K802L188
57203B87110L221L079L142L534M184M846N051M597M136M518N534O102N757N141
57189C49952M869M879N065N582O159O097N390M876M944N054M984N307O067O173
57175D25398N105M015M116M936N374N577O427P797Q783R350J0356J2046J3696
57162E22976J4863J5906J7156J8312J8959J9132J9228J9693K0715K1947K2742
57151G31629K2972K3245K4019K4950K5506K5768K6155K6816K7715K8788K9641
$$ plain form
57248 206070 207549 209554 211554 213246 214428 214912 214823 214616 214617 214745 214826 214966 215504 216751 218765 221229 223582
57231 223582 225468 227030 228610 230312 232141 234375 237337 240795 243999 246452 248362 250290 252526 254922
57217 254922 257131 258970 260598 262297 264110 265883 267720 270041 272964 275988 278642 281120 283922 287110
57203 287110 290331 293410 296552 300086 304270 309116 314167 318764 322900 327418 332952 339054 344811 349952
57189 349952 354821 359700 364765 370347 376506 382603 387993 392869 397813 402867 407851 413158 419225 425398
57175 425398 430503 434518 438634 443570 448944 454521 460948 468745 477528 486878 497234 509280 522976
57162 522976 537839 553745 570901 589213 608172 627304 646532 666225 686940 708887 731629
57151 731629 754601 777846 801865 826815 852321 878089 904244 931060 958775 987563 1017204
57140A017204K9705K9214K9346L0759L2713L4246L5491L7085L8947M0689M2598
57129A397997M5211M8281N1071N3425N5762N8341O1217O4603O8569P2792P7168
57118B054437Q2173Q7968R3859R9438J05647J13777J23979J35641J48723J63636
57108C209278J80310J98428K18312K40936K67588L00299L41995L95311M61975
57099E814432N44187O45792P70912R22124J100963J309129J547458J814050K104320
57090A6573367K411762K726931L036151L322811L569731L760190L879057L914212
57082D3194212L852406L668542L323070K783038K056140J204547L20593n15552
57074E9886996j261292j907614k460945k928938l314420l613320l815012l906741
$$ plain form
57140 1017204 1046909 1076123 1105469 1136228 1168941 1203187 1238678 1275763 1314710 1355399 1397997
57129 1397997 1443208 1491489 1542560 1595985 1651747 1710088 1771305 1835908 1904477 1977269 2054437
57118 2054437 2136610 2224578 2318437 2417875 2523522 2637299 2761278 2896919 3045642 3209278
57108 3209278 3389588 3588016 3806328 4047264 4314852 4615151 4957146 5352457 5814432
57099 5814432 6358619 7004411 7775323 8697447 9798410 11107539 12654997 14469047 16573367
57090 16573367 18985129 21712060 24748211 28071022 31640753 35400943 39280000 43194212
57082 43194212 47046618 50715160 54038230 56821268 58877408 60081955 60402548 59886996
57074 59886996 58625704 56718090 54257145 51328207 48013787 44400467 40585455 36678714
57066C6678714l881366l744127l513929l218493k887133k545587k213865j905524
57058A2768690j627764j383040j171427r91646q40705p14387o08886n21479m49551
57049D459805l90048l40269k98425k62981k32299k05330j81896j61917j44800
57040B241840j29739j15916j02437q8963p6300o5306n5227m4303l2028j9328o601
57029A505692O190J6568J8877Q699j2602l8772o3135q1298r1144r2768q8571q1827
57017A005909p4505o6948n9260n1966m5344l9265l3861k9689k6954k5056k3103
57006E29958k0665j8054j6003j4965j4518j3768j2381j0835r500q106o484n182
56994C79497m730m743m401l588k917k699k412j257J031L886O375P912Q449P789
$$ plain form
57066 36678714 32797348 29053221 25539292 22320799 19433666 16888079 14674214 12768690
57058 12768690 11140926 9757886 8586459 7594813 6754108 6039721 5430835 4909356 4459805
57049 4459805 4069757 3729488 3431063 3168082 2935783 2730453 2548557 2386640 2241840
57040 2241840 2112101 1996185 1893748 1804785 1728485 1663179 1607952 1563649 1531621 1512293 1505692
57029 1505692 1511882 1528450 1547327 1556026 1543424 1504652 1441517 1360219 1269075 1176307 1087736 1005909
57017 1005909 931404 864456 805196 753230 707886 668621 634760 605071 578117 553061 529958
57006 529958 509293 491239 475236 460271 445753 431985 419604 408769 399269 391163 384679 379497
56994 379497 374767 370024 365623 362035 359118 356419 354007 352750 353781 357667 364042 371954 380403 388192
56980C88192N226M62n286j0008j2787j4216j4908j4641j3263j1453r949q679p199
56967B71491n367l168n69K023L909N183O911R720J2912J5565J7565J8763J7957
56954C72895J3876O868j245q711j4546j8231j9715j9548j8308j6029j2764r268
56942B55274o417m190j982L16K367M322O869J0313J4282J8329K2177K5266K6606
56929C73532K5218K0517J2550K402p755j5700k0618k3292k4886k5831k5808k4406
56917B65923k1700j8367j5309j3003j1280r787q438p233n915m177k191o09J8k40
56903A47692p20p49l05L2r1k04L70J569K831M134O034Q586J0986J2647J3959J5649
56887B22420J7797J9841K1033K0512J7499J1971M990j927p592j1333j2979j2945
$$ plain form
56980 388192 393418 393880 388594 378586 365799 351583 336675 322034 308771 297318 287369 278690 271491
56967 271491 266124 262956 262387 264410 268319 273502 280413 290133 303045 318610 336175 354938 372895
56954 372895 386771 393639 392394 383683 369137 350906 331191 311643 293335 277306 264542 255274
56942 255274 248857 244667 242685 243001 245368 249690 256559 266872 281154 299483 321660 346926 373532
56929 373532 398750 419267 431817 434219 426464 410764 390146 366854 341968 316137 290329 265923
56917 265923 244223 225856 210547 197544 186264 176477 168039 160806 154891 150714 148523 147914 147932 147692
56903 147692 146972 146223 145918 145950 145859 145655 146025 147594 150425 154559 160593 169179 180165 192812 206771 222420
56887 222420 240217 260058 281091 301603 319102 331073 336063 334136 326544 315211 302232 289287
56875B89287j1952j0368q130n351k466L52L410O969J0923J5127J9519K3889K8125
56862C59334L2733L8273M4001M7707M7160M1229K9916J4391k680j7920k9010l5323
56850E69811l7076l4958l0632k6034k1513j5823q451o87O298J3050K0520K8441
56838D62946L6179M4129N2912O1967O9937P5515P6607O9836N2929K7612j003k7704
56826A001862m9028o2945o8857o8161o3487n6854m9160m1092l3314k5733j7699
56815D65532r168q53O871J4421K2237L0210L7970M5050N0563N2948N0156M0309
56803H06246K3151J434j9847l6552m7545n3596n5237n2770m7450m1098l4642k8098
56791D13996k1706j5973j0785n595m19M319Q796J3610J8658K3093K6228K7526
$$ plain form
56875 289287 277335 266967 258837 253486 251020 251372 254782 261751 272674 287801 307320 331209 359334
56862 359334 392067 430340 474341 522048 569208 610437 640353 654744 652064 634144 605134 569811
56850 569811 532735 497777 467145 441111 419598 403775 395324 394637 400935 413985 434505 462946
56838 462946 499125 543254 596166 658133 728070 803585 880192 950028 1002957 1030569 1029566 1001862
56826 1001862 952834 889889 821032 752871 689384 632530 583370 542278 508964 483231 465532
56815 465532 456364 455511 462382 476803 499040 529250 567220 612270 662833 715781 765937 806246
56803 806246 829397 830831 810984 774432 726887 673291 618054 565284 517834 476736 442094 413996
56791 413996 392290 376317 365532 359937 359518 363837 372633 386243 404901 427994 454222 481748
56779D81748K5924K0311J0886p93j2937k3942l2103l6254l6854l5492l3188l0053
56767B97253k6381k2875j9757j6713j3873j1787j0366q879p241o141n715n150
56755A42375m061l222l356m028m319l962l263k420j487o56k05k47o19q69n83m
56739A09074J0q46j617j283k82P1n19j096r54l93J36N85Q97R43R79J331J637J278
56721A09951N89N38J141J337O98Q6K01O09O96O65R02J216J364J569J917J898J224
56704A26601M69K35K15k19q80r54j16J044J638J270K81n26n67k4N03P48Q70Q98
56686A31486O01N2k35L7N52P97O10J76k05k91j23l5j83k59j3J99p4n70o14j35
56666A31773L04M03M12N44P21Q94J186J600K104K715L184K933J948J252J701K660
$$ plain form
56779 481748 507672 527983 538869 538076 525139 501197 469094 432840 395986 360494 327306 297253
56767 297253 270872 247997 228240 211527 197654 185867 175501 166622 159381 153240 147525 142375
56755 142375 138314 135092 131736 127708 123389 119427 116164 113744 112257 111601 111396 111149 110530 109661 109078 109074
56739 109074 109084 108238 106621 105338 105056 105127 104608 103512 102558 102165 102301 102886 103783 104726 105705 107036 108673 109951
56721 109951 110540 111078 112219 113556 114254 114340 114541 115150 115846 116511 117413 118629 119993 121562 123479 125377 126601
56704 126601 127070 127305 127520 127301 126421 125467 125351 126395 128033 129303 129584 129058 128491 128467 128970 129718 130588 131486
56686 131486 132087 132139 131904 131941 132493 133290 133900 134076 133871 133580 133457 133422 133239 132980 132967 133166 133092 132522 131908 131773
56666 131773 132077 132480 132892 133436 134157 135051 136237 137837 139941 142656 145840 148773 150721 151973 153674 156334
56650A56334K830K004J073N04M7k57p9K05k31j210j570r31k57l02o28o27m91n36
56632A55878m93r9K82J98k68p68j123j181q67n41p65j492k096k234k064j637q89
56615A39841k24k02n79o06l24n11j227j550j084n50n08n52k79n1j44o2O07J354
56597A33349J429Q32J29k11o0L38L99j48o35k42O73R53L57k23k82k12j05O21J905
56578A38867K700K478K034K103K307K078J596J192Q49Q75J982M035N708O195O269
56563A81268P027Q472J0046J1449J2215J1514R268O608M417K359J51j384j562
56550B61848j212j556k470l016l017l038l263l404l395l364l252l167l536m298
56536B19860m578l893l013k826l038k810k129j564j250q86m41o8J95J82m19j322
$$ plain form
56650 156334 159164 161168 162241 162745 162792 162535 162456 162661 162430 161220 159650 158719 158462 158160 157532 156905 156414 155878
56632 155878 155385 155286 155568 155766 155498 154730 153607 152426 151559 151018 150253 148761 146665 144431 142367 140730 139841
56615 139841 139617 139415 138836 138230 137906 137395 136168 134618 133534 132984 132476 131924 131645 131594 131450 131388 131995 133349
56597 133349 134778 135610 135739 135528 135468 135806 136205 136057 135422 135180 135853 136806 137163 136940 136658 136446 136341 136962 138867
56578 138867 141567 144045 146079 148182 150489 152567 154163 155355 156204 157079 159061 163096 168804 174999 181268
56563 181268 188295 196767 206813 218262 230477 241991 251259 257867 262284 264643 264794 263410 261848
56550 261848 260636 259080 256610 253594 250577 247539 244276 240872 237477 234113 230861 227694 224158 219860
56536 219860 215282 211389 208376 205550 202512 199702 197573 196009 194759 193873 193432 193364 193559 193741 193322 192000
56520A92000j604j046o69j205j881j634p70l86p65j319j643j709j460j009q53
56505A74047j152j325r78n96o81r15q93q77j024o77N82J883K089J261K12p00j449
56488A68807j658j118l67R4N64J185J143m8j290j182L9J052J425J653J772J345
56472A73416O17L25N04N30K66J15J21k0k12j17K27O04J091J558J312J26r74r78
56454A78511l53j63l66k13K59M49M46P25R78N97K6K09R44J114M70j71l82m33k89
56435A82358L80J181J265O90K88K22j03o57o64l9L54J20j65j48k58o84q37l06
56417A82997M88R93J124R40M44o0j39M5j25o88r55n34J73O73R31J019P83J68n24
56398A87753q12l61P58J902K254J792J405J701K125J827Q67o3o05p23l48K67M12
$$ plain form
56520 192000 190396 189350 188681 187476 185595 183961 183191 182805 182040 180721 179078 177369 175909 174900 174047
56505 174047 172895 171570 170592 169996 169315 168400 167507 166630 165606 164929 165511 167394 169483 170744 170956 170256 168807
56488 168807 167149 166031 165664 165758 166322 167507 168650 168602 167312 166130 166169 167221 168646 170299 172071 173416
56472 173416 174033 174358 174862 175392 175658 175773 175894 175874 175662 175545 175772 176376 177467 179025 180337 180463 179489 178511
56454 178511 178158 177995 177629 177416 177675 178124 178570 179295 180273 180870 180896 181105 182049 183163 183633 183462 183080 182647 182358
56435 182358 182738 183919 185184 185874 186162 186384 186281 185624 184960 184921 185275 185395 185230 185082 184824 184140 183303 182997
56417 182997 183485 184478 185602 186542 186986 186926 186787 186832 186707 186019 185064 184530 184703 185376 186307 187326 188109 188277 187753
56398 187753 186941 186580 187338 189240 191494 193286 194691 196392 198517 200344 201211 201148 200543 199820 199472 199739 200151
56381B00151r4l56K75J069J039N33N34R78J043P06O37Q25N74j85p53p57m40K6
56363B05805N94R22Q10P55J228J770J762J564J777J980J392L76k1L00N82N98O80
56346B22874P70O97J020K172L165K631R59o9L07J201J702J788J687J577J863K609
56330B46953L012K570K247L067M197M117L113K714K996K557J105p3l67n84j070
56315B76554j005n3R45J374J481J356Q37N86J537L019L283K215J777L107M994
56300C02007N826N515M769L995L515L543L465K445J080R07J950K527J924J456
56286C44924K189L404M206M910N867O425O211O127O975Q158Q737Q778Q820R022
56272D34753R459J0395J1613J2509J3245J4692J6818J8443J9117J9927K1876K4736
$$ plain form
56381 200151 200057 199701 199976 201045 202084 202617 203151 204129 205172 205878 206515 207340 207914 207729 206976 206219 205779 205805
56363 205805 206399 207321 208131 208886 210114 211884 213646 215210 216987 218967 220359 220735 220714 221014 221596 222194 222874
56346 222874 223644 224341 225361 227533 230698 233329 234288 234219 234526 235727 237429 239217 240904 242481 244344 246953
56330 246953 249965 252535 254782 257849 262046 266163 269276 271990 274986 277543 278648 278575 278208 277624 276554
56315 276554 275549 275496 276441 277815 279296 280652 281489 282075 283612 286631 289914 292129 293906 297013 302007
56300 302007 307833 313348 318117 322112 325627 329170 332635 335080 336160 337067 339017 341544 343468 344924
56286 344924 347113 350517 354723 359633 365500 371925 378136 384263 391238 399396 408133 416911 425731 434753
56272 434753 444212 454607 466220 478729 491974 506666 523484 541927 561044 580971 602847 627583
56260F27583K8078L2021L6334M0184M3586M7907N4168O1891P0210P8828Q7351
56249A208141R5037J02006J09348J17254J24206J28820J31260J32079J30786J26457
56239B405394J18706J07318R2012P3305N2676L1212Q970j3837l6057n6479p4518
56228B708702q9633j01202j09336j14799j17774j17883j15560j12095j08114j03362
56218A618944r8066r2994q7973q2031p5276o8959o3493n8208n3222m9423m6284
56207H43015m2060l6729l2352k9741k7207k3619k0268j8293j6684j4406j2326
56196E69330j1346j0551r024p727p654p731o524m652l639l476l143k481k030j828
56182D87524j759k145k813k659j298K2K98K66R18J819K203K404K908L185K766
$$ plain form
56260 627583 655661 687682 724016 764200 807786 855693 909861 971752 1041962 1120790 1208141
56249 1208141 1303178 1405184 1514532 1631786 1755992 1884812 2016072 2148151 2278937 2405394
56239 2405394 2524100 2631418 2723430 2796735 2849411 2880623 2889593 2875756 2839699 2783220 2708702
56228 2708702 2619069 2517867 2408531 2293732 2175958 2058075 1942515 1830420 1722306 1618944
56218 1618944 1520878 1427884 1339911 1257880 1182604 1113645 1050152 991944 938722 889299 843015
56207 843015 800955 764226 731874 702133 674926 651307 631039 612746 596062 581656 569330
56196 569330 557984 547433 538409 530682 523028 515297 508773 504121 500482 497006 493863 491382 489352 487524
56182 487524 485765 483620 480807 478148 476850 476872 477170 477436 478354 480173 482376 484780 487688 490873 493639
56167D93639K319K457K683K585K828L830M781N098N548O769Q070Q841R738J1352
56153E70538J3106J4506J6087J8060J9715K1149K3907K8744L4565M0613M7685
56142H48675N5966O3836P0373P6777Q3499Q8098Q7960Q3394P6139O6822N6084
56131A657623M6355M0023L6943L5540L4784L3323K8589J9374Q028k043r868j6224
56119A912447k1234k5038k9415l6389m5932n6705o7707p7488q3445q4112q0950
56108A304032p6092o9740o1485n2449m3984l5905k8097k2046j8623j6004j2153
56097H67454p832m913l351k083j248j152o81Q94K135J819J360K391L848M024L707
56082H66372M495N716N882N640O420P627P944P931Q666R410R284R464J1002J2319
$$ plain form
56167 493639 495958 498415 501098 503683 506511 510341 515122 520220 525768 532537 540607 549448 559186 570538
56153 570538 583644 598150 614237 632297 652012 673161 697068 725812 760377 800990 848675
56142 848675 904641 968477 1038850 1115627 1199126 1287224 1375184 1458578 1534717 1601539 1657623
56131 1657623 1703978 1744001 1780944 1816484 1851268 1884591 1913180 1932554 1940582 1938539 1928671 1912447
56119 1912447 1891213 1866175 1836760 1800371 1754439 1697734 1630027 1552539 1469094 1384982 1304032
56108 1304032 1227940 1158200 1096715 1044266 1000282 964377 936280 914234 895611 879607 867454
56097 867454 859622 854709 851358 849275 848027 846875 846194 847088 849223 851042 852402 854793 858641 862665 866372
56082 866372 870867 876583 882465 888105 894525 902152 910096 918027 926693 936103 945387 954851 965853 978172
56068I78172J1788J0898J1676J3021J2924J2441J3777J6109J7033J6740J7114
56057A131693J7958J7784J7081J7286J7642J6591J5037J4931J5852J6278J6825
56046A314958J8720K0676K0783K0118K0936K2781K3817K4295K5203K5384K3835
56035A561506K2759K4417K6951K7592K7728L0250L3947L5535L5472L6710L9144
56024A902011M0346M0476M1571M3228M3797M4454M7308N0984N2875N4030N7010
56013B418090O0815O3062O5073O9262P3700P5144P5422P8723Q4489Q9119R2808
56002C245707R8300J04797J09621J14036J20967J28963J35057J41200J50807J61634
55992D511089J69590J76936J88683K03632K17317K31024K48913K69063K86872
$$ plain form
56068 978172 989960 1000858 1012534 1025555 1038479 1050920 1064697 1080806 1097839 1114579 1131693
56057 1131693 1149651 1167435 1184516 1201802 1219444 1236035 1251072 1266003 1281855 1298133 1314958
56046 1314958 1333678 1354354 1375137 1395255 1416191 1438972 1462789 1487084 1512287 1537671 1561506
56035 1561506 1584265 1608682 1635633 1663225 1690953 1721203 1755150 1790685 1826157 1862867 1902011
56024 1902011 1942357 1982833 2024404 2067632 2111429 2155883 2203191 2254175 2307050 2361080 2418090
56013 2418090 2478905 2541967 2607040 2676302 2750002 2825146 2900568 2979291 3063780 3152899 3245707
56002 3245707 3344007 3448804 3558425 3672461 3793428 3922391 4057448 4198648 4349455 4511089
55992 4511089 4680679 4857615 5046298 5249930 5467247 5698271 5947184 6216247 6503119
55983F503119L04704L28259L56219L83663M12799M49482M92186N36032N84469
55974A0350932O44583P14321P87618Q68767R67562J084114J214033J364934J551268
55965A9548132J777193K043092K365321K770034L272124L881335M623050N528365
55957D5808646O610986P883409R389238J1186317J3305555J5762313J8588170
55950A28534634K1783606K5223617K8628089L1533497L3117642L2075002K7041262
55943C27937349J7602141N049346q007188j8983153k6478537l0431370l1524641
55936B35163947l0596267k8390318k5498958k2338733j9176387j6197257j3533583
55929G9432444j1243587r316914p720327o420947n373049m519609l818299l247144
$$ plain form
55983 6503119 6807823 7136082 7492301 7875964 8288763 8738245 9230431 9766463 10350932
55974 10350932 10995515 11709836 12497454 13366221 14333783 15417897 16631930 17996864 19548132
55965 19548132 21325325 23368417 25733738 28503772 31775896 35657231 40280281 45808646
55957 45808646 52419632 60303041 69692279 80878596 94184151 109946464 128534634
55950 128534634 150318240 175541857 204169946 235703443 268821085 300896087 327937349
55943 327937349 345539490 350588836 342581648 323598495 297119958 266688588 235163947
55936 235163947 204567680 176177362 150678404 128339671 109163284 92966027 79432444
55929 79432444 68188857 58871943 51151616 44730669 39357620 34838011 31019712 27772568
55921B7772568k783444k398213k073280j803915j581523j390532j223755j084102
55913A3433804r68979q67798p76465o99822o37751n82170n29706m84757m47989
55904G438367m13455l79147l49529l25571l02358k78349k57467k40450k23209
55895D668832k05191j90599j79893j68498j55266j44026j35513j25723j13711
55886C250412j03518r7003r1879q7882q7642r0175r0523q7258q3916q1945p8819
55875B269852p4146p0999o9759o7082o2426n9465n9431n8933n6004n2718n0220
55864A588669m6626m1602l7850l6372l4929l2561l0986l0519k9285k7407k7163
55853A213369k8155k7342k4789k4068k5835k6373k4094k2129k2524k2938k1418
$$ plain form
55921 27772568 24989124 22590911 20517631 18713716 17132193 15741661 14517906 13433804
55913 13433804 12464825 11597027 10820562 10120740 9482989 8900819 8371113 7886356 7438367
55904 7438367 7024912 6645765 6296236 5970665 5668307 5389958 5132491 4892041 4668832
55895 4668832 4463641 4273042 4093149 3924651 3769385 3625359 3489846 3364123 3250412
55886 3250412 3146894 3049891 2958012 2870130 2782488 2692313 2601790 2514532 2430616 2348671 2269852
55875 2269852 2195706 2124707 2054948 1987866 1925440 1865975 1806544 1747611 1691607 1638889 1588669
55864 1588669 1542043 1500441 1462591 1426219 1391290 1358729 1327743 1297224 1267939 1240532 1213369
55853 1213369 1185214 1157872 1133083 1109015 1083180 1056807 1032713 1010584 988060 965122 943704
55842I43704j9746j9530j9220j7528j6021j5951j5956j5022j4352j4380j3331
55831G62667j0707q861r209j0011r702r293r604r308p755o785p737r236r775r958
55817F34726j0481j0460r497q919r326r232p742o233n868n655m474k943j864p92
55803E41240N61J493J902K807M372N392N496N648N860M877K781J415J302Q23o98
55788E85271j845k074l010n448p857r287j1043j3883j6152j6494j6076j6262j6258
55775D49582j4922j2903j1185r336o948n063m491m268l381k439k250k241j721
55762C68434j237j399j789k098k827l798l756k497j588j818j865q39m6p03j714
55747C40460j532p08p72j897l229m417n384n689n362n267n578n220l826k789l117
$$ plain form
55842 943704 923958 904428 885208 867680 851659 835708 819752 804730 790378 775998 762667
55831 762667 751960 743099 733890 723879 714177 704884 695280 685972 678217 671432 663695 654459 644684 634726
55817 634726 624245 613785 604288 595369 586043 576811 569069 562836 556968 551313 546839 543896 542032 541240
55803 541240 541801 543294 545196 548003 552375 557767 563263 568911 574771 579648 582429 583844 585146 585969 585271
55788 585271 583426 581352 578342 572894 565037 555750 544707 530824 514672 498178 482102 465840 449582
55775 449582 434660 421757 410572 401236 394288 389225 384734 380466 377085 374646 372396 370155 368434
55762 368434 367197 365798 364009 361911 359084 355286 351530 349033 347445 345627 343762 342923 342877 342174 340460
55747 340460 338928 338220 337448 335551 332322 327905 322521 316832 311470 306203 300625 295405 291579 288790 285673
55732B85673l819l593k718j997j336p60j285l286n250n694n108m656m266l458
55718B38447k765k758k776k108j396j428j557q66J37M66M14Q38J523J672J350
55703B29193J123Q78K95k67m88j009k419m002m606m168l368k493j621j148j094
55688B04806o60N65J737K000J722J577J382R46R99K036L077K916J878J079O60
55673B26720L0p30j050j031j248j680j843j634j206m01Q76K134K898L343L665
55658B28843L462K505J470J101J226J365J634K267K824K689J885Q06k92j073j167
55643B49545r12j268k394l340l659m199n503o669o730o112n669n253m381l390
55629A90066k826k452j885j447j373j080j94N52N30L38N56M46p89k302k683k119
$$ plain form
55732 285673 281854 278261 275543 273546 272210 271450 270165 266879 261629 255935 250827 246171 241905 238447
55718 238447 235682 232924 230148 228040 226644 225216 223659 222793 222930 223396 223810 224648 226171 227843 229193
55703 229193 230316 231194 231489 231222 230734 229725 227306 223304 218698 214530 211162 208669 207048 205900 204806
55688 204806 204146 204711 206448 208448 210170 211747 213129 214075 215074 217110 220187 223103 224981 226060 226720
55673 226720 226750 226020 224970 223939 222691 221011 219168 217534 216328 215927 216803 218937 221835 225178 228843
55658 228843 232305 234810 236280 237381 238607 239972 241606 243873 246697 249386 251271 252077 251785 250712 249545
55643 249545 248633 247365 244971 241631 237972 233773 228270 221601 214871 208759 203090 197837 193456 190066
55629 190066 187240 184788 182903 181456 180083 179003 178809 179361 179891 180229 180785 181231 180442 178140 175457 173338
55613A73338j937k494k984k962k715k351j758j289j409j806j853j664j804k210
55599A44102k317k022j639j218o72k11O5N77J526K283K228J694J299R87O01O64
55583A47947J632K925L654L822L888L840L661M031N474P352Q697R519J0268J0651
55569B27361J0134Q981P650N676K445j383m433o257p363q033q288q606r340r774
55555A98770q936p196n872n468n341m942m241l254k126j510j871k648k978k889
55541A39498k829k553j615m80O6J97N74J060J170J323K160K975K480Q77l82q01
55525A43720j165j702j676j108j199k336l248k874j884j476j668j677j309j087
55511A19311j355j865k072j597n76L40O15L47j08o77j312j549j099m96m57q32
$$ plain form
55613 173338 171401 168907 165923 162961 160246 157895 156137 154848 153439 151633 149780 148116 146312 144102
55599 144102 141785 139763 138124 136906 136234 136023 136088 136665 138191 140474 142702 144396 145695 146682 147283 147947
55583 147947 149579 152504 156158 159980 163868 167708 171369 175400 180874 188226 196923 206442 216710 227361
55569 227361 237495 246476 254126 259802 262247 260864 256431 250174 242811 234778 226490 217884 208544 198770
55555 198770 189834 182638 176766 171298 165957 161015 156774 153520 151394 149884 148013 145365 142387 139498
55541 139498 136669 134116 132501 132021 132087 132284 132858 133918 135088 136411 138571 141546 144026 144903 144521 143720
55525 143720 142555 140853 139177 138069 136870 134534 131286 128412 126528 125052 123384 121707 120398 119311
55511 119311 117956 116091 114019 112422 111846 112186 112801 113148 113040 112363 111051 109502 108403 107907 107450 106618
55495A06618r81q50p90o73j71L45K58j53p6N04Q93R53J108J230P70L6RO89R20
55476A10639J72o77p14j71K93M73L24l56j414k178k247j885j363o05K98Q39P70
55459A02198M77M17O11Q14P59K55n21r10n02K42O71R23J455J949J732R56L32j34
55441A11724r47j737j512l84L33O0l34j12L05M14M97P65P07M7o06p39p00q46p90
55422A06145j91M47N57L80L64L81K61M14J073J583J270N70L16L28l36j801k963
55405A08798k833j698p14o42j128j243o75j97n84j297r67O36J972J603M3r76o67
55388I9431J54M50J52j90l36n26q68r77m12O56J400J166K07o02o51j20L51K74
55370I9559l06q82j011q16p45q54o96j12M49O44P13Q73Q05L61J37N83J101R22
$$ plain form
55495 106618 105637 104787 103997 103324 103153 103498 103756 103603 103527 104031 104924 105877 106985 108215 108985 109021 109030 109719 110639
55476 110639 110811 110134 109420 109249 109542 110015 110339 109983 108569 106391 104144 102259 100896 100291 100589 101428 102198
55459 102198 102675 103092 103703 104517 105276 105531 105010 104100 103598 103840 104511 105434 106889 108838 110570 111526 111858 111724
55441 111724 110777 109040 107528 107144 107477 107537 107203 107091 107396 107810 108307 109072 109779 109826 109220 108481 107781 106935 106145
55422 106145 105954 106401 106958 107338 107702 108083 108344 108758 109831 111414 112684 113254 113570 113898 113562 111761 108798
55405 108798 105965 104267 103553 102911 101783 100540 99865 99668 99084 97787 96820 97456 99428 101031 101074 100098 99431
55388 99431 99585 100035 100187 99997 99661 99135 98267 97290 96878 97534 98934 100100 100307 99705 99054 98934 99285 99559
55370 99559 99253 98371 97360 96544 95799 94945 94249 94137 94586 95230 95943 96816 97621 97982 98119 98702 99803 100725
55352A00725L91L32N66K20o12q84k92J65l19j268j717j372o23n2r1o36q96k49
55334I3388Q40J386J237J053J052P86J87j95j73j78l87m76l88m20m30KN25K10
55316I8019r02j635j402r28q18o75j87Q1j82k61L57R58P79L29M58Q38N19m79j190
55297I3679j080m89J67P84J222J267R92P05N11L46K91N62J165J770J902J341M29
55280A05564j44j46j36n48r23p48n92j297k250j925j77J380J680J410J397J243
55264A03788M57l27l38O7J27r8k17l52o14m94K46Q11M57l20p25r65j571k111j817
55245I6004r86m97l65M2O64R14Q87J166J540J128j68j359j636j054lJ077J537
55228I8891J011J54J0N82R19N47o5n24r85j414j377q86o18q95j142p69ON98Q06
$$ plain form
55352 100725 101116 101448 102014 102234 101622 100738 100446 100611 100292 99024 97307 95935 95312 95260 95169 94533 93637 93388
55334 93388 94228 95614 96851 97904 98956 99742 99929 99734 99561 99383 98996 98520 98132 97712 97282 97284 97809 98019
55316 98019 97117 95482 94080 93152 92334 91659 91472 91553 91371 91110 91467 92425 93204 93533 93991 94829 95348 94869 93679
55297 93679 92599 92110 92277 93061 94283 95550 96542 97247 97758 98104 98395 98957 100122 101892 103794 105135 105564
55280 105564 105420 105274 105138 104590 103667 102919 102327 101030 98780 96855 96678 98058 99738 101148 102545 103788
55264 103788 104245 103918 103580 103647 103774 103676 103459 103107 102493 101999 102245 103056 103513 103193 102468 101503 99932 97821 96004
55245 96004 95018 94521 94156 94198 94862 95776 96663 97829 99369 100497 100329 98970 97334 96280 96277 97354 98891
55228 98891 99902 100056 100066 100648 101567 102114 102049 101525 100540 99126 97749 96863 96245 95350 94208 93439 93445 94043 94849
55209I4849P60N75M05M29N03K32l34n24J00J008J267O33k28n65k63K06M22M20
55191I9895N38R22J304J246N26o60j733k060j526q16p36j186j272m63P54J565
55175I6298J622J004p1j058j207l56P37J293J342J310J213Q05J44m73q95r97n71
55158A00140K18P01N13J28R5K26R0j50j21l2l05o96o05o6L30L41K46K05J43N4
55138A01455r4n56j249j368l58J024J503R72M32L81L07j57o21o99n33k66K42Q09
55120A01224Q92M23O7K31M36J46l85n44k52J00K87M68Q08J217J343R07J04l64
55102A07108p0N11N64R2j18L21Q29P93M35L70O38O87J73n83r58o29J51Q48J117
55083A12279R89N93l1p58j242j206p14n6M69N34k1p95j054o66k51j46J22P63R44
$$ plain form
55209 94849 95609 96184 96589 97018 97521 97753 97419 96895 96995 98003 99270 99903 99675 99110 98847 99053 99475 99895
55191 99895 100433 101355 102659 103905 104431 103771 102038 99978 98452 97636 96900 95714 94442 93979 94733 96298
55175 96298 97920 98924 98853 97795 96588 96232 96969 98262 99604 100914 102127 102932 103076 102603 101708 100711 100140
55158 100140 100358 101059 101572 101700 101795 102021 102111 101961 101840 101808 101503 100807 100202 100136 100466 100807 101053 101258 101401 101455
55138 101455 101361 100805 99556 98188 97830 98854 100357 101329 101761 102142 102449 102292 101671 100972 100439 100173 100415 101224
55120 101224 102116 102539 102606 102837 103273 103419 103034 102490 102238 102338 102625 103093 103901 105118 106461 107368 107472 107108
55102 107108 107038 107549 108113 108205 108087 108408 109237 110030 110465 110835 111473 112160 112333 111750 110792 110163 110314 111162 112279
55083 112279 113268 113861 113830 113072 111830 110624 109910 109854 110323 110857 110836 110041 108987 108321 108070 107924 108046 108809 109753
55064A09753O8r35p72J42K62n98r18K7R60N94m02n48J98N49j02r36r55r6R79J656
55044A08926J637R02k68j274j574j176o96o97r17n75M70J269R78N4l34P6M47J93
55026A07441l01m94m43l87k20J14K30k07q22q94k06P08J142Q48J68k84j81K69
55008A06481O43P84P66N62J43k14j11M15R08J086J012P66L51J5J70Q35J499J635
54990A17746J097J05q24j097o27j42l64j006j147n15K90Q27J275J668J540O50
54974A19476m98j254j443j169n69m1l9l58j55Q45J779J700P38k81q73j034p45
54957A16079l7O60Q44N71L62M99P14N75k4o78p88k00M42L45m70j216j428j428
54939A14822j538j484r39j63L34M23L13K19M00J081J976K371K121K009K613L239
$$ plain form
55064 109753 109821 108886 108114 108256 108518 107920 107002 107029 107989 108583 108181 107633 107831 108380 108278 107342 106387 106291 107270 108926
55044 108926 110563 111465 111197 109923 108349 107173 106477 105780 104863 104288 104758 106027 107005 107059 106725 106801 107248 107441
55026 107441 107140 106646 106203 105816 105596 105710 105940 105733 104911 104017 103811 104519 105661 106509 106677 106393 106212 106481
55008 106481 107124 107908 108674 109236 109379 109165 109054 109469 110377 111463 112475 113241 113592 113607 113777 114612 116111 117746
54990 117746 118843 118948 118124 117027 116400 116258 115894 114888 113741 113226 113516 114343 115618 117286 118826 119476
54974 119476 118978 117724 116281 115112 114543 114502 114463 114105 113950 114795 116574 118274 119012 118731 117858 116824 116079
54957 116079 116042 116702 117546 118117 118479 118978 119692 120267 120243 119565 118777 118577 119019 119364 118894 117678 116250 114822
54939 114822 113284 111800 110861 110698 111032 111455 111768 111987 112387 113468 115444 117815 119936 121945 124558 127797
54923A27797K831J626J104K157M035N293N320M671M181M044L681K446M32j492
54909A68126k503k554k267k270k752l435l827l653l148k772k589k229j549r46
54895A31632q28j078j318j337j052l52O51J433J501Q92N1n82o79n1J101K158K634
54878A34776K653K709L109L790M361M278L354K256J986K536K653J381p12k378
54864A66752l272l855m172l765k804k263k612l118k950k296j880j771j486j042
54850A29466j123j985k772k467j215k70n08j469k028j639p32p2j10p01j168p63
54834A10444N30J824K287K042J674J214L64m65m12M24Q45J98p01q92o16o48r42
54817A17170r07n54m04m70k27M15Q85Q34N64M75N34N55N62O85Q85Q93M70k43o41
$$ plain form
54923 127797 130628 132254 133358 135515 139550 144843 150163 154834 159015 163059 166740 169186 169618 168126
54909 168126 165623 163069 160802 158532 155780 152345 148518 144865 141717 138945 136356 134127 132578 131632
54895 131632 130804 129726 128408 127071 126019 125667 126318 127751 129252 130144 130195 129613 128934 128883 129984 132142 134776
54878 134776 137429 140138 143247 147037 151398 155676 159030 161286 163272 165808 168461 169842 169130 166752
54864 166752 163480 159625 155453 151688 148884 146621 144009 140891 137941 135645 133765 131994 130508 129466
54850 129466 128343 126358 123586 121119 119904 119634 119126 117657 115629 113990 113258 113186 113076 112375 111207 110444
54834 110444 110974 112798 115085 117127 118801 120015 120379 119914 119502 119926 120771 120969 120268 119376 118760 118112 117170
54817 117170 116263 115709 115305 114835 114608 115023 115908 116742 117306 117781 118315 118870 119432 120117 121002 121895 122365 122122 121481
54798A21481k77L54K11q12j442o24R56J742J316O00K63k0n48q78n55J33O22Q05
54780A23327Q20N75Lm62j94Q21J917K490K630K864L413L877L811L429L422M052
54764A56795M838N357N871O649P106O321M281J852m31k703m791n862n591m965
54750A74727n183o121o555n751m239l004k492k434k262j562m77K73N8q74j533
54735A32571j273m23K54M90N54O57P51Q53J118J487J648J528J488J828K429L107
54719A49067L942M855N156M168K167K21r29j359j455j538j966k923l897m043l286
54704A48180k540k473k699k537j985j422r44n84o61j239j622j173l37n1m37q43
54688A26633r87j153j261q05R5N01j02j060j502j421j256r95l86K99M33K6r3O45
$$ plain form
54798 121481 121204 121558 121769 120957 119515 118891 119847 121589 122905 123505 123768 123748 123200 122322 121767 121900 122522 123327
54780 123327 124147 124722 124725 124263 124069 124890 126807 129297 131927 134791 138204 142081 145892 149321 152743 156795
54764 156795 161633 166990 172861 179510 186616 192937 197218 199070 198639 195936 191145 185283 179692 174727
54750 174727 169544 163423 156868 151117 146878 143874 141382 138948 136686 135124 134647 134920 134978 134104 132571
54735 132571 131298 130875 131129 131619 132173 132830 133581 134434 135552 137039 138687 140215 141703 143531 145960 149067
54719 149067 153009 157864 163020 167188 169355 169576 168647 167288 165833 164295 162329 159406 155509 151466 148180
54704 148180 145640 143167 140468 137931 135946 134524 133580 132996 132335 131096 129474 128301 127964 127913 127476 126633
54688 126633 125646 124493 123232 122427 122522 123023 122921 121861 120359 118938 117682 116687 116301 116600 117033 117059 116966 117611
54670A17611J623J620K82j348j928j329n55l06j56M90J251J300O50J36J38J93
54654A19672kk1M39Q66O39K3k01J35M25K13k46m27k34p6k88o51n46K80J261J607
54634A22868J296R95R80O42m64j653j823r19q4k63j179j871j748q96K85J387K072
54617A19625K144J677R71L67M7j02l74q36j107q06j93N4k48n11l41k27p39j422
54599A17979j246j22Q87J002O28M68M79K82R0M29J167J542J134K60n64j023r21
54582A22471k42N88R34N65k42j096j630j404k81J086J704J273M16j42j19M82J358
54565A25721J716Q93o54j660j530q07r5O06J122Q25l37j306j229n26K3M91J195
54548A24448J630J145J94j73J53M05L13L84P97J107J093J079J189J107P51M84
$$ plain form
54670 117611 119234 120854 121136 119788 117860 116531 115976 115670 115514 116004 117255 118555 119205 119341 119479 119672
54654 119672 119670 119649 120088 120954 121593 121616 121415 121550 121975 122188 121942 121515 121281 121205 120917 120266 119720 120000 121261 122868
54634 122868 124164 125159 126139 126781 126317 124664 122841 121922 121838 121575 120396 118525 116777 115881 116166 117553 119625
54617 119625 121769 123446 124417 124784 124831 124729 124355 123519 122412 121606 121413 121467 121219 120708 120367 120140 119401 117979
54599 117979 116733 116611 117498 118500 119128 119596 120075 120357 120447 120876 122043 123585 124719 124979 124415 123392 122471
54582 122471 122229 122817 123751 124316 124074 122978 121348 119944 119663 120749 122453 123726 124142 124000 123881 124363 125721
54565 125721 127437 128330 127676 126016 124486 123679 123584 124190 125312 126137 125800 124494 123265 122739 122762 123253 124448
54548 124448 126078 127223 127417 127244 127397 127802 128115 128499 129296 130403 131496 132575 133764 134871 135622 136106
54532A36106M68M46L02K35K18m8m95n91j97R4k54r93j419j160m72L9m7m94o04
54513A31134j11M03L55Qq4j02o03j377j568r87k96J05M77Q94R47O02M89Q92J250
54494A32428J023M07j72n85o96l07K65K91k48m01L53J263J444J084Q49O67J08
54477A37773o11q67o40l38J15J105K290K638J750M91m3K52N74L08l07n80k79Q0
54459A43711n4m93o33m19m05q30j254j311j192j009m21O39J431J274M98m8j18
54442A39366J2L01P78R19N4j509k560k350j290k20M55P12N88K42K8J56M94Q23
54424A36999J127J406J451J018K51k68k0Q26J431J138K41l65k98l5q2k98l14j73
54406A44035j02J7L82Q03R18P54N87M52K80L40R41J736J938J318N09K06M31P83
$$ plain form
54532 136106 136574 137020 137322 137557 137775 137727 137232 136641 136444 136538 136284 135291 133872 132712 132240 132279 132232 131738 131134
54513 131134 131023 131426 131781 131789 131705 131603 131000 129623 128055 127068 126772 126877 127354 128248 129195 129797 130286 131178 132428
54494 132428 133451 133858 133686 133101 132405 132098 132363 132654 132406 132005 132358 133621 135065 136149 136998 137665 137773
54477 137773 137162 136295 135655 135317 135432 136537 138827 141465 143215 143706 143663 143915 144489 144797 144490 143910 143631 143711
54459 143711 143657 143164 142531 142112 141707 140877 139623 138312 137120 136111 135690 136329 137760 139034 139532 139484 139366
54442 139366 139378 139679 140457 141376 141430 139921 137361 135011 133721 133501 133956 134668 135256 135498 135526 135682 136176 136999
54424 136999 138126 139532 140983 142001 142252 141984 141964 142790 144221 145359 145600 145235 144937 144902 144820 144522 144208 144035
54406 144035 143933 143950 144332 145135 146053 146807 147394 147846 148126 148466 149407 151143 153081 154399 154908 155114 155545 156328
54388A56328R05O53P2n74r70j069j003p51j97M66Q09P20M94K73j74q31j048k36
54370A53867J201K089J690M42o17r25p48n65m00L2O75J004O89J33K5N00J069J311
54352A61472J290J257J304J451J779K253K614K666K548K492K340J652L21j083
54338A84356j806j697j449j901l198m596n124m416l002j808j403j626j911j861
54324A48558j470r05l00J77L16J38k4J28M96P67P85N29j01j055j823j711n65J008
54306A44948K180K437J734M35q26j547j685j491j146q38r03j424j778j265j04
54291A38727P44Q60Q17J144J528J433R59O12N50N14L05j9k43j47K76O95P97P27
54273A50279P53O29k7p58o17L45Q72K97m39k17O37J005O04L9k54k23K55J057J452
$$ plain form
54388 156328 157233 157886 157958 157384 156414 155345 154342 153591 153394 153860 154669 155389 155883 156156 155982 155151 154103 153867
54370 153867 155068 157157 158847 159289 158672 157747 156999 156434 156034 156066 156741 157745 158434 158567 158592 159092 160161 161472
54352 161472 162762 164019 165323 166774 168553 170806 173420 176086 178634 181126 183466 185118 185439 184356
54338 184356 182550 180853 179404 177503 174305 169709 164585 160169 157167 155359 153956 152330 150419 148558
54324 148558 147088 146183 145883 146060 146376 146514 146490 146618 147114 147881 148666 149195 149094 148039 146216 144505 143940 144948
54306 144948 147128 149565 151299 151734 150908 149361 147676 146185 145039 144201 143298 141874 140096 138831 138727
54291 138727 139471 140331 141148 142292 143820 145253 146212 146824 147374 147888 148193 148174 147931 147784 148060 148755 149552 150279
54273 150279 151032 151661 151634 150876 150259 150604 151476 151773 151334 151117 151754 152759 153363 153402 153148 152925 153180 154237 155689
54254A55689R31J27M2N56P28L14o8j84m71r48r83m34n4l34p54o71k55m2q2j02
54234A53005m0J3R4J57q8p34j292j086k0J280J971J628N34n87j216j374j249p66
54216A50230J48J097J529J428J236J145R58N52N1m65q79q14j28M59M1j136j749
54199A53703j082R6O45L56k78r09j332j184k75R05J524J193J69j015j800j746
54183A48970q32L32Q93M80m22p93PJ476K297J750N60j31k81o96j468j635o84O18
54165A50441J301J341J144O74j88r23q46q7N54N82J10n80j189j326q56k75k10
54148A49667n62n73J38J062J407R59J79k86j72K19L73J45j45k43k85m38m88j46
54130A50811L99O85O69P67J234J756J828J300M43k94n04j0R05J536J318N06L4
$$ plain form
54254 155689 156620 156747 156789 157345 158073 158387 158319 158135 157664 156716 155733 155299 155245 154911 154157 153486 153231 153189 153107 153005
54234 153005 152965 152978 153072 153229 153141 152407 151115 150029 150009 151289 153260 154888 155422 154835 153619 152245 150996 150230
54216 150230 150378 151475 153004 154432 155668 156813 157771 158323 158374 157909 157030 156216 156088 156547 156588 155452 153703
54199 153703 152621 152717 153362 153718 153440 152531 151199 150015 149740 150645 152169 153362 153531 152516 150716 148970
54183 148970 148138 148470 149363 149843 149421 148628 148635 150111 152408 154158 154718 154587 154306 153610 152142 150507 149823 150441
54165 150441 151742 153083 154227 154901 154713 153790 152944 152857 153411 153993 154103 153523 152334 151008 150152 149877 149667
54148 149667 149105 148532 148670 149732 151139 152098 152277 151991 151819 152038 152411 152556 152411 152168 151883 151445 150957 150811
54130 150811 151210 151895 152564 153331 154565 156321 158149 159449 159892 159598 159094 159084 159989 161525 162843 163349 163383
54113A63383M71J263J373O73R3K44N05Lr75j339p45J2K28J32K48N68O58K60m57
54094A66598j004q86j82L14m1q03j006n47j76q9M13J549K405K220J503J168J268
54077A72704J329J328J478J572J337J067J152J286R18K08k11k03m8K95J067K016
54061A87295K584K778L095L658M103M345M728N389O152P022Q153R145R133P714
54047B65294N346K746M54j043j421q98p2P95J785K767L424L915M764N944O715
54032C00515O629O052N453M833M166L699L410K751J551O29Q68J923K491J701k12
54017C46459k409m145n057n256n224n355n588n689n738o035o560o890o702o141
54003B69670n517m872m025l023k275k039j981j572r74j030k109l323l466k525
$$ plain form
54113 163383 163854 165117 166490 167163 167256 167500 168005 168008 167033 165694 164949 164961 165189 165321 165569 166137 166795 167055 166598
54094 166598 165594 164708 164526 164840 164799 163996 162990 162443 162267 162178 162591 164140 166545 168765 170268 171436 172704
54077 172704 174033 175361 176839 178411 179748 180815 181967 183253 184171 184379 184168 183965 183917 184212 185279 187295
54061 187295 189879 192657 195752 199410 203513 207858 212586 217975 224127 231149 239302 248447 257580 265294
54047 265294 270640 273386 273840 272797 271376 270478 270406 271201 272986 275753 279177 283092 287856 293800 300515
54032 300515 307144 313196 318649 323482 327648 331347 334757 337508 339059 339688 340556 342479 344970 346671 346459
54017 346459 344050 339905 334848 329592 324368 319013 313425 307736 301998 295963 289403 282513 275811 269670
54003 269670 264153 259281 255256 252233 249958 247919 245938 244366 243392 242362 240253 236930 233464 230939
53989B30939j638j611k043k111j650j131r59j105j271j130o08j8K04J3k48l38
53973B15295l44l46l00l13o17j087j141m08Q51K103L017L321K750J531N53N47
53957B25412J286J991K333K564K877L161L375L639L961M242M666N588O910P929
53943B79934Q055P503P026O968O896O174M763L318K476K215K059J722J348J115
53929C41572J023J141J707K735L796M508N028N750O672P438P964Q587R514J0486
53915D17921J1142J1461J1651J1741J1543J0931J0068R249Q621Q106P568P048
53903E37050O835P331Q747J0693J1929J0737O014j773j0653j8237k2919k4438
53891E21316k3806k2558k1602k0605j8787j6272j4123j2926j1975j0384q414p072
$$ plain form
53989 230939 229301 227690 225647 223536 221886 220755 219796 218691 217420 216290 215682 215664 215868 215881 215633 215295
53973 215295 214951 214605 214305 213992 213375 212288 211147 210739 211590 213693 216710 220031 222781 224312 224865 225412
53957 225412 226698 228689 231022 233586 236463 239624 242999 246638 250599 254841 259507 265095 272005 279934
53943 279934 287989 295492 302518 309486 316382 322556 327319 330637 333113 335328 337387 339109 340457 341572
53929 341572 342595 343736 345443 348178 351974 356482 361510 367260 373932 381370 389334 397921 407435 417921
53915 417921 429063 440524 452175 463916 475459 486390 496458 505707 514328 522434 530002 537050
53903 537050 543885 551216 559963 570656 582585 593322 599336 597563 586910 568673 545754 521316
53891 521316 497510 474952 453350 432745 413958 397686 383563 370637 358662 348278 339864 332792
53879C32792o666o592o462o538o868o745n655m226l593l963m399m112l395l070
53865B60508l306l488l139k533k253k431k742k963l136l212k925k212j478j225
53851B23465j518j981k172j918j425j138j269j385q40K32P78Q6j151j541o27P21
53835B08317J477J470J151Q66O58M48J90QJ91Q54J569J702J175O47O77J102J381
53818B23883J358J359J715K419L172L581L431K898K508K699L423M262M860N282
53804B66850N887O837P714P799O894N709N104N132N186N001M950N233N312M544
53790C48152L044J534N26n6o01j417k452l258l433l297l751n170o743p311o680
53775C09087n687n149n175n438n646n704n620n385m877m053l303l238l835m182
$$ plain form
53879 332792 326126 319534 313072 306534 299666 292921 287266 283040 279447 275484 271085 266973 263578 260508
53865 260508 257202 253714 250575 248042 245789 243358 240616 237653 234517 231305 228380 226168 224690 223465
53851 223465 221947 219966 217794 215876 214451 213313 212044 210659 209819 210051 210829 210915 209764 208223 207596 208317
53835 208317 209794 211264 212415 213281 213939 214387 214577 214585 214776 215630 217199 218901 220076 220723 221400 222502 223883
53818 223883 225241 226600 228315 230734 233906 237487 240918 243816 246324 249023 252446 256708 261568 266850
53804 266850 272737 279574 287288 295087 301981 307690 312794 317926 323112 328113 333063 338296 343608 348152
53790 348152 351196 352730 353256 353200 352599 351182 348730 345472 342039 338742 334991 329821 323078 315767 309087
53775 309087 303400 298251 293076 287638 281992 276288 270668 265283 260406 256353 253050 249812 245977 241795
53761B41795l576k509j980k080k042j579j254j375j461j119p82r97j538j771j489
53746B16243r57m46j59l26q42j149r16n35m88n22j04N91Q17M62K90Q38J643J943
53728B16383J685J359J191R77O93P12J211J638J239L0j037j098k68P11J410J863
53712B28699K003J621J020J070K158L488L886L070J785R40R51J658K507K961L057
53697B60874L297L795L998L566L028K895K674J632J66o25o51r42j919k681k484
53682B76623j883j697j702j206l30J90J72O3L0k28o91q13l43J96J95k82o59o20
53664B67015l88l42n82r03j059r89p10j83N75J272J420Q23r4n75k02O52J069M42
53646B67241p53j268m40R65J688J556J501K038K505K131J145L41L1J08O65J845
$$ plain form
53761 241795 238219 235710 233730 231650 229608 228029 226775 225400 223939 222820 222038 221041 219503 217732 216243
53746 216243 215286 214840 214681 214355 213513 212364 211448 210913 210425 209903 209799 210390 211207 211669 211959 212797 214440 216383
53728 216383 218068 219427 220618 221595 222288 223000 224211 225849 227088 227118 226081 224983 224715 225426 226836 228699
53712 228699 230702 232323 233343 234413 236571 240059 243945 247015 248800 249740 250691 252349 254856 257817 260874
53697 260874 264171 267966 271964 275530 278558 281453 284127 285759 285925 285300 284649 283707 281788 279107 276623
53682 276623 274740 273043 271341 270135 269805 269995 270167 270230 270260 270032 269341 268528 268185 268381 268576 268294 267635 267015
53664 267015 266627 266285 265703 264800 263741 262752 262042 261859 262434 263706 265126 265949 265855 265280 265078 265730 266799 267241
53646 267241 266488 265220 264780 265745 267433 268989 270490 272528 275033 277164 278309 278650 278681 278789 279454 281299
53630B81299L137L645L118K246J756J696J751J829K004K196K267K402K990M036
53616C16372M911M985M395L933M034M234L887L110K565K449K329K000J897K371
53602C63472L060L375L189K753K223J682J346J299J288J129J089J448J873J682
53588C90908O85o24j708k478l136l805m329m406l974l447l307l397l058k070r97
53573C50857m21k92m02q15j388j513r42l70m00n13M4P99O76j39k82P17J691J574
53555C48881Q16M56P39J301K019K788L041K407J572J634K663L641L896L936M548
53540C84338N614O305O252O038O376P170P789Q048Q449R316J0220J0603J0606
53527D87124J0796J1353J2010J2615J3215J3717J4083J4730J6132J7934J9160
$$ plain form
53630 281299 284436 288081 291199 293445 295201 296897 298648 300477 302481 304677 306944 309346 312336 316372
53616 316372 321283 326268 330663 334596 338630 342864 346751 349861 352426 354875 357204 359204 361101 363472
53602 363472 366532 369907 373096 375849 378072 379754 381100 382399 383687 384816 385905 387353 389226 390908
53588 390908 391593 390969 389261 386783 383647 379842 375513 371107 367133 363686 360379 356982 353924 351854 350857
53573 350857 350436 350144 349742 348927 347539 346026 345084 344714 344314 343801 343845 344644 345320 345181 344899 345616 347307 348881
53555 348881 349697 350153 350892 352193 354212 357000 360041 362448 364020 365654 368317 371958 375854 379790 384338
53540 384338 389952 396257 402509 408547 414923 422093 429882 437930 446379 455695 465915 476518 487124
53527 487124 497920 509273 521283 533898 547113 560830 574913 589643 605775 623709 642869
53516F42869J9406J9369K0001K1550K3545K5249K6042K5786K4956K4103K3244
53505H96120K2218K1415K1398K1838K1658K0456J9012J8180J7974J8012J8107
53494A116388J8061J7638J7111J7169J7776J7956J7168J6210J6063J6579J7019
53483A305138J7192J7199J6632J5122J3188J1563R900P196L426k68l057n167o995
53470A401069q456r520j0691j2389j4310j5754j6331j6130j5505j4923j4815j5338
53458A236907j6365j7665j8998k0108k0829k1153k1081k0572j9776j8999j8239
53447A023122j7072j5337j3514j1992j0424q407o407n222m717l978k679j437p56
53434I21180l92M8O57J616L296N538P461Q441Q830R405J0445J1823J3459J5289
$$ plain form
53516 642869 662275 681644 701645 723195 746740 771989 798031 823817 848773 872876 896120
53505 896120 918338 939753 961151 982989 1004647 1025103 1044115 1062295 1080269 1098281 1116388
53494 1116388 1134449 1152087 1169198 1186367 1204143 1222099 1239267 1255477 1271540 1288119 1305138
53483 1305138 1322330 1339529 1356161 1371283 1384471 1396034 1405934 1413130 1416556 1416288 1413231 1408064 1401069
53470 1401069 1392613 1383093 1372402 1360013 1345703 1329949 1313618 1297488 1281983 1267060 1252245 1236907
53458 1236907 1220542 1202877 1183879 1163771 1142942 1121789 1100708 1080136 1060360 1041361 1023122
53447 1023122 1006050 990713 977199 965207 954783 946376 939969 934747 930030 926052 923373 921936 921180
53434 921180 920788 920836 921493 923109 926405 931943 939404 947845 956675 966080 976525 988348 1001807 1017096
53420A017096J7033J8472J9786K1237K2776K4273K5917K7991L0328L2450L4177
53409A291536L5777L7440L8973M0175M1315M2926M5081M7132M8433M9196N0251
53398A768235N1903N3483N4239N4209N3870N3353N2664N2151N1980N1373M9348
53387B346808M6197M3257M1049L8689L5491L2026K8989K5883K1812J6931J2076
53376B689208P437K636k168o398j0339j5247k1831k9328l6378m2149m6371m8979
53364B440093n0279n0982n1563n1813n1386n0441m9329m8012m6294m4412m2748
53353A902834m1139l9120l6946l5696l6024l7306l8440l8994l9102l8555l6870
53342A484642l4249l1739l0097k8976k7548k5583k3430k1299j9117j6986j5331
$$ plain form
53420 1017096 1034129 1052601 1072387 1093624 1116400 1140673 1166590 1194581 1224909 1257359 1291536
53409 1291536 1327313 1364753 1403726 1443901 1485216 1528142 1573223 1620355 1668788 1717984 1768235
53398 1768235 1820138 1873621 1927860 1982069 2035939 2089292 2141956 2194107 2246087 2297460 2346808
53387 2346808 2393005 2436262 2477311 2516000 2551491 2583517 2612506 2638389 2660201 2677132 2689208
53376 2689208 2696645 2699281 2697113 2690715 2680376 2665129 2643298 2613970 2577592 2535443 2489072 2440093
53364 2440093 2389814 2338832 2287269 2235456 2184070 2133629 2084300 2036288 1989994 1945582 1902834
53353 1902834 1861695 1822575 1785629 1749933 1713909 1676603 1638163 1599169 1560067 1521512 1484642
53342 1484642 1450393 1418654 1388557 1359581 1332033 1306450 1283020 1261721 1242604 1225618 1210287
53331A210287j4467j4353j4746j5379j5918j6093j5870j5331j4357j2786j0797
53320A050190q851p172n640m209l052k176j253j5J432K920M461O055P484Q623
53306A048797R688J1016J2720J4705J6761J8484J9484K0038K1123K3364K6136
53295A242316K8175K8911K8806K8393K7618K6208K4235K2065J9950J7885J5780
53284A510342J3650J1654R844P854N045J301k559n543p619r627j2075j4538j6425
53271A491304j7857j9414k1269k2983k4030k4305k4123k3942k4019k4285k4562
53260A240515k4894k5481k6221k6679k6595k6152k5538k4614k3379k2404k2329
53249I66229k3002k3610k3619k3207k2718k2152k1386k0541j9905j9573j9348
$$ plain form
53331 1210287 1195820 1181467 1166721 1151342 1135424 1119331 1103461 1088130 1073773 1060987 1050190
53320 1050190 1041339 1034167 1028527 1024318 1021266 1019090 1017837 1017822 1019254 1022174 1026635 1032690 1040174 1048797
53306 1048797 1058485 1069501 1082221 1096926 1113687 1132171 1151655 1171693 1192816 1216180 1242316
53295 1242316 1270491 1299402 1328208 1356601 1384219 1410427 1434662 1456727 1476677 1494562 1510342
53284 1510342 1523992 1535646 1545490 1553344 1558389 1559690 1557131 1551588 1543969 1534342 1522267 1507729 1491304
53271 1491304 1473447 1454033 1432764 1409781 1385751 1361446 1337323 1313381 1289362 1265077 1240515
53260 1240515 1215621 1190140 1163919 1137240 1110645 1084493 1058955 1034341 1010962 988558 966229
53249 966229 943227 919617 895998 872791 850073 827921 806535 785994 766089 746516 727168
53238G27168j8871j7892j6480j4970j3550j2063j0428r102q618q818r045r097
53226E78234r390j0087j0765j1229j1861j2799j3384j3101j2507j2392j2483j1901
53214D36335j0649r668r384r195q551p686o982o355n719n407n650o097o335o420
53200C32237o506o351n688m790m211m116m229m276m162l864l356k574j462k62
53186B76390L38j52j192j767j781k122l021l398k473j078m55n10l78n7j70m97
53170B57677k26M32L45o76j451j291r87j345j926j990j724j597j367p07j96n63
53154B42408j360j445o91j90p09j788k492k368j498k45Q06J132Q23N01N54Q01
53138B34239R96J157J234R40K47l29l66j38j73m36m97l61m40p15n59K44R62Q68
$$ plain form
53238 727168 708297 690405 673925 658955 645405 633342 622914 613812 605194 596376 587331 578234
53226 578234 568844 558757 547992 536763 524902 512103 498719 485618 473111 460719 448236 436335
53214 436335 425686 416018 406634 397439 388888 381202 374220 367865 362146 356739 351089 344992 338657 332237
53200 332237 325731 319380 313692 308902 304691 300575 296346 292070 287908 284044 280688 278114 276652 276390
53186 276390 276728 276576 275384 273617 271836 269714 266693 263295 260822 259744 259289 258779 258401 258344 258174 257677
53170 257677 257451 257883 258228 257552 256101 254810 253823 252478 250552 248562 246838 245241 243874 243167 242971 242408
53154 242408 241048 239603 238912 238722 238013 236225 233733 231365 229867 229622 230428 231560 232383 232884 233438 234239
53138 234239 235235 236392 237626 238566 238813 238484 238118 237980 237807 237371 236874 236513 236073 235358 234799 235043 236005 236873
53120B36873L39L49J089J795J889J583J287J016O70K81k30j036j850k008j503
53105B40544j246j699j977j140J94N69k10q73n46K46O35M72no46j071p07L36J008
53087B33884N62m91j125j052p01l25J59O54P64K65o02j259j184m09L26K76l35
53070B29407n63n9M16J44n32p76l44L83J000J188O74l22j008q39j25O15J378K201
53052B32838K487J700M25j84J51O35N68j2p79j441j663j361j087j442k120k268
53036B26447j761j320j286j096k77Q22J587J837J633J003K22j54M3L97N82P35
53020B29414Q50M96l97j058p90L9N85P05Q57J081Q96K44j69J69Q30R92M78j43
53002B35079m14n04p26q18k42Q42J426Q75j27m15J03M75K03j33K3L43L48L10O76
$$ plain form
53120 236873 237212 237561 238650 240445 242334 243917 245204 246220 246890 247171 246941 245905 244055 242047 240544
53105 240544 239298 237599 235622 234482 234676 235245 235035 234162 233616 233862 234497 234969 234964 234318 233247 232540 232876 233884
53087 233884 234446 233955 232830 231778 231077 230752 230911 231565 232329 232594 231992 230733 229549 229140 229466 229742 229407
53070 229407 228844 228785 229201 229345 228813 228037 227693 228076 229076 230264 230938 230616 229608 228769 228644 229259 230637 232838
53052 232838 235325 237025 237450 237266 237417 238052 238620 238608 237829 236388 234725 233364 232277 230835 228715 226447
53036 226447 224686 223366 222080 220984 220707 221529 223116 224953 226586 227589 227811 227657 227700 228097 228679 229414
53020 229414 230264 230760 230363 229305 228515 228554 229139 229844 230701 231782 232678 232922 232753 232922 233752 234744 235222 235079
53002 235079 234665 234161 233435 232617 232375 233217 234643 235518 235391 234976 235079 235554 235757 235624 235647 235990 236338 236648 237324
52983B37324J161J174R03J080J773K191J853J267J206J751K352K544K331J970
52969B60880J625J176N17LL55J670K832K506P29j059j703j432j109j045j049j131
52953B63765j439j776j806j662j747j951j701q90j74j14n11q88j181j512j622
52938B44791j150l20J76K6m00o53p23q12r32r42q01o15n33o18p27n06K32J060
52920B36553J257O42j63m98l29L2M17O83M84l06j162j412j129r55j092j067o00
52903B31355q4O3J4R8K03R6O5O28J623K189J772P93Q5n7L6M8P2L22P27Q84M17
52882B41349p08k030k761k299q45N77R94M10k68k40M39J201J682J906J998K039
52866B43444K075K042J718J018K58j42j40k2R2K74L88P3o25j097r53o71j058k137
$$ plain form
52983 237324 238485 239659 240562 241642 243415 245606 247459 248726 249932 251683 254035 256579 258910 260880
52969 260880 262505 263681 264198 264201 264556 266226 269058 271564 272293 271234 269531 268099 266990 265945 264896 263765
52953 263765 262326 260550 258744 257082 255335 253384 251683 250793 250619 250505 249994 249106 247925 246413 244791
52938 244791 243641 243321 243497 243523 243123 242470 241747 240935 240003 239061 238260 237645 237112 236494 235767 235261 235493 236553
52920 236553 237810 238452 238289 237791 237462 237494 237911 238594 239078 238772 237610 236198 235069 234114 233022 231955 231355
52903 231355 231271 231334 231348 231446 231649 231745 231810 232438 234061 236250 238022 238815 238900 238843 238879 238927 238999 239321 240048 240932 241349
52882 241349 240641 238611 235850 233551 232706 233283 234277 234687 234419 234179 234618 235819 237501 239407 241405 243444
52866 243444 245519 247561 249279 250297 250555 250413 250273 250251 250343 250617 251005 251078 250453 249356 248403 247732 246674 244537
52848B44537l075l224k840k551k507k332j773j061n73m05m48n84p28p89p86q70
52832B19991j010q39j51N76O09n4o17n75l67n93j052j106p16m38m26j30P75J690
52814B15567J812J271J088J911L125L464K436Q43j91m80p11j322j951k137j976
52799B22749j760j432r14n67p89j353j728j875k101k270j870r02l2L10L87N81
52783B06434R54J471K083K421K013J103N17M76K89l27n01M46J688J856Q72j96
52767B21599p79j241j708j680j001k72Q5L65P51P72J55m49l08K77N12L53M36R34
52749B18801J341J418J487J620J355N94J07O03J666K264K068J662J605J846K021
52734B40458J888J410P79L84M11N42M03K27M87R42P80k07j282j851k110k263j920
$$ plain form
52848 244537 241462 238238 235398 232847 230340 228008 226235 225174 224601 224196 223748 223164 222436 221647 220861 219991
52832 219991 218981 218142 217991 218567 219176 219122 218505 217930 217563 216970 215918 214812 214096 213658 213232 213102 213877 215567
52814 215567 217379 218650 219738 221649 224774 228238 230674 231517 231326 230846 230135 228813 226862 224725 222749
52799 222749 220989 219557 218643 218076 217287 215934 214206 212331 210230 207960 206090 205188 205156 205466 205853 206434
52783 206434 207388 208859 210942 213363 215376 216479 216996 217472 217761 217434 216933 217379 219067 220923 221795 221599
52767 221599 220820 219579 217871 216191 215190 214918 215003 215368 216119 216891 217046 216597 216289 216566 217078 217431 217867 218801
52749 218801 220142 221560 223047 224667 226022 226616 226723 227326 228992 231256 233324 234986 236591 238437 240458
52734 240458 242346 243756 244535 244919 245330 245872 246275 246502 246989 247931 248711 248504 247222 245371 243261 240998 239078
52717B39078r57k41n26j212j193n85m53r97j231o84j60l75p94n54K15P21O97N40
52699B31289N17N03M03L68N51Q48R09M25m00p98k75N38N79j18l59M21J264J090
52681B37755J84n05q54j278j545r80K08R53P90M11M99Q09P29J96l62n60k80L18
52663B36488P44N92J19J26R58J968K276J797J261J335J986K604K561J715M26q03
52647B56153j723k269k318j814j039m83l25k80m7L22N31L75r8o05p58l21O13J747
52629B47661K851L751M225M058L183J691j21j674k368k236k018k215k374j812
52615B52602p95l11o76j164j154r53j028j081m12R86K267K652K153J414J008R58
52599B56466Q47L85j70l04J14P16J081J114R62Q21Q44J003J029P70M88M69M85
$$ plain form
52717 239078 238121 237880 237354 236142 234949 234364 233911 232914 231683 230999 230839 230464 229670 229116 229331 230052 230749 231289
52699 231289 231806 232309 232712 233080 233631 234479 235388 235813 235413 234615 234340 234878 235457 235339 234980 235401 236665 237755
52681 237755 237939 237434 236580 235302 233757 232777 232985 233938 234728 235139 235638 236447 237176 237372 237010 236450 236170 236488
52663 236488 237232 237824 237943 238069 239027 240995 243271 245068 246329 247664 249650 252254 254815 256530 256956 256153
52647 256153 254430 252161 249843 248029 246990 246507 246182 245902 245855 246177 246708 247083 246985 246380 245622 245301 245914 247661
52629 247661 250512 254263 258488 262546 265729 267420 267299 265625 263257 261021 259003 256788 254414 252602
52615 252602 251807 251496 250820 249656 248502 247549 246521 245440 245028 246014 248281 250933 253086 254500 255508 256466
52599 256466 257313 257698 257528 257224 257338 258054 259135 260249 261211 262032 262876 263879 264908 265678 266166 266635 267120
52582B67120J13n17q98j020j317j633j143K67J443J453Q76P83J064Q46J39j69
52566B67407Q9K9p47j392j136m37j63l04k81j30m07j100j442r14Q6P99R12O28
52548B61497K62j1j54k52m11o02p07p04p16p85p59m62Q6O40Q76O11M2k99l0N67
52528B58689P60K44m23m41K65R68R93M12j63k65R9O50J171J623K034K437K866
52511B71919L268L407L044K385K120K603L128K478M32j760k782k682k528k936
52497B82096l599m006l976l430k352j164n68o95q72n06J64N33M96M20N89R08J096
52480B65134Q90L26q4K29J124J800J806J497J312J168R98J201J937K561K491K169
52464B86559K324K696K526J939J730J835J289j47j495k067k372l020l700l900
$$ plain form
52582 267120 267233 266716 265818 264798 263481 261848 260705 260972 262415 263868 264744 265527 266591 267437 267576 267407
52566 267407 267496 267525 266778 265386 264250 263813 263650 263346 263065 262935 262528 261428 259986 259072 259158 259957 260869 261497
52548 261497 261759 261748 261594 261342 260931 260329 259622 258918 258202 257417 256658 256196 256282 256922 257798 258409 258451 258152 258122 258689
52528 258689 259449 259693 259270 258829 259094 260062 261055 261467 261304 261039 261138 261788 262959 264582 266616 269053 271919
52511 271919 275187 278594 281638 284023 286143 288746 291874 294352 294784 293024 290242 287560 285032 282096
52497 282096 278497 274491 270515 267085 264733 263569 263001 262306 261434 260928 261092 261625 262121 262541 263130 264038 265134
52480 265134 266024 266350 266266 266495 267619 269419 271225 272722 274034 275202 276200 277401 279338 281899 284390 286559
52464 286559 288883 291579 294105 296044 297774 299609 300898 300751 299256 297189 294817 291797 288097 284197
52450B84197l811l722l267k121r54p29j408k126k347k132j530n60L20N35K45J88
52434B60778O04R86R19N92K95Ll24m80l43j01O1K12M24N52N10N26R39J788K730
52415B70671L297L287L073L383M491N830O739P522R067J1322J2791J2012R069
52402C62554N166J090l167p366j0447j1441j0543q838p126n479l884k733k320
52389B95466k200j575l70N91O97L80M61J010J441J576J926K735L441L486L255
52374C12320L582M583N529N915N982O028N734M585K698P94n48j261j484j294q15
52359C52348k74J96N79P36M35j88m78Q3J237K217K593K538K416K452K750L249
52343C72889L694M006M627N968P497Q017P231O421P037R051J1231J2759J3803
$$ plain form
52450 284197 280386 276664 273397 271276 270322 269593 268185 266059 263712 261580 260050 259490 259810 260345 260590 260778
52434 260778 261382 262368 263287 263879 264174 264177 263853 263373 263030 262929 262990 263202 263626 264178 264688 265214 266153 267941 270671
52415 270671 273968 277255 280328 283711 288202 294032 300771 308293 317360 328682 341473 353485 362554
52402 362554 367720 368810 365643 358277 347830 336389 325846 317008 309882 304403 300519 297786 295466
52389 295466 293266 291691 291321 291912 292609 292989 293450 294460 295901 297477 299403 302138 305579 309065 312320
52374 312320 315902 320485 326014 331929 337911 343939 349673 354258 356956 357750 357202 355941 354457 353163 352348
52359 352348 352074 352270 352849 353585 354020 353832 353354 353437 354674 356891 359484 362022 364438 366890 369640 372889
52343 372889 376583 380589 385216 391184 398681 406698 413929 420350 427387 436438 447669 460428 474231
52330D74231J4643J5154J5401J6043J7617J9804K1787K3055K3505K3075K1845
52319F86160K0322J9173J8520J7881J6915J5875J5213J5021J5081J5213J5281
52308H70655J4969J3914J2170J0270Q803P962P568P357P100O678O073N213L831
52295I82563J616j335m462p197r287j0528j0578r464p950o877o184n095l275j258
52281I00689L50J571K709L899N295P188R440J1225J1980J2260J3031J4274J5009
52268A008920J4729J4065J3802J3876J3679J2974J2068J1335J0956J0996J1325
52257A148725J1596J1455J0863R972Q860P579O335N266M132K502L99j664l363
52244A222657n006o900q613r295q752p755p152p044o957o541n730m569l212j967
$$ plain form
52330 474231 488874 504028 519429 535472 553089 572893 594680 617735 641240 664315 686160
52319 686160 706482 725655 744175 762056 778971 794846 810059 825080 840161 855374 870655
52308 870655 885624 899538 911708 921978 930781 938743 946311 953668 960768 967446 973519 978732 982563
52295 982563 984179 982844 978382 971185 961898 951370 940792 931328 923378 916501 910317 905222 901947 900689
52281 900689 901039 902610 905319 909218 914513 921701 931141 942366 954346 966606 979637 993911 1008920
52268 1008920 1023649 1037714 1051516 1065392 1079071 1092045 1104113 1115448 1126404 1137400 1148725
52257 1148725 1160321 1171776 1182639 1192611 1201471 1209050 1215385 1220651 1224783 1227285 1227684 1226020 1222657
52244 1222657 1217651 1210751 1202138 1192843 1184091 1176336 1169184 1162140 1155183 1148642 1142912 1138343 1135131 1133164
52230A133164j023k59M57R99J346J920L013M091M416M237M526N439N989N660N386
52215A179361O196P650Q558Q706Q862R300R455R098Q732Q603Q181P127O060N795
52201A291684O206O390N770M639L756L644M220M872N056M819M593M493M202L552
52187A357896K786J990P90j074l194m901o036o968p983q996r777j0185j0210r932
52173A284206r449q760p839o830n913m962l664k112q55j33M96J429K362K810K931
52158A243717L178L353K704J047q43k083k494k469k434k614k963l161k966k598
52144A229374k473k512k219j535j057j164j473j539j571j789j503K81L407O504
52130A220731Q614J0199J2295J5207J8510K1859K5112K7887K9667L0496L0964
$$ plain form
52230 1133164 1132141 1131882 1132339 1133338 1134684 1136604 1139617 1143708 1148124 1152361 1156887 1162326 1168315 1173975 1179361
52215 1179361 1185557 1193207 1201765 1210471 1219333 1228633 1238088 1247186 1255918 1264521 1272702 1279829 1285889 1291684
52201 1291684 1297890 1304280 1310050 1314689 1318445 1322089 1326309 1331181 1336237 1341056 1345649 1350142 1354344 1357896
52187 1357896 1360682 1362672 1363462 1362388 1359194 1354293 1348257 1341289 1333306 1324310 1314533 1304348 1294138 1284206
52173 1284206 1274757 1265997 1258158 1251328 1245415 1240453 1236789 1234677 1233822 1233689 1234185 1235614 1237976 1240786 1243717
52158 1243717 1246895 1250248 1252952 1253999 1253156 1251073 1248579 1246110 1243676 1241062 1238099 1234938 1231972 1229374
52144 1229374 1226901 1224389 1222170 1220635 1219578 1218414 1216941 1215402 1213831 1212042 1210539 1210820 1214227 1220731
52130 1220731 1229345 1239544 1251839 1267046 1285556 1307415 1332527 1360414 1390081 1420577 1451541
52119A451541L1346L1138K9820K7678K5530K3777K2138K0253J8121J5805J3158
52108A710305J0142P171M798L050J415l72j817k220j606r02j062k190l655m848
52094A718209n692o463p466q935j0925j3039j4438j4465j3309j1785j0411q947
52082A592334o885m137j099J814M411O630Q473J0050J1532J3006J4485J6010J7539
52069A684163J8694J8871J7827J6037J4307J2970J1738J0222Q399O442M401K261
52057A826332J65j717l431n104o585p602q350r558j1735j4561j7278j9436k1071
52044A700069k2312k3221k3884k4346k4422k3803k2400k0368j7920j5335j3056
52033A469002j1393j0085q566o722n039l906l227k905l190m148n184n653n750
$$ plain form
52119 1451541 1482887 1514025 1543845 1571523 1597053 1620830 1642968 1663221 1681342 1697147 1710305
52108 1710305 1720447 1727618 1732416 1735466 1736881 1736509 1734692 1732472 1730866 1729964 1728902 1726712 1723057 1718209
52094 1718209 1712517 1706054 1698588 1689653 1678728 1665689 1651251 1636786 1623477 1611692 1601281 1592334
52082 1592334 1585449 1581312 1580213 1582027 1586438 1593068 1601541 1611591 1623123 1636129 1650614 1666624 1684163
52069 1684163 1702857 1721728 1739555 1755592 1769899 1782869 1794607 1804829 1813228 1819670 1824071 1826332
52057 1826332 1826497 1824780 1821349 1816245 1809660 1802058 1793708 1784150 1772415 1757854 1740576 1721140 1700069
52044 1700069 1677757 1654536 1630652 1606306 1581884 1558081 1535681 1515313 1497393 1482058 1469002
52033 1469002 1457609 1447524 1438958 1432236 1427197 1423291 1420064 1417159 1413969 1409821 1404637 1398984 1393234
$$ [...]
##END NTUPLES=NMR SPECTRUM
##END=
