##TITLE=AC1754_VAR00026_9319673_kG689NxaN2
##JCAMPDX= 6.0         $$ Bruker NMR JCAMP-DX V2.0
##DATA TYPE= NMR SPECTRUM
##DATA CLASS= NTUPLES
##ORIGIN= BRUKER
##OWNER= Administrator
$$ 1.72 TOPSPIN		Version 2.1
$$ 2015-08-11 18:54:06.242 -0700  Administrator@X
$$ Compression mode = diff/dup
##.OBSERVE FREQUENCY= 400.02188249412
##.OBSERVE NUCLEUS= ^1H
##.ACQUISITION MODE= SIMULTANEOUS (DQD)
##.ACQUISITION SCHEME= undefined
##.AVERAGES= 64
##.DIGITISER RES= 22
##SPECTROMETER/DATA SYSTEM= spect
##.PULSE SEQUENCE= noesygpps1d.comp
##.SOLVENT NAME= COFFEE_meoh
##.SHIFT REFERENCE= INTERNAL, COFFEE_meoh, 1, 14.96119
##AUDIT TRAIL= $$ (NUMBER, WHEN, WHO, WHERE, PROCESS, VERSION, WHAT)
$$ ##TITLE= Audit trail, TOPSPIN		Version 2.1
$$ ##JCAMPDX= 5.01
$$ ##ORIGIN= Bruker BioSpin GmbH
$$ ##OWNER= Administrator
$$ $$ E:\/data/COFFEE/nmr/AC1754_VAR00026_9319673_kG689NxaN2/12/pdata/1/auditp.txt
$$ ##AUDIT TRAIL=  $$ (NUMBER, WHEN, WHO, WHERE, PROCESS, VERSION, WHAT)
(   1,<2015-08-11 18:54:00.789 -0700>,<Administrator>,<X>,<go>,<TOPSPIN 2.1>,
      <created by zg
	started at 2015-08-11 18:42:31.398 -0700,
	POWCHK enabled, PULCHK disabled,
       configuration hash MD5:
       21 0F 79 D6 B3 7B B4 F6 88 20 88 DB 03 48 BD 9F
       data hash MD5: 64K
       33 12 BD DC 4E 40 0F 54 9E F1 F6 42 6D 94 84 60>)
(   2,<2015-08-11 18:54:04.132 -0700>,<Administrator>,<X>,<proc1d>,<TOPSPIN 2.1>,
      <Start of raw data processing
       efp LB = 0.3 FT_mod = 6 PKNL = 1 PHC0 = 0 PHC1 = 0 SI = 128K 
       data hash MD5: 128K
       A3 A3 D9 8D 46 66 2F 30 4C 8B EE 29 31 D8 9E 63>)
(   3,<2015-08-11 18:54:05.023 -0700>,<Administrator>,<X>,<proc1d>,<TOPSPIN 2.1>,
      <pk PHC0 = 269.1321 PHC1 = 0 
       data hash MD5: 128K
       34 0D EF 6E 1F 9E B0 B6 BA B9 A5 E5 1C 43 AD 94>)
(   4,<2015-08-11 18:54:05.429 -0700>,<Administrator>,<X>,<proc1d>,<TOPSPIN 2.1>,
      <abs ABSG = 1 
       data hash MD5: 128K
       E5 75 C5 37 8A 5B A8 24 DA 2D 65 C6 A8 97 CC 53>)
(   5,<2015-08-11 18:54:05.523 -0700>,<Administrator>,<X>,<proc1d>,<TOPSPIN 2.1>,
      <abs ABSG = 2 
       data hash MD5: 128K
       EA 7F 60 69 BF B4 17 12 C8 BF 90 1E 94 14 C7 4D>)
(   6,<2015-08-11 18:54:05.617 -0700>,<Administrator>,<X>,<proc1d>,<TOPSPIN 2.1>,
      <abs ABSG = 3 
       data hash MD5: 128K
       B3 F8 55 F7 73 08 67 84 C6 5F BA E8 6D E7 46 A0>)
(   7,<2015-08-11 18:54:05.710 -0700>,<Administrator>,<X>,<proc1d>,<TOPSPIN 2.1>,
      <abs ABSG = 4 
       data hash MD5: 128K
       AA 73 3D 36 F2 10 51 37 F9 C8 44 9D AD 5B E0 14>)
(   8,<2015-08-11 18:54:05.789 -0700>,<Administrator>,<X>,<proc1d>,<TOPSPIN 2.1>,
      <abs ABSG = 5 
       data hash MD5: 128K
       13 EB 86 7F 73 3C B0 3A A6 9F D5 C3 85 7E F1 F9>)
$$ ##END=
$$ 
$$ $$ hash MD5
$$ $$ FE BC 25 B1 85 40 D9 16 AE A4 2E 3C 3B A1 77 78
##$RELAX= 
##$RELAX= 
##$RELAX= 
##$RELAX= 
##$RELAX= 
##$RELAX= 
##$RELAX= 
##$RELAX= 
$$ Bruker specific parameters
$$ --------------------------
##$DU= <E:\>
##$EXPNO= 12
$$ [...]
##$TP07= 0
##$TPNAME0= <>
##$TPNAME1= <>
##$TPNAME2= <>
##$TPNAME3= <>
##$TPNAME4= <>
##$TPNAME5= <>
##$TPNAME6= <>
##$TPNAME7= <>
##$TPOAL= (0..7)
0.5 0.5 0.5 0.5 0.5 0.5 0.5 0.5
##$TPOFFS= (0..7)
0 0 0 0 0 0 0 0
##$TUNHIN= 0
##$TUNHOUT= 0
##$TUNXOUT= 0
##$USERA1= <user>
##$USERA2= <user>
##$USERA3= <user>
##$USERA4= <user>
##$USERA5= <user>
##$V9= 5
##$VALIST= <valist>
##$VCLIST= <CCCCCCCCCCCCCCC>
##$VD= 0
##$VDLIST= <DDDDDDDDDDDDDDD>
##$VPLIST= <PPPPPPPPPPPPPPP>
##$VTLIST= <TTTTTTTTTTTTTTT>
##$WBST= 2048
##$WBSW= 25
##$XGAIN= (0..3)
0 0 0 0
##$XL= 0
##$YL= 0
##$YMAX_a= 6670861
##$YMIN_a= -12263650
##$ZGOPTNS= <>
##$ZL1= 120
##$ZL2= 120
##$ZL3= 120
##$ZL4= 120
##$ABSF1= 14.96119
##$ABSF2= -5.596992
##$ABSG= 5
##$ABSL= 3
##$ALPHA= 0
##$AQORDER= 0
##$ASSFAC= 0
##$ASSFACI= 0
##$ASSFACX= 0
##$ASSWID= 0
##$AUNMP= <proc_prof1d_extract.lims>
##$AXLEFT= 0
##$AXNAME= <>
##$AXNUC= <1H>
##$AXRIGHT= 0
##$AXTYPE= 0
##$AXUNIT= <>
##$AZFE= 0.1
##$AZFW= 0.1
##$BCFW= 0
##$BC_mod= 0
##$BYTORDP= 0
##$COROFFS= 0
##$CY= 15
##$DATMOD= 1
##$DC= 0
##$DFILT= <>
##$DTYPP= 0
##$F1P= 0
##$F2P= 0
##$FCOR= 0.5
##$FTSIZE= 131072
##$FT_mod= 6
##$GAMMA= 0
##$GB= 0
##$INTBC= 1
##$INTSCL= 1
##$ISEN= 128
##$LB= 0.3
##$LEV0= 0
##$LPBIN= 0
##$MAXI= 10000
##$MC2= 0
##$MEAN= 0
##$ME_mod= 0
##$MI= 0
##$NCOEF= 0
##$NC_proc= -2
##$NLEV= 6
##$NOISF1= 0
##$NOISF2= 0
##$NSP= 0
##$NTH_PI= 0
##$NZP= 0
##$OFFSET= 14.96119
##$PC= 1
##$PHC0= 269.1321
##$PHC1= 0
##$PH_mod= 1
##$PKNL= yes
##$PPARMOD= 0
##$PPDIAG= 0
##$PPIPTYP= 0
##$PPMPNUM= 2147483647
##$PPRESOL= 1
##$PSCAL= 4
##$PSIGN= 0
##$PYNMP= <proc.py>
##$REVERSE= no
##$SF= 400.020009561738
##$SI= 131072
##$SIGF1= 0
##$SIGF2= 0
##$SINO= 400
##$SIOLD= 131072
##$SPECTYP= <>
##$SREGLST= <1H.CDCl3>
##$SSB= 0
##$STSI= 131072
##$STSR= 0
##$SW_p= 8223.68421052631
##$SYMM= 0
##$S_DEV= 0
##$TDeff= 65536
##$TDoff= 0
##$TI= <>
##$TILT= no
##$TM1= 0
##$TM2= 0
##$TOPLEV= 0
##$USERP1= <user>
##$USERP2= <user>
##$USERP3= <user>
##$USERP4= <user>
##$USERP5= <user>
##$WDW= 1
##$XDIM= 131072
##$YMAX_p= 426337455
##$YMIN_p= -11802
##$CURPLOT= <Network HP LaserJet P1505>
##$CURPRIN= <$Network HP LaserJet P1505>
##$DFORMAT= <normdp>
##$LAYOUT= <+/1D_H.xwp>
##$LFORMAT= <normlp>
##$PFORMAT= <normpl>
##$SURQMSG= 1
$$ End of Bruker specific parameters
$$ ---------------------------------
##NTUPLES= NMR SPECTRUM
##VAR_NAME=  FREQUENCY,     SPECTRUM/REAL,   SPECTRUM/IMAG
##SYMBOL=    X,             R,               I
##VAR_TYPE=  INDEPENDENT,   DEPENDENT,       DEPENDENT
##VAR_FORM=  AFFN,          ASDF,            ASDF
##VAR_DIM=   131072,        131072,          131072
##UNITS=     HZ,            ARBITRARY UNITS, ARBITRARY UNITS
##FACTOR=    0.0627417313425164, 1,          1
##FIRST=     8223.62146879497, -741,         -59015
##LAST=      0,             721,             -59495
##MIN=       0,             -11802,          0
##MAX=       8223.62146879497, 426337455,    0
$$ Real data points
##PAGE= N=1
##DATA TABLE= (X++(R..R)), XYDATA
$$ [...]
$$ plain form
63898 826784 808069 793178 781331 772332 765912 761014 756457 752087 748463 745560 742586 739113 735598
63885 735598 732656 730493 729292 729685 732580 738822 749039 763495 782023 804367 830534 860572 894236
63872 894236 931260 971766 1015917 1063397 1113800 1167304 1224334 1284573 1346970 1410625 1474973
63861 1474973 1539074 1601548 1661393 1718160 1771015 1818285 1858365 1890583 1914774 1930495 1937185
63850 1937185 1934754 1923527 1903776 1875674 1839547 1795801 1744801 1687263 1624687 1558894 1491041
63839 1491041 1421401 1350307 1279003 1209193 1141859 1076902 1014133 954302 898777 848235 802048
63828 802048 759103 718945 681908 648395 618346 591341 566929 544771 524575 506012 488759
63817 488759 472726 458126 445131 433514 422898 413328 405182 398407 392235 385868 379122 372217 365342
$$ packed form
63898H26784j8715j4891j1847q999o420m898m557m370l624k903k974l473l515
63885G35598k942k163j201L93K895O242J0217J4456J8528K2344K6167L0038L3664
63872H94236L7024M0506M4151M7480N0403N3504N7030O0239O2397O3655O4348
63861A474973O4101O2474N9845N6767N2855M7270M0080L2218K4191J5721O690
63850A937185k431j1227j9751k8102l6127m3746n1000n7538o2576o5793o7853
63839A491041o9640p1094p1304o9810o7334o4957o2769n9831n5525n0542m6187
63828H02048m2945m0158l7037l3513l0049k7005k4412k2158k0196j8563j7253
63817D88759j6033j4600j2995j1617j0616r570q146o775o172o367o746o905o875
$$ plain form
63804 365342 358705 352601 346980 341164 334441 326828 319019 311757 305504 300430 296341 292760 289356 286135
63790 286135 283029 279744 276387 273829 272791 272767 272459 271219 269533 268154 267308 266871 266742 266807 266756 266191 264877
63773 264877 262934 260926 259565 259114 259140 259032 258570 257802 256717 255397 254199 253325 252462 251369 250645 251234 253143
63756 253143 255234 256449 256781 256954 257566 258784 260518 262630 265093 268018 271357 274574 276895 278031 278491
63741 278491 279114 280394 282248 284280 286181 287929 289584 291033 292216 293583 295867 299237 303103 307107
63727 307107 311816 317912 325031 332126 338753 345310 351932 357815 361899 363800 363872 362679 360626 357901 354526
63712 354526 350465 345747 340527 335181 330342 326531 323634 321074 318760 317423 317671 319120 320974 323087
63698 323087 325772 328803 331423 333389 335333 337850 340737 343359 345359 346811 347943 348899 349604 349836 349574
$$ packed form
63804C65342o637o104n621n816o723p613p809p262o253n074m089l581l404l221
63790B86135l106l285l357k558j038k4l08j240j686j379q46m37j29O5n1n65j314
63773B64877j943k008j361m51K6j08m62p68j085j320j198q74q63j093p24N89J909
63756B53143K091J215L32J73O12J218J734K112K463K925L339L217K321J136M60
63741B78491O23J280J854K032J901J748J655J449J183J367K284L370L866M004
63727C07107M709O096P119P095O627O557O622N883M084J901P2j193k053k725l375
63712C54526m061m718n220n346m839l811k897k560k314j337K48J449J854K113
63698C23087K685L031K620J966J944K517K887K622K000J452J132R56P05K32k62
$$ plain form
63683 349574 349186 349047 349090 349075 349162 349872 351509 353963 357031 360590 364469 368444 372338 375926 378937 381445
63667 381445 383994 386937 389782 391532 391542 389708 386136 381175 375569 370029 364712 359524 354670 350346 346229
63652 346229 341973 338050 335340 333961 333272 332932 333118 333689 334098 334407 335475 337732 340490 342915 345050 347424
63636 347424 350290 353773 358292 364178 371185 378861 387181 396341 406132 416051 426038 436785 449181 463599
63622 463599 479754 497212 515955 536292 558181 580993 604273 628456 654344 681969 710410
63611 710410 738596 765641 790393 811361 827379 837996 843179 843226 839147 832549 824776 816411 807699
63598 807699 798978 790487 782133 773638 764508 753803 740471 724160 705383 684798 662890 640451
63586 640451 618684 598395 579558 562007 546088 532249 520458 510494 502458 496563 492791 491149
$$ packed form
63683C49574l88j39M3j5Q7P10J637K454L068L559L879L975L894L588L011K508
63667C81445K549K943K845J750J0j834l572m961n606n540n317n188m854m324m117
63652C46229m256l923k710j379o89l40J86N71M09L09J068K257K758K425K135K374
63636C47424K866L483M519N886P007P676Q320R160R791R919R987J0747J2396J4418
63622D63599J6155J7458J8743K0337K1889K2812K3280K4183K5888K7625K8441
63611G10410K8186K7045K4752K0968J6018J0617N183M7m079o598p773q365q712
63598H07699q721q491q354q495r130j0705j3332j6311j8777k0585k1908k2439
63586F40451k1767k0289j8837j7551j5919j3839j1791r964q036n895l772j642
$$ plain form
63574 491149 491911 495065 499817 505202 511060 517937 526093 535083 544359 553878 564013 575111 587290 600554
63560 600554 615005 630928 648650 668479 690972 717238 748505 785105 825955 869179 913039
63549 913039 955938 995386 1027244 1046640 1050522 1039889 1019431 994700 969593 946220 926018 909901
63537 909901 897606 888015 880296 874061 868369 861492 852018 839535 823971 805103 783147 759178 734295
63524 734295 708787 682566 656004 629842 604700 581167 559937 541239 524406 508601 493786
63513 493786 480454 468596 457613 447205 437750 429679 422912 417108 412075 407699 403676 399642 395553
63500 395553 391809 388875 386828 385288 383741 381833 379444 376791 374609 373884 375046 377566 380630 384026
63486 384026 388025 392619 397377 401967 406374 410754 415452 420959 427193 433019 437249 440075 442649 445162
$$ packed form
63574D91149P62L154M752N385N858O877Q156Q990R276R519J0135J1098J2179J3264
63560F00554J4451J5923J7722J9829K2493K6266L1267L6600M0850M3224M3860
63549I13039M2899L9448L1858J9396L882j0633k0458k4731k5107k3373k0202j6117
63537I09901j2295r591p719o235n692o877r474j2483j5564j8868k1956k3969k4883
63524G34295k5508k6221k6562k6162k5142k3533k1230j8698j6833j5805j4815
63513D93786j3332j1858j0983j0408r455q071o767n804n033m376m023m034m089
63500C95553l744k934k047j540j547j908k389k653k182p25J162K520L064L396
63486C84026L999M594M758M590M407M380M698N507O234N826M230K826K574K513
$$ plain form
63472 445162 446267 444698 440650 435142 428850 422102 415329 408815 402429 396198 390734 386580 383575 381432
63458 381432 380541 381563 384440 388427 392944 397897 403329 409340 416368 425139 436261 450000 466334 485066
63444 485066 506136 530076 557953 590583 627944 669372 713694 758584 800070 833543 855788
63433 855788 866303 866968 860702 850300 838242 827251 820410 820081 826637 838756 855036 874910 898041
63420 898041 923594 950433 977344 1002567 1023604 1038123 1045016 1044586 1038233 1028178 1016705 1005040
63408 1005040 993208 981196 969590 958585 947083 933528 917236 898210 876157 850604 821825
63397 821825 790953 759212 727638 697315 669130 643265 619517 598098 579583 564021 550714
63386 550714 539010 529017 521402 516769 515133 515751 517515 519836 523071 527876 534335 542064 550876 560928
$$ packed form
63472D45162J105j569m048n508o292o748o773o514o386o231n464m154l005k143
63458C81432q91J022K877L987M517M953N432O011P028Q771J1122J3739J6334J8732
63444D85066K1070K3940K7877L2630L7361M1428M4322M4890M1486L3473K2245
63433H55788J0515O65o266j0402j2058j0991o841l29O556J2119J6280J9874K3131
63420H98041K5553K6839K6911K5223K1037J4519O893m30o353j0055j1473j1665
63408A005040j1832j2012j1606j1005j1502j3555j6292j9026k2053k5553k8779
63397H21825l0872l1741l1574l0323k8185k5865k3748k1419j8515j5562j3307
63386E50714j1704r993p615m633j636O18J764K321L235M805O459P729Q812J0052
$$ plain form
63372 560928 572378 585428 600591 618365 638574 660397 683183 707030 732565 760370 790472
63361 790472 822106 853977 884945 914373 941643 965582 984656 997668 1004146 1004384 999437 990869
63349 990869 980189 968574 957158 947015 938335 929904 919966 907564 892723 875563 855814 833242
63337 833242 808160 781473 754511 728736 705220 684287 665802 649896 637388 629536 627322 630621
63325 630621 637883 646617 654090 657310 652900 638366 614294 584772 554838 527439 502888 480562
63313 480562 460342 442713 428183 416761 407712 399952 392883 386653 381439 376943 372889 369488 366889
63300 366889 364562 361848 358858 356252 354290 352665 351155 349894 348995 348202 347031 345221 343254 342287 342962
63285 342962 344223 344093 341917 339070 337027 335699 334311 332947 332164 331774 331186 330517 330290 330368 330298 330433 331548
$$ packed form
63372E60928J1450J3050J5163J7774K0209K1823K2786K3847K5535K7805L0102
63361G90472L1634L1871L0968K9428K7270K3939J9074J3012O478K38m947q568
63349I90869j0680j1615j1416j0143q680q431r938j2402j4841j7160j9749k2572
63337H33242k5082k6687k6962k5775k3516k0933j8485j5906j2508p852k214L299
63325F30621P262Q734P473L220m410j4534k4072k9522k9934k7399k4551k2326
63313D80562k0220j7629j4530j1422r049p760p069o230n214m496m054l401k599
63300C66889k327k714k990k606j962j625j510j261q99p93j171j810j967r67O75
63285C42962J261j30k176k847k043j328j388j364p83l90n88o69k27P8p0J35J115
$$ plain form
63268 331548 333503 335400 336999 338875 341144 343212 344971 347170 350256 353715 356874 359558 361701 363118
63254 363118 364055 365273 367291 370084 373694 378387 383959 389621 394936 400285 406095 412262 418674 425669
63240 425669 433554 442193 451523 462031 474249 488120 503280 519676 537518 556805 577200 598220
63228 598220 619417 640448 661084 681043 699870 717298 733727 750049 766990 784820 803526
63217 803526 822785 841910 860403 878553 896924 915073 931342 944133 952976 958115 959455 956276
63205 956276 947868 934284 916480 895655 872403 846803 819523 792334 766976 743894 722745 703791
63193 703791 687844 674933 664104 654858 647995 644665 645162 649018 655739 665030 676646 690321 705629
63180 705629 721875 738506 755696 774019 793428 813057 832211 850994 869730 888280 906302
$$ packed form
63268C31548J955J897J599J876K269K068J759K199L086L459L159K684K143J417
63254C63118R37J218K018K793L610M693N572N662N315N349N810O167O412O995
63240D25669P885Q639R330J0508J2218J3871J5160J6396J7842J9287K0395K1020
63228E98220K1197K1031K0636J9959J8827J7428J6429J6322J6941J7830J8706
63217H03526J9259J9125J8493J8150J8371J8149J6269J2791Q843N139J340l179
63205I56276q408j3584j7804k0825k3252k5600k7280k7189k5358k3082k1149j8954
63193G03791j5947j2911j0829r246o863l330M97L856O721R291J1616J3675J5308
63180G05629J6246J6631J7190J8323J9409J9629J9154J8783J8736J8550J8022
$$ plain form
63169 906302 923793 940891 957305 972251 984858 994521 1000897 1003702 1002470 996671 986118 971037
63157 971037 951593 927748 899988 869833 839089 808776 779238 750887 724119 698718 674210
63146 674210 650819 629374 610304 593399 578463 565429 553812 542929 532831 524220 517278 511326
63134 511326 505865 501186 497665 495120 493202 491796 490769 489860 489163 489144 489915 490964 491822 492564 493484 494780
63118 494780 496632 498986 501184 502436 502853 503419 504855 507123 510040 513439 516509 517937 517199 515079 512607
63103 512607 510243 508369 507646 508251 509435 510432 511234 512048 512675 512976 513352 514179 515284 516462 517945 519830
63087 519830 521600 522786 523629 524612 525874 527545 530061 533537 537385 541185 545362 550316 555461 559998 564226
63072 564226 569188 575286 582091 589359 597345 606080 615198 624722 635414 648005 662430 678068 694537
$$ packed form
63169I06302J7491J7098J6414J4946J2607R663O376K805j232n799j0553j5081
63157I71037j9444k3845k7760l0155l0744l0313k9538k8351k6768k5401k4508
63146F74210k3391k1445j9070j6905j4936j3034j1617j0883j0098q611o942n952
63134E11326n461m679l521k545j918j406j027r09o97j9P71J049Q58P42R20J296
63118D94780J852K354K198J252M17N66J436K268K917L399L070J428p38k120k472
63103E12607k364j874p23O05J184R97Q02Q14O27L01L76Q27J105J178J483J885
63087E19830J770J186Q43R83J262J671K516L476L848L800M177M954N145M537M228
63072E64226M962O098O805P268P986Q735R118R524J0692J2591J4425J5638J6469
$$ plain form
63059 694537 712120 731501 753217 777330 803607 831931 862451 895453 931275 970138 1011710
63048 1011710 1054984 1099052 1143897 1189932 1236853 1283586 1329312 1373889 1417312 1459574 1501120
63037 1501120 1542535 1583649 1623839 1663327 1703078 1742961 1781142 1815897 1847002 1874542 1897353
63026 1897353 1913579 1922047 1922119 1912918 1893809 1865239 1828186 1783297 1731536 1675195 1617106 1559017
63014 1559017 1501636 1446018 1393862 1346532 1304731 1269071 1240057 1217426 1200422 1188908 1183529
63003 1183529 1184637 1191693 1203829 1220341 1240542 1263765 1289751 1318526 1349692 1382261 1415383 1448902
62991 1448902 1483067 1517984 1553435 1588872 1623483 1656476 1687433 1716253 1742691 1765966 1784671
62980 1784671 1796994 1801344 1797072 1784554 1764477 1737208 1702791 1661215 1612604 1557663 1498153 1436427
$$ packed form
63059F94537J7583J9381K1716K4113K6277K8324L0520L3002L5822L8863M1572
63048A011710M3274M4068M4845M6035M6921M6733M5726M4577M3423M2262M1546
63037A501120M1415M1114M0190L9488L9751L9883L8181L4755L1105K7540K2811
63026A897353J6226Q468P2r201j9109k8570l7053m4889n1761n6341n8089n8089
63014A559017n7381n5618n2156m7330m1801l5660k9014k2631j7004j1514n379
63003A183529J108P056J2136J6512K0201K3223K5986K8775L1166L2569L3122L3519
62991A448902L4165L4917L5451L5437L4611L2993L0957K8820K6438K3275J8705
62980A784671J2323M350m272j2518k0077k7269l4417m1576m8611n4941n9510o1726
$$ plain form
62968 1436427 1374172 1312008 1250515 1191025 1134951 1082866 1034722 990475 949950 912567 877863
62957 877863 845963 817009 790472 765617 742300 720725 700721 681901 664324 648425 634410
62946 634410 622110 611141 600884 590717 580677 571372 562827 554156 545031 536709 530580 526307 522539
62933 522539 518969 516315 514445 512018 508283 504044 500395 497438 494756 492358 490569 489458 488811 488315 487490
62918 487490 485870 483545 481221 479493 478279 477040 475332 473101 470730 468797 467546 466614 465559 464495
62904 464495 463861 463746 463876 464126 464551 464941 464824 463940 462424 460596 458917 457915 457693 457641 457124 456343 456081 456724
62886 456724 457999 459526 461070 462367 463237 463883 464599 465258 465558 465645 465969 466607 467197 467442 467193 466233 464556
62869 464556 462738 461439 460666 460108 459974 460736 462125 463259 463851 464458 465346 465948 465809 465378 465401 465985 466694 467257
$$ packed form
62968A436427o2255o2164o1493n9490n6074n2085m8144m4247m0525l7383l4704
62957H77863l1900k8954k6537k4855k3317k1575k0004j8820j7577j5899j4015
62946F34410j2300j0969j0257j0167j0040r305q545q671r125q322o129m273l768
62933E22539l570k654j870k427l735m239l649k957k682k398j789j111o47m96q25
62918D87490j620k325k324j728j214j239j708k231k371j933j251r32j055j064
62904D64495o34j15J30K50M25L90j17q84j516j828j679j002k22n2n17p81k62O43
62886D56724J275J527J544J297Q70O46P16O59L00Q7L24O38N90K45k49r60j677
62869D64556j818j299p73n58j34P62J389J134N92O07Q88O02j39m31K3N84P09N63
$$ plain form
62851 467257 467798 468597 469854 471579 473555 475510 477260 478513 478766 477789 476130 474661 473650 472690 471549
62836 471549 470622 470419 470969 471829 472497 472840 473315 474580 476665 478741 480091 480968 482105 483696 485434 487272
62820 487272 489506 492272 495559 499477 503802 507540 509834 511227 513232 516645 521046 525817 530649 535033
62806 535033 538397 541155 544714 549950 556389 563221 570272 577461 584202 590231 596520 604538 614807 626862
62792 626862 640430 656013 674236 695185 718613 744554 773511 806048 842278 881851 924488
62781 924488 970426 1020213 1074199 1132386 1194594 1260443 1329288 1400381 1472948 1545804 1617086
62770 1617086 1684743 1747163 1802971 1850438 1887524 1912501 1924222 1922073 1906164 1877492 1837513
62759 1837513 1787669 1729618 1665440 1596989 1525333 1451526 1377623 1306039 1237966 1173251 1111842
$$ packed form
62851D67257N41P99J257J725J976J955J750J253K53r77j659j469j011r60j141
62836D71549r27k03N50Q60O68L43M75J265K085K076J350Q77J137J591J738J838
62820D87272K234K766L287L918M325L738K294J393K005L413M401M771M832M384
62806E35033L364K758L559N236O439O832P051P189O741O029O289Q018J0269J2055
62792F26862J3568J5583J8223K0949K3428K5941K8957L2537L6230L9573M2637
62781I24488M5938M9787N3986N8187O2208O5849O8845P1093P2567P2856P1282
62770A617086O7657O2420N5808M7467L7086K4977J1721k149j5909k8672l9979
62759A837513m9844n8051o4178o8451p1656p3807p3903p1584o8073o4715o1409
$$ plain form
62748 1111842 1054495 1001888 953795 909503 868591 831141 797597 768398 743312 721228 701117
62737 701117 683002 667329 653641 640831 628666 618062 609695 603261 598306 594843 592754 591416 590381
62724 590381 589839 590100 591187 593188 596306 600275 604497 609141 615398 624103 634712 646099 657920 670698
62710 670698 685009 701110 719134 739276 761962 787899 817645 851076 887710 927582 971288
62699 971288 1019163 1071087 1127155 1187737 1252572 1320500 1390387 1461535 1532744 1601645 1665565
62688 1665565 1722635 1771616 1811066 1839194 1854422 1855956 1844114 1820127 1785218 1739891 1684718
62677 1684718 1621684 1553907 1483901 1412928 1342156 1273300 1207630 1145333 1086473 1031756 981712
62666 981712 935938 893921 855933 822248 792089 764302 738708 715910 695994 678200 661816
$$ packed form
62748A111842n7347n2607m8093m4292m0912l7450l3544k9199k5086k2084k0111
62737G01117j8115j5673j3688j2810j2165j0604q367o434m955l463k089j338j035
62724E90381n42K61J087K001L118L969M222M644O257Q705J0609J1387J1821J2778
62710F70698J4311J6101J8024K0142K2686K5937K9746L3431L6634L9872M3706
62699I71288M7875N1924N6068O0582O4835O7928O9887P1148P1209O8901O3920
62688A665565N7070M8981L9450K8128J5228J534j1842k3987l4909m5327n5173
62677A684718o3034o7777p0006p0973p0772o8856o5670o2297n8860n4717n0044
62666I81712m5774m2017l7988l3685l0159k7787k5594k2798j9916j7794j6384
$$ plain form
62655 661816 646721 633053 620811 609802 599704 590301 581830 574764 569048 563935 558834 553937 549751
62642 549751 546497 544268 543135 542626 541655 539558 536814 534241 531961 529762 528002 527338 527667 528060 527791 526979
62626 526979 526273 526224 526909 527888 528574 528864 529195 529859 530582 530967 531008 530895 530754 530891 531947 534374 538004 542456
62608 542456 547690 553859 560925 568750 577373 586966 597756 610184 624800 641772 660784 681616 704494
62595 704494 729696 757199 786887 818686 852290 887167 922970 959415 995514 1029443 1059461
62584 1059461 1084535 1103960 1117033 1123426 1123319 1116785 1103644 1084219 1059700 1031413 1000210 966853
62572 966853 932281 897188 861985 827515 794996 764803 736146 708527 682767 659938 640059
62561 640059 622516 606990 593130 580091 567433 555988 546806 539633 533370 527660 522999 519513 516664
$$ packed form
62655F61816j5095j3668j2242j1009j0098r403q471p066n716n113n101m897m186
62642E49751l254k229j133n09r71k097k744k573k280k199j760o64L29L93k69q12
62626E26979p06m9O85R79O86K90L31O64P23L85M1j13j41J37J056K427L630M452
62608E42456N234O169P066P825Q623R593J0790J2428J4616J6972J9012K0832K2878
62595G04494K5202K7503K9688L1799L3604L4877L5803L6445L6099L3929L0018
62584A059461K5074J9425J3073O393j07o534j3141j9425k4519k8287l1203l3357
62572I66853l4572l5093l5203l4470l2519l0193k8657k7619k5760k2829j9879
62561F40059j7543j5526j3860j3039j2658j1445r182p173o263n710m661l486k849
$$ plain form
62548 516664 514104 511872 509729 507193 504384 502091 500808 500225 499818 499457 499300 499511 500194 501377 502980 505064
62532 505064 508019 512301 517958 524485 531126 537479 544117 552452 563428 576399 590008 604175 620338
62519 620338 639531 661216 684487 709516 737143 767828 801682 838786 878738 920435 963010
62508 963010 1006375 1050241 1093267 1133823 1170963 1203992 1231889 1253987 1270518 1281767 1287548 1288367
62496 1288367 1286083 1282234 1276611 1268894 1260908 1255564 1253870 1254566 1256501 1259730 1264118 1268264 1270175 1268110
62482 1268110 1260823 1248109 1231189 1211469 1188744 1161391 1128236 1089363 1045530 998224 950226
62471 950226 904513 862031 821539 781888 743460 707284 674073 644595 619650 598962 580991
62460 580991 564535 549801 537374 526953 517784 509684 502924 497489 493035 489343 486427 484437 483614
$$ packed form
62548E16664k560k232k143k536k809k293j283n83m07l61j57K11O83J183J603K084
62532E05064K955M282N657O527O641O353O638Q335J0976J2971J3609J4167J6163
62519F20338J9193K1685K3271K5029K7627L0685L3854L7104L9952M1697M2575
62508I63010M3365M3866M3026M0556L7140L3029K7897K2098J6531J1249N781Q19
62496A288367k284l849n623p717p986n344j694O96J935L229M388M146J911k065
62482A268110p287j2714j6920j9720k2725k7353l3155l8873m3833m7306m7998
62471I50226m5713m2482m0492l9651l8428l6176l3211k9478k4945k0688j7971
62460E80991j6456j4734j2427j0421r169q100o760n435m454l692k916j990q23
$$ plain form
62447 483614 484059 485469 487476 490184 493814 497886 501426 504054 506158 507952 509163 509827 510544 511547 512170
62432 512170 511592 509567 506193 501618 496295 490942 485838 480723 475629 471228 467939 465234 462250 458669
62418 458669 454688 450585 446719 443598 441474 440082 439008 438049 437052 435734 434030 432400 431583 432046 433651
62403 433651 435697 437405 438623 439910 441725 443882 446234 449397 453995 459467 464560 468936 473366 478274
62389 478274 483216 488069 493718 500983 509620 518920 528589 538415 547707 555899 563317 570663 577902 584293
62375 584293 589449 593880 598525 604170 611369 620573 632046 645718 661272 678531 697887 720238 746428
62362 746428 776736 810948 848640 889375 932992 979903 1030598 1084350 1138774 1191123 1239694
62351 1239694 1283491 1321102 1350907 1372289 1385825 1392325 1392382 1386713 1375987 1360200 1339047 1313063
$$ packed form
62447D83614M45J410K007K708L630M072L540K628K104J794J211O64P17J003O23
62432E12170n78k025l374m575n323n353n104n115n094m401l289k705k984l581
62418D58669l981m103l866l121k124j392j074r59r97j318j704j630q17M63J605
62403D33651K046J708J218J287J815K157K352L163M598N472N093M376M430M908
62389D78274M942M853N649P265Q637R300R669R826R292Q192P418P346P239O391
62375E84293N156M431M645N645P199R204J1473J3672J5554J7259J9356K2351K6190
62362G46428L0308L4212L7692M0735M3617M6911N0695N3752N4424N2349M8571
62351A239694M3797L7611K9805K1382J3536O500N7n669j0726j5787k1153k5984
$$ plain form
62339 1313063 1283604 1251525 1216675 1179059 1139774 1100408 1062036 1025127 989865 956114 923413
62328 923413 891454 860473 831079 803795 778662 755029 731976 709338 688120 669322 652610
62317 652610 636760 621216 606476 593080 581099 570585 561688 554182 547623 542049 537816 534735 532215
62304 532215 530300 529632 530227 531261 532345 534066 536901 540429 544073 547788 551574 555105 558379 561990 566137
62289 566137 569918 572224 572943 572816 572528 572350 572226 571838 570935 569849 569320 569687 570785 572707 575923 580371
62273 580371 585229 590108 595807 603471 613488 625697 640074 656713 675636 697132 721950 750738
62261 750738 783695 821022 863164 910114 960913 1014254 1069253 1125197 1180819 1234155 1282871
62250 1282871 1324596 1357474 1380804 1394949 1400574 1398344 1389352 1375026 1356212 1332772 1304382 1271247
$$ packed form
62339A313063k9459l2079l4850l7616l9285l9366l8372l6909l5262l3751l2701
62328I23413l1959l0981k9394k7284k5133k3633k3053k2638k1218j8798j6712
62317F52610j5850j5544j4740j3396j1981j0514q897p506o559n574m233l081k520
62304E32215j915o68N95J034J084J721K835L528L644L715L786L531L274L611M147
62289E66137L781K306P19j27k88j78j24l88r03j086n29L67J098J922L216M448
62273E80371M858M879N699P664J0017J2209J4377J6639J8923K1496K4818K8788
62261G50738L2957L7327M2142M6950N0799N3341N4999N5944N5622N3336M8716
62250A282871M1725L2878K3330J4145N625k230q992j4326j8814k3440k8390l3135
$$ plain form
62238 1271247 1233934 1193237 1150568 1107870 1066608 1027224 989884 955235 924030 896462 872234
62227 872234 850911 831869 814310 797665 781731 766304 751078 735990 721132 706257 690907
62216 690907 675172 659686 644833 630672 617739 606962 598386 590812 583186 575681 569060 563747 559981
62203 559981 558079 557864 558406 558957 559782 561673 565106 570193 576848 584629 592958 601835 611717 622436 633024
62188 633024 643011 653070 663850 674951 685691 696111 706420 715992 723778 729531 734074 738548 743650
62175 743650 749267 754773 760245 767445 778834 795406 816343 840913 869503 902256 937976 975221
62163 975221 1013441 1051964 1088734 1121196 1147961 1168712 1183096 1190757 1192102 1188096 1179459 1166603
62151 1166603 1149956 1129725 1105757 1078115 1047412 1014227 978955 942706 907507 874915 845173
$$ packed form
62238A271247l7313m0697m2669m2698m1262l9384l7340l4649l1205k7568k4228
62227H72234k1323j9042j7559j6645j5934j5427j5226j5088j4858j4875j5350
62216F90907j5735j5486j4853j4161j2933j0777q576p574p626p505o621n313l766
62203E59981j902k15N42N51Q25J891L433N087O655P781Q329Q877R882J0719J0588
62188F33024R987J0059J0780J1101J0740J0420J0309R572P786N753M543M474N102
62175G43650N617N506N472P200J1389J6572K0937K4570K8590L2753L5720L7245
62163I75221L8220L8523L6770L2462K6765K0751J4384P661J345m006q637j2856
62151A166603j6647k0231k3968k7642l0703l3185l5272l6249l5199l2592k9742
$$ plain form
62140 845173 818262 794779 774962 757910 742879 730479 721363 714547 708350 702495 697958 695171 693749
62127 693749 693722 695753 700136 706557 714833 725063 737255 751486 768017 786421 805034 822262 837943
62114 837943 852455 864933 873635 877810 878128 875563 871033 865857 861186 856771 851284 843893 834770 824391
62100 824391 813489 803528 796040 791376 789108 789541 793645 801419 811531 822857 835331 849000 863205
62087 863205 877188 890801 904270 917829 931784 946459 961945 978320 996038 1015639 1037275
62076 1037275 1061004 1087106 1115398 1144654 1173613 1202249 1231091 1259691 1286884 1312349 1336611
62065 1336611 1359599 1380471 1398967 1415681 1430634 1442632 1450374 1453374 1451728 1445984 1437361 1426991
62053 1426991 1414648 1399221 1380658 1360325 1339061 1315998 1289877 1260543 1228557 1194217 1157765
$$ packed form
62140H45173k6911k3483j9817j7052j5031j2400r116o816o197n855m537k787j422
62127F93749k7K031M383O421Q276J0230J2192J4231J6531J8404J8613J7228J5681
62114H37943J4512J2478Q702M175L18k565m530n176m671m415n487p391r123j0379
62100H24391j0902r961p488m664k268M33M104P774J0112J1326J2474J3669J4205
62087H63205J3983J3613J3469J3559J3955J4675J5486J6375J7718J9601K1636
62076A037275K3729K6102K8292K9256K8959K8636K8842K8600K7193K5465K4262
62065A336611K2988K0872J8496J6714J4953J1998P742L000j646n744q623j0370
62053A426991j2343j5427j8563k0333k1264k3063k6121k9334l1986l4340l6452
$$ plain form
62042 1157765 1119983 1081878 1044111 1007052 970941 935719 901268 868093 837183 808916 782710
62031 782710 758090 735455 715406 697864 682236 668013 654858 642526 630964 620136 609678
62020 609678 599172 588802 579135 570162 561249 552250 543991 537383 532649 529642 528287 528363 529466 531576
62006 531576 535191 540567 547262 554712 562827 571723 581176 590486 598579 604331 607336 608465 609053 609470 609079
61991 609079 607638 605879 604423 602845 600268 596346 591266 585336 579035 573093 568074 564047 560841 558333
61977 558333 556404 554960 554081 553763 553473 552460 550634 548680 547213 546241 545499 544765 543755 542269 540592 539340
61961 539340 538797 538854 539586 541331 544177 547932 552634 558467 565146 572066 579161 587022 596125 606685 619243
61946 619243 634550 652653 672937 695328 720598 749114 780041 812197 844984 878103 911151
$$ packed form
62042A157765l7782l8105l7767l7059l6111l5222l4451l3175l0910k8267k6206
62031G82710k4620k2635k0049j7542j5628j4223j3155j2332j1562j0828j0458
62020F09678j0506j0370r667q973q913q999q259o608m734l007j355P6J103K110
62006E31576L615N376O695P450Q115Q896R453R310Q093N752L005J129N88M17l91
61991F09079j441j759j456j578k577l922n080n930o301n942n019m027l206k508
61977E58333j929j444q79l18k90j013j826j954j467r72p42p34j010j486j677j252
61961E39340n43N7P32J745K846L755M702N833O679O920P095P861R103J0560J2558
61946F19243J5307J8103K0284K2391K5270K8516L0927L2156L2787L3119L3048
$$ plain form
61935 911151 944048 977159 1010316 1042206 1071333 1097192 1120011 1139690 1155558 1166950 1173563 1175437
61923 1175437 1172886 1166375 1156374 1143631 1129570 1115935 1103817 1093492 1085371 1080543 1080059 1084163 1092560
61910 1092560 1105003 1121171 1140233 1160869 1181528 1200514 1216138 1227111 1232675 1232357 1225870 1213360
61898 1213360 1195491 1173259 1147851 1120471 1091851 1062057 1031175 999995 969586 940485 912977
61887 912977 887879 866111 847496 830771 814880 799518 784554 769842 755738 742930 731551
61876 731551 721179 711763 703711 697105 691825 688500 688151 690637 694638 699568 706352 715784 727379 740576
61862 740576 756015 774683 796608 821235 848435 878379 911129 947116 987311 1032101 1080561
61851 1080561 1131549 1184842 1240362 1296971 1353028 1407600 1460073 1508885 1551684 1586689 1613108
$$ packed form
61935I11151L2897L3111L3157L1890K9127K5859K2819J9679J5868J1392O613J874
61923A175437k551o511j0001j2743j4061j3635j2118j0325q121m828m84M104Q397
61910A092560J2443J6168J9062K0636K0659J8986J5624J0973N564l18o487j2510
61898A213360j7869k2232k5408k7380k8620k9794l0882l1180l0409k9101k7508
61887I12977k5098k1768j8615j6725j5891j5362j4964j4712j4104j2808j1379
61876G31551j0372r416q052o606n280l325l49K486M001M930O784R432J1595J3197
61862G40576J5439J8668K1925K4627K7200K9944L2750L5987M0195M4790M8460
61851A080561N0988N3293N5520N6609N6057N4572N2473M8812M2799L5005K6419
$$ plain form
61840 1613108 1630464 1638427 1637427 1628822 1614461 1596508 1577439 1559492 1544069 1532099 1524758 1523190
61828 1523190 1527530 1536735 1549366 1564091 1579414 1593432 1604038 1609170 1606955 1596039 1576066 1547706
61816 1547706 1512061 1470024 1422244 1369775 1314515 1258608 1203245 1148556 1094965 1044072 997515
61805 997515 955476 917167 882460 851944 825557 802403 782081 764955 750817 738456 727047
61794 727047 716917 708378 700843 693769 687505 682399 677935 673610 669872 667277 665301 662915 659890 656740
61780 656740 653812 651185 649080 647601 646370 645008 643655 642470 641132 639448 637985 637353 637281 637063 636631
61765 636631 636479 636852 637639 638771 640190 641719 643417 645681 648497 651144 653184 655126 657382 659111 659054
61750 659054 657181 654679 652500 650710 648985 646999 644437 641324 638309 636071 634604 633557 632947 632934 633200
$$ packed form
61840A613108J7356P963j000q605j4361j7953j9069j7947j5423j1970p341j568
61828A523190M340R205J2631J4725J5323J4018J0606N132k215j0916j9973k8360
61816A547706l5645m2037m7780n2469n5260n5907n5363n4689n3591n0893m6557
61805I97515m2039l8309l4707l0516k6387k3154k0322j7126j4138j2361j1409
61794G27047j0130q539p535p074o264n106m464m325l738k595j976k386l025l150
61780F56740k928k627k105j479j231j362j353j185j338j684j463o32p2k18m32
61765F36631j52L73P87J132J419J529J698K264K816K647K040J942K256J729n7
61750F59054j873k502k179j790j725j986k562l113l015k238j467j047o10j3K66
$$ plain form
61735 633200 633290 633324 633750 634598 635621 636971 639034 641694 644424 646976 649357 651232 652115 652276 652868 654947
61719 654947 658599 663014 667126 670236 672269 673456 673812 673238 672072 670915 669651 667320 663361 658385 653255
61704 653255 648097 642794 637751 633319 628985 624045 618760 613994 609965 606191 602413 598731 594944 590678
61690 590678 586140 582016 578463 574861 570679 566050 561384 556899 552691 548949 545862 543374 540998 537975
61676 537975 533913 529341 525200 521699 518219 514473 511034 508387 506205 504087 502324 501298 500711 500078 499435
61661 499435 498952 498372 497541 497009 497415 498719 500624 503191 506324 509258 511404 513239 515608 518614 522001
61646 522001 525976 530691 535432 539421 543017 547002 550936 553309 553232 550998 547112 541763 535262 528146 520802
61631 520802 513550 506926 501182 495843 490488 485576 481623 478084 474131 470206 467588 466563 466202 465863 465734
$$ packed form
61735F33200R0L4M26Q48J023J350K063K660K730K552K381J875Q83J61N92K079
61719F54947L652M415M112L110K033J187L56n74j166j157j264k331l959m976n130
61704F53255n158n303n043m432m334m940n285m766m029l774l778l682l787m266
61690E90678m538m124l553l602m182m629m666m485m208l742l087k488k376l023
61676E37975m062m572m141l501l480l746l439k647k182k118j763j026n87o33o43
61661D99435m83n80q31n32M06J304J905K567L133K934K146J835K369L006L387
61646E22001L975M715M741L989L596L985L934K373p7k234l886n349o501p116p344
61631E20802p252o624n744n339n355m912l953l539l953l925k618j025l61l39j29
$$ plain form
61616 465734 465859 465778 465280 464452 462833 459590 454746 449284 443822 438122 432068 426096 420338 414320 408000
61601 408000 402218 397649 393948 390378 386684 382944 379110 375179 371487 368531 366670 366010 366166 366146 364991
61586 364991 362679 360039 357810 356152 354916 353863 352652 351159 349719 348651 347696 346465 345212 344545 344524
61571 344524 344626 344449 343878 342831 341527 340709 340864 341498 341882 342112 342565 342786 342111 341171 341463 343365 345725
61554 345725 347518 348750 349561 349663 349120 348674 348817 349324 350064 351466 353750 356366 358565 360004 360660 360840
61538 360840 361452 363530 367189 371613 376148 380726 385131 388643 390664 391083 389950 387490 384514 381999 380085
61523 380085 378199 376220 374708 373895 373328 372683 372073 371411 370394 369328 369019 369514 369832 369336 368480 367826 367185
61506 367185 366180 364922 363608 362163 360731 359835 359626 359622 359611 360152 361676 363692 365425 366819 368375 370353
$$ packed form
61616D65734J25q1m98q28j619l243m844n462n462n700o054n972n758o018o320
61601D08000n782m569l701l570l694l740l834l931l692k956j861o60J56k0j155
61586C64991k312k640k229j658j236j053j211j493j440j068r55j231j253o67k1
61571C44524J02j77n71j047j304q18J55O34L84K30M53K21o75r40K92J902K360
61554C45725J793J232Q11J02n43m46J43N07P40J402K284K616K199J439O56J80
61538C60840O12K078L659M424M535M578M405L512K021M19j133k460k976k515j914
61523C80085j886j979j512q13n67o45o10o62j017j066l09M95L18m96q56o54o41
61506C67185j005j258j314j445j432q96k09mj1N41J524K016J733J394J556J978
$$ plain form
61490 370353 372497 374327 375499 376128 376844 378197 380031 381771 383175 384333 385232 385993 387248 389367 391496
61475 391496 392371 391990 391395 390889 389798 388126 387040 387153 387577 387370 386900 387004 387682 388395 389022 389791 390696 391490
61457 391490 391914 391699 390883 390274 390880 392727 394884 396713 398232 399256 399414 399254 400090 402306 404992 407724
61441 407724 411410 416680 422681 428440 434319 441027 448128 454569 460036 464753 468630 471615 474332 477409
61427 477409 480666 483798 487287 491660 496400 500562 504038 507200 509649 510469 509602 507975 506247 504261 501791
61412 501791 499054 496283 493337 489983 486288 482616 479371 476650 474081 471186 467952 464731 461605 458409
61398 458409 455428 453368 452389 451821 451134 450555 450402 450533 450803 451373 452046 452116 451447 450988 451550 452663 453344 453429
61380 453429 453451 453735 454378 455665 457728 460110 462352 464707 467652 470995 474125 476892 479605 482437 485457
$$ packed form
61490C70353K144J830J172O29P16J353J834J740J404J158Q99P61J255K119K129
61475C91496Q75l81n95n06j091j672j086J13M24k07m70J04O78P13O27P69R05P94
61457C91490M24k15q16o09O06J847K157J829J519J024J58j60Q36K216K686K732
61441D07724L686N270O001N759N879O708P101O441N467M717L877K985K717L077
61427D77409L257L132L489M373M740M162L476L162K449Q20q67j627j728j986k470
61412E01791k737k771k946l354l695l672l245k721k569k895l234l221l126l196
61398D58409k981k060r79n68o87n79j53J31K70N70O73P0o69m59N62J113O81Q5
61380D53429K2K84O43J287K063K382K242K355K945L343L130K767K713K832L020
$$ plain form
61365 485457 489081 493775 499299 504723 509302 513187 517331 522785 529891 538134 547043 557144 569394 583681
61351 583681 598633 613178 627531 642245 656916 670286 681154 688947 694010 697650 701234 704863
61339 704863 707465 708333 707746 705800 701680 694780 685781 675986 666262 657094 648927 641780 635182 629061 624049
61324 624049 620434 617632 615161 613266 611959 610475 608455 606732 606040 605869 605641 606170 608801 613714 620172
61309 620172 627817 636569 645788 654779 663821 673567 683727 693259 701458 707802 711188 710637 706706 701066
61295 701066 694702 687494 679494 671514 664266 657746 651714 646164 641147 636595 632391 628358 624403 620924
61281 620924 618677 617830 617665 617719 618585 621027 624968 630156 637062 646009 655898 665041 673080 681066 689784
61266 689784 699109 708984 720041 733029 748296 765855 785270 805452 825123 843497 860006 873579
$$ packed form
61365D85457L624M694N524N424M579L885M144N454P106Q243Q909J0101J2250J4287
61351E83681J4952J4545J4353J4714J4671J3370J0868P793N063L640L584L629
61339G04863K602Q68n87j946m120o900q999r795r724r168q167p147o598o121n012
61324F24049l615k802k471j895j307j484k020j723o92j71k28N29K631M913O458
61309F20172P645Q752R219Q991R042R746J0160R532Q199O344L386n51l931n640
61295G01066o364p208q000p980p248o520o032n550n017m552m204m033l955l479
61281F20924k247q47j65N4Q66K442L941N188O906Q947R889R143Q039P986Q718
61266F89784R325R875J1057J2988J5267J7559J9415K0182J9671J8374J6509J3573
$$ plain form
61254 873579 882817 886888 885806 880032 870327 857827 843661 828522 812868 797230 782037 767531
61242 767531 754211 742786 733331 725153 717994 712552 709180 706889 704568 702434 701290 701004 700851 700832 701469
61227 701469 702617 703644 704580 706067 708295 710814 713124 714681 714781 713419 711851 711326 711698 712231 713181 715302
61211 715302 718236 720790 722634 724386 726222 727822 729683 733049 738283 744527 751259 759097 768804 780505
61197 780505 794084 809446 826137 843524 861384 879424 896252 909933 919737 926400 930606 932296
61185 932296 931655 929610 926885 923414 919002 913672 907111 898754 888870 878724 869146 859606 849161 837642
61171 837642 825476 812832 799499 785265 770090 754143 737892 721986 706955 693147 680803
61160 680803 669944 660436 652476 646681 643299 641751 641441 642532 645289 649167 653376 657904 663096 668436
$$ packed form
61254H73579R238M071j082n774r705j2500j4166j5139j5654j5638j5193j4506
61242G67531j3320j1425r455q178p159n442l372k291k321k134j144k86j53j9O37
61227G01469J148J027R36J487K228K519K310J557J00j362j568n25L72N33R50K121
61211G15302K934K554J844J752J836J600J861L366N234O244O732P838R707J1701
61197G80505J3579J5362J6691J7387J7860J8040J6828J3681R804O663M206J690
61185I32296o41k045k725l471m412n330o561q357r884j0146r578r540j0445j1519
61171H37642j2166j2644j3333j4234j5175j5947j6251j5906j5031j3808j2344
61160F80803j0859r508p960n795l382j548l10J091K757L878M209M528N192N340
$$ plain form
61146 668436 672579 674318 672864 667771 659647 650540 642495 635894 630164 625600 623217 623080 624309 626731
61132 626731 631161 637820 645707 653848 662130 670709 679626 689281 700345 712933 726610 741272 757116
61119 757116 773714 790096 805872 821341 836426 850494 863346 875415 886818 897107 906090 913997
61107 913997 920699 925678 928857 930547 930485 927815 922181 913996 903566 890792 875770 858876 840348
61094 840348 820608 800832 782182 764671 747730 731612 717015 703656 690663 678322 667923
61083 667923 659820 653036 646899 641605 637067 632777 629096 627146 626961 627144 626892 627001 628365 630809 633856
61068 633856 637406 641089 644121 646455 649059 652689 657399 663421 671294 680796 691025 701875 714164
61055 714164 728052 742763 758182 775193 793946 813248 832223 851194 870529 890125 910490
$$ packed form
61146F68436M143J739j454n093q124r107q045o601n730m564k383j37J229K422
61132F26731M430O659P887Q141Q282Q579Q917R655J1064J2588J3677J4662J5844
61119G57116J6598J6382J5776J5469J5085J4068J2852J2069J1403J0289Q983P907
61107I13997O702M979L179J690o2k670n634q185j0430j2774j5022j6894j8528
61094H40348j9740j9776j8650j7511j6941j6118j4597j3359j2993j2341j0399
61083F67923q103o784o137n294m538m290l681j950j85J83k52J09J364K444L047
61068F33856L550L683L032K334K604L630M710O022P873R502J0229J0850J2289
61055G14164J3888J4711J5419J7011J8753J9302J8975J8971J9335J9596K0365
$$ plain form
61044 910490 932652 956379 980063 1003041 1026424 1050994 1076071 1101232 1127363 1155001 1183351
61033 1183351 1211993 1241942 1273967 1307542 1342568 1380366 1421718 1465508 1510611 1557499 1606829
61022 1606829 1658337 1712655 1772435 1840025 1915736 1999984 2095145 2203364 2324544 2458999 2610610
61011 2610610 2785333 2988634 3227108 3510655 3849839 4252810 4728438 5291101 5959300
61002 5959300 6752775 7697009 8827051 10174021 11740052 13488515 15355379 17251371
60994 17251371 19037705 20516157 21490095 21879496 21790407 21462408 21135462 20951506 20947831
60985 20947831 21089465 21270257 21298510 20940172 20031794 18577229 16741138 14752099 12803737
60976 12803737 11015626 9443266 8098920 6967801 6023124 5238241 4589989 4056468 3617210
$$ packed form
61044I10490K2162K3727K3684K2978K3383K4570K5077K5161K6131K7638K8350
61033A183351K8642K9949L2025L3575L5026L7798M1352M3790M5103M6888M9330
61022A606829N1508N4318N9780O7590P5711Q4248R5161J08219J21180J34455J51611
61011B610610J74723K03301K38474K83547L39184M02971M75628N62663O68199
61002E959300P93475R44234J130042J346970J566031J748463J866864J895992
60994A7251371J786334J478452R73938L89401q9089l27999l26946j83956l675
60985B0947831J41634J80792K8253l58338r08378j454565j836091j989039j948362
60976A2803737j788111j572360j344346j131119r44677p84883o48252n33521m39258
$$ plain form
60967 3617210 3255802 2959558 2716413 2514072 2342285 2194299 2065862 1953918 1856176 1770637
60957 1770637 1695110 1627733 1567996 1516493 1473463 1437851 1407695 1380951 1355940 1331454 1306750
60946 1306750 1281621 1256496 1232261 1209635 1188747 1169532 1152302 1137427 1124598 1113067 1102594
60935 1102594 1093562 1086097 1079769 1074389 1070500 1068761 1069200 1071358 1074823 1079462 1085388 1092768 1101440 1110800
60921 1110800 1120365 1130296 1140898 1151823 1162382 1172551 1182912 1193497 1203476 1212153 1219546 1225635
60909 1225635 1229738 1231216 1230275 1227494 1222844 1215819 1206394 1195275 1183098 1169772 1154852 1138322 1120763
60896 1120763 1102863 1085017 1067433 1050302 1033599 1016963 1000176 983677 968239 954077 940693
60885 940693 927670 915182 903574 892807 882543 872413 862095 851503 841039 831224 821909 812334
$$ packed form
60967C617210l61408k96244k43145k02341j71787j47986j28437j11944r7742q5539
60957A770637p5527o7377n9737n1503m3030l5612l0156k6744k5011k4486k4704
60946A306750k5129k5125k4235k2626k0888j9215j7230j4875j2829j1531j0473
60935A102594r032p465o328n380l889j739M39K158L465M639N926P380Q672R360
60921A110800R565R931J0602J0925J0559J0169J0361J0585R979Q677P393O089
60909A225635M103J478r41k781m650p025r425j1119j2177j3326j4920j6530j7559
60896A120763j7900j7846j7584j7131j6703j6636j6787j6499j5438j4162j3384
60885I40693j3023j2488j1608j0767j0264j0130j0318j0592j0464r815r315r575
$$ plain form
60873 812334 802117 791632 781217 770745 760344 750839 742822 735825 729042 722410 716329 710701 704949
60860 704949 698825 692623 686643 680828 674778 667962 660215 652187 644865 638441 632300 626376 621644 618662
60846 618662 616366 613164 608635 603391 597762 591593 584984 578291 571533 564582 557788 551700 546307 541257
60832 541257 536711 533292 531207 530027 529303 528890 528782 529138 530408 533006 536815 541256 545636 549251 551535
60817 551535 552512 552831 553121 553645 554637 556284 558091 559084 559131 559288 560249 561325 561630 561407 561241 560759 559220 556810
60799 556810 554250 551605 548590 545607 543277 541205 538345 534491 530368 526360 522142 517509 512675 507774
60785 507774 502802 497900 493017 487600 481462 475583 471103 467806 464590 461141 458086 455704 453647 451834
60771 451834 450544 449610 448555 447534 447131 447262 447391 447826 449656 453134 457208 460915 464346 467878 471396
$$ packed form
60873H12334j0217j0485j0415j0472j0401r505q017o997o783o632o081n628n752
60860G04949o124o202n980n815o050o816p747q028p322o424o141n924m732k982
60846F18662k296l202m529n244n629o169o609o693o758o951o794o088n393n050
60832E41257m546l419k085j180p24m13j08L56J270K598L809M441M380L615K284
60817E51535R77L19K90N24R92J647J807R93M7J57R61J076L05k23j66m82j539k410
60799E56810k560k645l015k983k330k072k860l854m123m008m218m633m834m901
60785E07774m972m902m883n417o138n879m480l297l216l449l055k382k057j813
60771D51834j290r34j055j021m03J31J29M35J830L478M074L707L431L532L518
$$ plain form
60756 471396 474705 478063 481881 486307 491296 496609 501745 506338 510603 514916 519099 522659 525462 527464
60742 527464 528079 526667 523485 519279 514155 507765 500475 493299 486634 480053 473327 466744 460328 453791
60728 453791 447406 441989 437769 434103 430515 427198 424324 421635 418975 416508 414244 411988 409869 408247
60714 408247 407023 405724 404357 403465 403203 403028 402357 401010 399100 397104 395883 395888 396492 396862 397212 398301 400039
60697 400039 401660 403107 404969 407077 408499 409156 410244 412624 415845 419127 422380 425841 429550 433549
60683 433549 437836 441909 445158 447968 451635 456892 463259 469975 476747 483367 489454 494857 499661 503652
60669 503652 506461 508198 509110 508653 505960 501309 496138 491465 487377 484107 482307 481799 481258 479725 477582
60654 477582 475616 474040 472867 472244 471920 471153 469625 467737 465711 463207 460113 456786 453221 448911 443899
$$ packed form
60756D71396L309L358L818M426M989N313N136M593M265M313M183L560K803K002
60742E27464O15j412l182m206n124o390p290p176o665o581o726o583o416o537
60728D53791o385n417m220l666l588l317k874k689k660k467k264k256k119j622
60714D08247j224j299j367q92k62j75o71j347j910j996j221NO04L70L50J089J738
60697D00039J621J447J862K108J422O57J088K380L221L282L253L461L709L999
60683D33549M287M073L249K810L667N257O367O716O772O620O087N403M804L991
60669E03652K809J737R12m57k693m651n171m673m088l270j800n08n41j533k143
60654D77582j966j576j173o23l24p67j528j888k026k504l094l327l565m310n012
$$ plain form
60639 443899 439028 434781 430839 427186 424605 423473 422957 422012 420483 418791 417339 416626 417076 418289 419227
60624 419227 419584 420117 421271 422395 422798 422661 422343 421702 420716 419977 419994 420657 421787 423343 424707 424719 423019
60607 423019 420481 417925 415385 413142 412271 413264 415020 416118 416360 416331 416270 416193 416386 416895 417148 416878 416798 417654
60589 417654 419202 420808 422391 424009 425205 425622 425747 426225 426877 427128 426954 426728 426579 426528 426872 427822 429232
60572 429232 431145 434093 438340 443383 448718 454533 461099 468078 475026 481960 488922 495588 501894 508313
60558 508313 514854 520416 523876 525272 525315 524368 522653 520923 520111 520661 522617 525821 529555 532797 535526
60543 535526 539055 544392 551023 558171 566378 576740 589073 602003 614540 626586 638078 648604
60531 648604 657711 664815 668899 669123 665776 660139 653489 646610 639896 633375 626789 620158 614067 609119
$$ packed form
60639D43899m871m247l942l653k581j132n16r45j529j692j452p13M50J213R38
60624D19227L57N33J154J124M03j37l18o41r86p39J7O63J130J556J364J2j700
60607D23019k538k556k540k243q71R93J756J098K42k9o1p7J93N09K53k70q0Q56
60589D17654J548J606J583J618J196M17J25M78O52K51j74k26j49n1L44R50J410
60572D29232J913K948M247N043N335N815O566O979O948O934O962O666O306O419
60558E08313O541N562L460J396M3r47j715j730q12N50J956L204L734L242K729
60543E35526L529N337O631P148Q207J0362J2333J2930J2537J2046J1492J0526
60531F48604R107P104M084K24l347n637o650o879o714o521o586o631o091m948
$$ plain form
60517 609119 605428 602955 601810 601819 602328 602964 604131 606306 609332 612868 616966 621695 626774 632219 638908
60502 638908 647936 659797 674607 692575 713782 738037 765364 795937 829110 863297 897371 931296
60490 931296 964568 994905 1019405 1036379 1045197 1045137 1035597 1017030 990714 957939 920341 880503
60478 880503 841080 803427 767848 734836 705158 679009 655987 635782 618105 602239 587546
60467 587546 574298 563166 554008 545894 538193 530884 523924 517111 510608 504927 500266 496302 492658 489237
60453 489237 486168 483717 482036 480741 479039 476546 473640 470802 468114 465670 463809 462510 461241 459913
60439 459913 459332 460061 461476 462578 463106 463169 462472 460788 458715 457061 455821 454527 453225 452342 451904 451591
60423 451591 451352 451377 451780 452759 454584 456938 458836 459774 460405 461484 462850 464065 465225 466280 466328 464714
$$ packed form
60517F09119l691k473j145RN09O36J167K175L026L536M098M729N079N445O689
60502F38908R028J1861J4810J7968K1207K4255K7327L0573L3173L4187L4074L3925
60490I31296L3272L0337K4500J6974Q818o0r540j8567k6316l2775l7598l9838
60478H80503l9423l7653l5579l3012k9678k6149k3022k0205j7677j5866j4693
60467E87546j3248j1132r158q114p701p309o960o813o503n681m661l964l644l421
60453D89237l069k451j681j295j702k493k906k838k688k444j861j299j269j328
60439D59913n81P29J415J102N28O3o97j684k073j654j240j294j302q83m38l13
60423D51591k39K5M03R79J825K354J898R38O31J079J366J215J160J055M8j614
$$ plain form
60407 464714 462284 460571 460131 460594 461756 463533 465283 466348 467069 468289 470081 471838 473302 474621 475734
60392 475734 476648 478044 480653 484224 487966 491666 495499 499096 501907 504274 507123 510638 514179 517435
60378 517435 520700 523999 526796 528716 529973 531027 532230 533671 534934 535322 534733 533971 533757 533975 534342 535089
60362 535089 536346 537591 538497 539618 541425 543453 545365 548020 552282 557434 562096 566205 570809 576320
60348 576320 582284 588442 594658 599994 603293 604657 605194 605378 604772 603212 601067 598372 594813 590594 586306
60333 586306 582047 577674 573680 570700 568292 565422 562097 559293 557292 555315 552962 550858 549571 548854
60319 548854 548237 547603 547006 546585 546705 547584 548897 550380 552550 556131 561151 567384 575234 585185 596810
60304 596810 609345 622838 637648 653191 668303 682343 694632 703373 706743 704933 699607 691533
$$ packed form
60407D64714k430j713m40M63J162J777J750J065P21J220J792J757J464J319J113
60392D75734R14J396K609L571L742L700L833L597K811K367K849L515L541L256
60378E17435L265L299K797J920J257J054J203J441J263L88n89p62k14K18L67P47
60362E35089J257J245R06J121J807K028J912K655M262N152M662M109M604N511
60348E76320N964O158O216N336L299J364N37J84o06j560k145k695l559m219m288
60333E86306m259m373l994k980k408k870l325k804k001j977k353k104j287p17
60319E48854o17o34n97m21J20Q79J313J483K170L581N020O233P850R951J1625
60304E96810J2535J3493J4810J5543J5112J4040J2289Q741L370j810n326q074
$$ plain form
60292 691533 680318 666414 651565 637020 622825 609197 597030 586522 576679 566856 557770 550482
60280 550482 545279 541837 539504 537187 534059 530684 528441 527607 527019 525863 524641 524083 524151 524531 525071 525364
60264 525364 524794 523412 522005 521052 520389 519964 520018 520369 520496 520497 521056 522280 523493 524231 524532 524204 522861 520795
60246 520795 518813 517165 515629 514561 514608 515351 515564 515039 514850 515588 516671 517789 519642 522715 526441 530112
60230 530112 533620 536874 539559 541881 544521 547466 549920 551680 553454 555487 557100 558136 559646 562491
60216 562491 566277 570289 574476 578876 583096 587047 591341 596261 601029 604754 607439 609578 611401 612896
60202 612896 613959 614239 613460 612092 610941 609955 608372 606146 604148 602683 600966 598560 596308 595240 595341
60187 595341 595910 596414 596542 596097 595236 594281 593194 591857 590754 590487 590692 590456 589761 589428 589611 589593 589161 588948
$$ packed form
60292F91533j1215j3904j4849j4545j4195j3628j2167j0508r843r823r086p288
60280E50482n203l442k333k317l128l375k243q34n88j156j222n58O8L80N40K93
60264E25364n70j382j407r53o63m25N4L51J27JN59J224J213P38L01l28j343k066
60246E20795j982j648j536j068M7P43K13n25j89P38J083J118J853L073L726L671
60230E30112L508L254K685K322K640K945K454J760J774K033J613J036J510K845
60216E62491L786M012M187M400M220L951M294M920M768L725K685K139J823J495
60202F12896J063K80p79j368j151r86j583k226j998j465j717k406k252j068J01
60187E95341N69N04J28m45q61r55j087j337j103k67K05k36o95l33J83j8m32k13
$$ plain form
60169 588948 589298 590059 591584 594493 598165 600964 602328 603249 604335 604949 604787 604783 605636 606764 607401 607607 607568
60152 607568 607184 606934 607932 610424 613442 616436 619980 624252 628237 631258 633971 637040 640018 642350 644367
60137 644367 646565 649006 652006 656127 660835 664527 666642 668349 670395 671736 671229 669218 666424 662675
60123 662675 657891 653008 648795 644946 641349 638848 637595 636078 633170 629856 627478 625541 622856 619711
60109 619711 617195 615249 613164 611361 611015 612324 614549 617272 620273 622704 623851 624457 626011 628904 632312
60094 632312 635548 638506 641125 643447 645992 649224 652902 656561 660142 663526 666121 667626 668472 668764 667618
60079 667618 664466 660197 656039 651944 647063 641114 634299 626577 618054 609596 602105 595647 589959 585155
60065 585155 581172 577309 573141 569142 565656 562194 558575 555761 554487 553964 552981 551536 550343 549628 549461
$$ packed form
60169E88948L50P61J525K909L672K799J364R21J086O14j62mQ53J128O37K06l9
60152F07568l84k50R98K492L018K994L544M272L985L021K713L069K978K332K017
60137F44367K198K441L000M121M708L692K115J707K046J341n07k011k794l749
60123F62675m784m883m213l849l597k501j253j517k908l314k378j937k685l145
60109F19711k516j946k085j803l46J309K225K723L001K431J147O06J554K893L408
60094F32312L236K958K619K322K545L232L678L659L581L384K595J505Q46K92j146
60079F67618l152m269m158m095m881n949o815p722q523q458p491o458n688m804
60065E85155l983l863m168l999l486l462l619k814j274n23r83j445j193p15j67
$$ plain form
60050 549461 550364 552496 555039 557432 560239 563689 566497 567540 567685 568438 569558 569574 567943 565155 561285
60035 561285 556087 550189 544688 539775 534939 530180 525870 521783 517402 512757 508018 502832 497109 491789
60021 491789 487706 484396 481123 478265 476388 474890 473003 471374 471070 471745 472320 472822 473834 474787 474611 473669
60005 473669 473261 473492 473395 472900 472908 473549 474073 474478 475570 477322 478795 479853 481486 484185 487282 490079 492420
59988 492420 494055 494683 494790 495348 496549 497765 498691 499492 499978 499705 498846 497911 496813 495212 493513 492430
59972 492430 491850 491258 490955 491659 493122 494403 495316 496468 498109 500088 502552 505536 508265 510109 511743
59957 511743 513975 515994 516454 515821 515850 516904 517608 517086 515779 514024 511622 509051 507388 506686 505964 505041
59941 505041 504830 505538 506160 506210 506441 507344 508355 509081 510067 511776 513963 516551 520061 524653 529665 534413
$$ packed form
60050E49461R03K132K543K393K807L450K808J043J45P53J120J6j631k788l870
60035E61285n198n898n501m913m836m759m310m087m381m645m739n186n723n320
60021D91789m083l310l273k858j877j498j887j629l04O75N75N02J012R53j76r42
60005D73669m08K31r7m95QO41N24M05J092J752J473J058J633K699L097K797K341
59988D92420J635O28J07N58J201J216R26Q01M86k73q59r35j098j601j699j083
59972D92430n80n92l03P04J463J281R13J152J641J979K464K984K729J844J634
59957E11743K232K019M60o33K9J054P04n22j307j755k402k571j663p02p22r23
59941E05041k11P08O22N0K31R03J011P26R86J709K187K588L510M592N012M748
$$ plain form
59925 534413 538615 541885 543889 545172 546838 549245 552002 555225 559555 564834 570052 574813 579626 584503
59911 584503 588529 591214 593133 594797 595875 595866 594695 592438 589352 586224 583724 581437 578583 575608 573849
59896 573849 573666 574262 575369 577602 580929 584324 587415 591117 596056 601573 606862 612000 617328 622751 628124
59881 628124 633459 638382 642249 645027 647222 648866 649580 649635 649720 649482 647572 643480 638230 632972 628063 623793
59865 623793 620712 618656 616511 613452 609663 605614 601623 598311 596421 595835 595728 595838 596661 598392 600926
59850 600926 604910 611381 620067 629378 638416 647626 657072 665514 671746 675641 677384 677027 675493 674734 676029
59835 676029 678977 682627 686452 689565 690218 687097 680535 671861 662261 652680 643926 636177 628987 622169
59821 622169 616064 610750 605817 601163 597207 594094 591514 589443 588115 587169 585822 584041 582506 581257
$$ packed form
59925E34413M202L270K004J283J666K407K757L223M330N279N218M761M813M877
59911E84503M026K685J919J664J078rj171k257l086l128k500k287k854k975j759
59896E73849j83N96J107K233L327L395L091L702M939N517N289N138N328N423N373
59881F28124N335M923L867K778K195J644P14N5Q5k38j910m092n250n258m909m270
59865F23793l081k056k145l059l789m049l991l312j890n86j07J10Q23J731K534
59850F00926L984O471Q686R311R038R210R446Q442O232L895J743l57j534p59J295
59835F76029K948L650L825L113O53l121o562q674r600r581q754p749p190o818
59821F22169o105n314m933m654l956l113k580k071j328r46j347j781j535j249
$$ plain form
59807 581257 579511 577042 574653 573034 572200 572171 572995 573900 573615 571833 569255 566235 562687 559376 557658 557575
59791 557575 557754 557535 557587 557986 557482 555538 553604 553365 554917 557427 560323 563015 564677 565269 565840 567110
59775 567110 568649 570006 571519 573452 575418 577266 579443 581973 584177 585862 587558 589227 590155 590629 592110
59760 592110 595048 598084 600250 602389 605384 608531 610863 612750 614896 616933 618311 619603 621728 624683
59746 624683 628059 631995 636637 641420 645707 649344 651980 652886 652193 651212 650792 650465 649853 649517 649556 648892 647127
59729 647127 645749 646135 647560 648491 648741 648920 648867 648230 647760 648428 649819 650781 651098 651227 651035 650214 649511 650109
59711 650109 652006 654186 656233 658731 662160 666282 670479 674076 676616 678378 680266 682714 685169 687039
59697 687039 688452 689657 690483 690942 691485 692065 691822 690330 688250 686161 683819 681167 678910 677212 675003
$$ packed form
59807E81257j746k469k389j619q34k9Q24R05k85j782k578l020l548l311j718q3
59791E57575J79k19N2L99n04j944j934k39J552K510K896K692J662N92N71J270
59775E67110J539J357J513J933J966J848K177K530K204J685J696J669R28M74J481
59760E92110K938L036K166K139K995L147K332J887K146K037J378J292K125K955
59746F24683L376L936M642M783M287L637K636R06o93r81m20l27o12l36L9o64j765
59729F47127j378L86J425R31K50J79n3o37m70O68J391R62L17J29j92q21p03N98
59711F50109J897K180K047K498L429M122M197L597K540J762J888K448K455J870
59697F87039J413J205Q26M59N43N80k43j492k080k089k342k652k257j698k209
$$ plain form
59682 675003 671571 667685 664057 659874 654204 647845 642238 637247 631518 624651 617713 611807 607149 603379
59668 603379 599972 596579 593536 591575 590653 589782 588507 587567 587474 587618 587627 588446 590933 594303 597153 599249 601188
59651 601188 603034 604369 605023 604770 603036 599898 596629 594255 592330 590063 587771 586177 585140 584242 583829
59636 583829 584317 585192 585836 586544 587554 587810 585975 582128 577367 572387 567494 563256 559929 556846 553478
59621 553478 550414 548206 546032 542793 538800 535105 531856 528686 526103 525079 525635 527107 529390 532691
59607 532691 536456 539824 542827 546025 549299 552068 554341 556491 558392 559742 560796 561845 562454 562227 561762
59592 561762 561865 562435 563140 564450 566746 569002 569732 568922 567837 567210 566720 565947 564759 563012 560784 558673
59576 558673 557061 555403 552932 549601 545675 541084 535985 531345 528130 526382 525617 525381 524956 523586 521655
$$ packed form
59682F75003l432l886l628m183n670o359n607m991n729o867o938n906m658l770
59668F03379l407l393l043j961r22q71j275r40r3J44RQ19K487L370K850K096J939
59651F01188J846J335O54k53j734l138l269k374j925k267k292j594j037q98m13
59636E83829M88Q75O44P08J010K56j835l847m761m980m893m238l327l083l368
59621E53478l064k208k174l239l993l695l249l170k583j024N56J472K283L301
59607E32691L765L368L003L198L274K769K273K150J901J350J054J049O09k27m65
59592E61762J03N70P05J310K296K256P30q10j085o27m90p73j188j747k228k111
59576E58673j612j658k471l331l926m591n099m640l215j748p65k36m25j370j931
$$ plain form
59561 521655 520523 520457 520071 518698 517802 518823 521052 523071 525033 527959 531955 536651 542376 549278 556326
59546 556326 562702 569249 577123 586218 596448 609198 625541 644105 662631 680386 696864 709234
59534 709234 713877 710256 701307 690448 680076 672168 667853 666359 666213 667205 669648 672504 674306 675264
59520 675264 676282 676512 674220 669599 664311 658540 651032 641923 632988 624958 616992 608984 601975 595904
59506 595904 589373 582195 575962 571390 567247 562714 558814 556505 555046 553305 551296 549521 547962 546561
59492 546561 545714 545640 546003 546511 547128 547632 547821 548145 549245 551033 553103 555708 559209 563077 566693 570583
59476 570583 575439 580422 584058 586356 588395 590267 591280 591787 592858 594376 595353 595995 597432 599617 601576
59461 601576 603698 607572 613366 619518 625309 631690 639136 646661 653486 659887 665985 671354 676154 680939
$$ packed form
59561E21655j132o6l86j373q96J021K229K019J962K926L996M696N725O902P048
59546E56326O376O547P874R095J0230J2750J6343J8564J8526J7755J6478J2370
59534G09234M643l621q949j0859j0372p908m315j494j46R92K443K856J802R58
59520F75264J018K30k292m621n288n771p508r109q935q030p966q008p009o071
59506E95904o531p178o233m572m143m533l900k309j459j741k009j775j559j401
59492E46561q47p4L63N08O17N04J89L24J100J788K070K605L501L868L616L890
59476E70583M856M983L636K298K039J872J013N07J071J518R77O42J437K185J959
59461F01576K122L874N794O152N791O381P446P525O825O401O098N369M800M785
$$ plain form
59447 680939 685033 686781 685644 682388 677208 669652 660591 652113 644982 638175 631360 625830 622429 620460
59433 620460 619294 619212 620117 621278 623005 626765 632999 640538 648709 658228 669472 681718 694705 709077
59419 709077 724719 740489 756159 772619 789667 805731 820409 834657 847242 853499 849556 836310
59407 836310 817956 798421 780740 767829 761341 760351 762839 767892 775094 782406 786120 782947 771820
59394 771820 754337 733963 714048 695980 679613 665232 653896 645841 640088 635968 633611 632616 631850
59381 631850 631115 631477 633323 635569 637397 639310 641818 644525 647189 650245 653645 656599 659103 662240 666428
59366 666428 670867 675284 680537 686757 692598 697217 701449 706286 711720 717852 725388 734143 742695 750516
59352 750516 758859 768644 779156 789805 801273 813646 825224 834702 843001 851343 858883 863892 866041
$$ packed form
59447F80939M094J748j137l256n180p556r061q478p131o807o815n530l401j969
59433F20460j166q2R05J161J727L760O234P539Q171R519J1244J2246J2987J4372
59419G09077J5642J5770J5670J6460J7048J6064J4678J4248J2585O257l943j3246
59407H36310j8354j9535j7681j2911o488r90K488N053P202P312L714l173j1127
59394G71820j7483k0374j9915j8068j6367j4381j1336q055n753m120k357r95p66
59381F31850p35L62J846K246J828J913K508K707K664L056L400K954K504L137M188
59366F66428M439M417N253O220N841M619M232M837N434O132P536Q755Q552P821
59352G50516Q343R785J0512J0649J1468J2373J1578R478Q299Q342P540N009K149
$$ plain form
59339 866041 865927 863350 857799 849922 840976 831265 820293 808023 795063 782108 769905 759143 749725
59326 749725 740826 732162 724377 717786 711806 706038 700789 696057 691300 686694 683241 681011 678705 675691
59312 675691 673062 671856 671574 671297 671032 671158 671790 673418 676970 682612 689680 698201 708883 721138 732803
59297 732803 742401 749813 754044 752564 744196 730887 715418 699052 682565 667653 655677 646440 639529
59284 639529 635408 633934 633494 633097 633866 637006 641785 646972 652807 659943 667814 675669 683988 693284 702675
59269 702675 711194 719363 728036 736771 744750 752086 758734 763341 764806 763989 762393 760083 756262 750910
59255 750910 744505 737146 729203 721778 715284 708684 701362 694536 689558 686147 683629 682573 683610 685829
59241 685829 687902 689757 691806 693674 695109 696968 699846 702816 704787 705853 706145 704910 702161 699548
$$ packed form
59339H66041j14k577n551p877q946r711j0972j2270j2960j2955j2203j0762r418
59326G49725q899q664p785o591n980n768n249m732m757m606l453k230k306l014
59312F75691k629j206k82k77k65J26O32J628L552N642P068Q521J0682J2255J1665
59297G32803R598P412M231j480q368j3309j5469j6366j6487j4912j1976r237o911
59284F39529m121j474m40l97P69L140M779N187N835P136P871P855Q319R296R391
59269G02675Q519Q169Q673Q735P979P336O648M607J465q17j596k310l821n352
59255G50910o405p359p943p425o494o600p322o826m978l411k518j056J037K219
59241F85829K073J855K049J868J435J859K878K970J971J066K92j235k749k613
$$ plain form
59227 699548 697884 695450 690631 684695 679915 676420 673083 670201 668841 668529 667880 666772 665757 664182 661117
59212 661117 657456 654826 652955 650225 646363 642492 638860 634604 629656 625059 621431 618622 616720 615989
59198 615989 616076 616496 617515 619410 621533 623257 625098 627602 630080 631831 633663 636642 640223 643229 645815
59183 645815 648868 652296 655560 659021 663096 666933 669673 672157 675645 679700 683257 686954 692397 699690
59169 699690 707608 715710 724374 733147 740870 747128 752098 755463 757003 757585 757959 757248 754268 749654 744946
59154 744946 740240 734534 727751 720608 713062 704731 696337 688975 682324 675313 668032 661348 655145 648625
59140 648625 641905 635718 629998 624301 619100 615178 612373 610318 609611 610796 613114 615804 619564 625009
59126 625009 630924 636049 641434 648846 657930 667350 677769 691056 707100 724075 741525 760704 782017
$$ packed form
59227F99548j664k434m819n936m780l495l337k882j360l12o49j108j015j575l065
59212F61117l661k630j871k730l862l871l632m256m948m597l628k809j902p31
59198F15989Q7M20J019J895K123J724J841K504K478J751J832K979L581L006K586
59183F45815L053L428L264L461M075L837K740K484L488M055L557L697N443P293
59169F99690P918Q102Q664Q773P723O258M970L365J540N82L74p11k980m614m708
59154G44946m706n706o783p143p546q331q394p362o651p011p281o684o203o520
59140F48625o720o187n720n697n201l922k805k055p07J185K318K690L760N445
59126F25009N915N125N385P412R084R420J0419J3287J6044J6975J7450J9179K1313
$$ plain form
59113 782017 804464 827559 851556 875788 898819 920275 940689 959718 976278 990160 1001660
59102 1001660 1009967 1013877 1013763 1010938 1005426 996427 984727 972622 961605 951895 943906 938170 934036
59089 934036 930292 926885 924360 922004 918353 913075 906659 898856 889315 879129 869730 860861 851530 842180
59075 842180 833795 825716 816718 807533 799840 793377 786586 779574 773745 768939 763646 757843 752940 749015
59061 749015 744710 739830 735527 731944 728102 724103 720999 718512 715317 711574 708782 707242 706036 705297
59047 705297 705905 707087 707010 705788 705310 706053 706758 707284 709068 712489 716430 720699 726280 733044 739769 746683
59031 746683 755384 766105 777651 790132 804899 821563 837977 853503 869387 885502 899719 911091
59019 911091 920737 928868 933860 935157 934257 931982 927570 921467 916237 913543 912634 912786 914700 918569 923305
$$ packed form
59113G82017K2447K3095K3997K4232K3031K1456K0414J9029J6560J3882J1500
59102A001660Q307L910j14k825n512q999j1700j2105j1017r710p989n736m134
59089I34036l744l407k525k356l651n278o416p803r541j0186r399q869r331r350
59075H42180q385q079q998r185p693o463o791p012n829m806n293n803m903l925
59061G49015m305m880m303l583l842l999l104k487l195l743k792j540j206p39
59047G05297O08J182p7j222m78P43P05N26J784L421L941M269N581O764O725O914
59031G46683Q701J0721J1546J2481J4767J6664J6414J5526J5884J6115J4217J1372
59019I11091R646Q131M992J297r00k275m412o103n230k694r09J52J914L869M736
$$ plain form
59004 923305 928805 936464 946336 956159 964284 971243 977372 981367 982421 981552 979568 975824 970038 963169
58990 963169 955415 945555 933446 921030 909745 899000 888328 878935 871872 866658 862874 861274 862244
58977 862244 864974 869150 875583 884211 893327 901775 910129 918890 927367 935190 943113 951577 960256 969552
58963 969552 980518 992686 1004052 1013748 1022624 1030618 1035954 1037631 1036392 1032529 1025138 1014345 1001903
58950 1001903 988729 974242 958893 944761 932744 921722 911511 903986 900088 898236 896904 896265
58938 896265 896028 894266 889912 884175 878198 871593 864404 858040 852894 847508 841440 836485 833600 831158
58924 831158 827789 824556 822713 821778 821451 822987 826834 831216 834972 839669 847070 856600 867066 878783
58910 878783 892042 905410 917521 928901 940411 951587 962015 972484 983255 993099 1001496 1009874
$$ packed form
59004I23305N500P659R872R823Q125O959O129L995J054q69j984l744n786o869
58990I63169p754r860j2109j2416j1285j0745j0672r393p063n214l784j600R70
58977H62244K730M176O433Q628R116Q448Q354Q761Q477P823P923Q464Q679R296
58963I69552J0966J2168J1366R696Q876P994N336J677j239l863p391j0793j2442
58950A001903j3174j4487j5349j4132j2017j1022j0211p525l898j852j332o39
58938H96265k37j762m354n737n977o605p189o364n146n386o068m955k885k442
58924H31158l369l233j843r35l27J536L847M382L756M697P401R530J0466J1717
58910H78783J3259J3368J2111J1380J1510J1176J0428J0469J0771R844Q397Q378
$$ plain form
58898 1009874 1019144 1028032 1035438 1042453 1050494 1059459 1069379 1081862 1098064 1116929 1136951 1157823 1178866
58885 1178866 1197819 1212888 1224297 1232385 1236106 1234794 1229381 1220432 1207098 1189541 1170186 1150890
58873 1150890 1130867 1109023 1086259 1063868 1041821 1020330 1000991 984570 969580 954618 940093
58862 940093 926283 912019 896946 882700 870145 857805 844738 832442 822057 812231 801792 791958
58850 791958 783648 775159 764973 754583 746023 738670 730855 722548 714126 704694 694187 685086 679419
58837 679419 675862 672245 669020 667655 667448 666676 665491 665154 665699 666573 668197 670856 673448 675201 677098
58822 677098 679909 682613 684456 686502 689365 691622 692319 692734 693692 693610 691399 688721 687024 684927 681149
58807 681149 677398 675556 674474 672452 670391 669449 668004 664303 659928 657188 655030 651031 645697 641351
$$ packed form
58898A009874R270Q888P406P015Q041Q965R920J2483J6202J8865K0022K0872K1043
58885A178866J8953J5069J1409Q088L721j312n413q949j3334j7557j9355j9296
58873A150890k0023k1844k2764k2391k2047k1491j9339j6421j4990j4962j4525
58862I40093j3810j4264j5073j4246j2555j2340j3067j2296j0385r826j0439r834
58850G91958q310q489j0186j0390q560p353p815q307q422r432j0507r101n667
58837F79419l557l617l225j365k07p72j185l37N45Q74J624K659K592J753J897
58822F77098K811K704J843K046K863K257O97M15R58q2k211k678j697k097l778
58807F81149l751j842j082k022k061r42j445l701m375k740k158l999n334m346
$$ plain form
58793 641351 638298 635411 633060 632191 631887 630921 630434 632090 635020 637581 640583 645693 652043 657533 662162
58778 662162 667158 672254 676802 681996 688826 695245 698468 698744 697921 695921 691874 687148 683789 681208 677657
58763 677657 673709 670995 668858 665664 662213 660405 659611 657751 655015 653259 652692 652322 652643 654719 657643
58748 657643 660052 663035 668363 675058 681063 687147 695707 706714 718286 730352 744266 759619 774798
58735 774798 789991 806369 823034 837908 850855 862875 873157 880101 884228 886824 886746 881991 873586
58722 873586 864662 856417 848116 839995 832845 825674 817194 808752 802521 797697 791740 784391 777153 769889
58708 769889 761346 752046 743237 733952 722437 709386 696441 682831 667072 650668 636315 623685
58696 623685 610798 598316 588462 580865 573557 566970 562734 559587 554847 549069 544927 542371 539289 536102
$$ packed form
58793F41351l053k887k351q69l04r66m87J656K930K561L002N110O350N490M629
58778F62162M996N096M548N194O830O419L223K76q23k000m047m726l359k581l551
58763F77657l948k714k137l194l451j808p94j860k736j756n67l70L21K076K924
58748F57643K409K983N328O695O005O084Q560J1007J1572J2066J3914J5353J5179
58735G74798J5193J6378J6665J4874J2947J2020J0282O944M127K596p8m755q405
58722H73586q924q245q301q121p150p171q480q442o231m824n957p349p238p264
58708G69889q543r300q809r285j1515j3051j2945j3610j5759j6404j4353j2630
58696F23685j2887j2482r854p597p308o587m236l147m740n778m142k556l082l187
$$ plain form
58682 536102 535090 535773 535666 535146 536974 541277 545644 549992 556739 566122 575882 585766 598005 613157
58668 613157 629622 647298 667510 689237 709511 727560 744439 758649 766365 766216 759988 748932
58656 748932 733494 716280 700763 687050 673137 659843 649955 643049 636268 630053 627738 629185 630175
58643 630175 628843 627622 628004 628340 627849 628006 628857 628486 627165 627553 629816 630938 629844 628871 629277 629717 630026
58626 630026 632084 636023 639919 644022 650810 660062 668519 675321 683100 692677 701487 708420 715421 722812
58612 722812 727681 728535 727223 724838 720104 713259 707146 702823 698148 692039 686007 680358 673299 665089
58598 665089 658670 654791 650892 646191 643415 644050 646395 649798 656233 665981 676252 685927 697336 711532
58584 711532 726056 739175 752110 765272 776475 784780 792073 799101 803893 805753 806933 808871 810755
$$ packed form
58682E36102j012O83j07n20J828M303M367M348O747R383R760R884J2239J5152
58668F13157J6465J7676K0212K1727K0274J8049J6879J4210P716j49o228j1056
58656G48932j5438j7214j5517j3713j3913j3294r888o906o781o215k315J447R90
58643F30175j332j221L82L36m91J57Q51l71j321L88K263J122j094r73M06M40L09
58626F30026K058L939L896M103O788R252Q457O802P779R577Q810O933P001P391
58612G22812M869Q54j312k385m734o845o113m323m675o109o032n649p059q210
58598F65089o419l879l899m701k776O35K345L403O435R748J0271R675J1409J4196
58584G11532J4524J3119J2935J3162J1203Q305P293P028M792J860J180J938J884
$$ plain form
58571 810755 813146 818814 828559 840286 853451 870143 890607 912212 934062 957879 983085 1005974
58559 1005974 1025303 1043753 1062218 1077690 1088617 1097252 1104683 1108502 1107567 1104180 1099379 1090947 1078316
58546 1078316 1064625 1051660 1037476 1021152 1005117 990546 975323 958792 943660 930939 917912
58535 917912 903358 889844 878666 867720 856689 848976 845812 843741 840738 839648 842754 848080 853958
58522 853958 862058 872876 883275 891511 899649 908211 913687 914389 913371 912453 908760 900494 890651 881446
58508 881446 870497 856314 842262 831226 821330 810693 801216 793875 785571 774785 765278 760004 756288
58495 756288 751154 746444 744476 743626 742573 744071 750035 757509 763824 771183 781897 793843 805017 817857
58481 817857 834529 852381 868399 883633 898923 910929 916911 919014 919624 917069 910100 901873 895100
$$ packed form
58571H10755K391N668R745J1727J3165J6692K0464K1605K1850K3817K5206K2889
58559A005974J9329J8450J8465J5472J0927Q635P431L819r35l387m801q432j2631
58546A078316j3691j2965j4184j6324j6035j4571j5223j6531j5132j2721j3027
58535I17912j4554j3514j1178j0946j1031p713l164k071l003j090L106N326N878
58522H53958Q100J0818J0399Q236Q138Q562N476P02j018r18l693q266r843r205
58508H81446j0949j4183j4052j1036r896j0637r477p341q304j0786r507n274l716
58495G56288n134m710j968q50j053J498N964P474O315P359J0714J1946J1174J2840
58481H17857J6672J7852J6018J5234J5290J2006N982K103O10k555o969q227o773
$$ plain form
58468 895100 888027 879428 872539 869552 867233 862627 858111 856195 854567 851109 848619 849496 850957 850593 851379
58453 851379 855810 860273 860878 859769 860038 859435 855068 849549 846550 844788 842105 840828 843315 846879 848802
58438 848802 851640 857736 863504 865244 865810 869339 874204 877480 881493 889281 898166 904463 910201 918622
58424 918622 927485 933360 938163 944752 950394 951255 949123 947132 943311 935067 925611 919121 913766 906177
58410 906177 898292 893015 887827 879797 872357 869895 870132 869018 868462 871855 876709 879394 882552 889935 898434
58395 898434 903214 906329 912145 918599 921225 921606 923595 925387 923684 921596 923977 928888 931946 934912
58381 934912 941491 948909 952477 954486 959763 966440 969932 971923 976465 981315 982366 982540 986872 992820
58367 992820 995087 996122 1001990 1011476 1019150 1025661 1035087 1045506 1052166 1056721 1063508 1070095 1071459 1070014
$$ packed form
58468H95100p073q599o889k987k319m606m516j916j628l458k490Q77J461l64P86
58453H51379M431M463O05j109K69o03m367n519k999j762k683j277K487L564J923
58438H48802K838O096N768J740N66L529M865L276M013P788Q885O297N738Q421
58424I18622Q863N875M803O589N642Q61k132j991l821q244r456o490n355p589
58410I06177p885n277n188q030p440k462K37j114n56L393M854K685L158P383Q499
58395H98434M780L115N816O454K626L81J989J792j703k088K381M911L058K966
58381I34912O579P418L568K009N277O677L492J991M542M850J051J74M332N948
58367I92820K267J035N868R486P674O511R426J0419O660M555O787O587J364j445
$$ plain form
58353 1070014 1071448 1074127 1072949 1070234 1072238 1078014 1082212 1085821 1093811 1105263 1116242 1129082 1148357
58340 1148357 1170969 1190756 1209296 1231517 1254492 1271731 1284739 1298858 1311575 1316811 1317095 1319411
58328 1319411 1322519 1320637 1316120 1315980 1319193 1319951 1320066 1325385 1333449 1337756 1340839 1349834 1362585 1371779
58314 1371779 1379361 1392780 1410340 1424651 1437395 1455844 1477732 1494726 1508269 1526732 1549268
58303 1549268 1567841 1582897 1601512 1622246 1637549 1649131 1665194 1684568 1699486 1711761 1729867
58292 1729867 1752263 1770301 1785470 1806773 1833248 1856456 1878085 1907154 1941900 1972771 2001427
58281 2001427 2037985 2081269 2120935 2157459 2200380 2248426 2291632 2331815 2380243 2436181 2488724
58270 2488724 2538747 2597241 2662795 2723137 2778537 2840899 2909883 2973350 3031548 3096866 3168952
$$ packed form
58353A070014J434K679j178k715K004N776M198L609P990J1452J0979J2840J9275
58340A148357K2612J9787J8540K2221K2975J7239J3008J4119J2717N236K84K316
58328A319411L108j882m517j40L213P58J15N319Q064M307L083Q995J2751R194
58314A371779P582J3419J7560J4311J2744J8449K1888J6994J3543J8463K2536
58303A549268J8573J5056J8615K0734J5303J1582J6063J9374J4918J2275J8106
58292A729867K2396J8038J5169K1303K6475K3208K1629K9069L4746L0871K8656
58281B001427L6558M3284L9666L6524M2921M8046M3206M0183M8428N5938N2543
58270B488724N0023N8494O5554O0342N5400O2362O8984O3467N8198O5318P2086
$$ plain form
58259 3168952 3234320 3291622 3352892 3418894 3478340 3532683 3596107 3669660 3741261 3812244 3896893
58248 3896893 3994563 4090226 4184061 4291782 4414104 4535672 4656010 4790738 4940113 5088301
58238 5088301 5236147 5401544 5584747 5767757 5950962 6154438 6379619 6607312 6837712
58229 6837712 7093210 7376717 7667952 7966501 8296207 8660784 9039308 9432532 9867670
58220 9867670 10349886 10857408 11392713 11987767 12650096 13357805 14117632 14970738 15930657
58211 15930657 16976801 18121170 19416298 20884914 22513398 24330625 26418162 28827995
58203 28827995 31576605 34743037 38485162 42940685 48214687 54488018 62022243 71031844
58195 71031844 81689872 94303625 109349371 127325056 148776120 174459837 205058029
$$ packed form
58259C168952O5368N7302O1270O6002N9446N4343O3424P3553P1601P0983Q4649
58248C896893R7670R5663R3835J07721J22322J21568J20338J34728J49375J48188
58238E088301J47846J65397J83203J83010J83205K03476K25181K27693K30400
58229F837712K55498K83507K91235K98549L29706L64577L78524L93224M35138
58220I867670M82216N07522N35305N95054O62329P07709P59827Q53106R59919
58211A5930657J046144J144369J295128J468616J628484J817227K087537K409833
58203B8827995K748610L166432L742125M455523N274002O273331P534225R009601
58195G1031844J0658028J2613753J5045746J7975685K1451064K5683717L0598192
$$ plain form
58188 205058029 240396639 279099963 319116386 358055714 392432334 417026069 426337455
58181 426337455 417686092 393007814 357543947 316957600 275531607 236080559 200357599
58174 200357599 169172432 142545034 120123955 101491179 86153078 73526434 63093856
58167 63093856 54491030 47404899 41507559 36541567 32365498 28861948 25881072 23308614
58159 23308614 21103256 19223455 17585575 16126424 14839408 13715236 12706525 11780009
58151 11780009 10946306 10208832 9534951 8903665 8332176 7829688 7370838 6938474 6548589
58142 6548589 6209700 5899026 5601111 5330630 5095326 4873703 4650460 4438886 4248330
58133 4248330 4063444 3875110 3699434 3546838 3402820 3257370 3123720 3010251 2902507
$$ packed form
58188B05058029L5338610L8703324M0016423L8939328L4376620K4593735R311386
58181D26337455q651363k4678278l5463867m0586347m1425993l9451048l5722960
58174B00357599l1185167k6627398k2421079j8632776j5338101j2626644j0432578
58167F3093856q602826p086131n897340m965992m176069l503550k980876k572458
58159B3308614k205358j879801j637880j459151j287016j124172j008711r26516
58151A1780009q33703p37474o73881o31286n71489n02488m58850m32364l89885
58142F548589l38889l10674k97915k70481k35304k21623k23243k11574j90556
58133D248330j84886j88334j75676j52596j44018j45450j33650j13469j07744
$$ plain form
58124 2902507 2790665 2687427 2601649 2520598 2434969 2356010 2291416 2228859 2159621 2094932 2043001
58113 2043001 1992558 1934781 1879589 1834970 1791327 1741326 1694738 1658891 1624165 1583177 1544977
58102 1544977 1516113 1486668 1449299 1413753 1388309 1364482 1334194 1305056 1284633 1265899 1242043
58091 1242043 1220036 1206068 1192641 1173226 1155142 1145129 1136301 1121765 1107125 1097256 1084460 1062020
58079 1062020 1036366 1014073 989929 959496 930360 909040 889305 865096 842631 828038 815191
58068 815191 797653 781053 771823 764810 753610 742505 736858 732075 723194 715265 713288 711773 704840
58055 704840 696853 692690 687430 676240 664775 659134 654847 646323 637875 634782 632409 624896 616080 611320
58041 611320 606806 597488 587545 582610 579193 571932 563972 560233 557647 551719 545650 543456 541103 533872
$$ packed form
58124B902507j11842j03238q5778q1051q5629p8959o4594o2557o9238o4689n1931
58113B043001n0443n7777n5192m4619m3643n0001m6588l5847l4726m0988l8200
58102A544977k8864k9445l7369l5546k5444k3827l0288k9138k0423j8734k3856
58091A242043k2007j3968j3427j9415j8084j0013q828j4536j4640r869j2796k2440
58079A062020k5654k2293k4144l0433k9136k1320j9735k4209k2465j4593j2847
58068H15191j7538j6600r230p013j1200j1105n647m783q881p929j977j515o933
58055G04840p987m163n260j1190j1465n641m287q524q448l093k373p513q816m760
58041F11320m514r318r943m935l417p261p960l739k586n928o069k194k353p231
$$ plain form
58027 533872 525617 521454 518221 511357 504292 501708 500192 494844 488699 486441 485225 480794 476426 476804
58013 476804 479153 479269 480170 485866 492639 495429 496948 501654 506611 507237 506348 508561 511301 510177 507800
57998 507800 508465 509448 506414 502165 501275 501336 498284 495117 496253 498326 495811 491099 489800 490450 488051 483666
57982 483666 481405 479703 474484 467431 462555 458100 450269 441425 436268 433305 428296 422657 420198 419073
57968 419073 415331 411136 411084 413404 413021 410468 409752 410383 409491 408914 412112 416777 418400 418516 421610 426608
57952 426608 429313 430559 434003 438385 439977 440390 444048 450056 454325 457633 463841 472225 479258 485984
57938 485984 495978 507935 517951 527278 540145 555624 569281 581183 594551 607994 616823 620878
57926 620878 623575 624497 620473 612875 606267 600663 592429 582026 573467 566756 558163 547599 538657 531697
$$ packed form
58027E33872q255m163l233o864p065k584j516n348o145k258j216m431m368L78
58013D76804K349J16R01N696O773K790J519M706M957O26q89K213K740j124k377
57998E07800O65R83l034m249q90O1l052l167J136K073k515m712j299O50k399m385
57982D83666k261j702n219p053m876m455p831q844n157k963n009n639k459j125
57968D19073l742m195n2K320l83k553p16O31q92n77L198M665J623J16L094M998
57952D26608K705J246L444M382J592M13L658O008M269L308O208Q384P033O726
57938D85984R994J1957J0016R327J2867J5479J3657J1902J3368J3443Q829M055
57926F20878K697R22m024p598o608n604q234j0403q559o711q593j0564q942o960
$$ plain form
57912 531697 523776 515180 509264 505991 502074 497261 494171 492379 489042 484955 483574 484390 483603 481024 479994
57897 479994 480814 480565 479286 479979 482546 483853 483793 485252 488118 489268 488487 488568 489608 489023 487096 486626 487162
57880 487162 485415 481457 478706 477713 475657 472066 469356 467632 464579 460573 458292 457269 454451 450203
57866 450203 448091 448591 448681 447751 448224 450068 450490 449464 449965 452293 453726 454167 456528 460977 464382 466075
57850 466075 468653 472328 473925 472360 469951 467515 463223 456954 450799 444673 436450 426905 419398 414222
57836 414222 408498 402077 398061 396857 395233 392165 390194 390087 389486 387963 388130 390537 392539 393304 394880
57821 394880 397307 397974 397039 398159 402303 405937 406948 407446 409049 410128 409453 408008 405664 400551 393311
57806 393311 387623 385116 384003 383757 386458 392168 397770 401896 406461 411894 415630 416956 418633 421923
$$ packed form
57912E31697p921q596n916l273l917m813l090j792l337m087j381Q16p87k579j030
57897D79994Q20k49j279O93K567J307o0J459K866J150p81Q1J040n85j927m70N36
57880D87162j747l958k751r93k056l591k710j724l053m006k281j023k818m248
57866D50203k112N00R0r30M73J844M22j026N01K328J433M41K361M449L405J693
57850D66075K578L675J597j565k409k436m292o269o155o126q223r545p507n176
57836D14222n724o421m016j204j624l068j971j07o01j523J67K407K002P65J576
57821C94880K427O67r35J120M144L634J011M98J603J079o75j445k344n113p240
57806C93311n688k507j113k46K701N710N602M126M565N433L736J326J677L290
$$ plain form
57792 421923 424506 425141 425932 428143 430115 431177 433278 436892 439554 440325 441466 443839 444963 443619 442207
57777 442207 442466 442890 442355 442306 443250 443050 440716 438145 436144 432608 426542 419998 414134 407325 399133 392112
57761 392112 387499 383027 377247 372185 369428 367414 364936 363657 364704 366286 367039 368373 371276 374239
57747 374239 376556 380192 385983 391389 394383 396299 398536 399723 398560 396312 394134 390965 386263 381805
57733 381805 378615 375103 370251 365540 361743 357167 351145 345949 343018 340559 337111 334155 332911 331896
57719 331896 330060 329006 329578 329561 327357 324702 323086 320744 316145 311426 309218 308623 307268 304928 302462
57704 302462 299584 296360 294592 295262 296772 297812 299437 302249 304410 304844 305514 307989 310443 310673 309458
57689 309458 308373 306940 304605 302959 303365 304817 306665 310752 318278 327301 336239 347269 363276 383910
$$ packed form
57792D21923K583O35P91K211J972J062K101L614K662P71J141K373J124j344j412
57777D42207K59M24n35m9R44k00k334k571k001l536o066o544n864o809q192p021
57761C92112m613m472n780n062k757k014k478j279J047J582P53J334K903K963
57747C74239K317L636N791N406K994J916K237J187j163k248k178l169m702m458
57733C81805l190l512m852m711l797m576o022n196k931k459l448k956j244j015
57719C31896j836j054N72j7k204k655j616k342m599m719k208n95j355k340k466
57704C02462k878l224j768O70J510J040J625K812K161M34O70K475K454K30j215
57689C09458j085j433k335j646M06J452J848M087P526R023Q938J1030J6007K0634
$$ plain form
57675 383910 407688 435636 469823 510549 558167 615625 685828 767787 857765 952137 1046009
57664 1046009 1130353 1193339 1224135 1215291 1165278 1081919 980903 877389 779526 690629 613594
57653 613594 549869 497137 452171 414543 384725 360756 340104 323009 310668 301665 293382 285466
57641 285466 279008 273718 268801 265083 263345 261944 258943 255241 252938 251973 251035 250257 250331 250390 249446 248521
57625 248521 248774 249065 247902 246158 245226 244240 241909 239344 238099 237101 234658 231903 230935 230932 229453 226522
57609 226522 224098 222465 220362 217967 216639 216211 215446 214614 214980 216265 217096 217389 217943 218413 217997 217309 217324
57592 217324 217344 216210 214474 213151 211555 208744 205885 204624 204291 203217 201655 200799 200073 198135 195516
57577 195516 193518 191476 187865 183266 179570 177023 174669 172853 172636 173434 173777 173722 174210 174912 175006 175074 175830
$$ packed form
57675C83910K3778K7948L4187M0726M7618N7458P0203Q1959Q9978R4372R3872
57664A046009Q4344O2986L0796q844n0013q3359j01016j03514r7863q8897p7035
57653F13594o3725n2732m4966l7628k9818k3969k0652j7095j2341r003q283p916
57641B85466o458n290m917l718j738j401l001l702k303r65r38p78P4N9r44r25
57625B48521K53K91j163j744r32r86k331k565j245r98k443k755r68lj479k931
57609B26522k424j633k103k395j328m28p65q32L66J285Q31K93N54M70m16o88J5
57592B17324K0j134j736j323j596k811k859j261l33j074j562q56p26j938k619
57577A95516j998k042l611m599l696k547k354j816k17P98L43n5M88P02R4O8P56
$$ plain form
57560 175830 176154 174911 173599 174438 176849 178507 178878 179029 179051 178530 178608 180587 183281 184570 184801 185895 187972
57543 187972 189795 191630 194645 198162 200546 202177 204587 207283 208434 208121 207864 207566 206028 204064 203853
57528 203853 205384 206530 206509 206398 206470 205981 205468 206455 208876 211351 213667 216430 218803 219482 219451 220790 223181
57511 223181 224659 225439 227709 231702 235192 236970 237774 237778 236354 234519 234441 236056 237018 236368 235450 234972 234094
57494 234094 232795 232300 232583 232142 230687 229512 228845 227464 225275 223696 223125 222540 221844 221999 222635 222196 220755
57477 220755 220051 220488 220800 220871 221929 223612 223887 222552 221915 223276 225443 227483 230164 233774 237120 239674
57461 239674 242386 245523 248037 249805 252216 255820 259655 263379 267695 272140 275008 276158 277437 279624
57447 279624 281453 282335 283474 285443 287213 288537 290807 294487 298011 300296 302219 304686 307378 310189
$$ packed form
57560A75830L24j243j312Q39K411J658L71J51K2n21P8J979K694J289K31J094K077
57543A87972J823J835L015L517K384J631K410K696J151l13k57k98j538j964k11
57528B03853J531J146k1j11P2m89n13R87K421K475K316K763K373O79l1J339K391
57511B23181J478P80K270L993L490J778Q04Mj424j835p8J615R62o50r18m78q78
57494B34094j299m95K83m41j455j175o67j381k189j579n71n85o96J55O36m39j441
57477B20755p04M37L12P1J058J683K75j335o37J361K167K040K681L610L346K554
57461B39674K712L137K514J768K411L604L835L724M316M445K868J150J279K187
57447B79624J829Q82J139J969J770J324K270L680L524K285J923K467K692K811
$$ plain form
57433 310189 313744 317637 320379 321887 323862 326945 329761 331585 333608 336668 340023 343244 347043 351332
57419 351332 354729 356934 359344 362433 364873 366173 367781 370508 373252 375423 378265 382506 386938 390610
57405 390610 394240 398255 401610 403927 406693 410941 415714 420093 424778 430344 435866 440576 445089 449830
57391 449830 454116 457940 462682 468850 475072 480480 486121 492735 499255 504837 510408 516718 522722 527450
57377 527450 531783 536958 542867 549080 555931 563389 570464 576850 583545 590901 597953 604645 612689 622978
57363 622978 634106 644586 654629 664583 673820 682512 692322 703771 714936 724305 732948 742292 751862
57350 751862 760975 770651 781914 793875 805325 816594 828110 838877 848224 857507 868213 879774
57338 879774 890968 902030 913730 925798 937913 950834 964931 979101 992652 1006678 1021992
$$ packed form
57433C10189L555L893K742J508J975L083K816J824K023L060L355L221L799M289
57419C51332L397K205K410L089K440J300J608K727K744K171K842M241M432L672
57405C90610L630M015L355K317K766M248M773M379M685N566N522M710M513M741
57391D49830M286L824M742O168O222N408N641O614O520N582N571O310O004M728
57377E27450M333N175N909O213O851P458P075O386O695P356P052O692Q044J0289
57363F22978J1128J0480J0043R954R237Q692R810J1449J1165R369Q643R344R570
57350G51862R113R676J1263J1961J1450J1269J1516J0767R347R283J0706J1561
57338H79774J1194J1062J1700J2068J2115J2921J4097J4170J3551J4026J5314
$$ plain form
57327 1021992 1037373 1051612 1065611 1080587 1095861 1110426 1125230 1141719 1159389 1176771 1193788
57316 1193788 1211249 1229161 1247343 1266585 1287355 1308437 1328576 1348398 1369105 1390532 1412171
57305 1412171 1434726 1458782 1483224 1506923 1530791 1556155 1582272 1607586 1632399 1658182 1685066
57294 1685066 1712141 1739527 1768157 1798033 1828457 1859404 1891022 1922556 1953426 1984645 2017469
57283 2017469 2051348 2084866 2118026 2151971 2187107 2223067 2259885 2297678 2335799 2373662 2411685
57272 2411685 2450139 2488028 2524582 2560883 2598525 2637619 2677572 2718755 2761696 2805615 2849536
57261 2849536 2894013 2940085 2987393 3035041 3083448 3133527 3184890 3236613 3289092 3343399 3399524
57250 3399524 3456988 3516422 3578748 3643354 3708771 3774643 3841446 3908929 3976415 4044042 4112123
$$ packed form
57327A021992J5381J4239J3999J4976J5274J4565J4804J6489J7670J7382J7017
57316A193788J7461J7912J8182J9242K0770K1082K0139J9822K0707K1427K1639
57305A412171K2555K4056K4442K3699K3868K5364K6117K5314K4813K5783K6884
57294A685066K7075K7386K8630K9876L0424L0947L1618L1534L0870L1219L2824
57283B017469L3879L3518L3160L3945L5136L5960L6818L7793L8121L7863L8023
57272B411685L8454L7889L6554L6301L7642L9094L9953M1183M2941M3919M3921
57261B849536M4477M6072M7308M7648M8407N0079N1363N1723N2479N4307N6125
57250C399524N7464N9434O2326O4606O5417O5872O6803O7483O7486O7627O8081
$$ plain form
57239 4112123 4179923 4246574 4312484 4378310 4443288 4506222 4567457 4628351 4689490 4750935 4813376
57228 4813376 4877458 4942669 5008405 5075273 5143910 5213671 5284275 5357607 5435805 5518319 5602891
57217 5602891 5688636 5776070 5864773 5953242 6040656 6126719 6210083 6288924 6362937 6433045 6499407
57206 6499407 6561308 6618671 6671968 6721073 6765831 6807398 6847415 6886298 6923868 6961090 6999514
57195 6999514 7039551 7080987 7124576 7171353 7220886 7271884 7323981 7377197 7430311 7481724 7531474
57184 7531474 7580570 7628777 7674796 7718023 7758247 7794164 7824325 7849240 7870565 7888393 7901257
57173 7901257 7908544 7911130 7909811 7904914 7897267 7887945 7877228 7865217 7852952 7841448 7830362 7819300
57161 7819300 7809574 7802740 7798182 7794312 7791363 7790647 7791617 7792228 7791989 7792414 7794807 7800077 7810287 7827206 7848508
$$ packed form
57239D112123O7800O6651O5910O5826O4978O2934O1235O0894O1139O1445O2441
57228D813376O4082O5211O5736O6868O8637O9761P0604P3332P8198Q2514Q4572
57217E602891Q5745Q7434Q8703Q8469Q7414Q6063Q3364P8841P4013P0108O6362
57206F499407O1901N7363N3297M9105M4758M1567M0017L8883L7570L7222L8424
57195F999514M0037M1436M3589M6777M9533N0998N2097N3216N3114N1413M9750
57184G531474M9096M8207M6019M3227M0224L5917L0161K4915K1325J7828J2864
57173G901257P287K586j319m897p647r322j0717j2011j2265j1504j1086j1062
57161G819300r726o834m558l870k949p16R70O11k39M25K393N270J0210J6919K1302
$$ plain form
57146 7848508 7867607 7878039 7876704 7863294 7839271 7808025 7773662 7738362 7701848 7663491 7623345
57135 7623345 7581075 7535679 7486695 7434372 7378735 7320149 7260854 7204300 7152742 7106775 7066863
57124 7066863 7033450 7005588 6981337 6959891 6941960 6928232 6919155 6916252 6921872 6937265 6962233 6996668
57112 6996668 7041287 7097247 7166859 7254715 7366622 7507331 7680641 7891775 8148779 8462489
57102 8462489 8847270 9322403 9912118 10644927 11554260 12679290 14063394 15750744 17783098
57093 17783098 20197165 23022921 26284589 30003147 34195351 38867382 44007065 49578207
57085 49578207 55518643 61745684 68166052 74667891 81074493 87087748 92293009 96259683
57077 96259683 98676194 99419367 98527937 96137849 92441009 87671148 82089936 75965092
$$ packed form
57146G848508J9099J0432j335j3410k4023l1246l4363l5300l6514l8357m0146
57135G623345m2270m5396m8984n2323n5637n8586n9295n6554n1558m5967l9912
57124G066863l3413k7862k4251k1446j7931j3728r077k903N620J5393K4968L4435
57112F996668M4619N5960O9612Q7856J11907J40709J73310K11134K57004L13710
57102H462489L84781M75133N89715P32809R09333J125030J384104J687350K032354
57093A7783098K414067K825756L261668L718558M192204M672031N139683N571142
57085D9578207N940436O227041O420368O501839O406602O013255N205261L966674
57077I6259683K416511P43173q91430k390088l696840m769861n581212o124844
$$ plain form
57069 75965092 69550068 63068937 56705122 50598207 44850719 39535797 34698490 30356299
57061 30356299 26505304 23127112 20190927 17655383 15475075 13606700 12009286 10642997
57053 10642997 9471966 8467177 7604502 6861749 6219633 5663306 5180320 4758608 4388158
57044 4388158 4062446 3776034 3522521 3296628 3095972 2918576 2760571 2618416 2491365
57035 2491365 2379622 2281856 2196421 2123048 2061542 2010956 1971772 1946188 1933907 1930165 1930331 1933466
57023 1933466 1937662 1934038 1909769 1857265 1778448 1681648 1577168 1474463 1379534 1293852 1216846
57012 1216846 1148770 1089975 1039072 994152 954970 921908 893820 868887 846726 827720 811153
57001 811153 795859 781860 769637 758717 748591 739978 733502 728168 722788 717838 714332 712154 711188
$$ packed form
57069G5965092o415024o481131o363815o106915n747488n314922m837307m342191
57061C0356299l850995l378192k936185k535544k180308j868375j597414j366289
57053A0642997j171031j004789q62675p42753o42116n56327m82986m21712l70450
57044D388158l25712k86412k53513k25893k00656j77396j58005j42155j27051
57035B491365j11743r7766q5435p3373o1506n0586l9184k5584j2281l742J66L135
57023A933466M196l624k4269n2504p8817r6800j04480j02705r4929q5682p7006
57012A216846o8076n8795n0903m4920l9182l3062k8088k4933k2161j9006j6567
57001H11153j5294j3999j2223j0920j0126q613o476n334n380m950l506k178r66
$$ plain form
56988 711188 712808 718383 727390 738638 752023 767311 782415 794598 802118 803126 794786 775848 748944
56975 748944 718329 686502 654738 625112 599413 577248 557604 541278 529576 521829 516540 513946
56963 513946 515133 519799 527336 539006 556317 577989 601057 624108 646600 665492 675483 672895
56951 672895 657591 631704 598819 563840 530994 501601 475393 453399 437424 427226 420694 416806
56939 416806 416381 420036 427548 439313 456543 479743 508336 541541 578163 615716 650967 680654
56927 680654 700475 704865 690338 658986 617076 570652 523870 480091 441738 409101 381312 358310
56915 358310 340238 325636 312423 300323 290319 282203 274724 267783 262331 258337 254853 251857 250080
56902 250080 249267 248525 248099 248951 250889 253007 255508 259247 264032 269467 276861 287971 302268 317867
$$ packed form
56988G11188J620N575R007J1248J3385J5288J5104J2183P520J008q340j8938k6904
56975G48944l0615l1827l1764k9626k5699k2165j9644j6326j1702p747n289k594
56963E13946J187M666P537J1670J7311K1672K3068K3051K2492J8892R991k588
56951F72895j5304k5887l2885l4979l2846k9393k6208k1994j5975j0198o532l888
56939D16806m25L655P512J1765J7230K3200K8593L3205L6622L7553L5251K9687
56927F80654J9821M390j4527l1352m1910m6424m6782m3779l8353l2637k7789k3002
56915C58310j8072j4602j3213j2100j0004q116p479o941n452l994l484k996j777
56902B50080q13p42m26Q52J938K118K501L739M785N435P394J1110J4297J5599
$$ plain form
56888 317867 334872 355257 379432 405264 430492 453560 471799 481440 480566 470642 454827 436266
56876 436266 417960 402193 389459 379264 372067 369052 370257 374714 382404 394388 411114 432409
56864 432409 459120 492937 534382 582334 635263 691189 746384 795508 832931 853068 851109 826252
56852 826252 784143 733949 682871 634738 592434 558456 533136 515184 504586 502926 510794 527165
56840 527165 551559 584764 627360 679728 743416 819853 907052 999380 1090379 1173214 1238263
56829 1238263 1273840 1271811 1232163 1162313 1073746 978917 888094 806846 736845 678880 633776
56818 633776 600916 578358 565022 561165 566618 580457 602705 634595 676828 728892 789698 856813
56806 856813 925012 987215 1036620 1066594 1070226 1043799 991213 922466 847379 772497 702830 642425
$$ packed form
56888C17867J7005K0385K4175K5832K5228K3068J8239R641q74r924j5815j8561
56876D36266j8306j5767j2734j0195p197l015J205M457P690J1984J6726K1295
56864D32409K6711L3817M1445M7952N2929N5926N5195M9124L7423K0137j959k4857
56852H26252m2109n0194n1078m8133m2304l3978k5320j7952j0598j660P868J6371
56840E27165K4394L3205M2596N2368O3688P6437Q7199R2328R0999Q2835O5049
56829A238263L5577k029l9648o9850q8567r4829r0823q1248p0001n7965m5104
56818F33776l2860k2558j3336l857N453J3839K2248L1890M2233N2064O0806O7115
56806H56813O8199O2203M9405K9974L632k6427n2586o8747p5087p4882o9667o0405
$$ plain form
56794 642425 592243 550415 515615 488076 467266 451672 441517 438772 443727 454423 470183 492565
56782 492565 521602 553986 586156 616291 641769 657493 658888 644857 616790 577125 530289 482518
56770 482518 438535 399590 365549 336810 313082 292586 274157 258470 246099 236179 227994 221856
56758 221856 217339 212738 207408 202595 198888 195039 190407 186244 183242 180156 176314 173230 172083 171740
56744 171740 170892 170061 169821 169094 167089 165087 164510 164866 165237 166051 167703 169051 168983 168048 167151 166228 165497 166193
56726 166193 168561 170909 172077 173049 174662 175790 175522 175202 176382 178434 180033 181337 182865 183860 183668
56711 183668 183290 183786 184642 185348 186854 189577 191640 191227 189300 187977 187562 187093 186530 186344 186089 185254 184489
56694 184489 184317 183845 182410 181195 181458 182451 182891 183158 184143 185222 185387 185310 186257 187861 188811 188904 188725 188211
$$ packed form
56794F42425n0182m1828l4800k7539k0810j5594j0155k745M955J0696J5760K2382
56782D92565K9037L2384L2170L0135K5478J5724J395j4031k8067l9665m6836m7771
56770D82518m3983l8945l4041k8739k3728k0496j8429j5687j2371r920q185o138
56758B21856m517m601n330m813l707l849m632m163l002l086l842l084j147l43
56744A71740q48q31k40p27k005k002n77L56L71Q14J652J348o8r35q97r23p31O96
56726A66193K368K348J168R72J613J128k68l20J180K052J599J304J528R95j92
56711A83668l78M96Q56P06J506K723K063m13j927j323m15m69n63j86k55q35p65
56694A84489j72m72j435j215K63R93M40K67R85J079J65p7R47J604R50R3j79n14
$$ plain form
56676 188211 187135 186158 185868 185727 185287 185323 186397 187587 188075 188576 189728 190629 190692 191377 194074 197671 200265
56659 200265 202004 204165 206621 208486 210241 212978 216160 218199 218733 218648 218466 218337 218897 220588 222751 224705
56643 224705 226879 229682 232340 234152 235670 237250 237792 236387 233867 231259 228183 224381 221228 219857
56629 219857 219204 217751 215703 213630 210607 205883 200911 197375 194583 191121 187808 186495 186934 187329 187153
56614 187153 187076 186840 185511 183390 181668 180654 179981 179764 179918 179347 177494 175668 175172 175377 175340 175817 177652
56597 177652 179658 180319 180270 180864 181695 181843 182178 183918 186115 187118 187371 188251 189328 189376 189029 189686 190771
56580 190771 190789 190251 190886 192712 194438 195979 197956 199624 199939 199886 201141 203227 204653 205954 208820 213043
56564 213043 217235 221819 228290 236088 243208 249500 256445 263983 270427 275327 279735 283881 287173 290143
$$ packed form
56676A88211j076r77k90j41m40L6J074J190M88N01J152R01O3O85K697L597K594
56659B00265J739K161K456J865J755K737L182K039N34q5j82j29N60J691K163J954
56643B24705K174K803K658J812J518J580N42j405k520k608l076l802l153j371
56629B19857o53j453k048k073l023m724m972l536k792l462l313j313M39L95j76
56614A87153p7k36j329k121j722j014o73k17J54n71j853j826m96K05l7M77J835
56597A77652K006O61m9N94Q31J48L35J740K197J003K53Q80J077M8l47O57J085
56580A90771J8n38O35J826J726J541J977J668L15n3J255K086J426J301K866M223
56564B13043M192M584O471P798P120O292O945P538O444M900M408M146L292K970
$$ plain form
56550 290143 293783 297257 298824 298682 298441 298309 297351 295821 294543 292668 288930 284519 281724 280291 278098
56535 278098 274910 272299 270252 267168 263029 259382 256294 252462 248245 245392 243757 241472 238405 236344
56521 236344 235589 234513 232620 230963 229419 226684 223228 221115 220553 219645 217785 216250 215171 213123 210174
56506 210174 208240 207837 207434 206463 206037 206210 205535 203954 203202 203787 204333 204363 204882 205819 205827 205060 205097 205716 204837
56487 204837 202237 200216 199950 200232 200414 201370 202823 202986 201821 201586 203164 204843 205673 206904 209028 210415
56471 210415 210180 209633 209694 209492 208595 207947 207626 206352 204180 202964 203236 203376 202840 203293 205488 207843 209285
56454 209285 210749 212651 213649 213217 212892 213713 214785 215440 216345 217487 217602 216584 216016 216434 216622 216324 216856
56437 216856 218240 218616 217475 216637 217073 217657 217988 219328 221646 222798 221980 221080 221345 221621 221132 220991 221607
$$ packed form
56550B90143L640L474J567j42k41j32r58j530j278j875l738m411k795j433k193
56535B78098l188k611k047l084m139l647l088l832m217k853j635k285l067k061
56521B36344p55j076j893j657j544k735l456k113n62r08j860j535j079k048k949
56506B10174j934m03m03r71m26J73o75j581p52N85N46L0N19R37Qp67L7O19q79
56487B04837k600k021k66K82J82R56J453J63j165k35J578J679Q30J231K124J387
56471B10415k35n47O1k02q97o48l21j274k172j216K72J40n36M53K195K355J442
56454B09285J464J902R98m32l25Q21J072O55R05J142J15j018n68M18J88k98N32
56437B16856J384L76j141q38M36N84L31J340K318J152q18r00K65K76m89j41O16
$$ plain form
56420 221607 221512 220249 219606 220568 221783 222350 223254 224750 225273 224360 223843 224697 225547 225648 226389 228395 230064
56403 230064 230461 230788 231594 231514 230212 229514 230115 230273 229345 229451 231872 234861 236818 238621 241038 242888 243635
56386 243635 244844 247158 248783 248826 249129 250915 252618 252998 253411 255005 256542 257007 257497 258627 259019 258250
56370 258250 258286 260030 261540 261611 261985 264008 266278 267720 269640 272469 273836 272346 270130 269158 268251 266274
56354 266274 265010 266033 267721 268222 268551 270008 271344 271249 270924 271505 271648 270283 269057 269482 270389 270636 271424
56337 271424 273463 274901 274752 275265 278133 281485 283457 285557 289382 293134 294765 295665 297878 300318 301126
56322 301126 301223 302253 303384 303311 303116 304161 305461 305904 306624 308521 310066 310246 310804 312898 314592 314525 314892
56305 314892 317713 321349 323864 326569 330864 334788 336356 337304 339954 343282 345636 348262 352489 356424
$$ packed form
56420B21607r5j263o43R62J215N67R04J496N23r13n17Q54Q50J01P41K006J669
56403B30064L97L27Q06q0j302o98O01J58r28J06K421K989J957J803K417J850P47
56386B43635J209K314J625M3L03J786J703L80M13J594J537M65M90J130L92p69
56370B58250L6J744J510P1L74K023K270J442J920K829J367j490k216r72r07j977
56354B66274j264J023J688N01L29J457J336r5l25N81J43j365j226M25R07K47P88
56337B71424K039J438j49N13K868L352J972K100L825L752J631R00K213K440Q08
56322C01126R7J030J131p3j95J045J300M43P20J897J545J80N58K094J694o7L67
56305C14892K821L636K515K705M295L924J568R48K650L328K354K626M227L935
$$ plain form
56291 356424 358227 359774 363378 367786 371151 374976 381197 388287 394093 399644 406318 412349 416102 419809
56277 419809 425986 433186 439329 446009 455151 464625 471813 478522 487768 498621 508944 520242 534902
56264 534902 551396 567246 584145 605258 629937 655972 684513 717839 754767 793278 835224
56253 835224 883488 936896 992905 1052801 1119210 1190938 1265330 1343142 1425845 1510681 1593650
56242 1593650 1674822 1755251 1831314 1897847 1954421 2002695 2039975 2061503 2067166 2060088 2040605 2007534
56230 2007534 1963429 1912499 1855061 1789790 1719507 1648794 1577811 1504506 1430980 1361387 1295347
56219 1295347 1229877 1166245 1108507 1056609 1007271 960424 918619 881335 845973 813179 785109
56208 785109 759894 733992 708610 687656 670807 654785 639797 628289 619055 609137 599935 594679
$$ packed form
56291C56424J803J547L604M408L365L825O221P090N806N551O674O031L753L707
56277D19809O177P200O143O680R142R474P188O709R246J0853J0323J1298J4660
56264E34902J6494J5850J6899K1113K4679K6035K8541L3326L6928L8511M1946
56253H35224M8264N3408N6009N9896O6409P1728P4392P7812Q2703Q4836Q2969
56242A593650Q1172Q0429P6063O6533N6574M8274L7280K1528N663p078j9483l3071
56230B007534m4105n0930n7438o5271p0283p0713p0983p3305p3526o9593o6040
56219A295347o5470o3632n7738n1898m9338m6847m1805l7284l5362l2794k8070
56208G85109k5215k5902k5382k0954j6849j6022j4988j1508r234r918r202n256
$$ plain form
56196 594679 591549 586246 579732 576248 575170 572269 567750 565447 565056 562787 558936 557304 557736 556683 554499
56181 554499 554694 556605 556394 554763 556045 560069 562601 563480 566595 572076 576293 579455 585334 593513 599670
56166 599670 603588 609205 616797 622972 628347 637180 649201 659757 668311 678951 692300 704956 717146
56153 717146 732895 752379 772089 792682 818468 849133 880406 913051 952546 999724 1050686
56142 1050686 1106356 1173010 1252657 1341875 1440705 1553278 1678515 1809247 1941269 2073886
56132 2073886 2200908 2311453 2401824 2477602 2542901 2597090 2643013 2687527 2731024 2765772 2786803
56121 2786803 2795406 2790806 2769071 2732715 2691074 2648142 2599134 2540786 2474729 2398464 2304174 2190422
56109 2190422 2065682 1937527 1807947 1681618 1567829 1470375 1385101 1310378 1250172 1204203
$$ packed form
56196E94679l130n303o514l484j078k901m519k303l91k269l851j632M32j053k184
56181E54499J95J911k11j631J282M024K532Q79L115N481M217L162N879Q179O157
56166E99670L918N617P592O175N375Q833J2021J0556Q554J0640J3349J2656J2190
56153G17146J5749J9484J9710K0593K5786L0665L1273L2645L9495M7178N0962
56142A050686N5670O6654P9647Q9218R8830J12573J25237J30732J32022J32617
56132B073886J27022J10545R0371P5778O5299N4189M5923M4514M3497L4748K1031
56121B786803Q603m600k1735l6356m1641m2932m9008n8348o6057p6265r4290j13752
56109B190422j24740j28155j29580j26329j13789r7454q5274p4723o0206m5969
$$ plain form
56099 1204203 1165741 1132358 1108458 1094130 1082348 1070472 1063589 1062983 1062418 1059575 1059972 1065503 1070213
56086 1070213 1071602 1075012 1082605 1089048 1092321 1097644 1106549 1113432 1117104 1124138 1136494 1147694 1155643
56073 1155643 1167079 1184689 1202151 1216704 1234026 1255665 1274525 1288128 1303370 1322630 1338412
56062 1338412 1347467 1356820 1369805 1379824 1384336 1391227 1404568 1417761 1427529 1440649 1459831 1477278
56050 1477278 1489641 1505008 1527502 1549556 1567183 1587957 1615742 1642721 1665036 1690911 1724508
56039 1724508 1757322 1784752 1815352 1854152 1892898 1926667 1963846 2009376 2054660 2094722 2138549
56028 2138549 2191401 2243901 2290059 2338838 2396085 2452689 2502930 2556620 2620357 2684913 2744257
56017 2744257 2808430 2883909 2960222 3030203 3104251 3189961 3277372 3359556 3447536 3549076 3653333
$$ packed form
56099A204203l8462l3383k3900j4328j1782j1876o883o06n65k843L97N531M710
56086A070213J389L410P593O443L273N323Q905O883L672P034J2356J1200P949
56073A155643J1436J7610J7462J4553J7322K1639J8860J3603J5242J9260J5782
56062A338412R055R353J2985J0019M512O891J3341J3193R768J3120J9182J7447
56050A477278J2363J5367K2494K2054J7627K0774K7785K6979K2315K5875L3597
56039A724508L2814K7430L0600L8800L8746L3769L7179M5530M5284M0062M3827
56028B138549N2852N2500M6158M8779N7247N6604N0241N3690O3737O4556N9344
56017B744257O4173P5479P6313O9981P4048Q5710Q7411Q2184Q7980J01540J04257
$$ plain form
56006 3653333 3752809 3859315 3981255 4106949 4228085 4357187 4503501 4654821 4802411 4959866
55996 4959866 5137059 5320186 5498985 5688244 5900059 6121156 6341252 6576612 6840694
55987 6840694 7119482 7401918 7705634 8045298 8405915 8776427 9177967 9628223 10111266
55978 10111266 10615322 11165452 11783974 12455508 13168790 13954403 14841035 15815719 16871138
55969 16871138 18049064 19390462 20889928 22551620 24441560 26630707 29143510 32028186
55961 32028186 35422222 39482599 44318125 50066960 56965155 65250367 75087567 86703231
55953 86703231 100510017 117001939 136677379 160210671 188424551 221632807 258948706
55946 258948706 298445342 337741429 373750125 401799884 416104619 412454694 391005878
$$ packed form
56006C653333R9476J06506J21940J25694J21136J29102J46314J51320J47590J57455
55996D959866J77193J83127J78799J89259K11815K21097K20096K35360K64082
55987F840694K78788K82436L03716L39664L60617L70512M01540M50256M83043
55978A0111266N04056N50130O18522O71534P13282P85613Q86632R74684J055419
55969A6871138J177926J341398J499466J661692J889940K189147K512803K884676
55961C2028186L394036M060377M835526N748835O898195Q285212R837200J1615664
55953H6703231J3806786J6491922J9675440K3533292K8213880L3208256L7315899
55946B58948706L9496636L9296087L6008696K8049759J4304735l649925k1448816
$$ plain form
55939 391005878 356368472 314990144 272394741 232152969 196174348 165166257 138984499
55932 138984499 117086529 98917812 83968059 71685738 61544600 53160797 46246420
55925 46246420 40506709 35674805 31591098 28156557 25245310 22731992 20558199 18697316
55917 18697316 17086541 15654606 14381206 13268611 12284012 11383789 10565360 9842717 9196143
55908 9196143 8594039 8039629 7549781 7110080 6694322 6307195 5965907 5659086 5363646
55899 5363646 5084149 4837499 4615470 4398582 4191307 4008926 3844290 3680571 3522875
55890 3522875 3385528 3261536 3135260 3012586 2908918 2819251 2728546 2640158 2566356 2501590
55880 2501590 2431861 2360163 2297070 2236435 2165597 2089798 2022053 1958437 1887409 1814159 1751792
$$ packed form
55939C91005878l4637406m1378328m2595403m0241772l5978621l1008091k6181758
55932A38984499k1897970j8168717j4949753j2282321j0141138q383803o914377
55925D6246420n739711m831904m083707l434541k911247k513318k173793j860883
55917A8697316j610775j431935j273400j112595r84599r00223q18429p22643o46574
55908I196143o02104n54410m89848m39701m15758l87127l41288l06821k95440
55899E363646k79497k46650k22029k16888k07275j82381j64636j63719j57696
55890C522875j37347j23992j26276j22674j03668q9667r0705q8388p3802o4766
55880B501590o9729p1698o3093o0635p0838p5799o7745o3616p1028p3250o2367
$$ plain form
55869 1751792 1697014 1637935 1577876 1528551 1487199 1442773 1397821 1362506 1333509 1299939 1263980
55858 1263980 1235342 1211325 1182297 1151044 1127213 1108248 1084785 1059204 1040127 1024122 1001509
55847 1001509 974944 953892 935913 911793 884381 863993 849446 831484 810991 796176 785431
55836 785431 770432 752896 741212 733445 720473 703320 691066 683970 674541 663049 656335 653279
55824 653279 646701 637785 633801 633386 628633 619934 614458 611752 605024 595025 588666 585443 579014 570686
55810 570686 567717 569608 569558 568061 571681 579549 584345 585624 589107 593797 592943 587056 583003 580709 573501
55795 573501 561287 550809 543020 532576 519772 510739 505665 498772 490213 486157 486658 484945 479259
55782 479259 474161 469813 461320 449367 440438 435670 430068 423356 420885 423018 424120 422854 423218 424697
$$ packed form
55869A751792n4778n9079o0059m9325m1352m4426m4952l5315k8997l3570l5959
55858A263980k8638k4017k9028l1253k3831j8965k3463k5581j9077j6005k2613
55847A001509k6565k1052j7979k4120k7412k0388j4547j7962k0493j4815j0745
55836G85431j4999j7536j1684p767j2972j7153j2254p096r429j1492o714l056
55824F53279o578q916l984m15m753q699n476k706o728r999o359l223o429q328
55810E70686k969J891n0j497L620P868M796J279L483M690q54n887m053k294p208
55795E73501j2214j0478p789j0444j2804r033n074o893q559m056N01j713n686
55782D79259n098m348q493j1953q929m768n602o712k471K133J102j266L64J479
$$ plain form
55768 424697 421783 414199 407476 402466 394245 382367 372244 365280 357283 347776 341270 338246 334214 328728
55754 328728 325975 325538 322006 314810 309124 305961 300745 292904 287517 285968 283953 280112 277739 276707
55740 276707 272770 266260 262519 262261 260402 255835 253289 253872 252974 249514 248279 250782 252496 251525 251562 253804
55724 253804 254184 251199 248626 248035 246240 242378 239834 239021 235967 230213 226448 226092 224983 221606 219883
55709 219883 221386 222388 221228 221180 223499 224908 224452 225559 228788 229741 226811 223882 222837 220485 215597
55694 215597 211814 210715 208933 205068 202718 203751 205146 205294 206940 211210 215265 218472 224265 233148
55680 233148 240575 244559 248738 254959 259581 260357 260411 261967 262390 259835 256802 254814 251567 246546 243522
55665 243522 244231 245433 245338 246944 251761 256317 258391 260849 265718 270175 272056 273714 276743 278224 275978
$$ packed form
55768D24697k914p584o723n010q221j1878j0123o964p997r507o506l024m032n486
55754C28728k753m37l532p196n686l163n216p841n387j549k015l841k373j032
55740B76707l937o510l741k58j859m567k546N83q98l460j235K503J714r71L7K242
55724B53804L80k985k573n91j795l862k544q13l054n754l765l56j109l377j723
55709B19883J503J002j160m8K319J409m56J107L229R53k930k929j045k352m888
55694B15597l783j099j782l865k350J033J395J48J646M270M055L207N793Q883
55680B33148P427L984M179O221M622P76N4J556M23k555l033j988l247n021l024
55665B43522P09J202r5J606M817M556K074K458M869M457J881J658L029J481k246
$$ plain form
55650 275978 272337 269171 264299 256387 248308 242106 235617 227517 220712 217194 214407 210183 206399 204381
55636 204381 201672 196910 193072 192309 192244 190850 190107 191247 191229 187859 183850 182018 180784 178149 175806 175505
55620 175505 175458 173998 172837 173257 173115 170986 169208 169453 169404 167168 164855 164407 164005 162040 160484 160951 161410
55603 161410 160159 158950 158910 157667 154024 151174 151560 152735 152000 151004 151847 152740 151620 150272 150811 151592
55587 151592 150545 149142 149341 150008 149963 151028 154341 157260 157628 157665 159939 163013 164846 166939 171232 176283
55571 176283 180366 185011 191672 198223 202559 206297 211056 214570 214510 212789 211900 210268 205552 199435 194789
55556 194789 190919 185942 181153 178697 177332 174701 171565 169940 169384 168774 169237 171596 173504 172871 171633
55541 171633 172441 174273 175042 175733 177974 180146 180000 178704 178294 177532 174340 170031 167066 164785 161330 157610
$$ packed form
55650B75978l641l166m872p912q079o202o489q100o805l518k787m224l784k018
55636B04381k709m762l838p63o5j394p43J140j8l370m009j832j234k635k343l01
55620A75505m7j460j161M20j42k129j778K45m9k236k313m48m02j965j556M67M59
55603A61410j251j209m0j243l643k850L86J175p35r96Q43Q93j120j348N39P81
55587A51592j047j403J99O67m5J065L313K919L68L7K274L074J833K093M293N051
55571A76283M083M645O661O551M336L738M759L514o0j721q89j632m716o117m646
55556A94789l870m977m789k456j365k631l136j625n56o10M63K359J908o33j238
55541A71633Q08J832P69O91K241K172j46j296m10p62l192m309k965k281l455l720
$$ plain form
55525 157610 155413 153659 150418 146651 144239 142416 139835 137859 137992 138335 136552 134123 133604 133859 132200
55510 132200 129263 127568 126983 125757 124421 124605 125532 125457 125107 126015 127139 126782 126123 127104 128596 128368 127082
55493 127082 126594 126164 124304 122504 123094 124974 125451 124725 124674 124851 123771 122582 123294 124751 124423 122869 122420
55476 122420 122813 122195 121117 121380 122134 121335 119989 120754 123193 124508 124225 124246 124956 125159 125210 126466 128216
55459 128216 128641 128086 128090 128182 127099 126002 126853 128676 129132 128677 129336 130520 130019 128237 127404 127407 126379 124706
55441 124706 124449 125387 125571 125273 126453 128776 130026 130073 130646 131552 130981 129294 128779 129793 130631 130930 131764
55424 131764 132778 132732 132447 133710 135760 136382 135928 136618 138465 139735 140903 144104 148847 152222 153306 153589
55408 153589 153277 151175 148173 146745 146670 145126 141448 138050 136215 134678 132881 132004 132037 131199 129033 127085
$$ packed form
55525A57610k197j754l241l767k412j823k581j976J33L43j783k429n19K55j659
55510A32200k937j695n85j226j336J84R27p5l50R08J124l57o59R81J492k28j286
55493A27082m88m30j860j800N90J880M77p26n1J77j080j189P12J457l28j554m49
55476A22420L93o18j078K63P54p99j346P65K439J315k83K1P10K03N1J256J750
55459A28216M25n55MR2j083j097Q51J823M56m55O59J184n01j782q33Lj028j673
55441A24706k57R38J84k98J180K323J250M7N73R06n71j687n15J014Q38K99Q34
55424A31764J014m6k85J263K050O22m54O90J847J270J168L201M743L375J084K83
55408A53589l12k102l002j428p5j544l678l398j835j537j797q77L3q38k166j948
$$ plain form
55392 127085 125982 124784 123596 123801 125313 126436 126707 127145 127692 127333 126641 127182 128499 128737 128061 128220 128950
55375 128950 128259 126197 124767 124084 122300 119516 118046 118381 118522 117847 118029 119468 120364 120107 120198 120994 120886
55358 120886 119578 118950 119700 120293 120112 120553 121979 122668 121916 121370 122183 123431 124284 125229 126278 126458 125837
55341 125837 125691 126106 125830 124845 124524 124920 124602 123511 123158 123653 123426 122297 121872 122441 122534 122080 122791 124720
55323 124720 125611 124652 123857 124683 126089 126975 127795 128667 128560 127457 126902 127434 127747 127123 126348 125662 124349 122841
55305 122841 122612 123403 123282 121968 121297 121805 121854 120909 120687 122057 123641 124501 125487 126938 127721 127518 127476 127757
55287 127757 127118 125697 125389 126530 127062 126019 124990 125042 125030 124222 123833 124611 125407 125418 125471 126008 126194 126005 126681
55268 126681 128184 128794 128127 127877 128688 129146 128917 129771 132189 133871 133171 131346 129954 128684 127268 126842
$$ packed form
55392A27085j103j198j188K05J512J123K71M38N47l59o92N41J317K38o76J59P30
55375A28950o91k062j430o83j784k784j470L35J41o75J82J439Q96k57R1P96j08
55358A20886j308o28P50N93j81M41J426O89p52n46Q13J248Q53R45J049J80o21
55341A25837j46M15k76r85l21L96l18j091l53M95k27j129m25N69R3m54P11J929
55323A24720Q91r59p95Q26J406Q86Q20Q72j07j103n55N32L13o24p75o86j313j508
55305A22841k29P91j21j314o71N08M9r45k22J370J584Q60R86J451P83k03m2K81
55287A27757o39j421l08J141N32j043j029N2j2q08l89P78P96J1N3N37J86j89O76
55268A26681J503O10o67k50Q11M58k29Q54K418J682p00j825j392j270j416m26
$$ plain form
55252 126842 127774 128541 128311 128295 129170 129628 128859 128045 127971 127604 126436 125778 126259 126519 125755 125100 125110 124542 123073
55233 123073 122549 123868 125250 125320 125289 126308 127306 127387 127776 129210 129899 128404 126458 126551 128491 130473 131823
55216 131823 132741 132984 132712 133074 134326 134954 134152 133343 133701 134061 132943 130836 128908 127187 125626 125156 126142
55199 126142 127449 128341 129527 131121 131676 130614 129477 129380 129329 128495 127855 128029 127826 126608 125798 126321 126832
55182 126832 126274 125896 126834 127959 128085 128082 128818 129245 128626 128398 129630 130808 130439 129775 130537 131925 132350 132286
55164 132286 132993 134106 134866 136035 138199 139885 139753 139038 139399 139966 138992 136966 135577 134935 134226 133814 134280
55147 134280 134634 133835 132882 133161 133894 133573 132722 132904 133988 134654 134690 134735 134678 134254 134199 134977 135492 134884 134311 135114
55127 135114 136559 137328 137757 138556 138864 137855 136856 137454 138736 138796 137898 137684 138241 138329 137743 137243 136860 136236
$$ packed form
55252A26842R32P67k30j6Q75M58p69q14p4l67j168o58M81K60p64o55J0n68j469
55233A23073n24J319J382P0l1J019R98Q1L89J434O89j495j946R3J940J982J350
55216A31823R18K43k72L62J252O28q02q09L58L60j118k107j928j721j561m70R86
55199A26142J307Q92J186J594N55j062j137r7n1q34o40J74k03j218q10N23N11
55182A26832n58l78R38J125J26lP36M27o19k28J232J178l69o64P62J388M25o4
55164A32286P07J113P60J169K164J686j32p15L61N67r74k026j389o42p09m12M66
55147A34280L54p99r53K79P33l21q51J82J084O66L6M5n7m24n5P78N15o08n73Q03
55127A35114J445P69M29P99L08j009r99N98J282O0q98k14N57Q8n86n00l83o24
$$ plain form
55109 136236 135876 136208 136409 135906 135854 137264 138986 139546 139659 140795 142565 143746 144597 145842 146666 146150 145497
55092 145497 146296 147658 147608 146356 145624 145601 145141 144248 143843 143720 143102 142584 143204 144259 144351 143852 144021 144436 143715
55073 143715 142158 141256 141157 140976 141026 142296 144151 144921 144414 143742 143090 141842 140408 139752 139582 139156 139255 141117
55055 141117 143945 145760 146247 146570 146944 146713 146317 146788 147677 147713 147099 146925 146806 145543 143705 143093 143873 144575
55037 144575 144718 145095 145694 145692 145405 145954 147079 147452 147040 146981 147329 147135 146587 146781 147437 147115 145622 144124 142972
55018 142972 141679 140847 141733 143841 145293 145712 146446 147790 148336 147522 146597 146536 146887 147162 147610 148236 148612 148942
55000 148942 149762 150587 150463 149782 149852 150787 151517 151766 152217 152902 153265 153678 154949 156437 156605 155422 154320 153835
54982 153835 153237 152469 152436 153229 153921 154213 154575 154782 154087 152751 151716 150964 149995 149549 150812 153150 154783
$$ packed form
55109A36236l60L32K01n03n2J410J722N60J13J136J770J181Q51J245Q24n16o53
55092A45497P99J362n0j252p32k3m60q93m05j23o18n18O20J055R2m99J69M15p21
55073A43715j557r02r9j81N0J270J855P70n07o72o52j248j434o56j70m26R9J862
55055A41117K828J815M87L23L74k31l96M71Q89L6o14j74j19j263j838o12P80P02
55037A44575J43L77N99kk87N49J125L73m12n9L48j94n48J94O56l22j493j498j152
55018A42972j293q32Q86K108J452M19P34J344N46q14r25o1L51K75M48O26L76L30
55000A48942Q20Q25j24o81P0R35P30K49M51O85L63M13J271J488J68j183j102m85
54982A53835n98p68l3P93O92K92L62K07o95j336j035p52r69m46J263K338J633
$$ plain form
54965 154783 155504 156610 158320 159552 160193 161271 162771 163547 163531 163870 164741 165207 165327 166122 167339 167636 167237
54948 167237 168000 170422 172912 174477 175803 177136 177470 176617 175967 176338 177021 177677 179269 182351 186210 190420
54932 190420 195567 201826 208497 215533 223843 233524 243435 252918 262254 270940 277240 280022 279581 276344
54918 276344 270393 262566 254274 245898 236869 227491 218956 211473 204299 197741 193084 190280 187719 184649
54904 184649 181836 179589 177239 174922 173731 173673 173568 173397 174600 177555 180965 184260 188345 193338 197896
54889 197896 201578 205744 211298 217686 224853 233831 244380 254252 261908 267970 273005 276029 276384 274918
54875 274918 271990 266332 257360 246829 236729 227145 217541 208572 201110 194847 189200 184450 180851 177783
54861 177783 174804 172365 170647 168926 166902 165326 164618 164228 164029 164762 166338 167314 166859 165713 164482 162707
$$ packed form
54965A54783P21J106J710J232O41J078J500P76j6L39Q71M66J20P95J217K97l99
54948A67237P63K422K490J565J326J333L34q53o50L71O83O56J592L082L859M210
54932A90420N147O259O671P036Q310R681R911R483R336Q686O300K782m41l237
54918B76344n951p827q292q376r029r378q535p483p174o558m657k804k561l070
54904A84649k813k247k350k317j191n8j05j71J203K955L410L295M085M993M558
54889A97896L682M166N554O388P167Q978J0549R872P656O062N035L024L55j466
54875B74918k928n658q972j0531j0100r584r604q969p462o263n647m750l599l068
54861A77783k979k439j718j721k024j576p08l90j99P33J576R76m55j146j231j775
$$ plain form
54845 162707 160442 158955 158767 158636 157575 156323 155742 155275 154192 152956 152322 152281 152771 154033 155497 155829
54829 155829 154915 154267 154693 155202 155062 155091 155931 156846 157393 158515 160672 162566 163049 162772 162654 162317 161402 160903
54811 160903 161654 162807 163208 163142 163450 164150 165099 166768 169067 170647 170658 170086 170245 171057 171876 172727 173675 174223
54793 174223 174432 175356 177318 179108 179908 180583 181964 183414 184345 185694 188463 192173 196130 200861 206923
54778 206923 213587 220110 227111 235351 244411 253912 264674 277159 289936 301212 310737 318785 324477
54765 324477 326695 325618 321920 315548 306789 297438 289254 282063 274738 267029 259084 250314 240439 230773
54751 230773 222826 216332 210134 204286 199825 197089 195630 195178 195457 195704 195566 195816 197140 199046 201024
54736 201024 203779 208141 213671 219604 226206 233859 241728 248752 255196 261880 268507 274005 277912 280221
$$ packed form
54845A62707k265j487j88j31j061j252n81m67j083j236o34m1M90J262J464L32
54829A55829r14o48M26N09j40K9Q40R15N47J122K157J894M83k77j18l37r15m99
54811A60903P51J153M01o6L08P00R49J669K299J580J1n72J59Q12Q19Q51R48N48
54793A74223K09R24J962J790Q00O75J381J450R31J349K769L710L957M731O062
54778B06923O664O523P001Q240R060R501J0762J2485J2777J1276R525Q048N692
54765C24477K218j077l698o372q759r351q184p191p325p709p945q770r875r666
54751B30773p947o494o198n848m461k736j459m52K79K47j38K50J324J906J978
54736B01024K755M362N530N933O602P653P869P024O444O684O627N498L907K309
$$ plain form
54722 280221 280506 278290 273757 267256 258839 249073 239347 230511 222091 213676 205944 199565 194308 190116
54708 190116 187643 186676 185539 183262 180865 179282 177619 174978 172425 171354 171252 170914 170646 171351 172535
54693 172535 173146 173491 174375 175195 174781 173497 172701 172648 172578 172324 172188 171796 170597 169059 167976 167152 165966 164627
54675 164627 163683 163029 162579 162979 164442 165902 166548 167088 168109 168516 167202 165027 163431 162266 160845 159963
54659 159963 160748 162425 163317 163368 163778 164845 166035 167444 169258 170518 170328 169605 169743 170353 170261 169860 170273
54642 170273 170951 170498 169355 169266 170343 170987 170623 170267 170335 169955 168625 166822 164928 163173 162429 163323 164771
54625 164771 165107 164446 164268 164984 165764 166388 167274 167948 167552 166756 167098 168430 169012 168246 167325 167033 166842 166441
54607 166441 166380 166854 167429 168161 169402 170497 170389 169606 169859 171478 173015 173592 173858 174262 174139 173093 171871
$$ packed form
54722B80221K85k216m533o501q417r766r726q836q420q415p732o379n257m192
54708A90116k473r67j137k277k397j583j663k641k553j071j02l38k68P05J184
54693A72535O11L45Q84Q20m14j284p96n3p0k54j36l92j199j538j083q24j186j339
54675A64627r44o54m50M00J463J460O46N40J021M07j314k175j596j165j421q82
54659A59963P85J677Q92N1M10J067J190J409J814J260j90p23J38O10r2m01M13
54642A70273O78m53j143q9J077O44l64l56O8l80j330j803j894j755p44Q94J448
54625A64771L36o61j78P16P80O24Q86O74l96p96L42J332N82p66r21k92j91m01
54607A66441o1M74N75P32J241J095j08p83K53J619J537N77K66M04j23j046j222
$$ plain form
54590 171871 171242 171196 171529 172040 172030 170831 169013 167910 167936 168514 169495 171196 173110 174094 174010 173798 173873 173750 173286
54571 173286 172926 172702 172265 171928 172363 173351 174067 174414 174721 174470 172942 170959 170292 171351 173011 174660 176696
54554 176696 178910 180192 180153 179606 179180 178806 178671 179292 180416 181174 181449 181918 182829 183867 185026 186312 186953
54537 186953 186329 185352 185377 186181 186626 186772 187395 187876 186784 184421 182575 181740 180780 179477 179136 180265 181762
54520 181762 182881 184068 185427 186253 186528 187093 187928 188072 187520 187310 187436 186654 184698 182691 181018 178941
54504 178941 176794 176260 177708 179366 180004 180345 181029 181339 181039 181394 182994 184354 184011 182547 181337 180752
54488 180752 180666 181308 182422 182927 182473 182118 182586 183236 183567 184252 185644 186774 186976 187128 188052 188963 188833 188196
54470 188196 188279 189191 190135 190760 191257 191659 191894 192064 192192 192197 192262 192487 192266 191135 190132 190794 192711 193715 192814
$$ packed form
54590A71871o29m6L33N11j0j199j818j103K6N78R81J701J914R84q4k12P5j23m64
54571A73286l60k24m37l37M35R88P16L47L07k51j528j983o67J059J660J649K036
54554A76696K214J282l9n47m26l74j35O21J124P58K75M69R11J038J159J286O41
54537A86953o24r77K5Q04M45J46O23M81j092k363j846q35r60j303l41J129J497
54520A81762J119J187J359Q26K75N65Q35J44n52k10J26p82j956k007j673k077
54504A78941k147n34J448J658O38L41O84L10l00L55J600J360l43j464j210n85
54488A80752q6O42J114N05m54l55M68O50L31O85J392J130K02J52R24R11j30o37
54470A88196Q3R12R44O25M97M02K35J70J28NO5K25k21j131j003O62J917J004r01
$$ plain form
54451 192814 191157 189735 188118 186197 185166 185577 186143 185677 184818 184698 185259 185972 186920 188049 188550 188088 187523
54434 187523 187485 187432 187010 186986 187787 188433 188098 187581 188016 189143 189960 190188 190124 189944 190020 190971 192617 193861 194280
54415 194280 194694 195559 196158 196109 196135 196451 195977 194336 193127 193822 195659 196991 197588 198258 199233 200261 201439
54398 201439 202743 203580 203846 204475 205938 207286 207624 207349 206875 205542 203108 201000 200525 200899 200619 199764 199359
54381 199359 199400 199203 198979 199375 200002 199976 199468 199309 199463 199282 198912 199128 200083 201300 202579 203838 204576 204605 204864
54362 204864 206402 208897 211197 212873 214235 215299 215875 216365 217472 219309 221495 223822 226125 228006 229362
54347 229362 230664 232152 233397 234189 234977 235767 235577 233836 231352 228955 226220 222661 219237 217352 216995
54332 216995 217070 216902 216358 215168 213344 211668 210614 209429 207329 205008 203702 203354 202960 202261 201832 201837 201877
$$ packed form
54451A92814j657j422j617j921j031M11N66m66q59j20N61P13R48J129N01m62n65
54434A87523l8n3m22k4Q01O46l35n17M35J127Q17K28o4j80P6R51J646J244M19
54415A94280M14Q65N99m9K6L16m74j641j209O95J837J332N97O70R75J028J178
54398B01439J304Q37K66O29J463J348L38k75m74j333k434k108m75L74k80q55m05
54381A99359M1j97k24L96O27k6n08j59J54j81l70K16R55J217J279J259P38K9K59
54362B04864J538K495K300J676J362J064N76M90J107J837K186K327K303J881J356
54347B29362J302J488J245P92P88P90j90j741k484k397k735l559l424j885l57
54332B16995P5j68n44j190j824j676j054j185k100k321j306l48l94o99m29NM0
$$ plain form
54315 201877 201892 202166 202641 203037 203407 203840 204004 203665 203190 202859 202305 201308 200468 200284 200252 199706 198828 198045 197195
54296 197195 196219 195863 196689 198020 198812 198920 198665 198001 197044 196617 197179 197939 198074 197996 198375 198751 198339 197506 197202
54277 197202 197512 197911 198353 199015 199599 199977 200821 202507 204073 204487 204263 204691 206088 207958 210100 212350 213964
54260 213964 214575 215050 216173 217190 217010 216085 215607 215538 215002 214099 213680 213654 213088 211827 210677 210151 210219 210951
54242 210951 212241 213228 213223 212760 212612 212328 211057 209202 207803 206770 205287 203578 202640 202458 202055 201201 200643
54225 200643 200673 200830 200991 201470 202084 202314 202313 202622 203020 202796 201983 201282 200943 200790 200993 201751 202514 202635 202407 202468
54205 202468 202680 202763 203376 205158 207289 208517 209145 210448 212486 214127 214907 215259 215134 214060 212476 211398
54189 211398 210801 209797 208313 207102 206225 205153 204222 204305 204997 204837 203520 202269 201812 201550 201040 200759 200991
$$ packed form
54315B01877J5K74M75L96L70M33J64l39m75l31n54r97q40j84l2n46q78p83q50
54296A97195r76l56Q26J331P92J08k55o64r57m27N62P60J35p8L79L76m12q33l04
54277A97202L10L99M42O62N84L78Q44J686J566M14k24M28J397J870K142K250J614
54260B13964O11M75J123J017j80r25m78o9n36r03m19k6n66j261j150n26O8P32
54242B10951J290R87nm63j48k84j271j855j399j033j483j709r38j82m03q54n58
54225B00643L0J57J61M79O14K30jL09L98k24q13p01l39j53K03P58P63J21k28O1
54205B02468K12Q3O13J782K131J228O28J303K038J641P80L52j25j074j584j078
54189B11398n97j004j484j211q77j072r31Q3O92j60j317j251m57k62n10k81K32
$$ plain form
54172 200991 201290 201428 201681 201893 201464 200540 200076 200461 201151 201713 202150 202185 201464 200544 200452 201199 201868 202135 202418
54153 202418 202641 202216 201331 200898 201092 201296 201459 202138 203146 203606 203510 203716 204379 204890 205522 207434 210607 213349
54135 213349 214426 214327 214004 213746 213759 214458 215531 215921 215388 215014 215634 216797 217750 218427 219049 219704 220700 222372
54117 222372 224244 225287 225236 224769 224380 224089 224183 224949 225640 225084 223509 222422 222485 222855 222825 222659 222511 222007 221349
54098 221349 221457 222503 223587 224263 225102 226386 227586 228590 230062 232108 233916 235247 236978 239722 243221
54083 243221 247555 253502 261126 269384 277873 287734 300196 315364 332868 352307 372382 390923 406358
54070 406358 417886 423825 421605 410510 393140 373273 353383 334794 318435 304243 291186 279160
54058 279160 269746 263971 260572 257739 255456 254743 255515 256708 257856 259181 260533 261477 262187 263388 265632
$$ packed form
54172B00991K99J38K53K12m29r24m64L85O90N62M37L5p21r20r2P47O69K67K83
54153B02418K23m25q85m33J94K04J63O79J008M60r6K06O63N11O32J912L173K742
54135B13349J077r9l23k58J3O99J073L90n33l74O20J163R53O77O22O55R96J672
54117B22372J872J043n1m67l89k91R4P66O91n56j575j087O3L70l0j66j48n04o58
54098B21349J08J046J084O76Q39J284J200J004J472K046J808J331J731K744L499
54083B43221M334N947P624Q258Q489R861J2462J5168J7504J9439K0075J8541J5435
54070D06358J1528N939k220j1095j7370j9867j9890j8589j6359j4192j3057j2026
54058B79160r414n775l399k833k283p13P72J193J148J325J352R44P10J201K244
$$ plain form
54043 265632 269100 273562 277978 280968 282393 283815 286687 290829 295291 299784 304412 308782 312451 315738
54029 315738 319277 323222 327533 332420 337809 342963 347320 351209 355165 359166 363123 367430 372387 377671
54015 377671 382890 387984 392598 395877 397442 397701 396579 392871 385753 376168 365860 355643 345428 335287
54001 335287 325580 316480 308101 300672 294058 287672 281423 276090 272132 268864 265468 262170 259640 257854
53987 257854 256372 255296 255040 255401 255532 254760 253101 251209 250011 249966 250455 250333 249181 247512 245856 244415
53971 244415 243552 243637 244272 244720 245169 246470 248467 249959 250569 251257 252532 253678 254340 255329 256994 258292 258517
53954 258517 258645 259863 261897 263939 266076 268690 271431 273947 276668 279772 282425 284255 286568 290780
53940 290780 296495 302363 308025 313917 319984 326004 332525 340106 348251 356412 365427 376510 389347 402593
$$ packed form
54043B65632L468M462M416K990J425J422K872M142M462M493M628M370L669L287
54029C15738L539L945M311M887N389N154M357L889L956M001L957M307M957N284
54015C77671N219N094M614L279J565K59j122l708p118r585j0308j0217j0215j0141
54001C35287r707r100q379p429o614o386o249n333l958l268l396l298k530j786
53987B57854j482j076k56L61J31p72j659j892j198m5M89j22j152j669j656j441
53971B44415q63Q5O35M48M49J301J997J492O10O88J275J146O62R89J665J298K25
53954B58517J28J218K034K042K137K614K741K516K721L104K653J830K313M212
53940B90780N715N868N662N892O067O020O521P581Q145Q161R015J1083J2837J3246
$$ plain form
53926 402593 415888 430000 445327 461713 479537 499540 521519 544326 567068 589071 608563
53915 608563 622645 629008 627240 618561 604994 588744 571572 554551 538491 524136 511472 499528
53903 499528 487675 476655 467568 460296 453771 447358 441133 435175 429478 424263 419548 414705 409108 402906
53889 402906 396460 389481 381553 373113 365087 357870 351399 345783 341049 336657 332093 327616 323661 319942
53875 319942 316000 312161 309035 306391 303476 300221 297202 294619 292129 289502 286732 283708 280488 277646
53861 277646 275649 274126 272388 270389 268494 266681 264652 262477 260447 258591 256912 255783 255519 255875 256437
53846 256437 257071 257524 257198 255919 254346 253063 251940 250955 250821 251929 253380 253980 253631 252960 252215 251383 250749
53829 250749 250428 250005 249464 249725 251318 253255 254301 254631 255088 255593 255591 255414 255817 256593 257020 257265 258088 259538
$$ packed form
53926D02593J3295J4112J5327J6386J7824K0003K1979K2807K2742K2003J9492
53915F08563J4082O363j768q679j3567j6250j7172j7021j6060j4355j2664j1944
53903D99528j1853j1020r087p272o525o413o225n958n697n215m715m843n597o202
53889D02906o446o979p928q440q026p217o471n616m734m392m564m477l955l719
53875C19942l942l839l126k644k915l255l019k583k490k627k770l024l220k842
53861B77646j997j523j738j999j895j813k029k175k030j856j679j129k64L56N62
53846B56437O34M53l26j279j573j283j123r85j34J108J451O00l49o71p45q32o34
53829B50749l21m23n41K61J593J937J046L30M57N05kj77M03P76M27K45Q23J450
$$ plain form
53811 259538 261237 263559 267102 271243 274684 277369 280573 285053 290312 295685 301079 306573 312249 318352
53797 318352 324830 330899 335924 340407 345204 350155 354464 357918 360560 361740 360905 359020 357705 357111 356014
53782 356014 353915 351602 349587 347396 344576 341138 336830 331198 324691 318651 313939 310343 307325 304389
53768 304389 300828 296253 291453 287686 285091 282773 280329 278160 276252 273962 271196 268684 266816 265199
53754 265199 263575 262197 261139 260127 259190 258610 258231 257697 257302 257590 258158 258041 257266 256875 257308 257933 258323
53737 258323 258767 259300 259405 259077 259077 259686 260241 260317 260497 261462 263069 264706 265951 266630 266895 267418 268861 271027
53719 271027 273104 274678 275885 276842 277824 279680 282930 286580 289047 290222 291371 293041 294535 295691 297654
53704 297654 301264 305870 310392 314483 318017 320498 321834 323037 325349 329021 333270 337007 339375 340208
$$ packed form
53811B59538J699K322L543M141L441K685L204M480N259N373N394N494N676O103
53797C18352O478O069N025M483M797M951M309L454K642J180q35j885j315n94j097
53782C56014k099k313k015k191k820l438m308n632o507o040m712l596l018k936
53768C04389l561m575m800l767k595k318k444k169j908k290k766k512j868j617
53754B65199j624j378j058j012r37n80l79n34l95K88N68j17p75l91M33O25L90
53737B58323M44N33J05l28%O09N55P6J80R65J607J637J245O79K65N23J443K166
53719B71027K077J574J207R57R82J856L250L650K467J175J149J670J494J156J963
53704B97654L610M606M522M091L534K481J336J203K312L672M249L737K368Q33
$$ plain form
53690 340208 340303 340779 341998 343474 344747 345733 346290 346229 345805 345571 345804 346596 348134 350129 351422 351214 350343
53673 350343 350151 350476 350092 348870 347867 347333 346404 344980 344207 344575 345106 345024 344815 344944 344896 344301 343788 343947
53655 343947 344483 345060 345886 346807 346993 346334 345978 346594 347137 346314 344407 342631 341450 340578 340031 340116 340670 341173
53637 341173 341490 341977 342995 344612 346456 347759 348062 347978 348614 350168 351936 353718 356118 359168 361920 363975
53621 363975 366306 369790 373889 377613 381002 384724 388839 392833 396506 400164 404230 409051 414669 420490
53607 420490 425709 430357 435240 440570 445458 449162 452075 455027 458425 462551 467887 474448 481367 487743
53593 487743 493471 498946 504540 510670 517588 524646 530467 534189 535877 535512 532614 527286 520675 513760
53579 513760 506622 499459 493260 488639 484835 480765 476395 472265 468343 464262 460190 456627 453652 451073
$$ packed form
53690C40208R5M76J219J476J273R86N57o1m24k34K33P92J538J995J293k08q71
53673C50343j92L25l84j222j003n34r29j424p73L68N31q2k09J29m8n95n13J59
53655C43947N36N77Q26R21J86o59l56O16N43q23j907j776j181q72n47Q5N54N03
53637C41173L17M87J018J617J844J303L03q4O36J554J768J782K400L050K752K055
53621C63975K331L484M099L724L389L722M115L994L673L658M066M821N618N821
53607D20490N219M648M883N330M888L704K913K952L398M126N336O561O919O376
53593D87743N728N475N594O130O918P058N821L722J688l65k898n328o611o915
53579E13760p138p163o199m621l804m070m370m130l922m081m072l563k975k579
$$ plain form
53565 451073 448957 447444 446355 445487 444942 444851 445190 446086 447709 449556 450585 450380 449513 448465 447103 445605
53549 445605 444909 445526 446784 447928 449167 450862 452474 453257 453480 454182 456044 459093 463043 467431 471893
53534 471893 476730 482667 489742 497129 504367 511901 519943 527869 535382 543388 552923 564031 576390 590154
53520 590154 605225 620512 634979 648912 663363 678900 695628 713776 733309 753497 773693
53509 773693 794068 814951 836122 857499 879790 903521 927993 952131 975824 999560 1023338
53498 1023338 1046897 1070542 1094740 1119268 1143675 1168178 1193229 1218539 1243426 1267837 1292160
53487 1292160 1316259 1339481 1361451 1382228 1401951 1420875 1439477 1457990 1476162 1493840 1511221
53476 1511221 1528128 1543878 1558445 1572861 1587645 1601622 1613215 1622197 1629244 1634553 1637927 1639456
$$ packed form
53565D51073k116j513j089q68n45r1L39Q96J623J847J029k05q67j048j362j498
53549D45605o96O17J258J144J239J695J612P83K23P02J862L049L950M388M462
53534D71893M837N937P075P387P238P534Q042P926P513Q006R535J1108J2359J3764
53520E90154J5071J5287J4467J3933J4451J5537J6728J8148J9533K0188K0196
53509G73693K0375K0883K1171K1377K2291K3731K4472K4138K3693K3736K3778
53498A023338K3559K3645K4198K4528K4407K4503K5051K5310K4887K4411K4323
53487A292160K4099K3222K1970K0777J9723J8924J8602J8513J8172J7678J7381
53476A511221J6907J5750J4567J4416J4784J3977J1593Q982P047N309L374J529
$$ plain form
53464 1639456 1638951 1635344 1627912 1617585 1605795 1592597 1577215 1560001 1542355 1524878 1507017 1488433
53452 1488433 1469321 1449370 1427761 1404497 1380594 1356738 1332775 1308748 1285414 1263329 1242201
53441 1242201 1221460 1200802 1180044 1159244 1139250 1121499 1106926 1095411 1086330 1079129 1073393 1068919
53429 1068919 1065847 1064316 1064062 1064806 1066925 1071182 1077801 1086288 1096100 1107005 1118873 1131655 1145554
53416 1145554 1160854 1177624 1195819 1215495 1236555 1258599 1281383 1305187 1330412 1357181 1385562
53405 1385562 1415686 1447279 1479768 1513354 1549312 1588565 1630607 1674613 1720906 1770400 1823045
53394 1823045 1877867 1934213 1991980 2050846 2110221 2169888 2229965 2290374 2350952 2411742 2472509
53383 2472509 2532333 2590423 2646891 2701936 2754779 2804381 2850840 2895020 2937052 2976238 3012148
$$ packed form
53464A639456n05l607p432j0327j1790j3198j5382j7214j7646j7477j7861j8584
53452A488433j9112j9951k1609k3264k3903k3856k3963k4027k3334k2085k1128
53441A242201k0741k0658k0758k0800j9994j7751j4573j1515r081p201n736m474
53429A068919l072j531k54P44K119M257O619Q487R812J0905J1868J2782J3899
53416A145554J5300J6770J8195J9676K1060K2044K2784K3804K5225K6769K8381
53405A385562L0124L1593L2489L3586L5958L9253M2042M4006M6293M9494N2645
53394A823045N4822N6346N7767N8866N9375N9667O0077O0409O0578O0790O0767
53383B472509N9824N8090N6468N5045N2843M9602M6459M4180M2032L9186L5910
$$ plain form
53372 3012148 3044734 3073489 3097642 3117217 3132830 3144352 3150641 3150619 3143736 3129351 3106633 3075282
53360 3075282 3035761 2988841 2935618 2877888 2817611 2755890 2693026 2629424 2565710 2502171 2438936
53349 2438936 2376665 2316217 2257732 2200852 2145722 2092813 2041828 1991723 1941923 1892665 1844081
53338 1844081 1795894 1748210 1701820 1657521 1615774 1577037 1541654 1509312 1479344 1451741 1427222
53327 1427222 1406258 1388594 1373641 1360593 1348233 1335568 1322797 1310851 1299856 1288832 1277041
53316 1277041 1264895 1253286 1242720 1233349 1225290 1218613 1213352 1209554 1207005 1205110 1203660 1203492 1205681
53303 1205681 1210234 1216306 1223550 1232426 1243207 1255592 1269369 1284690 1301518 1319545 1338754 1359461
53291 1359461 1381769 1405657 1431494 1459651 1489549 1519880 1549937 1579927 1609893 1639116 1666808
$$ packed form
53372C012148L2586K8755K4153J9575J5613J1522O289k2o883j4385k2718l1351
53360C075282l9521m6920n3223n7730o0277o1721o2864o3602o3714o3539o3235
53349B438936o2271o0448n8485n6880n5130n2909n0985n0105m9800m9258m8584
53338A844081m8187m7684m6390m4299m1747l8737l5383l2342k9968k7603k4519
53327A427222k0964j7664j4953j3048j2360j2665j2771j1946j0995j1024j1791
53316A277041j2146j1609j0566r371q059o677n261l798k549j895j450j68K189
53303A205681M553O072P244Q876J0781J2385J3777J5321J6828J8027J9209K0707
53291A359461K2308K3888K5837K8157K9898L0331L0057K9990K9966K9223K7692
$$ plain form
53280 1666808 1692720 1716869 1739295 1760244 1779986 1798243 1814257 1827484 1837686 1844420 1847106 1845714
53268 1845714 1840855 1833119 1822781 1809994 1794666 1776249 1754276 1729008 1701005 1670354 1637106 1602235
53256 1602235 1567150 1532280 1496967 1460747 1423901 1386862 1350036 1314238 1280293 1248055 1216670
53245 1216670 1185937 1156486 1128486 1101069 1073336 1045100 1016434 987297 957931 928969 900898
53234 900898 873926 848403 824674 802499 781387 761604 744064 729085 715993 704074 693164
53223 693164 683203 673966 665400 657483 649650 641088 631696 622065 612440 602441 591733 580261 567874
53210 567874 554655 541520 529550 518749 508428 498701 490416 483516 476782 469533 462438 456246 450778
53197 450778 445564 440472 435247 429413 423111 417123 411686 406134 400062 393903 388003 382160 376538 372017
$$ packed form
53280A666808K5912K4149K2426K0949J9742J8257J6014J3227J0202O734K686j392
53268A845714m859p736j0338j2787j5328j8417k1973k5268k8003l0651l3248l4871
53256A602235l5085l4870l5313l6220l6846l7039l6826l5798l3945l2238l1385
53245A216670l0733k9451k8000k7417k7733k8236k8666k9137k9366k8962k8071
53234I00898k6972k5523k3729k2175k1112j9783j7540j4979j3092j1919j0910
53223F93164r961r237q566p917p833q562r392r631r625r999j0708j1472j2387
53210E67874j3219j3135j1970j0801j0321r727q285o900o734p249p095o192n468
53197D50778n214n092n225n834o302n988n437n552o072o159n900n843n622m521
$$ plain form
53183 372017 368992 366714 364364 362018 359991 358091 356088 354147 352240 349896 347060 344445 342471 340623
53169 340623 338420 336286 334847 334029 333369 332575 331345 329314 326739 324535 323182 322249 321377 320853 320686 320005
53153 320005 318119 315466 312878 310578 308612 307486 307478 307822 307409 306049 304456 303393 303302 304255 305632 306315
53137 306315 305851 305133 305343 306544 307812 308523 308994 309965 311744 313793 315134 315467 315789 317341 320041 322616
53121 322616 324316 325633 327176 328762 329932 330541 330447 329404 327670 325982 324617 323207 321689 320522 319581
53106 319581 317859 314790 310980 307211 303641 300486 298406 297472 296686 295310 293858 293119 293077 293545 294881 297157
53090 297157 299417 300754 301480 302354 303284 303704 303595 303252 302671 302064 302331 303961 305978 307052 307260 307733 308857
53073 308857 309895 310248 310142 310018 309922 309546 308429 306320 303647 301333 299780 298496 297052 295719 294713 293610
$$ packed form
53183C72017l025k278k350k346k027j900k003j941j907k344k836k615j974j848
53169C40623k203k134j439q18o60p94j230k031k575k204j353r33q72n24j67o81
53153C20005j886k653k588k300j966j126qL44m13j360j593j063r1R53J377O83
53137C06315m64p18K10J201J268P11M71R71J779K049J341L33L22J552K700K575
53121C22616J700J317J543J586J170O09r4j043j734j688j365j410j518j167r41
53106C19581j722l069l810l769l570l155k080r34p86j376j452p39m2M68J336K276
53090B97157K260J337P26Q74R30M20j09l43n81o07K67J630K017J074K08M73J124
53073C08857J038L53j06j24r6l76j117k109k673k314j553j284j444j333j006j103
$$ plain form
53057 293610 292204 291185 291082 291220 290673 289685 289153 289177 289193 289173 289574 290272 290561 290184 289523 288890 288416 288523 289623
53038 289623 291322 292676 293298 293599 293985 294427 294856 295367 295922 296249 296088 295325 294065 292800 292242 292596 293252
53021 293252 293504 293293 292993 292932 293443 294883 297094 299256 300679 301323 301263 300315 298707 297500 297633 298988 300877
53004 300877 302871 304637 305610 305584 305107 304693 304218 303678 303782 304971 306549 307704 308709 310123 311497 312082
52988 312082 312273 313026 314162 314647 314435 314732 316255 318351 320083 321260 322185 323231 324898 327518 330637 333302
52972 333302 335155 336745 338669 340952 343343 345653 347616 348845 349086 348341 346801 344827 342749 340433 337393
52957 337393 333681 330218 327742 325863 323770 321453 319529 318168 316916 315403 313620 311684 309862 308616
52943 308616 308106 307929 307816 308133 309144 310226 310546 310153 309710 309502 309415 309428 309393 308754 307359 306152 306144 307057 307890
$$ packed form
53057B93610j406j019j03J38n47r88n32K4J6k0M01O98K89l77o61o33m74J07J100
53038B89623J699J354O22L01L86M42M29N11N55L27j61p63j260j265n58L54O56
53021B93252K52k11l00o1N11J440K211K162J423O44o0r48j608j207J33J355J889
53004C00877J994J766R73k6m77m14m75n40J04J189J578J155J005J414J374N85
52988C12082J91P53J136M85k12K97J523K096J732J177R25J046J667K620L119K665
52972C33302J853J590J924K283K391K310J963J229K41p45j540j974k078k316l040
52957C37393l712l463k476j879k093k317j924j361j252j513j783j936j822j246
52943C08616n10j77j13L17J011J082L20l93m43k08q7J3l5o39j395j207qR13Q33
$$ plain form
52924 307890 308449 309227 310027 310004 309124 308424 308528 308833 308473 307389 306155 305269 304886 304848 304894 305070 305712 306698 307123
52905 307123 306358 305028 304209 304016 303786 303371 303306 303843 304800 306280 308587 311313 313389 314245 314214 313763 313072 312482
52887 312482 312594 313590 314928 315865 315909 314836 312800 310504 308816 308135 308346 309131 310007 310429 310432 310784 311924 313154
52869 313154 313535 313257 313339 314259 315638 317007 318113 318683 318725 318886 319791 321168 322259 322771 322728 321808 319778 317217
52851 317217 314844 312404 309196 305424 301959 299047 296417 294440 293856 294325 294569 294145 293884 294288 294643 294137
52835 294137 292974 291969 291838 293060 295613 298518 300462 301175 301493 301953 302110 301492 300386 299397 298948 299454
52819 299454 301272 304123 307248 310401 314173 319021 324425 329102 331659 331089 327369 321716 315758 310398
52805 310398 305811 302170 299574 297436 294923 292092 289769 288297 287148 285823 284393 283092 282103 281743 282129
$$ packed form
52924C07890N59P78Q00k3q80p00J04L05l60j084j234q86l83l8M6J76O42R86M25
52905C07123p65j330q19j93k30m15o5N37R57J480K307K726K076Q56l1m51o91n90
52887C12482J12R96J338R37M4j073k036k296j688o81K11P85Q76M22LL52J140J230
52869C13154L81k78Q2R20J379J369J106N70M2J61R05J377J091N12m3r20k030k561
52851C17217k373k440l208l772l465k912k630j977n84M69K44m24k61M04L55n06
52835B94137j163j005j31J222K553K905J944P13L18M60J57o18j106r89m49N06
52819B99454J818K851L125L153L772M848N404M677K557n70l720n653n958n360
52805C10398m587l641k596k138k513k831k323j472j149j325j430j301r89l60L86
$$ plain form
52790 282129 282682 282690 282253 281938 281706 281092 280303 280114 280717 281631 282681 284009 285185 285482 285165 285407 286687 288271
52772 288271 289400 289960 289859 288895 287503 286569 286186 285558 284370 283239 282549 281907 281040 280254 279682 279060 278509
52755 278509 278550 279056 279258 279070 279364 280668 282654 285119 288269 291691 294337 296029 297721 299744 301089 301091
52739 301091 300601 300698 301349 302220 303704 306151 308931 311236 313102 314887 316405 317384 318019 318353 317849 316303
52723 316303 314487 313151 312074 310810 309633 308914 308277 307260 306197 305533 304781 303138 300864 299147 298661
52708 298661 298893 298869 298113 297009 296433 296917 298135 299508 301085 303206 305487 307065 307888 308683 309574 309878 309569
52691 309569 309691 310798 312134 312936 313355 313491 312723 310840 308778 307320 306085 304610 303339 302604 301759 300484
52675 300484 299916 301109 303171 304348 304390 304483 305239 306088 306498 306600 306631 306698 307064 307933 309077 310259 311720 313684
$$ packed form
52790B82129N53Qm37l15k32o14p89j89O03R14J050J328J176K97l17K42J280J584
52772B88271J129N60j01r64j392r34l83o28j188j131o90o42q67p86n72o22n51
52755B78509M1N06K02j88K94J304J986K465L150L422K646J692J692K023J345K
52739C01091m90R7O51Q71J484K447K780K305J866J785J518R79O35L34n04j546
52723C16303j816j336j077j264j177p19o37j017j063o64p52j643k274j717m86
52708B98661K32k4p56j104n76M84J218J373J577K121K281J578Q23P95Q91L04l09
52691C09569J22J107J336Q02M19J36p68j883k062j458j235j475j271p35q45j275
52675C00484n68J193K062J177M2R3P56Q49M10J02L1O7L66Q69J144J182J461J964
$$ plain form
52657 313684 315831 317929 320398 323450 326182 327407 326990 325509 323150 319955 316800 314960 314764 315491 316473
52642 316473 317443 317989 317539 316030 314052 312392 311763 312559 314362 316123 317458 319270 322331 325755 327759
52627 327759 327627 326056 323906 321542 319223 317182 315276 313256 311392 310244 309928 310160 310760 311548 311967 311547
52611 311547 310574 309754 309419 309604 310510 312200 314082 315463 316404 317379 318353 318926 319195 319677 320492 321278 321813 322135
52593 322135 322232 322292 322958 324548 326184 326560 325612 324658 324759 325652 326410 326506 325969 325026 323958 323084 322630 322630 322951
52574 322951 323343 323619 323820 324024 323977 323334 322312 321587 321329 320921 319919 318730 317981 317754 317819 318046 318125 317548 316414
52555 316414 315742 316364 317914 319328 319907 319454 318052 316246 314854 314025 313042 311581 310396 310144 310287 309984
52539 309984 309381 309167 309482 310183 311593 313933 316412 317879 318150 317939 317842 318088 318822 319804 320268 319910 319546 320057
$$ packed form
52657C13684K147K098K469L052K732J225m17j481k359l195l155j840j96P27R82
52642C16473R70N46m50j509j978j660o29P96J803J761J335J812L061L424K004
52627C27759j32j571k150k364k319k041j906k020j864j148l16K32O00P88M19m20
52611C11547r73q20l35J85R06J690J882J381R41R75R74N73K69M82Q15P86N35L22
52593C22135R7O0O66J590J636L76r48r54J01Q93P58R6n37r43j068q74m54%L21
52574C22951L92K76K01K04m7o43j022p25k58m08j002j189p49k27O5K27P9n77j134
52555C16414o72O22J550J414N79m53j402j806j392q29r83j461j185k52J43l03
52539C09984o03k14L15P01J410K340K479J467K71k11r7K46P34R82M64l58l64N11
$$ plain form
52521 320057 321228 322420 323689 325254 326598 327297 328166 330270 333164 335432 336647 337505 338244 338316 337546 336360
52505 336360 334814 332565 329848 327392 325351 323355 321581 320688 320674 320881 321199 322184 323885 325564 326728 327502
52489 327502 327934 327886 327693 327966 328686 329351 329978 330975 332122 332832 333432 334907 337244 339289 340523 341650 342969
52472 342969 343499 342519 340891 340002 340116 340576 340967 341259 341215 340448 338962 337209 335654 334462 333442 332192 330515
52455 330515 328686 327073 325642 324224 323027 322327 321850 321083 320119 319506 319355 319172 318553 317472 316038 314614
52439 314614 313949 314475 315640 316661 317665 319196 320831 321406 320638 319470 318729 318398 318349 318792 319669 320488 321013
52422 321013 321421 321654 321444 321157 321780 323812 326851 330418 334490 339128 344397 350723 358497 367237 376041
52407 376041 384934 394752 405377 415017 421594 424107 422513 417278 409458 400332 390513 380087 369796
$$ packed form
52521C20057J171J192J269J565J344O99Q69K104K894K268J215Q58P39P2p70j186
52505C36360j546k249k717k456k041j996j774q93j4K07L18R85J701J679J164P74
52489C27502M32m8j93K73P20O65O27R97J147P10O00J475K337K045J234J127J319
52472C42969N30r80j628q89J14M60L91K92m4p67j486j753j555j192j020j250j677
52455C30515j829j613j431j418j197p00m77p67r64o13j51j83o19j081j434j424
52439C14614o65N26J165J021J004J531J635N75p68j168p41l31m9M43Q77Q19N25
52422C21013M08K33k10k87O23K032L039L567M072M638N269O326P774Q740Q804
52407C76041Q893R818J0625R640O577K513j594n235p820r126r819j0426j0291
$$ plain form
52394 369796 361142 354927 350522 347044 344388 342673 341522 340512 339708 339250 338976 338885 339400 340691 342261 343626
52378 343626 344895 346383 348139 350183 352696 355709 359072 362896 367376 371954 375422 377221 378022 378658 379062
52363 379062 378713 377635 376486 375972 376449 377768 379330 380580 381533 382564 383818 385303 387343 390216 393426
52348 393426 396066 397877 399257 400349 400975 401450 402537 404519 407150 410524 414970 420015 424524 428139 431691
52333 431691 435994 441162 447221 454366 462365 470699 479481 489241 499668 509748 519315 529152 539308
52320 539308 548767 557340 566371 576777 587754 598389 609320 621686 635370 649367 663135 676718
52308 676718 690367 704942 721811 741270 761714 781325 799961 818505 837069 854870 871316
52297 871316 886162 898988 909468 917900 924744 930035 933859 936880 939640 941859 943171 943993 944853 945399
$$ packed form
52394C69796q654o215m405l478k656j715j151j010q04m58k74r1N15J291J570J365
52378C43626J269J488J756K044K513L013L363L824M480M578L468J799Q01O36M04
52363C79062l49j078j149n14M77J319J562J250R53J031J254J485K040K873L210
52348C93426K640J811J380J092O26M75J087J982K631L374M446N045M509L615L552
52333D31691M303N168O059P145P999Q334Q782R760J0427J0080R567R837J0156
52320E39308R459Q573R031J0406J0977J0635J0931J2366J3684J3997J3768J3583
52308F76718J3649J4575J6869J9459K0444J9611J8636J8544J8564J7801J6446
52297H71316J4846J2826J0480Q432O844N291L824L021K760K219J312Q22Q60N46
$$ plain form
52283 945399 944972 943727 942301 940719 938502 935616 932551 929724 927485 926377 926590 927396 927833 927838 928143 929309
52267 929309 931441 934539 938513 943087 948211 954309 961679 970061 979272 989758 1001936 1015393 1029414
52254 1029414 1043846 1058774 1073671 1087624 1100207 1111639 1122288 1132467 1142301 1151293 1158431 1163286
52242 1163286 1166623 1169473 1172070 1174131 1175558 1176181 1175454 1173236 1170371 1167694 1164882 1161167 1156782 1152741
52228 1152741 1149346 1145752 1140976 1134693 1127256 1119574 1112816 1107537 1103201 1099052 1095250 1092612 1091515 1091596
52214 1091596 1092241 1092825 1092753 1091943 1091041 1090674 1090798 1091254 1092462 1094902 1098349 1102358 1107093 1112913 1119519 1126334
52198 1126334 1133353 1140687 1147556 1152808 1156410 1159441 1162518 1165114 1166580 1167019 1166841 1166137 1164838 1163010 1160682
52183 1160682 1157701 1154050 1150085 1146265 1142694 1139008 1134776 1130097 1125636 1121726 1117676 1112591 1106860 1101967
$$ packed form
52283I45399m27j245j426j582k217k886l065k827k239j108K13Q06M37NL05J166
52267I29309K132L098L974M574N124O098P370Q382R211J0486J2178J3457J4021
52254A029414J4432J4928J4897J3953J2583J1432J0649J0179R834Q992P138M855
52242A163286L337K850K597K061J427O23p27k218k865k677k812l715m385m041
52228A152741l395l594m776o283p437p682o758n279m336m149l802k638j097Q1
52214A091596O45N84p2q10r02l67J24M56J208K440L447M009M735N820O606O815
52198A126334P019P334O869N252L602L031L077K596J466M39j78p04j299j828k328
52183A160682k981l651l965l820l571l686m232m679m461l910m050n085n731m893
$$ plain form
52169 1101967 1098565 1095701 1092445 1089364 1087552 1087006 1086874 1086748 1086742 1086726 1086487 1086340 1086636 1086896 1086366 1085320 1084895
52152 1084895 1085677 1087234 1089024 1090983 1093132 1095225 1096882 1097660 1097146 1095463 1093538 1092313 1091767 1091149 1089952
52137 1089952 1088187 1086007 1083656 1081677 1080610 1080593 1081646 1084023 1087896 1093032 1099235 1106644 1115119 1123906
$$ packed form
52169A101967l402k864l256l081j812n46j32j26oj6k39j47K96K60n30j046m25
52152A084895P82J557J790J959K149K093J657P78n14j683j925j225n46o18j197
52137A089952j765k180k351j979j067j7J053K377L873N136O203P409Q475Q787
$$ [...]
##END NTUPLES=NMR SPECTRUM
##END=
