##TITLE=AC1755_VAR00027_9319777_qAtLbfTzhX
##JCAMPDX= 6.0         $$ Bruker NMR JCAMP-DX V2.0
##DATA TYPE= NMR SPECTRUM
##DATA CLASS= NTUPLES
##ORIGIN= BRUKER
##OWNER= Administrator
$$ 1.72 TOPSPIN		Version 2.1
$$ 2015-08-11 21:42:15.210 -0700  Administrator@X
$$ Compression mode = diff/dup
##.OBSERVE FREQUENCY= 400.02188249412
##.OBSERVE NUCLEUS= ^1H
##.ACQUISITION MODE= SIMULTANEOUS (DQD)
##.ACQUISITION SCHEME= undefined
##.AVERAGES= 8
##.DIGITISER RES= 22
##SPECTROMETER/DATA SYSTEM= spect
##.PULSE SEQUENCE= zg30
##.SOLVENT NAME= COFFEE_meoh
##.SHIFT REFERENCE= INTERNAL, COFFEE_meoh, 1, 14.98509
##AUDIT TRAIL= $$ (NUMBER, WHEN, WHO, WHERE, PROCESS, VERSION, WHAT)
$$ ##TITLE= Audit trail, TOPSPIN		Version 2.1
$$ ##JCAMPDX= 5.01
$$ ##ORIGIN= Bruker BioSpin GmbH
$$ ##OWNER= Administrator
$$ $$ E:\/data/COFFEE/nmr/AC1755_VAR00027_9319777_qAtLbfTzhX/10/pdata/1/auditp.txt
$$ ##AUDIT TRAIL=  $$ (NUMBER, WHEN, WHO, WHERE, PROCESS, VERSION, WHAT)
(   1,<2015-08-11 21:42:07.960 -0700>,<Administrator>,<X>,<go>,<TOPSPIN 2.1>,
      <created by zg
	started at 2015-08-11 21:41:02.070 -0700,
	POWCHK enabled, PULCHK disabled,
       configuration hash MD5:
       21 0F 79 D6 B3 7B B4 F6 88 20 88 DB 03 48 BD 9F
       data hash MD5: 64K
       5D 48 6A 8F CC 46 65 FD C0 F0 1A D9 2F FF D6 A9>)
(   2,<2015-08-11 21:42:11.070 -0700>,<Administrator>,<X>,<proc1d>,<TOPSPIN 2.1>,
      <Start of raw data processing
       efp LB = 0 FT_mod = 6 PKNL = 1 PHC0 = 0 PHC1 = 0 SI = 32K 
       data hash MD5: 32K
       E3 57 83 22 1E 98 58 27 C1 2F 90 41 D8 CE 8A D4>)
(   3,<2015-08-11 21:42:11.351 -0700>,<Administrator>,<X>,<proc1d>,<TOPSPIN 2.1>,
      <pk PHC0 = 87.83569 PHC1 = 0 
       data hash MD5: 32K
       0F 59 B9 EA 41 C6 49 89 6F CF E9 BF 88 C2 42 1C>)
(   4,<2015-08-11 21:42:11.460 -0700>,<Administrator>,<X>,<proc1d>,<TOPSPIN 2.1>,
      <abs ABSG = 1 
       data hash MD5: 32K
       10 C9 01 C8 E8 1C E6 19 E7 F4 9F BA FF 2D DF E3>)
(   5,<2015-08-11 21:42:11.523 -0700>,<Administrator>,<X>,<proc1d>,<TOPSPIN 2.1>,
      <abs ABSG = 2 
       data hash MD5: 32K
       C7 C8 20 A1 F2 FA 17 B7 9F 2B 2B 6A C7 7F 00 1E>)
(   6,<2015-08-11 21:42:11.601 -0700>,<Administrator>,<X>,<proc1d>,<TOPSPIN 2.1>,
      <abs ABSG = 3 
       data hash MD5: 32K
       B9 B6 3D D4 59 D5 53 B0 63 27 A7 2D 9D F4 C0 32>)
(   7,<2015-08-11 21:42:11.664 -0700>,<Administrator>,<X>,<proc1d>,<TOPSPIN 2.1>,
      <abs ABSG = 4 
       data hash MD5: 32K
       5B E7 22 E3 79 E5 9E 93 B2 AE E8 07 FC 0B 72 85>)
(   8,<2015-08-11 21:42:11.726 -0700>,<Administrator>,<X>,<proc1d>,<TOPSPIN 2.1>,
      <abs ABSG = 5 
       data hash MD5: 32K
       2A 77 96 B4 40 69 66 48 58 59 EA DE 99 CB C2 D0>)
$$ ##END=
$$ 
$$ $$ hash MD5
$$ $$ 22 FA 2F CD 4A 0A 37 06 FC D2 66 FD 64 11 47 29
##$RELAX= 
##$RELAX= 
##$RELAX= 
##$RELAX= 
##$RELAX= 
##$RELAX= 
##$RELAX= 
$$ Bruker specific parameters
$$ --------------------------
##$DU= <E:\>
##$EXPNO= 10
##$NAME= <AC1755_VAR00027_9319777_qAtLbfTzhX>
$$ [...]
##$TP= (0..7)
150 150 150 150 150 150 150 150
##$TP07= 0
##$TPNAME0= <>
##$TPNAME1= <>
##$TPNAME2= <>
##$TPNAME3= <>
##$TPNAME4= <>
##$TPNAME5= <>
##$TPNAME6= <>
##$TPNAME7= <>
##$TPOAL= (0..7)
0.5 0.5 0.5 0.5 0.5 0.5 0.5 0.5
##$TPOFFS= (0..7)
0 0 0 0 0 0 0 0
##$TUNHIN= 0
##$TUNHOUT= 0
##$TUNXOUT= 0
##$USERA1= <user>
##$USERA2= <user>
##$USERA3= <user>
##$USERA4= <user>
##$USERA5= <user>
##$V9= 5
##$VALIST= <valist>
##$VCLIST= <CCCCCCCCCCCCCCC>
##$VD= 0
##$VDLIST= <DDDDDDDDDDDDDDD>
##$VPLIST= <PPPPPPPPPPPPPPP>
##$VTLIST= <TTTTTTTTTTTTTTT>
##$WBST= 2048
##$WBSW= 25
##$XGAIN= (0..3)
0 0 0 0
##$XL= 0
##$YL= 0
##$YMAX_a= 591830
##$YMIN_a= -519644
##$ZGOPTNS= <>
##$ZL1= 120
##$ZL2= 120
##$ZL3= 120
##$ZL4= 120
##$ABSF1= 14.98509
##$ABSF2= -5.573092
##$ABSG= 5
##$ABSL= 3
##$ALPHA= 0
##$AQORDER= 0
##$ASSFAC= 0
##$ASSFACI= 0
##$ASSFACX= 0
##$ASSWID= 0
##$AUNMP= <proc_prof1d_extract_pilot.lims>
##$AXLEFT= 0
##$AXNAME= <>
##$AXNUC= <1H>
##$AXRIGHT= 0
##$AXTYPE= 0
##$AXUNIT= <>
##$AZFE= 0.1
##$AZFW= 0.1
##$BCFW= 0
##$BC_mod= 0
##$BYTORDP= 0
##$COROFFS= 0
##$CY= 15
##$DATMOD= 1
##$DC= 0
##$DFILT= <>
##$DTYPP= 0
##$F1P= 0
##$F2P= 0
##$FCOR= 0.5
##$FTSIZE= 32768
##$FT_mod= 6
##$GAMMA= 0
##$GB= 0
##$INTBC= 1
##$INTSCL= 1
##$ISEN= 128
##$LB= 0
##$LEV0= 0
##$LPBIN= 0
##$MAXI= 10000
##$MC2= 0
##$MEAN= 0
##$ME_mod= 0
##$MI= 0
##$NCOEF= 0
##$NC_proc= -8
##$NLEV= 6
##$NOISF1= 0
##$NOISF2= 0
##$NSP= 0
##$NTH_PI= 0
##$NZP= 0
##$OFFSET= 14.98509
##$PC= 1
##$PHC0= 87.83569
##$PHC1= 0
##$PH_mod= 1
##$PKNL= yes
##$PPARMOD= 0
##$PPDIAG= 0
##$PPIPTYP= 0
##$PPMPNUM= 2147483647
##$PPRESOL= 1
##$PSCAL= 4
##$PSIGN= 0
##$PYNMP= <proc.py>
##$REVERSE= no
##$SF= 400.02
##$SI= 32768
##$SIGF1= 0
##$SIGF2= 0
##$SINO= 400
##$SIOLD= 32768
##$SPECTYP= <>
##$SREGLST= <1H.CDCl3>
##$SSB= 0
##$STSI= 32768
##$STSR= 0
##$SW_p= 8223.68421052631
##$SYMM= 0
##$S_DEV= 0
##$TDeff= 65536
##$TDoff= 0
##$TI= <>
##$TILT= no
##$TM1= 0
##$TM2= 0
##$TOPLEV= 0
##$USERP1= <user>
##$USERP2= <user>
##$USERP3= <user>
##$USERP4= <user>
##$USERP5= <user>
##$WDW= 1
##$XDIM= 32768
##$YMAX_p= 448243416
##$YMIN_p= -668084
##$CURPLOT= <Network HP LaserJet P1505>
##$CURPRIN= <$Network HP LaserJet P1505>
##$DFORMAT= <normdp>
##$LAYOUT= <+/1D_H.xwp>
##$LFORMAT= <normlp>
##$PFORMAT= <normpl>
##$SURQMSG= 1
$$ End of Bruker specific parameters
$$ ---------------------------------
##NTUPLES= NMR SPECTRUM
##VAR_NAME=  FREQUENCY,     SPECTRUM/REAL,   SPECTRUM/IMAG
##SYMBOL=    X,             R,               I
##VAR_TYPE=  INDEPENDENT,   DEPENDENT,       DEPENDENT
##VAR_FORM=  AFFN,          ASDF,            ASDF
##VAR_DIM=   32768,         32768,           32768
##UNITS=     HZ,            ARBITRARY UNITS, ARBITRARY UNITS
##FACTOR=    0.250966925370066, 1,           1
##FIRST=     8223.43324360094, -152794,      3236
##LAST=      0,             181891,          -14424
##MIN=       0,             -668084,         0
##MAX=       8223.43324360094, 448243416,    0
$$ Real data points
##PAGE= N=1
##DATA TABLE= (X++(R..R)), XYDATA
$$ [...]
23889 -101877 96340 -155725 -104284 70661 -288666 -73117 -127846 -113371 -206739 -102155 -168418
23878 -168418 -133487 -53751 -29039 -47484 -99639 -71098 104036 -86972 -141196 -117716 96174
23866 70353 -17308 -290210 -229720 -155674 -224009 441705 -71397 86002 -107372 100321 145518
23855 145518 118044 -77926 -86489 43442 -26787 392951 -11982 -106470 -249744 143478 -41382
23843 -65974 190607 -45695 160281 -128484 81089 -77053 133594 28302 -77281 -527335 287750
23831 -9936 -1341 71365 -118484 -46507 37755 -231429 -99974 120414 -62976 13931 10916 -50147
23818 106275 -130496 163351 168391 161109 -159069 444422 -6017 -78578 -291608 -211561 122762
23806 133288 210162 308107 112665 126220 160275 -148176 -249471 -68570 28645 -96622 87672
23794 -64301 52715 89318 51769 -121136 200325 182665 18222 -181708 413119 -158870 -102567
23783 -102567 91923 2400 -37449 169670 88885 -209718 -310644 -381941 -157702 49040 -18529
23771 294076 -148501 47253 101628 22910 24656 163752 -144407 -52486 121555 -149795 138285
23759 27784 -27552 -52319 35497 -338002 37062 39375 -98727 29949 105437 73686 68899 173238
23747 173238 -244365 134576 -448926 71517 196393 -116125 50123 99901 -190656 -107188
23737 -107188 -123363 -191034 87984 -238853 53089 98683 -1056 -12718 56138 32296 -89977
23725 117439 117155 200825 -226248 -19600 -25398 8071 66111 91718 -159948 172458 147058 130634
23713 130634 -193422 -21305 -155491 -131832 -14585 -309784 -45418 -81946 -178712 127749 248999
23702 248999 -246781 76057 241708 -82708 -74844 -16121 191256 206090 -175171 -421863 89218
23690 86174 125409 -46009 -431968 -80113 -154921 -116684 -39252 -278452 -30553 31651 -261244
23678 -97534 -256502 -214852 -156344 87908 106377 -4986 271296 99120 -142315 83560 18616
23666 -110750 98754 -75613 -214869 -287374 -77840 285966 -155043 -302925 -35699 19855 22800
23655 22800 13108 -252360 -233234 -110647 69967 -181128 156713 -3677 191187 -310082 -52038
23643 -64218 261856 15860 -144829 -38967 -186250 38264 -2920 34701 -239607 33873 -42605
23631 197977 -236821 130686 113586 -72905 -42770 -249524 -393597 220742 -417808 -41235
23620 25751 -53412 -100572 238280 -7835 78938 15363 20863 -105653 108071 17231 16533 -420948
23607 18317 41925 -321939 155282 312003 8316 -44886 -252309 42857 109316 -270999 140040
23595 -88983 289133 -37753 9287 -77258 -78132 163472 158647 5974 70160 189836 -227498 140335
23582 123190 -160181 -126948 -83650 -115279 184046 77415 267594 -34687 47229 -145233 -27213
23570 -17027 -218642 34911 173733 -111364 -59238 190697 54970 -217596 433391 118926
23559 -57837 309109 -86976 209913 -103758 -71318 12075 -127037 -176681 -16374 85913 -203654
23547 -78200 -339136 -272216 -363024 -51416 -57115 -182577 -155192 68920 -70299 -309120 51334
23535 -331999 -248257 -143851 306314 -1401 -206226 -87887 -351406 22347 95724 357089 37275
23523 57359 49778 176460 18729 -105954 95218 -92696 -314231 69444 3785 -109063 150628
23511 70013 40249 388911 -50153 -121302 -92752 223909 184547 69972 -52232 -62757 99634
23499 -322898 87115 -158325 -38325 -147922 500973 26629 209409 185183 373128 45963
23488 -137877 -21813 27053 169240 -36211 -124277 -73909 131092 194409 112778 130088 430915
23477 430915 447027 -49644 141779 -155065 -195229 23885 -267297 -2089 -81675 41260 216679
23466 216679 185474 -53398 -163399 -81972 18764 -389729 59431 148868 51861 75272 139506
23455 139506 -390156 -7435 -123693 -82983 -305938 291360 91226 24365 -72224 -40228 -176384
23444 -176384 92396 -353176 188955 -11095 -333732 -208918 273037 71683 -191080 209165
23433 -44139 -118871 -83131 -147924 -421287 -102066 209544 211130 122441 -413911 -172848 -294487
23422 -294487 129681 197819 68117 173766 128564 399176 198015 177456 -228584 82956
23411 30659 -45847 -308865 196299 -239700 -29125 30168 204903 -173198 -54234 185719
23400 -22 11702 -160297 262783 -526078 -251664 209540 236393 34955 -153232 -123161 -91042
23389 -91042 57284 -65221 -207937 -105721 -95264 -60801 121161 431927 201626 -4281 -322962
23378 -322962 -89143 -68491 68559 224728 50052 -119747 7160 270711 40433 -124186 -53776
23366 -18899 -133755 309316 -103413 78197 -16288 249993 257463 123122 -160874 -6714 -261810
23355 -261810 23245 40035 -126907 16007 127125 57552 127458 -200417 48873 -99891 -15861
23343 32759 -22859 264213 -188233 99600 -144805 118533 -66798 -10282 17936 -82588 454338
23331 -116232 -252650 128492 -130640 -255766 -177532 27946 63434 142580 -131150 -162156
23321 -162156 -33173 -238728 -68030 -78204 188102 220061 -104417 6384 -334348 52345 -127300
23309 -6391 50134 -157000 -112773 143658 -80636 189186 259633 -113286 27783 -253939 -158622
23298 -158622 88181 -126742 -39743 -119611 -369628 -151987 -103076 -238095 -76278 -220329
23288 -220329 -270239 -115799 7214 -13065 -122373 172154 -46967 -65962 -30893 16305 -96951
23276 -211129 223565 -158103 -343275 -239176 -5355 93691 -234776 -233456 -151409 -44218 -141697
23265 -141697 76356 13439 134839 283607 -81815 178073 -223403 157737 -223615 -139488
23255 -139488 -202985 69993 -4486 -166125 44396 67523 -25316 -229832 29617 -113604 -170388
23244 -170388 276088 124376 132823 209343 202139 70111 43437 -79096 43635 268006 -75602
23232 -78854 -162938 7622 -97342 41742 2608 -86649 -127957 -22662 22352 114900 -48056 -340701
23220 -340701 2312 -32164 -258785 -323205 95524 -56683 134885 -50214 -159926 33823 72690
23209 72690 -93561 -207808 185027 113883 135347 199356 501521 9481 -112135 -103752 138999
23197 -95185 266486 -69373 -204212 190043 225411 56011 256072 -169041 -131500 -44172 -287555
23186 -287555 -213787 -65872 26336 22295 63419 -176896 48107 -129732 -155133 -34845 -100687
23175 -100687 4528 -210202 -112972 -126103 14390 -92698 -289418 -186450 46377 100071 -99764
23163 54873 319997 -106980 271354 -202720 102855 23043 241987 -29934 55317 -19965
23152 -214130 211131 -91799 -29763 51028 73750 58269 -72077 344078 134536 -117990 -59683
23141 -59683 -46514 -39809 187170 10889 17435 -123522 -9130 307206 -88212 44458 119369 29092
23128 253223 174635 178498 -211579 -16297 -62394 -316935 -45960 -48615 5781 71021 -272630
23116 -69726 -37412 -60168 -243605 150904 66469 -201002 -140073 133088 -214500 101493
23105 318437 61465 8225 167849 153654 6342 -105608 -70141 -151400 -84114 -127033 275225
23093 38565 135436 -212673 155242 40620 -46786 -390146 -68248 -314343 -299022 -284911 22366
23081 -241077 -56161 -14363 217615 -334624 181630 -194302 84679 -247819 -167451 12850
23070 -68198 -282142 4819 -89834 41720 190260 87719 98095 -120125 -23943 -348956 -14020
23058 -130726 3171 -178053 156259 31746 -27651 -87429 353748 72248 112821 31059 43429
23047 43429 34719 -3312 204004 219252 179597 174810 -27274 -344486 -351486 194830 -123778 357522
23034 79922 -110206 -33193 -125827 -45975 -79742 26718 37137 130298 -92768 -276345 -79292
23022 154836 -84899 -27524 178325 -98624 -35051 150835 -26895 -32482 -318052 -62030 315543
23010 -168985 -38882 -176 87834 -8940 -270930 -105227 -243447 -124684 -20598 -171352 -49784
22998 26143 -313216 -106 -122249 -26953 -103500 84451 52955 58822 54539 -244760 25965 167898
22986 167898 -115459 16913 -340647 -49510 174980 853 -296136 101780 -98459 199148 -196951
22974 294835 -116231 116766 55429 13131 116397 -366 260029 164856 391819 105533 301902
22963 301902 41466 171744 -216891 -315342 109220 -239934 73607 92289 -30515 -329107
22953 -329107 -215305 -40056 -43311 -217767 -92418 67780 41436 69547 -162919 -367728 -328980
22942 -328980 251167 105141 61898 -108625 363816 -347766 -227988 -226476 77705 -387018
22931 -86361 -30039 84517 170093 63402 -122623 -13526 120570 -18291 -209599 150680 -4620
22919 -66645 91039 35471 -182024 138824 -231549 -283940 -43847 -305592 52502 -105236 -148042
22908 -148042 -7641 -17557 69385 73568 208771 -227349 90743 -295587 31827 147579 123787
22897 123787 -95014 -321917 -363053 -61006 132717 378729 -376866 -102680 183732 -53918
22886 178329 44695 -88052 119114 -448027 22409 -104078 -239470 3724 112869 -286987
22875 200832 362274 -3258 260939 -141947 -217593 58003 -152286 -335081 -150921 -154472 -143596
22864 -143596 -166711 78023 7720 15289 -195432 -159817 -43917 291155 -445761 123253 65485
22853 65485 196155 -123171 42276 -159088 305189 -315717 17901 -180928 -311985 216888
22842 -39362 38771 -192173 237878 -314542 55173 144172 2056 40110 113389 -132154 310544
22830 -132510 -23321 -29811 223839 -158423 254205 -212901 -259917 -177509 137866 89514 117294
22819 117294 -250106 -222335 127322 -165819 229289 48806 -8884 81672 -41791 -322083 -72202
22807 78824 -37666 88103 87100 71727 -4008 53753 -278335 48700 11772 -77402 -348056 13584
22794 105344 -49257 -124856 -62282 137632 -203927 313142 174416 -415665 -521446 7771
22783 129165 189985 -9817 -95888 13954 -263582 -302810 -239224 44978 212326 -36631 -10089
22771 78779 -261425 -187960 -68621 35149 -116623 199437 43644 -73004 -284304 -384248 -29398
22759 172135 -142809 -104891 174495 -99104 -156008 184285 -252958 92536 29784 -231452
22748 39676 -182971 188767 178580 164118 -185619 -47663 77832 65894 -34811 368945 -89563
22736 266648 -69026 -42559 -247633 -66494 -285086 -89860 88745 35741 15653 53615 -117443
22724 -155176 -486090 394834 -107263 -398172 206539 -116997 117577 -179174 -16124 16117
22713 -357444 140865 -110925 -153027 12633 -72547 168602 -124727 -287919 -52091 -118170
22703 -118170 -7438 173274 274980 88896 6716 315936 -154750 -448544 -133049 56471 -139500
22691 -164619 104558 -203009 -301151 231474 -54038 114091 -125497 -21598 10525 92297
22681 92297 -56133 161777 -42576 197790 67786 -214374 -140674 163202 -239731 -11322 -276720
22670 -276720 -286424 202697 -28878 81942 -137129 310370 72156 38740 -32863 -241825 32215
22658 -37397 -16668 387917 -28764 96037 -7539 69732 -26694 -148530 17735 -244155 35737
22646 -199281 -220170 -166116 -109844 -179835 -222785 -86229 103360 -364491 34160 70952 -66582
22634 -19913 338983 -229440 143879 223743 120870 696870 -183024 -293802 18976 -15203
22623 -37080 -221990 96080 77295 -53062 -391403 -122724 -14442 191572 145516 34541 -51077
22611 -156647 -100707 -110465 -263942 -51993 49217 29185 346570 67160 115968 -112368 -16119
22599 -326746 22275 -266292 -128004 -125782 -227445 -51572 -196748 -11091 -246830 31336 -146019
22587 -420602 -133707 156930 58188 -308055 153344 142980 233259 -75033 231641 191572
22577 191572 -70846 26428 -341700 -159957 -135599 -235916 -125554 -90995 31349 -160167
22566 -220390 -312101 -16983 51543 7801 173726 -171543 162901 -117445 -19391 -72529 -13997
22554 256658 286742 -271320 80244 150012 -453132 -131789 127313 -82344 200888 12384
22543 -296696 4013 232355 -170805 -75978 -51051 -211714 128076 427694 14656 -16810 -16589
22532 -16589 89489 -168801 31552 -196037 34926 -78655 36556 -42152 -250581 -321584 -6524
22520 -272864 241078 -28269 -159376 12317 114046 264723 -26796 346604 -81585 251116
22509 104486 121686 -71559 -366265 -267235 147136 -32485 -188478 42468 -121866 -266148
22499 -266148 210785 137030 -332395 -92132 -104991 18180 -7876 -201141 82078 70619 -128289
22487 -36838 -141097 -81169 -25988 -41918 -66875 -93523 122264 -181324 3692 188162 -106450
22475 118862 206897 -46512 -59590 -62344 -21873 98056 -94156 -144378 -445254 110526 8505
22463 -146233 226048 18578 -92025 214575 -36552 -285639 225417 -358740 -235970 -28887
22452 -334657 -81561 99238 -279672 -2739 203329 -46920 -146860 113353 -257041 -143247 -39432
22440 174706 -162041 -570178 -62758 -149441 -58238 354474 349058 -51324 170274 -263852 113571
22428 -81320 -63156 -180093 157086 -44870 284781 40583 219237 43109 -37201 -144527 -257708
22417 -257708 -87883 199224 -69286 84159 80521 -248724 194790 189761 31531 46358 99698
22406 99698 -75594 -24494 -234002 91270 -212077 -14441 22075 -66726 -159839 114126 81356
22395 81356 44404 43370 10676 -67185 82711 234811 -22230 -97359 28992 274382 -52527
22383 49858 -143909 91946 -175333 94961 -64309 150528 28871 -401243 -78651 91688 12898
22371 -108530 17098 -195483 127228 53697 -31847 87148 -2582 10975 -24395 -46959 -112154
22360 -112154 -329926 143603 -137564 -44597 51897 236964 120166 -130376 -263965 -42670
22349 -289294 291851 142591 -262511 -372590 -10782 138995 -182091 -130139 -53061 174207
22338 2980 -35728 -86435 132163 -110622 -38189 -244144 -338379 291097 -187652 -22978 -108345
22327 -108345 88973 -80191 -324512 -386679 357712 -15859 -20700 88858 -104598 25618 -60738
22315 -324183 89540 45152 -141142 151148 81261 -175403 -226739 -155676 -197128 -244728 -140613
22304 -140613 83169 -43227 141876 10553 92780 -86995 35773 -46093 -189403 275355 102131
22292 148766 -18919 213331 300780 111234 122003 -160664 7155 155028 102026 -154022 356692
22280 153270 -5008 186323 -37948 68075 -75245 25746 20878 14887 -54777 -152063 -86490 -353871
22268 -353871 30287 -444327 125831 -84703 69400 -2894 1819 77137 -168041 114148 132429
22257 132429 120995 107292 43093 -276926 -4056 60056 235747 -18602 -265802 69567 -17534
22245 233204 -53620 -229817 -238224 -278389 -107932 -111141 -83456 -226146 -8657 -170460 -187034
22234 -187034 -76410 -51155 -203747 -302967 -128650 -100920 -54922 95387 -318587 -47521 226481
22222 176503 70089 8296 -73795 -256149 127854 -95386 -197080 250062 119973 300765
22212 300765 -124477 -214643 -3330 -17951 -39097 -318655 -149895 37925 -156263 -30211 49815
22200 -81240 -36126 -56630 150644 -84916 241744 -350693 -147653 394722 194490 6243 187745
22189 187745 265846 34327 -274028 127712 -103994 -185941 160236 -30990 13132 -48863 -258209
22178 -258209 -144576 -292719 415745 -53987 -156252 54016 159151 3178 97684 -154150
22167 -20932 122723 123320 -384703 -177515 -100173 130676 -201056 141971 -229424 210606
22156 252184 93410 52621 -121918 141318 148634 -151027 -99212 -499148 246594 -146437
22145 -170211 1840 61767 157882 -52811 15551 104305 -237272 90609 -468494 -158963 -275771
22134 -275771 -25537 15604 -179608 4720 113031 -108028 3463 25850 -82227 -190032 12442
22122 -59369 159655 33349 -123999 -255548 -205649 -11997 -294541 -123355 135249 -250053
22111 -229797 -199714 124239 -265940 -221713 -116715 279340 -16683 66348 -19618 149040
22100 14024 -159412 -29091 -217491 103140 -105224 18554 -310094 -82178 -9883 -369058 72603
22088 -210300 -188941 -393078 -294054 -159035 180193 -33629 -136031 -151877 101546 -41861
22077 60010 -156092 -8238 -291459 235171 42765 2171 214738 -17521 -360259 -95731 -127263
22066 -127263 -78687 183868 -189938 382611 -39845 205798 -24209 246807 212243 -17337
22055 -125596 161119 -90912 193013 7335 -189862 -100633 -34761 -39444 -83994 152295 329747
22044 329747 35887 -153573 138102 -481806 224555 -141243 -416746 106620 -58270 8549
22033 -6227 -99282 168801 -300342 -70590 -206077 232218 55460 99048 66949 -88174 111330
22021 65255 40051 -122733 -6113 217722 -6557 -80988 -35569 -262966 -72664 104536 -177072
22009 -111065 116108 49784 162492 -66002 25981 191513 43566 329148 -90292 -88114 10294
21997 -186039 -95857 15125 82006 -16988 -207700 -246562 -42423 40305 89476 -6850 -279649
21986 -279649 74971 -83676 -212524 -105544 -90511 205757 7212 -238882 -400300 -396480 99746
21974 -102037 -88133 -151631 -172743 -12867 -9659 -225321 -13708 -230706 145024 -264213 -111239
21962 29252 -79823 31933 225544 -132853 35434 -9494 -55293 44494 -103191 53370 -112976
21950 -35298 -11133 -39616 282019 -132615 41659 -56343 -79421 -157846 -241716 -11253 164713
21938 -29052 -205550 280413 -133781 -235625 -64079 -52792 -317131 -285270 -145011 -98425
21928 -98425 -2675 -93484 -6940 -222713 -249593 -211300 360639 -61730 -260038 74508 97510
21917 97510 72991 9923 183579 -54852 -18056 37410 -149602 -217254 52277 -167276 75880
21905 -200704 -42733 166661 -255854 -99961 -32291 -81333 -25620 -74700 179052 -71875 -66334
21894 -66334 -3437 191895 173139 194758 6432 93433 317430 28743 -119614 19633 124948
21883 124948 -77730 -338914 -33870 77933 190697 -176427 70687 -292389 -108514 177659
21872 94577 -130592 119338 39759 125765 -42378 -26099 49939 -7553 12323 -23978 93533
21860 -48068 376963 120205 -202040 -39280 41376 -99118 -150241 -42407 4853 -88793 -43936
21848 -29385 -63419 543883 211381 -78953 -191889 102687 66046 -206569 121067 -309434
21837 141654 82732 -110100 77989 -211062 152896 -159816 -237275 -19894 -150873 -108237
21827 -108237 9002 -353894 -125684 21791 -173448 -268523 60122 3731 -26509 65204 283735
21816 283735 215640 -116694 -200905 -98453 -212083 -94782 120975 -270542 -33889 936 57921
21805 57921 -121485 -99596 -105266 113579 189730 -243975 -432776 101602 -43409 -21755 315290
21793 113825 140233 61693 424859 -144061 140345 83020 71351 67499 -258881 83022 -142202
21781 -105224 -215242 72237 -31511 -227752 -51467 274719 -471874 -9384 -77878 -41819 41803
21769 -95819 -345686 286893 -42159 -73767 -286346 114543 -3586 14687 -109215 -158192 -175198
21758 -175198 -365820 -348719 -87455 261034 56348 98753 -9126 177732 -366194 -371851 93646
21746 -102281 26800 -7245 -16127 -198919 -311884 13752 -165755 -17284 -102315 -9296 -272670
21735 -272670 -95293 67405 -178773 -14755 -115273 99391 -4694 -64230 285736 -173144 179060
21723 -60911 -184917 -43883 118519 44572 111762 106676 -331959 12352 -246516 63247 -73787
21711 165156 69753 40593 122226 -51590 70689 59878 -221033 23978 -180583 -207925 102843
21699 -82807 -165722 -35664 49442 36610 139628 23701 -199216 -281224 -37385 -8564 -2125 -49991
21687 -49991 -3675 -291312 -386734 -254652 -292247 -342427 -18286 -198731 -262995 -266235 -113488
21675 -160223 108794 -164637 -167327 -137408 -126339 -152949 297632 -8279 -90708 -111019 78146
21663 357752 71464 76710 80154 -203136 -81759 -21587 -59267 -186827 57325 -182347 -118265
21652 -118265 43575 116757 -38277 -62250 -18939 30817 -281638 -55102 -339083 -55633 -211660
21641 -211660 -113626 -30925 -441803 -19513 -85010 68120 19363 186798 279712 157959 202544
21630 202544 -459086 -85042 -188042 -18821 -282666 -25542 -224275 60048 2182 -47420 432220
21618 -52052 -295863 341602 -35474 -63769 69980 -227599 -169727 -69543 -43652 -4118 6316
21606 109646 -247220 -154624 33546 213331 -67259 -53564 276764 272121 -444558 -142061 113247
21594 135912 -115237 89149 288062 153032 -7059 -59921 -32965 178534 51404 99813 -13744
21582 -192372 254935 -173472 82911 -257952 -138892 423043 -173281 139600 -143831 -47362
21571 -68799 -222232 27635 99538 105715 -272242 -47434 306776 -119061 198727 -149361 17604
21559 -274855 -90267 -291201 -248548 77486 -352859 276359 250989 139809 117329 -46851 -174314
21548 -174314 -138608 -123932 92117 42292 -94487 -172778 -8496 72984 -410024 -63302 82764
21536 273478 -135252 5986 -115844 -350569 -53272 -321913 83676 154658 45536 285797 -140590
21524 -67642 -265962 62933 -139324 159921 113518 -66913 -41777 -135571 -170384 -13109 -166760
21513 -166760 -116110 29670 -78968 -81910 -100667 -38178 69534 -3794 -30795 23028 78710 56677
21501 56677 361711 -217360 126922 -187063 -140047 -79485 89318 4085 48073 148264 -100090
21489 -55718 87202 -298937 62255 124968 -348722 -228234 24924 82864 -335498 -258562 -139142
21478 -139142 87977 124757 -225923 -74125 -208334 -36025 125542 -304991 58730 -70569 -31741
21466 -150557 7580 -280522 -167505 -149003 -132738 -82487 133300 -178609 -22815 113721 -130490
21454 20418 -186493 76794 -53543 -54524 -69121 -76923 133917 -98061 31963 -182229 54967 257178
21442 257178 197797 -152864 158209 234676 14720 -690 133738 48582 438665 120314 -18651
21430 22105 -99729 52483 -197099 -28729 -97138 -66217 -31770 -2279 23661 -41126 165133
21418 314942 -399790 -260287 -103104 -103708 -237766 -318506 100897 5380 -1353 -63123 -24852
21406 -202521 -133222 171348 97086 -41276 -94569 -243031 30720 303132 42203 -205936 -7862
21394 179817 59577 -91691 69935 -20767 -14159 -99409 -419582 -212604 124822 82243 -405884
21382 267752 -120259 32224 -110127 43186 -82305 -255041 -108153 -141780 57783 110041 115731
21371 115731 -165584 3497 -266344 110074 -390151 107990 -605181 364554 295685 -4704
21360 -159197 -133293 -24678 -36793 -315979 -13527 -61187 -69874 -253104 -113782 -53624 -382576
21349 -382576 127074 158861 12438 34345 -187560 -231500 -69300 -62526 -118639 -228986 -67948
21337 -114599 -284803 35071 -230785 -345081 -171004 -50532 -19476 88871 -233376 18458
21326 198701 -113169 -226360 52315 222648 -101639 18661 -208812 -241866 -35848 171629
21315 -126404 -22620 30682 33582 88240 -45931 214732 -68167 -134685 284905 -11192 -50576
21304 -50576 -150672 -112168 -78293 -159716 252639 -215126 98189 -262503 -151673 -92548 45927
21292 228226 7414 -151823 56896 -8153 12488 9023 -195838 -283538 36126 -97400 -67288 51319
21279 -219539 -131183 191870 107034 57419 23112 155216 -164803 -88857 93142 113426 -174875
21267 327993 -342651 165350 -93850 -40764 -149640 123169 -74021 64315 -163848 48398
21256 -46846 630 197284 -100197 -112741 -235597 -182080 204852 -217543 -300815 77090 -172795
21244 89048 8055 236516 205968 -76774 -176802 -17365 341169 -222531 -81425 -109054 -134047
21233 -134047 54332 -176190 -406594 1879 -1177 17516 71924 -11625 -78831 -159404 -251112
21222 -251112 149059 -96351 80739 203329 -240093 135888 -99457 -204422 242559 137310
21212 137310 -72570 -58692 -20047 -114188 -10877 49727 116409 -53551 54921 51925 -175815
21200 -170627 -445832 -344164 190906 -160013 11549 -258297 -136131 -9957 -30802 165789
21189 -144199 218228 55069 -82963 -300717 95228 -97891 155800 92221 -331854 -23556 -11244
21177 -52540 -260152 -49627 -51229 136110 246818 -3414 -200395 -349788 183355 -106187 19697
21165 69520 177410 -113364 -122782 -28363 -223428 80146 -29999 -35806 134517 236026 -479108
21153 114525 -376288 -359306 -125304 507441 -324601 194169 -150913 -248368 -140111 -75179
21143 -75179 -154138 -269239 304782 -78217 -154454 -56902 -151957 -97625 -103027 369710 -118202
21131 67336 -52037 -131742 -39562 -93015 3095 -38209 -57284 -34704 210873 -287387 6555 93997
21119 93997 -72691 -16176 -141304 -127441 -36937 145417 152397 -12641 -58828 351096 -127312
21107 -188216 20450 -185096 -252251 -90368 -220728 84203 -224396 199236 -21393 -290904
21097 -290904 -45208 -306632 -146149 32253 -104031 55457 -70405 -260493 -397815 122051
21086 185021 -132615 -84408 -184284 -236409 -63663 -443389 -317832 -58561 -367731 107015
21075 65047 -78711 -272735 -170296 9451 41 16760 106413 -99553 -104011 -82534 74662 -114092
21062 73920 -36288 192868 92627 -82931 96723 181830 291387 -445368 7056 -18239 -211897
21051 -211897 -162738 -328814 -113335 2306 102145 1315 259513 132717 -39720 75717 339717
21040 339717 -23167 -639559 141210 -364615 -42401 -64460 49727 -4308 11785 93871 -225019
21028 -5952 -162986 114114 -816 -125536 3369 55699 -194936 212828 -110074 134409 -47101
21016 -72223 -40876 -88459 -126900 -72469 -361931 -256528 -152876 21361 -92713 79684 74280
21005 74280 -162462 113750 -128691 -96959 7680 50531 147905 217827 -5343 335649 48838
20993 243311 -80842 361449 -191887 -14853 -158454 -241961 -77910 -214480 -14645 243742
20982 101901 41961 -135544 -94586 112746 131006 -189207 -64201 70530 -182823 -80468 -317999
20971 -317999 -68553 1618 -65912 -186734 128790 -179396 -195080 33603 62447 -13006 347263
20959 -69398 -183255 -15779 182706 -178314 -5465 282197 207288 -142512 18031 -192927 136023
20947 157787 6567 -65979 -245681 -203792 -181050 -118115 20066 -314057 -151792 89827 284135
20936 284135 118098 176343 46613 13162 18130 320409 247778 -211116 -57582 -207761 315153
20924 -489788 -180750 -103395 -8919 45020 -264683 -34133 -258430 173365 187594 1911 -148549
20912 -338724 -210954 -58057 -74640 -236547 -86261 204912 116315 -279539 -133489 -75400
20902 -75400 -127841 -197390 129199 -192364 -54753 -8120 -467285 -88707 -162177 -69214 234364
20890 154877 233123 94433 20550 89133 -118485 -395087 -72329 -109987 -56412 3845 -86302
20878 -54919 1654 -162537 -477497 201450 -124695 -184733 -147187 -101489 83984 1924 -89294
20866 -317173 66100 5717 192908 -101991 84782 -110252 -441242 -216494 167940 -40043
20855 -63808 5595 97646 -19715 -29347 -27748 -194435 -209446 5526 116197 -413550 -118518 -287293
20843 -287293 -298155 -196117 251043 56439 71235 -22829 -257646 -293683 -48169 -258551 -201604
20832 -201604 172896 -42329 190061 78294 -72065 -46653 -7178 -108787 179949 -125205 3681
20820 -40633 -79198 250399 -305307 -133053 -137367 2512 -123230 76757 -37172 -149227 -183839
20809 -183839 -49836 -17016 -20322 85236 91836 -195662 -266334 -281814 47533 137357 -197946
20797 134263 -41708 438619 -152601 -123400 -480726 -147908 -106902 21476 -17604 26892 -87727
20785 -202712 -118371 14845 -40633 -228360 -188789 59540 358288 -12760 -308525 103604 -86609
20773 -46326 180659 -48847 -56642 -104085 25289 -243707 124178 -146488 -32420 -178210 111304
20761 74464 70379 75979 -37808 -112107 -191567 35940 69047 33091 316562 -58512 -19973 -111406
20749 -111406 -95482 -23159 -37150 52752 131032 -215787 -426178 177277 -172611 182951
20738 389004 69418 -24949 -260902 -176838 -196813 -64544 -89592 -167242 -59724 -141564 27631
20726 -352334 -57466 6590 -129581 92103 -93119 29017 142582 -169919 -216913 43826 -77620
20714 -145623 -141560 -55338 162002 -262328 574 -321195 -209940 54408 54927 37426 179972
20703 179972 -430327 -226830 252292 -127874 25811 -233637 -251065 127810 -189200 -341654
20693 -341654 -71933 100052 117062 -15951 59810 28019 -202806 -93512 3485 92615 -253825
20681 105937 -152865 -131222 -238487 48527 124077 27294 91636 -358615 207036 190229 -182475
20669 -42049 -180255 56554 -208059 46230 80548 -53773 -97433 -128355 -68479 -64896 266853
20657 243974 -17609 -169917 -94637 328196 111348 49066 -88971 24593 -79678 267540 -101199
20645 -128416 -168823 57970 80986 -74104 -121930 -47363 21878 -376324 302800 -149612 61286
20633 -230414 188925 -158293 104900 24977 409248 255681 31924 -311512 -173647 68604
20622 41756 -326401 184844 -585636 -142712 -318807 53634 -87631 -49477 -77926 -203562
20612 -203562 -196806 -154958 -188752 -122110 -103041 -47027 -75289 45514 44242 -327453 -185968
20601 -185968 -147641 159691 -138301 -9571 -92015 -218015 101444 101109 -105115 30154 -57459
20589 -3335 137678 97251 -168343 -97515 108838 157999 126130 73817 -131645 -181747 41609
20577 -329470 133213 486496 9946 39281 -74924 -196273 -217809 93240 -53735 -193427 114844
20565 217188 -197059 -112490 183362 -90471 199605 -482731 -185335 -138481 -144842 -85077 14660
20553 -277431 -66497 321258 68411 13569 -52634 92605 -180931 112241 161289 -98272 -168182
20542 -168182 229723 126671 -138654 -209624 34388 100208 -64569 -232626 66437 31129 -273804
20530 87803 -232973 -152161 -189187 -247031 -224101 273718 136516 -78141 -97391 53968 -178253
20518 136185 -93652 -33919 -150056 -225146 -187104 53306 -177524 172828 -402891 -101610
20507 46080 -47258 -67401 -15488 128667 -151526 -87229 74949 -53812 163181 -224829 63433
20495 -51783 212871 -137126 103434 -24013 -313746 -37600 -17698 -141526 -143911 -45540 -224316
20484 -224316 -32736 -44895 -72941 -176858 -120811 -10540 41749 -144733 -85242 -137491 465175
20472 28869 -44228 -13521 39552 54732 -158322 12795 -167267 -177959 85395 130713 280183
20461 280183 -50215 -225694 18622 132931 202379 163377 -247262 154220 9124 53108 160004
20450 160004 149116 -235941 80367 244672 -299253 -50582 -2178 -149934 98911 -18399 -218581
20439 -218581 -10677 -305615 77996 -70947 -172079 54187 78336 38182 78795 -142243 -161228
20428 -161228 -27523 -210327 -182279 -154770 -491446 150023 143498 -3241 128956 -13687 -248384
20417 -248384 224497 -450262 59089 -55003 -92821 237887 -339113 -230376 -23862 460552
20406 128462 -230810 27233 -133649 -202234 -136894 -21850 -217969 62157 -95318 23865 -185881
20394 -41970 -148073 111271 -583655 -162691 180558 -122882 -54771 183341 94708 -50575
20383 -194944 -210164 75932 -158820 -219955 -13468 39904 152078 -114283 128835 12127 337469
20372 337469 -243555 -320998 80693 153165 224101 -141371 20291 252183 240324 -165258 28461
20360 143629 32249 27813 48730 -294116 -192483 -132547 27905 -142504 -366605 -142950 147912
20348 2203 -72266 -101277 19547 -259117 -15349 -254191 -107621 27933 -229307 -49677 -310912
20337 -310912 28373 144677 -58575 -155478 -95127 -92379 25807 -415640 -354287 -182354 27142
20325 -254623 223364 -131963 182510 -30331 58416 -66676 -487576 -43549 143140 49009
20314 107980 226198 -76020 -186469 -492060 -120845 -356016 184524 141501 36491 -6936
20303 -83842 -34896 -97947 -197067 -188459 -335200 -119210 -221478 -91099 122575 8886 -13231
20291 -201458 44134 -106985 -251732 -353291 -6761 -84193 -153224 -65111 -64569 27372 -101831
20279 -238612 -269573 44655 50536 -179293 10320 -56516 2255 290275 -316724 78382 -56888
20267 159459 -223204 206379 48760 -526454 33919 35636 286814 -281812 -49451 -234668
20257 -234668 241203 -163838 -107211 -42490 -46647 -171721 -154461 -923 -1300 30336 -33211 23685
20244 231658 91288 -263110 -94961 19940 175750 -143618 263469 -5212 90344 -264325 -270029
20233 -270029 -43865 -138556 -101558 58106 -450986 -159396 -192929 -193232 110989 -47449 188065
20221 -37717 -146317 -15768 -34622 -50511 -120705 100913 -273733 241944 39262 185311 189499
20210 189499 -488022 37125 -70629 -187861 160202 92495 -12493 -254358 224050 -214455
20199 -256417 11958 -127241 -267317 151615 -111124 193129 140926 -157891 -109201 45981
20188 106651 84148 -52705 9166 -97938 -21152 135274 -153989 33459 -14216 -66725 -19658
20176 -62660 55064 -145386 -76025 -180121 36196 -9738 106147 -183540 -95737 71265 -194349
20164 -216323 200168 -240807 -145016 -125499 -158118 -93913 -269544 15495 -206139 99138 97451
20153 97451 -124689 -38192 -18281 -241467 -73102 -147627 341024 184096 -109026 -35989 -89802
20142 -89802 -262087 -49442 -167191 318803 -207779 8275 -206058 -256387 160530 305091
20132 305091 256008 63148 -197212 68343 49816 -308163 -84660 -76439 214578 -131725 -200725
20121 -200725 -138960 143147 186090 -67996 181339 -144290 -50118 -117835 30178 -48093 188687
20109 -195334 230831 -20802 49035 -301524 -69187 313216 -42329 27650 -193990 47771 -156003
20097 11815 -270061 169491 -492070 165651 196747 150113 -178920 5066 -230488 -87789 -104183
20086 -104183 -185581 -182359 21720 35521 -521888 -115830 307540 168052 -42986 26031 -20818
20074 -53539 124465 163616 104592 174241 159375 -73764 -25623 40635 -337928 -384189 -92923
20062 -209918 -177284 -280596 -111778 4559 -229069 8696 141517 -202274 22966 -90766 -160716
20051 -160716 -190105 4191 28705 -53962 113617 -113238 -451467 -74858 67366 -118664 -36835
20039 192992 -338974 164340 -149031 -175711 -22407 112879 -58436 -53814 367360 -75509 -52869
20028 -52869 -83171 262946 90799 -18434 -8541 -6335 -357464 -455918 -23321 -190676 -119083
20017 -119083 -44026 -244386 -100122 -2300 227187 -130760 127730 210355 169261 160933 37081
20005 -331406 263716 -103361 -206994 288589 155223 -100032 -472765 -18835 -55635 134525
19994 -26559 -219463 -128199 155657 -14556 107125 -83332 -402714 -13015 3631 -120262 -160123
19983 -160123 -229091 156191 149191 -189074 -486274 3990 88952 -140518 157315 208750 -320722
19971 275140 -222079 64215 -213409 -67476 -192348 71166 -72404 97749 125166 -147618 117574
19959 -60062 -121243 -205866 -146903 -22204 85671 -76431 -145131 -284923 -145501 -233453 110404
19947 92182 -20489 -294051 18428 153066 -300313 31944 -55194 -32138 -8553 61092 159163
19936 159163 -156685 24413 29839 74207 -98409 -14493 -367328 -150930 -271768 10792 -193389
19924 -263252 -92492 312487 154956 109317 -29875 -276098 60712 -137076 -143153 -381509 214674
19912 40483 -22460 -38409 52468 159460 95793 -47684 -252912 143113 -66931 -282220 -377757
19901 -377757 60961 -396091 -65148 -212659 234207 125573 -83185 -372110 8986 -67103 -102620
19890 -102620 -307873 205850 -178633 -109658 149342 75770 -23074 -249664 -200883 -2358 23904
19878 67520 161622 116122 116494 312546 -83113 -202897 -54227 -101176 -290842 62312 -207585
19866 -137996 -320759 44936 52183 8028 -104679 -153440 -267805 -42797 -283817 -357428 -9893
19854 -144390 212687 284343 22079 -46075 -421665 -198546 13352 -116322 18660 140078
19844 140078 -19410 -189391 -60630 175032 -76221 96409 -93390 75583 -34568 -13198 -281000
19833 -281000 11787 -120020 -168461 -91666 49094 109217 -168020 -24305 -249943 -300821 -19945
19821 129793 -44550 -87569 -158728 84424 223164 -178208 82573 -147132 -139442 37586 165649
19810 165649 -146949 -119039 -262441 -71038 147684 -49701 -163820 159321 -54168 -213921
19800 -213921 -188257 -163782 168424 -25960 31102 -100524 125958 -292368 -245934 -143762
19790 -143762 -208757 -193733 142879 -77202 -249730 -48825 -225904 -150818 -213877 2066 -250028
19778 198627 81474 51838 -424262 196319 60605 -120135 -247098 -29103 111886 -169923
19767 -360432 -101034 -251755 19107 -248404 -100889 198883 86351 -42250 -9509 -32031 -196525
19756 -196525 -81457 -136113 48233 115419 7364 -193432 -83377 -338468 -87413 -169249 -217055
19745 -217055 -205768 -3913 -68702 -255110 -367342 -189625 73406 -106146 -111924 -452742 -165267
19733 179764 30507 -186294 -19169 -173596 111678 -375778 -164140 74090 -107628 -258477
19723 -258477 186589 280340 -169802 -222750 285631 -125367 -71922 -98656 -92995 -332184 -160612
19711 -64032 -108510 -396731 -248284 -265366 82385 112206 -155780 109274 -329694 -87771 -109359
19700 -109359 174234 209438 72832 -214503 44072 -314310 66057 -111063 63954 -172871
19689 -17037 -588 1170 -59228 -42367 -197535 -53038 -155161 61826 -192634 -2132 263902 -283132
19676 -236942 86213 127308 -136089 216315 140804 178310 -82326 -238589 -207736 -171259 -145580
19665 -145580 88943 -184828 -89931 -408524 -397986 -174868 125654 203449 -210085 302202
19654 89783 -268714 843 -231528 65538 -63543 87875 90209 45558 -230264 44775 92067 -275533
19641 -305956 108215 37727 -90880 -162330 -96967 -249434 -89916 36968 -195334 -254558 -366444
19630 -366444 -78846 -149213 -77294 242647 -221122 -203313 -28413 208206 -94115 -82107 110743
19618 200565 -220662 -106918 149493 118056 204157 -72227 132665 -140131 2161 105295
19608 105295 27965 390 -20742 -48386 -107966 257159 -117322 141129 122071 -170419 82780
19596 -166253 95528 -230865 -23888 71831 -249165 -33042 -12300 275346 -313459 280171
19585 -6456 -263142 -163977 -55721 -156484 -39740 237659 199851 -258820 45733 -120594 -179670
19574 -179670 -55288 155548 -107300 -29941 -37871 -71016 -26598 -176647 -167966 116321 -215165
19562 7347 -3889 -12112 -133733 -203016 -375752 76090 111297 -86721 59332 330517 -354650
19550 -182892 215060 -143109 -167615 76414 -71597 48808 -226934 -242137 75364 -178010 -277534
19539 -277534 -285396 -4942 277784 -177712 -133846 -529744 126367 -42509 -150140 318978 25109
19527 -232443 -216495 -314135 235942 22435 -94344 -208766 -57324 -66777 -125623 46146 -294690
19515 -162640 -265513 -109972 -81616 77969 -311839 -123656 -279646 -336602 -96945 15681
19504 -64997 -174862 -345765 -29762 -140120 -50083 -399703 -206210 -459275 163352 94274
19494 94274 -160180 -3084 -320962 65631 -360320 -131271 247315 299271 -32407 87044 -148091
19482 -151332 50905 -112035 -270582 284300 113401 -119714 -440055 -91046 -58152 208247
19471 -92642 193615 70125 -401230 26395 142478 -218551 -247581 -44878 1598 -247741 6088
19459 -67588 -49495 -107995 90237 168313 -139958 85281 -228233 -51405 -115961 67806 -281177
19447 -113564 -169842 -424302 69452 32758 -230223 -255653 -62445 -99401 10032 -276065 12486
19435 315819 306759 174842 -168803 -173105 -29210 -114768 -114650 -30761 -39151 92906 -202492 104606
19422 -163388 30744 -229680 -355461 101713 -196482 -209270 145975 -222086 -3959 -87537
19412 -87537 195731 108703 59465 -311002 -144941 12219 211397 105195 -159351 -283203
19402 -283203 -28003 -88782 -24391 -229194 -63593 -94670 -128250 37333 -117312 53693 -109303
19390 -19194 -277394 245376 -34622 -115390 -146879 -221702 -103844 -51091 129775 -3627 122566
19378 -113758 126741 -56520 -56397 11373 -228664 -443766 -204936 116034 130613 -195581 135211
19366 -92126 50493 33488 -157671 -74057 -37914 -109237 -51205 -209400 -175345 -271293 41684
19354 -276022 131965 132343 -5138 -136214 -127878 -282 -139590 -85216 -193760 9895 -93181 -161583
19342 -161583 42006 -53435 -65693 -120129 7698 -87510 -238989 -31556 -111197 -24185 -15486 -61532
19330 -61532 -134350 63688 -324163 282523 -86790 5215 97159 -168274 63 -98731 -283778 -286577
19318 -286577 101346 -75712 -274012 -187921 9286 -105499 -287016 181710 -417006 -103689
19307 83341 52005 -10210 -183010 -28926 148968 -208914 -85445 80681 119238 -243839 -226985
19296 -226985 177413 72843 -15048 -8219 -146775 35892 -167355 -160531 -236862 -152251 -213571
19285 -213571 152736 -71214 -530347 14052 -226073 94088 -186055 -33054 -200724 -193364 539
19273 -37237 217850 158609 132768 184213 10860 68568 -31107 277504 -532408 101458 -125406
19261 -46376 111045 4093 -218041 -39151 -60649 1303 -142476 -28713 152020 -122789 -347279
19250 -347279 -235173 -51759 -387666 -159470 -141738 -149503 -79686 -2718 171206 -18951 275165
19238 -94626 -91285 2108 122078 -129449 -69583 100208 52043 -25710 24660 29441 244377
19227 244377 -110954 -414439 -170598 -155537 -191337 -6075 168642 129159 11072 -250728 52623
19215 28267 29834 -353181 -146649 -322496 -199598 -76589 141142 220908 165487 172146 -223206
19203 -302388 -184282 104908 36037 -165878 -7681 -151138 22608 90746 129376 -112511 164846
19191 -153014 114609 -214200 -207224 -303999 -118620 -42400 77516 -50865 -228720 -85220 10257
19179 153773 121571 -9754 -45976 -431366 -240890 18063 261731 66072 -147901 -241770 -349364
19168 -349364 -366530 -365447 -119350 -208072 -227488 -255210 -418611 -45528 -464541 -382908 47307
19156 -46286 -498896 -89619 -304822 -183745 -220465 -166236 -202453 103445 244201 141177
19146 141177 105168 65223 -135629 -163194 319058 -163996 -34697 117995 -194678 -202104 12319
19134 -2046 207569 -89501 -30699 -181264 -80972 -271633 -55516 -5415 -168723 -75516 -36453
19122 388307 -8688 -225822 -208722 150927 -13841 -269009 -129112 -17090 221014 -340013
19111 -84024 -47026 -46663 -55105 -13888 -146701 114577 81007 -229934 -157497 186425 225270
19100 225270 -37406 -217551 13993 -218684 -151817 -135661 -56195 -66529 -137692 69063 -97563
19088 418575 -170247 -178422 -45715 -248920 -44750 -119848 311773 -92290 -472745 30592 157357
19077 157357 -11752 -38064 -45341 -87946 -48442 -81050 -195334 25260 -66795 -157419 -268901
19066 -268901 -267844 -181844 -48067 115202 -213622 189060 -128723 -107463 80018 -142897 -99609
19055 -99609 205899 -47009 926 -172470 276355 180282 -55730 -53723 293096 -151988 19452
19043 -264742 -104064 -74896 234637 96310 9017 -7104 55347 -23730 -10826 5010 -142792
19031 -45910 -1200 -292532 -255293 -49474 20570 99737 -87456 304655 43663 -5898 -86716 103490
19018 20708 -104050 160720 -76316 -210712 -20701 -288092 -7414 -87998 -185661 -172171 69661
19006 -15580 -11880 -73326 44684 -15526 24391 -22137 -278431 191114 -505423 -94304 -95141 -474819
18994 -474819 235359 22499 -357783 -3048 -133064 5717 184755 -41296 -87359 -151340 84980
18982 -112115 -59723 70450 -30665 -61860 -97920 94637 159385 -30568 123349 -48920 25132
18970 -290281 -154648 115773 202831 165684 -244060 -63591 -301112 -28643 -54957 53334 -37774
18958 -51619 -190671 146536 -239981 -75463 13124 -214751 -415544 -327532 -141988 -259060
18948 -259060 -203063 211992 48912 443975 -451114 116852 -82444 317891 67198 107006
18938 107006 -237775 -38851 -133316 -113036 -229426 -190157 -79571 327577 134581 185249 -138725
18926 242248 84633 79716 -25808 -189542 73879 -224688 54268 -215638 -221279 45874 65837
18915 65837 -80964 66580 204343 200389 -259464 -56941 -53704 -38297 44365 34822 177641 -530186
18902 101029 -25233 190162 -72752 -84491 63830 -135212 -81178 33690 -45919 -100364 -298938
18891 -298938 14820 41737 -313995 -148607 -69327 -30584 -46412 114559 250972 -190593
18880 49981 299027 -170782 9205 -222245 1741 -10407 -345652 -301791 -182875 -97439 -65061
18869 -65061 -289778 163581 -439835 23944 76487 -89252 121677 -182068 -92605 -131158 -396870
18858 -396870 150805 -77440 -57816 -278852 13016 -58619 36672 236222 62253 225841 163868
18847 163868 -35919 -262955 274747 -114690 187992 -62985 298884 -20235 -81713 -42659
18837 -42659 -244338 -166355 -318574 -318673 -153838 214703 -56015 -280722 -81266 -33900 -161158
18826 -161158 53817 35861 -202811 -77664 -38825 -307714 -151647 -26704 107538 -200184
18815 -287375 -334838 182241 357046 213888 96297 116670 199415 -62006 98023 -27262 81204
18803 110811 -345550 87403 190083 -363816 115278 224756 2894 58034 -25307 20555 -60729
18791 -44956 153688 267420 35942 -324016 -444152 -62314 -86877 39592 701 -169221 -2605
18779 -104117 -108145 12864 -53890 262735 153413 -243956 47173 50524 61186 -175371 65554
18767 162818 38896 52078 -139751 -1577 115405 -532528 -2053 218985 189797 191322 -169286
18755 -154273 -39311 -361297 -306115 98682 -65487 190191 157547 -106883 -357124 -382756 86561
18743 -56937 252018 -222308 43683 -136779 251370 -21852 -435652 69078 -146345 -187634
18733 -187634 -105943 -287763 -110337 -161091 76839 -82257 74498 31786 356445 -108852 -3392
18721 -98915 51327 -63723 -194383 -144234 -189232 -118142 380165 -19606 -130184 -306472 -246193
18710 -246193 -246701 85344 -187704 -147103 108130 -165462 48573 -225996 1054 63990 -95502
18698 9011 -36613 -188905 -38606 -310349 -84599 212977 -135489 -15883 68662 256199 263263
18687 263263 -26108 -20220 108322 95936 -163135 -161623 -226845 -305981 -127225 169093 -132301
18675 -123256 10927 -17450 -53072 -274059 -182686 -143404 119098 429664 -61729 -53856 -10992
18663 52010 157470 86329 87032 -57090 61546 -51292 -100929 47903 -161625 42054 -283364
18651 93968 -288283 -20619 -90440 -20614 -441193 153273 -289800 -40978 -4683 -251857 64872
18639 -96878 14276 38803 73362 169466 -238500 -221402 -128341 14395 -56936 48348 -167025
18627 -29231 -2235 -181563 37545 294320 189693 -63708 217768 -167664 40245 -188307 101826
18615 411537 -82909 -22496 -352973 -146944 -62486 135826 -153813 292768 -60239 -36377
18605 -36377 28468 -93852 -32893 50717 -234106 -24352 -227250 114261 -75708 -31464 -220131
18594 -220131 -87477 -5143 -182372 -149468 -235508 205323 45857 -14154 -6726 -231025 -170810
18583 -170810 -344901 -184880 234443 -73168 158223 327106 -101771 271999 -18179 222928
18572 121116 -67881 -245296 -305513 -94548 58683 -211126 -116201 -233634 -38411 -251472 -14214
18560 -39890 -346291 -418223 -275027 52204 -5775 -97803 -74942 -215541 -244873 -261482 -58071
18548 386084 277668 -174940 131998 339385 56971 -110408 -91126 160 -6978 -92414 10404
18536 -6925 -181327 144611 22073 136532 -192804 -125097 59426 -208895 -148544 -158360 -32952
18524 292429 -426704 -106436 34787 -99761 -139162 33520 151659 -11827 -185127 -103023 -275098
18513 -275098 442356 -57267 -233836 -139971 -98704 100007 115834 -144757 -241421 -114108
18502 57894 127554 115762 -213786 -191798 -241723 140736 103519 182044 -266842 -67470 -17881
18490 66275 -234661 -135150 -40044 268724 35654 -56759 20815 -42498 -174707 97889 -65221
18478 -39540 -178358 -494161 133686 185776 68554 -182548 -109486 68451 -183714 239018
18467 -219433 76490 -228441 -31976 55907 49284 -287188 256377 -155465 -159720 20592 -166599
18455 18255 357046 -21323 -62489 -278988 -170991 -46448 -248463 167974 168375 -264486 368518
18443 54054 73566 -63862 -79668 351075 1145 -68419 -177246 -104890 40307 -229951 -225410
18432 -225410 134982 -267454 -68637 -440565 -192719 66575 -116400 45527 60565 -46638
18421 -69542 -13983 -385151 -32873 10430 331941 -373203 96852 130047 123415 -185411 93029
18409 -32602 190385 38717 -47646 -189831 126201 -139800 -278454 39564 -243931 12682
18398 71083 -121157 -15880 -283216 216781 -133155 -121841 -56427 -61885 -181640 44861 -270308
18386 -124069 -21527 -1215 314134 121767 -29320 988 416445 -156955 -28841 109459 -186598
18374 -31943 -238161 73659 -57891 -37079 60997 277068 -113035 -447110 -63761 -166062 123204
18362 149881 -37891 -154922 68526 -87617 82778 -125571 309764 20602 -106657 -211974
18352 -211974 -107122 206225 24781 -133377 -265193 -163905 -326484 -34292 243196 97515
18341 -82663 -143465 179751 -251630 52390 124463 -154920 26960 -55911 -24608 170056 -30386
18329 -49932 334439 -104938 -89605 -26887 -67105 -115942 114349 -60827 -106963 -355893 -382259
18318 -382259 -10961 -265090 75988 -307407 -130271 -72920 -2491 -67489 30358 186514 75096
18306 111963 -30045 -109533 -125338 -60015 -104245 -37883 -207621 209914 -37207 -218191 -92062
18294 -64263 118966 -241055 143592 -84805 222566 -8356 -152875 110286 5713 -324060 -184193
18283 -184193 -150370 99105 32840 19827 -80781 90924 -183460 2910 -117707 -299841 68573
18271 -227340 -215796 -446255 -280823 -167626 -169806 -235599 -257061 -160450 -143284 -108646 -334278
18260 -334278 -34435 -159911 -36431 -122385 -36954 -475984 -123021 43904 110141 82548 101005
18249 101005 214213 -17875 -345405 263685 -13803 -292 238597 216783 -267906 -74452 94430
18237 78363 11936 93850 -160550 -163604 -93141 -167949 -126122 -55037 39758 379072 -102435
18225 -190873 -130218 -169206 245922 -124586 -150035 45027 -210397 43074 -39489 28997 151021
18214 151021 142220 85183 -49886 -70517 -201540 143806 42435 -413551 402272 -5467 -121250
18203 -121250 433336 -175476 -87440 54728 -133316 -81740 92323 -46341 61730 -183185 40582
18191 -260904 43901 -404257 -287743 442 -174545 -82462 -31199 22719 6361 4656 75972 403498
18179 403498 -171883 55382 -7369 206085 -219887 -191114 39663 119040 -79651 -89850 258992
18167 150584 156649 -134747 -408212 138209 12822 46170 -191769 109413 -223538 30727
18156 -168048 204749 -156562 37856 19721 -77849 -31957 32707 -28914 -27185 -351476 174145
18144 39864 -170504 38858 -99674 -19017 -257526 -11092 -120603 140408 -54343 -83360 -154921
18133 -154921 329447 -13552 39557 -1172 -210491 -213772 65398 77323 -36974 328115 -181035
18121 -132834 -425595 -66777 122354 -296068 -86822 72838 -73469 -12320 171243 -61507 103834
18109 -24315 -266433 -87418 -319173 -252938 -131659 36400 -231769 -29053 116089 -51942 174997
18097 -245856 108682 -261310 -127719 -226117 175175 104913 -271421 -404263 -344235 111402
18086 10283 -19937 -333876 -32993 -511240 -162971 64996 -133271 -216023 -42959 111047 -88893
18074 93918 -83453 -54127 -54702 95822 -148165 6301 -107979 -4832 -20006 -2027 -253050 163147
18061 155092 -234347 -15963 35510 -21956 120148 -267955 23377 47826 4769 -87074 163471
18049 137432 117665 -549607 33474 34001 -52237 -14208 -82694 -71571 -238374 -115145 65220
18037 -88241 -45598 -220442 -155968 28380 -96162 33077 -204885 -251381 139990 31093 7822
18025 -29601 -3614 26074 455212 -7449 -202613 165363 -44867 -358661 -113287 135093 52638
18013 -39480 158828 -6312 89413 189289 -185655 -118956 -245668 188442 -195 -85539 -1115 286795
18000 -20263 -108550 -189208 -190943 -31181 -143085 -56674 -152597 103862 -139538 61915 146429
17989 146429 -279264 54092 58089 -93126 -28171 -73650 -140101 -26554 -18823 -159351 115692
17977 9805 81211 -11495 64169 157605 42247 128599 122730 87526 -99647 -89786 -104528 -329700
17965 -329700 17587 129900 -180431 26135 154140 -318651 -2255 42223 -347103 -73206 -75879
17954 -75879 176371 -201075 -92521 -55747 110634 -74148 142138 -425448 272181 -141245
17943 -22695 54757 -307742 80698 113703 -65161 160102 115464 190531 158216 -33384 -136881
17932 -136881 -79867 204384 -141412 17715 146593 -255255 -96120 125805 -32588 -254930
17922 -254930 107265 -221766 -200253 -37433 284455 -34379 -154016 -129452 -178708 -27709 222012
17910 -281940 -393919 -259016 218575 -168166 36454 -212024 68163 121300 83704 53584
17900 53584 -15106 -12322 91330 -2039 132262 -225343 -217583 177893 151480 -253764 124456
17888 112667 -99762 -87814 31521 -12950 237845 -342267 -60788 24076 132716 225078 -38791
17876 -444686 -108929 -13234 49271 48500 169364 187853 -15769 137155 -153730 125237 -43630
17864 115806 29821 81834 -6556 -114080 -119554 -81777 -227069 112446 -124451 296234 9550
17852 203010 381146 -154673 -235451 -38895 457511 9150 -65503 10258 263180 88072 132889
17841 132889 137088 224778 288470 -103388 -74794 -74857 -52914 -121768 -63840 -10963 -107935 -133703
17829 -133703 -87507 -61038 195601 -349914 301040 -80524 -89446 18573 -134681 207828 -194197
17817 307708 -224777 114969 198968 -176810 154621 92234 6333 -362984 271759 -76898
17806 -381564 -10211 -67059 -69587 -62594 -188981 -218313 -79345 -68992 -77899 -322598 89939 -358350
17793 29848 94172 -3842 131378 -203842 -314872 -284956 -18845 303029 218111 128521 138071
17782 138071 307949 14581 -172506 89840 -160009 -82083 119532 -12697 -159213 -150269 15331
17770 22285 -559333 -57933 9025 -295832 -70571 79647 -177816 -264223 2736 115854 193120
17759 193120 222 -186812 -44871 -160020 -93539 -104833 -14422 -7442 -209617 -141148 70019
17747 144676 -152576 82183 -197503 192987 -240726 67657 -234165 -46133 -152239 144650
17736 -218667 540 53413 205538 136371 -165746 -234506 116952 -143106 122162 -158779 72797
17724 -32968 13893 175909 6642 -29216 49150 231971 -125690 -315080 -24856 -99519 75166
17712 82329 -214093 -52638 92874 -1128 273060 14697 -38305 -121336 77875 -128119 -163742
17701 -163742 117337 -174228 -24539 130121 -57456 120228 -163035 -34829 378739 200109
17691 200109 101462 -179316 -36046 30364 1895 -459372 6692 201326 155792 215157 66267
17679 -53313 -214800 -105267 93282 204569 -78966 -90823 -89051 153943 -104863 -50183 -42570
17668 -42570 31025 41783 27568 -115873 -209441 -25488 204698 -108487 10472 112708 -86993
17656 -138040 61441 132292 154231 95032 331479 -18041 132284 -167909 -98099 183324 248669
17645 248669 41494 78909 -20059 -184324 66314 102842 -140048 90383 113779 109784 255824
17634 255824 165600 188400 -206997 2336 -113359 61254 -63641 8782 -248866 -86612 -24554
17622 180144 -41238 -234521 71040 -266083 313693 -286450 -144878 -226744 45900 -876 -21141
17611 -21141 231923 76404 39521 44312 -256371 -212248 -260674 89668 109913 -29939 -312785
17600 -312785 -184028 -388271 -201436 87474 53137 111068 40258 111835 288449 266021 -98565
17588 -113820 121588 -2646 16098 240036 -214439 -108150 54222 384686 -31223 -170229
17578 -170229 178145 -69639 -221799 14510 96279 -111353 -235875 -25500 186721 -121656
17567 29114 -127752 -147838 44786 87095 68568 351547 91901 -28783 -21226 6364 -34724 83704
17554 -376343 121291 133396 -210465 139986 105036 110170 271679 -75155 -169154 -28420 94052
17542 -186764 138825 71432 -84526 59015 236555 102262 215349 -88186 -38095 125775
17531 -98661 86865 -271733 -16597 169125 261897 195188 312949 -162722 163362 422537
17521 422537 70873 158703 163247 -378787 231702 -137747 275088 5107 -56408 -273446 -83059
17509 315930 10684 -40559 174886 133627 278613 23777 71401 25043 -109492 105768 130196
17498 130196 -163557 594923 38558 169448 -28399 102770 131645 128303 379003 -4689 400216
17486 196596 23238 259200 -40343 -116344 -39546 183762 217590 383502 149963 392010
17476 392010 174367 -226541 140119 107045 -230583 99770 120160 -123946 -266593 -28607
17465 74327 226005 237230 -245793 -20369 178136 -181988 22542 132782 -64231 19371 226405
17454 226405 127061 108575 537137 309464 322415 195002 555630 448133 306280 400519
17444 400519 97978 27825 176787 -89805 106112 340991 488337 341692 345851 251987 324561
17433 324561 296317 -129420 9648 361574 280901 -2131 -109943 161712 5019 -119198 147971
17421 149529 703207 150692 263102 43494 270857 -33228 554629 146768 60917 503774
17411 503774 81399 -165393 -89643 285407 13506 155657 -39823 79024 284118 107283
17400 264079 291491 264018 -55341 -79942 10082 64895 214444 176902 115895 220645 126731
17389 126731 -105370 277578 11490 44967 -391679 122268 -31764 122246 184291 114997
17379 114997 219051 90220 99745 271217 29088 342617 276500 69664 182079 -102073 103983
17367 37640 8800 -527 304072 -269489 -190833 191779 189311 108336 110101 64000 1222 -75528
17354 220984 343394 330555 18082 -45384 267049 319217 -40738 645144 185636 239723 185101
17343 185101 328738 -279621 -100701 55266 -79703 119475 6741 56260 -28244 -223133 -10674
17331 149149 109446 102307 282067 149656 223876 -117071 300512 165172 42744 -179283
17320 -169835 168867 137590 154407 -84360 261982 55001 528595 150950 -107082 360467
17309 124426 158208 154843 190131 -115698 23841 341132 -44350 282134 387626 357621 -77228
17297 170743 -21658 28927 -120749 -126631 363733 31616 -156035 160593 3131 -338677 232125
17285 -19172 166407 100662 424085 -164153 140355 70719 -82348 75147 250347 173280 120004
17274 120004 1725 155241 226022 180611 239433 200399 229527 120526 293763 199424 -17074
17262 9878 165878 -286075 65312 203225 81843 217702 61958 165286 34797 228169 87091
17250 270645 156938 58875 169440 19972 265754 -165567 697 361139 173756 153568 227684
17239 227684 285285 100262 60668 204800 22293 357280 -64788 227549 68219 49008 30377
17228 30377 295931 261816 188959 150725 235446 388778 28174 40799 246377 -10307 316491
17216 -18559 -120175 70839 -1338 405595 31204 -106025 393418 180069 231192 127374 364660
17205 364660 128080 -262346 145843 -76145 402523 250706 243863 397026 102350 165726
17195 165726 178151 163511 115369 375963 152662 407163 336744 19291 352811 355350 219654
17184 219654 249476 133855 489203 4132 598323 409333 248286 343113 308123 433737
17174 433737 104690 133645 270659 325923 115368 355016 -1030 220957 477696 381771
17164 381771 342090 303222 463073 -16521 182201 154330 187600 258925 626990 380901 266421
17153 266421 490184 62168 308400 269728 154474 333049 390703 275186 665692 92842
17142 362917 403547 48051 244068 288518 87096 326076 130633 202852 324203 18904 186294
17131 186294 495736 391702 150787 57105 -166634 316671 408730 432049 375190 507587
17121 507587 396527 163036 471254 617209 319663 198765 92072 388165 104137 497051
17111 497051 420491 241578 136668 -40909 99984 299727 202235 523318 317775 351098
17101 351098 532920 91309 566249 225686 398044 162406 100198 420303 534864 -60103
17090 365463 302195 408803 482372 545869 470345 442048 784876 240612 181390 49785 381665
17079 381665 342024 433431 110319 193693 495068 145529 371946 722926 552324 495655
17069 495655 365873 717690 477094 221229 516518 767083 762602 366801 258594 448997
17059 448997 431915 136178 487839 489895 240155 470438 330242 309219 430005 654450
17049 654450 335467 671329 318856 504548 316932 357007 405826 748140 456685 353922
17039 353922 404707 692627 117229 520662 567134 494702 390224 729823 502828 587914
17029 587914 570803 682790 481896 472714 520830 506793 601561 691486 714732 380520 871303
17018 871303 670576 581794 410702 404636 569918 689382 613989 712245 735481 585671 414648
17007 414648 625081 747963 658832 644539 101886 598000 712686 895817 639376 665040
16997 665040 528318 700985 491603 720325 844915 334915 757691 604034 835510 829875
16987 829875 610417 733301 578912 819735 853974 812484 585969 220072 916829 782663
16977 782663 603338 811235 550058 798065 895378 865258 913520 845655 873005 757670
16967 757670 838947 1032159 862483 795737 625610 1002073 1053353 976796 1211137 783410
16957 783410 647131 921052 719946 891295 685739 886056 855201 891336 782759 1040836
16947 1040836 908420 1132366 1017410 1058429 959080 1181794 725454 993856 866050 1139617
16937 1139617 1043059 1347788 1417041 1158721 937693 896651 1303642 1054086 1133847 1158320
16927 1158320 1252640 1207675 1419516 963671 1114817 1511111 1315578 1139465 1212226 1173570
16917 1173570 1102861 1286613 1457496 1285671 1441059 1301021 1236892 1166072 1485618 1478618
16907 1478618 1398985 1434349 1639119 1369934 1401845 1605038 1498695 1750795 1956318 1664972
16897 1664972 1447853 1726103 2105303 1926583 1842315 1758327 1810034 1509937 1997575 1838461
16887 1838461 1731938 1755646 1772263 2140780 2283551 2131146 1918256 2283999 2113378 2146699
16877 2146699 2036964 2329020 2202214 2447935 2490460 2026989 2358960 2057751 2284595 2698258
16867 2698258 2455062 2456339 2551605 2296222 2850920 2712156 2845058 2764604 2844525 3009214
16857 3009214 2892878 2847130 2973824 2915491 2976344 3181847 3123772 2943358 3199232 2908312
16847 2908312 3234531 3603230 3312349 3409723 3316715 3258012 3743150 3664197 3968384 4046305
16837 4046305 3922180 4061836 3798628 4037217 3860091 4244685 4034499 4352781 4509603
16828 4509603 4351577 4435891 4627406 4666480 4765585 4996221 4973770 5082139 5012408 5025928
16818 5025928 5731622 5505542 5662064 5673938 5670181 5952067 6217405 5800424 6243019 6636225
16808 6636225 6469967 6839392 7022398 7314678 7272793 7481037 7597698 7411677 7871711 8064840
16798 8064840 8251975 8707016 8883259 9268277 8936523 9212220 9761689 10439139 10318251
16789 10318251 10290076 10858528 11166488 11538490 11830647 12422895 12424767 12963343 13396641 13937844
16779 13937844 14170045 14668066 15251953 15851096 16020815 17042001 17438841 18080974 18395575
16770 18395575 19191093 19849699 20677075 21706063 22260735 23420609 24174697 25438709 26055834
16761 26055834 27143496 28517441 29647020 31156982 32416772 34000901 35884228 37669597
16753 37669597 39579863 41352735 43510130 46092860 48559572 50960397 53954474 57456184
16745 57456184 60009161 63690052 67564353 71864270 75668897 80647330 85746938 90849495
16737 90849495 96588015 102589205 108956293 115460357 122353712 129591431 136782822 144029201
16729 144029201 151340069 158416550 164956496 171068473 176309750 180344504 184049521 185940984
16721 185940984 187322061 186811607 185266848 182553408 178735119 174261933 168561119 162380561
16713 162380561 155763927 148371637 141264239 133738048 126501356 119664829 112325354 106017510
16705 106017510 99794314 93472811 88199561 82763028 77836711 73496195 68852104 65215522
16697 65215522 61038851 57833579 54587783 51749884 49041313 46663061 43961019 41686644
16689 41686644 39390927 37731677 35982308 34030798 32389768 30951304 29569640 28466514
16681 28466514 26826723 25583917 24604028 23727007 22718672 21921134 20904830 20019111 19482067
16672 19482067 18790520 18190612 17444222 16800308 15749271 15782156 14871728 14810728 13789279
16663 13789279 13550173 13305119 12596967 12321928 11882191 12160418 11222567 10981358 10432258
16654 10432258 10202784 9697585 9545937 9045266 9162731 8831820 8973715 8483308 8271449
16645 8271449 8004566 7708929 7379881 7406364 7217587 6992757 6886555 6525791 6389605 6148626
16635 6148626 6349268 6222498 5821403 5867053 5674204 5707571 5500271 5197886 5089256 5453056
16625 5453056 4586026 4841089 4793298 4689677 4671814 4497393 4371492 4230244 3851313 4200845
16615 4200845 4146785 4151787 4195007 3735765 3880051 3671423 3638328 3821380 3489409 3430230
16605 3430230 3283428 3667794 3317063 3517534 3196324 2929254 3253360 3130856 2882471
16596 2882471 2903873 3189469 2882327 2651132 2586530 2435697 2769347 2493852 2485296 2651397
16586 2651397 2443321 2277953 2360133 2148516 2185251 2294223 1983494 1995949 2246010 2126874
16576 2126874 2377843 2215136 1943935 1723508 1733234 2094549 2104944 2080795 2066905 2059097 1680461
16565 1680461 1846292 1664125 1785933 1748945 1860559 1523369 1465101 1619239 1458609 1564187
16555 1564187 1529405 1713557 1273870 1042021 1591222 1196852 1821644 1176403 1420527 1311354
16545 1311354 967225 1291017 1412422 1551223 1151325 1400225 1174617 1042079 1428343
16536 1428343 1269635 1194926 1051396 1094454 1379590 1184676 817045 1142187 1331370 1121739
16526 1121739 1038512 1259324 1282418 1080457 1112951 1135603 999678 1030852 815638 1095889
16516 1095889 984762 908465 1027537 1241061 1213060 1037761 898400 759962 728825 620782
16506 620782 884476 770847 717253 959634 1093594 790225 965277 625389 782078 990836
16496 990836 670009 740145 1052296 854715 748716 669990 1121219 501248 885131 865910
16486 865910 651920 799266 334526 803230 1158971 583530 692259 687865 446978 766747
16476 766747 362966 515541 295052 967823 377910 772940 604531 619478 523098 454819
16466 454819 828963 582450 583095 663814 594060 626911 670153 795129 481377 610345 608212
16455 608212 476953 317064 374043 366212 557661 549140 411278 459813 198056 488199 614546
16444 614546 731318 755733 364034 323962 252866 423212 409964 372151 425704 401023 484461
16433 484461 295757 334041 322471 459322 444604 388581 378045 495549 490148 341578 561306
16422 561306 352477 430832 -55515 246644 312700 311851 321490 276988 427285 284254 556205
16411 556205 637157 376630 520828 347351 326118 408643 217770 620106 220896 257901
16401 257901 82408 320910 406777 414054 344198 251398 84160 171231 367687 253461 443875
16390 443875 188806 490236 215891 241215 492347 466284 52939 350329 93469 263263
16380 263263 427068 172386 361887 91236 419196 34858 149902 177689 231093 399748
16370 399748 287190 397856 158563 260077 329837 338066 449294 227569 289296 -85743
16359 383188 245642 175841 214018 355168 256155 344807 56508 82606 23531 318368 251992
16348 251992 40615 165612 67251 147759 279576 298813 71946 -140917 117077 300008
16338 300008 381505 197755 186325 55960 130692 216541 102700 43902 402317 -240257 393215
16326 67333 36528 486274 171886 108450 85995 69690 -63639 23342 -94680 291916 -113600
16314 -89952 294628 -160559 466318 -40600 -274228 -61766 -32870 -39534 -32496 103286 132344
16303 132344 213559 -68201 -315407 222171 -51079 109458 339100 206997 -303465 54998
16292 100203 94499 130752 -193323 46993 -22443 26981 172128 62090 153761 311786 315252
16281 315252 -81974 110460 75281 74119 120128 -58961 70520 -114521 60173 352692 382055
16270 382055 45371 173501 -30660 230161 119637 121991 -4943 80507 350279 296062 82373
16258 132847 190954 -157118 167162 -231644 121094 -40800 284806 11524 336948 -49771
16247 265707 -87194 -38958 84759 87372 -40920 209932 67659 144986 272564 17198 -26228
16235 227762 368037 -52841 140082 -263905 -30015 218038 205217 156988 83119 137213 -94621
16223 198566 125831 46151 123313 -161385 33580 90511 -196977 120048 -131634 51513 -26170
16211 37904 208768 227399 123978 -112872 4502 -53881 -203482 268952 368524 -64277 166223
16199 157668 -10669 -51351 -147656 -53123 267422 -51159 29166 -92928 -40868 115341 158148
16188 158148 -65623 68221 44472 -135609 83023 496612 -159734 -285180 183947 -12924
16177 9693 -52735 -152145 187590 22611 -27085 154937 21516 -60209 -98812 89244 253371
16166 253371 94717 187585 -245334 -261789 -109301 138318 -171704 235952 88667 230170
16156 230170 -203039 -59807 -25674 -461580 -21653 -185327 -260159 -44675 105227 -3549 112091
16144 -16673 72382 -231259 -15496 36145 21820 -225202 66301 102660 64381 49014 -42296
16132 176043 7580 213095 -55720 -198187 148136 12276 -126440 -28543 -38620 119032 350245
16121 350245 114630 55870 -29162 -497 -255593 89923 -1982 172299 197336 65550 18260
16109 60905 -121912 14045 104433 196306 20478 -114508 43719 -244550 117021 -20287 212546
16097 83556 93138 183420 -10593 205913 5867 132918 29084 -112726 153595 25872 -96395
16085 -142932 -242267 93831 112017 -75188 55284 -231739 -6670 167953 -10211 129343 266089
16074 266089 -219868 225691 172083 22168 -294482 -61941 48386 -153186 14096 -12219 -100982
16063 -100982 -194547 132453 220439 131384 15597 -101526 -143950 102839 -217418 109437
16052 -139476 -103085 -4878 -157486 127661 -121579 -137373 -68256 -65531 108549 70698 7013
16040 -189032 66914 -270862 90471 89155 -50868 -139738 -185077 -374690 17638 -44120 -101445
16029 -101445 -5885 -15414 -189105 -108863 55473 -152238 353557 56344 -96815 303829 -62271
16017 -357679 -27633 103266 -100022 127370 47236 -261422 78446 16528 115909 -139748
16006 54071 266841 39716 -307499 78372 -79819 -150424 27716 -65116 29962 -82030 -139597
15995 -139597 -209980 -155737 -68672 -115535 -138019 -48987 -206822 78878 -279105 -21989 43214
15983 47059 390821 110152 174173 -213955 151986 185957 -49813 -156165 -41555 30581 35749
15972 35749 -72848 -140814 51150 239343 179989 -151006 -387245 -18192 332383 269530 103013
15960 106101 20416 50546 -475508 141722 -302890 -27687 55784 -10300 -150853 -216531 -159934
15949 -159934 -159315 -135656 -41093 57303 -77720 -313229 71814 -351434 -113458 279088 -432893
15937 198670 -172405 150705 138498 -211249 144478 -6289 173892 447270 -88548 -21329
15926 41159 -160718 -152525 132496 232526 265444 -130964 -301664 -384821 869 -9957 -58441
15915 -58441 41089 177054 -79186 281850 -28991 71027 -314171 -284471 -54545 7103 251335
15904 251335 107865 -102940 -176644 118275 -154616 200981 -1652 -428372 -206859 388550
15893 -59706 -528222 30049 -314116 -30735 -98723 -208208 -32193 -8645 -223037 36455 -112396
15881 -222079 -18202 -223815 114712 157280 176713 -184132 134508 181836 335399 -54328
15870 -140589 -45485 -230609 -221644 -253771 96879 34356 -182218 118524 -263310 228967 103961
15858 5677 -51374 139483 -205159 3116 -135881 211339 -167230 -249492 -172673 -4838 -84961
15847 -84961 81441 -6630 -187281 -107888 -191147 202560 -140197 -75395 95582 131469 -60469
15835 -79959 25550 182377 -271183 33948 -63399 89703 -407924 -13108 72739 -368774 228183
15823 105864 -17988 222604 -370118 204440 -265246 104461 89853 -104161 327793 -168386
15812 -160366 70846 -53065 -119368 -267567 -326152 -74848 126253 -11093 -170481 -125258 177550
15800 92228 65772 183596 -34393 63374 -26772 323134 86645 -39960 200031 -73794 -41594
15789 -41594 -56705 277305 -321586 -211204 -259980 81905 -184413 -288944 -37570 -39253 -129074
15778 -129074 -94816 -48722 -277631 160492 -206549 8320 -12950 -122785 145096 129805 -114660
15766 380621 -25463 81306 -176641 92222 57312 150499 -32792 97480 -221968 -285920 -48456
15754 -70984 164565 -69272 -406045 -72840 -153730 -176743 198846 -34087 400975 195380 269949
15743 269949 -118941 394397 35395 39257 188492 -105225 210435 3281 399258 -258537
15732 98970 74813 -160125 -60560 192942 -115274 218490 70125 344727 -20112 -107490 -148698
15721 -148698 181426 166200 -151469 124741 -97578 28010 325648 -202479 -277940 -10437
15710 -164219 76752 -69285 -398250 -741 -171726 55623 107678 -288245 -26274 237881 183446
15699 183446 -113315 -109152 199155 -139261 -160788 -75459 -71574 80086 164515 119248 -4958
15687 -118968 11723 -52799 224887 8224 -175253 -109403 323904 168034 12204 31889 -14674
15675 -423867 -29575 -40946 -11828 -255199 390242 107850 97020 67775 -53453 42739 -109678
15663 36255 -75624 6377 -181556 48420 -149068 211462 47517 -45322 -299305 7467 -224268
15651 -332260 -312355 -22090 -44794 66705 -189339 -334903 -176662 251997 -123039 -38637
15640 122844 -251571 -113593 -243470 5352 18126 78701 -148552 -134892 95508 135028 -28108
15628 -96074 -106583 246575 -102705 -14193 -132338 -143763 266466 43568 57836 41682 102053
15617 102053 186642 -208812 76442 -80428 -204198 56084 102433 -104545 -7450 -40214 102477
15605 -50315 180096 -259172 -138086 -47723 143684 346935 187099 -110205 90634 21 -87857
15593 -220849 -260738 -147724 -59400 23020 43080 -47948 -75618 72070 -401993 176591 76939
15581 15049 47680 -258254 402737 -39344 -19645 211858 -321547 -64523 9511 -185509 -220579
15570 -220579 149405 111062 -105133 -2911 -293899 -34580 -79220 -81458 25121 -117911 41228
15558 -165561 12602 -57650 -68682 -18553 258482 133190 -134803 -308801 180984 -178373
15547 120038 -154108 -65891 -168031 217420 -51228 70918 -47313 282082 -94622 32036 124612
15536 124612 181847 337353 -51856 148339 -56953 -91010 -52286 131337 -319582 -180154
15526 -180154 102983 91426 -206055 -198877 246922 174394 -420116 -341976 260644 -80586 86137
15514 83276 42859 -134161 162132 50934 -329228 -264120 -302254 68229 -64111 -504318 454451
15502 132106 -57603 -239549 -131635 1194 5082 -89912 -45093 -102557 -148054 1170 -89348 194674
15489 -81365 128427 -59822 312420 -158444 62030 133834 119002 -157707 10371 -147595 -436644
15478 -436644 29101 181828 107758 107200 1626 204165 -88304 -142777 -103696 193819 218925
15467 218925 232088 -2521 66450 158691 98369 338403 -181120 -134272 269005 91142 254523
15456 254523 -40752 329975 -102632 131930 -130437 289253 -6994 114103 -203107 -170812
15446 -170812 -26204 108217 168249 -346864 102217 56091 -193877 -145947 -243082 -26478 -18285
15435 -18285 -199808 -109621 -108501 161164 -98613 -95819 2134 281224 169157 -55458 81150
15423 111690 -79940 352910 16458 -209409 186865 9560 237996 -9479 -15387 -217804 -325457
15412 -325457 22884 82387 -345261 328142 64747 -207817 -190662 122694 285232 -36522
15401 -225578 220572 27726 -27636 7649 422156 -201854 -20269 32511 -270898 -55608 145766
15389 113280 -45145 15211 -248275 35658 53881 -14885 70061 146208 49213 -56948 7796
15377 -409205 6310 -118836 60500 -147218 -76512 -311432 -276136 -64462 333812 -259143 -200888
15366 -200888 211377 -42288 13030 133449 -44006 -148809 -117999 -1957 -261511 255130 -219743
15354 -159675 -25634 -211688 602226 144597 -103621 -96060 308074 162211 -419907 -145965
15343 -37860 -221183 -89906 -91950 61522 -169452 -438178 -262497 -219468 38330 -187777 -141198
15332 -141198 340360 -51599 35392 71637 -236969 157932 215873 10789 -132027 -122208 -189880
15321 -189880 -58023 -235278 -81179 -15506 -31853 -17289 -39110 49468 126589 -148599 32092
15309 285238 114764 149244 101889 79060 -44377 -46779 15049 99513 -57506 414339 -125372
15297 168284 216166 -202437 264534 60926 -35041 14225 188604 -104208 -120194 20510 -83999
15285 95003 29035 466912 -60658 96893 226936 96754 -251898 4269 -125118 46320 61582
15274 61582 -206420 -29834 61992 68840 35964 -333717 -82190 157876 139239 390656 257468
15263 257468 14390 -14810 176163 365627 169269 74693 297723 300519 226740 -110413 207967
15251 -253021 514733 183576 546534 672501 1223723 1021071 959827 808624 189014 341238
15241 341238 28439 56415 -79472 108940 240330 163809 -235316 60985 -202736 87843 40466
15229 -101488 -238000 100179 419920 -244922 6815 27169 -254782 -29400 179780 160519
15219 160519 122606 145273 96724 -21290 250986 -61463 81844 61632 -446 56387 -72626 -83813
15207 -83813 266381 -106827 -232356 -241319 -159131 177006 296807 47381 -49893 32585 89319
15196 89319 111297 -312918 25696 77516 -163990 58881 -74529 71431 462668 257046 -272178
15184 -24757 -101458 83821 -171668 16471 -292925 44063 130896 -34965 121918 -168524 245107
15172 -53 219446 57231 299924 113908 -184086 -307581 -117634 145815 52186 175689 -76840
15160 81637 657 62992 201477 -36784 118141 276860 47896 -120372 -38356 270467 41356
15148 243165 -93200 61897 -68959 -18159 240000 -9105 450799 129605 -292714 8381 -129470
15136 231407 3858 139708 237630 -15737 170411 283651 269977 -293411 132146 62448 39879
15125 39879 127972 50044 62776 87560 223375 314573 -205651 -269967 273541 -149715 40248
15113 -35683 -137279 59549 59222 161470 181890 176578 70722 104627 76554 -226032 603040
15101 19909 -16410 126051 2280 -177870 9715 142864 318949 -186477 31700 -12956 -72462
15090 -72462 124633 27365 254855 229023 141615 218162 169930 298220 61134 -232211 -252279
15079 -252279 -200792 76249 209908 189475 48641 -89633 17992 -8822 -52017 125584 292139
15068 292139 -25232 -42879 235593 -38392 220673 30269 -27196 117998 -143472 202115
15057 205576 109379 55943 36488 122183 -313503 93950 -88066 -64113 137061 94797 195303
15046 195303 33639 191008 61373 305666 162371 530343 108685 163452 375579 44105
15035 207214 81495 272164 256736 183610 203073 199301 88734 212976 -149859 152945 -20673
15023 -257059 174174 168925 -112880 165574 179235 -57867 94468 -200338 122700 135301 239263
15012 239263 306868 15955 79156 377822 127716 149446 -99319 160818 247615 15677 143561
15001 143561 109072 82116 108328 151607 206616 515913 -54259 -23760 566923 -113387 483179
14989 -47381 354279 220070 46643 206830 365138 317067 484368 68367 -45554 228199
14978 -87837 206119 185353 154955 320323 307462 47074 484066 304272 30799 385794 111970
14966 385815 -56856 304222 32405 159338 290601 25996 24612 210389 496341 226234
14955 306736 376110 -9500 367184 415652 70141 137673 292007 396987 317851 399309 214984
14944 214984 218846 189252 23251 528672 441926 39334 10408 129738 328354 293560 -56202
14932 286362 356943 264787 288119 -50512 179522 -25985 285290 409810 325564 461994 366229
14921 366229 243220 421013 -313838 107389 152952 247066 181819 201024 284092 40583 -76850
14909 142325 272988 70303 429032 428563 254688 544492 254966 304749 187939 379426
14899 379426 446688 -124890 -36175 123890 21470 14347 228744 445534 81964 514640 29830
14887 599054 110848 313075 437147 133314 284718 96525 437773 455770 252754 415371
14877 415371 232376 340173 92229 48013 373722 354858 422612 58857 75815 339569 127777
14865 221463 497769 247448 275872 108828 328743 270421 315747 613222 251455 365529
14855 365529 480708 270205 172309 446666 226583 402656 97329 151734 131946 841441
14845 841441 297627 286244 279068 91563 268032 258090 414422 389280 502913 234037 400042
14834 400042 590849 376873 160688 181506 367333 -25781 342863 261092 556209 389322
14824 389322 290731 276342 413020 71543 456071 368328 409808 359643 571437 299984 603032
14813 603032 207926 439495 306404 581903 426351 432617 193857 594574 318515 258169
14803 258169 722940 575797 406967 615825 478587 405579 520541 203206 504516 -3922
14792 549417 579915 298259 379631 586527 82204 437536 476775 585539 522592 381035
14782 381035 414673 526321 288293 310528 559214 447758 516365 671082 713620 345776
14771 389413 288796 301362 541089 319092 895580 720340 863915 620149 602323 443302
14761 443302 773865 402384 868127 423162 481250 520017 394763 861750 464842 728859
14751 728859 1066783 973856 625994 378265 446950 154492 266305 679967 530326 354700
14741 354700 502850 502663 545122 628437 565762 640163 319908 477420 523923 410898 749352
14730 749352 840029 380451 575841 633189 835779 604681 669136 669689 755393 491898 511288
14719 511288 401338 751914 588056 395937 567348 786185 842519 595106 465553 599554
14709 599554 303980 741750 828555 800062 988450 631421 557460 656825 684014 392805
14699 392805 500465 1019568 787090 598223 817813 478421 846966 529714 625805 507535
14689 507535 618315 590326 661392 951590 617708 1025526 1014749 904320 799286 831747
14679 831747 612238 784801 879477 1049301 945873 762630 935937 1039121 1094665 808087
14669 808087 743682 721644 859070 1019112 766778 961177 510884 605266 990573 945814
14659 945814 883385 889702 808405 896372 1040089 1106060 948284 973457 768910 1029169 695295
14648 695295 856035 922090 1076448 998576 1185727 823922 1243220 1095811 757787 899449
14638 899449 1048790 973238 957371 904733 1042923 958825 1191879 1482992 875688 978084
14628 978084 947787 882322 1133869 1089958 1257081 955407 852001 1298164 1429892 1015355
14618 1015355 1166867 1390681 1287853 1408555 1194638 1255754 1131364 1268582 1047474 1544821
14608 1544821 1423802 1572137 1492668 1262412 1455560 1497612 1474966 1471763 1263178 1795169
14598 1795169 1350728 1507439 1539893 1553886 1442050 1595679 1510149 1616383 1727519 1703798
14588 1703798 1525851 1485269 1541020 1905392 1709816 1731929 2039504 1791963 1741718 1743169
14578 1743169 1759970 1546202 1862664 1760837 1773069 1982198 1627658 1767625 1673394 1825092
14568 1825092 2169185 1981538 2112292 1922552 2053699 2259769 2114893 2150160 2463582 2280836
14558 2280836 2227393 2823837 2613861 2590643 2699054 3240900 3767179 4373001 5410360 7699064
14548 7699064 12395760 22819860 37542090 36486875 20818447 10174182 4828786 3108834
14540 3108834 2101112 2062184 1933597 1927450 1836368 1936110 1556385 1846692 1927234 1877035
14530 1877035 1611226 2137006 1826911 1940403 1859225 2083907 2005068 1995023 2119285 2020167
14520 2020167 2034562 2248548 1965839 2267129 2430175 2141652 2217881 2272687 2526589 2190915
14510 2190915 2234073 2634094 2599520 2630072 2374629 2675030 2584628 2733518 2736294 2581529
14500 2581529 2668563 2708328 2943208 3085904 2856972 2592966 2881994 2519299 2919987 3163262
14490 3163262 3216759 2977002 3179573 3278441 3010679 3256125 3520111 3259188 3175346 3450105
14480 3450105 3374984 3235481 3743271 3759936 3270789 3513382 3391989 3379422 3644833 3749709
14470 3749709 4035390 3695880 4084982 3862675 4188173 4097416 4008815 4261319 4580397 4368895
14460 4368895 4134641 4071153 4531044 4650675 4607307 4369577 4734622 4404195 4628773 4631748
14450 4631748 4757903 4754273 5179359 4857035 4936507 5138187 5068168 5384601 5328922 5353133
14440 5353133 5183122 5377113 5462493 5618247 5557136 5945707 6073673 6167100 6077144 6184782
14430 6184782 6106834 6312042 6446055 6417901 6582576 6512835 6458299 6730078 6994304 7288740
14420 7288740 6894700 7270052 7276429 7585656 7734529 7416304 7824432 7818413 7806829 8230259
14410 8230259 8299943 8160536 8561396 8650306 8874062 8785034 9094051 8804884 9215990 9518483
14400 9518483 9666433 9650373 9817720 10028816 10071860 10754134 10592215 10946899 10906212 11032442
14390 11032442 11529850 11592559 11439170 11970381 12125492 12494470 12271098 12971368 13266360
14381 13266360 13244171 13531453 13843374 14252012 14334343 14322453 14707808 14698931 15174310 15816989
14371 15816989 15835342 16238864 16433657 16951424 17335936 17893294 18176368 18345775 19134454
14362 19134454 19149088 19876287 20505247 20652274 21284060 21815215 22109954 22631893 23176006
14353 23176006 23705308 24276887 24731320 25579631 26143287 26310641 27784340 28419257 28621358
14344 28621358 29278335 30324921 31323843 32286001 33346866 34001114 34903416 36040618 37014090
14335 37014090 38217264 39188710 40661470 41682038 43021833 44441220 45523287 47293184
14327 47293184 48845000 50574036 52092938 53908194 55651936 57651914 59781330 61806122
14319 61806122 64011294 66586120 69125356 71597401 74471751 77081039 80634284 83668199
14311 83668199 87131900 90868074 95095033 99241078 103791503 108086652 112797696 117930278
14303 117930278 123819986 129720233 135806601 142598731 149922177 157463414 165235981 173589688
14295 173589688 182963284 192361494 202343949 213247774 224209379 236217269 249049944
14288 249049944 262001894 275521311 289639418 304094068 319188484 334270310 349569091
14281 349569091 364694441 379549354 393857241 407472206 419602388 430461159 439796990
14274 439796990 446096197 448243416 446820807 444816082 441737026 437206147 432743599 429121212
14266 429121212 422304933 413732538 402945709 390129216 376460328 361871802 347265898
14259 347265898 332434236 317068527 301593573 287263124 273033212 259781582 246518817
14252 246518817 234108967 222173314 210894211 200282909 190745468 180850759 171962767
14245 171962767 163941743 156300185 148744938 141841658 135273588 129248112 122975014 118205624
14237 118205624 113108492 108185585 103544677 98896828 94919768 91162764 87700952 84558218
14229 84558218 80818020 77868908 74851343 72133800 69605532 67036834 64536421 62159762
14221 62159762 60004467 58070196 56100180 54206206 52284412 50684789 48997662 47961338
14213 47961338 46589763 45251210 43419923 42205120 40945150 40183961 39540165 38125950
14205 38125950 37053150 35572838 35018922 34235456 33327882 32174238 31167116 30552027 29865733
14196 29865733 28993023 28035281 27977432 27148656 26439537 25701450 25063100 24446951 24191747
14187 24191747 23479162 22941104 22462541 22041533 21533228 20944960 20707000 20217071 19734465
14178 19734465 19402613 19051593 18706582 18447392 17928809 17512435 17038354 16736013 16568553
14169 16568553 16418888 15863165 15568558 15039831 15074433 14708683 14365784 14239418 13985329
14160 13985329 13851430 13381098 13175308 12840750 12700271 12359956 12533126 12291557 11944579
14151 11944579 12167062 11449735 11460288 11123400 11263735 10976281 10774797 10212410 10419845
14142 10419845 10378160 9932596 9736043 9792381 9910072 9522657 9606014 9132157 9325778 8819457
14132 8819457 8769523 8547025 8561285 8367780 8177074 8630941 8105783 7739773 7909262 7998674
14122 7998674 7187794 7521815 7772649 7237500 7161058 7357703 7169913 6994712 6939105 6790641
14112 6790641 7085126 6887627 6798909 6520211 6440078 6179456 6369389 6430802 6245148 6052209
14102 6052209 5957417 6227139 5969629 5558609 5919139 5728147 5913257 5841882 5403950 5192314
14092 5192314 5677386 5191027 5375455 5201413 5105643 5214424 5166115 4961262 5061763 4995740
14082 4995740 4756593 4525737 4768674 5011799 4864622 4819334 4616291 4675619 4598609 4490702
14072 4490702 4425108 4542161 4055133 3884238 4055331 4193349 4111316 3665139 4051598 4018440
14062 4018440 4002613 3966359 4076747 4264032 3847767 4209749 3880128 3548080 3901582 3746290
14052 3746290 3669815 3328482 3342248 3604246 3552883 3340544 3234531 2893520 3348125 3029230
14042 3029230 3337448 3236567 3115193 2907883 3217788 3050405 3099628 3086887 3083157 2834411
14032 2834411 3007656 3137426 3022225 2803488 2548155 2989398 2878992 3064033 2635197
14023 2635197 2601052 3049058 2670740 2726003 2558425 2610074 2658859 2563567 2448897 2399611
14013 2399611 2362221 2295623 2729764 2233497 2076450 2204617 2389241 2097638 2297297 2321587
14003 2321587 1996768 1973440 2031195 2085234 2001950 2164771 2030452 2075882 2157491 2029319
13993 2029319 2171980 1667256 1940152 2837912 3888234 7341956 16024382 33489456 37019930
13984 37019930 24736492 13129056 8554724 6199890 5004224 3691279 3659294 3523609
13976 3523609 3017022 3102075 2699336 2594845 2448053 2593794 2357705 2104693 2288920 2375905
13966 2375905 2377494 2139125 1980328 2224502 2031738 2262340 2064803 1919119 2046410 2006215
13956 2006215 2085274 1823147 2014694 1859497 1695986 1744394 1893771 1818258 1833923 2009495
13946 2009495 2050865 1430239 1740688 2100603 1912975 2050005 1527318 1987420 1671059 1688409
13936 1688409 1736441 1656306 1637072 1870406 1657144 1882733 1904934 1896739 1599487 1806001
13926 1806001 1698159 1199353 1695786 1399088 1446219 1705585 1448825 1906934 1678514 1464935
13916 1464935 1468332 1915439 1533145 1312191 1257610 1283562 1459310 1386692 1368951 1511544
13906 1511544 1214801 1564432 1411682 1321295 1353205 1175893 1118331 1452529 1530965 1260834
13896 1260834 1073259 1516333 1431455 1451266 1172016 1246602 1493585 1137611 1654101 743245
13885 1159961 1284347 1466816 1106245 885419 1327897 1299927 1274798 1105332 1234313 1178691
13875 1178691 1087295 1202848 1272978 921608 1255780 1298118 1135690 1088734 946412 1137571
13865 1137571 1069056 864917 1053303 1277013 1179357 1285972 965356 1034824 1100502 1605049
13855 1605049 1100152 807144 956364 1433294 1117146 921383 1251733 810554 940360
13846 940360 721470 1243703 971534 684944 821856 908039 659561 1246178 1172757 722447
13836 722447 864213 1023880 1254845 834400 916893 1066541 1033575 1035830 800315 849728
13826 849728 944556 593896 1018085 654498 1054398 1285410 943506 1018777 854069 990246
13816 990246 1003860 1281561 836108 742299 1229078 819320 689106 1155863 773180 967655
13806 967655 534933 1010268 1089450 1301197 438196 582914 700108 901525 718893 330653
13795 704853 888878 627953 827062 1043883 935032 778416 567534 646841 920947 797331
13785 797331 1039530 828075 815901 720681 795170 441815 854949 660344 651669 726206 709104
13774 709104 837318 697579 1008584 559500 303699 1006741 630871 791268 378001 505369
13764 505369 894214 781234 591155 540194 899666 588615 864388 846842 933767 1096990
13754 1096990 787698 529918 769162 373795 896839 869250 1057750 737573 845798 455733
13744 455733 541234 977365 327965 412462 636985 713373 729902 681728 478583 577925 589201
13733 589201 436016 566318 397940 673948 474294 575310 860464 523424 858359 719927
13723 719927 170175 566474 593104 626549 599443 667649 537061 539842 549857 563900 816888
13712 816888 647673 750126 823486 607194 492082 544262 525763 525592 566450 538539 448056
13701 448056 756495 445879 708741 661419 612186 633389 531760 654214 777228 119789
13690 685192 513249 842286 417654 584782 621285 462122 604282 517560 818289 284024
13679 349754 397971 549136 605011 572880 1063648 665828 485675 600663 689557 364279
13669 364279 357987 405019 519724 600535 420179 604128 702019 230647 409535 856899
13659 856899 243253 417678 643788 367421 310509 449950 254477 314095 351306 332644
13649 332644 184022 218845 444158 711238 233563 478816 337479 524067 516849 485751
13639 485751 480872 492161 491312 579571 203723 347058 249868 417423 598857 543337 416358
13628 416358 494062 568243 539041 470918 510603 490941 845254 255160 538383 92588 714939
13617 714939 556958 121609 418933 220238 568882 325165 559036 543034 558739 193079
13606 407839 433420 415835 354229 438685 628855 205774 439154 150984 217227 491405
13596 491405 603423 488616 238761 337246 198025 515286 346163 273690 370040 392835
13586 392835 37861 395871 246671 446373 571432 810133 246314 382325 376315 529022
13576 529022 444348 330198 365795 274565 409540 349116 474121 298467 430270 -2188 365435
13564 534365 650744 237953 859089 91142 337197 81177 -134970 454488 356394 469540
13554 469540 373435 250006 410164 95702 501257 93864 165640 595812 314593 296065
13544 296065 305848 582632 335287 249483 349809 241156 244114 400481 153906 198433 291620
13533 291620 525270 183623 42073 322464 180617 277732 414101 335830 308993 468609
13523 468609 185893 193439 114906 328367 338531 489547 327975 42187 420749 271032
13513 271032 586863 289342 384612 429109 225085 269722 493663 565626 395487 480005
13503 480005 304995 205862 267557 494601 371175 49231 164312 304705 200819 126205
13493 126205 291883 184080 199674 114226 295574 240762 318455 125625 212882 99256 251172
13482 251172 208352 -44881 301724 283259 206872 227996 35600 39545 81435 103291 31491
13470 566919 77428 262493 507764 285120 173514 69493 252107 341281 119370 155388
13460 155388 155339 210377 412346 -34798 131439 496988 171257 147338 317629 180250 307588
13449 307588 427665 -1601 400631 242684 339387 241146 373475 417581 237156 8732 364762
13438 364762 231711 406796 151776 346765 191300 211000 201567 362892 493779 687319
13428 687319 290058 477629 207616 488533 360517 408472 310668 313421 40602 -24001 427928
13416 -152187 272823 313293 120705 149888 -128804 140632 21711 292434 73449 436015
13406 436015 226030 161260 208096 64538 176347 300421 346397 113620 148010 310328
13396 310328 10806 288521 72048 229105 423744 371457 241091 91850 483202 547057
13386 547057 72994 19579 -18847 286653 69632 133258 49229 -133001 120415 326867 563948
13375 563948 249298 302028 331624 227838 580221 547204 442048 273083 265537 189978 230878
13364 230878 388713 376270 275260 632069 252012 379682 249048 84814 39998 329850
13354 329850 39167 194859 237176 148103 129115 32632 351230 256245 380747 358484 132623
13342 421560 430774 308044 501122 52349 -145298 170168 518682 111871 319040 39257
13331 232815 94282 154915 187872 541124 193299 319289 1098 317481 28488 -42526 382284
13319 -157753 168981 326480 216425 146749 690037 468131 98353 -89515 138344 310396
13309 310396 401457 192348 283073 157564 300109 241065 230226 160544 23398 40310 483368
13298 483368 126174 183558 104802 118872 158264 208739 178174 -44776 300994 15076 226024
13287 226024 136592 239971 129957 310584 53204 208105 48862 19609 -241471 240246
13276 -319617 85641 -212925 148602 18178 330176 233769 -38819 378706 262391 355889
13266 355889 340834 84209 184413 -102753 417855 -135603 165564 117266 -147495 196355
13255 453174 209437 138224 249771 -39512 108606 545071 375714 -146473 47295 115829
13245 115829 -66906 176536 162547 180261 -84345 185496 -36950 465303 304415 545454
13235 545454 -76801 518338 171861 260674 130482 -22021 216043 383040 170274 154762
13225 154762 -15991 208188 129484 80508 67249 -118099 134408 -30046 -54855 171466 72175
13213 331919 -101372 -98231 160152 367425 224729 213631 189656 159171 460660 -140133
13202 392539 -111233 79584 -288025 448780 264560 190290 144280 61145 265736 83666
13191 228516 143033 -15757 -33715 81716 222126 -76793 404239 -76871 -189019 -539 185491
13179 232094 165007 114378 -192596 118315 48420 -323803 26375 67928 -117822 297511
13168 10101 242 10454 -46983 164730 48117 -118438 -5000 -49871 35379 142326 288664
13157 288664 135433 -231629 126745 379039 264878 242627 173532 102476 189426 -61736
13146 63676 -265178 235974 116988 -1145 33637 347273 334260 -78430 -14355 424105 55207
13134 196134 157521 265071 173966 65953 81740 261263 -163496 -108367 13037 158737 -38374
13122 102868 346741 -105223 111463 122711 256808 -200521 -102834 183445 -34838 173055
13111 54397 34910 441832 -118302 176246 256938 178325 151514 81524 -49020 -124417 -98297
13100 -98297 509421 45134 245902 -404 -180 178551 -122629 -43145 108785 -24553 207892
13088 47405 149081 -18757 389922 61995 -207945 18712 185134 61254 175685 229622 300253
13077 300253 160198 81056 175795 -64557 204434 139569 -172327 253923 182417 -17092 186209
13065 -214497 115372 113747 -117244 257043 318529 242050 26336 75267 124954 45825 -141801
13053 97875 -49103 21078 67618 -108620 355290 82374 252098 246638 389527 -19851 266597
13041 380157 151195 -118376 -77723 47040 52391 38845 77431 86272 -128476 119545 82750
13030 82750 -132480 313131 321922 198156 396504 288570 80743 191980 38195 265163
13020 265163 -73651 168415 126004 94182 125832 360914 360545 484107 170517 -6500 -53451
13009 -53451 415182 203157 651849 37271 -26366 15392 262607 -20249 -80367 230524 -49864
12997 -53592 -137927 126766 -140236 47523 77525 -95792 -4007 255935 -1028 -18075 353387
12985 -79124 16337 -41187 105082 -10091 151072 -123467 87183 537463 84197 -281240 181798
12973 160482 390150 -184140 -122244 135541 104589 -54508 -34667 -194593 -136267 56299 63425
12962 63425 -166698 472339 139391 57007 -104703 -72646 35277 -70779 221953 -44846 -216234
12951 -216234 207287 -17066 152625 52222 250795 31482 43398 -60360 49565 177709 153886
12940 153886 60952 -99245 384082 -49267 41683 -31337 -98490 -208455 347243 124777 63946
12929 63946 -199275 -13821 -90500 283723 -232733 -66704 246576 390138 125840 73357
12919 73357 53809 230174 -17555 -94771 -71244 268848 30524 147756 115112 202396 206892
12908 206892 -158101 126269 -73146 61812 47511 250839 288988 -135896 -24864 159380
12897 117362 -68635 -118353 154542 78038 157334 93114 -80215 431014 111712 -284450 309340
12885 -157386 32211 -3165 -36610 216588 125908 20988 -141467 -31684 -14814 39848 206329
12874 206329 178957 -53721 459057 -47119 -114339 134872 12510 -378697 41012 -62858 153966
12862 -108361 165771 166655 -50663 -70082 -71851 126288 -129310 -274142 2913 335576 -97795
12850 219753 82223 -215276 39328 273644 10827 -99566 263488 15643 134941 90395 102658
12839 102658 429745 -309410 -291498 -9790 143024 62810 -32629 60574 337278 85637 -14879
12827 151714 -190339 -207212 232738 95037 282195 -8021 91228 65743 140250 -258694 -18263
12815 -35648 108181 10065 4712 -203745 268877 21434 -25746 181065 138910 45690 -244724
12803 -79445 -40922 359417 -2367 -260733 -119682 112223 -75478 87940 -132542 81486 -5341
12791 225704 -94893 -91768 -32920 16239 140020 101956 210565 -138383 -95583 348385 -112134
12779 -91358 -231316 -87426 -125512 57269 -216411 219933 214970 198074 -229352 88893 67177
12768 67177 58283 121557 266673 -207397 -114209 99381 233680 164815 175386 50064 -70178
12756 129868 -443007 -627 -65992 30151 -177034 24744 10710 226596 -147262 -188086 -283494
12745 -283494 270727 -36971 132999 200318 -29725 -179548 403472 234935 -12086 76756
12734 89789 234122 -27008 16548 287037 208954 87388 168310 185386 323950 -13962 109584
12722 -86297 159099 100589 -83042 240707 141330 176687 87030 414461 -11313 150844 -195482
12710 -89629 -120206 160441 313071 475595 258966 156980 390699 205544 133648 441385
12700 441385 -108644 293552 170425 116146 203647 59637 -68625 124833 42994 154278
12690 154278 121640 64890 -383109 127713 -43851 -48787 204976 -213161 188213 229280 138494
12679 138494 -114819 143008 -43841 257091 -278985 152996 123187 -74239 31762 186556
12669 186556 83790 -70853 -161239 175400 -74179 87188 235117 -75657 418037 -46338 185474
12657 187313 -89267 -88486 247136 68403 65670 -115268 205041 -40323 -64344 240697 205584
12646 205584 363709 -59006 -149833 76517 155787 286599 -239141 279529 65818 62575 -135174
12634 240774 157234 173813 218419 286435 125755 243304 202433 407963 231775 297906 147707
12622 -120372 256986 282765 269036 110326 274759 39803 296232 -110441 -492194 -323804
12612 -323804 -110247 403921 -289707 141211 166900 102429 -116084 10527 -59792 448810
12601 -101049 3928 118837 517188 239932 -266953 329256 456706 215645 74802 307066
12591 307066 298757 60994 213963 201644 39349 -10145 -173177 -204637 292126 86342 -141349
12579 -345502 -48730 215460 -79229 245290 -161885 61437 118585 -90243 70705 162507 -188984
12567 179069 44867 58683 -49618 -100091 -336335 -91228 32566 -153156 77524 107721 -22711
12555 207600 180522 -132424 146797 103744 -105246 103779 81891 3265 -159770 47396 -268828
12543 267228 -95030 41980 61098 -64826 55865 71684 305323 193696 188026 73182 -140262
12531 -242156 242367 -91001 115362 -149079 -107668 -77613 199033 287275 34077 41224 163876
12520 163876 38770 -80572 -27228 194958 187440 34949 -8417 46065 277441 -83071 299211
12508 258721 -12583 -21276 -50256 75208 251350 135776 100144 -186927 -107799 -35717 10790
12496 78561 307320 1204 463033 -83452 -82605 142492 -112022 69548 93305 262199 85421
12484 1953 11803 20524 90397 -94520 -237439 62311 138317 155228 -16374 132890 248709 -128627
12471 225405 -343309 168454 81246 -311357 65100 -300095 -201954 -249341 148391 59282
12460 97105 186591 -164132 15948 234367 84121 124074 111952 106942 -407441 213031 290577
12449 290577 47868 54254 -367041 -115542 60032 -186352 117498 102022 212043 219780 306002
12438 306002 -102138 -149633 373826 145322 -30911 -254642 -123553 201975 20900 95385
12428 95385 -26151 12963 -278251 -130384 -222519 129835 148702 -22022 -117259 -120879 -201703
12417 -201703 108749 -150173 162646 325528 51256 -26959 31251 21511 -115049 -83844 286202
12405 -20202 157833 297685 -156721 -83905 288360 -84440 -79104 -194552 -331749 144951
12394 -41152 67352 335564 239072 -71572 -13065 -83425 -139531 -19208 172366 90698 172201
12383 172201 -208627 -117940 308047 97693 75592 -32335 22182 185037 91456 36894 86469
12372 86469 60329 -183236 370314 -299019 -124240 124182 139331 -15077 232717 -36782
12361 398184 -115814 -170310 -53668 -254078 -235153 413413 432021 98885 23791 -70843 -114262
12350 -114262 220576 84485 125022 293004 131411 159245 269243 98548 364572 81760
12339 52227 156600 -29977 308334 -34021 -127755 153661 79452 14567 277255 301839 164244
12328 164244 183462 74879 -8780 123603 -180929 463519 -76354 66426 119440 34182 -79844
12316 70730 -55422 -184324 -54614 -199200 -35859 71015 2423 123425 57662 -41456 54377
12304 -23556 -144024 -205174 -90951 -383669 -109911 -107493 57156 -143674 -292569 57502 -303141
12292 -13120 414641 -235395 -27278 -968 383062 -33162 -293888 227566 -2171 13843 107390
12281 107390 -14176 -91736 450794 164337 63788 307610 325769 487210 299250 90585
12270 130449 304488 118688 71772 202632 -111786 172824 441855 315568 85431 -52541
12259 187992 -51428 118736 190740 12708 -100261 31511 -261261 65662 407571 124211
12248 -7092 -50383 89877 50900 259279 -39435 218539 65377 412437 258348 406149 372890
12237 372890 -166388 -198321 -107785 452510 359929 137685 -168684 238997 250103 59787
12226 340784 409887 398325 502644 275090 132956 286918 205302 -4854 405582 -5329 382386
12214 208455 -88257 90779 -18409 41973 483407 189132 335375 147659 90736 92096 275107
12203 275107 83392 97255 40765 202734 211096 75826 342693 162360 -162543 148885 417982
12192 417982 61738 268166 28250 118623 -33410 109627 16193 304090 95143 178209 124565
12181 124565 -32783 37210 267583 194722 170439 174112 76460 -15639 18659 147365 -109780
12169 244470 -171853 41262 330810 303441 115979 195145 342336 205630 -100408 122973
12158 284000 35740 -248575 146372 68382 28050 -21482 498934 -88028 88693 -55542 258821
12146 -18068 120621 113368 430874 43018 463734 -167938 7102 278707 -138518 295630 91460
12134 259161 31649 -7192 260558 170864 -162437 -116636 -17895 -127110 284047 296074 103423
12122 15236 209562 223882 112425 -28727 80624 59330 -23930 140356 217443 124008 -93038
12110 -84367 55905 157615 390259 31184 -328031 -105283 -43702 -196770 312235 14163
12099 70612 -5813 -32192 -244353 -8569 -233325 -159976 -104097 382600 161762 -116123 112407
12087 263729 335009 9628 -168068 -76258 52408 233396 -309094 -188027 106892 272296
12077 272296 638349 1406466 1482189 501037 356368 -39367 -144985 360115 184765 333364
12067 333364 77975 -209902 157297 -77 134977 -65860 258951 -63028 241651 -96716 -25580
12055 -84476 6211 134216 -146538 267462 -23876 172980 -124891 -34498 150771 15333 19309
12044 19309 -356008 58352 200513 44521 130258 -124866 154079 -163507 44873 -109060
12033 94657 -182848 -16904 86642 -98851 -194050 202761 280271 55620 73366 -137940 15314
12021 -51101 165872 126328 -101739 -279905 42841 -210658 -113390 -127422 133324 280707
12011 280707 257729 240220 317133 45200 191309 -102416 -105656 -334660 -204642 -112196 309167
11999 -192180 -455124 -108466 40784 3227 -29772 -117305 -23373 -187835 167587 -60666 -265260
11988 -265260 24840 91154 464577 -250294 -67817 129306 249790 -240750 199747 -189631
11977 59125 -48681 -175004 -66086 375268 -150473 246607 197854 83309 -123988 -57964 15202
11965 -162310 -94683 -75325 -137802 -88391 -168903 -90054 68941 -125191 28744 352980 -350189
11953 24585 -275260 -28365 -3205 59098 189944 64265 -87752 -9744 -186595 -292831 -11396
11941 -38940 -51992 40167 60903 -10618 45962 -220321 -130757 92088 -73136 -239761 -109333
11929 -210851 135588 8016 -9472 -43513 -117219 -98556 38564 -157469 -175023 86960 -119804
11917 151621 107211 -138947 10478 -102741 132003 -122736 -183249 159837 -96466 177863
11906 57008 -66040 -78150 84196 418234 468458 -39911 114439 -135784 -370436 278444 79241
11894 -143835 300695 -107758 -18032 -191075 114374 -16319 -176841 -26783 -214242 -105223
11883 -3521 -98287 -59705 -143556 141647 208805 -125618 153006 -30741 -56006 -87514 -174254
11872 -174254 90445 328683 99187 -337714 -352046 -110404 62107 155119 -125313 -312115
11862 -312115 -199822 36689 -98920 -312288 91888 97214 -150672 -90074 -31758 20156 37425
11851 37425 201273 -55433 16976 -111231 183301 162256 36361 227146 55831 24050 127503
11840 127503 -484219 -279790 128486 151921 265973 87284 104980 32501 11909 -72534 -10751
11828 -94098 190740 -25108 14498 -257498 -63980 -132876 -120817 -172221 157494 434299 70439
11816 -155226 -518183 99270 -117623 33746 -13492 304349 169742 83800 -167216 -92997
11806 -92997 61563 -173239 101538 130254 -205973 44661 -266322 201120 -239819 -339032
11796 -339032 -86767 66151 435998 -8293 79435 305274 223579 199559 -22785 -14864 -930 35383
11783 -1882 15121 30179 30725 176260 -135816 116874 -2201 -90789 131748 -89606 -90510 94560
11770 76681 -255072 -19743 -302201 -147351 399126 -316178 -50641 54779 -444348 -58903
11759 -295933 199257 -55438 21197 -128897 142172 -394247 -224463 25761 -124845 -122256
11749 -122256 190683 -86826 -136357 184156 208434 -368827 278936 174210 165323 118810 68191
11738 68191 227383 -51379 -99331 -274195 58274 -48815 43555 259054 -108068 76345 -38863
11726 117878 109177 -29719 33353 -6054 70154 -2134 219259 206054 69269 -140663 77290 229308
11714 229308 39404 278961 81001 -23794 162662 61491 90681 146425 43623 158874 -12663
11702 51848 51531 306829 134022 177166 52582 28181 535095 74749 -72694 236462 173647
11691 173647 -203585 114180 79865 -3367 -156869 -73767 -87959 -47230 -8063 53925 174951
11680 174951 -73659 250945 33255 78753 139866 243499 83028 296021 123853 192474 -147935
11668 81609 -71667 47080 -157618 57679 -114491 -195375 -1175 329955 67752 233581 30948
11656 -168368 187849 -312237 -12088 -66497 243710 98963 176244 69721 134889 220334 125620
11645 125620 -52235 100200 98102 51925 -164726 29275 -92041 347422 -220896 66424 95728
11634 95728 -67346 83072 -136629 -150755 -138885 110542 -74727 98370 237612 -68770 208301
11622 -155390 -98571 -207260 233712 -110621 -4334 288843 102695 -105008 -27421 65731
11611 -34231 16473 140907 563 -259898 301179 71375 422787 136049 84089 296257 50464
11599 415111 278244 34044 -164443 67689 84392 384966 -123695 -93801 121922 -73891
11588 19329 176521 283595 185924 356625 109417 93512 78689 375752 80552 -113384
11577 4871 30823 -214823 -51634 -814 287724 21745 254815 439330 228498 73263 -15427
11565 36617 163744 342154 -17089 143291 76271 142882 -113857 422815 207697 48871
11554 2953 -25198 -134961 164409 330980 223290 15713 25156 -17442 185140 101889 269733
11543 269733 194093 -22615 217256 364647 -294604 -303890 -18705 -58052 -42254 -69326 344115
11531 526162 126646 177580 -38597 -23698 453677 241757 -109945 388833 -169965 82853
11520 59155 -106929 97655 159665 150370 470080 81960 125631 213728 10088 -11308 534039
11508 204271 348132 75500 130213 30071 -19527 195288 -18178 79048 251323 299972 195840
11497 195840 303180 -289292 419914 -71247 -46187 216944 268654 60935 76693 -139951
11486 429657 117841 215385 -82916 252786 126629 98066 459877 215270 269974 76330
11475 105872 232279 33755 183481 69729 67040 83374 244126 22984 135495 40424 239657
11464 239657 -46810 18475 -88004 -51503 96290 -187334 -69088 156341 330704 239812 498823
11453 498823 -31129 -38677 44342 318937 103507 -51386 99204 -128173 -170564 344676 388187
11442 388187 226480 120579 58412 54835 199040 2107 -37651 170485 237140 -49927 318321
11430 10221 247849 106273 97240 -187269 -41720 145565 948 402148 77135 -186201 20780
11418 111063 -94187 120514 71598 -277830 -110339 -8881 212523 -46000 -176250 -58348 262410
11406 64843 90195 -206052 -68166 95329 28406 359423 13978 -56038 172380 -76643 79793
11394 248440 72531 -125593 -26016 176603 -122026 -95025 -46723 -356989 -152978 127924
11383 241942 96819 223163 -198562 28034 -188117 41046 537974 98883 55168 76484 141522
11372 141522 19515 304755 -235770 -394070 47144 -325337 -403887 128514 -233529 -105988
11361 171466 78683 383317 71629 -69115 -198458 141488 -100996 221880 -78870 -124861
11351 -124861 3762 129547 -51434 -7156 142469 -75761 66307 99007 73697 -65259 103186
11339 143823 112022 59061 -66016 -168506 156058 -116769 68262 -7892 206632 37013 -100534
11327 19567 -40270 35542 80716 443235 60217 -258748 123742 144035 -4388 -144427 326856
11315 100503 -160466 13542 -139184 65698 -302731 55294 -47194 32145 -122934 10392 -115909
11303 -158324 -16433 -190748 -111389 41297 178404 21600 305089 -249523 38661 -44782 62463
11291 -108653 -387513 -3085 100399 -151748 -125644 -150532 -145487 231096 -135107 77317 -81406
11279 45662 -190188 -64890 80831 -246039 163872 57561 -191193 -140611 107435 -19011 -206063
11268 -206063 95250 -169173 -135132 55673 112494 -120061 140048 -74427 -80038 58109 62479
11257 62479 -11025 135324 -220686 -293004 -47551 -18548 -48880 59377 63485 83186 160789
11246 160789 -69887 -28993 131481 -74804 135930 83982 37987 173308 -185713 -43984 138633
11234 51406 211837 230828 -255715 -88751 451216 90977 100911 -24332 63168 49799 -57435
11222 80808 277618 -245898 14785 15317 73570 -341854 -99109 142333 312094 -6397 22023
11210 18741 -172431 54690 143230 -185547 -12551 -92135 -52081 -249700 -18254 -175361 188607
11198 141843 39174 -203138 208683 -102209 -70031 83715 -317020 252491 -268816 -9684
11187 102243 -271012 -74985 113296 8954 176663 -40841 -76998 -118690 193623 259626 -318510
11175 49191 -51733 -18760 -168241 -11128 -167841 192950 18279 -59282 78380 23892 -4552
11163 19073 -185297 -27671 16533 -10051 123474 72094 129859 -79085 208596 156423 133259
11152 133259 -168150 -196987 -288306 -47285 -108402 8050 43934 54123 21844 48446 6458 155894
11140 155894 214554 184517 154990 56230 291652 -54909 -295725 -251886 94697 71801 -119175
11128 -144873 72295 -104239 -37610 -274872 182802 127270 -141854 245459 169134 -63719
11117 584453 471351 60751 187297 -142299 296666 158879 150645 177614 16233 227632
11107 227632 266151 243327 158953 -136570 54351 -28627 -121316 169433 79150 152071 311192
11096 311192 272482 413473 167934 -145939 42135 -98895 140324 301893 180140 212723
11086 212723 -188733 106835 405658 311877 226843 -12988 552208 368468 96516 330107
11076 330107 263633 415685 354672 403632 431873 318866 259654 114896 214908 503133
11066 503133 323243 268471 270754 147561 172928 359154 335043 564092 413322 523061
11056 523061 263799 618381 442483 783350 934054 657543 936890 399511 623669 666706
11046 666706 712387 634701 326875 694693 895060 617659 541118 717746 989802 726745
11036 726745 1062757 380670 817747 952604 572969 650516 605992 778980 861209 672883
11026 672883 648242 644592 622330 394849 468940 442586 560259 520692 851605 534663 733555
11015 733555 816461 567026 486700 913756 710509 448182 729342 502843 981831 468826
11004 651879 865574 503844 710815 668034 685203 599590 825582 621974 449873 653585
10994 653585 604574 594652 836179 739675 985508 660152 385331 879361 1011178 719877
10984 719877 944612 1459335 1258329 1365165 1222105 1556579 1749744 1680558 1587642 2358203
10974 2358203 2495230 2656820 2923001 2621454 2580112 2539850 2672206 2383457 1606275 2008307
10964 2008307 1980286 1993495 2081356 2009744 1959368 2027747 2202056 2283012 1827596 1621719 1877141
10953 1877141 1388910 1223354 1167105 1102445 851480 588308 487036 764820 641871 626059
10943 626059 21924 191968 167265 134941 196091 392386 342502 60044 156643 84123 341328
10932 341328 -55301 259804 -38542 293102 282042 263800 92726 -49944 208114 21940 200155
10921 200155 -175519 266482 -172258 165388 -152280 -132560 -48764 -86290 73450 -22419
10910 44639 441070 60721 -110036 152112 -40779 -27932 203297 138397 14369 76107 255075
10899 255075 -338052 -92505 6396 44837 54012 457379 20941 -176268 -184579 29038 172929
10888 172929 239680 346494 40064 -236549 -47338 -177466 -12047 -293920 -4873 -7607 -350788
10877 -350788 -122115 37565 -189885 239447 76241 144401 81497 242291 32063 -120325
10866 126727 -72639 75459 5378 -67482 83417 -86350 245804 23764 98288 -124971 -91390
10855 -91390 26861 -181871 -168201 33914 -113829 44773 197166 244878 -213990 -114201 -65205
10844 -65205 -19425 -60779 160743 9029 108636 -28693 117610 53875 56903 -358762 68374
10832 -28305 198864 169369 -1533 -39813 14942 207551 105333 70562 404905 176479 -146787
10820 -36659 -252140 -214217 -359745 -111326 -28956 -287930 -246700 -271534 -23974 -161109 373872
10808 -6590 -36977 197172 -19477 -53279 35470 -3580 -205295 -181105 -123379 208791 -228801
10796 -72099 -48852 -329755 10156 23544 170489 -318076 -108490 146241 156852 -11325 -297774
10785 -297774 -225790 -5845 243810 -45237 -38183 -129497 -31061 -33021 141035 -84107 135431
10773 -217445 -388915 -60508 -12011 217613 152589 231467 -95875 311297 329839 -10772 -59863
10762 -59863 -16844 207900 -76615 -220530 -306441 -131450 2981 -216734 294974 -110892 -354229
10751 -354229 229308 117279 -57083 181496 -89922 -35950 208889 -115486 -223062 -76042
10740 229110 235197 91263 -70079 231509 -15893 -70080 -24515 -101286 -236609 -37158 -20988
10729 -20988 22153 111370 -119363 -49389 -33016 -179527 179297 -109951 10082 153959 58110
10717 4846 -203724 318000 113640 4868 -161091 -233919 -35294 -123035 -37388 -294434 124929
10705 -129161 -190297 -108000 -143965 -54483 3823 330265 1693 12327 -306294 -59628 -44197
10694 -44197 21309 -143493 64499 -19405 -141689 12063 -322550 -168484 -166021 -62370 -21851
10682 -185886 65961 241637 -185062 -248570 219342 -111714 -48998 -219526 -67620 -24603
10671 -202047 -293436 210026 -9026 159333 -45223 -190189 71041 -40753 -153390 -141056 -238920
10660 -238920 110225 262372 -7298 -92273 -334418 -46518 22832 -335269 -110712 -173063 -34815
10648 -314457 -337609 -160302 50236 58431 82112 97467 -139799 -45348 -95398 9381 -249559
10636 18464 -273178 -14072 -29170 -125939 -163638 -79700 -110401 -19357 -117011 162057 -106022
10624 22316 -204633 -218228 239785 36259 -60142 35159 -142585 184710 -32424 -171278 266758
10612 -174390 -470502 -181708 -62891 -428537 -180407 -124626 -28316 -312917 284822 6966
10601 99199 137125 -19816 -45981 67537 -236837 285743 -276054 -168360 133287 -164144
10590 -129122 -60700 -123963 -71644 315422 48030 -330082 39461 -229442 -99381 180342 54942
10578 -80015 -169178 2902 -168356 206271 -211495 32328 9476 -34490 -232009 -323038 -57969
10566 -115302 -315921 106472 12782 305924 178127 -138087 96111 -146234 -347534 25534
10555 -315600 60805 -375642 132318 -201851 99669 175628 -80557 -24790 -15882 223907 -232401
10543 -109809 -422314 -57770 104057 152025 -196385 -4261 -191758 47337 154349 19013 -72300
10531 118634 -136687 -137745 -77809 143359 411095 89175 -247197 150931 158534 7312 38329
10520 38329 164259 6270 -106411 125094 117651 36821 -212590 -600 -144335 -46490 -181599
10509 -181599 -131241 -163612 -182391 113497 -216545 46496 155682 119898 176297 -134552 -104920
10498 -104920 108024 -375587 71784 -114017 50920 -186740 -227148 -5757 191315 250381 -198866
10486 150552 -35605 41644 -270256 -137646 41281 320885 687935 333469 451530 304629
10476 304629 444669 125218 -308708 -25718 59904 166704 156361 117140 -4072 25662 -108052
10464 -297846 -190645 -114078 -108007 99759 -209547 -87680 -312721 -163507 78746 -9261 150811
10452 -171365 92515 120918 -344392 -126383 202559 195427 -10192 98047 -192027 121697 -271071
10440 -139530 31730 5876 -169408 -114847 -338768 105721 -189198 39286 -206306 124772
10429 40697 -243883 404681 -8344 -69623 266946 234951 -96623 -160398 67432 39238 109363
10418 109363 -141890 106127 120335 -10515 -25939 176662 75522 -135428 246201 206922
10408 206922 285614 181499 314050 -211523 -19712 127135 108848 -161253 -41666 126308
10397 406451 -129363 36892 -73038 1434 -300987 -42248 334291 71054 15673 262716 131528
10386 131528 103129 -25651 133746 27762 219065 72289 167975 340947 288843 149258 246794
10375 246794 303451 429728 306434 173926 99527 144699 240234 284059 560328 557595 375858
10364 375858 667797 99562 100657 -18226 508482 258183 -99344 288340 149187 -71188 -130544
10353 -130544 587083 513269 712310 432553 87041 320109 352419 344683 322446 286474 288475
10342 288475 74518 215673 169155 264364 128321 147866 98822 197681 156586 205426 36340
10330 117322 300 236268 -76064 313154 -148367 -69548 385949 406260 314402 117485 417930
10319 417930 174533 112448 500513 314342 224176 226611 -43627 120182 -214386 -115351 -145711
10308 -145711 74471 -175031 43703 104177 20067 100348 126135 -129219 212205 140375 -494638
10296 230920 10680 177380 37245 259958 -122045 -116877 -90619 -63010 144899 -43052 58694
10284 55190 -94792 -280036 123196 207155 -15424 62656 134156 154997 -58144 257397 79266
10272 140364 40554 31895 25731 -16563 -65506 115085 -52722 107831 230848 -129408 155760
10260 210646 293749 413819 168565 334495 566998 22475 -86875 95453 501633 178029
10249 280590 265490 453740 -8079 -162111 120586 -88163 14944 124174 -184368 -472174
10239 -472174 -221944 20181 -133291 -67664 203719 -140072 -102451 62615 -151192 -25218
10228 51723 120040 -168829 62704 -65796 -56345 -16633 -166756 -139842 -339844 -173378 165220
10216 185302 -150557 -169793 -244100 -190913 224842 63784 -61140 -72695 -267905 -183560 -1246
10204 242399 214421 176207 -49920 252871 -290062 -44652 -178544 -351723 68077 152095 -143839
10192 -124030 -181991 -99526 -167133 166456 -190171 186531 -184256 173142 156088 -62294
10181 -119519 -123930 93921 -61793 -124370 -344176 -246198 1877 59379 -114876 -87437 -271873
10170 -271873 123328 337988 -317705 -216216 -81492 -115762 92395 227236 -52871 168669
10159 -155189 -50432 -32238 66602 107313 -276802 -165360 -137522 100564 182436 -50066 128192
10147 -82920 -258198 -113618 -331470 -349645 172619 -179443 -481809 -22203 -26130 -122750 -134087
10136 -134087 -273363 -65662 235646 182842 32598 -283824 -143995 86475 133212 -154881
10125 -221570 -337106 8273 -227405 -60946 289381 -131522 -65922 -127277 79728 -30873 185580
10113 46590 -43749 49938 -33572 -182728 -44247 180008 120753 -251503 102065 35184 -315897
10101 -44760 17607 -189726 423925 -247680 -303968 -164788 -288251 -287291 328884 -265307 -88733
10089 -297229 -149336 -142638 -324058 133905 -24299 20427 -27243 11982 5448 112650 132561
10078 132561 166556 243412 -238749 36479 -65460 291296 -254597 378351 -5196 -100909 -388931
10067 -388931 -93629 -201256 -54262 57637 -16973 90142 100073 12723 113973 21884 -112212
10055 -93747 -116344 -41851 234807 61088 4360 -466821 -271313 78810 244960 -93388 28591
10043 -248870 39929 -96264 -29490 137280 -203045 -225716 -131435 67063 84003 -43488 247458
10031 -289212 36259 27405 -376027 -366667 -53114 211670 -126357 -69899 72550 2613 -136313
10019 -126468 -15124 -2176 -76534 260124 6137 58741 25483 -356189 -208622 -133473 -14229
10007 -364452 -64457 -278675 -212778 -276579 -295154 85044 -179394 221981 240686 -242855 -47292
9995 -85914 -251405 -106284 165913 196105 -149140 -223398 -100052 -95068 -94718 -6076 189713
9983 68026 -201676 27906 -155524 -306779 -39878 -229148 -46257 -129899 80168 -188418 -254935
9972 -254935 209572 -119670 303771 -13721 -166436 -66922 68621 109102 -60371 -229871 -156191
9961 -156191 -232579 -129489 7823 77159 69732 352877 111900 -196971 39565 -22587 76152
9949 -73883 -270965 -63230 -213821 -193362 -172362 126457 -72236 -20203 -307672 -309629 78397
9937 -144152 -51820 -348422 204984 20214 -8013 -69835 -114912 25672 45730 -183450 -129361
9926 -129361 -294247 133349 -316376 -27548 -474008 80174 -42292 9506 -125805 79125 125619
9915 125619 -143131 109946 -252461 -37625 -206232 18141 -343142 85217 114032 -78411 -226022
9904 -226022 -316570 -61621 -126478 -447197 -550034 285428 212686 -296451 44238 -303269 -44081
9892 107022 267798 37388 41691 165545 -26542 -224150 57130 -223722 175518 229689 -368951
9880 1095 -23427 -79243 17927 251523 55305 -233678 -131476 -23187 -197061 -6586 -159877
9869 -159877 -191882 -123339 -220342 5408 -27837 -55178 6373 -276411 -72097 -191699 199194
9857 180070 -62553 -259928 -349240 -230347 -138737 -93301 -354887 -169878 -204163 -122157 8611
9845 -94676 -300547 -73229 93077 279151 298165 -170150 -144042 -62585 -159971 -86483 150125
9833 -25193 -501935 31774 -113825 -190996 87530 -166928 -127676 147637 130154 -842 36813
9821 -116376 -199524 -18744 -27189 -118372 -141187 18862 40255 -189120 246910 40336 -17490
9809 -157394 29396 -1201 104286 272000 91831 161162 -249007 -307914 91558 -241644 -47422
9797 -514260 -92058 141220 -116364 -204040 81049 -213482 129720 -13297 -103752 -155095 -116213
9786 -116213 -244191 -88506 -40735 -54650 18508 -135720 -4524 7094 26518 -98171 254070
9774 -248425 31535 -52702 -149865 12292 199621 -343909 -132212 250838 111570 9412 -132236
9762 86296 -344063 -293087 -253506 65510 -94934 -39374 -317549 -326895 -64306 -74819 -168694 34868
9749 -8357 -175438 -172511 159785 -32796 103755 -54584 -171570 -2550 -246259 -3569 -24311 27515
9736 -153391 33616 -310295 -296012 182818 114557 77890 105953 -111702 22866 -116682 74325
9724 -363987 -199934 -284958 76493 -110543 20147 -149340 131174 -97385 256129 3202 143607
9713 143607 26421 12756 38238 37151 -8056 -147808 36505 210158 -128065 21393 -150052
9701 -235607 34483 233096 29409 196003 -16326 177452 -156364 -21401 -159242 -113170 115362
9689 167093 336553 195087 46055 -3898 -13467 -280733 120512 49050 32699 89359 324074
9678 324074 -57377 -114791 -13820 116273 -174948 271887 -127271 -12713 190561 134051 -246286
9666 -244823 -149051 -18936 -202343 229635 -119228 -124960 -38721 -127184 10486 -253251 63653
9654 -92340 17964 -22801 -18081 88835 -7865 153032 -123523 2838 -221030 -380670 38791 -23072
9641 150700 -102246 -302896 -128012 -16995 137601 -79343 -180934 264050 126564 -238434
9630 -136549 166412 -173101 -202590 83770 139108 50182 -173791 86449 -68249 95396 -175709
9618 70877 75212 308792 -25599 -183987 374702 -12389 -46288 -309713 238694 -115624 21405
9606 59261 -38711 168116 -265698 -47689 210286 226339 -165540 -229192 -51761 -1757 -5975
9595 -5975 171191 -19256 232318 -542192 4306 -18807 -227057 104875 -231683 28895 203859
9584 203859 -157169 15360 336034 -80749 -79422 -97421 -162002 -167929 -203508 -118077 130235
9572 72351 -40210 158208 11812 -132805 51891 -41213 -147725 -132882 80412 -59501 80708
9560 -166101 -221289 120163 48445 83741 100059 262892 122181 -104391 -243667 -109591
9549 49825 -146731 34789 118019 8554 -33790 72644 -374687 -207430 -106221 -149151 -28322
9537 -174628 -98361 -338279 -52509 203288 -22116 -31296 -33460 -67828 -245808 -195924 -121842
9526 -121842 -80442 -413834 -58964 -9512 -189698 -408205 -72670 217348 227936 58054 132694
9515 132694 -207234 187641 -7139 -318325 2506 -12911 -255883 -137263 -192821 -321573 -135426
9503 -95488 136601 72638 -668084 -89356 -52901 45193 -302879 45191 45922 217354 32110
9491 -1349 128953 317371 152954 -391414 -157197 -169723 178413 -77779 58935 -139125 -125687
9480 -125687 -258032 -171631 -197983 65669 8413 -33289 -27696 -115304 23110 49713 227821 93027
9467 -117214 -166579 33724 -306176 195067 148383 -73943 303229 -20348 -7917 -70877 -165376
9456 -165376 -3599 -61108 -469115 65567 -218379 22324 42061 78894 -310645 94391 47228
9445 47228 50949 76712 61701 -192536 -64890 -71767 52316 89548 198293 157771 -293405 -208579
9433 -208579 149916 -135630 -29315 -504212 -148712 211746 -348950 -301067 231662 -223058
9422 -33658 -12477 75077 18789 218684 -201043 116906 -18334 -261863 316428 81568 -57827
9410 284708 53828 -203165 13434 142078 241027 -263463 185007 14888 -23479 90299 98578
9399 98578 -39074 -179212 -77989 312597 243183 231590 132309 -407969 -128387 24650 -226397
9387 77143 -218133 -435488 -124301 -23048 17631 -94731 -142764 -48181 276960 -93404 -273134
9376 -273134 54555 -181810 1385 -248126 166842 -255293 132750 -111735 2509 -225620 216699
9364 128838 125559 -20835 -126274 -450141 100767 -71806 -404037 -168194 -21827 -222069 43882
9352 9513 614927 -196930 -3337 5366 -42657 -21637 219625 52923 -250927 -258673 -71943 -1817
9339 -219952 22737 -189200 -271938 -194623 -201623 35914 -118435 1924 105396 -59588 141463
9327 -137710 101024 -19611 -149422 -2259 125938 134845 191202 -351091 -139709 -273265 -205923
9316 -205923 -7736 -85767 -140809 -69688 -74750 12913 -205541 -123782 -78726 -135756 -170528 -480763
9304 -480763 148913 -147238 37959 203466 50782 -108834 235797 -5947 81829 -96534 -39056
9292 7979 -166230 -140341 69734 -111384 -329007 -106573 -63655 -89930 120045 -95708 -106418
9281 -106418 85615 59418 -317 -184003 -231563 -42725 -22063 288662 -41691 -480509 -111390
9269 -37442 -31684 -94497 17669 -68639 -439687 -293192 58733 -238013 188962 36981 -155003
9257 -154826 108170 -330934 -105185 155350 381286 -327391 -262399 136611 -40830 139092
9246 -244839 -151604 -180087 -151904 -166622 50759 81427 182190 76743 72558 4015 -7718 25228
9233 328507 -579 111017 114960 -344920 -25853 -354118 -190374 199178 -299824 -90720 -226719
9222 -226719 -159610 -30705 -76215 -75558 -361913 -268443 130496 -197855 235843 -56910 -181338
9211 -181338 93023 -102165 -7749 109619 73176 76641 -145916 -176308 -126453 -313198 -84161
9199 -221183 -80935 -183496 -116222 -263970 -372895 298714 129778 -62770 -39674 -378283
9189 -378283 -171197 24479 125751 -18175 -127055 29395 -62585 -122188 102715 -184912 -67550
9177 61808 233425 -28218 21892 -113106 -498133 112252 -189478 65594 -139103 -100460 104821
9165 279913 -38273 86622 -171437 -138636 -208249 12748 15974 -191921 -86741 -100558 -47310
9153 -172428 -186767 -211280 -38801 160270 -91605 -174628 324736 -89063 82879 -121600 60356
9141 84558 -45182 16474 89013 64264 32429 129501 -201258 48807 -226260 -123652 -45722
9129 -37458 12032 -333215 -323511 -97222 63821 -77288 76534 -169095 -70250 -305280 34507
9117 110252 -214505 -179903 -106009 -431332 -123390 114442 -155902 -464637 -72803 -22163
9106 -319859 -189155 287327 -68979 -112055 24082 90063 -203946 27188 -152622 -59969 -80522
9095 -80522 -6771 140024 -178166 -387553 -36294 -159581 213851 -198437 137315 -94386 -36433
9083 -269706 -43747 -136000 -133553 -13798 -49138 -147355 -146682 63873 4277 -210301 271519 24164
9070 -261153 152535 53978 -301995 -123932 -77264 241837 68246 -241172 -3410 -282948 172922
9058 -263110 171079 133299 -153878 -111586 -103458 -36360 -56308 -214638 -27606 81834 27502
9046 -227701 -241764 -214304 269723 -35516 211936 -53632 -194851 -173255 -140351 -58498 -186806
9035 -186806 60973 -107965 -49163 -32803 137797 -248561 -199129 -170120 -19082 153647 -168111
9023 -138368 87231 -175659 -54743 -46067 -114518 -157219 129818 53268 62209 -48700 -252044
9012 -252044 52579 -526992 -161151 -130313 36275 22228 166641 -105770 -95273 -224930 -369
9000 -97292 -202792 21665 -97708 -75610 9792 -173444 -13578 -451854 -10627 145080 -133262
8988 18794 -174696 148945 -296520 -214940 60289 184834 -190884 -112875 113802 316406
8978 316406 -95515 -167448 -92968 -86172 -16033 1755 -322 23583 88445 61980 -270350 48564
8965 299826 14 -399774 -22841 68776 -126856 40604 -225833 -289854 286563 -206472 -15024
8953 -218809 -71031 32511 3722 -95646 280969 -82596 77567 -81563 78179 90776 35468 -244059
8940 153651 121464 79495 -49114 -67776 -13882 162514 -55852 -345636 50233 -116664 -55239
8928 -92630 -453787 -237798 44012 39665 440933 1124027 2101530 2022379 396601 291423 31996
8916 126684 -165220 -108087 -203494 -70900 -11337 -10524 53937 -90665 174550 -87873 35251 196317
8904 196317 -267629 80884 -73065 -311780 54470 9242 -71629 -81930 181515 88086 -22302
8892 -389351 24082 -268092 107703 30771 -380507 163190 -190613 -162810 -134792 -195114 -152664
8881 -152664 -112680 -197387 234953 -144174 190702 -206321 103687 114663 46375 -36182 -85028
8870 -85028 179264 -297037 -242961 -68849 161673 54956 27871 187051 -292453 -617 -366456
8859 -366456 -156532 -222513 220112 88612 -69275 152828 69300 -66462 40989 -43068 63776
8847 110983 -142116 915 -210973 10455 -96959 -345665 -195720 -53008 102583 -135707 -189011
8836 -189011 48587 234870 -72727 16276 -306081 -192956 -162637 -100816 124468 41426 183409
8825 183409 -53797 271811 -170852 -27595 157783 54836 100944 3829 76207 -212628 152935
8813 -138893 -179475 -158636 115076 197319 188655 -218497 -76562 18079 -3944 -159704 -75244
8801 86816 -377275 -207208 -46346 203558 45480 193324 -37066 80792 -304863 -225650 14444
8789 -279288 -55340 -275368 -292109 -148638 -10360 10974 82032 81697 61862 18135 -144605
8777 93440 -11775 104325 37062 -370625 -169064 180851 179813 -104633 11934 100290 -60126
8765 -37586 94225 -73603 -196795 -283113 -38475 -290559 286942 99590 208025 -151385 -165378
8754 -165378 368644 -345294 38494 -42319 -318072 124480 43085 -212151 -3001 -8236 94087
8742 -58477 -104386 -205300 -61542 -169161 122864 -166833 -296986 -59952 183437 -391022
8731 -174331 -298363 -87284 144838 -118004 40318 171996 -159392 27978 -70260 3162 27857
8720 27857 156525 -106948 49965 62897 -362907 -164296 -232273 -10256 -22417 164421 -48280
8708 295703 -173669 -193600 -188306 -211186 -266276 183896 73130 -167926 -214680 -8841 29652
8696 167025 96579 -1757 316482 28626 -62495 89529 -226196 -63039 -107641 -7711 70278 -217269
8683 205088 72394 -227221 -122350 138995 -135737 -62548 -333403 178936 -244681 -101 459518
8671 -41322 -237107 -144728 3901 -17714 129364 14153 106022 302774 187232 -78168 -226376
8660 -226376 8366 150661 -37201 -21844 -297310 108411 -313349 -87603 206702 -321558 -175044
8649 -175044 217801 -358305 152291 -51464 -163910 29935 -76212 -54644 42964 100604 -23341
8637 81588 -271416 193195 -53700 -73831 -163745 -176699 20424 -60730 177592 -315765 -38677
8625 17925 134027 -62665 -372207 90711 -82524 26516 -153437 -266624 -158718 102948 201149
8614 201149 39755 51154 -171373 -358660 -308942 -245259 68496 -211399 -430340 -173140 410813
8602 -320678 -39284 -15454 -221547 109043 -155747 89936 -144135 84719 -103843 -52255 273055
8590 189096 -107777 -122516 -234887 239833 -179608 -6156 -100104 -122628 250550 -128647 93724
8578 -148373 -46313 -119793 62669 -113410 64332 -92654 -239772 19559 -187472 70491 333
8566 199759 -13174 -109882 -86542 -160895 -9342 -125295 -62746 158961 49743 85146 205010
8555 205010 -262885 -272312 79490 -17272 -16841 22957 -100299 150690 -8616 303408 -17922 54095
8542 -168165 -105417 -195831 79716 -23145 -269058 173317 131262 47224 -222596 -112852 -39065
8530 -311979 351458 -158579 -273167 66040 -105277 -205898 -188341 -13278 -226364 -118740
8520 -118740 208707 -133595 -156567 -280424 -65715 -249296 -151529 263542 159833 -274234
8509 191905 1140 -176404 78481 71633 -172785 -240812 -240876 -104229 -128199 -6250 239711 -55039
8496 -85467 84631 -20028 22232 135696 -34902 -31712 -239970 -79209 -4888 122060 104688 -120959
8483 -124234 -127890 -324055 240888 61197 203210 -154581 -196892 -937 194432 50511 -94991
8471 -157374 98215 -130954 137299 -41265 32285 92008 398633 24020 -36085 -245709 -97805
8459 108466 13313 76189 5713 -392386 -251675 -269792 -7059 -191383 -56644 -168063 78588
8447 26284 211521 -134412 203085 -316200 351916 -324539 -268889 -386805 -406445 79289
8436 -109041 -216471 -234450 -147568 27940 103048 -132120 67579 -167727 -31115 63306 -37388
8424 16966 -141873 -160147 321097 -176740 -47351 -98098 -89563 -382847 -812 295872 -261508
8412 -26977 -77825 -462809 -96701 -350365 -279139 137610 -324849 156018 -54362 -117808 -136280
8401 -136280 -188339 -96347 -289776 127248 32565 -5998 102702 -26202 99741 49811 -121724
8389 -375673 65093 -195450 4372 346539 109874 -264025 85255 259101 10536 -125014 -336558
8378 -336558 -19560 -322309 96176 -148381 75703 -327174 -289280 -406906 -172229 -160866 -153867
8367 -153867 154936 -125828 -204147 -242930 -107656 -81809 -37413 307126 -188665 -101848 -199550
8356 -199550 -53171 40992 -107542 -97321 138446 119614 30876 -170126 -215651 -286291 -46545
8344 45711 31716 -225321 60590 150128 -215163 -12836 74568 106009 35297 290743 56522
8332 -127505 -195007 230973 -77349 -284125 73215 -106030 134324 -163783 45247 312733
8322 312733 -253935 -76000 158016 209786 10680 -51078 330131 -69909 -237503 -245682 -47939
8310 -240672 200559 -242209 -31086 75907 -37176 25136 -57779 -197765 -18598 125375 -128464
8298 108403 43252 -23755 210059 -57441 208649 38156 -92996 -115032 -78858 -56630 -64793
8287 -64793 56070 -32217 -94465 101815 68555 -62531 65478 106144 -316145 -264132 40273
8275 -265496 220673 80902 71468 114741 -212732 -96153 43822 -177569 -156812 14943 120790
8264 120790 -58796 257237 -141871 -71716 -242717 -366653 -287655 164132 136331 59665 -166520
8252 237781 -179313 108239 -193704 -46661 -16023 90942 -95966 -796 233844 -244324 -341950
8241 -341950 235671 -128669 -117878 78675 -25137 34063 8275 -212736 -471524 -31976 -172246
8230 -172246 -114411 -122405 -40457 29415 -37202 -481796 -61981 -58021 -172091 70056 224499
8219 224499 275310 -78306 -119971 165015 239193 71366 -126031 73339 -117751 61686 40832
8208 40832 -394917 -1010 -33554 -188955 -124244 -7341 53332 -12106 -254063 111771 31569
8196 175482 46910 49908 49019 295825 47363 55963 -61990 -26072 94515 66554 -262855 -211565
8184 -211565 53554 -139764 27930 -40223 -60205 45552 -456018 50722 -12940 -114462 -131114
8173 -131114 -52689 -226248 54745 -350328 282874 -238142 82563 101897 173520 -445287 -12374
8161 -12222 -84561 -117388 37356 -242668 -76559 -12965 -78347 225615 -160558 -444196 -87051
8149 -349431 -35279 -56243 -305022 -88361 37052 75007 -206014 -319268 -234691 24197 -8331
8137 -415972 123291 186577 -206952 -120253 57930 390013 55930 -390605 -98458 96501 -374233
8125 20473 202312 -66575 -205642 -199216 -185448 -99870 55261 -80276 147464 -14622 126689
8113 -30330 -118702 81301 -67378 50465 210164 79974 27185 67700 286196 63967 133737
8102 133737 206722 36969 144856 108797 -153269 214633 104334 -45162 215636 107470
8091 -93287 -441617 -241050 -309552 214563 67682 251109 -156617 443890 50418 172718
8081 172718 308188 -25168 -226773 -210599 -95302 25522 148702 -328909 139191 37325 -60706
8069 -301695 -237741 -129721 -20500 258671 167643 -11414 146701 151628 14237 101636 145858
8058 145858 -291009 -200883 15199 185375 -1728 -324071 -144025 24928 177578 -166584 240076
8046 -63266 245337 111048 -160552 324857 -7468 -63342 -110353 -139419 63421 401175 -89668
8034 90059 -82285 -231248 1294 -44229 727 -59589 -336372 31801 -272511 51262 -115135 -105639
8022 -105639 -80110 19783 -83511 101255 135355 -108994 54457 35739 -293092 -112042 -229818
8011 -229818 -46703 204207 -55131 123894 -57810 -2084 -353424 113702 260417 -437221 -175850
7999 -206585 -328700 98225 -28040 -108556 -97513 417463 -246356 1952 -262437 17772 -167385
7987 292182 -141787 -93550 -41406 -40981 345672 -133044 -126904 -236504 -246285 -114922 264175
7975 -345554 -281365 -183785 108229 261232 -117268 16177 -184807 -24382 166428 -99922 147896
7963 -32529 -9231 -263131 12422 280185 -47123 -228152 235741 137265 -308537 -248607 229692
7951 52695 -143888 101640 -37928 -151816 21607 -184810 -157021 -95133 -43214 -117466 250415
7939 -126334 170938 -67478 132246 -218700 670 198039 -218384 29592 -420186 182561 102339
7928 102339 -40988 -329793 -218041 -102599 89642 -198988 -360751 58140 41238 -88213 121346
7916 -268494 -303123 25012 -127962 -29198 -49369 -11247 220099 -157246 99891 6289 -54906
7904 296079 -121219 -93160 57507 204030 -17701 -82195 -187919 262672 -119494 -21765 -108087
7893 -108087 73433 259604 -2220 352177 -150542 133446 64237 -221462 328501 -57360 -108906
7882 -108906 78478 168 141985 -3490 -28743 219430 -137928 111976 -285416 -144021 -187471
7871 -187471 -206038 303405 -130946 -169371 -84634 -4194 164880 -253581 202911 29180 -146672
7859 19989 -131242 -164551 172628 -131588 61034 103820 46488 33976 -797 -166795 -212397
7848 -212397 -154540 20951 -247426 183672 -29760 -272712 84087 -12416 -51422 43451 -365390
7836 14023 13202 -234811 -99378 201244 -101059 13134 86598 -71479 -405598 1037 158647
7825 158647 -161101 -137297 167700 -61696 158418 -93078 105905 -151940 -11348 175562
7814 254772 153861 -112103 -161002 -247270 -219259 -58267 -93552 -46571 -248879 76646 -171847
7802 -355986 -114620 -31649 284711 -28741 -87186 -69047 45367 -16759 -332194 -246947 35794
7790 44452 -133500 -76508 203722 -207893 -587262 -75630 -105394 -89708 -207442 127167 31866
7778 -149133 -427246 39904 -103983 -48453 589744 65211 205482 -195402 318532 -99726
7767 -276121 257244 -296371 -486290 -97699 -130938 312717 67279 -258435 -14373 276189
7756 -393858 66907 -144138 -123794 -311601 -110082 119646 -88190 -226722 227180 -137346
7745 -33382 22398 73554 139742 112961 -73529 -171050 -274924 -62298 -54682 144591 -96890 -137647
7733 -137647 120065 99766 8140 -63363 -248784 -231111 -128425 109077 -188992 15851 -4946
7721 -217740 19745 231064 -224663 -247865 186645 -258813 -166979 123435 127585 204515 248864
7710 248864 88927 -327453 -188689 -176533 -119879 84624 -151456 -63180 -72464 -51695 -282033
7699 -282033 -87702 -134279 -187499 -277016 -64243 5268 -340115 77694 34710 -155572 78213
7687 111746 -15119 7739 -11071 -41776 26139 -11185 450952 -51214 42374 -46504 157438
7675 -255279 -8266 43232 -235817 -61064 149776 -233170 -132165 -151593 21829 41996 -307644
7663 55197 117370 -49414 29102 -307936 184081 79050 5287 123206 134520 -93345 319992
7651 -139150 87828 -54390 -359120 86421 -71968 -152966 -18977 -195459 230723 -196880 -130714
7640 -130714 -109324 125233 103401 -214065 -42612 -94708 -80760 -261370 -266207 222489 -336781
7628 229818 -39903 -79311 -105340 -192885 12116 -89240 96942 -191909 -92945 170331 974 -180318
7615 206382 284977 -3471 5586 228116 -190073 -121437 228857 -11057 487411 265428 280761
7604 280761 -26388 -169236 2503 -309349 -361258 -56250 49301 -108610 8542 -108709 -145211
7593 -145211 -200916 -442650 -249184 -168334 17443 -326934 216451 -215154 -430116 103347
7582 -63396 -44562 58789 -43185 129666 -202502 -83829 -431851 -75156 -97197 -297578 234895
7570 284248 -169312 -282256 -131468 -109236 316772 -175178 -107252 -92888 -172183 -89001 -328580
7559 -328580 111102 823 -86148 -19444 125419 137280 -274884 201596 -151314 67275 190658
7548 190658 -376380 115728 -162825 -112489 -321240 -218000 -19314 -73657 -143571 -216925 -280698
7537 -280698 3191 -124813 -90391 -148751 -157381 -146380 -16169 146782 -139625 -109963 -203621
7526 -203621 -45129 87760 197231 -46930 43354 -137284 87383 57936 -366576 -26079 246447
7514 -280432 -169028 -196581 81019 194610 -39711 151583 79429 -91493 -93542 6186 241238
7503 241238 79616 -80471 -165650 -370288 44793 16467 216134 63995 18808 93267 361910
7492 361910 -232035 -124862 -99863 128633 -93539 -111574 -189586 -190875 234595 44911 127638
7481 127638 -175220 121175 -89243 -309910 287034 -209719 336211 -106119 -104077 -56397
7471 -56397 -175378 232767 -356941 185510 -222710 -10604 -170308 -9068 -14269 10847 -23165
7459 56011 -183983 -139347 -105711 68633 -137670 18633 155865 -10371 111340 -124982 39905
7447 105936 -255139 75732 96221 -164694 39433 -9932 62532 -29419 -315618 -169255 128591
7435 -31532 13230 84638 -208430 -291767 68297 -65613 90410 129870 254357 -223283 -41974
7423 -49515 -119512 -4094 196070 108979 66045 -245138 331162 230504 -221001 -58036 101125
7411 -417852 122007 14022 -104638 -222341 -132146 -19788 -159151 12024 -143719 -240457 -86384
7399 -338806 290243 -266616 271132 -332402 -265097 -158145 419727 -284042 -20835 92992
7388 -11718 126780 -234779 -122062 -164613 -174902 -179712 135222 150076 135520 -104110 -4696
7376 -127260 -9591 29749 202633 -194254 -62351 -460328 -303353 -383808 -41272 -379813 -211838
7365 -211838 -45625 63011 99318 -167757 -324802 110527 -24011 192675 -243690 -137002
7355 -137002 -115684 143397 109390 -150102 29952 257125 71866 25411 -346815 134061 9692
7343 -8776 294023 -178489 35926 198212 43298 -6787 350114 306005 127190 51968 47330
7332 47330 31034 -15300 453326 -40410 -388628 -28730 -72165 -38707 -79668 -60205 59675
7320 229392 -2312 -111994 148054 -99519 -135845 -125630 -17499 19716 88886 57748 358063
7309 358063 -239231 -147977 93884 -38213 253112 -74200 -49869 -52341 95913 89425 -324167
7297 79233 -197486 -12617 161875 -146293 17274 -210840 -123985 -26742 59710 12611 -182698
7285 -62846 220341 248903 171578 -264885 -435661 -210369 -140670 148471 244854 1714 -2174
7273 70765 66853 -125411 -233330 -93112 -86393 35862 86954 225438 18939 -151161 -439246
7262 -439246 107021 228207 -144106 89468 42027 -136881 -137840 -160388 57399 -136914 149844
7250 -73121 20660 -308817 258568 -43986 64286 188091 -231196 -162797 180734 87403 -106511
7238 -172031 -69871 22331 280225 128742 153312 112937 14428 205724 -265908 -371773 -54226
7226 -18410 4058 -504683 -129825 -71442 146933 71742 -115005 172169 -397825 -406751 -115767
7214 -131435 -151878 51144 49629 -148379 148625 37650 -58399 94121 -94402 183987 167852
7203 167852 41830 79995 10801 -247843 224771 -11511 -181795 -16242 55690 -158245 111904
7191 45979 -276160 -236925 -12606 -63713 12984 -320291 -92404 -344768 -76781 -443291 130263
7179 72537 70367 -225109 291800 106485 -160436 -109247 -72614 -147142 -24380 46886 245320
7168 245320 139933 -71292 76997 -181442 -32116 -48077 93175 107260 -60926 -363976 15994
7156 -82980 36992 65685 48548 -170130 -28131 -101882 -296061 -98127 -378172 128444 -120988
7144 -218086 -278447 -307586 -168797 127737 -50755 15503 -146252 -99164 -372600 12621 99283
7133 99283 -57145 91528 -32017 -54304 231515 -43046 -303901 -90143 -9343 -221046 370343
7121 -244156 -78207 303458 -242148 -48712 -167934 -127566 99783 5817 -201753 376000 -325081
7109 133122 -17045 -213092 -50719 20973 -82571 68998 -105606 -15035 -136969 -69967 -298020
7098 -298020 -87113 -68626 99876 -55720 123502 90732 -209444 -52078 278571 196331 -485737
7086 47553 157739 213727 -248684 -92632 6695 253999 -19181 -50101 -148359 114036 -188435
7074 36222 -296365 -225433 87860 -258251 68133 178392 -25409 -18588 39550 -85314 -61852
7063 -61852 286113 112723 -94942 271731 -341217 77395 378743 -320288 -71044 -71072 -151549
7052 -151549 8762 8788 -334896 255804 -138413 63037 173678 -229198 -103166 -212976 84844
7040 -143298 194454 -204681 -427627 178121 140825 421306 -24164 78581 -60107 -157967 57146
7028 -215405 -29190 43519 95015 196800 -70932 40245 17976 316669 20802 245870 34300
7016 -240883 -172147 -141210 -64331 -131141 -86326 -186849 -319926 -264000 338228 -322630 -81200
7004 -85997 -14572 -158055 -115901 -134576 178082 370517 -245326 -65715 482623 119127 190053
6993 190053 70260 155370 -294424 122562 218956 38138 5457 5734 18360 -186738 76596 46530
6981 46530 168742 35023 -209161 -255446 138186 1207 -174522 -394737 -102237 -98204 63374
6969 -114868 11302 -199582 -198721 46211 -256277 193405 60809 51567 8869 23725 -89417 -39951
6956 141063 67270 123620 27779 -41453 -237369 204814 137893 86941 -88165 118107 -240586
6944 -57377 -19131 -17144 26863 -225133 -217493 -328183 -7260 239799 -71478 119978 -36063 -173313
6932 -173313 -309281 186065 134481 -211757 -204113 -19588 -272510 -143697 -149296 -219050 -75102
6920 135016 -238748 -39065 -136708 -243930 -71805 -87271 -74458 -117282 178972 -228151 59107
6908 -226659 -40650 -91456 150363 -204278 40359 -215312 -176463 -92948 -70030 91173 -132401
6896 -145934 -53076 -23487 40211 34332 -194535 27008 -50249 -48727 -100551 -61877 42918 -54443
6883 388907 -33342 335181 -367189 46649 219075 -63118 186873 -126563 66715 398357
6873 398357 202277 -120011 74797 44830 37841 61846 -271286 -370230 -319734 153724 -192263
6861 -212475 57700 223453 48839 275048 -248452 164352 173936 -223239 -3126 22222 -206068
6849 -301596 -19096 -152789 54118 183646 -157352 -383000 -131420 -132578 -123418 -74752 158236
6837 26303 -534504 -85532 -410795 -308759 39776 -113554 -21839 201718 -222266 -102586
6826 -246745 167862 -414587 98172 -39498 -22867 23521 -54995 254902 97596 116951 177483
6815 177483 -25089 -195357 38195 155529 69214 -199837 109 -123680 18140 -175042 -82294
6803 -66413 -27315 253130 -20585 173355 -46663 -210308 191759 -8699 -51660 -16665 123611
6791 119010 -27277 -195484 -190831 -230542 66200 -152212 -77815 -53701 88557 -255933 -146244
6780 -146244 -355932 -76681 -192144 -103084 -90618 39838 -209855 -48947 -472411 36949 112309
6769 112309 73698 -100259 29738 -157521 240178 -209441 -137669 7840 -137314 -353040 140059
6757 -356814 70019 213452 -8139 136872 296948 230451 -374234 177031 262459 -68385 -45951
6746 -45951 -79237 -99229 174407 76387 -88021 98468 207271 153987 412305 44903 -345891
6734 -152037 17097 -160969 59188 -110852 -78900 -101203 65623 224987 3972 -413634 -44785
6722 -52943 67959 277420 -36902 201282 -84170 -99467 40512 -38131 -321982 19531 321356
6711 321356 66932 -271057 -163752 160994 92084 -9930 -58992 56762 138129 -105126 -282309
6700 -282309 -337221 230911 123776 -155066 -30706 -269324 -125587 45249 117587 261238
6690 261238 -256455 32072 -130329 67949 -69011 180559 34890 22975 -194482 99884 -233836
6678 -109271 175527 -291151 -165836 -363976 -86301 -16697 -182534 63796 -127369 -57475
6667 -168944 263299 -25546 311800 -87260 81063 -18484 -211628 230571 -32602 96876 229701
6656 229701 -60092 -48264 166680 -101219 -198726 -141896 -30243 50608 66734 85282 116987
6645 116987 -13440 73245 -169366 38911 -124052 211128 53199 484084 1613 -178743 -230107
6634 -230107 -57236 -46980 -45860 46424 148040 -22989 65979 -16084 36583 267952 121559
6622 -40777 -28356 127095 71256 -126989 -92335 47 -130077 36857 -13786 60843 -276717 307729
6609 333178 -60059 -75849 1039 -74387 3974 121055 -154310 -402594 206157 59402 250240
6598 250240 -229781 -249268 30883 -152521 5180 -112446 -106784 181146 25225 118109 -163721
6586 -40258 303320 266670 128289 -186864 223992 2599 -147610 35732 -218895 56808 -138922
6574 -186371 -36707 -180890 -207911 70104 95610 -36972 -190042 -96640 -6649 152760 127200
6563 127200 -263638 -367435 -209253 -156786 -134964 59116 -79412 101959 121557 46160 -24859
6551 146426 120632 -196541 -49480 93138 160625 15647 130223 -360253 218716 -154486 -180137
6540 -180137 -73463 203738 -251821 -49274 -4396 305326 46700 253354 297309 128773 -134955
6528 31188 -67240 48474 -176506 146837 -171855 -193855 179459 -413261 40308 -412662 227387
6516 -123412 -71128 -58060 28488 180599 -235467 -74961 86540 -132063 32983 -50486 246218
6504 70343 -36959 -20857 198387 258181 -260775 -130401 65790 -259197 -27254 -37619 -197393
6493 -197393 -40395 157101 -202414 -83268 99051 594 -217623 -158569 -187658 -90851 -167662
6482 -167662 7244 -78901 -143908 -180941 58856 -3724 277184 51614 -26395 -14714 84725 -241454
6469 -113865 246525 -225871 -16384 120982 -412626 -34952 217953 -240051 421614 -163722
6458 133563 -78668 -94140 21985 -88732 182561 130591 -104633 -34128 160082 -244710 -113608
6446 -36639 -171109 290647 -360697 100625 -143948 246768 -216397 -211807 -115566 -55747 219189
6434 41470 -47066 2360 -31145 -156068 84364 264518 -102176 -37961 -591359 -203451 -14849
6422 -87769 -269816 -75845 -439277 -189410 117814 -340225 183379 -213097 -44672 -345782
6412 -345782 -40111 52635 -52911 17182 -125056 -36645 268790 -1928 213592 -153477 169172
6400 -472950 109685 123 227767 40649 111683 -93895 242493 -216213 -19791 262369 141194
6389 141194 -208391 168700 227794 237780 -122752 117174 -197762 101290 -154741 -48506
6378 -197838 100951 -294639 29078 -232689 -121441 -23991 -73887 -211090 -88645 90675 -153498
6366 -30394 -144451 62629 -81821 10492 -242028 -241916 99645 26962 58533 -154169 -90315 -307393
6354 -307393 -73682 81186 -484116 146956 316438 -40510 -17000 -175320 -191086 -131696 91065
6342 105087 -267426 -306300 344150 232165 194088 -206155 116284 -19903 55298 -285569
6331 50581 19595 95484 -168221 -146705 -132681 -60508 -103793 -50742 92003 -78773 224035
6319 -181678 -16929 -151064 -2746 -144594 202339 164525 27188 112229 -175245 -30044 -138961
6308 -138961 -236819 -60566 -69724 78192 14952 -149178 209127 -113956 -256352 -3772 100719
6296 -86493 42242 249083 -57091 51156 -52933 22804 48212 -167832 75419 -82403 -274465
6285 -274465 21837 79016 -258003 140192 -6688 -44754 -116204 100421 314152 -240289 222459
6273 314401 186262 -79752 408994 181883 -17365 -162365 -64162 60392 -218962 -162586 -51488
6261 112018 -378752 192618 -106031 -5260 -325422 -185311 -199052 19776 201162 -5998 -207387
6250 -207387 -1459 -4873 215998 32823 -147032 133047 -122361 61842 -152926 159354 151601
6239 151601 -249612 215253 168494 -99559 -80803 233452 -207390 268666 -126758 -112262
6229 -112262 14965 169996 -17146 -54797 118869 -46248 232974 243034 -81487 93982 78261
6218 78261 124929 28316 127702 -438584 -333877 -59932 -98901 209789 86807 156156 73863
6206 -77105 -13615 194921 -161513 47498 -141030 132060 -272420 170037 -232385 6013 -135791
6194 355705 16064 163633 94259 -242724 -140570 -13310 -227359 -270330 -165750 -143385 -68169
6182 -210111 115444 261364 -187080 -72301 -170029 296725 -143212 -6701 5698 23754 16860
6171 16860 -88361 170685 -36387 -150987 -188080 102127 -52143 213317 -225878 69689 -12151
6159 212569 -189135 21683 70638 -9005 -75713 -39103 -45081 -147304 -175479 98420 306385
6148 306385 172969 -63482 216434 11771 -219568 9842 103326 11289 140263 133911 -137516
6136 206036 -217365 -104505 83624 -265392 242560 -302090 -195062 -49383 -51859 -39744 7045
6124 -57229 -496757 91484 -69633 76468 61320 -70377 -45432 -206259 45473 -80467 -472174
6113 -472174 277194 377714 -123409 152972 -430015 290687 6348 -281507 161164 -31149
6102 -184542 72760 42662 168002 -297792 -378586 -173407 -73283 -27203 -24110 -170499 32967
6090 -417696 -463827 57467 228568 -24466 -126788 -271905 124121 184955 -106378 36585 2105
6078 -89528 163775 -149468 143372 96894 -2 60693 100449 -31746 -168104 189527 -312510
6066 -106522 3896 193618 -212202 -21781 17715 178267 40912 -31498 -131384 -110536 -130869
6055 -130869 109281 -240187 -152427 -209478 -50610 283220 207397 -167243 -3188 304684 -200548
6043 170003 440379 156604 -252672 231786 -300471 -2459 -186647 230094 -146813 -121063
6033 -121063 -18503 -132327 -66146 56373 -307450 49269 207570 144804 -35566 77807 -63202
6021 2108 36414 -10918 -127329 136777 116381 369079 -22348 138471 46854 -182458 143477
6009 6302 -12842 -79062 41392 -48041 166262 128000 181718 195002 30727 -15589 420289 118082
5996 -61525 -86542 178381 -59391 -145564 -479096 132515 -54525 45858 -32739 -196119 -162848
5985 -162848 9220 -392728 -257919 141696 18112 165411 -25327 -80713 -214489 61909 77704
5974 77704 -122149 -159246 50701 52158 105181 -124323 -99840 377534 -100091 -23393 -62121
5963 -62121 -266463 -34554 17800 141903 175340 54457 218091 -160409 -199626 119573 114915
5952 114915 -328516 -62560 -49058 -46120 -309767 49909 -150881 213279 -130175 130910 -212400
5940 65252 -132477 129950 159109 21257 -16 -16349 1286 -242672 -78484 36976 29205 -124208
5927 -413419 109575 -4467 214089 -102140 87092 12557 -162366 -213397 120465 -155749 44576
5915 -96510 -105942 140197 26696 -108644 152770 217870 116413 -189747 -261783 -128822 78143
5903 -9140 519389 -341325 150384 -40057 -102428 -211491 -72808 110100 200161 61817 -159598
5891 -225355 -90009 29452 52740 -121889 155912 -73693 81274 163100 235385 207372 403318
5880 403318 -172255 -148325 -99334 -135301 115621 24983 135428 -148705 -41831 56212 -237705
5868 -174499 -131389 65655 456719 98291 159343 75469 -179717 70436 -74496 27964 -118105
5856 -63974 169182 -164473 421969 206673 -196742 -89703 193158 129542 165225 621 -15773
5844 14183 81945 266449 134413 388471 -150265 -212361 -166477 -111143 51721 -188496 -292504
5833 -292504 49634 -223184 -249095 143042 -70787 90187 -118901 -268284 -86221 -83852 -150943
5822 -150943 -2439 109316 -201068 314943 -242559 -107686 171710 172624 -17614 63798 202839
5811 202839 73884 -18245 -169501 -44669 47754 1956 96236 80778 203748 11319 -364983
5799 129387 -126609 -172431 101420 -77807 133141 -181279 -219753 -75357 -131063 -4496 177916
5787 -411267 291066 -56542 186404 54594 -100936 -35668 -91485 -181203 -124980 -91400 302656
5775 152709 -71527 -125214 -34768 132936 -386603 250686 -300359 -66635 42529 380198 -197507
5763 -53622 -476418 27354 -38285 -166232 304571 -185532 -122831 140165 -212432 -39803 -18906
5751 -191070 -91474 -351367 110435 -34901 -211317 -16035 417859 28940 151632 155480 32532
5739 9318 14215 -171442 109956 145850 51002 16301 -53535 16907 93648 319910 277326 140636
5727 140636 158496 -74967 153467 -141744 -89777 248292 -181146 -139453 -43400 293938 14700
5715 -60177 106248 130745 -272366 -175960 -109257 -98481 -6760 -147420 25648 -214470 39211
5703 147324 -269517 -320104 -161153 -178865 102642 -29794 153654 -171448 -9052 -26948 2910
5691 -142240 970 71358 283225 111019 -147839 -270630 -207080 -363563 29158 -28351 76376
5679 -337790 50972 -5201 196400 172653 4653 -151233 -354507 167638 28666 -85755 -112738
5668 -112738 -71219 -124862 -377930 -204974 156538 79193 -82975 208205 -56141 -324909 100335
5656 23010 75304 -82920 -48599 28196 -169327 -8695 92071 164894 129854 313008 47963 199671
5644 199671 -87066 13761 -98211 36408 120300 55488 21480 -67352 -96394 -154968 -136985 -50990
5631 -25016 -183 -17050 -294823 124660 107042 -119239 217389 -184039 -19486 89666 187765
5620 187765 -291266 -131048 248900 33974 26162 -153570 -63096 54201 202831 100187 82755
5609 82755 27241 -6439 -11766 -70572 -67345 148415 -82756 41767 167592 104575 64718 118881
5597 118881 -94592 -309605 251080 -179260 64161 342162 -305045 188554 105250 -25687
5586 -110987 315066 -357639 -137855 197701 -97497 7573 -182440 81137 182070 76540 -321962
5574 -254391 -318820 -398160 141101 -208710 103719 120804 152879 109786 -205397 -84807 -49555
5563 -49555 4757 140575 -180627 -58930 143559 -267169 276775 -34987 -247634 -8659 -196352
5552 -196352 220009 -54181 129893 189881 -251004 -165579 -194326 -229653 63081 -65637 -89564
5541 -89564 -100699 -110921 -305365 117037 -343489 -87168 302549 -179723 70510 -182883 -57359
5529 197814 3815 60004 -33093 296577 278126 -28187 45787 198162 178991 67198 -302691
5517 170730 -82097 88468 154813 -201729 -201470 -168502 46375 -253165 -18905 13163 -86775 232790
5504 435260 210010 194471 -240754 45373 268197 -188837 -92062 -143223 190527 58064 -250951
5492 -103448 -31743 188061 -69299 -10390 17172 197142 101306 -4482 -180603 39967 107272
5481 107272 -107110 -341671 -20618 192928 -294975 -308183 -463 115931 2466 -159070 -105026
5470 -105026 -75163 -292748 87432 24140 -47726 -20652 235636 -4084 43584 36736 207740
5459 207740 -173720 -195918 -44627 190821 -165104 13884 -300062 -184647 328230 -32036
5448 -63289 -117464 172790 81874 78797 -478609 -321363 68000 183447 82592 148260 -79270
5436 -153676 -5625 -74624 -7904 -268175 201951 53666 78793 -94214 -71796 -180845 124568
5424 -180461 -133923 -154828 -67335 5307 16468 120480 186753 146262 144336 47884 -436216 -124204
5411 140340 -101568 27722 144204 -247727 146600 -121124 88148 -78194 19077 -67658 27906
5399 152078 -106514 96787 34434 -135476 131278 80286 -265052 4736 -232720 -202516 -95200
5387 -175055 113512 -78250 70207 172680 275350 82717 222312 23090 -45495 179341 -33686
5375 186718 -183013 -75427 -372268 -72278 -171529 -171810 -22719 36956 -94539 -14527 216934
5363 225842 -49144 -121804 344528 105170 -46164 -317173 -207279 -21164 118602 -16298 -62817
5352 -62817 -495162 -163298 54716 -212632 117910 -311314 149549 -79378 275164 125908
5341 -79608 -193498 113885 140676 159188 -7906 -35421 -62539 -120548 7659 87368 -39944 132194
5328 6669 -13644 272266 142457 294453 -165196 3502 -227974 52761 290564 39704 122172
5317 122172 -163799 65548 107127 99753 -15457 -95402 494259 317928 -108863 163141 -13464
5305 278196 -274123 -448279 -334669 -194180 -70726 -223333 -126434 -192354 -197487 76063 -184425
5293 80825 -205473 -381932 80734 -105284 256633 -35809 135913 50987 6012 -72055 166263
5281 -95142 355532 50822 11834 109913 -156957 70954 -77448 -73139 -308040 -32413 -58321
5270 -58321 -110479 209601 -161281 -76992 2826 -62760 -15446 143506 224678 -298055 3939
5258 -47076 138616 -298983 96700 251405 84815 -84854 44285 85460 -207389 -69179 -98598
5247 -98598 115726 -145642 20708 -28998 29436 156337 -62687 291666 -217799 50750 91988
5236 91988 22250 86466 130980 -60083 -295019 216122 147829 -171843 143475 -204597 43417
5224 148593 -97758 80976 -215706 -56499 228683 175131 36257 -10950 1419 -95423 -12145
5212 275083 -121106 211715 215208 114622 -290973 79821 -225820 -112185 -15302 -285434
5202 -285434 -40371 2415 -290643 -153263 204997 -52314 364441 -120885 358300 -111737
5191 74539 88134 59341 126570 21231 247726 12783 -90475 87449 97134 -241799 71472 -107861
5178 12573 -227517 114076 -369412 212959 136451 147561 14971 -365989 321805 -189926
5167 22933 -126462 -183932 84677 166963 -176585 -154100 38881 -88360 273081 255793 232138
5156 232138 -57923 -39598 366504 -4763 -77768 -61268 -442903 -325100 57681 259227 -95028
5144 215613 37894 -86658 77594 75048 42981 27295 -192967 -345140 -191923 -34506 63525
5132 177361 -127286 190715 45917 -6443 -194757 -155675 -58543 303341 86416 303517 29844
5120 50932 182244 144320 -8557 157483 -98191 -232469 207224 -58673 -124594 -330124 -147697
5108 -284450 870 126596 -39706 -91075 329619 -192189 -207927 3694 -84044 71674 85570 -121469
5095 -187821 -203407 150742 -299898 3276 -15492 233038 -16837 466925 -54858 78291 -68980
5083 33119 -30608 157365 -156282 46680 -174256 69044 6077 -204516 -392594 -91940 -144619
5072 -144619 407498 -105348 8749 -137586 -188676 -74914 5390 537 35683 295888 -60207 -153388
5060 -153388 513792 64601 73649 175764 254741 83517 -5197 -129072 84 390718 -144397 192208
5047 -155822 81901 -351277 136699 110049 -10271 345046 154741 111843 -373131 7135 406148
5036 406148 64377 -7504 -42489 -37123 -1158 106305 127888 -219352 -174884 -27569 -110385 193980
5023 -17377 174566 -247897 -219007 148506 47497 108548 -11256 15238 23032 202799 -22989
5011 -160265 -132790 4234 274404 -175990 -322749 78978 -58009 156421 -305355 -61192 -182671
5000 -182671 44127 -178055 30905 -15387 -719 -144787 -253469 201565 284424 -97292 30579
4988 -12356 79520 -263043 -101230 -162382 -239867 -167225 -44047 13933 -159605 -96788 32685
4976 152572 -168936 155249 360578 -56102 -123677 81393 -140879 137808 -298269 -59880
4965 148762 -88291 -43925 403402 -160017 151915 22152 158318 32383 -40063 -441794 107121
4953 1780 -321810 224337 204587 -42836 -127697 85358 -68489 -245894 -62773 147030 41546
4941 -525127 158442 -24376 173809 -513344 160803 -159935 -15267 -77676 -84785 125358 59176
4929 119287 343741 7698 -51981 20296 34911 44274 95832 -176172 -217052 -100977 148868
4917 72591 -118943 -315445 201829 -308406 -76510 7080 -49995 180613 2878 16109 -175172
4905 255577 -549779 23163 -62292 -57018 -93345 -41730 -54473 132312 -88593 147616 -164881
4893 -129865 62710 58975 14425 -203043 -172250 203374 -139717 -39509 -239151 82937 20220
4881 146664 -408248 179068 -25289 -264089 -161172 228459 -116233 98142 159718 -337080
4870 49841 324253 -363539 -232559 -148190 171148 97693 -121843 48406 337601 40542 -195510
4858 182275 -152065 -180940 -59141 54879 161739 -208966 -162566 -181280 202416 216553 6170
4846 16678 37438 -12508 -44610 -112049 361003 69669 -82907 -179112 -93936 -79892 51022 154039
4834 154039 153813 176776 153487 73 -1224 -163455 -214667 -142901 -186044 -261954 -20035 280983
4821 -234044 -47724 -127547 70338 -83685 360606 -58267 -3495 10561 -312229 -7303 -73858 -76863
4809 -76863 37614 140047 450760 -22512 -13787 246820 546727 28691 -114521 70163 -14865
4797 -86246 -240985 -359787 231871 -121208 -48202 64477 -220708 113601 -18557 -138160
4787 -138160 52972 4258 340839 -77332 29553 260852 65337 -86034 -230959 195292 265671
4776 265671 63162 -109773 -369620 -96436 -139153 215898 77614 -362364 -30373 -93673 -190043
4765 -190043 -49363 151832 43450 173384 283361 -96572 -171304 286276 139638 -75159 101199
4753 -364335 -48095 115557 242212 173545 -2470 -83577 -218373 4446 -7560 -55958 -19 45377
4740 -182461 -378157 66246 90958 -4467 -20373 91075 -28108 -114481 122036 109105 334934
4729 334934 81439 42742 3762 -160413 384326 -91885 56154 -184638 209795 -43992 -275764
4718 -275764 75056 -87185 -183184 51998 -9948 179381 -8387 136466 10723 -149221 -243703
4707 -243703 242505 -209098 177651 -83441 -107899 -58054 191860 100557 214369 -89836 -161984
4696 -161984 20655 255363 116606 332536 236394 -64901 211038 21191 227041 -221256
4685 87905 98651 165018 -160135 100843 155458 -69016 62992 -193675 -106702 147207 -146444
4673 -19876 155340 -130103 237504 67801 -136829 111835 47898 -16072 43734 -51161 274912
4661 78547 -307290 122676 68711 174886 243729 156743 -51003 200347 154024 -5095 57311
4649 -33227 -5577 122893 223794 -41933 15402 29276 57090 21232 -200526 -85098 -378383
4638 -378383 -156172 -4510 -175405 116334 -108085 -99268 -174071 -242066 305470 46776 -187949
4626 492139 -123490 94414 138446 76793 -147690 -439336 50070 -68068 -113693 -159195 45295
4614 922 -139732 280068 138619 89056 -189265 -37681 275828 142239 172040 207776 26375
4602 190314 39024 -200425 -5917 -322023 322113 -193432 -110550 -97373 121203 -200394 -243267
4591 -243267 -198692 311207 -61193 -22549 -143479 -55904 -93346 -16370 -24392 128199 -257157
4579 7804 -143554 -15654 -88491 -233292 -37323 13097 -114686 177850 -130635 -78956 140230
4567 -18389 -471215 40636 -10600 -164159 -290362 24484 -194142 254618 -56723 301144 56055
4555 28342 45646 15592 -77593 -167109 208772 -244439 145105 -268705 35588 420337 190493
4543 -176628 -118870 -366187 66729 74391 -259448 64146 134497 233578 -320454 -47449 -213907
4532 -213907 -62966 127484 371126 -188319 -383780 159797 -202597 -119109 -347559 -220387
4522 -220387 298546 302669 -121491 -66518 286934 -19114 -103878 35441 82036 129368 -50395
$$ [...]
##END NTUPLES=NMR SPECTRUM
##END=
