##TITLE=AC1756_VAR00028_9319824_1CXsmxYH48
##JCAMPDX= 6.0         $$ Bruker NMR JCAMP-DX V2.0
##DATA TYPE= NMR SPECTRUM
##DATA CLASS= NTUPLES
##ORIGIN= BRUKER
##OWNER= Administrator
$$ 1.72 TOPSPIN		Version 2.1
$$ 2015-08-11 21:19:14.257 -0700  Administrator@X
$$ Compression mode = diff/dup
##.OBSERVE FREQUENCY= 400.02188249412
##.OBSERVE NUCLEUS= ^1H
##.ACQUISITION MODE= SIMULTANEOUS (DQD)
##.ACQUISITION SCHEME= undefined
##.AVERAGES= 64
##.DIGITISER RES= 22
##SPECTROMETER/DATA SYSTEM= spect
##.PULSE SEQUENCE= noesygpps1d.comp
##.SOLVENT NAME= COFFEE_meoh
##.SHIFT REFERENCE= INTERNAL, COFFEE_meoh, 1, 14.96081
##AUDIT TRAIL= $$ (NUMBER, WHEN, WHO, WHERE, PROCESS, VERSION, WHAT)
$$ ##TITLE= Audit trail, TOPSPIN		Version 2.1
$$ ##JCAMPDX= 5.01
$$ ##ORIGIN= Bruker BioSpin GmbH
$$ ##OWNER= Administrator
$$ $$ E:\/data/COFFEE/nmr/AC1756_VAR00028_9319824_1CXsmxYH48/12/pdata/1/auditp.txt
$$ ##AUDIT TRAIL=  $$ (NUMBER, WHEN, WHO, WHERE, PROCESS, VERSION, WHAT)
(   1,<2015-08-11 21:19:08.789 -0700>,<Administrator>,<X>,<go>,<TOPSPIN 2.1>,
      <created by zg
	started at 2015-08-11 21:07:39.210 -0700,
	POWCHK enabled, PULCHK disabled,
       configuration hash MD5:
       21 0F 79 D6 B3 7B B4 F6 88 20 88 DB 03 48 BD 9F
       data hash MD5: 64K
       FD 07 6D BE 7F 1A 0D CC 0E D8 87 C0 91 00 6A 94>)
(   2,<2015-08-11 21:19:12.132 -0700>,<Administrator>,<X>,<proc1d>,<TOPSPIN 2.1>,
      <Start of raw data processing
       efp LB = 0.3 FT_mod = 6 PKNL = 1 PHC0 = 0 PHC1 = 0 SI = 128K 
       data hash MD5: 128K
       39 6D 11 89 4B 6D 23 E5 F5 61 ED 45 57 61 E6 61>)
(   3,<2015-08-11 21:19:13.023 -0700>,<Administrator>,<X>,<proc1d>,<TOPSPIN 2.1>,
      <pk PHC0 = 269.7308 PHC1 = 0 
       data hash MD5: 128K
       A4 2B 11 A7 0F 42 C3 13 AD C4 14 AA 27 53 5A 37>)
(   4,<2015-08-11 21:19:13.429 -0700>,<Administrator>,<X>,<proc1d>,<TOPSPIN 2.1>,
      <abs ABSG = 1 
       data hash MD5: 128K
       19 4A 07 CB 4E 37 82 5A 6E AB 81 25 20 69 5D 4B>)
(   5,<2015-08-11 21:19:13.539 -0700>,<Administrator>,<X>,<proc1d>,<TOPSPIN 2.1>,
      <abs ABSG = 2 
       data hash MD5: 128K
       0C 3D F0 70 52 D4 EF AA 74 42 F0 58 19 27 1F 17>)
(   6,<2015-08-11 21:19:13.617 -0700>,<Administrator>,<X>,<proc1d>,<TOPSPIN 2.1>,
      <abs ABSG = 3 
       data hash MD5: 128K
       9D 76 21 E5 C3 D7 22 6B A0 4B 13 D8 F9 A4 47 D5>)
(   7,<2015-08-11 21:19:13.710 -0700>,<Administrator>,<X>,<proc1d>,<TOPSPIN 2.1>,
      <abs ABSG = 4 
       data hash MD5: 128K
       9A 6F 3F 78 E1 C8 38 3D 49 61 84 A5 88 20 8C 48>)
(   8,<2015-08-11 21:19:13.835 -0700>,<Administrator>,<X>,<proc1d>,<TOPSPIN 2.1>,
      <abs ABSG = 5 
       data hash MD5: 128K
       CD 3E 79 52 0E A4 D0 FF DE 47 D1 B8 00 E7 69 4B>)
$$ ##END=
$$ 
$$ $$ hash MD5
$$ $$ 82 EF 30 CC D6 E9 4C 4E 85 38 B2 77 78 5B 68 6D
##$RELAX= 
##$RELAX= 
##$RELAX= 
##$RELAX= 
##$RELAX= 
##$RELAX= 
##$RELAX= 
##$RELAX= 
$$ Bruker specific parameters
$$ --------------------------
##$DU= <E:\>
##$EXPNO= 12
$$ [...]
150 150 150 150 150 150 150 150
##$TP07= 0
##$TPNAME0= <>
##$TPNAME1= <>
##$TPNAME2= <>
##$TPNAME3= <>
##$TPNAME4= <>
##$TPNAME5= <>
##$TPNAME6= <>
##$TPNAME7= <>
##$TPOAL= (0..7)
0.5 0.5 0.5 0.5 0.5 0.5 0.5 0.5
##$TPOFFS= (0..7)
0 0 0 0 0 0 0 0
##$TUNHIN= 0
##$TUNHOUT= 0
##$TUNXOUT= 0
##$USERA1= <user>
##$USERA2= <user>
##$USERA3= <user>
##$USERA4= <user>
##$USERA5= <user>
##$V9= 5
##$VALIST= <valist>
##$VCLIST= <CCCCCCCCCCCCCCC>
##$VD= 0
##$VDLIST= <DDDDDDDDDDDDDDD>
##$VPLIST= <PPPPPPPPPPPPPPP>
##$VTLIST= <TTTTTTTTTTTTTTT>
##$WBST= 2048
##$WBSW= 25
##$XGAIN= (0..3)
0 0 0 0
##$XL= 0
##$YL= 0
##$YMAX_a= 6081141
##$YMIN_a= -11786327
##$ZGOPTNS= <>
##$ZL1= 120
##$ZL2= 120
##$ZL3= 120
##$ZL4= 120
##$ABSF1= 14.96081
##$ABSF2= -5.597372
##$ABSG= 5
##$ABSL= 3
##$ALPHA= 0
##$AQORDER= 0
##$ASSFAC= 0
##$ASSFACI= 0
##$ASSFACX= 0
##$ASSWID= 0
##$AUNMP= <proc_prof1d_extract.lims>
##$AXLEFT= 0
##$AXNAME= <>
##$AXNUC= <1H>
##$AXRIGHT= 0
##$AXTYPE= 0
##$AXUNIT= <>
##$AZFE= 0.1
##$AZFW= 0.1
##$BCFW= 0
##$BC_mod= 0
##$BYTORDP= 0
##$COROFFS= 0
##$CY= 15
##$DATMOD= 1
##$DC= 0
##$DFILT= <>
##$DTYPP= 0
##$F1P= 0
##$F2P= 0
##$FCOR= 0.5
##$FTSIZE= 131072
##$FT_mod= 6
##$GAMMA= 0
##$GB= 0
##$INTBC= 1
##$INTSCL= 1
##$ISEN= 128
##$LB= 0.3
##$LEV0= 0
##$LPBIN= 0
##$MAXI= 10000
##$MC2= 0
##$MEAN= 0
##$ME_mod= 0
##$MI= 0
##$NCOEF= 0
##$NC_proc= -2
##$NLEV= 6
##$NOISF1= 0
##$NOISF2= 0
##$NSP= 0
##$NTH_PI= 0
##$NZP= 0
##$OFFSET= 14.96081
##$PC= 1
##$PHC0= 269.7308
##$PHC1= 0
##$PH_mod= 1
##$PKNL= yes
##$PPARMOD= 0
##$PPDIAG= 0
##$PPIPTYP= 0
##$PPMPNUM= 2147483647
##$PPRESOL= 1
##$PSCAL= 4
##$PSIGN= 0
##$PYNMP= <proc.py>
##$REVERSE= no
##$SF= 400.02000971173
##$SI= 131072
##$SIGF1= 0
##$SIGF2= 0
##$SINO= 400
##$SIOLD= 131072
##$SPECTYP= <>
##$SREGLST= <1H.CDCl3>
##$SSB= 0
##$STSI= 131072
##$STSR= 0
##$SW_p= 8223.68421052631
##$SYMM= 0
##$S_DEV= 0
##$TDeff= 65536
##$TDoff= 0
##$TI= <>
##$TILT= no
##$TM1= 0
##$TM2= 0
##$TOPLEV= 0
##$USERP1= <user>
##$USERP2= <user>
##$USERP3= <user>
##$USERP4= <user>
##$USERP5= <user>
##$WDW= 1
##$XDIM= 131072
##$YMAX_p= 424505854
##$YMIN_p= -12085
##$CURPLOT= <Network HP LaserJet P1505>
##$CURPRIN= <$Network HP LaserJet P1505>
##$DFORMAT= <normdp>
##$LAYOUT= <+/1D_H.xwp>
##$LFORMAT= <normlp>
##$PFORMAT= <normpl>
##$SURQMSG= 1
$$ End of Bruker specific parameters
$$ ---------------------------------
##NTUPLES= NMR SPECTRUM
##VAR_NAME=  FREQUENCY,     SPECTRUM/REAL,   SPECTRUM/IMAG
##SYMBOL=    X,             R,               I
##VAR_TYPE=  INDEPENDENT,   DEPENDENT,       DEPENDENT
##VAR_FORM=  AFFN,          ASDF,            ASDF
##VAR_DIM=   131072,        131072,          131072
##UNITS=     HZ,            ARBITRARY UNITS, ARBITRARY UNITS
##FACTOR=    0.0627417313425164, 1,          1
##FIRST=     8223.62146879497, -1058,        -55230
##LAST=      0,             233,             -55702
##MIN=       0,             -12085,          0
##MAX=       8223.62146879497, 424505854,    0
$$ Real data points
##PAGE= N=1
##DATA TABLE= (X++(R..R)), XYDATA
$$ [...]
61620D64358m823n309n659n416m586l504k664k452k759k997k870k789l231l923
61606D11376m182l863l449l283l179k826k276j939k155k671k676j693m13j33j160
61591C75478k432k951k893k887k882k442j636r30n62o04j152j875j886q47K99
61576C49798M90j8l17l46o24r20n41J88J62o45r31l4J109J467J253J153J228J314
61558C53786J629K174K342J876J569K105K824K625J635R44R22Q90L93j89n03p56
61542C74266j086j110n98JJ59M1J25M37O56Q22J303K002K284J871J305J113R32
61525C84523L9j420k447k453j901j476j209q64o23q44j326j437r03l0P66J226
61509C69621J128M51k57k00P51J788K079J618R97O15M33M16P75J649K710L338
$$ y = [464358, 459535, 454226, 448567, 443151, 438565, 435061, 432397, 429945, 427186, 424189, 421319, 418530, 415299, 411376, 407194, 403331, 399882, 396599, 393420, 390594, 388318, 386379, 384224, 381553, 378877, 377184, 376771, 376638, 375478, 373046, 370095, 367202, 364315, 361433, 358991, 357355, 356425, 355863, 355259, 354107, 352232, 350346, 349499, 349798, 350288, 350270, 349953, 349607, 348983, 348063, 347522, 347710, 347872, 347227, 346296, 346262, 347371, 348838, 350091, 351244, 352472, 353786, 355415, 357589, 359931, 361807, 363376, 365481, 368305, 370930, 372565, 373509, 374431, 375321, 375714, 375525, 375022, 374266, 373180, 372070, 371472, 371473, 371632, 371673, 371798, 372235, 372891, 373713, 375016, 377018, 379302, 381173, 382478, 383591, 384523, 384562, 383142, 380695, 378242, 376341, 374865, 373656, 372792, 372169, 371325, 369999, 368562, 367659, 367629, 368395, 369621, 370749, 371200, 370943, 370743, 371494, 373282, 375361, 376979, 377976, 378591, 379024, 379440, 380215, 381864, 384574, 387912]
61493C87912L308L093L299L828M003L546K960K719K466J644N73K34Q84J611J529
61478D23609R43Q61J590K373K420J828J211O91j71j491k588k796k366k068k132
61463D21914k195k211k615l378l654k811j365l68k41n77p96n51J91J035J363R81
61447D04722L30j51m54n49o4J023J971K141J882J849J900J451O34K56O42J332
61431D18915J856K182K342K235J878J449J085R58J309J978K298J946J512J554
61417D43497J642J168O01P87J380J233K81l17j01K8n63j154r24k80k12r38j845
61400D44283k304k052j238m29j53j88J91J107J845J939J741J598J303P35L71O21
61384D49370J235J829K370K754K614K083K101L204M510M666L439J791O27J13M1
$$ y = [387912, 391220, 394313, 397612, 401440, 405443, 408989, 411949, 414668, 417134, 418778, 419351, 419585, 420469, 422080, 423609, 424552, 425413, 427003, 429376, 431796, 433624, 434835, 435526, 435355, 433864, 431276, 428480, 426114, 424046, 421914, 419719, 417508, 414893, 411515, 407861, 405050, 403685, 403317, 403076, 402499, 401703, 401152, 401343, 402378, 403741, 404722, 405052, 404901, 404447, 403898, 403834, 404857, 406828, 408969, 410851, 412700, 414600, 416051, 416685, 416941, 417583, 418915, 420771, 422953, 425295, 427530, 429408, 430857, 431942, 432900, 434209, 436187, 438485, 440431, 441943, 443497, 445139, 446307, 446908, 447695, 449075, 450308, 450589, 450272, 450171, 450199, 449636, 448482, 447558, 447278, 447066, 446128, 444283, 441979, 439927, 438689, 438260, 438107, 437919, 438110, 439217, 441062, 443001, 444742, 446340, 447643, 448378, 448749, 449370, 450605, 452434, 454804, 457558, 460172, 462255, 464356, 467560, 472070, 476736, 480175, 481966, 482593, 482706, 482747]
61369D82747K28N01O85O23J51p36j647k040j901j808k139k541k368j340L25K076
61353D70816L229L474L317L577M424N330N956O401O587O131M972L463J798J22
61339E29597q89o10L39O96M58Q27J889K053N89r30r28j17n6o21o35j05L9j07M32
61320E31921J669K643L206M181N647O641O854P138P942Q530Q433Q425R351J0909
61306F23490J2339J3562J4970J6479J7456J7237J5486J2366Q675N311K404n91
61294G59184l782o450q016q883r832j1039j2110j2746j2982j2911j2510j1684
61282F36239j0367q724p201o146n360m378l124j983j149l81M78J124J165O56J23
61267E90972J80J047K300L105L078K761L024M055N272O113O464O408O029N497
$$ y = [482747, 482975, 483476, 484161, 484784, 484935, 484199, 482552, 480512, 478611, 476803, 474664, 472123, 469755, 468415, 468740, 470816, 474045, 477519, 480836, 484413, 488837, 494167, 500123, 506524, 513111, 519242, 524214, 527677, 529475, 529597, 528708, 528098, 528437, 529133, 529591, 530418, 532307, 534360, 534949, 534019, 533091, 532974, 532918, 532297, 531662, 531557, 531596, 531489, 531921, 533590, 536233, 539439, 543620, 549267, 555908, 562762, 569900, 577842, 586372, 594805, 603230, 612581, 623490, 635829, 649391, 664361, 680840, 698296, 715533, 731019, 743385, 752060, 757371, 759775, 759184, 755402, 748952, 740936, 732053, 722221, 711182, 699072, 686326, 673344, 660433, 647923, 636239, 625872, 617148, 609947, 603801, 598441, 594063, 590939, 588956, 587807, 587426, 587904, 589028, 590193, 590849, 590972, 591152, 592199, 594499, 597604, 600682, 603443, 606467, 610522, 615794, 621907, 628371, 634779, 640808, 646305]
61253F46305M934M137K902J531N36j07r00j922k572k370j578q04m16m83q33j024
61237F47336o35J65P10O31K08j46k79lJ075K980N043O541P401Q017Q607R103R406
61220G06160R469R227Q800Q517Q518Q500Q156P693P524P595P374O529N283M051
61206H13396L019K228J801J889K509L612N210P192R106J0428J1220J2238J4078
61193H97926J6325J7862J7984J6877J4947J2244Q794N084J778q86l010m548n327
61180I96050n528n676o130o882p901r240j0655j1602j1849j1861j2173j2637j2636
61167H71280j2013j1394j1424j2051j2759j3309j3804j4126j3837j2776j1388
61156G32399j0170r047p651n892l921j724P54L157M903N770N964N594M567K899
$$ y = [646305, 651239, 655376, 658278, 659809, 660345, 660238, 659338, 657416, 654844, 652474, 650896, 650092, 649676, 649193, 648360, 647336, 646701, 646866, 647576, 648207, 648415, 648269, 647990, 647987, 649062, 652042, 657085, 663626, 671027, 679044, 687651, 696754, 706160, 715629, 724856, 733656, 742173, 750691, 759191, 767347, 775040, 782564, 790159, 797533, 804062, 809345, 813396, 816415, 818643, 820444, 822333, 824842, 828454, 833664, 840856, 849962, 860390, 871610, 883848, 897926, 914251, 932113, 950097, 966974, 981921, 994165, 1002959, 1008043, 1009821, 1008935, 1005925, 1001377, 996050, 990522, 984846, 978716, 971834, 963933, 954693, 944038, 932436, 920587, 908726, 896553, 883916, 871280, 859267, 847873, 836449, 824398, 811639, 798330, 784526, 770400, 756563, 743787, 732399, 722229, 713182, 705531, 699639, 695718, 693994, 694748, 697905, 702808, 708578, 714542, 720136, 724703, 727602]
61142G27602P20j879m522o220o161m801l375k254p09J559L688M962N865P148Q653
61127G30276R902J1195J3133J5475J7361J8534J9560K1020K3048K5527K8123L0308
61115I63462L1819L3010L4290L5433L5901L5584L4793L3840L3052L2794L2907
61104A336885L2502L0889K8307K5214K1418J6725J1948Q270N754L429P28k023
61092A520046m469o667q562r830j0408j0592j0534j0228r940r986j0133r859r243
61079A399595q854q787q534p970p692q132q885r269r160r053r505j0636j1939
61066A281179j2678j2690j2574j2797j3021j2760j2300j2240j2425j2172j1323
61055A144199j0339r376q188o824n638m505k841n84J530K851L467L925M772O404
$$ y = [727602, 728322, 726443, 721921, 715701, 709540, 704739, 701364, 699110, 698401, 699960, 703648, 708610, 714475, 721623, 730276, 740178, 751373, 764506, 779981, 797342, 815876, 835436, 856456, 879504, 905031, 933154, 963462, 995281, 1028291, 1062581, 1098014, 1133915, 1169499, 1204292, 1238132, 1271184, 1303978, 1336885, 1369387, 1400276, 1428583, 1453797, 1475215, 1491940, 1503888, 1512158, 1517912, 1521341, 1522069, 1520046, 1515577, 1508910, 1500348, 1490518, 1480110, 1469518, 1458984, 1448756, 1438816, 1428830, 1418697, 1408838, 1399595, 1390741, 1381954, 1373420, 1365450, 1357758, 1349626, 1340741, 1331472, 1322312, 1313259, 1303754, 1293118, 1281179, 1268501, 1255811, 1243237, 1230440, 1217419, 1204659, 1192359, 1180119, 1167694, 1155522, 1144199, 1133860, 1124484, 1116296, 1109472, 1103834, 1099329, 1096488, 1095904, 1097434, 1100285, 1103752, 1107677, 1112449, 1118853]
61041A118853Q736J1053J2650J3601J4471J5467J6420J7335J8312J9122J9611
61030A285631K0320K1954K4408K6965K9255L1259L2719L3395L3686L4188L4974
61019A608754L6150L8667M3498N0363N8351O7305P7400Q7886R7904J08371J21727
61008B396376J40073J65074J99225K45448L05797L82281M78254N96700P38106
60999E647334R03114J095578J316631J553307J776910J952803K044171K004013
60991A8293861J780982J360360Q10869K77878r1648k31945j77649j7933J52698
60982B2157473K44931J71923j22146o12068j179437j669378j973338k069028j998373
60973A2950559j822792j596449j360246j140418r47744p82837o44216n30606m38430
$$ y = [1118853, 1127589, 1138642, 1151292, 1164893, 1179364, 1194831, 1211251, 1228586, 1246898, 1266020, 1285631, 1305951, 1327905, 1352313, 1379278, 1408533, 1439792, 1472511, 1505906, 1539592, 1573780, 1608754, 1644904, 1683571, 1727069, 1777432, 1835783, 1903088, 1980488, 2068374, 2166278, 2274649, 2396376, 2536449, 2701523, 2900748, 3146196, 3451993, 3834274, 4312528, 4909228, 5647334, 6550448, 7646026, 8962657, 10515964, 12292874, 14245677, 16289848, 18293861, 20074843, 21435203, 22246072, 22523950, 22432302, 22200357, 22022708, 22004775, 22157473, 22402404, 22574327, 22452181, 21840113, 20660676, 18991298, 17017960, 14948932, 12950559, 11127767, 9531318, 8171072, 7030654, 6082910, 5300073, 4655857, 4125251, 3686821]
60964C686821l62383k99388k49221k11039j81877j58953j40925j26319j12995
60955A843721j00005q8174p7972o8412n8841n0279m3975l9728l6560l4162l2851
60944A212762l2613l2892l2878l1846k9695k7317k5789k5144k4590k3822k3159
60933I03017k2443k1016j9055j7703j7349j6815j5003j2558j0945j0498j0231
60922G29401r341q079p196o993p113o978o362n550m933m536m168l846l725l663
60908F46918l227k235j062l73o36j763k998l410k764j831j572k192l187m034m514
60893F11120m687m857n307n783n689m999m497m682n070n121n101n390n561n112
60879E39264m525m559m880m563l659l106l166l100k493j796j331p39K89J496K531
$$ y = [3686821, 3324438, 3025050, 2775829, 2564790, 2382913, 2223960, 2083035, 1956716, 1843721, 1743716, 1655542, 1577570, 1509158, 1450317, 1400038, 1356063, 1316335, 1279775, 1245613, 1212762, 1180149, 1147257, 1114379, 1082533, 1052838, 1025521, 999732, 974588, 949998, 926176, 903017, 880574, 859558, 840503, 822800, 805451, 788636, 773633, 761075, 750130, 739632, 729401, 720060, 711981, 704785, 697792, 690679, 683701, 677339, 671789, 666856, 662320, 658152, 654306, 650581, 646918, 643691, 641456, 640394, 640021, 639385, 637622, 634624, 631214, 628450, 626619, 625047, 622855, 619668, 615634, 611120, 606433, 601576, 596269, 590486, 584797, 579798, 575301, 570619, 565549, 560428, 555327, 549937, 544376, 539264, 534739, 530180, 525300, 520737, 517078, 513972, 510806, 507706, 505213, 503417, 502086, 501347, 501636, 503132, 505663]
60864E05663L259L542L388L420M366N903O786O358N256M409M009L697L130K158
60850E65344R78K17L50J006J428J503J591J416K16j915l804m727n221o001o908
60835E45473p450p683p870p906p602p082o552o013n577n463n419m744l353k131
60821D60628j790j876j577j020j053k031l404m424m758m497m004l676l579l407
60807D19532k977k588k567k675k323j358k67L83N50O49R27J102P64R5j34N06J497
60790D11116K006J871J504J142P20M10N75J107J361R58K50j46N0O38J100Q33l33
60773D25162j775k552k280j291r9R02J305Q91oo94p65k68N52J287J400P53m6l81
60755D22095m79q66j287j069l86j61n80o97J57J456K289K374J906J089J82n22
$$ y = [505663, 508922, 512464, 515852, 519272, 523638, 529541, 536327, 542685, 547941, 552350, 556359, 560056, 563186, 565344, 566322, 566539, 566889, 567895, 569323, 570826, 572417, 573833, 574049, 572134, 568330, 563603, 558382, 552381, 545473, 538023, 530340, 522470, 514564, 506962, 499880, 493328, 487315, 481738, 476275, 470856, 466112, 462759, 460628, 458838, 456962, 455385, 454365, 453312, 451281, 447877, 443453, 438695, 434198, 430194, 426518, 422939, 419532, 416555, 413967, 411400, 408725, 406402, 405044, 404777, 405160, 405710, 406359, 407286, 408388, 409152, 409247, 409113, 409619, 411116, 413122, 414993, 416497, 417639, 418359, 418769, 419344, 420451, 421812, 422770, 423020, 422874, 422924, 423562, 424662, 425495, 425162, 423387, 420835, 418555, 417264, 417165, 418067, 419372, 420263, 420257, 419563, 418798, 418530, 419082, 420369, 421769, 422522, 422476, 422095, 421616, 420750, 419463, 418394, 418008, 417847, 417267, 416570, 416727, 418183, 420472, 422846, 424752, 425841, 426023, 425501]
60739D25501j147k045l057l538l376l242l484l547k893j812q57j21M18M78L0k38
60723C97070L18J402K179K310K137K024K036K040J829J301P36O70J244J888J884
60708D21068J020l06j388j548o57N37J016N39k64q65j367j984k620l135l498l499
60692D03049k876j865j059n93j03L03l0j055j532m87J450K816L022K668K486K595
60676D08789K704K625K560K907L620L921L160J837R85O00l51k157l690l993l566
60661D19951l300l013k013n31M53N36K65L00Q21J617K260K401K261K475L124L430
60645D31037K850J925J425J125J75j571l317m291m398m040l670l449l066k131
60631D08604r53l91o82j000o49j4K34K52N27P85M14l50n74P1R02J217R90N61J81
$$ y = [425501, 424354, 422309, 419252, 415714, 412338, 409096, 405612, 402065, 399172, 397360, 396503, 396382, 396800, 397278, 397308, 397070, 397388, 398790, 400969, 403279, 405416, 407440, 409476, 411516, 413345, 414646, 415382, 416052, 417296, 419184, 421068, 422088, 421782, 420394, 418846, 418189, 418726, 419742, 420281, 420017, 419152, 417785, 415801, 413181, 410046, 406548, 403049, 400173, 398308, 397249, 396656, 396553, 396856, 396826, 395771, 394239, 393752, 395202, 398018, 401040, 403708, 406194, 408789, 411493, 414118, 416678, 419585, 423205, 427126, 430286, 432123, 433108, 433708, 433357, 431200, 427510, 423517, 419951, 416651, 413638, 411625, 411094, 411547, 412083, 412348, 412648, 413469, 415086, 417346, 419747, 422008, 424483, 427607, 431037, 433887, 435812, 437237, 438362, 438537, 436966, 433649, 429358, 424960, 420920, 417250, 413801, 410735, 408604, 407651, 407260, 406578, 405578, 404929, 404915, 405149, 405401, 405928, 406713, 407127, 406777, 406203, 406274, 407176, 408393, 409383, 409944, 410125]
60612D10125RJ10L48N39O63P78Q15P48O59N16K07p4J50Q74J422J319R06O93O86
60593D21493P33R87J430J581J276J208J948K982L456L376L210K800J708L30m11
60578D48107l02R3M88J029J544J662J732K637M528O546P988R003R917J0679J1250
60563E16901J1831J2330J2128J0704Q214N234K262m10k721m788o568p578p322
60550E50217n949m147k463j088n7Q15K026L802N566O588P142Q301J0506J2979
60536E94238J4767J5834J6881J8421K0177K1145K0298J7518J3728R852N877J378
60524G70114l339p288r890j1346j2039j2150j1919j1608j1155j0325r169p852
60512F52034o199m057j958o20J14J118K671M184N376O820R104J2228J6092K0748
$$ y = [410125, 410134, 410244, 410592, 411131, 411794, 412572, 413387, 414135, 414794, 415310, 415517, 415443, 415593, 416467, 417889, 419208, 420114, 420807, 421493, 422226, 423213, 424643, 426224, 427500, 428708, 430656, 433638, 437094, 440470, 443680, 446480, 448188, 448518, 448107, 447805, 447898, 448386, 449415, 450959, 452621, 454353, 456990, 461518, 468064, 476052, 485055, 494972, 505651, 516901, 528732, 541062, 553190, 563894, 572108, 577342, 579604, 579194, 576473, 571685, 565117, 557539, 550217, 544268, 540121, 537658, 536570, 536513, 537328, 539354, 543156, 548722, 555310, 562452, 570753, 581259, 594238, 609005, 624839, 641720, 660141, 680318, 701463, 721761, 739279, 753007, 762859, 768736, 770114, 766775, 759487, 749597, 738251, 726212, 714062, 702143, 690535, 679380, 669055, 659886, 652034, 645835, 641778, 639820, 639200, 639314, 640432, 643103, 647287, 652663, 659483, 668587, 680815, 696907, 717655]
60498G17655K5779L0272L3972L7741M2215M6557M9283M9951M9294M7902M5482
60487A176103M1445L5692K8617K0591J1683J857q636j9218k9416l9089m7900n4785
60475A116944n8524n8945n7081n4081n0405m6160m1543l6689l1592k6610k2543
60464F32771j9789j7760j5621j3365j1608j0539r630q406p047o016n401m853m111
60451D98625l367l027l151l343l330l347l679l970l530k412j523j435j522r15
60437D60074P5K17r03k192k440j846j557j974k341j989j228o65l36m1p3p51j517
60420D40513j344j35J081J518J494J676K164K681L057L065K370J128K02K35Q47
60405D60552J252J275J325J642K094K469K588K386K195K506L173L396K880K390
$$ y = [717655, 743434, 773706, 807678, 845419, 887634, 934191, 983474, 1033425, 1082719, 1130621, 1176103, 1217548, 1253240, 1281857, 1302448, 1314131, 1315988, 1307352, 1288134, 1258718, 1219629, 1171729, 1116944, 1058420, 999475, 942394, 888313, 837908, 791748, 750205, 713516, 681924, 655314, 632771, 612982, 595222, 579601, 566236, 554628, 544089, 534459, 526053, 519006, 512990, 507589, 502736, 498625, 495258, 492231, 489080, 485737, 482407, 479060, 475381, 471411, 467881, 465469, 463946, 462511, 460989, 460074, 460149, 460366, 459463, 457271, 454831, 452985, 451428, 449454, 447113, 445124, 443896, 443231, 442895, 442854, 442781, 442030, 440513, 439169, 439034, 440115, 441633, 443127, 444803, 446967, 449648, 452705, 455770, 458140, 459268, 459470, 459705, 460552, 461804, 463079, 464404, 466046, 468140, 470609, 473197, 475583, 477778, 480284, 483457, 486853, 489733, 492123]
60391D92123K575K967K852K482K516K795K709K366K338K461K040J137N85P60J204
60376E23910J576J982K330K317K159K436L023L136K656K417K842L214K766J770
60362E58534R71N94M75O20J117J822K587L550M857O329P595Q407Q715Q608Q201
60347F22982P381N901L964K338J365K97j641l857n044n031m925n317n559n115
60333F07739m570m635n021m987m461l975l827l842l710l310k809k613k835k872
60319E54272k030n00Q45J618K221K945L611M280N481P361R265J0523J1147J1442
60305F22481J1559J1628J1805J1916J1622J0969J0219R093O981L945O45k795o763
60292G13305j0817j3544j4256j3718j2759j1254r102p075n791m786l549k632k782
$$ y = [492123, 494698, 497665, 500517, 502999, 505515, 508310, 511019, 513385, 515723, 518184, 520224, 521361, 521946, 522706, 523910, 525486, 527468, 529798, 532115, 534274, 536710, 539733, 542869, 545525, 547942, 550784, 553998, 556764, 558534, 559505, 560099, 560574, 561194, 562311, 564133, 566720, 570270, 575127, 581456, 589051, 597458, 606173, 614781, 622982, 630363, 636264, 640228, 642566, 643931, 644228, 642587, 638730, 633686, 628655, 623730, 618413, 612854, 607739, 603169, 598534, 593513, 588526, 584065, 580090, 576263, 572421, 568711, 565401, 562592, 559979, 557144, 554272, 552242, 551742, 552587, 554205, 556426, 559371, 562982, 567262, 572743, 580104, 589369, 599892, 611039, 622481, 634040, 645668, 657473, 669389, 681011, 691980, 702199, 711292, 718273, 722218, 722863, 720068, 713305, 702488, 688944, 674688, 660970, 648211, 636957, 627855, 620780, 614989, 610203, 606654, 604022, 601240]
60279F01240l685m530n124n552n469m761m272m735n511n503m886m653m875m682
60265E33002l890l287l210l031k369j791j845k210k228j734r39MJ012J910K576
60250E11970L018L170K847K079J277R71J321J923K073J443M84q5j39j30k39j18
60234E31865K91M43J5m34k07O20J511K259K938L483L842M246M807N203N231N293
60218E71406N840O745P707Q794R998J0812J0928J0930J1476J2216J2382J2085
60206F91319J2065J2344J2179J1306J0301R544Q755P677O593N850N421N054M454
60193H02862L292J522l58j859l181m822o669q079q829r256r527r516r382r508
60179G26690r723r399q492p744p532p214o014m046k121r28p29j379k293k766k684
$$ y = [601240, 597555, 593025, 587901, 582349, 576880, 572119, 567847, 563112, 557601, 552098, 547212, 542559, 537684, 533002, 529112, 525825, 522615, 519584, 517215, 515424, 513579, 511369, 509141, 507407, 506468, 506472, 507484, 509394, 511970, 514988, 518158, 521005, 523084, 524361, 525332, 526653, 528576, 530649, 532092, 532576, 532491, 532352, 532222, 531983, 531865, 532156, 532599, 532614, 532180, 531973, 532593, 534104, 536363, 539301, 542784, 546626, 550872, 555679, 560882, 566113, 571406, 577246, 583991, 591698, 600492, 610490, 621302, 632230, 643160, 654636, 666852, 679234, 691319, 703384, 715728, 727907, 739213, 749514, 759058, 767813, 775490, 782083, 787933, 793354, 798408, 802862, 806154, 807676, 807318, 805459, 802278, 797456, 790787, 782708, 773879, 764623, 755096, 745580, 736198, 726690, 716967, 707568, 699076, 691332, 683800, 676586, 670572, 666526, 664405, 663477, 662748, 661369, 659076, 656310, 653626]
60164F53626k589k849l139k977k402j756j140m56K32P09R12R14P46M29K02L93
60148F40855J085J982K690L061L245L430L632L839M284N298O841Q375R399R888
60134G07904J0143J0400J0728J1039J1061J0502R408Q045O465M603K914K230K627
60121H08069L113K914K472K572L171L809M547N487N916N083L543K525K076J156
60107H56453m14j492j486j358k206l771n144o050o711p125p254p328p322o638
60093G92154n019l210k066j476r20n52q32j470j768j702j797k007j753j112r22
60078G65548j513k253k669l174m213n436o318p030q028r230j0180j0704j0828
60065F83972j0392r407q432p948p554o515n000l972l840m018l951l716l374k525
$$ y = [653626, 651037, 648188, 645049, 642072, 639670, 637914, 636774, 636318, 636550, 637259, 638171, 639085, 639831, 640260, 640462, 640855, 641940, 643922, 646612, 649673, 652918, 656348, 659980, 663819, 668103, 673401, 680242, 688617, 698016, 707904, 718047, 728447, 739175, 750214, 761275, 771777, 781185, 789230, 795695, 800298, 803212, 805442, 808069, 811182, 814096, 816568, 819140, 822311, 826120, 830667, 836154, 842070, 847153, 850696, 853221, 855297, 856453, 856039, 854547, 853061, 851703, 849497, 845726, 840582, 834532, 827821, 820696, 813442, 806114, 798792, 792154, 787135, 783925, 781859, 780383, 779463, 778911, 778079, 776609, 774841, 773139, 771342, 769335, 767582, 766470, 765548, 764035, 761782, 759113, 755939, 751726, 746290, 739972, 732942, 724914, 715684, 705504, 694800, 683972, 673580, 664173, 655741, 647793, 640239, 633724, 628724, 624752, 620912, 616894, 612943, 609227, 605853, 603328]
60051F03328r69Q25K375L728M920N573N589N694O567P896Q962R661J0132R927
60037F84208Q565O658N364M836M165K909J618P28j27j379k940m603o327p976r403
60022F86296j0893j2621j3786j3357j1832j0930j1118j0890r179p082o087n818
60010E62703m971l612k934l133l083k140r74m47n77q94j032p97k37K55L58L30
59994E38815O61J398K263L195M189M885N001N010N629O709P344P001N957M626
59980F02683L167J691K39j487l676n686o473n904m994m627m570m075k960j720
59966E61608q14j66O12J676K754L534M137M865N538N573M880M057L460K673J336
59951F05723r6r98j391j521j255n89j91n68j174j237r76j030j179q23l18n03j078
$$ y = [603328, 602359, 603184, 605559, 609287, 614207, 619780, 625369, 631063, 637630, 645526, 654488, 664149, 674281, 684208, 692773, 699431, 704795, 709631, 713796, 716705, 718323, 719051, 718924, 717545, 714605, 710002, 703675, 695699, 686296, 675403, 662782, 648996, 635639, 623807, 612877, 601759, 590869, 581690, 574608, 568521, 562703, 557732, 554120, 551186, 548053, 544970, 542830, 541856, 541409, 540832, 539938, 538906, 538109, 537872, 538127, 538485, 538815, 539476, 540874, 543137, 546332, 550521, 555406, 560407, 565417, 571046, 577755, 585099, 592100, 598057, 602683, 605850, 607541, 607780, 606293, 602617, 596931, 590458, 584554, 579560, 574933, 570363, 566288, 563328, 561608, 560794, 560628, 561240, 562916, 565670, 569204, 573341, 578206, 583744, 589317, 594197, 598254, 601714, 604387, 605723, 605627, 604629, 603238, 601717, 600462, 599873, 599682, 599114, 597940, 596703, 595727, 594697, 593518, 592695, 592377, 591874, 590796]
59934E90796q57L66J597K456L708N552O810O634N874N742N968N298L332R10j020
59919F43166k149k597k579k302j721n26J388L506N047N651N613N506N677N939
59905F69619N775M919L654K341Q99q90k771m184m893n016m543l430k050r46j25
59890F58359Q28J936K784L258L742M429N088N584O072O538O775O885P197P587
59876G27062P457O619N571M696L875L015K332J782Q71n71j939k555k407j970j690
59861G52148j842k393k813k513j753j529k271l180l206k233q95L42J496K708L972
59846G36038N088N683N500M779M034L416K601J381kj198j969j971q78J028K751
59831G66281L410K883J497n06k901n166o653p071o732o345o501p190p817p848
$$ y = [590796, 589939, 590305, 591902, 594358, 598066, 603618, 610428, 617062, 622936, 628678, 634646, 639944, 643276, 644186, 643166, 641017, 638420, 635841, 633539, 631818, 631292, 632680, 636186, 641233, 646884, 652497, 658003, 663680, 669619, 675394, 680313, 683967, 686308, 687207, 686317, 683546, 679362, 674469, 669453, 664910, 661480, 659430, 658484, 658359, 659187, 661123, 663907, 667165, 670907, 675336, 680424, 686008, 692080, 698618, 705393, 712278, 719475, 727062, 734519, 741138, 746709, 751405, 755280, 758295, 760627, 762409, 763280, 762709, 760770, 758215, 755808, 753838, 752148, 750306, 747913, 745100, 742587, 740834, 739305, 737034, 733854, 730648, 728415, 727520, 727862, 729358, 732066, 736038, 741126, 746809, 752309, 757088, 761122, 764538, 767139, 768520, 768518, 767320, 765351, 763380, 762502, 763530, 766281, 769691, 772574, 774071, 773565, 770664, 765498, 758845, 751774, 745042, 738697, 732196, 725006, 717189, 709341]
59817G09341p259o307n167m035l158k404j284J67J025O21m39j157j453j762j844
59802F74885j218m14m19j036j132n86n57j550k620k978l110l677m407m753m752
59787F41676m501l730k581j959k358l046l081k549k093j894j776j777j914j859
59773F06558j380o78J22J294K791L909M125L820L636L694L904M438N383O423P389
59758F55428Q482R634J0277J0294J0413J1134J1953J2378J2830J3782J4597J4261
59746G95463J2825J1247J0068R087Q040O861N420L637J799K33j066k154k901l411
59732H55148m227n481o363o118n166m502m350m118l492k764k178j711j459j700
59718H01519k429l234l696l650l151k455j885j525j152n58K56J268K479L693M690
$$ y = [709341, 702082, 695775, 690608, 686573, 683415, 681011, 679727, 679894, 680919, 681540, 681101, 679944, 678491, 676729, 674885, 673667, 673253, 672834, 671798, 670666, 670080, 669523, 667973, 665353, 662375, 659265, 655588, 651181, 646428, 641676, 637175, 633445, 630864, 628905, 626547, 623501, 620420, 617871, 615778, 613884, 612108, 610331, 608417, 606558, 605178, 604500, 604622, 605916, 608707, 612616, 616741, 620561, 624197, 627891, 631795, 636233, 641616, 648039, 655428, 663910, 673544, 683821, 694115, 704528, 715662, 727615, 739993, 752823, 766605, 781202, 795463, 808288, 819535, 829603, 838690, 846730, 853591, 859011, 862648, 864447, 864680, 863614, 861460, 858559, 855148, 850921, 845440, 839077, 832959, 827793, 823291, 818941, 814823, 811331, 808567, 806389, 804678, 803219, 801519, 799090, 795856, 792160, 788510, 785359, 782904, 781019, 779494, 778342, 777784, 778040, 779308, 781787, 785480, 790170]
59703G90170N606O705P706Q063P996Q427R634J0650J0513R432Q340P847P978Q265
59689I07332P729N568K302n21k136l273m647n755n915n531n440n735o107o732
59675H71139p866r099r815r963r732r002p787o594n666m573l223k366k292j937
59661G81224m19J429K383K845M070N963P248P596P928Q644R055Q749Q149P387
59647H62251N846L259K62k549n264p967j0234j1686j2445j2666j2226j1202j0133
59634G75246r466r077q551p665o516n457m884m874n084n283n739o738p916q588
59620F79408q590q387q369q453q224p344n929m588l821l336k493j468j060j206
59606F06140p47P95K249K415J708J233J109Q29N20O15P86M83J48O43J756K406
$$ y = [790170, 795776, 802481, 810187, 818250, 826246, 834673, 844307, 854957, 865470, 874902, 883242, 891089, 899067, 907332, 915061, 920629, 922931, 922410, 920274, 917001, 912354, 906599, 900684, 895153, 889713, 883978, 877871, 871139, 863273, 854174, 844359, 834396, 824664, 815662, 807875, 801281, 795615, 791042, 787819, 785453, 783161, 781224, 780805, 782234, 784617, 787462, 791532, 797495, 804743, 812339, 820267, 828911, 837966, 846715, 854864, 862251, 868097, 871356, 871618, 869069, 863805, 855838, 845604, 833918, 821473, 808807, 796581, 785379, 775246, 765780, 756703, 748152, 740487, 733971, 728514, 723630, 718756, 713672, 708389, 702650, 695912, 687996, 679408, 670818, 662431, 654062, 645609, 637385, 630041, 624112, 619524, 615703, 612367, 609874, 608406, 607346, 606140, 605393, 606188, 608437, 610852, 612560, 613793, 614902, 615731, 616251, 616866, 617652, 618135, 618283, 618926, 620682, 623088]
59590F23088K230J838J644J453J122O54j98j512k611k846k718l184m093m435m017
59575F06415l627l584l260k272j114m06l08p34j373j541q48N5K28k07m14l36p09
59558E85965j609k164j923j444j215r56k49Q35J993K941L308K982K532K656L289
59543E96941L903M487N456O849Q521J0830J4138J7716K0190K0947K0030J6938
59531G46946J0990L071m285r000j0792j0296q096m855j460J472L592M358L477
59518G25122J765N23p2r56k523m105n230o195p148p706p838q044q366q266p760
59503F53201p536p609p025n414l757k999k846k552j979j301m34N94J400J828K154
59488F15725K498K702L034M116N794O971O985O354N779N298M824M744N296O014
$$ y = [623088, 625318, 627156, 628800, 630253, 631375, 632029, 631831, 630319, 627708, 624862, 622144, 618960, 614867, 610432, 606415, 602788, 599204, 595944, 593672, 592558, 592152, 591844, 591110, 589737, 588196, 587348, 587403, 587631, 587424, 587010, 586674, 585965, 584356, 582192, 580269, 578825, 577610, 576654, 576405, 577240, 579233, 582174, 585482, 588464, 590996, 593652, 596941, 600844, 605331, 610787, 617636, 626157, 636987, 651125, 668841, 689031, 709978, 730008, 746946, 757936, 761007, 756722, 747722, 736930, 726634, 718538, 713683, 712223, 713695, 717287, 721645, 725122, 726887, 727410, 727338, 726382, 723859, 719754, 714524, 708329, 701181, 693475, 685637, 677593, 669227, 660961, 653201, 645665, 638056, 631031, 625617, 621860, 618861, 616015, 613463, 611484, 610183, 609749, 610343, 611743, 613571, 615725, 618223, 620925, 623959, 628075, 633869, 640840, 647825, 654179, 659958, 665256, 670080, 674824, 680120, 686134]
59474F86134O296O040N433M626L777K941J817K16j282j846j521r91m07N59J639
59459G13431K095J968K035K485K881L427M861O961Q583R393J0021J0300R176O820
59445G94437M943M203L105N01k551m650o177q079r802j0152r218p968o706n305
59431G36581m269m176m559m574m213l773k729l84K746N476P527R580J1992J4510
59417G59735J7000J9572K2165K4682K7220K9638L1313L1841L1182K8451K1720
59406A044519J0451k464j2492j7190j7252j4347r445l180L460R369J3401J4024
59394A018854R776P52j0599k0593k6463k7867k6544k4470k2238j9406j6071j3193
59382H21938j1213r401p161n087l942l353k412j063j1M33N47N11K34k49p79j251
$$ y = [686134, 692430, 698470, 703903, 708529, 712306, 715247, 717064, 717280, 715998, 714152, 712631, 711640, 711233, 711792, 713431, 715526, 717494, 719529, 722014, 724895, 728322, 733183, 740144, 748727, 758120, 768141, 778441, 787617, 794437, 799380, 803583, 806688, 807189, 804638, 799988, 793811, 785732, 775930, 765778, 756560, 748592, 741886, 736581, 732312, 728136, 723577, 719003, 714790, 711017, 708288, 707904, 710650, 716126, 723653, 733233, 745225, 759735, 776735, 796307, 818472, 843154, 870374, 900012, 931325, 963166, 994348, 1022799, 1044519, 1054970, 1052506, 1040014, 1022824, 1005572, 991225, 981780, 978600, 982060, 991429, 1004830, 1018854, 1028630, 1029382, 1018783, 998190, 971727, 943860, 917316, 892846, 870608, 851202, 835131, 821938, 810725, 801324, 794163, 789076, 785134, 781781, 779369, 778306, 778295, 778728, 779275, 779786, 780020, 779771, 778992, 777741]
59366G77741j390p34O72K032K702L039L730M759N579O005O339O904P913R450J1220
59351H45961J2651J3616J4655J6110J7580J8619J9412K0183K0564K0065J8827
59340A038243J7338J5748J3911J1732R049N635J656k288n823r041j1947j4311
59328A069902j6281j8276k0063k0801k0371j9671j9219j8523j7291j6147j5467
59317H67792j4668j3383j2250j1653j0821r210p722p334p484p064o174n618n269
59304G49142m324k696q86J099L580O280Q651J0715J2514J3188J1717Q313L992
59291H21285q12o112j1155j4637j6116j6188j5310j3339j0261o563k928o1J447
59278G09250J843K447M425P486J0354J2237J3241J3786J4277J4995J5709J5834
$$ y = [777741, 776351, 775617, 776289, 778321, 781023, 784062, 787792, 792551, 798130, 804135, 810474, 817378, 825291, 834741, 845961, 858612, 872228, 886883, 902993, 920573, 939192, 958604, 978787, 999351, 1019416, 1038243, 1055581, 1071329, 1085240, 1096972, 1106021, 1111656, 1113312, 1111024, 1105201, 1096160, 1084213, 1069902, 1053621, 1035345, 1015282, 994481, 974110, 954439, 935220, 916697, 899406, 883259, 867792, 853124, 839741, 827491, 815838, 805017, 795807, 788085, 780751, 773267, 766203, 760029, 754411, 749142, 744818, 742122, 741236, 742335, 745915, 752195, 760846, 771561, 784075, 797263, 808980, 817293, 821285, 820473, 814361, 803206, 788569, 772453, 756265, 740955, 727616, 717355, 710792, 707864, 707803, 709250, 711093, 713540, 717965, 725451, 735805, 748042, 761283, 775069, 789346, 804341, 820050, 835884]
59266H35884J5370J5050J4948J3934J1306Q081N605L702J388j237l230m421n486
59253I10894o594p225p133o542n505m044k668j904j541j155q67q54o30J31O69
59238H65032J08j044j600j443j461j989k525k803l086l473l866m467n516o755
59224H25112p878r038j0253j0925j0736j0334j0239r881q765p651p272o825n248
59211G10067l202k163k114j887j301j159j376r74J56J106J594K181K865K964K447
59196G09204K007J843J645J689K515L671M233M348M796N304M951M112M083M833
59182G59234M950M010L092K665J873M76l69j4N10P1j084k081k546k435j870j544
59166G64938k085k748j971L56K543L362L342L283K950J940N94p12k178l820n063
$$ y = [835884, 851254, 866304, 881252, 895186, 906492, 914573, 920178, 923880, 925268, 924031, 920801, 916380, 910894, 904300, 897075, 889942, 883400, 877895, 873851, 871183, 869279, 867738, 866583, 865716, 864862, 864232, 864363, 865032, 865140, 864096, 862496, 861053, 859592, 857603, 855078, 852275, 849189, 845716, 841850, 837383, 831867, 825112, 817234, 808196, 797943, 787018, 776282, 765948, 755709, 745828, 737063, 729412, 722140, 715315, 710067, 706865, 704702, 702588, 700701, 699400, 698241, 696865, 695891, 696047, 697153, 698747, 700928, 703793, 706757, 709204, 711211, 713054, 714699, 716388, 718903, 722574, 726807, 731155, 735951, 741255, 746206, 750318, 754401, 759234, 764184, 768194, 771286, 773951, 775824, 776300, 775931, 775917, 776427, 776498, 775414, 773333, 770787, 768352, 766482, 764938, 762853, 760105, 758134, 758490, 761033, 764395, 767737, 771020, 773970, 775910, 776504, 775792, 773614, 769794, 764731]
59151G64731n713o372p400q282q567q522q470q288p951p710p505o996o357o130
59137F60468o213n975n413n075m834l982k642j692j123K0J776K909K896K802L577
59122F37499M784N678O306O945P571Q445J0028J1835J2594J2017J1251J1068J0991
59109G57012J0693J0756J1301J1251R927Q158O960O136N044L640K026J8k095l471
59095H37356m042m757n810o009m792l496l400l718k874q90Q39J500J385R74M78
59080H02744j5p01j977l667m953n554o176p169p721p117n969n287n100m819m345
59065G32174l948l592l164k851k681k277j556j137j422j937k067j865j572j095
59051G01010m22oj29m90p63r21q41l65Q0j11n15p5J024J347N51K18J466L220L917
$$ y = [764731, 759018, 752646, 745246, 736964, 728397, 719875, 711405, 703117, 695166, 687456, 679951, 672955, 666598, 660468, 654255, 648280, 642867, 637792, 632958, 628976, 626334, 624642, 623519, 623539, 625315, 628224, 631120, 633922, 637499, 642283, 647961, 654267, 661212, 668783, 677228, 687256, 699091, 711685, 723702, 734953, 746021, 757012, 767705, 778461, 789762, 801013, 810940, 819098, 826058, 832194, 837238, 840878, 842904, 842922, 840827, 837356, 833314, 828557, 822747, 816738, 811946, 808450, 805050, 801332, 798458, 797568, 798407, 799907, 801292, 802266, 802744, 802729, 802028, 800051, 796384, 791431, 785877, 779701, 772532, 764811, 757694, 751725, 746438, 741338, 736519, 732174, 728226, 724634, 721470, 718619, 715938, 713661, 712105, 710968, 709546, 707609, 705542, 703677, 702105, 701010, 700588, 700582, 700453, 699963, 699200, 698279, 697438, 697073, 697153, 697042, 696527, 696452, 697476, 698823, 699374, 699592, 701058, 704278, 708195]
59032G08195L794M119N130O120O879P811Q970J0074J1238J2841J4842J6681J7653
59019H34347J7162J5222J2818J1035R519O849K673j623m820p088q819r575r088
59006H68612q106p183n723l197l27J945L756N604P174P896P883P387O160M202
58992H96083K369J252L51q08j603j442j029j456k592l513l891l972l667k626q19
58977H72637J563M337O949Q645R540J0624J2209J3397J3712J4025J4969J5637
58965I98244J5070J3919J3419J3487J3023J1487R119O286L464J287l28k341n225
58952A090911q241j0742j3073j5307j6401j5712j4282j3377j2811j1826j0579
58941I48560r481q091o123m559m282m440l627j967n76L28J272K216K812L465M683
$$ y = [708195, 711989, 716108, 721238, 727358, 734237, 742048, 751018, 761092, 772330, 785171, 800013, 816694, 834347, 851509, 866731, 879549, 890584, 900103, 906952, 909625, 908002, 903182, 896094, 887275, 877700, 868612, 860506, 853323, 847600, 844403, 844076, 846021, 849777, 855381, 862555, 870451, 878334, 885721, 891881, 896083, 898452, 899704, 900055, 899247, 897644, 896202, 895173, 893717, 891125, 887612, 883721, 879749, 876082, 873456, 872637, 874200, 878537, 885486, 894131, 903671, 914295, 926504, 939901, 953613, 967638, 982607, 998244, 1013314, 1027233, 1040652, 1054139, 1067162, 1078649, 1087768, 1094054, 1097518, 1098805, 1098477, 1096136, 1090911, 1082670, 1071928, 1058855, 1043548, 1027147, 1011435, 997153, 983776, 970965, 959139, 948560, 939079, 930988, 924865, 920306, 916024, 911584, 907957, 905990, 905414, 905742, 907014, 909230, 912042, 915507, 920190]
58926I20190N852O002N331M657L923K562R47J02L17J105K132L199L908M388N661
58911I70276Q121J0497J1550J1920J2907J4245J4705J4266J3948J3972J3655J2823
58899A122885J1826J0476Q394O151M708L979L222K497K462L100L971N317P611
58886A196599J0408J2872J4991J6962J7935J6958J4718J2762J1304R348O701M281
58874A345839K499Q90o71j777k486l323m339n340o796r239j2007j3928j5063j6464
58860A257795j8356j9871k0555k0796k0782k0348j9830j9874k0293k0131j8948
58849A038011j7192j5391j3814j2702j2048j1428j0763j0757j1815j3185j4063
58838H94853j4687j5338j5214j3654j1590j0375r800q795p366o232n168l460j501
$$ y = [920190, 926042, 932044, 937375, 942032, 945955, 948517, 949464, 949566, 949883, 950988, 953120, 956319, 960227, 964615, 970276, 978397, 988894, 1000444, 1012364, 1025271, 1039516, 1054221, 1068487, 1082435, 1096407, 1110062, 1122885, 1134711, 1145187, 1153581, 1159732, 1164440, 1168419, 1171641, 1174138, 1176600, 1179700, 1183671, 1188988, 1196599, 1207007, 1219879, 1234870, 1251832, 1269767, 1286725, 1301443, 1314205, 1325509, 1334857, 1341558, 1345839, 1348338, 1349228, 1348557, 1346780, 1344294, 1340971, 1336632, 1331292, 1324496, 1315257, 1303250, 1289322, 1274259, 1257795, 1239439, 1219568, 1199013, 1178217, 1157435, 1137087, 1117257, 1097383, 1077090, 1056959, 1038011, 1020819, 1005428, 991614, 978912, 966864, 955436, 944673, 933916, 922101, 908916, 894853, 880166, 864828, 849614, 835960, 824370, 813995, 804195, 795400, 788034, 781802, 776634, 773174, 771673]
58825G71673l50J1M21J048J622K605M452O233O698O298O451P249P625P337O850
58810H36223N752L238P8j950k529k884l590m180m790o108p633p904o719n390m668
58795G86946m200l977m542n512n776n357n330n662m990k880o07P96J712K818M202
58780G47641N915Q019R837J0477J0181R811R178P341M510J883l25k943n815p619
58766H08091p922p767p912q106q240q595q753p921o527n868o037n827m813l791
58752G10012l086k207j365j407k003j804p08j33n69p85N4J319K486M002N894P152
58736G16852P209O693O201N644N140N122N281M860M136M101M591M437L633L501
58722G87401M439N299N379N272N420N522N729O629P721P695O512N428M745L471
$$ y = [771673, 771323, 771334, 771755, 772803, 774425, 777030, 781482, 787715, 794413, 800711, 807162, 814411, 822036, 829373, 836223, 841975, 845213, 845291, 843341, 840812, 837928, 834338, 830158, 825368, 819260, 811627, 803723, 797004, 791614, 786946, 782746, 778769, 774227, 768715, 762939, 757582, 752252, 746590, 741600, 738720, 738113, 738909, 740621, 743439, 747641, 753556, 761575, 771412, 781889, 792070, 801881, 811059, 818400, 822910, 824793, 824468, 821525, 815710, 808091, 800169, 792402, 784490, 776384, 768144, 759549, 750796, 742875, 736348, 730480, 724443, 718616, 713803, 710012, 706926, 704719, 703354, 701947, 699944, 698140, 697432, 697299, 696730, 695945, 695999, 697318, 699804, 703806, 709700, 716852, 724061, 730754, 736955, 742599, 747739, 752861, 758142, 763002, 767138, 771239, 775830, 780267, 783900, 787401, 791840, 797139, 802518, 807790, 813210, 818732, 824461, 831090, 838811, 846506, 853018, 858446, 863191, 866662]
58708H66662J401m79k021m185o920q927j0052j1729j4449j6859j8091j8888j9695
58695G35768j9712j8700j7661j6941j5548j3217j1167r988q706o873n630n665
58683E85960n968n561m859m394l829l054k619k455j790p54k94j59R47K827L789
58668E57787L669M423O855R319J0607J1648J3096J3670J2304R788O947L316j091
58655F62338m778o883q317r640r917q878q014q144q141p287o669o804o256m297
58641E58313k575k406k561j625l22L67J262L117M681M733M280M617M951M056K627
58626E83515J841J155k91j594j587j066j351j858j212L39J611K624M077N586O310
58611E98099O484O778O888O202N045L955K739J366O99J126J650J390P45J09j004
$$ y = [866662, 868063, 867584, 865563, 861378, 854458, 845531, 835479, 823750, 809301, 792442, 774351, 755463, 735768, 716056, 697356, 679695, 662754, 647206, 633989, 622822, 612834, 604128, 597255, 591625, 585960, 579992, 574431, 569572, 565178, 561349, 558295, 555676, 553221, 551431, 550677, 550383, 550224, 551171, 553998, 557787, 561456, 565879, 572734, 582053, 592660, 604308, 617404, 631074, 643378, 653166, 660113, 663429, 662338, 657560, 650677, 642360, 632720, 622803, 613925, 605911, 597767, 589626, 582339, 575670, 568866, 562610, 558313, 555738, 553332, 550771, 549146, 548824, 549191, 550453, 553570, 558251, 562984, 567264, 571881, 576832, 580888, 583515, 585356, 586511, 586220, 584626, 583039, 581973, 580622, 578764, 577552, 577891, 579502, 582126, 586203, 591789, 598099, 604583, 611361, 618249, 624451, 629496, 633451, 636190, 637556, 638255, 639381, 641031, 642421, 643166, 643275, 642271]
58596F42271k520l197k633k164k544k605j421J00J205K793N375P605Q554R422
58582F60241J1228J2812J3014J2780J3101J2839J0844Q360P112O718O257O607
58570G81913Q794J1596J3289J4451J6762K0252K3926K7763L1969L5468L7336L8444
58558A061963L9641L9718L7195L2696K7456K1072J3014M872j340n815r610j2009
58546A248853j1744r657p763o624n839o113q525j2675j7426k2512k7696l1636
58534A080643l3462l4155l4534l3525l0371k6755k4446k2486j9126j5011j1967
58523G94805j0068q322o896o322n838m729l936m187m172k843j635j998k621j730
58509G29508k71j9l01L78J252Q96K04O71J291L13j380j909j816k593l293k141
$$ y = [642271, 639751, 636554, 633921, 631757, 629213, 626608, 625187, 625287, 626492, 629285, 634660, 642265, 650819, 660241, 671469, 684281, 697295, 710075, 723176, 736015, 746859, 755219, 762331, 769049, 775306, 781913, 790707, 802303, 815592, 830043, 846805, 867057, 890983, 918746, 950715, 986183, 1023519, 1061963, 1101604, 1141322, 1178517, 1211213, 1238669, 1259741, 1272755, 1277627, 1276287, 1270472, 1260862, 1248853, 1237109, 1227452, 1219689, 1213065, 1207226, 1201113, 1192588, 1179913, 1162487, 1139975, 1112279, 1080643, 1047181, 1013026, 978492, 944967, 914596, 887841, 863395, 840909, 821783, 806772, 794805, 784737, 776415, 769519, 763197, 757359, 752630, 748694, 744507, 740335, 737492, 735857, 733859, 731238, 729508, 729237, 729218, 728917, 729295, 730547, 731443, 731647, 732318, 733609, 733922, 732542, 730633, 728817, 726224, 722931, 720790]
58493G20790j59L70q2O58K465L564M171N945Q566J0416J1912J4665J8078K0187
58479H21546K1342K3574K6801K8949K9316K8719K6897K2965J7863J3152Q166J490
58467A070780n574j0399j3025j5354j7173j6638j4052j1504r116n321n08L207
58455I55323N603Q311J1341J3006J3134J2999J2286R274L929k159q396j4840j9931
58442I99880k1819k1485k1290k1191j9493j6521j4020j1774q375m576k286r98
58430H36052J171L767N047N755P883J0604J1597J1511J2706J4357J3395R847O515
58417I50207L798k85n167p873q282r402j1876j3019j1929j0977j1285j1144r808
58404H42958q757q273o712m055k408k161j302Q85K861M024N277O359O099N345
$$ y = [720790, 720631, 721001, 720919, 721577, 724042, 727606, 731777, 737722, 746288, 756704, 768616, 783281, 801359, 821546, 842888, 866462, 893263, 922212, 951528, 980247, 1007144, 1030109, 1047972, 1061124, 1069290, 1070780, 1065206, 1054807, 1041782, 1026428, 1009255, 992617, 978565, 967061, 957945, 952624, 952116, 955323, 960926, 969237, 980578, 993584, 1006718, 1019717, 1032003, 1041277, 1045206, 1043047, 1034651, 1019811, 999880, 978061, 956576, 935286, 914095, 894602, 878081, 864061, 852287, 843912, 839336, 837050, 836052, 837223, 840990, 846037, 851792, 859675, 870279, 881876, 893387, 906093, 920450, 933845, 943692, 950207, 954005, 953720, 948553, 940680, 932398, 922996, 911120, 898101, 886172, 875195, 863910, 852766, 842958, 834201, 825928, 819216, 815161, 812753, 810592, 809290, 810175, 813036, 817060, 822337, 828696, 834795, 840140]
58390H40140N890O850N959M072M105N838O314N194M998O052O107N046N099O088
58376I17752N387L024J985K955L580L303M054N661N648M192M332O554Q130Q344
58362I84901R372J1439J2309J2138J3526J6104J6444J4095J2201J1332Q367K650
58350A124878k308m530n664o319m838j900p49j596j060J685L708M191N779Q983
58336A120260J1040J1517J3229J6457J8172J8056J9178K1574K1541J8561J6388
58325A305973J5905J3572Q562M633L195J289j788k815j355j055k368j255K871
58312A345364N407M918N602Q952J0844R705R603J2189J3402J1591J1078J3957
58300A462612J6156J5322J5024J7226J8232J6130J4805J6541J8006J7367J7944
$$ y = [840140, 846030, 852880, 858839, 862911, 867016, 872854, 879168, 884362, 889360, 895412, 901519, 906565, 911664, 917752, 923139, 926163, 928148, 931103, 934683, 937986, 942040, 947701, 953349, 957541, 961873, 968427, 976557, 984901, 994273, 1005712, 1018021, 1030159, 1043685, 1059789, 1076233, 1090328, 1102529, 1113861, 1122228, 1124878, 1122570, 1118040, 1112376, 1106057, 1101219, 1099319, 1098570, 1096974, 1095914, 1097599, 1101307, 1105498, 1111277, 1120260, 1131300, 1142817, 1156046, 1172503, 1190675, 1208731, 1227909, 1249483, 1271024, 1289585, 1305973, 1321878, 1335450, 1344012, 1348645, 1351840, 1353129, 1351341, 1348526, 1347171, 1346116, 1343748, 1342493, 1345364, 1350771, 1355689, 1361291, 1370243, 1381087, 1390792, 1400395, 1412584, 1425986, 1437577, 1448655, 1462612, 1478768, 1494090, 1509114, 1526340, 1544572, 1560702, 1575507, 1592048, 1610054, 1627421, 1645365]
58289A645365K1029K2758K1873K2720K6708K8990K7586K7361L0645L2603L0390
58278A938028K8285K8987K8636K5475K4584K8674L2791L3460L4443L8281M1062
58267B282706M0892M2386M7432N0803N0286N1540N7387O2333O3253O5058O9837
58256B883913P1474O7429O4606O6765O7634O3695O1797O6298P0783P0842P2798
58245C628034Q1011Q8914R1840R6266J06816J16704J20900J25982J36849J46841
58235D740157J51425J58043J71669J84646J92003K02086K20263K37505K47663
58226F505460K60209K82677L06848L26125L49466L83558M18972M49438M86131
58217I768884N36587N89340O36879O92860P67809Q49990R30792J025646J147732
$$ y = [1645365, 1666394, 1689152, 1711025, 1733745, 1760453, 1789443, 1817029, 1844390, 1875035, 1907638, 1938028, 1966313, 1995300, 2023936, 2049411, 2073995, 2102669, 2135460, 2168920, 2203363, 2241644, 2282706, 2323598, 2365984, 2413416, 2464219, 2514505, 2566045, 2623432, 2685765, 2749018, 2814076, 2883913, 2955387, 3022816, 3087422, 3154187, 3221821, 3285516, 3347313, 3413611, 3484394, 3555236, 3628034, 3709045, 3797959, 3889799, 3986065, 4092881, 4209585, 4330485, 4456467, 4593316, 4740157, 4891582, 5049625, 5221294, 5405940, 5597943, 5800029, 6020292, 6257797, 6505460, 6765669, 7048346, 7355194, 7681319, 8030785, 8414343, 8833315, 9282753, 9768884, 10305471, 10894811, 11531690, 12224550, 12992359, 13842349, 14773141, 15798787, 16946519]
58208A6946519J285953J433328J611074J838514K107373K415155K794796L281072
58200C3713784L882091M620923N571496O815112Q399264J0377284J2836049J5831214
58192A02047217J9348403K3373762K7890601L2663327L7062469M0209854M1212960
58185C23808593L9116095L2848310K1812668O920188r122226k2962330l2314601
58178C60106697l6771841l7335764l5477921l2498686k9256245k6106724k3059607
58171A39599909k0074716j7227598j4630966j2323585j0300674q578508p163489
58164D9300373o006273n042990m249175l613790l097217k656818k285077j985934
58156B0363099j739023j519974j331793j184711j065718r56174q59738p86108
$$ y = [16946519, 18232472, 19665800, 21276874, 23115388, 25222761, 27637916, 30432712, 33713784, 37595875, 42216798, 47788294, 54603406, 63002670, 73379954, 86216003, 102047217, 121395620, 144769382, 172659983, 205323310, 242385779, 282595633, 323808593, 362924688, 395772998, 417585666, 424505854, 415383628, 392421298, 360106697, 323334856, 285999092, 250521171, 218022485, 188766240, 162659516, 139599909, 119525193, 102297595, 87666629, 75343044, 65042370, 56463862, 49300373, 43294100, 38251110, 34001935, 30388145, 27290928, 24634110, 22349033, 20363099, 18624076, 17104102, 15772309, 14587598, 13521880, 12565706, 11705968, 10919860]
58148A0919860p25185o62372o02731n56379n15598m68650m21612l85289l54193
58139F227851l18613k84374k61265k44231k24476k07256k00653j97880j88288
58130D100815j75470j67860j61570j49029j34997j27879j23864j15013j04606
58121B840527r9722r6842q9257q0906p8601p8093p1818o3363o0546o0738n6617
58110B004024n0241m8270m8871m6018m1636m1228m2550m0298l7083l8371m1340
58099A528118l9978l6427l6417l8053l5997l2285l2167l3432l0496k5209k3220
58088A164437k3252k0234j5594j4376j5308j3525j0313j0631j3632j4680j4122
58077I98770j5384j7198j6285j4878j6995k0060j8855j5032j4157j5815j5299
$$ y = [10919860, 10194675, 9532303, 8929572, 8373193, 7857595, 7388945, 6967333, 6582044, 6227851, 5909238, 5624864, 5363599, 5119368, 4894892, 4687636, 4486983, 4289103, 4100815, 3925345, 3757485, 3595915, 3446886, 3311889, 3184010, 3060146, 2945133, 2840527, 2740805, 2643963, 2554706, 2473800, 2395199, 2317106, 2245288, 2181925, 2121379, 2060641, 2004024, 1953783, 1905513, 1856642, 1810624, 1768988, 1727760, 1685210, 1644912, 1607829, 1569458, 1528118, 1488140, 1451713, 1415296, 1377243, 1341246, 1308961, 1276794, 1243362, 1212866, 1187657, 1164437, 1141185, 1120951, 1105357, 1090981, 1075673, 1062148, 1051835, 1041204, 1027572, 1012892, 998770, 983386, 966188, 949903, 935025, 918030, 897970, 879115, 864083, 849926, 834111, 818812]
58066H18812j2702j1873j2347j0656p862p781r332q420n869n914q391r636r564
58053F98465j0741j2075j0523p522o880p941p434o134o846p927n902k652k763
58040F03125n390n968m499m813o801o778m700m019m981m862m165n902r203j0181
58026E20863q754q317r101q118n359l885l983l157j644k096l988m110k444k054
58012D53853l314l692k937l088l661k193O13J647R53J404L157L647K744K688L241
57997D55062K126l0m00O41l4k666m457m798n606o690n928l927l455m311l760j887
57981D09880j443k469k208m64Q8q97r27L56O54k18J14J806K347J302R75J850J902
57964D12648Q18N23J137P35n89p37J95mj287j516r11j785l790m105k558j842k467
$$ y = [818812, 806110, 794237, 781890, 771234, 763372, 755591, 746259, 737839, 731970, 726056, 717665, 708029, 698465, 687724, 675649, 665126, 657604, 650724, 642783, 635349, 629215, 622369, 614442, 608540, 605888, 603125, 597735, 591767, 587268, 582455, 575654, 568876, 564176, 560157, 555176, 550314, 546149, 540247, 531044, 520863, 512109, 503792, 494691, 486573, 481214, 477329, 473346, 470189, 468545, 466449, 462461, 458351, 455907, 453853, 450539, 446847, 443910, 440822, 437161, 434968, 435581, 437228, 438181, 439585, 442742, 446389, 449133, 451821, 455062, 457188, 457158, 456758, 457399, 457365, 454699, 450242, 445444, 439838, 433148, 427220, 423293, 419838, 415527, 411767, 409880, 408437, 405968, 403760, 403296, 403384, 402487, 401560, 401916, 402570, 402352, 402466, 404272, 406619, 407921, 408896, 410746, 412648, 413466, 413989, 415126, 415861, 415272, 414535, 414730, 414726, 413439, 411923, 411012, 409227, 405437, 401332, 398774, 396932, 394465]
57947C94465k226r52q91j966j527N86J596J068J674M030N657O001P472J0431J2038
57932D37456J1349J0816J1334J0570P751N459M945M083J748j64r06k748o590r703
57918D85400j0068r275r187r126q334p737p499o078l443k002k717l551l307l584
57904C99492n343o877o943o737p041o583m819l388l149k701j285k18q6N23K153
57889C46998L329L536M249N749O086M576L138K832K256P44j27L08M20m62o82L21
57873C83271O04o05j131L80K204K802L196M184M400L172K320K994L639L031K468
57858D16929K963L251K658K897M782O091N131L648L726M410L958L005K858K788
57844D69095J541k50j454k385l450l796l151l031m243n214m522l063k082j223
$$ y = [394465, 392239, 391287, 390396, 388430, 386903, 387489, 389085, 390153, 391827, 395857, 401514, 407515, 414987, 425418, 437456, 448805, 459621, 470955, 481525, 489276, 494735, 499680, 503763, 505511, 505347, 504441, 501693, 495103, 485400, 475332, 466057, 456870, 447744, 439410, 431673, 424174, 418096, 414653, 412651, 409934, 406383, 403076, 399492, 394149, 387272, 380329, 373592, 366551, 359968, 355149, 351761, 348612, 345911, 344626, 344408, 344322, 344845, 346998, 350327, 353863, 358112, 363861, 369947, 374523, 377661, 380493, 382749, 383493, 383366, 383674, 384094, 383632, 382950, 383271, 383875, 383270, 382139, 382519, 384723, 387525, 390721, 394905, 399305, 402477, 404797, 407791, 411430, 414461, 416929, 419892, 423143, 425801, 428698, 433480, 439571, 444702, 448350, 452076, 456486, 460444, 463449, 466307, 469095, 470636, 470386, 468932, 466547, 463097, 459301, 456150, 453119, 448876, 443662, 439140, 436077, 433995, 432772]
57830D32772k49j72r20l89K114M089L586K237K256K896K513J803K148K733K113
57815D59530J068J142J754J328Oj160k496m872p598r293r871r878r035p148n322
57800C98155m477l839k425q07P0M05N26j67j751k910k866k603k797k432r40L59
57784C71501O13J146K947M533M426L758M188M933M371L002K419K563K225J234
57770D13859J83r86k391l354l708m586o341p306o307m721m269m501m294m038m242
57755C52998l765j744L78J116J542L213N066N179M292M702O456P412O673N475
57741C98993M952N086N588O127N999N018M065L626K785R71o59j051j069j790k490
57726D36151k161j506j547j614q48k05p96j614j244m94r16j862j611m46l8o07
$$ y = [432772, 432523, 432351, 431431, 431042, 433156, 437245, 440831, 443068, 445324, 448220, 450733, 452536, 454684, 457417, 459530, 460598, 461740, 463494, 464822, 464828, 463668, 461172, 456300, 448702, 439409, 429538, 419660, 410625, 403477, 398155, 393678, 389839, 387414, 386607, 386677, 387082, 387608, 387441, 385690, 382780, 379914, 377311, 374514, 372082, 371142, 371501, 372114, 373260, 376207, 380740, 385166, 388924, 393112, 398045, 402416, 405418, 407837, 410400, 412625, 413859, 414042, 413056, 410665, 407311, 403603, 399017, 392676, 385370, 379063, 374342, 370073, 365572, 361278, 357240, 352998, 349233, 347489, 347867, 348983, 350525, 353738, 358804, 363983, 368275, 372977, 379433, 386845, 393518, 398993, 403945, 409031, 414619, 420746, 426745, 431763, 435828, 439454, 442239, 443210, 442551, 441500, 440431, 438641, 436151, 433990, 432484, 430937, 429323, 428475, 428270, 427474, 425860, 424616, 424122, 423206, 421344, 419733, 419287, 419249, 418642]
57710D18642j057j266j857k380j975j283j448j822r00J065K519L188M030N181
57696D20637N923O288O697O559N157L258J943N71k058n160o809o799o545o564
57682D23098o131n056l871k584r54M98J438L005O373J0794J4955J9340K5249L2285
57668E18439L9025M5299N1414N5719N5317M8850L6616J8874l290k5915m3776n4390
57656G42182n8625n7923n3217m6198l8978l2273k5782k0120j6296j3643j0633
57645C68494p499n748n274m423k854j880j823j428k67N61M85K59K86J07k02j5
57629C38779L11k55j430j809j203q49j147j182o80n30r97j316j365j916k918l306
57613C18187k816k323k135j646r21q02j270j361r80j044j558j351j27R27R59L97
$$ y = [418642, 417585, 416319, 414462, 412082, 410107, 408824, 407376, 405554, 404654, 405719, 408238, 411426, 415456, 420637, 426560, 432848, 439545, 446104, 451261, 454519, 456462, 457033, 454975, 449815, 443006, 436207, 429662, 423098, 416967, 411911, 408040, 405456, 404502, 405000, 406438, 409443, 415816, 426610, 441565, 460905, 486154, 518439, 557464, 602763, 654177, 709896, 765213, 814063, 850679, 869553, 866263, 840348, 796572, 742182, 683557, 625634, 572417, 526219, 487241, 454968, 429186, 409066, 392770, 379127, 368494, 360995, 355247, 349973, 345550, 342696, 340816, 338993, 337565, 337298, 337859, 338344, 338603, 338889, 338996, 338794, 338779, 339090, 338835, 337405, 335596, 334393, 333544, 332397, 331215, 330535, 330005, 329008, 327692, 326327, 324411, 321493, 318187, 315371, 313048, 310913, 309267, 308346, 307544, 306274, 304913, 303933, 302889, 301331, 299980, 299853, 300780, 301739, 302136]
57597C02136l20j420k810l745l881l567l060k546k695l793m668l992k348j379
57583B61912j263q73j22q7r00j424j222r73j012j128j678l065m315m098k956k490
57567B34306k632k027q69q12j987k653k131j583j578j297o52o93j320j006N08
57552B13574J552J306R97J535K178K354K639L142K957K001J306Q52n32k456k708
57537B30697p21J209J392R12R81O65q95k298k035j002q09j124p08J96N31L70N05
57520B27866Q43Q88J007J775K693K828K210J597J473K007L171M217L960K298N28
57505B59361m18r85j643j870j292n80l55l66m65j206k617l572l252k200j285p21
57489B36534o44j263j938j526k56K72m40j049p31m23p57p22L59J308R69Pn70j146
$$ y = [302136, 301816, 300396, 297586, 293841, 289960, 286393, 283333, 280787, 278092, 274299, 269631, 265639, 263291, 261912, 260649, 259776, 259654, 259567, 258667, 257243, 256021, 255048, 254036, 252908, 251230, 248165, 243850, 239752, 236796, 234306, 231674, 229647, 228778, 227966, 225979, 223326, 221195, 219612, 218034, 216737, 216085, 215392, 214072, 213066, 213574, 215126, 216432, 217429, 218964, 221142, 223496, 226135, 229277, 232234, 234235, 235541, 236393, 235861, 233405, 230697, 229976, 231185, 232577, 233489, 234470, 235135, 234240, 231942, 229907, 228905, 228096, 226972, 226264, 226460, 226991, 227361, 227866, 228709, 229597, 230604, 232379, 235072, 237900, 240110, 241707, 243180, 245187, 248358, 252575, 256535, 258833, 259361, 258943, 257958, 256315, 254445, 253153, 252573, 252218, 251852, 251387, 250181, 247564, 243992, 240740, 238540, 237255, 236534, 235890, 234627, 232689, 231163, 230907, 231179, 230739, 229690, 228959, 228536, 227779, 227057, 227416, 228724, 229693, 229700, 229130, 227984]
57471B27984k237l016k674k013k101k514k404k097k135j866o50O11P32J69O7K85
57455B06141m0o87o88j0N41O56N85L82Q6P4L53K37m12n58M36J632J979J877K114
57436B14698K407K240K096K450K549J713Q79J208K018J788O51J19P17J520J776
57421B38829J580J086L41k48k93j08j39j16L27P73P38P02J344K286K671K484K200
57404B54457J712P34k00l75j94o48j721k404k142j319n24k5J58L50J019K031K630
57387B53539K588K619L096L406L196L222L988M595M085K947K112J383J24j255
57373B89645j904k042k529l447m298n029n698n799n111m637n366o601o790n584
57359B24810l869k221o00Q39J846K743L878M860N250N498O092O466N956N215N319
$$ y = [227984, 225747, 222731, 220057, 218044, 215943, 213429, 211025, 208928, 206793, 204927, 204277, 204888, 205620, 205789, 205856, 206141, 206101, 205414, 204726, 204716, 205257, 205913, 206498, 206880, 206966, 207040, 207393, 207630, 207218, 206660, 207096, 208728, 210707, 212584, 214698, 217105, 219345, 221441, 223891, 226440, 228153, 229032, 230240, 232258, 234046, 234697, 234816, 235533, 237053, 238829, 240409, 241495, 241836, 241588, 241295, 241187, 241048, 240932, 241259, 242032, 242770, 243472, 244816, 247102, 249773, 252257, 254457, 256169, 256903, 256703, 256328, 256134, 255486, 253765, 251361, 249219, 247900, 247376, 247351, 247509, 247859, 248878, 250909, 253539, 256127, 258746, 261842, 265248, 268444, 271666, 275654, 280249, 284334, 287281, 289393, 290776, 290900, 289645, 287741, 285699, 283170, 279723, 275425, 270396, 264698, 258899, 253788, 249151, 243785, 237184, 230394, 224810, 220941, 218720, 218120, 218959, 220805, 223548, 227426, 232286, 237536, 243034, 249126, 255592, 261548, 266763, 272082]
57344B72082N930N802M698L473K582J886J649K284L252L508L063K840L136L294
57330C19479K885K107J152J87j24P21K025K522K022J449J344J345J135R43J041
57315C40233J459K129K723K640J804J083J172J607J679J748K546L658L900L032
57301C71413K004J610J814K228K509K472K438L119M508N492N335M827N078N851
57287D20698O239O208O237O015M965L751L733N065O447O810O256N457N052N452
57273D98385O414O986O640O037N965O147N990N755N966O283O101N690N608N635
57259E83602N406N380N981O536O417O440P598R080R353Q615Q399R100R738R865
57245F91510R943R918R251Q387Q447R355R919R871J0184J1119J1659J1285J0852
$$ y = [272082, 278012, 283814, 288512, 291985, 294567, 296453, 298102, 300386, 303638, 307146, 310209, 313049, 316185, 319479, 322364, 324471, 325623, 325810, 325686, 326407, 328432, 330954, 332976, 334425, 335769, 337114, 338249, 339192, 340233, 341692, 343821, 346544, 349184, 350988, 352071, 353243, 354850, 356529, 358277, 360823, 364481, 368381, 371413, 373417, 375027, 376841, 379069, 381578, 384050, 386488, 389607, 394115, 399607, 404942, 409769, 414847, 420698, 426937, 433145, 439382, 445397, 450362, 454113, 457846, 462911, 469358, 476168, 482424, 487881, 492933, 498385, 504799, 511785, 518425, 524462, 530427, 536574, 542564, 548319, 554285, 560568, 566669, 572359, 577967, 583602, 589008, 594388, 600369, 606905, 613322, 619762, 627360, 636440, 645793, 654408, 662807, 671907, 681645, 691510, 701453, 711371, 720622, 729009, 737456, 746811, 756730, 766601, 776785, 787904, 799563, 810848, 821700]
57232H21700J1154J1864J2397J2740J3025J3202J3439J4032J4780J5218J5422
57221I68973J5765J6086J6042J6002J6559J7446J8029J8569J9668K0842K1034
57210A165015K0447K0420K1538K3108K4450K5477K6086K6227K6553K7684K9026
57199A436031K9558K9534K9989L0889L1309L1304L1916L3329L4585L5235L5742
57188A789421L6223L6427L6934L8695M1204M2865M3435M4429M6708M9271N1008
57177B256620N2042N2758N2937N2529N2095N1944N1821N1761N2117N2583N2492
57166B831699N2283N3272N5673N8328O0773O3969O8253P1926P2802P0196O4835
57155C524009N7823N0468M4311M0439L8983L9415M0824M2044M2260M1555M0225
$$ y = [821700, 832854, 844718, 857115, 869855, 882880, 896082, 909521, 923553, 938333, 953551, 968973, 984738, 1000824, 1016866, 1032868, 1049427, 1066873, 1084902, 1103471, 1123139, 1143981, 1165015, 1185462, 1205882, 1227420, 1250528, 1274978, 1300455, 1326541, 1352768, 1379321, 1407005, 1436031, 1465589, 1495123, 1525112, 1556001, 1587310, 1618614, 1650530, 1683859, 1718444, 1753679, 1789421, 1825644, 1862071, 1899005, 1937700, 1978904, 2021769, 2065204, 2109633, 2156341, 2205612, 2256620, 2308662, 2361420, 2414357, 2466886, 2518981, 2570925, 2622746, 2674507, 2726624, 2779207, 2831699, 2883982, 2937254, 2992927, 3051255, 3112028, 3175997, 3244250, 3316176, 3388978, 3459174, 3524009, 3581832, 3632300, 3676611, 3717050, 3756033, 3795448, 3836272, 3878316, 3920576, 3962131, 4002356]
57144D002356L7918L4348L0449K7637K6146K5168K4399K4267K4904K6130K8138
57133D311860L0932L3387L4351L4260L4341L4592L4107L3021L2408L2517L2817
57122D678593L3550L5520L8611M2260M7149N4523O3991P3796Q3169R2603J02164
57111E345929J11531J21579J33922J49093J66972J88634K15871K49469K90171
57102F973171L40686M04526M83783N80690P00476Q49523J030988J244851J490609
57093A4099303J765533K060320K359992K648926K912584L137226L313786L440682
57085C5738352L517691L540465L509640L439274L335079L154255K803303K199056
57077F1237115J339735L14853p48154j740964k593704l268436l752362m053642
$$ y = [4002356, 4040274, 4074622, 4105071, 4132708, 4158854, 4184022, 4208421, 4232688, 4257592, 4283722, 4311860, 4342792, 4376179, 4410530, 4444790, 4479131, 4513723, 4547830, 4580851, 4613259, 4645776, 4678593, 4712143, 4747663, 4786274, 4828534, 4875683, 4930206, 4994197, 5067993, 5151162, 5243765, 5345929, 5457460, 5579039, 5712961, 5862054, 6029026, 6217660, 6433531, 6683000, 6973171, 7313857, 7718383, 8202166, 8782856, 9483332, 10332855, 11363843, 12608694, 14099303, 15864836, 17925156, 20285148, 22934074, 25846658, 28983884, 32297670, 35738352, 39256043, 42796508, 46306148, 49745422, 53080501, 56234756, 59038059, 61237115, 62576850, 62891703, 62143549, 60402585, 57808881, 54540445, 50788083, 46734441]
57069D6734441m192995m194596m082814l882283l616797l308267k977287k642482
57061A7836920k318015k013023j733734j484379j265984j076785r14796p78562
57053F251642o65393n71058m91991m26217l72007l27231k90404k60687k36571
57044B610083k15954j97680j81530j66788j52332j38056j24659j11993r9223q6533
57034A135335p5049o5030n5612m6392l7780k9648k1045j1416j144Q882J7308K2479
57022H40888K3790K2184J7949R055o278k5797m4023n6767o3262o4461o1531n6117
57010E35630n0031m4019l8029l2570k8353k4964k1509j8422j6831j6356j5462
56999B29084j3987j3349j4054j4879j4850j4372j3989j3478j2595j1298r034n188
$$ y = [46734441, 42541446, 38346850, 34264036, 30381753, 26764956, 23456689, 20479402, 17836920, 15518905, 13505882, 11772148, 10287769, 9021785, 7945000, 7030204, 6251642, 5586249, 5015191, 4523200, 4096983, 3724976, 3397745, 3107341, 2846654, 2610083, 2394129, 2196449, 2014919, 1848131, 1695799, 1557743, 1433084, 1321091, 1221868, 1135335, 1060286, 995256, 939644, 893252, 855472, 825824, 804779, 793363, 792219, 801101, 818409, 840888, 864678, 886862, 904811, 913866, 907588, 881791, 837768, 781001, 717739, 653278, 591747, 535630, 485599, 441580, 403551, 370981, 342628, 317664, 296155, 277733, 260902, 244546, 229084, 215097, 201748, 187694, 172815, 157965, 143593, 129604, 116126, 103531, 92233, 83199, 78011]
56987G8011m33L650O540R115J1907J4252J5143J3819R774L541k722o942r268j1080
56973A35307j2287j1525q828o077m445l243j634K09K111M431P178R880J2609J5831
56959A39517J9060K1147K1990K2350K1793J8541J1858L141n678j3405j9033k1651
56947B19630k1536k0018j7823j4746j1080p827n113j975J875N552Q663J1997J6008
56934A63607K0058K3729K7410L0928L2810L1545K6609J8000O212o843j8221k6024
56922C29820l0295l1765l1006k8963k6810k4718k1924j8388j5143j2730j0625
56911G7453q525o761n262l564k176k254l443l801k509r73m54k35Q68K589L922
56896D4875M588M875N083N841P877J0768J3065J4348J5876J8547K1413K3001K2782
$$ y = [78011, 77578, 81228, 87768, 96883, 108790, 123042, 138185, 152004, 161778, 165319, 162597, 155655, 146387, 135307, 123020, 111495, 102667, 96590, 92145, 88902, 87268, 87477, 89588, 94019, 101197, 111077, 123686, 139517, 158577, 179724, 201714, 224064, 245857, 264398, 276256, 279397, 273719, 260314, 241281, 219630, 198094, 178076, 160253, 145507, 134427, 126600, 121487, 119512, 121387, 126939, 135602, 147599, 163607, 183665, 207394, 234804, 265732, 298542, 330087, 356696, 374696, 380908, 374065, 355844, 329820, 299525, 267760, 236754, 207791, 180981, 156263, 134339, 115951, 100808, 88078, 77453, 68928, 62167, 56905, 53341, 51165, 48911, 45468, 41667, 39158, 38185, 37731, 37496, 38364, 40953, 44875, 49463, 54338, 59421, 65262, 73139, 83907, 96972, 111320, 127196, 145743, 167156, 190157, 212939]
56883B12939K0493J5446P715r22q307j3502j6450j7099j5720j3194j0186o714
56871A54499k988L46L276O659J0778J4970J9258K4881L2197L9419M4646M7916
56859C95857M9892M9448M4175L3041J7491L08j5741k8556l7073m1183m1162l7558
56847C88939l1621k4923j8138j0939l274M246J1532J9415K8332L7738M7296N7452
56835E06055O7967P6926Q1926Q1329P3733N7687L3302L722k5935n0824o7659p5254
56823G62975p4955o9773o2171n3031m2895l2979k4097j5741p176J349R385J7413
56811D08304K6221L5665M4842N2861N8601O0321N6258M5438K7850M845k0056m1835
56799G59315n6621o3614o4301o0641n4380m7041l9595l2402k5717j9698j3864
$$ y = [212939, 233432, 248878, 256593, 255671, 247364, 233862, 217412, 200313, 184593, 171399, 161213, 154499, 151511, 151857, 155133, 161792, 172570, 187540, 206798, 231679, 263876, 303295, 347941, 395857, 445749, 495197, 539372, 572413, 589904, 590212, 574471, 545915, 508842, 467659, 426497, 388939, 357318, 332395, 314257, 303318, 300044, 304290, 315822, 335237, 363569, 401307, 448603, 506055, 574022, 650948, 732874, 814203, 887936, 945623, 978925, 982647, 956712, 905888, 838229, 762975, 688020, 618247, 556076, 503045, 460150, 427171, 403074, 387333, 380157, 381506, 390891, 408304, 434525, 470190, 515032, 567893, 626494, 686815, 743073, 788511, 816361, 821206, 801150, 759315, 702694, 639080, 574779, 514138, 459758, 412717, 373122, 340720, 315003, 295305, 281441]
56788B81441p532r83M829R916J5259K0931K5616K8472K9876K9598K5833J7281
56776D80537N124q060k0303l0338l6897l9282l8089l4648l0207k6075k3241k1301
56764A77220j8780j5234j1966j0035q852p532o277n530m957m257l855l897l653
56751G2395k774j964j644j204l99p6o03r82n49j13l80p11o17q47j706j909o19
56734E5298Q69J044M08J85J71l28p75l61L65O12R36J985K836K499J925K479L413
56717G3561K963J220j90n72l86L02J545K325J659M54L04J075J493J457J733J936
56701I0879J105j37k42O85J139Q10Q32J442J701J490J710K286K124J276J134K022
56685A10256K559J899R17O27R46J475K071K276J582N53L18P67O81j93p51m69j42
$$ y = [281441, 273909, 272926, 277755, 287671, 302930, 323861, 349477, 377949, 407825, 437423, 463256, 480537, 485661, 477601, 457298, 426960, 390063, 350781, 312692, 278044, 247837, 221762, 198521, 177220, 158440, 143206, 131240, 121205, 112353, 104821, 98544, 93014, 88057, 83800, 79945, 76048, 72395, 69621, 67657, 66013, 64809, 64410, 64334, 63731, 62749, 62200, 62087, 61707, 60996, 60379, 59532, 57826, 55917, 55298, 56167, 57211, 57619, 57804, 57975, 57647, 56872, 56511, 56876, 57488, 58424, 60409, 63245, 65744, 67669, 70148, 73561, 76524, 77744, 77554, 76982, 76596, 76898, 78443, 80768, 82427, 82881, 83185, 84260, 85753, 87210, 88943, 90879, 91984, 91847, 91605, 92290, 93429, 94239, 95071, 96513, 98214, 99704, 101414, 103700, 105824, 107100, 108234, 110256, 112815, 114714, 115631, 116258, 117204, 118679, 120750, 123026, 124608, 125161, 125479, 126246, 126927, 126734, 125983, 125514, 125372]
56668A25372l33o18q10j402k323k562j680m82K54O50Q72O22j15p67j006j018p87
56651A13867j41M48K01o48j012n47j5M2j24k99n53n23K52J202J164J93l23L61
56633A13545J459J931J583O20p06j742j855j363j102j036n18J73Mr63j416q31
56617A07783k13l15n68l65j43m42r91j385j683j786j218j19N17K17l00l15j29
56600I8545k23l10P0O42Q54P35P33R88J232J167P11N0m40n18l01RL53N66L96J58
56580A05417O06J680K153J379M31M74R00M99l10r7J247K520L231L898M511M533
56564A33072M392N257P139Q876J0142J1806J3971J5295J4733J2535R201M873K16
56551B51508l549n971p628q759q876p987o865n848m696l767l872m558m230k515
$$ y = [125372, 125039, 124421, 123611, 122209, 119886, 117324, 115644, 115162, 115416, 116066, 116938, 117560, 117445, 116678, 115672, 114654, 113867, 113726, 114174, 114375, 113727, 112715, 112168, 112153, 112195, 112071, 111772, 111219, 110696, 110948, 112150, 113314, 113507, 113184, 113545, 115004, 116935, 118518, 119138, 118432, 116690, 114835, 113472, 112370, 111334, 110816, 110989, 110993, 110030, 108614, 107783, 107570, 107255, 106687, 106322, 106179, 105737, 104746, 103361, 101678, 99892, 98674, 98555, 99072, 99289, 98989, 98674, 98545, 98322, 98012, 98082, 98724, 99578, 100313, 101046, 102034, 103266, 104433, 105144, 105194, 104754, 104236, 103935, 103944, 104297, 104863, 105259, 105417, 106023, 107703, 109856, 111235, 111666, 112140, 113040, 113539, 113229, 113132, 114379, 116899, 120130, 124028, 128539, 133072, 137464, 142721, 149860, 158736, 168878, 180684, 194655, 209950, 224683, 237218, 246419, 251292, 251508, 247959, 241988, 234360, 225601, 216725, 208738, 201873, 196025, 191329, 187562, 183690, 179132, 174902, 172387]
56537A72387j005r99j814k125j751j322j172j283j532j527r37k06q5m23l71J92
56521A56027O27Q17J174J322L83j272k096j596r67j117j555j682j750j944j904
56506A44467j677j861k346k192j190k49J57N14R39P64l5m78j54K27K89N28R73
56489A38676Q45J52J8Q23J442J023R9o86j365j696r78M36J038L50l09N0P13Q36
56471A41467P40Q31O99K61L12J063J543J258R31Q92L84o27q09K65R52K2j379j559
56453A47246o32M15J494K775L472K921J885J386J212P55M00P60J416J583J207
56438A68295M78p25j965k034o71N78L76o37j126r53o72l13J02p8r51j324l82Q73
56420A58871J145P64Q22J281J374J069Q72P40L48j26l57m87o04m39j61m38j124
$$ y = [172387, 171382, 170383, 168569, 166444, 164693, 163371, 162199, 160916, 159384, 157857, 156920, 156714, 156629, 156206, 155835, 156027, 156654, 157471, 158645, 159967, 160350, 159078, 156982, 155386, 154419, 153302, 151747, 150065, 148315, 146371, 144467, 142790, 140929, 138583, 136391, 135201, 134952, 135109, 135623, 136562, 137326, 137291, 136813, 136659, 136886, 137175, 137703, 138676, 139521, 139673, 139691, 140514, 141956, 142979, 143078, 142392, 141027, 139331, 138353, 138789, 139827, 140177, 139868, 139918, 140631, 141467, 142207, 143038, 143737, 143998, 144310, 145373, 146916, 148174, 149105, 149997, 150381, 149754, 148945, 149210, 150162, 150184, 148805, 147246, 146614, 147029, 148523, 151298, 154770, 157691, 159576, 160962, 162174, 162929, 163329, 164089, 165505, 167088, 168295, 168773, 168048, 166083, 164049, 163378, 163956, 164332, 163695, 162569, 161616, 160944, 160631, 160733, 160655, 159704, 158380, 157998, 158871, 160016, 160780, 161602, 162883, 164257, 165326, 166198, 166938, 167286, 167160, 166803, 166316, 165712, 165273, 165112, 164674, 163550]
56403A63550j033J76J241J235Q88J002J026L82j44K72J006J184J293K132L116
56388A77326L101K130J222R24J058J249J008Q7p40l26R88J533P46r7j83k50o51
56371A89125l78Q95J782J519J286J888K169J268M03O47R64L44j36N73J263O87
56355B04299R8J090K543K474J480J516K350K123P58l9K77O53O47Q11J050P04Q0
56338B22914J52Q82J471J820K293K684K811L306M359M772L871L116L852M815M078
56323B67196K375J952L005L708L282K568J891P01p50j472j361j126q10qR14J345
56307B83410J636K298K841K905L504N364P160P391O871P201P872P310N872N221
56293C56856N421N140M294L993M339M539M848O099P742Q570Q933J0008J1331J1438
$$ y = [163550, 162517, 162693, 163934, 165169, 166057, 167059, 168085, 168467, 168323, 168595, 169601, 170785, 172078, 174210, 177326, 180427, 182557, 183779, 184703, 185761, 187010, 188018, 188105, 187365, 187039, 188027, 189560, 190306, 190209, 190026, 189776, 189125, 188747, 189642, 191424, 192943, 194229, 196117, 198286, 199554, 199957, 200604, 201568, 201912, 201776, 202349, 203612, 204299, 204397, 205487, 208030, 210504, 211984, 213500, 215850, 217973, 218731, 218692, 218969, 219622, 220269, 221080, 222130, 222834, 222914, 223066, 223948, 225419, 227239, 229532, 232216, 235027, 238333, 242692, 247464, 251335, 254451, 258303, 263118, 267196, 269571, 271523, 274528, 278236, 281518, 284086, 285977, 286678, 285928, 284456, 283095, 281969, 281159, 281151, 282065, 283410, 285046, 287344, 290185, 293090, 296594, 301958, 309118, 316509, 323380, 330581, 338453, 345763, 351635, 356856, 362277, 367417, 371711, 375704, 380043, 384582, 389430, 395529, 403271, 411841, 420774, 430782, 442113, 453551]
56279D53551J0524J0188J0777J1272J1485J2141J3080J3502J3782J4910J6535
56268E91747J7664J8751K0926K3720K5756K7271K9644L2983L6463M0464M5981
56257I11370N2442N8612O5168P3792Q4176R4539J04728J16148J28956J41911J54743
56246A986585J67974J80615J90693J97946K03370K06339K04782J98032J86909
56237C723245J71192J49782J23198R3324O0824K5613j0385m3845p3423r9916j23265
56226C996344j42324j57436j70093j79870j84706j84539j81684j77346j70630
56217B447716j61368j51134j40980j30688j20637j11856j04053r6036q8115q1549
56207A261300p5873o9517o2846n7565n3252m7759m1056l5356l1326k7470k3561
$$ y = [453551, 464075, 474263, 485040, 496312, 507797, 519938, 533018, 546520, 560302, 575212, 591747, 609411, 628162, 649088, 672808, 698564, 725835, 755479, 788462, 824925, 865389, 911370, 963812, 1022424, 1087592, 1161384, 1245560, 1340099, 1444827, 1560975, 1689931, 1831842, 1986585, 2154559, 2335174, 2525867, 2723813, 2927183, 3133522, 3338304, 3536336, 3723245, 3894437, 4044219, 4167417, 4260741, 4321565, 4347178, 4336793, 4292948, 4219525, 4119609, 3996344, 3854020, 3696584, 3526491, 3346621, 3161915, 2977376, 2795692, 2618346, 2447716, 2286348, 2135214, 1994234, 1863546, 1742909, 1631053, 1527000, 1430964, 1342849, 1261300, 1185427, 1115910, 1053064, 995499, 942247, 894488, 853432, 818076, 786750, 759280, 735719]
56196G35719k1173k0311j8920j6395j4403j3549j2388j0469r212q998q407p047
56184E74447o208o089n360m028l741m599m740l589k566k111j168kk36j558j751
56169E26701m69L66M51J654M124N540N284N626P644R516J0004J0282J1165J1802
56155F09690J2151J3520J5762J7205J8105K0662K4952K8565L1022L4657M0252
56144H66543M5955N1567N9587P0438Q0877Q8858R5912J02935J07526J07523J03618
56133A781339R6695Q6273P3411O1640N3100M6934M2583M0747L9764L5337K5946
56122B383769J4767M541n491j5891k4757l1462l8838m9222o1751p5210q9626j03218
56110A907611j11946j14277j12638j08494j00280q8061p5612o5394n5753m5450
$$ y = [735719, 714546, 694235, 675315, 658920, 644517, 630968, 618580, 608111, 598899, 589901, 581494, 574447, 568239, 562150, 556790, 552762, 549021, 544422, 539682, 536093, 533527, 531416, 530248, 530246, 530010, 528452, 526701, 526232, 526598, 527049, 528703, 532827, 538367, 543651, 549277, 556921, 566437, 576441, 586723, 597888, 609690, 621841, 635361, 651123, 668328, 686433, 707095, 732047, 760612, 791634, 826291, 866543, 912498, 964065, 1023652, 1094090, 1174967, 1263825, 1359737, 1462672, 1570198, 1677721, 1781339, 1878034, 1964307, 2037718, 2099358, 2152458, 2199392, 2241975, 2282722, 2322486, 2357823, 2383769, 2398536, 2403077, 2397586, 2381695, 2356938, 2325476, 2286638, 2237416, 2175665, 2100455, 2010829, 1907611, 1795665, 1681388, 1568750, 1460256, 1359976, 1271915, 1196303, 1130909, 1075156, 1029706]
56100A029706l6598l0607k5510j9957j5682j3546j1344q044n913n896n331k746
56088H48532n51k59L37K577M108L494L066M404N524N314N926Q076Q920P480P038
56073I13986R143J0635R789R757J2426J4516J3742J3166J5227J7036J6031J4941
56061A070395J6490J8302J7743J6787J7529J7790J5730J3884J4189J4106J2065
56050A245010J1400J4382J7689J8376J8783K1062K2643K1932K2340K5653K7637
56039A466907K5449K3028K3690K4041K1077J8505J9839K1888K1596K2475K7500
56028A715995L2463L3499L4310L8588M2313M1457M0299M3795M8407M9058M8658
56017B168842N1972N6403N7716N8597O2792O6951O7243O7574P2420P8115Q0097
$$ y = [1029706, 993108, 962501, 936991, 917034, 901352, 887806, 876462, 868418, 862505, 856609, 851278, 848532, 847981, 847722, 848059, 850636, 854744, 858238, 861304, 865708, 871232, 876546, 882472, 890548, 899468, 906948, 913986, 923129, 933764, 943553, 953310, 965736, 980252, 993994, 1007160, 1022387, 1039423, 1055454, 1070395, 1086885, 1105187, 1122930, 1139717, 1157246, 1175036, 1190766, 1204650, 1218839, 1232945, 1245010, 1256410, 1270792, 1288481, 1306857, 1325640, 1346702, 1369345, 1391277, 1413617, 1439270, 1466907, 1492356, 1515384, 1539074, 1563115, 1584192, 1602697, 1622536, 1644424, 1666020, 1688495, 1715995, 1748458, 1781957, 1816267, 1854855, 1897168, 1938625, 1978924, 2022719, 2071126, 2120184, 2168842, 2220814, 2277217, 2334933, 2393530, 2456322, 2523273, 2590516, 2658090, 2730510, 2808625, 2888722]
56006B888722Q1782Q7170R2227R3136R5142J03184J11897J15467J18881J28308
55996C915916J39072J44999J50702J62206J74509J81468J88767K03423K19879
55987E480941K30861K42196K61839K84346L02205L22054L52742L87920M18384
55978H283488M50786M95280N45884N93064O44242P10653P86097Q61176R45978
55969A4316648J054742J181584J317335J476377J679334J924780K208619K555785
55961B7715204L001240L559316M249802N135973O297600P787785R656733J1984485
55953G9388138J4834404J8207141K2093409K6491849L1230819L5773533L9299197
55946B67318490M0921128L9662565L4356439K4128784R474027p184459k2388038
$$ y = [2888722, 2970504, 3057674, 3149901, 3243037, 3338179, 3441363, 3553260, 3668727, 3787608, 3915916, 4054988, 4199987, 4350689, 4512895, 4687404, 4868872, 5057639, 5261062, 5480941, 5711802, 5953998, 6215837, 6500183, 6802388, 7124442, 7477184, 7865104, 8283488, 8734274, 9229554, 9775438, 10368502, 11012744, 11723397, 12509494, 13370670, 14316648, 15371390, 16552974, 17870309, 19346686, 21026020, 22950800, 25159419, 27715204, 30716444, 34275760, 38525562, 43661535, 49959135, 57746920, 67403653, 79388138, 94222542, 112429683, 134523092, 161014941, 192245760, 228019293, 267318490, 308239618, 347902183, 382258622, 406387406, 415861433, 408676974, 386288936]
55939C86288936l3399650l9294638m0702105l8899477l5179419l0630865k6033949
55932A42148833k1803627j8087497j4930018j2328414j0211652q476380p055523
55925D9255722n912818m993745m233722l601446l089662k673831k318309k012096
55917B0420093j761693j556784j375222j213409j080992r72406q71676p78740
55909A0809171p04509o45575n88477n33523m90885m57943m22734l85568l56227
55900F223730l33564l07820k79718k58220k42460k23896k03520j89632j81121
55891D003779j69408j54593j44037j37251j27347j15221j07641j03323r5079q3872
55881B766007p6914p3784o8011o0735n9346o3609o6041o5169o6116o8856o7966
$$ y = [386288936, 352889286, 313594648, 272892543, 233993066, 198813647, 168182782, 142148833, 120345206, 102257709, 87327691, 74999277, 64787625, 56311245, 49255722, 43342904, 38349159, 34115437, 30513991, 27424329, 24750498, 22432189, 20420093, 18658400, 17101616, 15726394, 14512985, 13431993, 12459587, 11587911, 10809171, 10104662, 9459087, 8870610, 8337087, 7846202, 7388259, 6965525, 6579957, 6223730, 5890166, 5582346, 5302628, 5044408, 4801948, 4578052, 4374532, 4184900, 4003779, 3834371, 3679778, 3535741, 3398490, 3271143, 3155922, 3048281, 2944958, 2849879, 2766007, 2689093, 2615309, 2547298, 2486563, 2427217, 2363608, 2297567, 2232398, 2166282, 2097426, 2029460]
55870B029460o3662o1652o2223o0226n5452n2580n1412m7372m1138l7881l7504
55859A458358l5336l1723l1191l2936l1854k8520k8339l1231l1703k9029k7914
55848A118582k9100k8489k5810k5113k6285k4904k0914j8937j9521j8495j5441
55837H65573j4453j5835j5342j2483j1469j2931j2667r772q291r408r446p178
55825G26298o013p293q190p717q448j0806j1898j1183j1314j2402j1546q930q106
55812F02452r296q758n759l852m041l161l81J041J34K01K610M475M444N073P352
55797E92534Q281O169L361J634m03l455n726o682q192j0336j0560q443o889p123
55783E44170o936n339m563n903p824r490j1964j4649j4942j2703j0872j0426r133
$$ y = [2029460, 1965798, 1904146, 1841923, 1781697, 1726245, 1673665, 1622253, 1574881, 1533743, 1495862, 1458358, 1423022, 1391299, 1360108, 1327172, 1295318, 1266798, 1238459, 1207228, 1175525, 1146496, 1118582, 1089482, 1060993, 1035183, 1010070, 983785, 958881, 937967, 919030, 899509, 881014, 865573, 851120, 835285, 819943, 807460, 795991, 783060, 770393, 760621, 752330, 742922, 733476, 726298, 720285, 712992, 704802, 697085, 688637, 677831, 665933, 654750, 643436, 631034, 619488, 610558, 602452, 593156, 584398, 578639, 574787, 570746, 567585, 567204, 568245, 568379, 568580, 571190, 575665, 580109, 585182, 592534, 600815, 606984, 610345, 611979, 611576, 608121, 602395, 595713, 587521, 577185, 566625, 558182, 551293, 544170, 537234, 531895, 527332, 521429, 513605, 504115, 492151, 477502, 462560, 449857, 438985, 428559, 419426]
55770D19426o351m491m317l477j220m0r86j767j291j623l530m473l193k074k795
55755C77798l557k929k559l743m842m541m333n489o642o524o148o335n946m535
55741C09675l800m570n119m254l302l393l497k762k150k204j836p23k96j020j432
55726B69317r92j160k459l326l004k757l097k832j852j799k871l055j742q54j226
55711B36291j215j68J90o42n48J305K619J891Q50R30O31j349l378l697l192l127
55695B27391k776j498o31j006j014O75K679L322L211L448L474K743K369L113L780
55680B49280L457L243L982M489L809L068L165K883J268k38j28O84O35q8p75j968
55664B76766m091n983o580o386n887m376j887k01l15q47o01n06j329j668l03J441
$$ y = [419426, 413075, 408584, 404267, 400790, 399570, 399530, 398544, 396777, 395486, 393863, 390333, 385860, 382667, 380593, 377798, 374241, 371312, 368753, 365010, 360168, 355627, 351294, 345805, 339163, 332639, 326491, 320156, 314210, 309675, 305875, 301305, 296186, 291932, 288630, 285237, 281740, 278978, 276828, 274624, 272788, 272065, 271769, 270749, 269317, 268325, 267165, 264706, 261380, 258376, 255619, 252522, 249690, 247838, 246039, 243168, 240113, 238371, 237517, 236291, 235076, 234908, 235098, 234456, 233908, 235213, 237832, 239723, 240573, 241503, 242134, 240785, 237407, 233710, 230518, 227391, 224615, 223117, 222486, 221480, 220466, 221141, 223820, 227142, 230353, 233801, 237275, 240018, 242387, 245500, 249280, 252737, 255980, 259962, 264451, 268260, 271328, 274493, 277376, 278644, 278406, 278278, 278962, 279597, 279509, 278734, 276766, 272675, 266692, 260112, 253726, 247839, 243463, 241576, 241375, 241060, 240213, 239612, 239106, 237777, 236109, 235806, 237247]
55648B37247J717Q63J56l88j142j467j113j364l056m912n520n370n422n349m761
55633B00119m382m484l894k176q76j040j411p91r5k71k65Q42J664P52p80j076
55617A81836m68l72p48q33j057k103l242l529l499l815l620k029q5O75M06M1n02
55600A57056j454j860r82J78L85N6N7J5n74r37m52n8n95j082l94P73J258J358
55582A52748J721J831J344J364K577L636L371L021M247O388P772Q447R431J0545
55568B18443J1042J1235J1509J0920Q689N784L244M04l212n965o423o079p229
55555B52362r394j0461j0184r901r757q925p797p390p108n633l450k155j779j089
55541A57339p7K04j73j41L24M39L76Q33J271O41n65j003p41q74j412j550j479
$$ y = [237247, 238964, 239827, 239983, 239595, 238453, 236986, 235873, 234509, 231453, 226541, 221021, 215651, 210229, 204880, 200119, 195737, 191253, 187359, 185183, 184307, 183267, 181856, 181065, 180970, 180699, 180434, 181276, 182940, 183692, 182912, 181836, 181368, 180996, 180248, 179415, 178358, 176255, 173013, 169484, 165985, 162170, 158550, 156521, 156436, 157111, 157517, 157558, 157056, 155602, 153742, 152760, 152938, 153323, 153379, 153436, 153451, 152877, 151940, 151488, 151430, 150835, 149753, 149359, 150132, 151390, 152748, 154469, 156300, 157644, 159008, 161585, 165221, 168592, 171613, 175860, 182248, 190020, 198467, 207898, 218443, 229485, 240720, 252229, 263149, 271838, 277622, 280866, 281270, 278058, 272093, 265670, 259591, 252362, 242968, 232507, 222323, 212422, 202665, 193740, 185943, 178553, 171445, 165812, 162362, 160207, 158428, 157339, 157262, 157466, 157293, 157152, 157476, 157915, 158291, 159124, 160395, 161036, 160471, 159468, 158727, 157853, 156441, 154891, 153412]
55524A53412j946k516k354k103k868l907l588k214j552j887j888j246j101j706
55510A22536j909j216m90l67n33p22r89r96m28J78K18J65N02L84r02k029j304
55493A12098M73J117M74L21J093J301L14o59p99p51r48p50K20J331K018K244J870
55476A20967Q28r9k2O02O57J41j54k74p72j249r56m56q32j579j290j24M41J23
55458A15952l7J05l90j419j746j175p58o37J96J643K210J397M90L75M35J53J7
55441A16811J82k0o39p43j46J01n26j181j160q17n12mO35Q01N47O38J132J184
55423A16283O37L55O52P48K62p9K33P16Q81R22R88Q26L79j14o45j170j066n4P15
55404A21469q5j835k738k373j851j567q18L15P97N63P09J382J439O34J99O94J087
$$ y = [153412, 151466, 148950, 146596, 144493, 141625, 137718, 134130, 131916, 130364, 128477, 126589, 125343, 124242, 122536, 120627, 119411, 118921, 118554, 118021, 117299, 116310, 115314, 114886, 115064, 115282, 115447, 115949, 116333, 115431, 113402, 112098, 112571, 113688, 114162, 114483, 115576, 116877, 117191, 116532, 115733, 114982, 114034, 113284, 113504, 114835, 116853, 119097, 120967, 121795, 121696, 121674, 122276, 122933, 123074, 122920, 122646, 121874, 120625, 119669, 119213, 118381, 116802, 115512, 115388, 115829, 115952, 115915, 116020, 115630, 114211, 112465, 111290, 110532, 109895, 110091, 111734, 113944, 115341, 115831, 116206, 116641, 116794, 116811, 116993, 116973, 116334, 115591, 115445, 115546, 115020, 113839, 112679, 111862, 111350, 111346, 111981, 112782, 113329, 113967, 115099, 116283, 116920, 117275, 117927, 118675, 118937, 118858, 119091, 119807, 120688, 121610, 122598, 123424, 123803, 123689, 123044, 121874, 120808, 120754, 121469, 121384, 119549, 116811, 114438, 112587, 111020, 110202, 110517, 111314, 111877, 112586, 113968, 115407, 116041, 116240, 116934, 118021]
55387A18021O60N4k72q36j678j789q20J52L89M97R58J160P28L31L62J61o00j130
55369A16348r38p09r57j105p26m13n76n93p2K73j79q42r09m14K11P35P36j68j251
55350A08451j097L16J343J045L61J86q3j026j702j104O2M30o7m66l95k72l33m22
55332A05227m07k05K56O67M85k51q52r49p52k87O60J655J778R60P4m45q67r92
55314A05755k23Q75P81o26j563r50P7J47l15k43K87N87O62P96P19J81m18p26r46
55295A04857j072o67N0J50l80l15O89J281O54NN14J298J000J05MO43Q68L84j76
55276A09892n98j075j244o63J55L85K15L64P15N85P7k5M75J017J195R86L42o07
55258A12191j227j070n84l97k68M10J411J860J423N59j94o31p30o63p60j035j089
$$ y = [118021, 118681, 118735, 118463, 117627, 115949, 114160, 113340, 113492, 113881, 114378, 115336, 116496, 117224, 117555, 117917, 118078, 117478, 116348, 115410, 114701, 113744, 112639, 111913, 111500, 110924, 110331, 110259, 110532, 110353, 109511, 108602, 108188, 108399, 109134, 109870, 109702, 108451, 107354, 107670, 109013, 110058, 110419, 110605, 110522, 109496, 107794, 106690, 106752, 107182, 107115, 106649, 106254, 105982, 105649, 105227, 104820, 104615, 104871, 105538, 106023, 105772, 104920, 103971, 103219, 102932, 103592, 105247, 107025, 107985, 108059, 107614, 106747, 105755, 105532, 106407, 107188, 106562, 104999, 104049, 104126, 104273, 103958, 103715, 104002, 104589, 105251, 106047, 106766, 106947, 106529, 105803, 104857, 103785, 103118, 103168, 103318, 102938, 102623, 103312, 104593, 105247, 105252, 105766, 107064, 108064, 108169, 108173, 108816, 109684, 110068, 109892, 109294, 108219, 106975, 106312, 106467, 106852, 107067, 107431, 108146, 108731, 108808, 108783, 109258, 110275, 111470, 112456, 112798, 112191, 110964, 109894, 109310, 108913, 108645, 109055, 110466, 112326, 113749, 114308, 114114, 113483, 112753, 112090, 111330, 110295, 109206]
55241A09206p53l54o6L13O71M23m31r48n92q6j90m96k91R5j56r51j408j115m24
55222A02447K71Q56J290J520J484R36k77j581j978j264l19J28K41L09K24Q5M00
55205A04772J077J210M47m25q59j317j943j745k22J357J592J004J039J744J897
55190A09628J091K24KJ38J60Q6Q1J05N0j12l44n12n81p90j238j383o59M18O84
55171A07048J4n60n10m00m80j76N27P00J92J69J002J288J87q62l19R30J058J93
55153A10001j00M88Q09M00QJ02L61O11J010J287R79K61k96o33r58j040p08n49
55135A12033j100j745j549o98j02M4J62J89k19o99n76pL00K95M65Q14R44R42J136
55116A10629J314J052N95M64N37M30L19M91N69J24l79k88P6O4m4L94J033R86L62
$$ y = [109206, 108453, 108099, 108033, 108346, 109017, 109440, 109009, 108061, 107469, 107383, 107193, 106697, 106406, 106501, 106345, 105394, 103986, 102871, 102447, 102718, 103574, 104864, 106384, 107868, 108804, 108527, 106946, 104968, 103704, 103385, 103513, 103754, 104063, 104287, 104372, 104772, 105849, 107059, 107506, 107081, 106222, 104905, 102962, 101217, 100995, 102352, 103944, 104948, 105987, 107731, 109628, 110719, 110943, 110945, 111083, 111243, 111329, 111410, 111515, 111565, 111453, 111109, 110597, 110016, 109226, 107988, 106605, 105946, 106364, 107048, 107062, 106502, 105992, 105592, 105112, 104936, 105463, 106163, 106355, 106524, 107526, 108814, 109001, 108139, 107820, 108750, 109808, 110001, 109901, 110389, 111198, 111598, 111606, 111708, 112069, 112680, 113690, 114977, 115956, 116217, 115921, 115288, 114330, 113290, 112582, 112033, 110933, 109188, 107639, 106941, 106839, 106883, 107045, 107234, 107015, 106316, 105740, 105733, 106033, 106328, 106793, 107607, 108551, 109493, 110629, 111943, 112995, 113590, 114054, 114591, 115021, 115340, 115831, 116400, 116524, 116145, 115857, 115933, 115997, 115953, 116347, 117380, 118366, 118728]
55097A18728J37O76J429J878J818J091n2p11m37j3k06m55N2Q06Q00L05K17L56
55079A26419l4n92l26N79J097J176J504J766J072q5k73M41M81n86j369j073o72
55062A29525r64j171m42O43J034O31l7o18p77k08O69Q81K71k17l7J77j48n15k51
55043A28446L09L06l99j062r06M0Q68O34m76j152o51J51O5o51r22o32n00o04m57
55024A22407k48n66r65m50O80J038L61j72l0n0n79o38K96J151Q46j96r30j122
55006A20833j034o53j1M81O52Q51J168J175Q79R68J635K042J500M19l65n62l08
54989A29670J49L65N3k63J75J011J047P5p56p28m47m49j89P78J739J803J106L29
54971A35468k24m49k14J14k23j120j401m98O02Q16M38L08L98K47Q8M47J077J200
$$ y = [118728, 118865, 119541, 120970, 122848, 124666, 125757, 125705, 124994, 124557, 124544, 124338, 123883, 123935, 124741, 125541, 125846, 126063, 126419, 126385, 125793, 125467, 126046, 127143, 128319, 129823, 131589, 132661, 132576, 132303, 132744, 133225, 132639, 131270, 130197, 129525, 128561, 127390, 126948, 127591, 128625, 129256, 129219, 128601, 127824, 127616, 128285, 129166, 129437, 129220, 129183, 129360, 129212, 128697, 128446, 128755, 129061, 128662, 127600, 126694, 126734, 127602, 128236, 127760, 126608, 125957, 126108, 126173, 125522, 124600, 123968, 123468, 122864, 122407, 122159, 121593, 120628, 120178, 120858, 121896, 122257, 122085, 122055, 122005, 121426, 120788, 121084, 122235, 123081, 122885, 121955, 120833, 119799, 119146, 119135, 119616, 120268, 121119, 122287, 123462, 124341, 125309, 126944, 128986, 130486, 130905, 130540, 129978, 129670, 129819, 130184, 130237, 129974, 130149, 131160, 132207, 132282, 131526, 130798, 130351, 129902, 129713, 130491, 132230, 134033, 135139, 135468, 135244, 134795, 134581, 134695, 134472, 133352, 131951, 131453, 132055, 132871, 133309, 133617, 134015, 134262, 134350, 134797, 135874, 137074]
54953A37074O30q2m34l13R3L23m4p10q25j54M88L93q1j88J18L33J36m65j244j698
54933A33350j394o58k67k17L97J815K898K641J626J238J959L226M422N302N800
54918A62138O051O338O535O050M688L084J830O80q85k747m384n520o074n856m881
54903A67047l669k785k372k364k727l180l166k526j727j149o14J5L82K17p9J04
54887A41407Q59J791K442K497K012J561J721K324K767K986L459M221M784N158
54873A79989N827O510N982L781J091o78j463k078k942l907m742n241n256n027
54859A71846m901m676l907k962k748l151l002j956j104j102j125n22j76r65k057
54844A37492k097j247o83o96o98o06q39j232j152n76j12l0j37l75p29q07l12L49
$$ y = [137074, 137704, 137622, 137188, 136875, 136968, 137291, 137247, 136537, 135712, 135558, 136046, 136439, 136358, 136170, 136288, 136621, 136757, 136292, 135048, 133350, 131956, 131298, 131031, 130814, 131211, 133026, 135924, 138565, 140191, 141429, 143388, 146614, 151036, 156338, 162138, 168189, 174527, 181062, 187112, 191800, 194884, 196714, 197394, 196509, 193762, 189378, 183858, 177784, 171928, 167047, 163378, 160593, 158221, 155857, 153130, 149950, 146784, 144258, 142531, 141382, 140768, 140783, 141165, 141382, 141303, 141407, 142266, 144057, 146499, 148996, 151008, 152569, 154290, 156614, 159381, 162367, 165826, 170047, 174831, 179989, 185816, 192326, 198308, 202089, 203180, 202502, 201039, 198961, 196019, 192112, 187370, 182129, 176873, 171846, 166945, 162269, 158362, 155400, 152652, 149501, 146499, 144543, 143439, 142337, 141212, 140690, 140514, 139549, 137492, 135395, 134148, 133465, 132769, 132071, 131465, 130626, 129394, 128242, 127666, 127554, 127524, 127387, 127012, 126283, 125476, 125164, 125513]
54826A25513O29O88R06R61L42n76q95n19j59j88k38M4N83J201J746J974J779J429
54808A35220J161P69R6m53m35q1J06J20J88J53j87m11J1P63R75L98l81q57j051
54789A36104j075q64m19M7L22L58K42J41J12p8n97r93n56O56J800K462L090L885
54771A44637M138L395K485K589L736N016N869O470P108P788Q304Q195O956M637
54757B21323J931n63k745m512n606o200o805p280o854n601m798n124n526m707
54743A56933k889j198j70K05j85j076j439o40N05Q52M57O6k06n90p18j49P29J384
54725A51871K141L410M574M859M658M782M984M567L884L670L394J852p69k992
54711A94885m111m738n338n632n568n474n167m083k404r95j81L01L44l70j348
$$ y = [125513, 126142, 126830, 127736, 128697, 129039, 128463, 127568, 127049, 126890, 126702, 126464, 126508, 127091, 128292, 130038, 132012, 133791, 135220, 136381, 137150, 137246, 136793, 136358, 136277, 136383, 136503, 136691, 136844, 136657, 136246, 136257, 137020, 137995, 138393, 138012, 137155, 136104, 135029, 134165, 133746, 133793, 134115, 134473, 134715, 134856, 134968, 134890, 134293, 133300, 132744, 133400, 135200, 137662, 140752, 144637, 148775, 152170, 154655, 157244, 160980, 165996, 171865, 178335, 185443, 193231, 201535, 209730, 216686, 221323, 223254, 222691, 219946, 215434, 209828, 203628, 196823, 189543, 182689, 177088, 172290, 167166, 161640, 156933, 154044, 152846, 152676, 152881, 152696, 151620, 150181, 149541, 150046, 150898, 151355, 151421, 151215, 150625, 149907, 149758, 150487, 151871, 154012, 157422, 161996, 166855, 171513, 176295, 181279, 185846, 189730, 193400, 196794, 198646, 197877, 194885, 190774, 186036, 180698, 175066, 169498, 164024, 158857, 154774, 152370, 151375, 151194, 151495, 151839, 151469, 150121]
54696A50121j733j631j768j931j224J46R13P38O53J119J195K23r95j456j270j090
54680A42010j046r77r62j077j146j050q13l36K79M20k65r51o15K76L28n83j151
54663A32341q12n03q40j108o89j51o3J6N23R24P17M40O93R48M25n24q57l23L89
54644A31546O81N58L22K40L55L63q8p85j140j037q46n54K53J242J241j33j548
54627A30670j472n3J286J610J099L62j44j32L90R64J040N19j95n61k80M89J195
54610A36787J398J207J001Q23M06l01j098j838k278j937p08N44Q34L25k1R4J53
54593A35391K5K08P35R13M08k64n81n11l1Q23J354P19o49j321q47k68k49n4Q84
54574A36685J664J234K9p70r11r47j043q60l01M24J166J714J691J111N98N52O36
$$ y = [150121, 148388, 146757, 144989, 143058, 141834, 141980, 142893, 143631, 144284, 145403, 146598, 146821, 145826, 144370, 143100, 142010, 140964, 139987, 139025, 137948, 136802, 135752, 134939, 134603, 134882, 135302, 135037, 134086, 133471, 133747, 134075, 133492, 132341, 131529, 131026, 130186, 129078, 128389, 128238, 128175, 128191, 128714, 129638, 130355, 130795, 131488, 132436, 132861, 132337, 131480, 131157, 131546, 132227, 132785, 133107, 133347, 133702, 134065, 133977, 133192, 132052, 131015, 130169, 129615, 129868, 131110, 132351, 132218, 130670, 129198, 129145, 130431, 132041, 133140, 133502, 133358, 133226, 133616, 134580, 135620, 136139, 135944, 135383, 135103, 135592, 136787, 138185, 139392, 140393, 141216, 141622, 141321, 140223, 138385, 136107, 134170, 133462, 134006, 134840, 135165, 135144, 135238, 135391, 135416, 135624, 136359, 137272, 137680, 137416, 136835, 136324, 136293, 137116, 138470, 139189, 138540, 137219, 136372, 136104, 135855, 135801, 136685, 138349, 139583, 139612, 138842, 137931, 136984, 135941, 135081, 134780, 135204, 136370, 138084, 139775, 140886, 141484, 142036, 142672]
54557A42672N44N30O38K15j007j957j392L92J898K194J575O77j97q72j040n31
54541A44339M48J295J362N99j26J22J108J634J117K50j58j67j59j31p1l19r27
54524A50216j338j211r61r27p54j92K09j6l53p9N64Q74P57N41J88m12p55k95O19
54505A46675J123J005P16N11K71Qk12o13j369k019j856q14N23J538J853J338L90
54488A49068j24J88O95P12M89O58J067J043N16P0M7K66N30P46P45N78P13J370
54470A59377J903J551N92J9K51Q75J437J806J835J443R63P82O82J97n24r28j010
54453A71251j275j773j927j525j087j096j421j728j867j743j230n13m9j9j21p0
54437A53807N6J01Q8Q1K3j29l03m16m24k78K1L54N46M86J69k43l79J2O30Q73O06
$$ y = [142672, 143216, 143746, 144384, 144599, 143592, 141635, 140243, 140635, 142533, 144727, 146302, 146979, 146782, 145910, 144870, 144339, 144787, 146082, 147444, 148043, 147917, 148039, 149147, 150781, 151898, 152148, 151990, 151823, 151664, 151533, 151462, 151143, 150216, 148878, 147667, 146706, 145779, 145025, 144833, 145042, 145026, 144673, 144594, 145158, 146032, 146789, 147330, 147518, 147106, 146351, 146056, 146675, 147798, 148803, 149519, 150030, 150301, 150309, 150097, 149484, 148115, 146096, 144240, 143426, 143949, 145487, 147340, 148678, 149068, 148944, 149132, 149827, 150539, 151028, 151686, 152753, 153796, 154312, 154382, 154429, 154695, 155225, 155971, 156716, 157294, 158007, 159377, 161280, 162831, 163423, 163442, 163693, 164568, 166005, 167811, 169646, 171089, 172052, 172834, 173516, 173713, 173189, 172261, 171251, 169976, 168203, 166276, 164751, 163664, 162568, 161147, 159419, 157552, 155809, 154579, 154066, 154017, 153998, 153877, 153807, 153863, 153964, 154052, 154133, 154156, 154027, 153724, 153308, 152884, 152606, 152627, 152981, 153527, 154013, 154182, 153939, 153560, 153572, 154202, 155075, 155681]
54416A55681L00K67K64O3j19j14j47l22k94N4K13j46m71j00P73J536K022K299
54398A61759K051J157M06O61J492J608O76k94l60L22J066J427J230N14k55m98
54382A72962k20K0p5j72J27Q24J699K521K943K679J873J098Q52J277K226L280
54366A93914L794L385K387J543J211J151R44M23k54p46r17j164j986l085l494
54351A97106k906k234k290k614k373j781j649j975k052j815j916k471k732k241
54337A66057j428q16l98j8L02O00R73J197R51M82L87O49N42k58j146j404r90k84
54319A65398M02Q02O90K49O7M41J036J319J033J68j059k062k145j206O0P93O96
54302A66682J25k78r7M54P13M32J58M64J003R48J81n38o35l55k50m69o77m47K77
$$ y = [155681, 155981, 156248, 156512, 156575, 156456, 156342, 156195, 155873, 155579, 155633, 155846, 155700, 155229, 155129, 155902, 157438, 159460, 161759, 163810, 164967, 165373, 166034, 167526, 169134, 169810, 169516, 169156, 169478, 170544, 171971, 173201, 173715, 173460, 172962, 172742, 172762, 172687, 172515, 172642, 173466, 175165, 177686, 180629, 183308, 185181, 186279, 187131, 188408, 190634, 193914, 197708, 201093, 203480, 205023, 206234, 207385, 208329, 208752, 208498, 207752, 206835, 205671, 203685, 200600, 197106, 194200, 191966, 189676, 187062, 184689, 182908, 181259, 179284, 177232, 175417, 173501, 171030, 168298, 166057, 164629, 163813, 163415, 163397, 163699, 164299, 165272, 166469, 167420, 167902, 168289, 168938, 169480, 169222, 168076, 166672, 165682, 165398, 165800, 166602, 167292, 167541, 167608, 168049, 169085, 170404, 171437, 171605, 170546, 168484, 166339, 165133, 165193, 165986, 166682, 166807, 166529, 166432, 166886, 167599, 168031, 168189, 168653, 169656, 170604, 170785, 170247, 169612, 169257, 169007, 168538, 167861, 167414, 167691]
54283A67691R21P75p2o73n12k30m91p81k68O97J085Q77R61J437J419O87K04N28
54265A74255R44P81N38R59J757K085J679Q77Po57p13r1O53Q73M74k56j002j387
54247A81776j047j29O85R32Q06O27L40j56o66r92j145j036m52M35J028J057Q53
54230A82916O16O5q42j450j233n70k08l20n87q51j105j140p08K9O08O88K22n63
54212A75567j156j059l53L15M87K85Kk44k94N9N60N64o0o18n60k01l2J06N48R49
54192A74865O82j63p77o38j7M71M44k5m53k89N82J707K597L124L268K866J837
54175A90081M95o11j012n45M06R26M20n21p68k43o8q37j688j676j189j158j574
54158A80438j700j323q10k82L38O87L11m56p93n45k56j05K55P58P07j11r02q24
$$ y = [167691, 168612, 169387, 169315, 168642, 168130, 167900, 167409, 166628, 166360, 167057, 168142, 169019, 169980, 171417, 172836, 173523, 173727, 174255, 175199, 175980, 176518, 177477, 179234, 181319, 182998, 183875, 183882, 183225, 182512, 182421, 183074, 183947, 184421, 184165, 183163, 181776, 180729, 180600, 181285, 182217, 183023, 183650, 183990, 183834, 183168, 182176, 181031, 179995, 179543, 179978, 181006, 182063, 182916, 183532, 183597, 182755, 181305, 180072, 179502, 179294, 178974, 178387, 177536, 176431, 175291, 174583, 174612, 175220, 175908, 176130, 175567, 174411, 173352, 172999, 173314, 173801, 174086, 174088, 173844, 173550, 173609, 174169, 174733, 174673, 174055, 173495, 173294, 173262, 173368, 173916, 174865, 175547, 175384, 174607, 173969, 173952, 174423, 174867, 174842, 174389, 174100, 174682, 176389, 178986, 182110, 185378, 188244, 190081, 190576, 189965, 188953, 188408, 188814, 189740, 190160, 189639, 188871, 188628, 188560, 187723, 186035, 184359, 183170, 182012, 180438, 178738, 177415, 176605, 176323, 176661, 177348, 177659, 177203, 176410, 175865, 175609, 175504, 175759, 176517, 177224, 177113, 176211, 175387]
54140A75387nP56Q73K85o33j195p54O03J937K339J790R87N40N33P06P75N59P3
54122A85556m45o23j83P91J798K304K259K189K609L491M359M814M838M691M652
54107B23100M726M529L575J855j3j332j928k158k509l291m386n157m970l988l096
54092B04957k755k427j530n18k62o72p92k13L54J57n84j130j126o91PQ27J537
54075A95139K005K387K814L046K729J962J240Q64P38P88J134J668J765R23m75
54060B18727j419j430r87p28o20k55L55Q03R20Q93Q91J006J512K577L710M109
54044B30064L811L844M824O004O293N815N702O472P432P794P758P995Q563Q826
54030C21197Q398P680P247P088O765O127N470M958M293L198J931R78M73K62K44
$$ y = [175387, 175382, 176138, 177011, 177296, 176663, 175468, 174714, 175317, 177254, 179593, 181383, 182370, 182910, 183443, 184149, 184924, 185483, 185556, 185111, 184488, 184305, 185096, 186894, 189198, 191457, 193646, 196255, 199746, 204105, 208919, 213757, 218448, 223100, 227826, 232355, 235930, 237785, 237772, 236440, 234512, 232354, 229845, 226554, 222168, 217011, 212041, 208053, 204957, 202202, 199775, 198245, 197727, 197465, 196793, 196001, 195788, 196142, 196299, 195715, 194585, 193459, 192768, 192775, 193602, 195139, 197144, 199531, 202345, 205391, 208120, 210082, 211322, 212186, 212924, 213712, 214846, 216514, 218279, 219202, 218727, 217308, 215878, 214891, 214163, 213543, 213288, 213643, 214446, 215366, 216259, 217150, 218156, 219668, 222245, 225955, 230064, 233875, 237719, 242543, 248547, 254840, 260655, 266357, 272829, 280261, 288055, 295813, 303808, 312371, 321197, 329595, 337275, 344522, 351610, 358375, 364502, 369972, 374930, 379223, 382421, 384352, 385330, 385803, 386065, 386309]
54015C86309K43k67j703l672n256o033o307o380o265o186o598p322p432o542n593
54000C10996n579o018n540l864k240j824k347k801k839k914l282l470k942j913
53986B63423j192j269j853k324k381k059j364k25J202K555L615M443N219O065
53972B73855O931P486P259O182M684L004P64k223n061o470o300n537m816l859
53958B75899k565j622j513j688j373o09N2M29P30J091J582K282K982L215K961
53943B81853K858L289L839M139M584N517O273N924M666L552L084K879K632K612
53929C37701L038L657M120M388M597M875N316N895O478P122Q073R236R957R812
53915D24265R276R183R757J0639J1460J1933J1702J0747R630Q707P443N265K704
$$ y = [386309, 386552, 386285, 384582, 380910, 375654, 369621, 363314, 356934, 350669, 344483, 337885, 330563, 323131, 316589, 310996, 305417, 299399, 293859, 289995, 287755, 285931, 283584, 280783, 277944, 275030, 271748, 268278, 265336, 263423, 262231, 260962, 259109, 256785, 254404, 252345, 250981, 250756, 251958, 254513, 258128, 262571, 267790, 273855, 280786, 288272, 295531, 301713, 306397, 309401, 310165, 307942, 302881, 296411, 290111, 284574, 279758, 275899, 273334, 271712, 270199, 268511, 267138, 266529, 266581, 267010, 267740, 268831, 270413, 272695, 275677, 278892, 281853, 284711, 288000, 291839, 295978, 300562, 306079, 312352, 318276, 322942, 326494, 329578, 332457, 335089, 337701, 340739, 344396, 348516, 352904, 357501, 362376, 367692, 373587, 380065, 387187, 395260, 404496, 414453, 424265, 433541, 442724, 452481, 463120, 474580, 486513, 498215, 508962, 518592, 527299, 534742, 540007, 542711]
53902E42711P83m85j939l687m826m912m657m774n069n232n698o938q479r381r503
53887D67914r608j0291j1247j1704j1275j0291r351q717q157p430o674o121n692
53874C51356n135m517m170m262m601m857m745m191l574l454l742l574k613j929
53860B95992k744m552n565n003l835l126k722k123j599j644j952j827j256q60
53846B57184r56j270j524j758k010k062j629p20K41O86M91J86L25P09O70J05m20
53829B48248o31q83j252j025K15J646K063J393O20M09N64P48R85J283J453J453
53813B57289J541J812K074K306K831L729M514M756M685M813N194N558O005O974
53799C14081Q424R544R607Q804P917P376O975O410N653M770L793K907K478K579
$$ y = [542711, 543494, 543009, 541070, 537383, 532557, 527645, 522988, 518214, 513145, 507913, 502215, 495277, 486798, 477417, 467914, 458306, 448015, 436768, 425064, 413789, 403498, 394147, 385430, 377273, 369843, 363169, 357048, 351356, 346221, 341704, 337534, 333272, 328671, 323814, 319069, 314878, 311304, 307850, 304108, 300534, 297921, 295992, 293248, 288696, 283131, 278128, 274293, 271167, 268445, 266322, 264723, 263079, 261127, 259300, 258044, 257184, 256228, 254958, 253434, 251676, 249666, 247604, 245975, 245255, 245496, 246182, 246673, 246859, 247184, 247893, 248563, 248668, 248248, 247617, 246734, 245482, 244457, 244672, 246318, 248381, 249774, 250394, 250803, 251367, 252115, 253100, 254383, 255836, 257289, 258830, 260642, 262716, 265022, 267853, 271582, 276096, 280852, 285537, 290350, 295544, 301102, 307107, 314081, 322505, 332049, 341656, 350460, 358377, 365753, 372728, 379138, 384791, 389561, 393354, 396261, 398739, 401318]
53785D01318K699K186R80l84j446k305l320m526n541o053o255o570p025p219o987
53770C49552o758o899p080o765o121n752n674n312m590m114m009l522k342j482
53756B79132j936l103l579l140k755k839k683j822q51m39l83k24j48n37j106j107
53740B52480l36O03J015P76K96N4J36J55k81r79j203m74P98J695J706J163P41
53723B58345P48R51J044J103J383J811K008J869J709J705J561J132Q81J248J813
53708B79311J802J272J061J506J964J890J719K172L117L742L696L494L742M387
53694C14875M900M965M627L966K956J819J036P12J61j251k926l434k257n31L45
53679C29963K09k33o54j195j712j773j377r33o10k35J54L09K82L88N99N56J19
$$ y = [401318, 404017, 406203, 407183, 406799, 405353, 403048, 399728, 395202, 389661, 383608, 377353, 370783, 363758, 356539, 349552, 342794, 335895, 328815, 322050, 315929, 310177, 304503, 299191, 294601, 290487, 286478, 282956, 280614, 279132, 277196, 274093, 270514, 267374, 264619, 261780, 259097, 257275, 256424, 255985, 255602, 255378, 255230, 254693, 253587, 252480, 252144, 252747, 253762, 254538, 254834, 254888, 255024, 255179, 254898, 253919, 252716, 252242, 253040, 254735, 256441, 257604, 258345, 259093, 260044, 261088, 262191, 263574, 265385, 267393, 269262, 270971, 272676, 274237, 275369, 276250, 277498, 279311, 281113, 282385, 283446, 284952, 286916, 288806, 290525, 292697, 295814, 299556, 303252, 306746, 310488, 314875, 319775, 324740, 329367, 333333, 336289, 338108, 339144, 339856, 340017, 338766, 335840, 332406, 330149, 329618, 329963, 330172, 329939, 329285, 328090, 326378, 324605, 323228, 322295, 321685, 321450, 321604, 321913, 322195, 322583, 323182, 323738, 323857]
53662C23857m79r93j186o95M95J552J547O72n1j91k32m53m81j95j04m11n23l4
53644C22095N74P46P42J088J743K390L020L602L658K877J824J364J611J974K060
53629C51368J919J676J439J449J775K049J917J640J706K036K190K160K410L055
53615C78789L596L625L316L049L031L340L950M479M367L584K853K795L150L182
53601D27106K681K067J636J231Q05O93R82J070L85p35j453j539j473j506j405
53586D30545j217j427k034k315k009j950k783l762l747k878k265k336k622k883
53572C96317l284l426k490o79O26O11P2J87J000J633J482O54k80o13n0Q29J118
53555C93707P89O76J048J090K72n45k26R98J897J864J445J375J801K475L124L533
$$ y = [323857, 323378, 322385, 321199, 320504, 320999, 322551, 324098, 324770, 324719, 324528, 324296, 323843, 323362, 323167, 323063, 322652, 322129, 322095, 322669, 323415, 324157, 325245, 326988, 329378, 332398, 336000, 339658, 342535, 344359, 345723, 347334, 349308, 351368, 353287, 354963, 356402, 357851, 359626, 361675, 363592, 365232, 366938, 368974, 371164, 373324, 375734, 378789, 382385, 386010, 389326, 392375, 395406, 398746, 402696, 407175, 411542, 415126, 417979, 420774, 423924, 427106, 429787, 431854, 433490, 434721, 435526, 436219, 437201, 438271, 438656, 437921, 436468, 434929, 433456, 431950, 430545, 429328, 427901, 425867, 423552, 421543, 419593, 416810, 413048, 409301, 406423, 404158, 401822, 399200, 396317, 393033, 389607, 387117, 386438, 387064, 387675, 387747, 387934, 388934, 390567, 392049, 392703, 392423, 391810, 391760, 392589, 393707, 394496, 395172, 396220, 397310, 397582, 397037, 396811, 397809, 399706, 401570, 403015, 404390, 406191, 408666, 411790, 415323]
53539D15323L638L615L761M274N131O076O714O945P240Q069R109R635R679J0092
53525E09301J1220J2343J2860J3212J4021J4974J5327J5174J5362J6330J7697
53514F67821J8899J9759K0418K1088K1957K3119K4539K6113K7495K8086K7644
53503I26938K6820K6460K6293K5213K2986K0826J9762J9345J8635J7667J7124
53492A168069J7190J7587J8240J9089J9642J9530J9169J9084J9006J8453J7858
53481A372917J8077J8924J9179J8161J6445J4876J3519J1837R425O414L359Q10
53469A523943j254l370n863q457j0838j3105j5206j6594j7004j7091j7545j8061
53457A379555j7984j7611j7868j8877j9852k0347k0754k1403k1917k1728k0724
$$ y = [415323, 418961, 422576, 426337, 430611, 435742, 441818, 448532, 455477, 462717, 470786, 479895, 489530, 499209, 509301, 520521, 532864, 545724, 558936, 572957, 587931, 603258, 618432, 633794, 650124, 667821, 686720, 706479, 726897, 747985, 769942, 793061, 817600, 843713, 871208, 899294, 926938, 953758, 980218, 1006511, 1031724, 1054710, 1075536, 1095298, 1114643, 1133278, 1150945, 1168069, 1185259, 1202846, 1221086, 1240175, 1259817, 1279347, 1298516, 1317600, 1336606, 1355059, 1372917, 1390994, 1409918, 1429097, 1447258, 1463703, 1478579, 1492098, 1503935, 1513360, 1519774, 1523133, 1523943, 1522689, 1519319, 1513456, 1504999, 1494161, 1481056, 1465850, 1449256, 1432252, 1415161, 1397616, 1379555, 1361571, 1343960, 1326092, 1307215, 1287363, 1267016, 1246262, 1224859, 1202942, 1181214, 1160490]
53446A160490j9345j8376j8397j8995j8767j6753j3643j0887q934p217n490m112
53434I99574l034j710j80P55Q46R63J904L366M632N616O748Q261J0064J2052J4113
53419A063970J6047J7752J9360K1066K2935K4850K6529K7694K8527K9641L1344
53408A329715L3178L4616L5859L7339L8890M0137M1389M3250M5524M7459M9005
53397A776361N0826N3028N4889N6042N6936N7867N8537N8833N9119N9318N8646
53386B400402N6820N4722N3178N1793M9658M6656M3341L9975L6315L2121K7373
53375B892354K2224J7076J2320P760K696l141r145j4770k0331k6416l2922l9189
53363B808516m4757m9509n3276n5845n7183n7423n6782n5725n4851n4316n3614
$$ y = [1160490, 1141145, 1122769, 1104372, 1085377, 1066610, 1049857, 1036214, 1025327, 1016393, 1009176, 1003686, 999574, 996540, 994830, 994650, 995405, 996251, 997214, 999118, 1002484, 1007116, 1012732, 1019480, 1027741, 1037805, 1049857, 1063970, 1080017, 1097769, 1117129, 1138195, 1161130, 1185980, 1212509, 1240203, 1268730, 1298371, 1329715, 1362893, 1397509, 1433368, 1470707, 1509597, 1549734, 1591123, 1634373, 1679897, 1727356, 1776361, 1827187, 1880215, 1935104, 1991146, 2048082, 2105949, 2164486, 2223319, 2282438, 2341756, 2400402, 2457222, 2511944, 2565122, 2616915, 2666573, 2713229, 2756570, 2796545, 2832860, 2864981, 2892354, 2914578, 2931654, 2943974, 2951734, 2954430, 2951289, 2942144, 2927374, 2907043, 2880627, 2847705, 2808516, 2763759, 2714250, 2660974, 2605129, 2547946, 2490523, 2433741, 2378016, 2323165, 2268849, 2215235]
53352B215235n2195n0078m7661m5382m3787m3404m4031m4613m4288m3277m2309
53341A714210m1500m0355l8585l6349l3835l1139k8524k6335k4609k3070k1445
53330A368464j9586j7466j5341j3753j3031j2945j3133j3657j4701j5851j6218
53319A202782j5335j3576j1681j0089q793p541o056m300k564j123K03J837L765
53306A127529N424O453P312Q716J0618J2250J3298J4516J6733J9639K2147K3847
53294A288482K5305K6892K8113K8533K8587K8850K9021K8385K6987K5517K4287
53283A588959K2973K1288J9189J6494J3035R158N442J964j542m850p351r041j0669
53270A665049j2788j5318j8109k1082k3697k5185k5558k5707k6212k6856k7509
$$ y = [2215235, 2163040, 2112962, 2065301, 2019919, 1976132, 1932728, 1888697, 1844084, 1799796, 1756519, 1714210, 1672710, 1632355, 1593770, 1557421, 1523586, 1492447, 1463923, 1437588, 1412979, 1389909, 1368464, 1348878, 1331412, 1316071, 1302318, 1289287, 1276342, 1263209, 1249552, 1234851, 1219000, 1202782, 1187447, 1173871, 1162190, 1152101, 1143308, 1135767, 1129711, 1125411, 1122847, 1121724, 1121927, 1123764, 1127529, 1132953, 1139406, 1146718, 1155434, 1166052, 1178302, 1191600, 1206116, 1222849, 1242488, 1264635, 1288482, 1313787, 1340679, 1368792, 1397325, 1425912, 1454762, 1483783, 1512168, 1539155, 1564672, 1588959, 1611932, 1633220, 1652409, 1668903, 1681938, 1691096, 1696538, 1698502, 1696960, 1692110, 1684759, 1675718, 1665049, 1652261, 1636943, 1618834, 1597752, 1574055, 1548870, 1523312, 1497605, 1471393, 1444537, 1417028]
53259A417028k8532k9805l0404k9929k9372k9784l0730l0907k9946k8704k7929
53248A090986k7481k6867k5930k4942k4323k4302k4688k5019k5033k4711k3929
53237H13761k2510k0735j9154j7759j5966j3730j1952j1225j0941j0176q938p918
53225F42757p512p727q540r648j0280j0103r902j0653j2123j3173j3231j2702
53213E17163j2068j1351j0533r817r308q887q444p935p262o460n849n664n723
53200D07862n815o069o530o684o066n063m464m396m348m147m152m469m703m633
53186C36323m565m794n134n208m880m273l625l170k947k697k196j611j267j206
53172B88750j211j171j091q99n40j39J32K52K12m6l38k97pj11r07j775j995j660
$$ y = [1417028, 1388496, 1358691, 1328287, 1298358, 1268986, 1239202, 1208472, 1177565, 1147619, 1118915, 1090986, 1063505, 1036638, 1010708, 985766, 961443, 937141, 912453, 887434, 862401, 837690, 813761, 791251, 770516, 751362, 733603, 717637, 703907, 691955, 680730, 669789, 659613, 650675, 642757, 635245, 627518, 618978, 609330, 599050, 588947, 579045, 568392, 556269, 543096, 529865, 517163, 505095, 493744, 483211, 473394, 464086, 455199, 446755, 438820, 431558, 425098, 419249, 413585, 407862, 402047, 395978, 389448, 382764, 376698, 371635, 367171, 362775, 358427, 354280, 350128, 345659, 340956, 336323, 331758, 326964, 321830, 316622, 311742, 307469, 303844, 300674, 297727, 295030, 292834, 291223, 289956, 288750, 287539, 286368, 285277, 284378, 283838, 283699, 283831, 284083, 284295, 284249, 283911, 283614, 283607, 283496, 282589, 280814, 278819, 277159]
53154B77159j231p49k02r8p60j431j169l99l78j199j508m86J012J685J243K05
53138B71694q97j571j372m57L42M62K63L64Q12J273J579J671J429J011R15J324
53122B78842J713J587J254J392K093K809L086K933K573K233K107K157K010J327
53108C08116K32p66j290j360j260j308j636k099k403k429k296k113j852j509j246
53093B84781j218j441j879k489l083l351l061k209r86J80O96K89n31q69m63M0
53077B64406r4q23j482j524r11o4M38K99j61l47j51r0n62j249j515j163n25p0
53059B54412j04o28j208j177l33P12J157R33O70Q92J491J998K042J535P21O3j07
53042B63069P9J99J07O7K43L18r2q44j393j497j450j555j702j651j388r81l03
$$ y = [277159, 275928, 275179, 274977, 274879, 274119, 272688, 271519, 271120, 270742, 269543, 268035, 267549, 268561, 270246, 271489, 271694, 270797, 269226, 267854, 267397, 267739, 268201, 268464, 268828, 269640, 270913, 272492, 274163, 275592, 276603, 277518, 278842, 280555, 282142, 283396, 284788, 286881, 289690, 292776, 295709, 298282, 300515, 302622, 304779, 306789, 308116, 308348, 307582, 306292, 304932, 303672, 302364, 300728, 298629, 296226, 293797, 291501, 289388, 287536, 286027, 284781, 283563, 282122, 280243, 277754, 274671, 271320, 268259, 266050, 265064, 265244, 265940, 266229, 265698, 264829, 264366, 264406, 264312, 263489, 262007, 260483, 259572, 259508, 259946, 260245, 260084, 259737, 259586, 259496, 258934, 257685, 256170, 255007, 254482, 254412, 254308, 253680, 252472, 251295, 250962, 251674, 252831, 253764, 254434, 255326, 256817, 258815, 260857, 262392, 263113, 263176, 263069, 263148, 263347, 263454, 263521, 263764, 264082, 263990, 263146, 261753, 260256, 258806, 257251, 255549, 253898, 252510, 251529, 251226]
53025B51226O52J418J502J111R46J195J265P09j20n67m39J00Q65J525J538P70
53009B63696j10l60q1P2j50m72p04q97r76p33k47K03N67R37J084P26J60J02P18
52990B63535J352J392R86P73J277K531L944M530L795K440J656J697J714J056P4
52975B92752o06q48p79l97R6J54l83q29m10P18J663J847J451R97Q11Q73R28P88
52957B98826N14J87l98j420k459k822k536k391k756l008k597k018k053k512k422
52942B70135j339J46J090R82N5q40q12J34J005R77L12k84p16j267j687j437o55
52925B65799l1K57O44J175J292Q48M89O33P68L02n03r86r97q05m67O9N16M69L6
52906B69508k94l23k84l57m90o67r00r41m17N51J252J163N53J16J95N97R80J146
$$ y = [251226, 251878, 253296, 254798, 255909, 256855, 258050, 259315, 260024, 259904, 259337, 258898, 258998, 259863, 261388, 262926, 263696, 263586, 263226, 263145, 263217, 263067, 262595, 261891, 260994, 260018, 259285, 259038, 259241, 259808, 260745, 261829, 262555, 262715, 262817, 263535, 264887, 266279, 267265, 268038, 269315, 271846, 275790, 280320, 284115, 286555, 288211, 289908, 291622, 292678, 292752, 292146, 291298, 290519, 290122, 290218, 290372, 289989, 289160, 288750, 289468, 291131, 292978, 294429, 295426, 296237, 297110, 298038, 298826, 299340, 299527, 299129, 297709, 295250, 292428, 289892, 287501, 284745, 281737, 279140, 277122, 275069, 272557, 270135, 268796, 268942, 270032, 271014, 271069, 270229, 269417, 269551, 270556, 271533, 271845, 271561, 270845, 269578, 267891, 266454, 265799, 265768, 266025, 266669, 267844, 269136, 269984, 270473, 271106, 271874, 272176, 271673, 270687, 269690, 268885, 268418, 268487, 269003, 269472, 269508, 269214, 268891, 268607, 268250, 267760, 267093, 266193, 265252, 264835, 265386, 266638, 267801, 268354, 268470, 268665, 269262, 270242, 271388]
52888B71388J024O18R3k12pO45J276J306N52n10j047o29L30R58Q10L52M28J287
52870B78662K305K790K859L153L794M104L564K574J766R80m46k447m056m604m387
52855B90611l975l470k882k544k568k393j639r64j311k479l285l051k181j295
52841B56574o45m42q71j468j351m26M00N05L59N16O55L14j15L4N50O77K99o5k42
52822B55258o03j264j826j991j818j385o75J29P05R96J166J224J117J119J551
52807B53703K124K080J100k96j366j762j599j280j235j501j631j343j016j067
52793B44911j172p45k3K27pQ7P57J156N89l95p11r2P71J108Q13M64P20J476J742
52774B51676Q17n82j085n06M1j18m01k63k22q41j636j811j501j331j237p08J31
$$ y = [271388, 272412, 273030, 273123, 272911, 272904, 273549, 274825, 276131, 276683, 276173, 275126, 274497, 274827, 275785, 276595, 276947, 277375, 278662, 280967, 283757, 286616, 289769, 293563, 297667, 301231, 303805, 305571, 306551, 306105, 303658, 299602, 294998, 290611, 286636, 283166, 280284, 277740, 275172, 272779, 271140, 270176, 268865, 266386, 263101, 260050, 257869, 256574, 255929, 255487, 254616, 253148, 251797, 251371, 251771, 252276, 252635, 253151, 253806, 254120, 254005, 254039, 254589, 255266, 255565, 255500, 255258, 254655, 253391, 251565, 249574, 247756, 246371, 245696, 245825, 246530, 247526, 248692, 249916, 251033, 252152, 253703, 255827, 257907, 259007, 258711, 257345, 255583, 253984, 252704, 251469, 249968, 248337, 246994, 245978, 244911, 243739, 242994, 242971, 243198, 243191, 243278, 244035, 245191, 245780, 245385, 244674, 244582, 245353, 246461, 247274, 247738, 248458, 249934, 251676, 252493, 251911, 250826, 250320, 250361, 250243, 249842, 249579, 249357, 248516, 246880, 245069, 243568, 242237, 241000, 240292, 240423]
52757B40423O29O59P80J296J896K209K173J834J360J165J481J819J467N62J5L20
52741B60088J024J538J863K146K130J516O24J60L95R43J322J443J484J557J594
52726B79827J479J079K81q22j837k358k426k420k474k293j746j233j068q70j30
52711B62989Q39J172P46L33M51O81M81j9l86n31n15k00M04P98M96l34j132j534
52693B64739j478j035n05l07l91j56O41J356J369J036J063J327J113L15l98n79
52677B68110m14j52J48K46k14j038j421q92J77J081J461J318Q24L33J79K73K56
52660B70275J54M30J205J933K200K378L054M084M736M600L858K737J202o13k117
52645C00116k780k705k442k273k035j646j350j282j123n91QK13K87R97K378L409
$$ y = [240423, 241052, 241711, 242491, 243787, 245683, 247892, 250065, 251899, 253259, 254424, 255905, 257724, 259191, 259753, 259768, 260088, 261112, 262650, 264513, 266659, 268789, 270305, 270929, 271089, 271484, 272427, 273749, 275192, 276676, 278233, 279827, 281306, 282385, 282666, 281844, 280007, 277649, 275223, 272803, 270329, 268036, 266290, 265057, 263989, 263119, 262989, 263828, 265000, 265746, 266079, 266530, 267211, 267692, 267673, 267287, 266756, 266241, 266041, 266445, 267243, 267739, 267405, 266273, 264739, 263261, 262226, 261721, 261414, 261023, 260867, 261508, 262864, 264233, 265269, 266332, 267659, 268772, 269087, 268689, 268110, 267696, 267544, 267692, 267938, 267724, 266686, 265265, 264373, 264550, 265631, 267092, 268410, 269234, 269567, 269746, 270019, 270275, 270429, 270859, 272064, 273997, 276197, 278575, 281629, 285713, 290449, 295049, 298907, 301644, 302846, 302233, 300116, 297336, 294631, 292189, 289916, 287881, 286235, 284885, 283603, 282480, 281889, 281897, 282110, 282397, 283394, 285772, 289181]
52629B89181L211K157J333J279J642J759J099n14k513l650l128j669q47j299k118
52614B85923k102j075K44J085J095L91m22o00l3N51N14J97M39J254J644R23k96
52597B89732q58n13k4M3j4K48O68Q94J027J306J423R18J39L7Q68J834K192K090
52579C02010J941J709J266Q94Q22O93P9p08r43m79J02K48r4o49j047r81n16j40
52561C04207k88q43j415j764j768j297n51j80n05r18o07K97Q79O33q7p32j064
52544B93997j021n90L6N64Q86R48O17P4Q2J136K480K802J909R43Q20J207J344
52527C08234J076O23l1q74j457j339q03n30o50n89Q5J023J522J461J568K590M307
52510C16216N670N976N522M923M259L266K016P82n54k266m082n297n659n513n064
$$ y = [289181, 292392, 294549, 295882, 297161, 298803, 300562, 301661, 301147, 298634, 294984, 291856, 290187, 289340, 288041, 285923, 283821, 282746, 282990, 284075, 285170, 285561, 285139, 284539, 284506, 285057, 285571, 285768, 286207, 287461, 289105, 290028, 289732, 288874, 288361, 288337, 288380, 288366, 288614, 289282, 290176, 291203, 292509, 293932, 294850, 294989, 295026, 295894, 297728, 299920, 302010, 303951, 305660, 306926, 307820, 308642, 309335, 309414, 308706, 307763, 307284, 307386, 307634, 307540, 306891, 305844, 304863, 304347, 304207, 303919, 303076, 301661, 299897, 298129, 296832, 296281, 296101, 295596, 294678, 294071, 294368, 295247, 295880, 295793, 295061, 293997, 292976, 292386, 292422, 292986, 293872, 294820, 295437, 295511, 295593, 296729, 299209, 302011, 303920, 304863, 305683, 306890, 308234, 309310, 309933, 309902, 309028, 307571, 306232, 305429, 304899, 304249, 303660, 303745, 304768, 306290, 307751, 309319, 311909, 316216, 321886, 327862, 333384, 338307, 342566, 345832, 347848, 348630, 348076, 345810, 341728, 336431, 330772, 325259, 320195]
52495C20195m231l295k946l342l745l428k482j451o24j06m8l40m32N6Q51J422
52479B96054J614J592J409J085R04J186J894K699L310L476K986K028J351J618
52465C23206K594L421L649L621L794M067M010L480K613J338o26l118n157n728
52451C41164m902l806l355l380l273l001k969l159l063k478j859j681j831j784
52437C00623j206k90L12M8q14j233n20O63J024K63o34p76l29J48O69J507K386
52420C01841K569J787O11j33j60J72M53P60J516K832M328N698P045Q415R433R878
52404C57045J0217J0767J0728Q955N590J993j025l783o398q017q075p287o655
52391C64055o183n372m382l700l145k149q83k18n49j298j639j145J54J793K934
$$ y = [320195, 315964, 312669, 309723, 306381, 302636, 299208, 296726, 295275, 294651, 294545, 294497, 294157, 293725, 293781, 294632, 296054, 297668, 299260, 300669, 301754, 302658, 303844, 305738, 308437, 311747, 315223, 318209, 320237, 321588, 323206, 325800, 329221, 332870, 336491, 340285, 344352, 348362, 351842, 354455, 355793, 355167, 352049, 346892, 341164, 336262, 332456, 329101, 325721, 322448, 319447, 316478, 313319, 310256, 307778, 305919, 304238, 302407, 300623, 299417, 299127, 299439, 299487, 298673, 297440, 296920, 297583, 298607, 298870, 298236, 297460, 297131, 297279, 297948, 299455, 301841, 304410, 306197, 306808, 306675, 306515, 306687, 307140, 307900, 309416, 312248, 316576, 322274, 329319, 337734, 347167, 357045, 367262, 378029, 388757, 397712, 403302, 405295, 404270, 400487, 394089, 386072, 377997, 370710, 364055, 357872, 352500, 348118, 344418, 341273, 339124, 338241, 338023, 337474, 336176, 334537, 333392, 333546, 335339, 338273]
52376C38273L053K602K570L271M095M520M805N424O270O774O595N800M525K781
52362D01358P24j190k461k972k999k838k550k119j616j076m24K28M65J06k95K
52346C82343R77J932K481K798K898K433J544J164J952L385M452M887N187N743
52332D24176O521P413Q438R551J0660J1720J2634J3308J3960J5060J6600J7809
52320E67850J8054J7676J7416J7236J6485J5111J4008J3949J4630J5133J4995
52309G42543J4659J4917J6091J7728J8988J9390J9038J8272J7340J6464J5865
52298I31295J5473J4859J3650J1847R577O875L900J047j498l986o545q735j0054
52285I77705j0578j0662j0261r149p584o188n175m169k810j103P65K518L742M232
$$ y = [338273, 341326, 343928, 346498, 349769, 353864, 358384, 363189, 368613, 374883, 381657, 388252, 394052, 398577, 401358, 402082, 400892, 398431, 395459, 392460, 389622, 387072, 384953, 383337, 382261, 381837, 382065, 382530, 382636, 382341, 382343, 383320, 385252, 387733, 390531, 393429, 395862, 397406, 398570, 400522, 403907, 408359, 413246, 418433, 424176, 430697, 438110, 446548, 456099, 466759, 478479, 491113, 504421, 518381, 533441, 550041, 567850, 585904, 603580, 620996, 638232, 654717, 669828, 683836, 697785, 712415, 727548, 742543, 757202, 772119, 788210, 805938, 824926, 844316, 863354, 881626, 898966, 915430, 931295, 946768, 961627, 975277, 987124, 996701, 1003576, 1007476, 1008523, 1007025, 1003039, 996494, 987759, 977705, 967127, 956465, 946204, 937055, 929471, 923283, 918108, 913939, 911129, 910026, 910791, 913309, 917051, 921283]
52271I21283M435N107O419P770Q644R188R772J0318J0458J0186J0030J0522J1632
52258A035764J2908J4051J5192J6496J7680J8234J8007J7238J6068J4421J2415
52247A208474J0402Q378N912K873j93k768m913o758q047q710r352j0436j1349
52234A173513j1142r954q878q480q328q018p809p984q260q228p821p061n851m323
52220A061376k990k166j518n56P15J840K497K742K832L031L524M306N139N678
52206A086450N709N279M676M225M039M045M220M643N241N762O176O749P507P976
52192A162697P875P758Q362R458R957R166P397N316L171R57j230l289n353p599
52178A214643r846j1602j2455j2460j2048j1567j0868r645q075o767n839m654
$$ y = [921283, 925718, 930825, 937244, 945014, 953658, 962846, 972618, 982936, 993394, 1003580, 1013610, 1024132, 1035764, 1048672, 1062723, 1077915, 1094411, 1112091, 1130325, 1148332, 1165570, 1181638, 1196059, 1208474, 1218876, 1227254, 1233166, 1236039, 1235846, 1233078, 1228165, 1221407, 1213360, 1204650, 1195298, 1184862, 1173513, 1162371, 1152417, 1143539, 1135059, 1126731, 1118713, 1110904, 1102920, 1094660, 1086432, 1078611, 1071550, 1065699, 1061376, 1058386, 1056220, 1054702, 1054146, 1054861, 1056701, 1059198, 1061940, 1064772, 1067803, 1071327, 1075633, 1080772, 1086450, 1092159, 1097438, 1102114, 1106339, 1110378, 1114423, 1118643, 1123286, 1128527, 1134289, 1140465, 1147214, 1154721, 1162697, 1170572, 1178330, 1186692, 1196150, 1206107, 1215273, 1222670, 1227986, 1231157, 1232114, 1230884, 1227595, 1222242, 1214643, 1204797, 1193195, 1180740, 1168280, 1156232, 1144665, 1133797, 1124152, 1116077, 1109310, 1103471, 1098817]
52166A098817k823r81R2P46J957L729M924M867M236L993M079L660K289L69j305
52151A128649k123j998j422j008q86p02k51K20M23L69J16m29j238j980k368k450
52135A112922k372k104j562p77L05J900L996O168Q099J0067J2498J5205J7593
52122A181938J9559K1657K4083K6033K6605K6079K5704K6076K6411K5702K4090
52111A453937K2459K1024J9185J6764J4515J3078J2093J0860R358Q110P418P240
52099A616041P511Q003Q049O995M826K025j061m379p921j1665j5483j8778k0639
52086A573524k0868k0431k0263k0032j8795j6550j4236j2396j0737q932o997m861
52074A398426k443k01J287K374M046O407Q432R567J0536J2087J3812J4825J4967
$$ y = [1098817, 1095994, 1095013, 1095105, 1095851, 1097808, 1101537, 1106461, 1111328, 1115564, 1119557, 1123636, 1127296, 1129585, 1129954, 1128649, 1126526, 1124528, 1123106, 1122098, 1121212, 1120510, 1120259, 1120479, 1120902, 1121271, 1121387, 1120958, 1119720, 1117740, 1115372, 1112922, 1110550, 1108446, 1106884, 1106107, 1106412, 1108312, 1112308, 1118476, 1126575, 1136642, 1149140, 1164345, 1181938, 1201497, 1223154, 1247237, 1273270, 1299875, 1325954, 1351658, 1377734, 1404145, 1429847, 1453937, 1476396, 1497420, 1516605, 1533369, 1547884, 1560962, 1573055, 1583915, 1593273, 1601383, 1608801, 1616041, 1623552, 1631555, 1639604, 1646599, 1651425, 1653450, 1652389, 1648010, 1640089, 1628424, 1612941, 1594163, 1573524, 1552656, 1532225, 1511962, 1491930, 1473135, 1456585, 1442349, 1429953, 1419216, 1410284, 1403287, 1398426, 1395983, 1395782, 1397069, 1399443, 1403489, 1409896, 1418328, 1427895, 1438431, 1450518, 1464330, 1479155, 1494122]
52061A494122J4693J4300J3891J3650J3590J3399J2957J2558J2234J1340R351
52050A636085O678M113J856m38k979n806r069j2748j6253j8845k0368k1140k1326
52037A519760k0843j9847j8772j7889j7072j6008j4479j2560j0756r679r377r204
52025A343274q627p935p819q527r641j0537j0762j0259r479r048q978q586p557
52012A225519o721p139q714j0294j1217j2015j3478j5580j7630j9129k0064k0558
52000A062980k0621k0311j9888j9534j9066j8060j6396j4427j2611j1152j0197
51989H80717r983j0469j1117j1538j2150j3588j5552j6955j7313j7294j7639j8262
51977G08857j8692j8809j8626j7805j5984j3366j0494p644m756j788J103L623
$$ y = [1494122, 1508815, 1523115, 1537006, 1550656, 1564246, 1577645, 1590602, 1603160, 1615394, 1626734, 1636085, 1642763, 1646876, 1648732, 1648294, 1645315, 1639509, 1630440, 1617692, 1601439, 1582594, 1562226, 1541086, 1519760, 1498917, 1479070, 1460298, 1442409, 1425337, 1409329, 1394850, 1382290, 1371534, 1361855, 1352478, 1343274, 1334647, 1326712, 1318893, 1310366, 1300725, 1290188, 1279426, 1269167, 1259688, 1250640, 1241662, 1233076, 1225519, 1218798, 1211659, 1202945, 1192651, 1181434, 1169419, 1155941, 1140361, 1122731, 1103602, 1083538, 1062980, 1042359, 1022048, 1002160, 982626, 963560, 945500, 929104, 914677, 902066, 890914, 880717, 870734, 860265, 849148, 837610, 825460, 811872, 796320, 779365, 762052, 744758, 727119, 708857, 690165, 671356, 652730, 634925, 618941, 605575, 595081, 587437, 582681, 580893, 581996, 585619]
51965E85619N431O473P283Q490R839J0215R030P032N283L780J723j160m190o506
51951F48342p708p734o637m595j887J183M316P316J0336J3788J7756K1655K4672
51938G20803K6422K7018K6565K4781K1095J5271Q045R03n121j0151j4587j8036
51926H23008k0000k1186k2806k4642k5193k4081k2736k2114k1270j9276j7003
51915E82701j5612j4454j2204r268p218o308n326l785k381j203P48L760O535P824
51901E23809P849P546P357P282P118O145L417r78n672r421j2117j3965j4581j3644
51887E00145j1764r928q438o936n151l026n45K059M209N609O665P886R141R941
51873D99867J0144R846Q899P075M669K448Q92k35j483l065m605n495n502m933
$$ y = [585619, 591050, 597523, 604806, 613296, 623135, 633350, 642380, 649412, 654695, 658475, 660198, 659038, 654848, 648342, 640634, 632900, 626263, 621668, 619781, 620964, 625280, 632596, 642932, 656720, 674476, 696131, 720803, 747225, 774243, 800808, 825589, 846684, 861955, 870000, 870903, 865782, 855631, 841044, 823008, 803008, 781822, 759016, 734374, 709181, 685100, 662364, 640250, 618980, 599704, 582701, 567089, 552635, 540431, 531163, 523945, 517637, 512311, 508526, 506145, 504942, 505690, 509450, 515985, 523809, 531658, 539204, 546561, 553843, 560961, 567106, 570523, 569545, 563873, 554452, 542335, 528370, 513789, 500145, 488381, 478453, 470015, 463079, 457928, 454902, 454357, 456416, 460625, 466234, 472899, 480785, 489926, 499867, 510011, 519857, 528756, 535831, 540500, 542948, 543840, 543605, 542122, 539057, 534452, 528957, 523455, 518522]
51859E18522m148l019j208J188L603N542O718O781N578L755K321J343l07l407
51845E43262p135r908j1039j1042j0630j0039r213q104o726n276m118l372k632
51832D44028j449l1R38J166J075J145J283J032K35p52j478j813j899j852j696
51817D39932j556j602j644j179q6R57J228R39R58J558K074J871J169N89L72L35
51801D45915L05K00p1m10m31R6P72Q69J47q74j529j710j804k050k216k003j558
51784D33648j237r06n9J228K005J559M50j63P2O42J215J898K533K703K712L672
51768D51972O106R059J1096J1775J1619J1114J0250Q858O913M499J738j294m585
51755E39120p923j0671j2192j2562j2464j2224j1491r992q109o444n224m413l889
$$ y = [518522, 514374, 511355, 510147, 511335, 514938, 520480, 527198, 533979, 539557, 543312, 545633, 546976, 546669, 543262, 536127, 526219, 515180, 504138, 493508, 483469, 474256, 466152, 459426, 454150, 450032, 446660, 444028, 442579, 442548, 443486, 444652, 445727, 446872, 448155, 449187, 449422, 448670, 447192, 445379, 443480, 441628, 439932, 438376, 436774, 435130, 433951, 433865, 434822, 436050, 436989, 437947, 439505, 441579, 443450, 444619, 445208, 445580, 445915, 446220, 446420, 446349, 445939, 445508, 445604, 446376, 447245, 447392, 446518, 444989, 443279, 441475, 439425, 437209, 435206, 433648, 432411, 431505, 431446, 432674, 434679, 436238, 436688, 436525, 436597, 437239, 438454, 440352, 442885, 445588, 448300, 451972, 458078, 467137, 478233, 490008, 501627, 512741, 522991, 531849, 538762, 543261, 544999, 543705, 539120, 531197, 520526, 508334, 495772, 483308, 471084, 459593, 449601, 441492, 435048, 429824, 425411, 421522]
51742D21522l262k050l13J362K797M548O936R301J0737J1010J0271Q549O179M177
51728D91764L313L116K593J682J247J793K895L691L387J497j589m455n821n798
51714D99315n353m794l701k263j555k198l550m573m855m485l571k273q41N66J737
51699D57606K088J224j81q33m95k43p82j351r68N4O77N50J9q48k167l444l835
51682D47071l274k564k219j887j039L38J915L358M353M724M754N008N688O481
51668D72707P135P858R024J0776J2924J4800J5155J2869Q053K174l233p606j0987
51655E51649j3105j3445j1928r075n553j900J416M020N601N686L817M01k993m860
51641E09731n202n207n622o198o654p209p817p752o667n400m944n067m796m008
$$ y = [421522, 418260, 416210, 415897, 417259, 420056, 424604, 431540, 440841, 451578, 462588, 472859, 481408, 487587, 491764, 495077, 498193, 500786, 502468, 503715, 505508, 508403, 512094, 515481, 516978, 515389, 510934, 505113, 499315, 493962, 489168, 485467, 483204, 481649, 479451, 475901, 471328, 466473, 461988, 458417, 456144, 455303, 455869, 457606, 459694, 460918, 460737, 459904, 459409, 459166, 458384, 457033, 456065, 456119, 456796, 457346, 457365, 456517, 454350, 450906, 447071, 443797, 441233, 439014, 437127, 436088, 436426, 438341, 441699, 446052, 450776, 455530, 460538, 466226, 472707, 479842, 487700, 496724, 507500, 520424, 535224, 550379, 563248, 571301, 573475, 570242, 562636, 551649, 538544, 525099, 513171, 504096, 498543, 496643, 498059, 502079, 507680, 513366, 517183, 517584, 514591, 509731, 504529, 499322, 493700, 487502, 480848, 473639, 465822, 458070, 451403, 446003, 441059, 435992, 431196, 427188]
51627D27188l593l973m353l787k394j134p27j145j926k612k956k915k535j866
51613C91272j132q13j219k017k488k333j898j513j060l40N03J259K050L104M355
51598C87730N590O890Q495J0323J1902J2785J2775J1681R238N459R86l137o113
51585D74604p755q258p773o357m228j895K09K091M090O398Q812J0899J2275J2837
51571D95949J2826J2663J2598J2676J3008J3806J4822J5223J4562J3727J4307
51560F46167J7009K1171K5769L0229L4080L6633L7343L6050L2586K6784J9270
51549I63091J1559M742j485p820j3909j8679k1784k3867k5424k6280k6275k5742
51537G88127k5081k4401k3775k3297k2736k1687k0344j9552j9687j9881j8880
$$ y = [427188, 423595, 419622, 415269, 411482, 409088, 407954, 407227, 406082, 404156, 401544, 398588, 395673, 393138, 391272, 390140, 389327, 388108, 386091, 383603, 381270, 379372, 377859, 376799, 376459, 376962, 378221, 380271, 383375, 387730, 393320, 400210, 408705, 419028, 430930, 443715, 456490, 468171, 477409, 482868, 483854, 480717, 474604, 466849, 458591, 450818, 444461, 440233, 438338, 438547, 440638, 444728, 451126, 459938, 470837, 483112, 495949, 508775, 521438, 534036, 546712, 559720, 573526, 588348, 603571, 618133, 631860, 646167, 663176, 684347, 710116, 740345, 774425, 811058, 848401, 884451, 917037, 943821, 963091, 974650, 979392, 977907, 970087, 956178, 937499, 915715, 891848, 866424, 840144, 813869, 788127, 763046, 738645, 714870, 691573, 668837, 647150, 626806, 607254, 587567, 567686, 548806]
51526E48806j6447j3466j0843q834p417o767o985p582p707p009n989n306m931
51513D39523m307l292k477k346k572k484j948j393j107r20n37J25Q99J455J559
51498D20178J493J952L088M002L703K435J343R76Q47N80N39R93J420J230N96N9
51482D45434l87j148k290l453m320m745m639m138l763l979m642n230n413n125
51468C92162m384l434k819k794k846k315j325n18n8M17Q84Q36J97l51k85J64O39
51451C74170J294K346L518M424N203O299P857R720J1744J3770J5451J6442J6553
51438D88791J5482J2835Q832M582J148j388l436m988n943o870q484j0372j1301
51425D78888j0868r947r259q443p010n346m167l603l420l588l943l816k712j057
$$ y = [548806, 532359, 518893, 508050, 499216, 491799, 485032, 478047, 470465, 462758, 455749, 449760, 444454, 439523, 435216, 431924, 429447, 427101, 424529, 422045, 420097, 418704, 417597, 416677, 416140, 416265, 417164, 418619, 420178, 421671, 423623, 426711, 430713, 434416, 436851, 438194, 439170, 440017, 440597, 441136, 442129, 443549, 444779, 445375, 445434, 445047, 443899, 441609, 438156, 433836, 429091, 424452, 420314, 416551, 412572, 407930, 402700, 397287, 392162, 387778, 384344, 381525, 378731, 375885, 373570, 372245, 371727, 371669, 372086, 372970, 373806, 374003, 373652, 373367, 373531, 374170, 375464, 377810, 381328, 385752, 390955, 397254, 405111, 414831, 426575, 440345, 455796, 472238, 488791, 504273, 517108, 525940, 530522, 531670, 530282, 526846, 521858, 515915, 509045, 500561, 490189, 478888, 468020, 458073, 448814, 440371, 433361, 428015, 423848, 420245, 416825, 413237, 409294, 405478, 402766, 401709]
51411D01709L42J278K019K518K546K331K285K233J727J119J394K776M227M685
51397D33189M224L625L309L201L291L799M852O235P590Q760R961J1530J3464J5447
51383E32477J7539K0438K4657K9757L4956M0190M5815N1372N5610N7735N7696
51372I68242N5023M8563L8099K5401J2849J500q818j8141k6103l2812l8870m4394
51360I80539m8650n0876n1068m9806m7623m4669m0815l6063l0915k6123k1963
51349E31968j8120j4495j1676j0079r080p730o082n085n124n445n125m120l034
51336D26773k407k437k983l627l918l772l475l271l169l119l045k774k256j794
51322C84726j675j614j056p9O56Q86J083J559J926J849J741K114K643K611K012
$$ y = [401709, 402051, 403329, 405348, 407866, 410412, 412743, 415028, 417261, 418988, 420107, 421501, 424277, 428504, 433189, 437413, 441038, 444347, 447548, 450839, 454638, 459490, 465725, 473315, 482075, 492036, 503566, 517030, 532477, 550016, 570454, 595111, 624868, 659824, 700014, 745829, 797201, 852811, 910546, 968242, 1023265, 1071828, 1109927, 1135328, 1148177, 1149677, 1140859, 1122718, 1096615, 1063803, 1024933, 980539, 931889, 881013, 829945, 780139, 732516, 687847, 647032, 610969, 580054, 553931, 531968, 513848, 499353, 487677, 477598, 468518, 460788, 454706, 449621, 444497, 439052, 433927, 429807, 426773, 424366, 421929, 418946, 415319, 411401, 407629, 404154, 400883, 397714, 394595, 391550, 388776, 386520, 384726, 383051, 381437, 380381, 380302, 380958, 381844, 382927, 384486, 386412, 388261, 390002, 392116, 394759, 397370, 399382]
51307C99382J507J339R32k10j722k714k622j574j96P70Q70K58m97r77j223j412
51291C91911j463j143m55K82P00P06O14J030K406M439O136O759O646O724P198
51276D32490P166N755L238P39r54j872k369k600k501j949q46O64K128L010L077
51261D45176K388J093m89j822k614l232m119m920m815l755k743k569k939l162
51247D11478l131l152l265l289l154k787j952p03K92M55J8l90o07q68j139j153
51231C86653r95r94j131j082q38o72n76k71J57K24k01o35n95m2Q17J758K361K177
51213C86115J314N34M88J094J864K542L185L835M339M500M311M027L880L715L157
51198D28900K302J739J651J304P5j453k215k202k334k905l192k749k043j450o07
$$ y = [399382, 400889, 402228, 403160, 402950, 401228, 398514, 395892, 394318, 394122, 394892, 395762, 396020, 395523, 394546, 393323, 391911, 390448, 389305, 388850, 389132, 389832, 390538, 391152, 392182, 394588, 399027, 405163, 411922, 418568, 425292, 432490, 439656, 445411, 448649, 449388, 448434, 446562, 444193, 441593, 439092, 437143, 436297, 436961, 439089, 442099, 445176, 447564, 448657, 448168, 446346, 443732, 440500, 436381, 431461, 426646, 422891, 420148, 417579, 414640, 411478, 408347, 405195, 401930, 398641, 395487, 392700, 390748, 390045, 390337, 390792, 390810, 390420, 389813, 388945, 387806, 386653, 385658, 384664, 383533, 382451, 381613, 380941, 380365, 380094, 380251, 380475, 380274, 379639, 379044, 379002, 379819, 381577, 383938, 386115, 387429, 387963, 388451, 389545, 391409, 393951, 397136, 400971, 405310, 409810, 414121, 418148, 422028, 425743, 428900, 431202, 432941, 434592, 435896, 435971, 434518, 432303, 430101, 427767, 424862, 421670, 418921, 416878, 415428, 414821]
51183D14821O91J765J984J722J670J656R84l35j491j858j541r45l75p6k20p58
51167D17694j508k273k737k451j254M37K016L169L847M001L622K835J729L79q31
51152D28675j337j184j153j655j984j331r8N46K39k83l86k42k05k44k45l26n25
51135D18262o26n55n21n94n12j87J0j93m24p9Q46J730K093K105K230K561K702
51118D28848K333J719J412J491J466J069P81J187K054K609K573K384K359K274
51104D54559J922J545J421J421J339J263J311J326J169J007Q69K95r91k258k326
51089D63872j035M42R34M95pq0K7r0m05n15m0R12J656J474N01j78L43J738K891
51070D72935L261L371L894M888O149P816J0142J2962J5881J8831K1947K4990K7272
$$ y = [414821, 415512, 417277, 419261, 420983, 422653, 424309, 425293, 424958, 423467, 421609, 420068, 419123, 418748, 418672, 418452, 417694, 416186, 413913, 411176, 408725, 407471, 407908, 409924, 413093, 416940, 420941, 424563, 427398, 429127, 429506, 428675, 427338, 426154, 425001, 423346, 421362, 420031, 419933, 420479, 420718, 420435, 420049, 419807, 419602, 419358, 419113, 418787, 418262, 417636, 417081, 416560, 415966, 415454, 415267, 415277, 415084, 414660, 414581, 415427, 417157, 419250, 421355, 423585, 426146, 428848, 431181, 432900, 434312, 435803, 437269, 438338, 439119, 440306, 442360, 444969, 447542, 449926, 452285, 454559, 456481, 458026, 459447, 460868, 462207, 463470, 464781, 466107, 467276, 468283, 469152, 469447, 468456, 466198, 463872, 462837, 463279, 464213, 464708, 464701, 464621, 464648, 464558, 464153, 463638, 463598, 464510, 466166, 467640, 468141, 467963, 468306, 470044, 472935, 476196, 479567, 483461, 488349, 494498, 502314, 512456, 525418, 541299, 560130, 582077, 607067, 634339]
51057F34339K8212K7506K4837K0008J3710P732L940L011M322O728R049J0044Q703
51044H02141M989J97m002o963r365j2025j4598j5775j4683j1815q552o196n601
51031F97752p199j0745j5068j8541k0050j9397j7004j3536r735o131k827J98K675
51018E60392M363N627P134Q864J0109J0579J0826J1197J1078R877Q094O695N776
51005F70611M661L116J557J41j438l050l951l863l560l861m570m935m694l999
50991F42165k737p00J624L282M081M977O939R752J2346J3983J4780J5315J6047
50978G41854J7046J7927J8036J7049J5439J4168J3949J4976J7255K0828K5513
50967I34040L0736L5742L9956M3204M5869M8742N2344N6202N9234O0908O1608
$$ y = [634339, 662551, 690057, 714894, 734902, 748612, 756344, 760284, 763295, 767617, 774345, 783394, 793438, 802141, 807130, 807327, 803325, 796362, 786997, 774972, 760374, 744599, 729916, 718101, 709549, 703353, 697752, 690553, 679808, 664740, 646199, 626149, 606752, 589748, 576212, 566477, 560346, 557519, 557717, 560392, 564755, 570382, 577516, 586380, 596489, 607068, 617894, 629091, 640169, 650046, 658140, 664835, 670611, 675272, 678388, 679945, 680086, 678648, 675598, 671647, 667784, 664224, 660363, 655793, 650858, 646164, 642165, 639428, 638728, 640352, 643634, 647715, 652692, 659631, 669383, 681729, 695712, 710492, 725807, 741854, 758900, 776827, 794863, 811912, 827351, 841519, 855468, 870444, 887699, 908527, 934040, 964776, 1000518, 1040474, 1083678, 1129547, 1178289, 1230633, 1286835, 1346069, 1406977, 1468585]
50956A468585O1706O0876N8703N5431N1549M7043M1781L6291L1419K7356K3748
50945A964488K0664J8603J7508J6694J5963J5896J6578J6794J5223J1973Q312
50934B138696N091K043j554o016j1075j6216k1151k6047l1291l6965m2789m8544
50922A904182n4082n8878o2062o3336o3408o3073o2213o0092n6459n1936m7433
50911A261210m3503m0162l7001l3571k9858k6286k3249k0834j9100j8074j7313
50900I52259j5972j3813j1651j0360r788r116p881o165m202k415j453j417j364
50887H56662m36P68R43R7k80P03K176K946L197L921N262O395O898P311Q239R521
50871I14323J0616J1413J2220J3165J4007J4658J5461J6712J8174J9442K0704
$$ y = [1468585, 1530291, 1591167, 1649870, 1705301, 1756850, 1803893, 1845674, 1881965, 1913384, 1940740, 1964488, 1985152, 2003755, 2021263, 2037957, 2053920, 2069816, 2086394, 2103188, 2118411, 2130384, 2138696, 2143787, 2145830, 2144276, 2138260, 2127185, 2110969, 2089818, 2063771, 2032480, 1995515, 1952726, 1904182, 1850100, 1791222, 1729160, 1665824, 1602416, 1539343, 1477130, 1417038, 1360579, 1308643, 1261210, 1217707, 1177545, 1140544, 1106973, 1077115, 1050829, 1027580, 1006746, 987646, 969572, 952259, 936287, 922474, 910823, 900463, 890675, 881559, 873678, 867513, 863311, 860896, 859443, 858026, 856662, 856226, 856994, 857937, 858034, 857754, 858457, 860633, 863579, 866776, 870697, 875959, 882354, 889252, 896563, 904802, 914323, 924939, 936352, 948572, 961737, 975744, 990402, 1005863, 1022575, 1040749, 1060191, 1080895]
50860A080895K2577K5240K8251L1390L5112L9890M5621N2075N9361O7391P5434
50849A563237Q2919R0318R8428J07060J15283J22697J29549J35570J39746J41465
50839B726272J41022J38597J33465J24819J12773R8231Q2213O5748M9937L5479
50829C708556K2416J0751J153n302p947o834k611L688J0890J8147K4981L0706
50817C808594L4051L3598K8510J8675M475j3316l3492n4651p5476r4931j12354
50806C543683j27532j40408j50612j57452j60337j59109j54031j45886j35935
50797B212381j25303j14260j02567r0494p8910o8295n8386m9086m0918l4104k7917
50786A422141k1656j5778j1366q755p346o432n653m873m283m371n154n790n641
$$ y = [1080895, 1103472, 1128712, 1156963, 1188353, 1223465, 1263355, 1308976, 1361051, 1420412, 1487803, 1563237, 1646156, 1736474, 1834902, 1941962, 2057245, 2179942, 2309491, 2445061, 2584807, 2726272, 2867294, 3005891, 3139356, 3264175, 3376948, 3475179, 3557392, 3623140, 3673077, 3708556, 3730972, 3741723, 3742876, 3737574, 3729627, 3722793, 3720182, 3723870, 3734760, 3752907, 3777888, 3808594, 3842645, 3876243, 3904753, 3923428, 3927903, 3914587, 3881095, 3826444, 3750968, 3656037, 3543683, 3416151, 3275743, 3125131, 2967679, 2807342, 2648233, 2494202, 2348316, 2212381, 2087078, 1972818, 1870251, 1779757, 1700847, 1632552, 1574166, 1525080, 1484162, 1450058, 1422141, 1400485, 1384707, 1373341, 1364586, 1357240, 1350808, 1345155, 1340282, 1335999, 1331628, 1326474, 1320684, 1315043]
50773A315043n402o235p984r332r782j0250j1428j2658j3142j3307j4027j5105
50761A186391j5587j5237j4767j4533j4025j2800j1198r691q071n766k743L39
50749A062312K882M967P248J0317J4195J8316K2020K5129K7967L0876L3952L7295
50737A297476M1229M5863N0559N4306N6760N8642O0888O3568O5904O7208O7500
50726A929903O7240O6723O5865O4383O1995N8539N3975M8318M1480L3229K3360
50715B515010J2021n0j1597k1280k8168l1894l2331k9456k3669j6107q231r18
50703B323330N823J2192J7866K2039K3885K2780J8302J0396m03j3241k7396m2275
50691B373298n6878o9719p9611q6346r0270r1355q9245q4303p7883p1133o3894
$$ y = [1315043, 1309641, 1303406, 1295422, 1286090, 1276308, 1266058, 1254630, 1241972, 1228830, 1215523, 1201496, 1186391, 1170804, 1155567, 1140800, 1126267, 1112242, 1099442, 1088244, 1078553, 1070482, 1064716, 1061973, 1062312, 1065194, 1070161, 1077409, 1087726, 1101921, 1120237, 1142257, 1167386, 1195353, 1226229, 1260181, 1297476, 1338705, 1384568, 1435127, 1489433, 1546193, 1604835, 1665723, 1729291, 1795195, 1862403, 1929903, 1997143, 2063866, 2129731, 2194114, 2256109, 2314648, 2368623, 2416941, 2458421, 2491650, 2515010, 2527031, 2526981, 2515384, 2494104, 2465936, 2434042, 2401711, 2372255, 2348586, 2332479, 2324248, 2323330, 2329153, 2341345, 2359211, 2381250, 2405135, 2427915, 2446217, 2456613, 2456210, 2442969, 2415573, 2373298, 2316420, 2246701, 2167090, 2080744, 1990474, 1899119, 1809874, 1725571, 1647688, 1576555, 1512661]
50680A512661n5454m6175l7520l0319k3846j7050j0080l887J227N786J0016J3396
50668A318755J5538J6785J7572J7780J7228J6371J5912J5867J5617J4909J4330
50657A496664J4650J6028J8045K0237K2266K3882K5041K6089K7460K9202L1094
50646A750658L3247L6145L9870M3735M7063N0073N3376N6873N9763O1616O2713
50635B295132O3204O2745O1286N9474N7674N5253N1617M7437M3966M1300L8012
50624B877100L2407K3453J0817m848k1375l5639m5231m9386m8509m3538l5962
50613B659289k7486j9172j1257m112J295M312N347N044L080j479q804j7967k7926
50600B560164l8359m9320o0417p0512p8262q2973q5005q5250q4267q2141p9033
$$ y = [1512661, 1457207, 1411032, 1373512, 1343193, 1319347, 1302297, 1292217, 1288330, 1289557, 1295343, 1305359, 1318755, 1334293, 1351078, 1368650, 1386430, 1403658, 1420029, 1435941, 1451808, 1467425, 1482334, 1496664, 1511314, 1527342, 1545387, 1565624, 1587890, 1611772, 1636813, 1662902, 1690362, 1719564, 1750658, 1783905, 1820050, 1859920, 1903655, 1950718, 2000791, 2054167, 2111040, 2170803, 2232419, 2295132, 2358336, 2421081, 2482367, 2541841, 2599515, 2654768, 2706385, 2753822, 2797788, 2839088, 2877100, 2909507, 2932960, 2943777, 2938929, 2917554, 2881915, 2836684, 2787298, 2738789, 2695251, 2659289, 2631803, 2612631, 2601374, 2597262, 2598557, 2602869, 2608216, 2613260, 2616340, 2614861, 2606057, 2588090, 2560164, 2521805, 2472485, 2412068, 2341556, 2263294, 2180321, 2095316, 2010066, 1925799, 1843658, 1764625]
50589A764625p5398p1445o6860o1440n5658n0187m5154m0255l5420l0893k6735
50578A205180k2768j8970j5541j2462r347n903k322R89L859O396Q665J0610J2307
50565A160693J4167J6545J9130K0983K1476K1087K0919K1531K2523K3260K3616
50554A385930K3904K4412K5181K5984K6413K6230K5666K5093K4506K3720K3117
50543A660156K3585K5521K8399L1576L5051L9149M3985M9610N6208O3672P1350
50532B128262P8724Q5932R3220J00332J07082J14064J21937J30180J37361J42665
50522C239759J46357J48734J49330J47384J42466J34331J22693J07498Q9105O8008
50512D495665M4686J9898n258k9898n3518p5461r4526j09570j20209j26581j28537
$$ y = [1764625, 1689227, 1617782, 1550922, 1489482, 1433824, 1383637, 1338483, 1298228, 1262808, 1231915, 1205180, 1182412, 1163442, 1147901, 1135439, 1126092, 1120189, 1117867, 1118856, 1122715, 1129111, 1137776, 1148386, 1160693, 1174860, 1191405, 1210535, 1231518, 1252994, 1274081, 1295000, 1316531, 1339054, 1362314, 1385930, 1409834, 1434246, 1459427, 1485411, 1511824, 1538054, 1563720, 1588813, 1613319, 1637039, 1660156, 1683741, 1709262, 1737661, 1769237, 1804288, 1843437, 1887422, 1937032, 1993240, 2056912, 2128262, 2206986, 2292918, 2386138, 2486470, 2593552, 2707616, 2829553, 2959733, 3097094, 3239759, 3386116, 3534850, 3684180, 3831564, 3974030, 4108361, 4231054, 4338552, 4427657, 4495665, 4540351, 4560249, 4554991, 4525093, 4471575, 4396114, 4301588, 4192018, 4071809, 3945228, 3816691]
50501C816691j25554j17382j04479q7763o8243m6979k5150l924J5620L2381M5267
50490C330485N3458N6584N4411M6457L2314J2439j1594l7766o4286q9471j11408
50479C271623j28399j39730j45718j47038j44442j39055j32271j24936j16992
50470B053042j08162r8708q9252q0220p1773o4037n6994n0343m3743l7222l1099
50459A321489k5588k0562j5711j0798n885j308K737O500J0281J3855J6817J9513
50447A311340K2900K7170L1201L3881L5423L6685L7647L7233L4447K8982K1073
50436A657982J1575K126n534j0700j3706j4985j4684j3249j1517r915q089n689
50424A563615l007n46J741M328P500J1203J5380K0100K5337L0911L6650M2572
$$ y = [3816691, 3691137, 3573755, 3469276, 3381513, 3313270, 3266291, 3241141, 3237217, 3252837, 3285218, 3330485, 3383943, 3440527, 3494938, 3541395, 3573709, 3586148, 3574554, 3536788, 3472502, 3383031, 3271623, 3143224, 3003494, 2857776, 2710738, 2566296, 2427241, 2294970, 2170034, 2053042, 1944880, 1846172, 1756920, 1676700, 1604927, 1540890, 1483896, 1433553, 1389810, 1352588, 1321489, 1295901, 1275339, 1259628, 1248830, 1242945, 1241637, 1244374, 1250874, 1261155, 1275010, 1291827, 1311340, 1334240, 1361410, 1392611, 1426492, 1461915, 1498600, 1536247, 1573480, 1607927, 1636909, 1657982, 1669557, 1671683, 1666149, 1655449, 1641743, 1626758, 1612074, 1598825, 1587308, 1577393, 1569304, 1563615, 1560608, 1560062, 1561803, 1566131, 1573631, 1584834, 1600214, 1620314, 1645651, 1676562, 1713212, 1755784]
50412A755784M8780N5214O1507O7108P1544P4563P6115P6344P5557P3845P0831
50401B507192O6076N9822N2846M5352L6478K5262J1763l165j8794l4622m9878
50390B698332o3540p4885q3537q8997r0678q8513q3162p5596o6684n7073m6981
50379A878686l6126k4220j1667M58J1042J9369K5089K8125K8519K6065K0285J1201
50367A976826m4j1769k2924l3194m2177m9017n3015n4135n2827m9664m5266m0355
50355A522439l5897l3271l3801l7578m2914m7491m9995n0277m8448m4648l9534
50344A058585l4091k8742k3320j7974j3348r735o728l872j131J428L751N508O323
50331I36654O448O633P138P556P678P817Q078Q095P824P826Q372Q961R190R399
$$ y = [1755784, 1804564, 1859778, 1921285, 1988393, 2059937, 2134500, 2210615, 2286959, 2362516, 2436361, 2507192, 2573268, 2633090, 2685936, 2731288, 2767766, 2793028, 2804791, 2801626, 2782832, 2748210, 2698332, 2634792, 2559907, 2476370, 2387373, 2296695, 2208182, 2125020, 2049424, 1982740, 1925667, 1878686, 1842560, 1818340, 1806673, 1807131, 1818173, 1837542, 1862631, 1890756, 1919275, 1945340, 1965625, 1976826, 1976782, 1965013, 1942089, 1908895, 1866718, 1817701, 1764686, 1710551, 1657724, 1608060, 1562794, 1522439, 1486542, 1453271, 1419470, 1381892, 1338978, 1291487, 1241492, 1191215, 1142767, 1098119, 1058585, 1024494, 995752, 972432, 954458, 941110, 931375, 924647, 920775, 919644, 921072, 924823, 930331, 936654, 943102, 949735, 956873, 964429, 972107, 979924, 988002, 996097, 1003921, 1011747, 1020119, 1029080, 1038270, 1047669]
50317A047669R938J0383J0037Q759O863M703K739J532J163J139J261K034L783
50304A112003N950P912R923J2616J6021J9769K3930K8931L4778M0922M6701N1479
50292A410935N4536N5067N1936M3284K7421N123j9306m0145n3582n8941n7745
50281A418583n2551m6042l9706l3192k5735j8033j1828p839n255l211j653n20
50269A173018O75K030K994L494M374O046P531P728P051O848P541Q242Q186P722
50255A253480P630Q074Q545Q570Q172P587O774N360L140M61k093m306o237p638
50241A297519p951o983n115k646N78M397P706R086P904M287j592r421j7904k4899
50227A254966k8902l0105k9686k8494k6803k4909k3265k1992k0820j9608j8572
$$ y = [1047669, 1057607, 1067990, 1078027, 1086786, 1093649, 1098352, 1101091, 1102623, 1103786, 1104925, 1106186, 1108220, 1112003, 1117953, 1125865, 1135788, 1148404, 1164425, 1184194, 1208124, 1237055, 1271833, 1312755, 1359456, 1410935, 1465471, 1520538, 1572474, 1615758, 1643179, 1648302, 1628996, 1588851, 1535269, 1476328, 1418583, 1366032, 1319990, 1280284, 1247092, 1221357, 1203324, 1191496, 1183657, 1178402, 1175191, 1173538, 1173018, 1173693, 1175723, 1178717, 1182211, 1186585, 1192631, 1200162, 1207890, 1214941, 1221789, 1229330, 1237572, 1245758, 1253480, 1261110, 1269184, 1277729, 1286299, 1294471, 1302058, 1308832, 1314192, 1317332, 1317793, 1315700, 1311394, 1305157, 1297519, 1289568, 1282585, 1277470, 1274824, 1275402, 1279799, 1287505, 1296591, 1304495, 1308782, 1307190, 1297769, 1279865, 1254966, 1226064, 1195959, 1166273, 1137779, 1110976, 1086067, 1062802, 1040810, 1019990, 1000382, 981810]
50216I81810j7782j6866j5514j3988j2775j1925j1041r937q865q088p521o914
50204H40594o139n169m073l086k586k704l102l270k994k479k115k236k992m207
50190G93442n382n967n767n111m572m502m777m995m905m555m072l517k999k759
50176G29562k877l067k952k510j985j550j309j481k137k778k635j523j10Q61J277
50161G04786J553K045K891M057N365O553P525Q547J0118J2607J5884J9191K1617
50148H22739K2965K3957K5224K6322K6279K4972K3295K1987K0977K0078J9618
50137A078413J9922K0762K1739K2736K3556K3451K1508J7342J1244L991l378r948
50125A251338j5512k0355k4332k6664k6939k5722k3800k1415j8688j6086j3789
$$ y = [981810, 964028, 947162, 931648, 917660, 904885, 892960, 881919, 871982, 863117, 855029, 847508, 840594, 834455, 829286, 825213, 822127, 819541, 816837, 813735, 810465, 807471, 804992, 802877, 800641, 797649, 793442, 788060, 782093, 776326, 771215, 766643, 762141, 757364, 752369, 747464, 742909, 738837, 735320, 732321, 729562, 726685, 723618, 720666, 718156, 716171, 714621, 713312, 711831, 709694, 706916, 704281, 702758, 702648, 703509, 704786, 706339, 708384, 711275, 715332, 720697, 727250, 734775, 743322, 753440, 766047, 781931, 801122, 822739, 845704, 869661, 894885, 921207, 947486, 972458, 995753, 1017740, 1038717, 1058795, 1078413, 1098335, 1119097, 1140836, 1163572, 1187128, 1210579, 1232087, 1249429, 1260673, 1264664, 1261286, 1251338, 1235826, 1215471, 1191139, 1164475, 1137536, 1111814, 1088014, 1066599, 1047911, 1031825, 1018036]
50114A018036j1214q098n650n506p617j0109j1266j0945r906q654p261n742m162
50101I11906k712j778j709k366l266m196n316o577p473p477o498m805k748p01
50087H54284J007K192K892L400M232N726P479Q565Q588Q188Q173Q519Q791R030
50073I41066R440R613Q923P603O499N773M768L254J871R91R1j321k850l861m322
50058I87538m508m448m222m340n136o136o564o252n469m194k248jJ720K568L061
50043I41369L954N543P647R867J1808J3262J4388J5457J6438J7063J7323J7642
50031A091761J8433J9657K0926K1886K2380K2368K1862K0915J9523J7581J5054
50020A312346J2221R607P595O172N066M008K736P96k341o935j2663j8740k4269
$$ y = [1018036, 1006822, 998724, 993074, 987568, 979951, 969842, 958576, 947631, 937725, 929071, 921810, 916068, 911906, 909194, 907416, 905707, 903341, 900075, 895879, 890563, 883986, 876513, 869036, 862538, 857733, 854985, 854284, 855291, 857483, 860375, 863775, 868007, 873733, 881212, 889777, 898365, 906553, 914726, 923245, 932036, 941066, 950506, 960119, 969042, 976645, 983144, 988917, 993685, 996939, 998810, 999801, 999892, 998571, 995721, 991860, 987538, 983030, 978582, 974360, 970020, 964884, 958748, 952184, 945932, 940463, 936269, 934021, 934020, 935740, 938308, 941369, 945323, 950866, 958513, 968380, 980188, 993450, 1007838, 1023295, 1039733, 1056796, 1074119, 1091761, 1110194, 1129851, 1150777, 1172663, 1195043, 1217411, 1239273, 1260188, 1279711, 1297292, 1312346, 1324567, 1334174, 1341769, 1347941, 1353007, 1357015, 1359751, 1360547, 1358206, 1351271, 1338608, 1319868, 1295599]
50007A295599k8650l1838l4207l5951l6705l5935l3570l0028k5610k0405j4814
49996I67886r708n787l101j379m93l52o99j368k420l782n171o623q686j1559j4446
49981H92312j6253j6692j6249j5390j4400j3655j3324j2973j2030j0570r056p531
49969G34189n810m301l807m396n292n906o240o165n233l509j811o46M51K030L835
49954F87389N230O146O961P871Q809R741J0591J1088J0985J0252Q855O735M320
49941G94973K509J749J416O31o31j763k641l873n952q690j1558j4078j5758j6066
49927G20268j4899j2911j1053r670q259o259l947k233j537j256n96M04J129J409
49913F50590J672K168K679L135L850M903N812O221O501P255Q532R932J1263J2601
$$ y = [1295599, 1266949, 1235111, 1200904, 1164953, 1128248, 1092313, 1058743, 1028715, 1003105, 982700, 967886, 958178, 952391, 949290, 947911, 947418, 947066, 946367, 944999, 942579, 938797, 933626, 927003, 918317, 906758, 892312, 876059, 859367, 843118, 827728, 813328, 799673, 786349, 773376, 761346, 750776, 741720, 734189, 728379, 724078, 720271, 715875, 710583, 704677, 698437, 692272, 687039, 683530, 681719, 681073, 681524, 683554, 687389, 692619, 698765, 705726, 713597, 722406, 732147, 742738, 753826, 764811, 775063, 783918, 790653, 794973, 797482, 799231, 800647, 801278, 800647, 798884, 796243, 792370, 786418, 777728, 766170, 752092, 736334, 720268, 705369, 692458, 681405, 671735, 663476, 657217, 653270, 651037, 649500, 648244, 647648, 648052, 649181, 650590, 652262, 654430, 657109, 660244, 664094, 668997, 674809, 681030, 687531, 694786, 703318, 713250, 724513, 737114]
49899G37114J3840J4523J4174J2684J0404P923N670L642J674k25k007l971o466
$$ y = [737114, 750954, 765477, 779651, 792335, 802739, 810662, 816332, 819974, 821648, 821423, 819416, 815445, 808979]
$$ [...]
##END NTUPLES=NMR SPECTRUM
##END=
