##TITLE=AC1758_VAR00030_9319999_5vkedlQDku
##JCAMPDX= 6.0         $$ Bruker NMR JCAMP-DX V2.0
##DATA TYPE= NMR SPECTRUM
##DATA CLASS= NTUPLES
##ORIGIN= BRUKER
##OWNER= Administrator
$$ 1.72 TOPSPIN		Version 2.1
$$ 2015-08-12 00:43:36.773 -0700  Administrator@X
$$ Compression mode = diff/dup
##.OBSERVE FREQUENCY= 400.02188249412
##.OBSERVE NUCLEUS= ^1H
##.ACQUISITION MODE= SIMULTANEOUS (DQD)
##.ACQUISITION SCHEME= undefined
##.AVERAGES= 8
##.DIGITISER RES= 22
##SPECTROMETER/DATA SYSTEM= spect
##.PULSE SEQUENCE= zg30
##.SOLVENT NAME= COFFEE_meoh
##.SHIFT REFERENCE= INTERNAL, COFFEE_meoh, 1, 14.98509
##AUDIT TRAIL= $$ (NUMBER, WHEN, WHO, WHERE, PROCESS, VERSION, WHAT)
$$ ##TITLE= Audit trail, TOPSPIN		Version 2.1
$$ ##JCAMPDX= 5.01
$$ ##ORIGIN= Bruker BioSpin GmbH
$$ ##OWNER= Administrator
$$ $$ E:\/data/COFFEE/nmr/AC1758_VAR00030_9319999_5vkedlQDku/10/pdata/1/auditp.txt
$$ ##AUDIT TRAIL=  $$ (NUMBER, WHEN, WHO, WHERE, PROCESS, VERSION, WHAT)
(   1,<2015-08-12 00:43:29.523 -0700>,<Administrator>,<X>,<go>,<TOPSPIN 2.1>,
      <created by zg
	started at 2015-08-12 00:42:23.039 -0700,
	POWCHK enabled, PULCHK disabled,
       configuration hash MD5:
       21 0F 79 D6 B3 7B B4 F6 88 20 88 DB 03 48 BD 9F
       data hash MD5: 64K
       67 76 78 FC 9A F5 1E 20 3D BB 0B 3E EC 07 DD CD>)
(   2,<2015-08-12 00:43:32.664 -0700>,<Administrator>,<X>,<proc1d>,<TOPSPIN 2.1>,
      <Start of raw data processing
       efp LB = 0 FT_mod = 6 PKNL = 1 PHC0 = 0 PHC1 = 0 SI = 32K 
       data hash MD5: 32K
       B1 28 A4 F3 21 B8 13 99 F9 FA F4 88 61 7E BF 31>)
(   3,<2015-08-12 00:43:32.945 -0700>,<Administrator>,<X>,<proc1d>,<TOPSPIN 2.1>,
      <pk PHC0 = 89.15405 PHC1 = 0 
       data hash MD5: 32K
       DA 5C B1 1C FB A5 33 BE 83 FD 99 7F FF B1 26 37>)
(   4,<2015-08-12 00:43:33.070 -0700>,<Administrator>,<X>,<proc1d>,<TOPSPIN 2.1>,
      <abs ABSG = 1 
       data hash MD5: 32K
       A1 05 1C 3B BA F2 30 C9 7A 1E 0E 13 1E 77 49 75>)
(   5,<2015-08-12 00:43:33.117 -0700>,<Administrator>,<X>,<proc1d>,<TOPSPIN 2.1>,
      <abs ABSG = 2 
       data hash MD5: 32K
       DB 9A 9D CB 9A 8A AB 4C 12 E9 47 DF 9C 67 95 2F>)
(   6,<2015-08-12 00:43:33.179 -0700>,<Administrator>,<X>,<proc1d>,<TOPSPIN 2.1>,
      <abs ABSG = 3 
       data hash MD5: 32K
       DC 2A 83 A3 A7 D4 F6 25 F4 F9 1E F7 C0 16 00 DA>)
(   7,<2015-08-12 00:43:33.242 -0700>,<Administrator>,<X>,<proc1d>,<TOPSPIN 2.1>,
      <abs ABSG = 4 
       data hash MD5: 32K
       D5 B3 D5 5D 4A 83 8B 7F E7 69 56 FA AA 57 84 2B>)
(   8,<2015-08-12 00:43:33.304 -0700>,<Administrator>,<X>,<proc1d>,<TOPSPIN 2.1>,
      <abs ABSG = 5 
       data hash MD5: 32K
       E6 38 3E 19 FC 27 DA 1C 0C D2 91 52 C2 75 EF 51>)
$$ ##END=
$$ 
$$ $$ hash MD5
$$ $$ E4 E1 CF D9 CF B3 65 9E 88 3C 60 42 75 16 2A 25
##$RELAX= 
##$RELAX= 
##$RELAX= 
##$RELAX= 
##$RELAX= 
##$RELAX= 
##$RELAX= 
$$ Bruker specific parameters
$$ --------------------------
##$DU= <E:\>
##$EXPNO= 10
##$NAME= <AC1758_VAR00030_9319999_5vkedlQDku>
$$ [...]
150 150 150 150 150 150 150 150
##$TP07= 0
##$TPNAME0= <>
##$TPNAME1= <>
##$TPNAME2= <>
##$TPNAME3= <>
##$TPNAME4= <>
##$TPNAME5= <>
##$TPNAME6= <>
##$TPNAME7= <>
##$TPOAL= (0..7)
0.5 0.5 0.5 0.5 0.5 0.5 0.5 0.5
##$TPOFFS= (0..7)
0 0 0 0 0 0 0 0
##$TUNHIN= 0
##$TUNHOUT= 0
##$TUNXOUT= 0
##$USERA1= <user>
##$USERA2= <user>
##$USERA3= <user>
##$USERA4= <user>
##$USERA5= <user>
##$V9= 5
##$VALIST= <valist>
##$VCLIST= <CCCCCCCCCCCCCCC>
##$VD= 0
##$VDLIST= <DDDDDDDDDDDDDDD>
##$VPLIST= <PPPPPPPPPPPPPPP>
##$VTLIST= <TTTTTTTTTTTTTTT>
##$WBST= 2048
##$WBSW= 25
##$XGAIN= (0..3)
0 0 0 0
##$XL= 0
##$YL= 0
##$YMAX_a= 543841
##$YMIN_a= -472540
##$ZGOPTNS= <>
##$ZL1= 120
##$ZL2= 120
##$ZL3= 120
##$ZL4= 120
##$ABSF1= 14.98509
##$ABSF2= -5.573092
##$ABSG= 5
##$ABSL= 3
##$ALPHA= 0
##$AQORDER= 0
##$ASSFAC= 0
##$ASSFACI= 0
##$ASSFACX= 0
##$ASSWID= 0
##$AUNMP= <proc_prof1d_extract_pilot.lims>
##$AXLEFT= 0
##$AXNAME= <>
##$AXNUC= <1H>
##$AXRIGHT= 0
##$AXTYPE= 0
##$AXUNIT= <>
##$AZFE= 0.1
##$AZFW= 0.1
##$BCFW= 0
##$BC_mod= 0
##$BYTORDP= 0
##$COROFFS= 0
##$CY= 15
##$DATMOD= 1
##$DC= 0
##$DFILT= <>
##$DTYPP= 0
##$F1P= 0
##$F2P= 0
##$FCOR= 0.5
##$FTSIZE= 32768
##$FT_mod= 6
##$GAMMA= 0
##$GB= 0
##$INTBC= 1
##$INTSCL= 1
##$ISEN= 128
##$LB= 0
##$LEV0= 0
##$LPBIN= 0
##$MAXI= 10000
##$MC2= 0
##$MEAN= 0
##$ME_mod= 0
##$MI= 0
##$NCOEF= 0
##$NC_proc= -8
##$NLEV= 6
##$NOISF1= 0
##$NOISF2= 0
##$NSP= 0
##$NTH_PI= 0
##$NZP= 0
##$OFFSET= 14.98509
##$PC= 1
##$PHC0= 89.15405
##$PHC1= 0
##$PH_mod= 1
##$PKNL= yes
##$PPARMOD= 0
##$PPDIAG= 0
##$PPIPTYP= 0
##$PPMPNUM= 2147483647
##$PPRESOL= 1
##$PSCAL= 4
##$PSIGN= 0
##$PYNMP= <proc.py>
##$REVERSE= no
##$SF= 400.02
##$SI= 32768
##$SIGF1= 0
##$SIGF2= 0
##$SINO= 400
##$SIOLD= 32768
##$SPECTYP= <>
##$SREGLST= <1H.CDCl3>
##$SSB= 0
##$STSI= 32768
##$STSR= 0
##$SW_p= 8223.68421052631
##$SYMM= 0
##$S_DEV= 0
##$TDeff= 65536
##$TDoff= 0
##$TI= <>
##$TILT= no
##$TM1= 0
##$TM2= 0
##$TOPLEV= 0
##$USERP1= <user>
##$USERP2= <user>
##$USERP3= <user>
##$USERP4= <user>
##$USERP5= <user>
##$WDW= 1
##$XDIM= 32768
##$YMAX_p= 406739481
##$YMIN_p= -713120
##$CURPLOT= <Network HP LaserJet P1505>
##$CURPRIN= <$Network HP LaserJet P1505>
##$DFORMAT= <normdp>
##$LAYOUT= <+/1D_H.xwp>
##$LFORMAT= <normlp>
##$PFORMAT= <normpl>
##$SURQMSG= 1
$$ End of Bruker specific parameters
$$ ---------------------------------
##NTUPLES= NMR SPECTRUM
##VAR_NAME=  FREQUENCY,     SPECTRUM/REAL,   SPECTRUM/IMAG
##SYMBOL=    X,             R,               I
##VAR_TYPE=  INDEPENDENT,   DEPENDENT,       DEPENDENT
##VAR_FORM=  AFFN,          ASDF,            ASDF
##VAR_DIM=   32768,         32768,           32768
##UNITS=     HZ,            ARBITRARY UNITS, ARBITRARY UNITS
##FACTOR=    0.250966925370066, 1,           1
##FIRST=     8223.43324360094, -199603,      -64867
##LAST=      0,             69546,           -255277
##MIN=       0,             -713120,         0
##MAX=       8223.43324360094, 406739481,    0
$$ Real data points
##PAGE= N=1
##DATA TABLE= (X++(R..R)), XYDATA
$$ [...]
23860 -90190 -116822 17340 -171778 -223024 -155421 -8490 -77830 113562 -240373 213149 -41461
23848 164246 -26778 123758 32855 -109281 215897 -155960 -160701 32160 183761 -287464
23837 -125413 196124 160506 -20925 -97170 -44747 89908 -124979 -55506 259504 235958 201918
23826 201918 249153 291898 26138 -41724 22179 -116863 100719 194628 -52819 -310674 -53388
23814 162710 19031 97569 42343 213739 31735 178996 173036 39535 -35128 161633 152635
23803 152635 -194658 -42075 101639 -105137 -37487 -165357 48877 12350 -22589 -288319
23793 -288319 -135367 -115690 -15736 60656 124709 112548 55844 334992 93421 112415 139018
23782 139018 -13773 -135492 469860 149628 -110109 -99200 -61325 -407758 10555 52416
23772 52416 -91485 -117677 -18482 -45576 -8739 -317389 357449 -220098 -70823 -96432 -121069
23761 -121069 19102 -47101 -103661 3139 -57026 -12879 155070 147604 121424 -47852 -195886
23750 -195886 -360835 218907 -267914 69929 -18249 188844 -135244 140913 -267375 18640
23739 -124120 -246314 13081 -99104 11674 22960 -259500 -338392 -174335 138827 -321420
23728 216757 206683 -129588 57083 218584 37301 26163 -52835 85166 -44893 119895 -142011
23716 131033 -186018 159851 20853 11195 138176 -13349 -350254 194736 40095 -259142
23705 17250 -163304 -53663 367253 -183950 -172299 -148672 -49380 -58729 -156889 161733 -49471
23693 92463 239446 106375 -33548 -220754 46260 -209662 261463 -135405 -158668 -71268
23682 108806 -38670 21163 -159618 -53912 142003 -32377 -21901 -204536 -254382 -15754 -8198
23671 -8198 -185938 -244951 428694 142665 -253997 -74838 197465 -129158 -215253 -265765 -36717
23659 255399 -130459 48167 -56358 -269537 163920 157771 -71362 155081 -327749 -304035 70204
23647 12880 -101955 10364 -118277 -188815 -47965 -283901 -30752 -109511 -512464 32798 5564
23635 -108885 -188204 345688 -462807 3786 -49691 -86987 135017 -180823 -469104 -228890
23624 261411 -84233 -156288 -174762 -4262 -200758 32747 151513 93281 8438 108642 115674
23613 115674 -195997 -84119 89588 43303 163135 -351544 186110 74849 -20625 172445
23602 -116320 -310605 74692 -222177 -245347 -160883 -105128 12593 132101 -192805 66957 101980
23591 101980 -44006 235439 226171 45811 216814 55816 103085 122682 -9770 162175 -78041
23579 -100430 -115853 311387 106436 -114899 66901 -58173 318922 32267 -86654 -31562 117285
23567 -117170 45642 -207466 46781 -287243 -126333 -31113 -23507 -124148 -26590 -166320 -191184
23556 -191184 303089 159789 -374437 145488 54973 45732 84229 -95969 -155261 -66124 -183665
23545 -183665 -185984 100800 -26373 -59217 242114 -146645 370099 -115852 -31653 -11738 161884
23533 24455 110986 330538 25223 175432 -111393 -96820 77691 -128976 39270 -33210 199168
23521 273443 -46042 38110 -27767 -101260 43954 -272098 -160321 -119630 -15032 33967 -109541
23509 -6723 -190433 309856 113876 67463 -54874 -348336 -92245 -168522 103697 249582 88025
23497 -50038 -233221 -157788 -33788 132426 87277 27327 -129109 -64506 -1820 -225380 -48791
23485 64579 -71673 -12315 64714 -70884 102367 291788 33659 -163075 168400 -80649 -116525
23474 -116525 127006 -60446 78331 -50702 102403 -56908 -219382 -162287 242793 -118494
23463 205690 -38267 79212 -2647 182893 -82557 22598 -108031 -120496 -104551 -229237 74244
23451 -155824 39993 195909 -88594 82772 63667 216047 236471 124439 164540 409618 -262501
23439 85482 30469 167741 -250715 -103003 -217617 43515 140072 154059 -251507 -51113 66895
23427 -63473 -139 139089 400618 296563 -76195 151411 -10041 -442952 135671 163210 28435
23415 -193796 -151625 -86880 -166136 167933 -116285 -335675 216714 170460 -67805 -173534
23405 -173534 -243202 443349 -152452 160814 12685 -316962 95703 -215013 166461 -24410
23394 -367050 -140248 -140208 35450 -163264 -347387 -202751 -48456 89268 -2218 143040 -51845
23382 156940 103700 -3990 -257572 10371 14974 -43889 -32117 78111 177387 -96680 307776
23370 90163 250879 151276 -242768 -116547 -27236 -64154 191765 60990 327148 -136091
23359 105227 -122539 -113427 56374 68676 -211039 -75127 -71298 87903 126852 177140 -203041
23347 -93285 -10492 115703 -53752 -146810 -557489 -203977 -70754 -121998 388098 -251493 69381
23335 175596 -232412 105990 -36381 -122531 -324497 -65093 -127260 -45778 -217 -241322 -280693
23324 -280693 -383656 49604 -298413 -246998 -113698 -260055 -256094 -22399 1122 -149841 90095
23312 -242964 34816 -50888 155871 84389 -67025 144281 -259704 -223713 104206 -264045
23301 -81916 -103413 4373 -87479 123112 -103283 156600 172888 8578 45004 -360564 140971
23289 -6480 -94631 -161215 -230333 89823 -228341 -144252 205512 90798 24173 -57617 -53332 -14303
23276 -40908 200178 -231074 -49278 -19459 118457 -71434 170365 -380065 36926 83741 190908
23265 190908 -197054 -16090 97243 -81611 -332839 -321900 -342728 -271170 146514 91565 -59177
23253 -225497 150886 -113638 28116 199609 246642 -7505 -269324 369041 -139540 174533
23242 316088 -25392 -54192 -187843 14900 -32466 148969 -229302 17155 -213553 -88996 -67609
23231 -67609 105594 -122126 93024 167198 477848 157480 187386 -217858 253375 -116223
23220 171447 95408 27889 -96678 -64095 16113 154859 -195323 -128285 -134872 -71650 -157003
23209 -157003 -67482 -27611 -128494 -288323 -42800 356434 149854 254333 246780 -50242 155103
23197 -30702 83656 84986 -169486 -144221 33559 145869 -45283 -226542 273986 -18651 -64623
23186 -64623 -137029 -95793 -69159 11169 -18658 -21679 -225623 58335 -101570 -267753 236232
23174 -114697 39376 -312002 -137284 199287 -198041 191466 -187075 148959 373885 -67579
23163 -82727 49186 26325 -124078 380310 27277 167764 -229062 -77788 -296392 -108837
23152 -4590 -125830 412265 -55165 60120 182179 -8557 -159148 82960 45765 -86127 -7388
23140 -50751 -16738 -121348 -67134 -78754 -4374 66160 241628 -40414 24431 -76218 80179
23128 13943 100365 -209714 104084 -216809 215440 -205594 104519 125666 -39160 -13627
23117 -163048 248013 60638 -132305 -22180 90390 77524 -95958 162225 355556 -155996
23106 66856 -121334 -531122 -24734 79817 114889 146698 -47976 -119274 -141590 21038 -3488
23094 136163 -257803 274491 -7058 -54811 194311 -372618 174997 204895 -16956 90461 151082
23083 151082 98545 158448 203918 -275790 -149619 -53797 77312 -190149 -16316 51619 -87257
23071 -235652 122960 -151096 -104057 125471 337495 -94702 133605 -77174 -15400 41305
23060 -228774 -106809 94036 240345 -601 -98357 10340 -379997 129368 142660 -171948 43705
23048 -57283 -241292 65735 368861 184139 -167714 157020 170849 280010 -115232 97234
23037 209444 -268242 -40935 98626 18892 8247 -409152 -99771 74457 164828 13309 -90107
23025 -171574 -209191 -36551 -6291 343131 -37601 -91677 -108284 68110 56048 -265060 -411742
23014 -411742 79009 61237 -254780 -33605 173536 -56634 -66960 35288 7518 -109308 151219
23002 -51513 -62949 77312 -336083 -81360 107275 -294561 214015 104200 74728 57753 -129165
22990 -205227 197885 -444180 -191795 -251535 127345 -144727 -127044 -192715 -229601 -344978
22980 -344978 -233410 -169905 -63292 -74112 35597 -260049 -171073 -166289 -355410 -77404 121360
22968 99101 95636 143443 -125781 159050 -64224 -372693 -63123 -102671 -11092 -110380 -247366
22957 -247366 -42901 -78795 -182510 -37755 -280521 -34622 -319983 -136002 -198977 -29926 -11087
22945 -91842 -100925 118670 -104255 -157212 299060 -147180 48208 4845 -90819 66580 -224020
22933 -26222 -81642 -219935 75182 -200925 -142130 -300056 128698 185262 -266408 52473 143609
22922 143609 260636 60742 295801 122642 202704 -467922 -87243 -305492 99737 42561
22911 -155415 212511 192201 93312 205465 -124544 -33680 387110 -67730 38816 -145691
22900 -32096 -86978 28097 230540 -221711 -108313 -12128 -4671 79478 -114235 -75105 -379198
22889 -379198 156964 -266787 -132192 119762 122068 95846 -58985 152683 117747 33043 311527
22878 311527 -94775 208708 -265405 84739 97812 231135 55378 -44065 -92133 103250 -191646
22866 11687 -38789 -185565 -88293 -46154 -111109 -161592 283594 -55594 -38537 195959 472134
22855 472134 110923 -101735 25726 -67784 -15049 -65095 -45012 16378 49888 -151617 107966
22843 -158884 221988 -79866 32945 355330 -238447 -129491 -158534 -47960 198923 233045
22833 233045 -226901 176081 -88238 98708 47394 -46520 -265242 206757 67652 -5458 -148124
22822 -148124 -80844 393010 -134931 -166241 110760 151167 -101032 -171113 98353 -82041 1335
22810 -164444 87831 79195 95336 140537 -77609 -235569 -125308 157115 36377 113482 175922
22799 175922 100847 405559 -198232 60110 210892 -145390 -173241 -346568 -200358 -124961
22789 -124961 149199 74301 -54391 -61037 -59532 130817 14815 -41731 -264469 -102467 -468729
22778 -468729 -39577 191606 213284 200434 275051 -140957 -27543 -316241 24753 -47311 -1289
22766 101148 7624 33414 99423 -455746 -11366 -32739 -181119 -394873 -126381 27364 -115489
22754 -102233 181927 26204 -72606 22925 300452 21124 -33908 196365 228557 -228319 282724
22742 34395 422542 187189 -27113 85074 -325281 -192531 9225 181573 -248107 148168
22731 32899 -160104 22010 5566 -212552 -3768 -54635 -109106 -33004 71542 121399 57329 -102122
22718 -168729 233959 287773 -373777 48025 -45164 343003 175468 -222407 -101870 -180769
22708 -180769 184342 -67260 95915 -131832 -141510 -88980 -6810 -52959 188990 -35810 208913
22696 -464183 89216 -167621 -78484 157568 -150256 28528 61522 -23559 -125591 -131243 1502
22684 -6095 183443 64225 -231439 -29114 89039 122180 -5246 8849 -49053 347666 -163030
22672 -62719 -77599 -10548 -219417 153591 -220768 -178351 256950 55703 -76612 -217296 -178895
22661 -178895 54956 48252 -79167 37453 54748 -141092 -218485 131480 74803 -30534 90394
22649 16586 -329412 -105877 117560 -315288 -259007 35773 -96466 100738 -315755 132597
22638 -408768 -100831 -222403 34033 -115307 -85845 216257 -274177 91485 -407036 -113224
22627 73611 -210668 228245 -277347 -180874 163446 265413 -133207 -4856 -51862 -10638 -229760
22616 -229760 -104538 282451 228723 -66826 -157429 240324 -317984 -112681 -61830 -15288
22605 -105993 -51456 51675 54331 -75501 64631 295023 108271 -209063 63463 -6097 149199
22593 -225996 -280858 -107330 -39133 -129986 145821 96343 67509 210115 -42087 -161658 -138011
22582 -138011 -151176 196874 78405 47982 78261 -175756 10489 275 57663 163032 -192488
22570 159753 235393 -282663 -72110 31286 -13361 6945 -77159 186863 142431 -426372 -96199
22558 -81961 196499 -317250 34669 -101612 -10410 -382970 144058 -204898 -356813 -294139
22548 -294139 -52804 -110596 162588 115056 -4725 -5088 60655 146459 29928 167034 -71861 -113248
22536 -113248 -23867 303819 299354 4643 49386 189355 113263 -114499 -139814 157868 -48914
22524 63530 -54286 113722 60826 -38907 -61744 287049 94297 -49027 32995 -298934 281218
22512 -121358 -10666 17689 -400281 102109 -6555 -153104 115650 244315 153497 40874 130016
22501 130016 -357469 131564 140839 3380 -216419 -65575 -146672 -119773 48091 -18215 -229948
22490 -229948 142390 -103513 -295677 -85365 -251670 -9237 -384111 9988 -184444 -128876 -87832
22479 -87832 -124966 -46239 183634 20929 -122270 -21719 -94383 -207978 -11325 48505 283164
22468 283164 286297 108949 -89420 23202 -113611 158086 -147997 -445813 39724 -327481
22457 -58799 -204683 159243 256311 130215 74165 -302627 -177751 47601 -173026 -472428
22447 -472428 56363 -30727 -48429 -29205 -261092 -22814 225977 -8676 -184315 -27558 79875
22435 -401118 -248657 -374626 70018 21714 -149820 -252239 96231 -124904 102718 -72899
22424 158477 -51792 2048 11547 130640 -23354 -173121 9176 89548 -4202 38474 136046 171854
22412 171854 -3888 102530 180133 33593 -132462 -45554 -123774 -193649 -102467 90765 113771
22401 113771 65233 -269180 -150344 -64261 28001 -111560 60880 -310836 65329 -33436 -51568
22390 -51568 -79750 -141421 -40380 -8474 -271594 97728 -88236 -2728 -64069 37110 -132272 257410
22377 27093 6369 121685 182946 49571 11460 -6774 -69491 -406754 -224326 241483 227734
22366 227734 -142453 126560 35848 -75701 244379 300144 -196595 94017 -48121 95890 67437
22355 67437 123721 -134822 21832 -157734 -24571 73972 48737 81202 93259 324437 -28235
22343 -313003 169084 59163 -127391 -307476 -120678 204514 -23883 -39903 202032 -45561
22332 -4506 -246926 -48425 44576 -1720 -465793 97662 -150266 168536 -56747 -62192 -203090
22321 -203090 -147023 325154 230614 -212143 375522 38711 486376 8851 -407017 -223668
22311 -223668 10386 189743 -227650 237813 15308 32473 -261382 269616 94404 -434500
22300 93232 -186806 -100071 16409 -80478 316800 246216 -88742 -88216 258220 19602 290397
22289 290397 155083 -100060 -120915 -24705 -284898 20943 -43105 157507 -100297 -149097
22279 -149097 30398 224956 -187791 -95713 -138536 4623 5427 -65151 45484 89427 178650 -194811
22266 -82687 70476 -274771 -42169 -187494 43013 4747 -54374 -68318 -231395 176860 -90069
22254 -75781 28955 -126155 35055 108777 25771 -139162 48532 -79635 43061 -364523 -82213
22242 -328588 -37630 228215 -125760 150544 195730 -247007 -216172 -181061 -231128 -20314 -168998
22231 -168998 73431 50373 -96727 56566 -77958 -217625 -108044 -123929 121902 164558 182434
22220 182434 -333893 -6901 -97545 -213608 -275548 -184340 56032 21838 -304326 -180143 -208674
22209 -208674 252367 42942 88386 -39936 -155727 70219 -172045 -8359 -164203 -34377 -50543
22198 -50543 -195133 -173015 -163344 -101346 118851 -5805 -171550 -317816 212957 -77162 107
22186 15136 -388589 173755 -187655 -106691 3049 84828 -247563 -133274 230923 8454 251638
22175 251638 -232793 210183 46419 79257 -51005 152792 -229959 -191390 -82413 96236 37039
22163 70207 -111642 -137784 -2473 130076 -209179 -144798 -783 -89095 -64121 -281070 -165380
22152 -165380 235684 -121383 -296719 -145273 -181182 137050 95562 -22700 -158546 23667
22141 -182474 -126987 -274352 -88157 -343248 318867 49075 -155251 -63830 1247 220690 -144446
22129 -75162 -273867 46689 52012 -276953 147740 1263 -60700 -155196 281494 110491 -199068
22117 -3045 229760 -258963 37461 -77467 -112874 -135789 -44492 195476 -87653 -85677 -125405
22106 -125405 146410 -70881 46739 -391603 175254 -115812 -193643 -259998 -123373 -205752
22096 -205752 200750 64004 -381132 -97180 -13097 -271041 14841 2354 -110642 -115085 -206358
22085 -206358 22855 -205130 20630 166193 51359 -43258 -78955 -400636 -321876 -61302 -216132
22074 -216132 -33222 347476 -84299 113213 -43008 -315012 63201 -727 -90230 171767 -1126
22062 310272 167644 159974 -2843 -64634 59484 -109806 302885 84308 232167 -321499 -544524
22051 -544524 -295266 234741 -115846 206427 -246068 -293769 -19090 19187 191269 -149715
22040 -91380 14390 29646 211095 -108304 138925 -1119 54904 -3815 189841 -411873 51512
22028 -436875 28256 -32266 -417456 -17559 38012 246319 88089 112092 113350 122921 -6523 -69454
22016 -69454 -312259 -77109 -14863 -57637 93500 -201112 268949 -46351 104693 231848 -27529
22004 -70891 83675 -27049 -26997 -197217 -176506 -157221 -227112 -15415 -171107 -208972 158213 -497303
21991 20443 3820 29695 -112375 142883 -213631 -329938 -90661 -176090 -204306 64655 -68000
21979 112044 252011 157699 43872 152167 87082 23101 -501882 -304323 73516 68434 159094
21968 159094 -176880 -337604 -9987 -371743 76177 -41207 151930 -72706 -294172 17863 -285506
21956 213179 10124 -265 174081 55649 -23001 -397545 -136723 -98573 96345 -144870 11323
21944 -29017 -143543 14714 -340726 286084 -152843 -177861 -157423 209816 -15632 -225897
21934 -225897 -127818 -33259 -363 58794 -167602 237654 -60138 -141001 29501 107359 136617
21923 136617 -319985 -208154 55762 -109483 -304974 -119981 -192369 -58835 -201331 -23770
21912 130427 -109318 -347474 115933 -146306 60078 -12728 -156303 16209 165740 225427
21902 225427 223334 -139996 173733 -83497 -203566 -127967 171426 -275430 164786 -4562 -190084
21891 -190084 79487 -68034 223709 -3959 -150448 -80589 23108 -124478 295116 -159389 3139
21879 -116479 47301 -16605 -141720 219398 -23752 -57921 -248571 68509 -83137 13404 83506
21868 83506 -60569 70004 46637 -59993 -48 -468886 -237157 -13274 -321243 188921 -311442
21856 297786 49052 92706 -2550 -118087 -96104 39867 22642 -117323 119685 -149430 -32325
21844 -31063 -503590 109038 -74971 -10695 213689 -89999 -188837 -175735 299644 -43810 -88109
21833 -88109 -145295 -395297 23705 -62551 44843 87195 -329847 -134325 -237092 -13331 258378
21821 -91069 8250 -500813 -246168 -502436 -106224 -231161 11977 -117105 -1680 -159490 -372277
21810 -372277 -18622 -256294 318499 -345388 -194081 228771 67807 92990 -136201 -419331
21800 -419331 -173983 -2753 -8857 -32908 -406850 193019 57881 -173133 -44688 205792 -220917
21788 -10039 -145635 -58458 -332151 -383834 149993 168250 -35627 -320879 -5872 -94265 -99654
21777 -99654 30040 -123923 -118893 234907 -49254 58212 -253264 -110762 68793 -265989 -38414
21765 -19297 -10483 -227107 -225279 -110391 -29050 -48057 -215054 -117398 -106465 69124 195966
21754 195966 127018 -1402 -47217 361849 86631 -178228 -151199 -45381 -35096 8080 79607
21743 79607 211961 -13492 226557 -137089 -218388 90939 -11265 143960 -153452 125451
21732 119344 207821 -91899 68704 -241870 -39338 -98683 -192771 102109 -202046 -163151 143902
21720 -216991 -136969 -155348 -53161 180556 91003 8875 -150044 -65565 24181 -104748 30109
21708 119203 -230116 229982 -38875 -66941 76228 -191982 -406341 -166120 154371 82164
21698 82164 -175600 -67067 -111709 32008 66367 -177511 -437851 169337 -234047 -6996 224200
21686 14254 -62340 -258053 -3227 271022 -107442 103272 84882 51817 -169802 -62360 -130154
21675 -130154 -87569 -111150 -91226 242011 29467 78691 -96113 -195802 242766 -8301 -124254
21664 -124254 -209247 390274 26273 -114212 135982 -404166 -76592 -13913 242308 183819
21654 183819 -81017 -126750 101360 -195107 46857 51566 161557 -144470 -180218 37658 112045
21643 112045 -433328 128898 46525 -31503 -40238 -29467 -278063 -79527 -63458 -395972 -162186
21631 -144982 33550 316038 -5230 8112 132935 -265326 -254423 60805 -138359 -184973 -231443
21620 -231443 54453 -69598 -243670 191900 236168 -253445 -91418 221180 -366869 -277121
21610 -277121 156248 -138963 55582 -18380 -107084 12611 12367 170443 57989 120139 -25499
21598 99867 -194718 -2246 -146586 -302872 61072 -446089 206743 109777 96573 -94793 -234644
21587 -234644 -125030 -302220 139363 29321 -142528 16407 -127257 7086 -142871 38994
21576 8849 238413 45474 67841 129013 -122763 -70593 83503 47112 -151900 -46391 232991
21564 111331 58382 206934 -132097 -129193 9133 223748 -121905 -47914 -219866 -126430 11829
21552 -18542 -48666 -223870 -103304 -224179 369594 -61238 -205862 -301822 -219668 61813 299548
21541 299548 281571 -174487 55276 114536 154894 -36518 431515 -6 -83699 -89184 -288324 142905
21528 -117732 -29092 -157972 205314 -199214 -1910 93610 -22108 -122407 -6179 -24407 -80444
21517 -80444 -47147 -186168 126477 -61173 310033 324245 -483031 -59404 141275 153353 -160902
21505 14844 170043 141194 58441 -48747 -207128 22008 -127479 34853 83122 -272517 25787
21493 -30857 -298620 54683 -61910 -34079 168263 -243285 267572 43700 333127 -406488
21482 -112627 96434 57966 -12820 -154051 -397164 -143869 -153760 122859 -3128 -67128 468410
21470 185191 148299 250388 31669 -18231 -141231 79305 -97402 -307320 -591070 23812 106848
21459 106848 -64240 -242008 52831 -100317 145672 -366480 97 97081 -242578 -230042 -181532
21448 -181532 83031 -224612 15312 41216 -51549 -94439 287818 348770 46217 15498 -76385
21436 231419 219250 338940 -105810 33644 355377 25817 -135737 -337019 159309 -56668
21425 -167181 -169704 -233052 24824 -85725 154225 69653 -89943 115346 -105652 -454897 -249993
21414 -249993 42605 83758 -318872 -103930 -105035 -20356 3260 -161199 -104779 -207907 -233515
21403 -233515 252231 -38932 -25514 -48528 150257 -86360 38290 -176601 99416 13651 -204826
21391 -107582 166898 42858 -26216 -105428 -53223 194511 -132447 -196183 59525 -75392 -34542
21379 158984 91358 -11097 150858 -295496 -11998 -43992 -135468 119095 -25910 -254273 -402756
21368 -402756 -412865 -62133 -52269 -228960 81054 126234 148659 1548 163002 -242451 -307355
21357 -307355 14792 88588 -106764 -314263 136354 2828 -63001 -8996 -86784 -89284 -522116
21346 -522116 59047 54609 176884 60124 -152926 279413 -167900 187629 128317 91290 33800
21334 36851 88807 -192069 98664 -141363 -93298 140969 -50250 -358183 78575 154438 35823
21322 71459 -296085 30228 148679 309894 -54780 -9281 96091 45676 -101601 6714 291062
21311 291062 -133702 210339 14001 -144728 -288015 -75938 -44111 77828 144492 232515 -248208
21299 -26867 -125954 246259 86272 -81621 -102294 -155315 18889 216602 -13330 183894 -46470
21287 -327515 33644 44534 -113446 -14177 11090 85806 -120831 9945 -46546 -198521 -207351
21276 -207351 -223100 -18049 -8219 -115385 148703 32124 -2199 -22675 -321154 117728 -39931
21264 63237 13113 -105937 -16145 -135149 -142023 -48918 63800 255900 -87264 -172483 -128198
21253 -128198 7936 72022 -190964 -196268 -302653 -191 -95254 -253782 -196664 171619 35886
21241 101084 220494 123029 -185567 -255365 49181 -39619 64731 79291 -62224 -9058 113065
21229 124018 14303 59002 -319400 -89870 -26343 161515 -135149 22355 77956 -339441 -52700
21217 -94647 -5382 -80620 -19260 163407 -261459 47158 49144 25717 42900 -394741 -80505
21205 19372 24091 -235698 -121545 59445 -177999 -19135 -94402 -234112 -143931 -59142 -80118
21194 -80118 -59550 -8588 51634 -88988 -125759 25613 -106670 81827 -110287 -174746 -75593
21182 -285554 320014 -71129 -313185 -157163 18738 -414055 72340 -162616 -180850 105103
21171 120303 -325659 -87687 381653 269843 -74981 39977 174901 -34558 -68600 100883
21160 -47995 100613 -151540 -127860 -350967 -266605 -349121 -136556 -17843 77576 -28593 212248
21148 378231 -75343 -308334 -317626 -4526 -82504 49901 21773 -8763 21800 241208 -4486 -125179
21136 -125179 -77520 -32995 -16705 107955 -104475 -281358 74674 -113917 -239884 -39258
21125 -203237 -284470 -33967 7609 -255746 -193822 79049 -75880 -303098 28525 129404 240
21113 -99876 -166278 153716 145038 -113905 216378 -304268 212025 303153 51552 95018 31170
21101 229489 7897 -257104 95525 -28042 -158346 -51686 94920 82383 16674 -299063 42570
21089 -115986 163352 -182584 -123136 326772 -44215 405328 85957 -79442 -125684 -177584 -177546
21078 -177546 -62560 24460 -52082 163944 5182 -99783 -434472 -178359 -205161 -140203 32863
21066 21341 -112902 -97439 -127776 -154751 244921 158679 -209266 81028 -134513 227587 8774
21054 -519967 86847 93541 -246016 -209728 86268 61903 -76358 -314484 211530 -259309 117634
21042 72963 -86483 -212389 -82543 18608 -295130 -10606 182854 -3896 -143611 -253210 346643
21030 -80562 180089 -140429 -224455 -71769 -32681 -143352 34728 -275915 -82919 -84101 -235586
21019 -235586 -204429 96402 -95092 71202 106162 -93061 -181317 -173379 122635 -82858 -79928 -240360
21007 -240360 -37487 24912 -168550 -57755 -158388 -247198 -8616 -310893 38724 -98054 -67573
20996 -67573 -159456 235449 -434956 -111910 -293384 57166 -130661 209235 200852 31635 -206100
20984 -370895 -309197 -185544 -90973 -175018 -11993 -234491 114162 55876 116142 -4171 -56836
20973 -56836 45462 -148710 -271976 -69485 -101707 -202558 -108260 92436 -51392 -80133 -5260
20961 -49275 -242935 39034 147510 173210 -194265 338548 32245 281914 136764 -51391
20950 -526829 -83108 25612 -117447 100997 -327633 158211 191361 167597 272119 14725
20939 333862 -118796 -40236 -331244 111836 -240326 -410156 -229902 -23986 -244248 -144052
20929 -144052 53793 257460 -154430 377289 -27297 167296 11073 -279755 -16937 -3210 -268352
20918 -268352 87136 -106953 -139999 221307 -115990 -246117 88498 214127 195730 129605
20908 129605 -232731 -64330 -210288 177044 -168645 -126338 -9479 -267214 -424762 -158145
20897 -11656 -205370 -140180 -168360 114871 195285 -141064 -223134 284642 -46265 32093 83042
20886 83042 -176546 -46526 50859 84239 254231 182418 -35164 28648 78352 -117148 147983
20874 64488 219281 -292197 -42608 246644 26506 -102908 33025 197579 -267623 97289
20863 12790 -20628 -114406 -91765 112506 36796 -39035 185551 -131646 163073 -193862 -50862
20851 -259250 23112 137786 -228543 217391 89288 248059 334722 254237 -92277 -35050 -106340
20840 -106340 -243299 34615 -149733 -140035 -136863 -56928 -189852 -38708 -280672 150312 -65290
20828 -23805 145361 -92563 -84480 -30613 -119569 -101753 -25534 -197204 178974 -159993 -112520
20817 -112520 -160844 -121878 147172 -144978 -81989 289628 -55808 98187 -57517 -122896 59827
20805 -82855 -138032 -126558 -130102 -20666 6388 -50207 -256136 -223912 -122569 -188094 -45619 -49871
20793 -49871 -103767 30586 39777 -243546 -232823 229764 27267 -435928 195268 134199 -40771
20781 62933 -434607 -82773 195162 22243 105586 -522065 195620 66682 -187415 89440 -78051
20769 -170840 -102816 129393 -16150 -244657 -268494 116933 8507 -495497 115438 -79870 72188
20757 -31547 -283091 -96631 -212219 25090 -289897 -44200 -4285 168710 -218036 179946 -220125
20745 -52072 185085 -191287 287211 -161030 -158877 -68934 -132307 -245306 130100 128316 180107
20734 180107 123306 -264648 -61996 94329 -333046 116152 -88046 -94662 -398112 9082 252172
20723 252172 -164202 12829 44975 -10784 -22176 66724 -108239 267003 210153 -223945 84561
20711 -170008 -458367 -151304 -4749 78596 -97657 160792 378 -97491 -99143 -140462 -414531
20700 -414531 -25020 -145358 18054 436149 -142419 -207852 -175632 -124073 -73286 -187121 -33162
20688 -44024 -126210 -100473 -115679 1956 -78577 -175767 -259240 172179 -120317 135399 -233246
20676 -123374 50004 -406787 -24498 -255835 -197885 134150 -32916 -132290 -275215 2991 -155825
20664 4756 -184809 -225073 -342084 -73302 4325 301455 54074 -35116 -204516 43709 -257430
20652 -227134 -47799 -16402 -132793 46233 -145090 65659 206934 -428599 11176 -39332 210223
20640 -10519 106564 132763 -84903 -54170 192856 49179 61932 -64818 -319898 68855 160566
20629 160566 158211 9586 135381 -83281 78774 50779 145769 -165653 19063 -136214 33992
20617 15596 -114413 28558 -140524 -243906 38935 -128040 -419226 -118988 -209400 -295019
20607 -295019 98387 -37001 -35429 128881 -232367 -161946 97354 -211969 179550 67415 11717
20595 -130029 228759 -334412 -79368 40904 -40132 108674 -40144 -323468 -115838 -38509
20584 63276 -74201 -3752 262966 -153647 231224 16292 -121073 81592 -126863 -70735 264798
20572 125009 202431 -122858 38561 68600 188011 4031 -118703 -47765 -81217 -17065 -31361
20561 -31361 116251 -143555 -280162 -116290 -26260 117154 -84801 364057 134881 248028
20551 248028 -263331 -216889 -11167 180742 -129017 -92019 -210253 267887 304906 -20727
20540 -322675 -258387 -224223 -137169 -197325 41160 -29554 -127167 97868 -275869 -335869 76098
20528 -331298 -8447 -13031 -24195 195316 -13779 -154173 -302914 -59527 -277939 10068 117073
20517 117073 -205330 278016 -84852 -7575 -260935 -81921 -55822 -198285 -75741 6874 12385
20506 12385 233414 -86516 -16299 53209 107427 -22413 57372 140589 -365775 -4692 -103123
20495 -103123 -98129 186250 -243053 -180341 -251107 -212804 186879 -38424 40364 -238614 -45230
20483 66773 -330845 129780 -6341 14171 130970 219118 -166202 77128 -13823 -20425 22934
20471 -40592 -252164 221389 -37795 -141231 133724 -207095 -51360 -203757 45714 74677
20461 74677 50725 -4535 -239113 -146495 -76775 254569 -217923 -24951 123794 29472 -152486
20449 19037 -54958 -338997 -9220 -42631 -84266 49163 -122658 284420 294850 -224295 -891
20437 -203656 -213101 -14076 206529 -63353 -134281 84129 -169145 -85294 90319 -194167 234661
20425 -150126 48955 -170414 -337564 54430 -17384 -34134 157933 -23706 276474 -16764 166118
20413 73681 55583 63784 171656 23201 36993 76723 191742 -143204 -155944 -102880 -68386
20402 -68386 -199057 224347 100907 7039 -31551 195683 -46165 83025 -254178 -113964 263831
20390 135911 -163765 -66220 -175700 278695 45620 -56472 -165133 46451 -153981 -263929
20380 -263929 -131086 224481 -233308 -192086 -38422 -206282 -170161 -312969 141462 -104191
20369 12037 -239646 -216510 26766 -253434 23604 -599 123728 -56549 46040 94945 -446869
20357 67608 45179 115253 73347 -130152 -119583 -216931 -237985 -116706 87629 -23842 83641
20345 -357043 -229382 31385 -159881 492392 -174800 178470 17105 -276993 -22426 -110864
20335 -110864 80282 76135 -373292 -81679 51787 -27496 -1387 -61626 -72460 -447992 -212894
20323 -7854 -27635 -159093 736 -117141 108060 -264771 -35602 -140307 23930 3639 -80552
20311 69597 95567 103732 274660 87905 -126058 -156907 -81720 -109245 213292 10265 -112891
20299 -213058 -201337 -221429 101882 60328 -78066 -104422 -124866 153164 -182686 -117688 -71136
20288 -71136 -82408 -238191 -3859 -104909 -278095 84131 -440183 50236 -139659 85658 -188000
20276 69049 -128108 17478 111858 -121071 -74951 -190826 33869 167788 -87540 199456 -53835
20264 -236947 -209443 -171806 -128571 -480388 97532 30150 238919 98626 -1932 -52991 2953
20252 -128380 -309357 240408 -298216 232541 -113539 -248442 -104721 202609 -52712 -135597
20242 -135597 107985 123578 164743 -177266 232518 -49375 -302235 -118146 287374 -340615
20231 -24623 -175350 181601 -154704 94708 -280119 437145 -279689 25015 -179787 -78436
20220 -480540 -99511 227772 166976 -64764 26211 -89253 -147903 -11123 130876 -253097 256538
20208 -113076 -474672 -351045 -70494 -227976 -104477 -221847 126089 -118840 209520 -2811
20197 50918 27712 84232 -78375 -48754 -411958 -139772 47498 -54384 -150172 71014 23154
20185 315946 5440 -31121 304409 -54498 -77998 192118 -31862 -346997 -129553 139914 -187747
20173 41625 9123 -100667 107886 -255283 -67993 -306728 -231850 71173 39716 50198 -203166
20161 -231908 -33429 77265 -44573 -320770 -3252 -311737 182741 84969 43899 -282746 -26313
20149 -142766 8609 -189146 28763 163295 35742 64001 97890 33855 197349 113859 156691
20138 156691 -75846 -26402 -293788 280265 -225039 -34295 170264 -384230 -215249 -35530
20127 154626 -22314 17868 -321174 13756 128647 81419 -63824 -14728 -73957 303732 -21715
20115 130311 27789 -264415 161040 -109636 -1803 -95775 -44235 99956 -122447 16639 9453
20104 9453 -177368 -47524 -161563 -355710 35560 47065 -29298 98001 -378860 52448 -94714
20092 70348 -11683 -168398 73864 -93981 -161953 -142900 -34843 227326 -141436 -15218 -216272
20081 -216272 -94271 -275679 50715 -81377 1995 124310 -124758 -71981 67232 198066 -120285
20069 -153826 83296 -181429 -119498 -94668 -296245 -56399 257447 -180468 153939 175375
20059 175375 11731 86048 -83480 -252580 70642 279911 351726 -216678 -146160 -402667 -248299
20048 -248299 -131372 35797 -135362 -28403 -219339 49259 278988 -149411 -211663 -17217
20037 16656 -16788 -265632 194960 -76506 98568 -47659 27974 -247214 132776 252223 102568
20025 -272770 -129933 -401634 72678 53824 162542 34059 52144 -68043 -52440 117356 -131948
20013 -4213 -28709 -23470 -157167 -45033 -85870 -80663 -15755 60162 -42235 135102 117052 9907
20000 -269209 -163967 -205818 -45318 -184677 -264149 -121247 169873 -20759 206827 23615
19989 -111263 70599 -17444 16021 177072 108665 89705 -127652 99064 -129026 -7297 82571
19977 151587 15182 53110 -42610 -313876 17160 -193930 116773 382458 110118 -34876
19966 -80346 97418 -78220 -183575 -413828 54325 -20397 -136036 -59973 -55002 -327129 -45409
19954 -114057 -270158 10197 161658 -59326 -6307 -216710 169515 -107983 -36701 193308
19943 -441609 236524 -46785 -111801 -17404 -164642 -62849 25571 -133014 -130066 63859 -113660
19931 -329710 -110922 -126651 -252031 -31133 64675 58953 -230175 -145200 115587 86382 50124
19920 50124 -70431 160820 -40317 -4070 101766 -189495 -95152 14440 -401056 -310292 -173867
19909 -173867 -70051 -330968 -38342 12308 301777 66469 161074 26524 63737 115643 -41980
19897 -60617 249301 -166046 -101732 177723 -206033 -71127 -1526 85613 -457480 -359705 123415
19885 23296 138287 43407 145393 -48778 -48100 -296412 -48823 -2838 -7739 16761 -185998 -68176
19872 -35711 -167233 191781 180905 16797 88250 122071 -158122 -69802 -9951 -147927 8598
19860 -182431 -41597 -277930 168656 57898 -18604 -196938 -27033 -199970 82355 -173375
19849 -320709 140428 37480 27097 -78821 -258273 -18196 -286509 -145470 -172903 -242361 -156204
19838 -156204 -132551 54640 -563796 -60436 -113923 -101618 -103193 91187 -132003 53045 -197745
19826 -26800 144904 -70585 -31632 -98091 -83161 -137211 -303982 -232817 -31587 -49561 215663
19814 -217442 -161394 -169321 -24399 -109712 -111897 -61089 77855 -109347 -58340 -32515 56142 -363143
19801 89666 -137586 195823 -153377 -169860 -34032 -12218 -157020 -8194 206302 157363 6886
19789 -240301 51713 -184743 -106339 -194540 91557 -55573 -287572 97197 9642 47268 34791
19778 34791 -92785 -125853 42108 113300 -365732 238036 121279 351450 -53686 -398354 205381
19766 -155562 -57735 -66275 72132 -282604 11166 71103 -1281 -314229 -20271 143959 -138371
19754 38139 -29795 -105934 188520 212947 -56046 -162503 -128172 -149523 -211590 -184938 293699
19742 -178252 140146 -219170 -84291 -75891 -184920 129179 321095 44522 79481 111372 -202892
19730 151282 107777 169534 -182349 19503 54822 -48205 -217690 -68094 -420119 246543 71575
19718 87377 -91608 -220677 -49362 -140884 -116116 37141 -232553 226651 -105406 -40705 -35022
19707 -35022 16646 212307 -252759 61437 -240199 187882 141347 209778 129211 -211689 -73067
19695 335839 -118839 -315740 -66395 67458 -122301 -100954 71006 65 -22412 -92584 -176235
19684 -176235 -19883 215645 57090 152053 50284 -292598 269361 183551 -36086 -74368 50488
19672 -301649 -177794 -126974 72380 139935 -369604 -229699 176790 -32610 -160968 226662
19661 84963 -268085 -216281 28494 -184429 -147966 -229912 -172934 -253173 91375 -113744 -187367
19650 -187367 -169315 -63024 29286 -65249 60314 -198418 -124011 163311 63807 -107105 -97992
19639 -97992 128738 4485 53670 -17810 -97246 110752 -426083 56788 131089 -31032 20748
19627 -143743 82358 -95058 212980 9813 -59274 -151759 -212330 -120318 -227431 180823 -72462
19615 59018 98275 6847 -97701 -15977 -243053 -7252 268261 -299996 -219799 -279120 7091 186602
19603 186602 61097 62895 -249105 -295973 -82920 -314135 -52741 -383732 -98350 -170863 -86918
19592 -86918 89060 -146027 -133093 56908 -216996 -280451 -121885 29050 232407 21326 9597
19580 -295162 388680 156752 -12810 -168032 312183 108563 -197952 -412806 -72083 -55928
19570 -55928 -208010 -157415 139050 165124 181012 -137111 184867 -32944 -352461 -128619
19559 100473 -186249 2695 -98421 2590 -127147 -129513 -294191 -32346 -45163 66741 241522
19548 241522 99133 -279258 83016 381145 151899 -177717 69180 -29473 -243402 -237155 246397
19536 -288590 -88185 -41044 -38013 99854 -220472 -102996 -20731 120734 -230174 -116808 -161707
19525 -161707 -285430 167529 74171 -266685 -32231 -212141 34285 -366171 282570 -15803
19514 240887 -4915 -236754 1102 -186415 284660 -332393 -627 -59609 36074 -141324 -212849
19503 -212849 172708 -10074 -84489 -220450 96255 -86053 107812 -92735 18968 -168487 -249468
19492 -249468 11225 -132803 24067 -217107 -561243 -103866 124491 154733 28391 -165064
19481 -143295 -149196 70001 -248244 -189282 18494 27113 50698 -25791 -178995 -218683 -312630
19470 -312630 49096 -141747 -110217 -366002 -280102 -204052 -92296 -72757 253621 -213799 -25151
19458 -11420 -50297 -49787 -376002 -10959 282976 65893 108619 -214834 6008 -24986 154274
19446 115884 -153150 -139649 179965 2375 143239 -23019 -328746 46418 266608 -443930
19435 428102 133641 37751 -141195 -200070 -119570 -440891 126422 -235689 -191091 80140
19424 -292816 -6640 -297305 -199856 -49266 -11240 -60255 40023 -60908 106299 -199477 122415
19412 57901 -266678 114290 60832 -151885 91030 -74146 -198310 -222609 15271 -58454 178569
19400 192633 -38377 209600 -245480 91120 -116214 -44272 205622 -15531 -269181 -8569 275284
19388 -124698 82138 -274176 -135405 135251 156128 149992 264446 -94973 -54592 53722 -204117
19376 166565 -82102 -180883 -232187 -180792 -92877 -45030 -307055 -158242 113596 -135056 -202426
19365 -202426 123731 -302869 -107224 -8115 94282 -59543 7645 -267627 79262 62805 -179367
19353 222192 -106421 27498 93571 45680 -286526 12148 -120854 -30191 140266 -289940
19342 -121945 -16279 18902 -183133 -392552 -345267 -84102 -216141 18262 129951 47781 14523
19330 -279762 6884 -110724 73983 -244342 17781 -333806 -143594 92197 -517398 16339 64710
19319 64710 -53657 -4388 -25966 69236 -178037 -193348 329882 119770 -188923 -253278 18277
19307 281487 52857 176813 -165352 -326058 -178708 -327401 -244180 -240193 378748 216080
19297 216080 -214597 -188338 -312443 -215357 -49489 30107 -233705 -329295 -128738 -103904 -183943
19286 -183943 -143329 69219 -183273 -436118 25252 -168517 -85578 -50367 108688 -214318
19275 154683 351498 -5657 -109864 30909 167095 -99156 98990 69276 -232987 -258782 126117
19263 291293 -238923 122048 -162799 55785 -91373 310771 -288061 144856 -132039 -72857
19253 -72857 168910 -5023 414298 59409 228514 -198000 -113228 -519645 -166569 115533
19242 -184848 160851 174483 -122227 -26878 -91202 -162937 -389729 -162698 190143 -41225
19231 -246074 -33124 106496 346164 11274 101049 -431758 152711 -79044 -163597 -80718 -32136
19219 12082 -24055 -401184 7900 -263895 109088 -218171 -31990 -14420 45521 -289351 228838
19207 -297719 235091 103540 58629 -270672 101008 -135354 61152 18901 -126079 -326433
19197 -326433 -451308 -356071 -97608 46944 -257365 18366 -95097 26784 -26600 -53884 -2891
19185 73334 83856 18166 200042 22147 -319170 14267 94494 -136457 -103321 146176 20229
19173 5585 208507 143080 -240444 -235948 149823 201483 -37257 18167 -133436 67226 -131693
19161 -69383 -88972 65209 -54386 145300 -14846 -172748 -82847 -179462 -195405 109625 -61161
19149 -9675 -40123 -167214 -343900 -284364 -81942 117209 -120405 -44080 -149766 -71643 -133635
19138 -133635 84610 -172086 -325703 253031 -173576 -146190 -17890 -258146 71117 5458 -21897
19126 -172653 -325415 195268 195604 -417763 129908 128804 29820 -114652 44543 -142876 -42945
19114 55169 -230304 -69924 -44657 186975 -90104 -413784 -140636 613 32134 339027 -151404
19102 -20794 -31354 56909 9904 -6623 -79177 -31735 -358981 99663 -171787 308676 -173234
19090 -157335 11106 -237922 -217546 -141663 -358726 14586 108434 -139512 196950 -18171 121365
19078 45592 212883 -164767 82623 130514 -484272 -6372 54318 131217 -78375 -69506 -29846
19066 -48554 1278 -80930 -75429 142394 -83187 -391336 181968 -270471 180089 163731 -203497
19054 -12972 16487 -99125 163978 -328006 -282887 18969 -414499 135377 71167 -225781 -160689
19043 -160689 -169787 132761 123903 -278737 43552 -178128 -231130 151797 -57493 -156333 -103524
19032 -103524 106150 145906 -169166 -114738 155732 99542 137090 349329 134192 58100
19021 -136338 -108329 -202741 -112418 -55576 -181917 96085 -10883 116789 -36182 -12343 -396924
19010 -396924 -87834 -212503 161364 79237 -86634 32247 128502 -198232 -28763 -53599 3548
18998 109099 -86290 105925 16474 359077 -98210 14520 155493 -53201 -22602 -376690 82595
18986 -48048 44375 -106277 -39823 24363 -378947 -345249 -205592 171068 -329323 -352531 81290
18974 -14073 41596 -374884 -257025 -261784 93233 -95321 -201158 -13435 -277619 -201999 -104895
18963 -104895 58232 311006 68779 75551 -354722 116567 -81590 -141165 -58910 -148336 -47248
18951 -105353 -218796 -20437 237825 -392588 -131485 70977 -9604 87008 -382691 84021 -58164
18939 -115105 -151997 72995 55782 239761 -109295 -8584 -395860 278033 -3098 -138374 -72367
18928 -72367 -14363 -71427 -206521 -120406 -186263 -15750 -124300 -272635 315139 243708 -124410
18916 -183192 3015 181224 10324 -249594 -361093 79507 -2830 -68583 204952 204709 -79698
18904 -111024 254859 -289602 -207820 -132989 203476 220985 152690 -67260 179094 -161503
18893 112594 128136 -122111 337193 -34912 126665 -59190 -78675 101229 82309 -116920
18882 286002 -157282 210170 -172254 121940 -26042 136257 262285 198743 -14596 29287
18871 122497 4513 19829 375928 -49268 41640 -210124 -17312 82204 -118683 -463689 -193812
18859 161502 -86745 -100094 -28687 -125302 -200303 228508 -223443 256236 125674 -10743 86167
18847 20231 -107121 239291 18870 188538 -189847 -336061 -199861 117838 -8814 62771
18836 -56894 -182611 87232 -125478 99360 -106528 -41555 -47806 -271920 -135837 -97980 -39425
18824 -147699 -34949 -162834 274167 -218126 -97968 -15504 124345 -118817 207487 -64215
18813 -250124 -72223 136498 138520 204437 -28590 361726 29968 85684 87510 191610 66543
18801 -69519 80357 -51059 138479 -223298 97695 139791 -204877 -367095 -51510 -41747 -186481
18790 -186481 109207 -202078 -311874 -48299 27592 -101697 29405 210526 -22851 -164190
18780 -164190 99343 -55535 156357 -9785 -23175 -119562 -399022 20435 18972 -35504 -159031
18769 -159031 -104854 -316880 -242410 76114 37062 127384 64494 164542 -476260 142246 110492
18758 110492 84257 213429 171220 367477 -62180 439 -171281 -213773 12830 102503 -48121
18746 43876 -207797 -18880 -161501 -147285 -506650 -20653 42811 -188738 -213796 -87166 -116365
18735 -116365 -184883 36248 306266 88232 212801 279712 49733 -27590 171830 36263 -127764
18723 -138108 -265819 -177597 243953 -61375 57834 -120433 174651 40925 -38782 -162088
18713 -162088 -25281 -61726 80472 4539 -111233 -143261 -58958 -339945 20944 136093 7842
18701 -121064 152397 121454 -47735 -231233 -107767 -216747 72429 -29444 -107521 -230894
18691 -230894 134931 -21700 80413 1109 -129853 228764 68045 278395 48863 36183 89443
18680 89443 -1482 179510 99593 -349400 -159792 -55357 66375 -53924 110704 -198966 -4059
18668 -293832 184695 30866 62738 -101693 -262876 -140958 -24001 -54300 -17115 -343917
18658 -343917 61952 8632 110080 277750 -89758 185953 -204559 -135460 -149707 -124773 17494
18646 19192 185649 -296688 -250185 -308620 207064 -50436 -194717 -208392 -63595 -214204 -70866
18634 -324557 -151802 -170528 -279150 36212 64354 7986 25781 24525 -169031 -206037 -239753
18623 -239753 78715 -194718 519619 -163031 -83193 -54599 18250 -74816 193658 100541 47057
18611 -16853 -205546 -91209 -108470 -75088 -1482 -243650 -168271 99516 -29067 -44298 -9101 -92442
18599 -92442 85945 60906 78917 117651 -306039 -277959 66697 177396 -192402 -261754 237262
18587 -169978 52163 224555 -282056 109128 273384 22702 -51997 -178688 -14196 336265
18576 -186971 -294112 -103942 86885 -98886 32847 -285835 -123828 7231 157251 -73181 42784
18564 -58559 -50795 188899 -242468 -92910 -7564 75855 -6337 -240823 195742 171378 -172195
18552 141040 -40152 -67847 53954 -102848 -249413 -355535 -477773 176292 94797 28813
18541 37926 -337631 -4725 -475592 24909 -305238 126749 -40951 171466 25899 41852 -238572
18529 -129095 -164140 381904 -171123 78800 -41326 -8303 -114313 -24158 -213413 44920 236397
18518 236397 -92113 -175172 271381 -26909 134215 361682 -249360 46948 -282215 62750
18507 -128723 -60556 -55535 -34593 -139460 -76436 -63437 -47328 247163 83715 116563 -70123
18495 129171 -121284 -99068 91265 -36086 -181538 -194257 -62872 -64105 44249 -89626 -103484
18484 -103484 31216 36016 -264404 -373059 -44886 72441 -91172 -76494 -22245 278594 -180147
18472 149402 36213 245220 -145919 144438 1523 -325746 -3490 -59243 -91112 -36131 -70696
18461 -70696 -148072 81126 -15009 -209809 -176424 38700 -270040 -194458 -5327 45350 64266
18450 64266 103992 -99478 -80088 206945 -185415 -102980 -108576 2728 -33446 32672 349051
18439 349051 94568 42447 -234758 173999 -245897 -56822 80566 29528 -235321 -418429
18429 -418429 -45805 75061 -236438 185258 59390 -26464 173094 107425 40335 252239 159667
18418 159667 -15332 -66659 69872 92937 -132176 -154047 -329594 149701 290612 -386352
18407 -31709 33956 169037 -165527 -131853 218515 -47521 -163559 -14749 19883 -211413 187135
18395 -147449 -45488 49251 10455 -31608 -46662 79279 -20141 -377594 93333 -100693 -153202
18384 -153202 -26945 161543 -181502 316737 82772 21481 -180362 -182644 79195 21772 184610
18373 184610 66170 -63534 -63261 -301550 19545 172596 104637 14026 -62001 235221 17885
18361 -164501 -288911 157514 -271344 206935 81893 -274814 -179302 62863 -241953 48384
18350 -20151 -178818 294551 -73369 145360 -22120 150534 21042 -206287 -402366 13851
18339 105505 -166693 -101072 -33505 37423 -352518 -68924 118379 29100 -141458 107245
18328 272886 -166273 298649 -92554 -61921 80148 -290369 -46659 -72324 -241562 56606 -51624
18316 -84755 -92832 43961 -134788 468716 -36573 27448 -87967 -74930 -241844 129998 -41481
18304 68740 117656 183287 96750 23526 -274688 -235811 -130962 -118264 -23620 177716 -119498
18292 -131566 -99307 -125729 -303084 -301009 -591090 -147623 -28631 -272478 -41914 -162882 -160302
18281 -160302 -14239 -17862 -217184 281782 -173202 -183896 -402334 -80600 -59165 106429 185063
18270 185063 -137529 -78506 250862 3223 -120840 119098 -59981 -318425 163952 -214708
18259 268327 87807 339595 84381 -305820 -81400 46099 -322981 -36792 7644 58519 -179636
18247 -157518 -46291 -287821 45363 293858 161187 201591 -114757 93519 -293744 118016
18236 -400838 -30583 63598 -101262 239642 -34689 151105 -128107 51499 69928 160846 -163192
18224 -129170 -222379 -262852 -195705 147655 -155673 204337 -157194 -162968 -5492 -88003 141299
18212 -46209 -38613 52539 371401 149899 -72349 238542 4632 -112813 -326411 -79403 -103625
18201 -103625 200192 -165308 -145005 41758 -138851 -28432 -192705 122537 200435 -242613
18190 160671 129145 -196728 138453 -47307 -89568 11836 152230 -31683 -94521 -140963 -94939
18179 -94939 73061 25689 18870 -301730 -74574 354602 -447952 159381 88270 101139 109066
18168 109066 -282005 -212172 -138305 -112110 -86092 -196659 29705 -100468 -85275 -135894 -61905
18156 35708 -79907 12541 167251 233639 47809 -85445 -406508 -356607 -155738 -216554 66905
18144 24447 50498 80033 3036 -78091 -542499 -78084 10933 208482 -146155 115485 318072
18133 318072 58283 -50026 -114788 386572 156338 71858 -82601 2153 24474 -64811 -182116
18122 -182116 -66151 -180439 -476620 -111041 81763 6981 -342403 -12379 144500 36451 -182365
18110 16574 11372 19113 176040 -210143 -147358 -112726 24788 -71841 207434 31755 116410
18099 116410 -42088 -118100 -144082 166388 140896 59118 -23371 100758 -7921 -41836 -1011
18087 -17991 -161417 -233318 -173235 -367357 71929 138571 -60657 -29322 138405 149984 112661
18076 112661 -220990 -33113 -215777 -113188 -27856 156858 -74478 -90300 326471 293764
18066 293764 -164624 56522 -57563 169265 -142698 81755 -195333 -212282 -214856 34078 389286
18055 389286 -293557 -337513 51405 103354 -78478 23841 239396 -225004 -78799 53864 -42389
18043 -162396 66772 9045 -282219 -101754 -17582 -210078 32422 49973 -28920 78833 81787
18032 81787 -65073 -6482 -18874 47599 -26677 373754 71489 -40716 153872 24615 -70900
18020 144007 -100056 -66129 195464 -104194 61448 -157452 73092 179443 39952 203515
18010 203515 52418 -232717 212863 52539 145303 19817 252598 -82090 -40463 15738 -169755
17998 -109081 -17316 -107683 -118006 -17389 239664 -23819 -304107 -48885 -86566 -124621 -290732
17987 -290732 33784 -138741 192590 229171 -127853 -100436 -145090 213822 447278 72952
17976 139884 135172 102917 423710 -149060 8519 -295726 -20516 172805 71224 92108 91714
17965 91714 248624 228075 -232786 75367 -196607 -66763 -250729 -233394 111594 -83757 -33970
17953 44619 87033 -171470 21280 -116494 -108789 -303982 -18802 105793 -156074 -270335 17362
17941 215572 -254295 38615 -115041 62408 -36203 -220860 -176679 76775 -341591 114107
17930 402844 38068 122833 -87165 -191100 16578 46387 376142 -140841 -86370 215723 186296
17919 186296 59650 66408 -93254 18109 -210757 146647 131958 134100 -95570 171055 -174761
17907 -222814 -60096 -1871 -157260 -212592 -19115 -110591 268620 -75740 144979 -199431 75758
17895 37884 -11926 2136 101859 -15872 281469 43813 273928 5822 39328 -380305 -66863
17883 -252978 -40754 -3850 -65869 -46786 -36672 299966 -416402 162542 -87156 243829 -13983
17871 64025 -102852 163365 -67371 119623 -125837 -96769 1355 -113807 -127963 -79701 -158819
17860 -158819 177655 -22129 -76836 43632 -190132 77303 -57428 -57427 -240190 7525 63109 162661
17848 162661 -36658 143253 -192597 -18155 148494 -11837 164093 329756 60777 51514 -4136
17836 11020 147897 -166537 -270824 59706 -160063 173843 -116281 -453455 -98349 310548
17825 163277 107805 -129351 82120 73968 83978 126007 29700 226018 -19526 11780 -107282
17813 -125033 -29565 -116180 -32726 -114944 176661 4737 -137926 26354 111178 27669 243922
17802 243922 40558 186144 -82556 68485 65341 285700 7305 44399 151057 214039 -23226
17790 66738 71553 -129243 -11597 -46505 -134550 -130648 64838 22572 -167037 -43111 -196151
17779 -196151 -29276 -42451 243000 277585 -220654 -27493 173038 -52800 159891 132663 -79956
17767 -18837 -79637 -147394 -19026 83715 137309 183614 141837 -170962 278644 193306 195321
17756 195321 169490 69609 -114324 -145336 -69194 121823 -36041 -338944 -402621 128001 183623
17745 183623 30036 210361 152095 -239773 188487 163174 60762 74559 -323330 -55381 125085
17733 -189890 -48793 -76578 -207978 -58347 -146690 -205722 257415 -36279 -26537 -29908 266520
17721 138374 211987 -159087 -327429 50974 48685 107694 -87782 51238 131630 -167912 -315028
17710 -315028 -198355 178423 -146196 48411 -66949 -252802 -444104 120034 32291 101671
17700 101671 139242 24451 24923 -198022 -101658 123406 257471 -267664 83103 30970 69362
17689 69362 -12443 -164413 452227 123529 -65053 310311 -218273 204238 -125257 38412
17678 -25307 197403 -175869 86742 -114906 102396 -230065 -38840 -60307 204572 319117
17668 319117 4260 -176451 37213 111464 -40453 -230840 -304060 91036 -145978 43905 111620
17657 111620 17608 310045 -54759 -51915 -123414 51394 338732 195876 -172188 -107431 268143
17645 -102653 -47640 -137184 199262 -22001 56983 2367 98863 18179 -293746 -200933 -11131
17633 47659 168753 -105252 186728 105907 313658 -184916 214493 -13163 90682 -131915
17622 -31057 -3718 79156 63609 -29953 -8037 -140759 21860 -210450 270495 -198965 -65864
17610 90095 167526 56995 130501 -9049 270720 -307833 -64043 179040 293966 89049 -51075
17598 61507 -872 248063 155200 -3246 100291 94065 -46332 189974 73234 -200186 121328
17586 185099 -183130 -195432 206749 -442764 -111695 22654 286811 93104 -78143 105906
17575 180541 -183606 84724 226104 59431 63730 -151329 -27779 263618 60579 76452 120237
17564 120237 62590 -83594 209130 45610 -54158 342645 -153469 317 12510 6080 -96833
17552 10880 244103 152629 303455 -64445 111460 214099 52713 -4991 -130235 201240 4158
17540 199364 71821 60954 440721 -15482 -45569 126316 -43361 188505 509584 313457
17530 313457 59549 -249599 -91120 -105705 464405 -33871 116102 -99762 163400 309488
17520 309488 -112368 -27339 30649 110451 142977 -26540 95098 133874 99735 203605 -14681
17508 -246093 -80336 -149726 57550 -127100 593055 239500 78444 22597 401888 97736 65945
17497 65945 163223 263535 73324 8489 103872 223190 -30754 19532 191950 60371 311354
17486 311354 176689 364540 186720 28533 457382 47543 406627 271853 -216573 356795
17475 -178639 27456 66058 52021 75577 149230 -157254 171682 -122622 277168 241744 321273
17464 321273 258087 -165908 256013 163617 -92536 -50757 25577 -83438 119672 153087 -77018
17452 131566 247223 -92353 418815 299545 114608 267906 399881 262411 322978 115497
17441 41935 300153 111664 30777 209411 245200 17840 220936 76052 243501 45815 301688
17430 301688 -94056 229802 -121368 121062 305543 273235 417819 262400 438443 -149651
17419 313820 222227 511894 61818 116576 459641 197033 -130047 273430 324666 -53188
17408 72648 202674 308141 316165 -72402 221102 210415 249497 -12429 97845 75124 49218
17397 49218 459694 205633 170094 180756 542559 -136355 289362 26076 -123791 -96598
17387 -96598 361977 12035 -26143 276624 105279 -176997 267647 345968 212260 223828
17377 223828 269246 464034 -181978 97191 -133859 325711 269488 -111248 367951 -21792
17366 -57171 -100614 116951 7264 83376 -33259 133966 -43697 389630 75640 57100 241230
17355 241230 -148921 178096 252812 135421 79280 -83346 102893 32829 284950 81620
17344 -65268 286074 280000 -239665 136382 298619 386386 204578 271885 262350 232458 -318563
17332 38872 -314281 27502 281186 157567 195763 -146397 -130538 216576 86302 111773 65619
17321 65619 -348877 279600 150870 371266 -18929 382480 241125 175748 -4305 45588 33961
17310 33961 413318 236328 400415 236916 217501 172651 -25538 410810 208556 250585
17300 250585 406113 570 -300 -60107 123891 374867 233181 371772 203528 382504 -23905
17288 -255656 221005 48502 82397 126340 -120032 224966 63861 311841 199830 -128475
17277 546451 142249 18719 -38457 -57464 192952 39405 627714 7298 87529 62334 299226
17266 299226 375689 160255 66007 124384 90994 357835 222591 116211 211619 -188454
17255 -13084 123953 407382 61074 426359 153147 223266 315454 -161176 596337 59738
17244 92448 -64231 193552 -157360 201370 412748 -170691 49769 122067 218271 100798
17233 182983 21605 320182 180685 339529 139595 51660 162358 123079 217967 524572
17223 524572 189669 175045 313009 185735 280981 344993 271261 104579 219945 88180
17212 406408 234994 256233 151271 4705 263564 146078 -39054 282484 76251 147738 261355
17201 261355 205868 244528 254540 178311 158372 450586 410216 428228 536380 -24747 223903
17189 156142 116193 472089 87966 300019 255286 91910 33969 10152 295286 231719 202847
17178 202847 263507 572491 369136 240996 391992 337538 113912 247140 198132 212784
17168 212784 130377 117217 251061 212380 239485 192355 331619 188312 373960 366034 186708
17157 186708 50628 -161429 417233 565616 266544 204630 232432 184960 320503 199782
17147 199782 253683 174567 229723 463545 482382 496346 207396 182663 341051 257485 552209
17136 552209 207052 180372 276374 533084 724145 161159 580880 254668 360402 501808
17126 501808 511823 537758 425927 291483 -50262 332562 301423 474769 346602 422089
17116 422089 190806 234126 650418 553549 266755 285665 144309 328890 135484 -69077
17105 366066 428535 549229 88178 517338 514858 294808 99716 394273 141206 39917 279722
17094 279722 236511 507521 495805 409116 223134 265839 122134 492154 537538 390274
17084 390274 345403 601419 604297 508364 317319 648267 240615 157388 68308 293126 572715
17073 572715 502318 415586 310016 363470 408455 434437 295695 434015 434839 385840 336000
17062 336000 458611 425111 601921 419929 659202 602664 300180 594696 353170 342469
17052 342469 477672 406618 520477 403173 592041 329842 299095 542323 317770 405997
17042 405997 217542 227960 314650 463435 246154 527635 493509 536802 452865 353271 790917
17031 790917 572593 277713 452842 556381 488720 370357 389402 610702 622857 341615
17021 341615 590017 714892 674473 629379 726888 570777 816603 964524 477023 732179
17011 732179 498763 730063 341694 573135 668466 585218 725667 768420 708617 485147
17001 485147 753255 758626 725332 989163 661007 465780 1015882 874371 806132 702208
16991 702208 556058 665054 818888 1037259 763340 748474 589192 607424 826406 1068193
16981 1068193 916239 848708 651702 797563 845364 654320 640224 1064502 716792 745721
16971 745721 981866 696861 1001817 613018 824881 1002688 820995 857512 966791 880491
16961 880491 924358 977235 834995 1117222 800238 815861 592260 1080388 592587 810804
16951 810804 914984 1020711 1038932 980194 1085977 930962 851668 1245256 779348 797790
16941 797790 1034795 1171526 1148431 1010746 1226374 1184270 833341 1295724 1211284 1097215
16931 1097215 1119344 1217042 960677 995691 1413061 1288992 1149958 1191998 1612946 1661659
16921 1661659 1387252 1254331 1192291 1663967 1788898 1075899 1643620 1616693 1375544 1396653
16911 1396653 1079595 1401159 1650630 1138577 1560817 1369380 1274494 1264410 1740864 1618791
16901 1618791 1360808 1657413 1766724 1251881 1479114 1879782 1738289 1664345 1616393 2003647
16891 2003647 1762486 1813946 1946097 1863532 1896599 1616566 1995748 1787371 1797644 1653685
16881 1653685 1803169 2165719 1928658 1862473 2234571 2139909 2103438 1856897 1934359 1738471
16871 1738471 2098539 2208362 2227612 2348611 2170074 2024451 2325046 2255516 2748648 2601065
16861 2601065 2396656 2560246 2490651 2237028 2924410 2456635 2966426 2904842 2853120 3128313
16851 3128313 2757323 2967776 2669074 2885315 3237045 3340346 3300175 2828760 3111198 2968952
16841 2968952 3284174 3315823 3535431 3567964 3903782 3865753 3526733 3751681 3964307 3689081
16831 3689081 3605947 3949515 4422765 4126277 4275038 4350706 4522021 4821608 4616759 4774330
16821 4774330 4909660 5009912 5104784 5090016 5465384 5397483 5059812 5595280 5640979 5654769
16811 5654769 5909285 5921013 5851240 5992596 6144968 6221686 6534913 6701149 6759829 6864554
16801 6864554 7226807 7583463 7382164 7523211 8018365 7916254 7960644 8422542 8783291 9266134
16791 9266134 9282258 9697464 9518903 10044483 10248767 10691582 11028253 11112390 11477170 12011472
16781 12011472 12253807 12459826 13126404 13537082 14007535 14071611 14370278 15441565 15757067
16772 15757067 16447817 17258309 17769685 18053473 18653109 19404938 20431633 21081400 21849068
16763 21849068 22945605 23533178 24560922 25783709 26804210 27889623 29426766 30797303
16755 30797303 32116999 33577423 35258324 36971704 38547071 40849872 42776309 45380493
16747 45380493 47797494 50507646 53168456 55928941 59570415 62613433 66213085 70187891
16739 70187891 74767847 78808884 83635936 88869882 94133603 99904424 105741911 111866803
16731 111866803 118509844 124978348 131389900 137863884 143833468 149622154 155143862 160004202
16723 160004202 163874801 167201514 168996557 169854397 169862064 168164393 166103814 162352416
16715 162352416 157982605 153001942 147303902 140954903 134436184 127349189 120838984 114233284
16707 114233284 107511674 101402598 95111782 89470417 84210874 78865059 74263633 69682438
16699 69682438 65340677 61699922 58055233 54654584 51352139 49046472 45858209 43750096
16691 43750096 41682615 39160735 37240460 35294022 33310300 31822879 30601336 28931587
16683 28931587 27976015 26154362 25076407 24105199 23330151 21966532 21216454 20372114 19522414
16674 19522414 18667107 18038947 17279365 16285333 15985681 15169125 15181057 14359719 14137715
16665 14137715 13243000 12794925 12224576 11707097 11412889 11484141 10807785 10585223 10011354
16656 10011354 9709866 9981448 9494106 9073730 8870968 8564921 8211928 8258081 7852889
16647 7852889 7866694 7475162 7151397 7140556 6502888 6761264 6547117 6250880 6476250 6229272
16637 6229272 5841160 5585033 5612913 5372392 5354404 5024081 4814010 4874712 4868048 5208426
16627 5208426 4500140 4636626 4506467 4481754 4248076 4319261 4006807 4233170 3924075 3594160
16617 3594160 3350933 3749573 3609311 3543470 3698272 3489240 3632376 3496428 3474294 3569956
16607 3569956 3118161 2991385 3067166 2863028 2999663 2825636 2752340 2672204 2661770 2602041
16597 2602041 2860452 2470230 2160433 2515102 2291532 2018351 2407259 2082383 2451888
16588 2451888 2153970 2279412 2042082 2064513 1954239 1981046 1921359 1979098 1946252 1751456
16578 1751456 2145217 1953714 1727652 1758612 1744313 1840980 1778163 1860001 1788885 1387545
16568 1387545 1269260 1744470 1381993 1111141 1427776 1576191 1539722 1589269 1487603 1319385
16558 1319385 1558074 1464449 1452100 1184816 1393785 1334314 927432 1212410 1038850 1201724
16548 1201724 1294793 1109428 1458057 1290129 1154914 1038891 953095 838334 1187352 1118615
16538 1118615 1285078 1061281 1060098 1044710 767003 993197 1122564 1014380 1128519 1224729
16528 1224729 1016259 886214 649701 847588 1196720 766467 944703 1081247 784536
16519 784536 860614 1094937 1022613 734547 783734 910118 672235 614530 536114 526275 794110
16508 794110 613939 567047 921352 728719 856752 736069 522644 772636 491918 749894
16498 749894 627936 316534 541462 728168 999297 604088 786760 1094181 937779 320775
16487 721541 671912 564715 539581 556547 677250 295485 580545 400937 597645 770036
16477 770036 795406 589831 759932 560347 237092 551861 275163 659075 590415 413055
16467 413055 518794 425376 284579 720240 587221 473356 644587 380647 447616 488242
16457 488242 614177 457152 320618 287224 570060 464175 348946 136461 568072 422621
16447 422621 276079 400725 610978 280430 597034 457176 557706 517553 97053 514879
16437 514879 120287 638130 319590 279096 263234 510055 197192 261053 554799 143280
16426 482195 360214 464975 591338 301336 356867 243695 528747 126542 224151 147811
16416 147811 461045 257072 52799 386972 153543 307960 167636 368651 242611 639795
16406 639795 339790 474832 335885 517137 238257 525946 590329 60608 105297 31487
16395 19520 352942 321877 251159 475074 209765 285226 232192 177162 -113163 171881 255454
16384 255454 117927 288876 -93807 -9705 340746 122354 -212133 235803 415573 86341
16373 192323 222211 112458 220140 182924 78019 4061 31655 -89237 310397 176237 43287
16361 447601 -63240 176702 -17059 93616 303291 460158 402996 149950 147679 100556 -145886
16349 435582 96086 233991 278318 -23125 80754 45433 175535 158994 105387 191569 312985
16338 312985 -30968 464778 294052 -64842 124979 33957 206682 457588 94439 299494
16328 299494 35151 158679 92821 432549 -46204 484302 90223 166163 33525 -58913 261780
16316 151763 -137594 387008 169671 30119 182561 38284 189294 223062 59787 -7276 75215
16304 286889 -90749 -159043 -88132 286803 23154 395712 -300282 465654 -143895 -117339
16294 -117339 55537 329235 -2339 -61008 149654 -28834 -139921 102397 222913 -51720 248557
16282 226754 205455 386139 -68654 38482 -93571 62379 -39443 -68447 483213 156668 -91398
16270 401424 -94950 237976 307563 189167 -7479 174481 131377 240541 240711 -161793 -47063
16258 -138203 -15230 -35255 154987 375679 -89114 169037 -44062 -98829 -40220 163668 33878
16246 -89087 125067 69887 -63037 177095 68694 168112 -25863 103627 -179258 139318 -84713
16234 119450 -83996 -50419 -138081 9923 313082 34552 128092 -239658 -1926 -103032 -93267
16223 -93267 -53928 52335 -77322 194067 602920 -2971 -32643 -329203 42149 -312320 -50206
16211 -199194 439371 7432 113852 -31869 88626 -11337 -89206 10303 146493 14288 45849
16200 45849 160508 -101199 209527 209714 55940 -340848 -122020 324275 368544 86511 122603
16189 122603 121911 20654 129763 -29339 -3343 184906 -156088 83830 -43307 -200263 -128268
16178 -128268 -19014 130648 -126039 -50753 14134 -222144 103278 -129897 24837 118428
16168 118428 98116 72068 73371 -35676 -164066 -128363 -425170 -14799 -282985 -19227 30138
16156 -113586 -142618 218365 -29572 54976 -82513 129599 -309806 119022 382522 28410
16145 -193859 -143079 -1664 34674 71339 145206 -196833 -74586 -7791 21711 -178255 -114636
16134 -114636 68280 16722 -146809 114560 34255 -416793 164701 111563 87684 -371375
16123 -3414 -146816 -148737 -394962 58356 -360359 -171177 52788 -129050 104335 273701 150148
16112 150148 39326 27665 195803 -203983 52933 -10087 -78991 -19482 43317 114767 115846
16101 115846 180462 143799 -74751 -170876 40710 -1612 58909 -175038 -33590 -86793 -138176
16090 -138176 -262256 -65706 -292079 25563 -232053 -52139 -127717 -277100 -70578 -126136 -30381
16078 -3807 150899 146487 197782 31085 61881 -304867 229994 189474 -326717 -106821 -224332
16067 -224332 82972 -165398 149917 -457994 80636 250377 46390 -342433 -39580 -243717
16057 -243717 142230 232308 165568 -5350 59728 25002 -22801 -75308 -215667 150190 67348
16045 91317 9515 14507 -220146 -239418 -152512 -154032 -159957 -342433 -308804 136506 -344376 -154828
16032 -60198 110693 -262407 122903 -110379 -329301 227983 -34783 -225942 -43945 113885
16021 163923 -24107 69125 170262 146061 166927 247658 -108783 202157 -255249 25219 -67458
16009 -169307 -240966 193062 48254 163402 165476 228935 -109404 188456 216880 89581 178878
15998 178878 -165212 38112 -2764 -347800 21287 -160381 151495 -110915 258898 71121
15987 204820 248139 244922 482655 -203950 293291 140208 203462 -152046 54015 -41181 4211
15975 462369 201714 -9289 153595 -128110 -153949 7135 -384929 145994 162091 -195216 -280683
15964 -280683 -50297 -82311 242029 10321 -284752 -95470 -227613 -377792 -27983 -302613
15954 -302613 -6744 38744 46470 73412 176961 177119 -212009 -280873 91222 180555 276903 133584
15941 28910 -151559 -156960 192275 87976 -302482 134255 170460 -9247 155395 -52362 61413
15929 -12626 176781 -135336 -109013 -139190 -138258 -362562 -135556 -366263 -260732 49916 -105301
15917 106306 129465 -335762 27716 -8101 10782 -222830 46471 52151 -194549 291325 -304254
15905 -98595 -74531 4370 241824 288856 58198 281541 75670 -157801 -77482 -185862 -256321
15894 -256321 71705 146696 25172 -52184 -190657 -39194 94595 68343 84635 534403 -147291
15882 1228 -123774 41243 -162839 285669 -199544 17850 52420 26121 -167497 -115835 195883
15870 44690 -51430 -9710 304616 115543 -217151 24500 75183 -245512 -42049 827 -65237
15858 20139 150032 73145 -170225 -394528 110114 50344 174277 -101028 -145433 340040
15847 71616 66842 16589 115037 200259 245039 206204 -206456 -205984 68969 90512 -233576 -289803
15835 -289803 -251189 -280656 -105305 -273567 -269018 22667 -50811 -55901 62520 187987 -115065
15823 -95970 -162994 6937 182929 -81746 201853 -265693 -46789 -141429 -55091 234190 46037
15811 123674 -21405 -250500 -130479 32134 -49650 -30955 -564687 -405794 -143071 -200970
15801 -200970 -195291 80601 -1688 22334 17375 -159214 163522 36928 -23924 309718 113603
15789 -260853 -1547 -177679 -45195 -143971 -137256 80061 -272641 285409 199613 -87039 -328948
15778 -328948 -7398 -126484 -47243 16261 140580 -172495 6369 -105880 -87628 27808 420430
15767 420430 -425169 -78727 130686 1532 -40059 -189328 -22710 306585 -94610 -345695 -101552
15755 127708 37153 134704 -61034 116614 -164611 9820 16137 156964 -130828 -167676 -222043
15744 -222043 44488 88338 185261 -24779 165826 35 -317810 -274143 -171406 20711 49908
15733 49908 11307 -116416 -171590 75262 80841 273569 169157 94696 164794 78204 399704
15722 399704 25315 -137925 42616 54456 -127428 7410 -58831 -315619 168041 24062 -152045
15710 279489 24806 175274 -86805 101513 -117449 -67514 -57175 -177944 74903 -445820
15699 -181802 -201527 352655 172126 -199772 318514 150697 -44606 -122085 -223079 63052
15688 206565 -112720 -134650 547838 -30437 265848 19269 -24501 -464525 6945 103704 -112064
15676 330446 87608 17797 -139814 195622 193223 74668 216867 18065 -61821 -98203 -250163
15665 -250163 27620 -48630 32616 158449 -54069 -92341 245333 -261958 -157182 136395
15654 -125361 -235295 -219194 103562 -70983 -437451 116794 -19910 -97789 57056 8073 -63873
15642 -94383 -162459 -154796 117295 147813 -102217 -115806 171427 190688 -40162 -12148 -128720
15631 -128720 -123819 -200955 38244 451084 -24838 83863 -95809 119907 176287 -268305 34850
15619 129411 225270 51731 21690 -37519 117785 37502 214803 136511 -17764 -104868 -54658
15608 -54658 24029 -93733 -6804 -281537 184320 -30301 254457 222558 60986 70710 -33000
15596 -173726 -71674 -31100 39141 -106050 87959 -127640 119032 104397 31362 -88254 188746
15584 203185 -144935 184804 183714 -17773 -118970 -6926 129365 -46668 199310 172999 -54590
15572 321039 31133 -76915 280 -215116 -44486 100341 145106 -14258 -4412 -266981 -8692 -480823
15560 -480823 137655 275516 229473 -209295 -122125 -120254 -79104 -68464 16425 -56200 -77863
15549 -77863 -390902 278174 190873 103300 -117410 -45360 83892 132044 -297390 186716 204971
15538 204971 -122000 -85444 354537 -48146 -5915 259345 184782 55475 25488 -38571 -31051
15527 -31051 -165296 162862 -309898 250417 -30421 -83579 62991 1661 116000 63651 102864
15516 102864 124288 -209100 -48536 113854 -113022 -461574 -93168 -54074 317283 253630
15506 253630 178464 139315 -55548 -412371 190515 -367495 269108 -430878 73396 -38322
15495 134778 -186457 45529 14065 17528 -23189 -63024 -57851 -192865 331417 -128284 -430679
15484 -430679 -347566 99074 -142334 -6385 180217 157627 -151894 92229 107982 4443 -339030
15472 -60412 74662 -892 -88823 -226726 324128 167642 -46309 103846 -9870 -127721 130190
15460 -5411 -58743 15162 58603 293297 110989 -9337 -4576 -351592 108955 -283736 142798
15448 95269 -181065 40797 -286530 177197 149377 211383 98186 -208246 -192138 -104814 13262
15436 -354160 346683 13152 -98955 36011 -103608 -28205 123579 -92027 180917 31746 199232
15425 199232 -10013 43467 77161 88582 -121174 174255 -297583 -167396 -193028 -240462 274920
15413 -159202 178476 147696 -86121 -147520 301809 214484 71600 -249509 138863 146330 27368
15401 -206769 -79311 162382 -290398 366394 1958 -95534 91319 197855 351029 359277 -62777
15389 -218976 324133 -86884 334834 -165568 -65961 206776 316513 49451 242819 37452
15378 40452 32389 149612 -9050 101049 -223173 373531 40720 14865 -369891 251172 -32101
15366 34970 60824 4507 182014 13884 -423460 -70897 -75554 -50572 138976 354268 50154
15354 -43898 -253148 -218467 316286 -30766 -92831 -35764 110191 -13121 -230 -62228 -170862
15343 -170862 -328008 -211526 174906 82872 -75982 -21248 -108902 187984 156455 -35798 -4732
15331 69736 -53599 -31768 -196607 -163170 95793 104868 -335029 201276 56686 220302 -20122
15319 39921 -172768 -191099 -17565 35559 82541 -201114 -385989 -25468 -256529 -199796 320362
15307 41384 191252 -235999 30875 58996 -79112 33699 164713 228470 22568 18969 133083
15296 133083 32416 -491521 177843 -155043 36561 174664 -207649 -242061 -37930 -179242
15286 -179242 -144126 154898 -205807 72987 -76509 -236548 -21003 154841 185826 -51806 142527
15274 -1937 -135994 -111690 67382 -155078 -16458 132938 36952 -102404 -213886 -177723 -219089
15263 -219089 -167201 149709 354192 -133494 309604 -75233 16541 304758 376524 271450
15253 271450 -39881 23207 129238 56730 684427 767986 733295 789710 847349 660182 360485
15242 360485 -58922 453897 187172 30554 45587 336055 167982 341967 223766 54631
15231 149627 117720 -184374 1138 -13715 220681 -140062 -134421 68418 166378 265368 315850
15220 315850 19567 -114774 49595 -58706 138979 -235541 164957 255863 -196045 163891
15209 -176014 239205 161132 99941 -43809 60564 72466 296384 52697 6646 74223 27229
15197 259056 -56462 95548 141101 317553 177019 -6877 -181101 37928 49495 217244 63979
15185 -16394 -40084 -162320 262659 308685 39757 421136 219570 -57416 269331 107418
15174 99045 -75022 -231787 -40716 -111244 86320 208403 -165902 273475 264228 18949 153935
15163 153935 -163618 119604 220439 91959 56202 -104653 144187 285935 88277 99974
15153 99974 157847 -41625 14839 129407 548128 248277 52132 -170006 104335 -9339 132766
15141 302832 -13742 -3506 41536 8415 -182061 138399 96987 -74155 68195 -78462 -156903
15130 -156903 -104374 -183823 46755 323888 316702 -26670 168450 57035 248719 209931 103929
15118 -67839 197144 120555 277012 154500 88690 220393 160762 74098 15867 193872 -173182
15106 117287 117486 165213 63228 240893 64385 -32606 323865 89951 -107949 61480 262391
15095 262391 56763 234581 488503 194048 75804 -237892 151103 191851 -135982 31329
15084 -71911 3589 205650 159772 192307 80582 47173 67098 -145791 57685 318574 41678
15072 288124 140606 321822 230817 373346 320976 141045 -93874 178691 82736 -157189
15061 142360 156004 384673 54437 44948 56619 332463 -100062 -119928 175786 -108609 -66961
15050 -66961 -43530 125991 -85353 64726 221208 127994 -8320 413428 539057 317610 220523
15039 220523 -400306 388952 308469 -87981 -200807 224114 185706 330912 237939 226948
15029 226948 315991 461592 114639 -41327 -100913 328477 117564 12880 210393 180338
15019 180338 121583 235812 124219 179789 86755 16739 215675 201660 70806 262299 267249
15008 267249 69755 21925 -31844 270347 285861 38195 410572 -127658 474387 38687 592799
14997 592799 112990 34020 264882 58585 84041 233491 107168 179610 269000 143525
14987 143525 93868 352375 237982 88358 -41726 278367 8274 135233 236134 297345 230083
14976 230083 35105 432084 52427 382988 292419 211907 385501 383528 384090 274958 -66540
14964 620859 -40975 338468 260158 429720 259184 313084 603220 268561 299539 463239
14954 463239 426620 261009 -14972 205186 446318 -30545 473003 124209 132073 318221
14944 318221 266748 365280 68066 371678 228400 313255 6831 198279 191044 29528 230253
14933 230253 374123 288981 151812 177944 64576 189036 197744 148579 431606 226819 160466
14922 160466 419937 323799 144465 183381 443918 598405 272064 203168 348747 55780
14911 322569 682890 372303 264895 540340 397603 205582 71013 300876 332820 75431
14900 72741 -42641 648533 199937 218344 263849 -42972 417652 389925 125121 356241 184680
14889 184680 314929 -34454 -38981 146630 451328 312967 172821 428646 63960 76856
14879 76856 544410 498269 162220 4433 388495 403724 64003 100760 300129 261907 501497
14868 501497 529528 362227 528476 362862 341669 281010 334842 114387 640491 460339
14858 460339 -53124 286118 229978 185985 454882 351732 296337 511377 481357 318424
14848 318424 391862 413767 608929 270946 328176 420047 385155 351689 251704 433060 454892
14837 454892 141945 324367 465450 239223 429393 126040 745638 427617 512484 362890
14827 362890 82732 648783 399464 348798 680515 299742 255509 433057 272100 280809
14817 280809 586134 84819 565494 557960 293539 364413 377026 505175 367317 365309 463434
14806 463434 818250 580987 515339 443863 601304 271709 643251 451105 377009 344224
14796 344224 405749 506631 524011 593291 394781 430169 721263 520900 640249 399984
14786 399984 307544 721309 428443 508843 418083 625643 627789 469317 648489 302066
14775 465725 529078 671531 602130 623744 682096 765989 627595 345518 321424 353181 551253
14764 551253 505930 814109 350610 838046 416396 678742 616383 164608 504963 665154
14754 665154 604851 580535 554793 632725 392143 721593 447773 669928 910746 350287
14743 566887 567710 634710 760290 653099 243447 486583 798368 460852 576812 297894
14733 297894 689471 702365 729599 759475 420073 674307 741590 828637 855000 702188 164515
14721 584438 559779 740601 576371 369437 735229 380032 663064 749196 786895 612427
14711 612427 634459 701972 568396 605166 856704 365542 941785 506971 786204 958757
14701 958757 661920 1031485 619087 842427 628571 803983 413661 1144157 883306 779604
14691 779604 959702 852030 1076642 703903 615791 817681 762247 1062454 860425 799558
14681 799558 921897 613127 782131 893439 866697 952435 1057974 838831 910422 901433
14671 901433 995889 817374 822461 873377 811509 1059170 1014118 735896 883526 821045 1088497
14660 1088497 939241 930161 776727 1172695 892414 1004532 971981 704325 1287744 1070004
14650 1070004 1261522 741167 922850 1131021 1075726 1168699 1130714 1135567 1094767 1126052 1157952
14639 1157952 950302 1410559 1198410 740496 1051880 968761 933791 1386117 1081178 1565992
14629 1565992 1066829 758308 1304949 1093075 1355870 1002256 1014586 1311998 1497981 1103988
14619 1103988 1116963 1141811 1352734 1247937 1431444 1219908 1102470 1005401 1581160 1604626
14609 1604626 1480633 1171286 1435209 1368001 1582033 1666356 1643894 1366041 1437967 1686668
14599 1686668 1385232 1404291 1351162 1573511 1735661 1864675 1300935 1602200 1773035 1704106
14589 1704106 1607524 1494513 1488689 1699781 1408680 1515334 2062432 1596993 1841524 1816072
14579 1816072 1830271 1711468 2132580 1767876 1788355 1892475 1696191 1855757 2124861 2183563
14569 2183563 2035687 2087732 2135301 2718651 1904332 2011644 2041052 2138127 2220848 2253983
14559 2253983 2488711 2314821 2641646 2792289 2905139 3238920 3511603 3791252 3960036
14550 3960036 5127739 7363199 11739179 19878448 35848873 38486036 17382895 7819963
14541 3524423 2239338 2147903 1560995 1917910 1814635 1523730 1907703 1729319 1571561
14532 1571561 1942526 1919674 2128164 2074143 1828034 1722529 2111874 1960708 1856422 2056671
14522 2056671 2538135 2153104 2107712 2086263 2058240 2251470 2029282 2073651 1805409 2048738
14512 2048738 2124739 2295541 2442465 2488949 2317539 2461605 2589298 2614301 2504235 2947735
14502 2947735 2679057 2612201 2701637 2712499 3268402 2740344 2971765 2947883 2843340 3103336
14492 3103336 3067603 2583419 3162511 2825419 2950188 2976083 3232982 3172186 3266813 3120450
14482 3120450 3449160 3222244 3244618 3497286 3318177 3626957 3417114 3677492 3608102 3771978
14472 3771978 3773240 4211015 3664672 3689012 3655074 3706879 4008922 3553789 3988130 3811140
14462 3811140 3987681 4064563 4347778 3907347 4270980 4549668 4713544 4731754 4452269 4664930
14452 4664930 4459010 4792282 4836364 5037928 4545545 5083758 5083938 4880502 5002490 5036032
14442 5036032 5393376 5559482 5071795 5258284 5485618 5466046 5597682 5398793 5345957 5792210
14432 5792210 5839809 6199623 6081098 6232810 6146879 6278552 6427568 6667516 6504645 6800043
14422 6800043 6679173 6600412 6794938 6809013 7247405 7307601 7307363 7243013 7327693 7293740 7801983
14411 7801983 7954927 7611978 8170398 8300876 8191194 8534364 8713994 8823936 8640799
14402 8640799 9219666 9001290 9330212 9595386 9700944 9977784 9947263 10050418 10099070 10284534
14392 10284534 10610526 10351332 10678321 11041876 11094140 11374534 11666360 11585797 12031330 12149210
14382 12149210 12566602 12849910 13129434 13216576 13621225 13632359 14010795 14376024 14379238 14676644
14372 14676644 14968662 15467203 15630915 16241553 16046761 16635395 17120167 17358932 17888330
14363 17888330 18030060 18915847 18649415 19041074 19736269 20295564 20641447 21064811 21513709
14354 21513709 22010753 22721786 23369095 24073062 24082098 24858437 25457231 26057252 26865642 27361721
14344 27361721 27976537 29356760 29686357 30579657 31288947 32192959 32836876 33832940 35204229
14335 35204229 36129307 37044163 38315980 39508055 40579943 41285996 43275300 44488722
14327 44488722 46135442 47863261 49161802 50710957 52756985 54307413 56564911 58364289
14319 58364289 60922134 62614836 65099765 67561398 70127523 72926190 75965786 78872601
14311 78872601 81991467 85911135 89479937 93309613 97152763 101902743 106327406 111337713
14303 111337713 116171030 121890662 127568593 133624635 140459628 147338855 154632586 162253555
14295 162253555 170437001 179490281 188770427 198609267 208449807 219379059 230722114 242413794
14287 242413794 254410851 267158915 279958820 293109942 306387572 319963996 332676119
14280 332676119 345696874 358101660 369822960 380770784 390522178 398699865 404719879
14273 404719879 406739481 404739790 403680524 402498443 400997807 397472465 393237395 386935779
14265 386935779 377322031 365698589 353016550 339370734 325263059 311218133 296968446
14258 296968446 282776184 269045432 255639504 243060524 231463320 219677565 208373481
14251 208373481 197602648 187716036 178218595 169215834 160321006 152781482 145127355 138619417
14243 138619417 131827820 125954500 119444773 114366111 109084695 104774202 100220774 95591245
14235 95591245 91527590 87533609 84002970 80837346 77944238 74682460 71466000 68623416
14227 68623416 66204457 63474039 61473156 59214303 57064724 54902934 53175314 51401755
14219 51401755 49750617 48084795 46266089 44846096 43648948 42472792 41568125 40011603
14211 40011603 38730802 37328321 36331340 35257046 34869411 33822793 32407956 31733892
14203 31733892 30852254 29968301 29249098 28669751 27813879 27181771 26346888 25879270 24991480
14194 24991480 24650476 23756712 23134468 22705013 22091491 21528468 21091260 20495758 20144676
14185 20144676 19426511 19197634 18717809 17927405 17920042 17809722 17141751 16627833 16469615 16103538
14175 16103538 16133885 15690918 15359497 14834499 14823817 14629782 13935836 13626667 13523655 13297644
14165 13297644 13165151 12671192 12465587 12423604 12191954 11831975 11792318 11695707 11224766 11085336
14155 11085336 11111716 10882286 10470574 10431714 10109084 9942850 9960023 9840266 9552155 9465557
14145 9465557 9241732 9088297 9241786 8804569 8816680 8742236 8550668 8376590 8298140 8001553
14135 8001553 7787173 7700572 7926794 7470256 7709064 7561278 7589448 7160249 6880071 6766537
14125 6766537 7007611 6751088 6770919 6879079 6601932 6755526 6443224 6312925 6300653 6193964
14115 6193964 6101837 5843253 5787282 5861273 6030843 5758769 5664153 5708178 5583174 5117648
14105 5117648 4992756 5161071 5135735 5149425 5286373 4720324 5114003 4913503 4824840 4837359
14095 4837359 4796518 4680097 4596680 4865916 4499641 4567763 4198557 4291980 4277633 3991594
14085 3991594 4286900 4010846 3777866 3808131 3924383 3951794 4074419 3985827 4182506 3812233
14075 3812233 3925618 3859890 3623020 3751623 3708507 3452716 3627174 3533820 3337708 3658338
14065 3658338 3547431 3566655 3309236 3422548 3398447 3359754 3546155 3002941 2963135 3284249
14055 3284249 3196031 3128755 3210375 3112942 3616639 2951875 2825935 2618553 3355602 3047748
14045 3047748 2930732 2840188 2409461 2811097 2944106 2672106 2506024 2587668 2751491 2613394
14035 2613394 2283324 2782726 2783138 2402950 2689445 2577110 2630828 2438693 2554139 2719762
14025 2719762 2712681 2288410 2225061 2313397 2106437 1918066 2121612 2195187 2100308 2223230
14015 2223230 2155825 2025881 2307976 2071299 2111036 1906415 2171059 1945486 2236379 2039993
14005 2039993 2154523 2019983 1898926 1846767 1629077 1712795 1552143 1625777 1869939 1563387
13995 1563387 1676723 1802218 1581085 1790280 2039247 2211455 3300028 6883383 13466972
13986 13466972 29897159 39296252 20926036 10571169 6151968 4389873 3306827 3226430
13978 3226430 3007138 2642909 2269352 2116975 2222524 2129517 2168282 1945373 2000556 2148060
13968 2148060 1837591 1995223 1700556 1430520 2151784 1803709 1939460 2207571 1834844
13959 1834844 1676328 1514849 1563414 1642190 1854313 1708496 1463019 1622806 1825898 1733215
13949 1733215 1872359 1332054 1598904 1454825 1607622 1389813 1412361 1392887 1202267 1699787
13939 1699787 1267830 1423287 1236240 1412823 1665283 1180555 1296019 1514537 1509721 1388401
13929 1388401 1178034 1340763 1348369 1180896 1163276 1649747 1340217 1256389 1621712 1190762
13919 1190762 1770513 1279279 859354 1496997 1148134 767060 1209763 1123058 1267568 1449490
13909 1449490 1237993 1122225 1186729 887360 959902 1071211 1234916 1135035 1134329 1027895
13899 1027895 1151979 1168282 1070348 1102187 1016257 821915 1051658 961430 800101 1066907
13889 1066907 1109782 1143034 1060419 1006619 803541 1240749 1092146 679600 1033870 1058300
13879 1058300 1192656 1026620 635771 963107 1019914 1522373 1463677 694695 1127372 1062829
13869 1062829 898117 850418 885106 866131 1276963 1124270 1067685 1235754 714063 894171
13859 894171 761618 766500 884688 842714 890805 1114945 880410 1018879 707745 945798
13849 945798 988204 685773 961301 785692 594213 729823 1120549 733831 815057 725779
13839 725779 555831 620825 651292 560103 1083297 584559 714760 658396 789012 1283417
13829 1283417 573189 1076512 613230 737815 588212 874932 591973 763856 938176
13820 938176 639412 410652 625154 665640 764351 622245 891249 519374 546759 617334
13810 617334 452802 722830 864422 810194 781256 398539 651319 671268 387711 680991
13800 680991 506970 617942 673805 822933 656562 492263 813296 363647 689483 724938
13790 724938 592424 642239 174023 571981 669289 532888 92584 503074 364270 780126
13780 780126 589889 619008 595857 626703 607289 639312 669774 1047261 609761 488706 237796
13768 459245 741064 557970 347702 493111 646930 481321 584520 719466 472645 492642
13758 492642 652739 463532 666092 433079 831985 366846 828903 379475 569997 327422
13748 327422 538243 714459 562155 669888 225735 472683 486146 578828 450232 594243
13738 594243 570335 719915 224023 469531 503688 807222 719278 252659 684526 980367
13728 980367 522049 619567 812679 519041 616350 454286 492090 401230 388632 205031
13718 205031 576376 400560 129019 174913 616063 491409 421368 206388 380702 392011
13708 392011 427334 561087 308272 419826 581559 438817 214111 715773 389993 564564
13698 564564 305979 377370 245480 370715 785329 782042 584411 537836 623397 317678
13688 317678 441685 401759 289165 210861 -2060 252824 402831 466635 505222 329256 275838
13677 275838 282886 473282 299623 374745 551122 213285 282068 438135 284156 367210
13667 367210 167663 69463 224527 660537 414859 199458 274431 308999 322696 422481
13657 422481 225155 43177 314860 389861 -6888 468457 288824 482191 520777 245005
13646 355802 -61675 246648 400965 158630 204942 252062 452526 467334 179287 311161
13636 311161 257770 262877 256708 484215 284235 67155 290623 368236 30744 152650 164924
13625 164924 253224 317461 286319 433306 136012 116532 232285 290913 115456 266707
13615 266707 307397 420110 425500 207892 51055 258974 281103 629135 -44729 345885 215436
13604 215436 253433 445086 284087 8837 73840 92929 71523 122891 176149 433571 544112
13593 544112 326849 331854 278390 22576 502584 235429 308782 233248 108417 418199 532686
13582 532686 240689 23760 227697 360898 299173 359546 45891 113123 57679 172756 309171
13571 309171 354387 121587 435770 402128 169877 435345 393653 100719 259476 273243
13561 273243 136264 516226 137719 341106 312105 300080 143320 333980 219445 81186
13550 190151 -263183 282347 447769 -364784 289707 381281 -120047 319511 410620 -12486
13539 133948 114656 459869 86508 390517 143489 145064 139449 99316 293756 213084 469624
13528 469624 -76212 87651 362867 -110198 445070 106214 752066 265151 170329 627791
13518 627791 232324 -169122 299374 66167 37953 188078 243159 376158 5191 416584
13508 416584 281670 140611 14937 425100 272761 -144696 196916 396832 -39701 511706
13497 171608 -181070 169306 372476 41501 260745 199181 580121 290008 111450 41172
13486 418081 209625 -18144 416417 -90923 439150 282890 132818 454608 474322 207081
13475 195930 289447 175085 202320 396161 160425 -18899 378914 -57858 407965 369279
13465 369279 77781 85243 315079 311406 112266 262017 121977 46352 340 202751 520914
13454 520914 317043 194485 291787 -5254 -24528 -47520 -59362 264313 452792 49631 192157
13443 192157 49042 -161573 -57118 339187 -188140 -122284 375583 169216 168865 145946 -16216
13431 139013 -1327 249328 105347 217043 123292 167888 644104 147789 289688 -93728
13420 142248 539924 117498 130406 140911 264143 94935 269888 131566 345553 387252
13410 387252 172780 136216 271598 275627 89693 318935 286649 133407 104718 86234 245638
13399 245638 -193568 -112504 297058 57652 174656 240857 10600 -115921 -36280 105040
13388 474943 -26268 78703 189235 149262 -32558 -107513 103085 257992 -89420 127905 248825
13377 248825 -96413 170279 6210 -29024 -50813 224014 142219 243444 409090 -22302 371505
13365 46964 192034 485155 -136014 258509 -5134 19134 142346 100346 85161 144776 124700
13354 124700 -194871 -52068 234677 47871 126219 309042 311911 49699 115199 277118 83531
13342 150833 328366 216976 465177 186612 313545 355367 109728 515 -103162 159508
13331 -84233 151756 -20961 240360 131880 43575 -64164 122944 229578 -49321 -13728 336483
13319 14279 436548 406229 278032 251007 254297 209749 86663 354784 359178 138043 -193672
13307 386914 -218191 88730 316289 47321 130567 -61628 123939 -24971 158545 28471 349284
13296 349284 140114 -67752 26877 -123125 -173241 82068 248317 -95812 -113620 105327 154195
13285 154195 179888 259390 133127 120757 -79148 -125 -30842 -115237 51529 55764 121754 419929
13273 419929 109783 -164943 274510 -126520 105255 -53328 -210092 -15913 -26632 -187499
13263 -187499 333149 299980 232073 418482 186310 -89084 145132 101632 -27036 209245
13252 -6609 151173 12404 -106044 485169 -318602 121536 -242829 203128 -6709 -39994 529113
13240 143532 194716 135860 -61474 -170458 390239 27894 164431 143848 368244 181722
13229 -227849 -127385 -107501 -99964 -22784 253018 83058 -19397 371346 -24864 -75561 11369
13217 224198 -146309 139217 308157 185339 66926 160660 167446 71518 69731 121529 81284
13206 81284 120480 -181400 241482 28136 -261674 40473 -198759 -162166 9134 -109985 14951
13194 166936 -180196 347196 17051 253645 -159195 -117594 -126870 126206 81047 -24544 30594
13182 108456 62307 -93285 43707 -8242 230991 231732 -85722 131995 418969 -304715 -4201
13170 16148 115606 -66054 198793 -215923 -16783 -386740 -110701 165775 99273 80090 -153462
13158 53786 34267 56389 -118219 -200511 -56658 14763 359881 217887 -50927 95451 174765
13147 174765 119271 -197228 137020 -325323 243997 -123229 -161962 177661 -63495 -199149
13137 -199149 201233 -30474 81864 93071 -172606 -320496 198699 166702 -136006 -30190
13126 -78403 43379 -100832 -110577 699473 -79440 35052 -139703 15685 14267 146890 147307 314148
13114 314148 143559 262740 -13049 -34235 -109707 27333 -11770 43286 130300 -102640 -152977
13103 -152977 56019 -175497 -259950 -383652 476806 -358809 138097 -429093 -85043 296622
13092 24911 -37282 41940 -143221 -76332 146547 -79405 -146485 82644 -95005 63495 269132
13081 269132 388649 28612 123313 219521 -364588 180353 87152 -8291 -298911 68746 106683
13070 106683 160067 -39953 76846 212325 107081 199240 -50709 -16751 189233 25658 -18389
13058 -216997 136320 -140888 388310 144759 255158 36714 -177752 16773 302481 -79051
13047 3323 39124 -40197 128030 181012 112232 -170283 373366 231653 4025 488166 173198
13035 -316276 101093 275499 -54366 215157 169536 84815 -15504 327591 8800 265465 182335
13024 182335 44621 498524 233281 -43064 -132385 143154 160075 283198 162486 227954
13014 227954 -328026 123637 98736 -133888 -133021 248175 38809 176134 -36381 -117252 47189
13002 -335135 225347 175786 105123 138941 -97564 58632 173825 52366 -77922 105493 115870
12991 115870 90678 -122929 -15327 336899 159701 131176 -367180 151438 95972 -128287
12980 139106 341749 -251475 74592 50990 70294 -72080 160893 -99385 -287849 -119155
12969 -115719 -66127 -183068 19770 35780 73094 148153 173402 -3246 108319 3012 -54298
12957 -51428 149093 -336161 -111608 243759 217334 -98700 104618 229836 62334 -27375
12946 45625 -177750 -26313 134700 -62055 -18712 -253830 -60227 185345 -50176 -124369 63316
12934 -54523 24078 -225861 -255690 -83856 -79476 62637 266147 163382 -189905 -53855 13393
12922 -145619 -102016 -171815 -110129 -69522 -14104 -151678 -60021 -321580 134859 208838 -40842
12910 -91467 -76774 83693 114979 -23403 -846 133857 -65835 -104134 238172 208410 42040 115422
12898 115422 -56951 -7284 -5248 -13151 181275 45501 -12054 123585 -190594 7624 -93374 -59562
12886 -59562 203010 -30453 32529 70640 -48355 238048 -194441 -81707 160536 191473 -305428
12874 299855 136994 298013 99953 132071 31679 -238145 130874 -246154 -287104 -57939
12863 -203987 485219 75547 323399 -46368 -14311 108579 197817 154855 -19902 -152507 164208
12851 342344 211569 78793 279918 -56522 -132831 193015 -218367 310694 52463 68343
12841 68343 -187296 -489334 -173578 -114864 11264 -100681 166818 -40590 145412 -82639
12830 -92990 105325 -83864 -155533 260453 -79213 -256274 -228962 173569 72008 -185112 -99085
12819 -99085 -115152 -86739 -105900 142302 -93229 -170947 130959 46190 -200602 -157221 157826
12807 -65642 376754 -104378 177847 302802 -99214 -63886 22577 -4405 -303334 -233556 103779
12795 -177562 5471 -70851 -66445 -74503 146996 -252769 -115818 202235 30998 -121806 47072
12783 -265017 -83325 388794 170144 228030 -11652 74018 178829 -2954 24824 34638 -95421
12771 -172918 167898 -155090 -34964 -70965 211780 -166863 57155 -73340 -103420 -77000 142946
12759 73025 -93941 270251 -118128 -142719 -72875 1201 -115443 46237 -59974 -125003 14915
12747 95598 -108288 -142920 -97569 -64858 1668 56418 -93392 74484 -119263 -35112 70332
12735 -58347 99088 -183204 15310 179769 156659 -109533 7856 -64340 -271778 111989 215936
12724 215936 49216 -87462 135211 -73099 190592 428881 -359388 -148893 -70702 183270
12713 284759 75730 -237189 191885 -21541 -26711 121162 202693 266326 514973 118588 -7924
12701 -166727 -49764 -82737 185033 161291 20281 70424 -230934 104186 449950 -32074 239840
12689 33466 33198 237627 79962 164666 9865 -187764 71017 -166970 50957 -32367 368731
12677 -95828 31598 -183598 76521 310158 286617 285361 134862 15329 99645 -165822 126809
12665 -89290 63885 -110771 175402 -206293 120042 114216 -17862 186817 -208902 26843 90453
12654 90453 108238 -42260 264665 338565 -201954 -38548 -347449 85880 184439 425980 146825
12642 188103 183601 454 39110 96911 6752 14341 113109 -453555 121214 -100810 154639 -55974
12629 -3653 392644 91558 -186 372011 247734 264337 -2780 73311 197484 -3814 38341 166311
12617 166311 -137901 -16859 179281 -102735 99072 370944 -273004 -173469 404313 63479
12606 229737 -89133 419058 15257 -29103 77383 53281 200686 102292 -45940 306248 51120
12594 -15916 66496 -66300 -38837 110688 223580 203044 -168666 -84851 -216010 89924 443470
12583 443470 62567 18601 253110 -123665 -151802 -434772 -178194 268057 -168820 -12049
12572 -337060 -51506 136622 172781 127488 131709 -145581 -88983 -259609 73880 -322579 -72347
12560 -94276 111388 293224 105600 -220116 112350 279922 -23193 -18071 123276 213608
12550 213608 65992 -10117 -113517 258960 157766 -19469 -984 20273 86186 23429 -120598
12538 273634 -214102 315535 135428 90879 -143191 -55288 -142310 27806 -129734 -95521
12528 -95521 189614 -32452 -148984 -96657 119296 -3104 -166000 73786 215474 -158963 104397
12516 -78466 -179744 -13761 181864 332341 -115016 191369 -332127 -168218 -315351 -88442
12505 -90248 46955 -83992 38187 -73960 109552 322961 105035 -379947 -191826 -121792 -5312
12493 162517 99744 -173418 5343 206625 -223925 300036 -127551 38500 -95726 -102550 9378
12481 144355 -112999 -446546 -177982 -349442 -391525 -231737 -175745 17327 113125 -41264
12470 -9743 -37324 -35958 -148519 -91786 -127644 188682 -79971 189469 322349 -151967 67291
12458 267484 -172476 -181770 -75593 -68598 -109129 -53681 41883 23523 80961 -118384 -191924
12447 -191924 -499171 -160809 157264 -210415 -118922 -119943 -104364 33665 -21028 -153937 65635
12435 -194275 -154583 -61765 145942 -43003 -62621 44994 15872 312752 173297 -253978 -116242
12423 111132 231365 21161 161729 -170325 -269780 48902 426279 163217 166071 244712 344579
12412 344579 -166128 -77868 116563 -142545 46715 -29802 -141897 -50077 -150286 -213680
12402 -213680 126372 34390 -130534 -43168 78708 -163947 -54039 -32155 246550 -193505
12391 -7971 282139 120028 -391332 -36214 -32833 143252 -72787 -210645 100419 56329 22090
12379 -143059 224356 56526 158226 61712 98888 17608 -2385 -76318 111556 -56478 238403
12367 -31536 -22877 39693 25574 49312 -118198 -47944 96693 -150667 -60466 -47670 -108310
12356 -108310 -62812 57484 241217 329910 -175063 -91052 24794 15395 -191123 216969 170238
12345 170238 242838 12734 -138525 51124 116516 -188771 -67458 -358120 136236 -16784 -188498
12334 -188498 -499271 95558 302585 -30130 -83969 157779 267903 -74091 121452 95797
12324 95797 -78991 133737 297005 -59458 -127537 442407 110452 -288947 -282634 -63816 -37889
12313 -37889 141268 -11415 101622 -195743 123258 -18061 97258 127617 97004 -44335 424259
12301 -152713 275773 97462 33961 -73673 -10130 147357 118565 -94955 266203 195391 186410
12290 186410 50862 -54207 -289565 -103533 -11463 22592 134796 -75202 -181760 20980 -47998
12278 182220 155121 214730 -106741 413556 46713 15894 170985 -2166 -107446 -130001 22483
12266 -132081 228060 -57331 303716 60115 59427 297346 147383 -2591 64974 49230 117831
12255 117831 -1764 325997 270058 25046 -7632 -173815 380571 2298 -23274 76781 -14763
12243 -57280 -101194 -31534 -245905 234442 22612 -102586 77505 180924 199803 8826 -116371
12231 281235 -44371 315797 -121113 404090 193166 -28270 -164696 415684 301588 253494
12221 253494 494497 84137 494411 57613 -224888 231515 -59618 178985 118006 321496
12211 321496 150762 293034 381157 -133808 50720 214318 150481 156139 88939 -45389 -92917
12200 -92917 40796 192394 188924 32269 -34990 -146932 168942 -28878 -2580 59712 78384
12189 78384 -42236 272900 -79447 34998 -227994 90195 120013 -27752 653224 144181 218600
12178 218600 214932 -74165 62447 258100 -16366 108031 169604 27351 -60391 503743 188934
12166 286769 -81611 265080 99801 53706 102764 261824 -75827 55796 -23646 -111091 -152238
12155 -152238 -38041 -96820 -170551 -160388 267031 281492 170667 292677 -36416 78602 350044
12144 350044 -7721 186637 43697 -188093 71989 38228 -152020 -381628 131506 -94723 375858
12132 169277 4026 22244 122476 231631 -35130 -278048 97569 83706 224612 -246506 114891
12120 120782 -25356 63469 -18676 -66955 -209568 134568 398137 95722 133493 -268438 1831
12108 -26333 34288 -89520 186255 -81808 -177208 -16728 -297 275815 -210624 -226410 -388093
12097 -388093 179009 58155 -25601 -153786 69664 22233 98474 106078 -52051 271548 -42551
12085 38603 235224 1157 -97108 174265 -326374 241394 -247240 306644 -210550 -33029
12074 258639 887638 1668276 1224506 230497 484356 -252842 -135763 -106047 -102259 -54723
12064 -54723 -137979 91306 -92136 -451926 -12454 -219601 -150145 -105939 -192444 -324569 -8008
12052 -186846 165705 -26893 191938 31355 -106934 -20538 42880 152991 -43084 4481 -50907
12040 -69312 233102 -35093 -7050 -175246 -31955 -5613 -98115 -349292 -217841 -159770 58355
12028 -287028 12389 -119927 19925 52169 44410 -178720 -229570 253146 159437 110319 115546
12017 115546 -73796 -121616 -123197 -45254 -210128 -339552 -27938 79631 248377 -214775 134748
12005 -132965 304370 249304 -141249 247391 9328 -137159 -134659 -94088 155900 -311342 200597
11993 503342 -171928 54504 -45163 32157 -17535 -396991 16929 -97429 21906 -304177 69193
11981 -10848 -18126 -128480 -70904 96876 6400 -78814 183520 -20999 -159236 314314 -162871
11969 -262327 -91669 47912 117677 -54399 130393 24747 18425 284696 -38249 6735 -216621
11957 41913 91902 -189704 -30186 -222374 144049 -157559 20312 148253 -12003 -365760
11947 -365760 -16273 -63476 -206573 -163819 12251 43401 -184468 -129172 40386 83579 -343635
11935 450924 -90287 -265794 50864 -128460 -89763 -237788 9560 -225240 -325278 -278350 61640
11923 114345 238613 141446 60206 55705 -142997 -92385 172549 391 107242 49793 -61304
11911 -208611 43799 -142068 -14699 15083 18888 -62973 -83341 165016 -127178 -99340 -106221
11900 -106221 -68597 30769 -154894 -317089 48800 97890 -38486 122578 -213891 41460 -67770
11888 243120 73191 354229 -159112 -258029 -95530 423805 98806 -31827 -70120 -141070 53433
11876 17925 -140704 -161953 -368487 -234251 203964 -69715 9271 211555 57120 -4476 -96124
11865 -96124 -144727 32978 -95953 32985 3482 -63006 123210 250856 -71061 -142688 -8940 20844
11852 71741 185888 -179215 92786 -239880 145518 -278262 81530 -290020 -150263 5178
11841 -95039 -20614 -191008 73696 -114626 -39739 -188748 40394 23287 -75401 63485 -197
11829 150544 72601 180687 96102 -20519 -8618 -92969 -225205 -187173 -76253 -296214 -254427
11818 -254427 61835 -231349 -6084 18937 -152842 -223708 57354 -280606 -93393 40200 101334
11807 101334 -42881 7424 -51026 109855 232880 17213 139239 67967 65469 232776 -204714
11795 -198770 33698 141533 49264 141038 -18536 -78956 -48398 1490 -61820 22970 -203418
11783 -299892 -2675 116904 -26119 140780 -110379 -130680 30077 -132415 -324230 -410856 -237442
11772 -237442 -40577 49317 -58725 -251388 83343 -343077 -183881 195066 136854 188704 286886
11761 286886 58709 -18183 92523 -199441 65345 -187766 58462 -55253 -5715 105991 54920
11750 54920 -193665 138484 31117 49991 -146887 210777 -157770 74303 -340081 -97420
11739 66607 157775 -8018 -19016 -69425 -178242 19049 86553 -50911 77540 -267497 -127902
11727 64767 83393 388942 -72964 -19250 297142 -129055 96033 79188 119524 -128968 252465
11715 176865 -52215 100512 190353 -123296 -80976 -59976 103308 147602 98619 -229074 -244055
11704 -244055 270604 11412 -50432 -188741 233131 368 170712 -44131 -28489 166236 -107612
11692 260064 30105 34830 -111887 12911 327014 -150195 -39544 -22370 186937 106578 -94218
11680 -133844 -187157 -44212 -23978 348507 240749 23460 97187 189527 36412 -66473 103630
11668 -20362 113535 160955 -156048 57156 -85056 75367 -344277 211367 45163 118463 290245
11657 290245 -30093 -451611 42064 21857 113752 147701 223864 -52310 355090 -282391 -223901
11646 -223901 93470 -80514 2677 -14635 -407713 265864 339422 49355 -294059 -36776 -53995
11635 -53995 180636 -33498 69815 -165483 -111211 13429 170383 305128 6201 -92823 -232783
11624 -232783 165643 -152375 128055 128330 293249 -91945 128257 232303 90243 -249642
11613 -208562 -222335 33104 180410 -24717 228603 171060 -218221 -195003 -34044 85048 20449
11601 -41207 -257746 123993 183632 208798 -48731 94134 -247110 117723 43583 -67365 298534
11589 143039 472848 46399 94718 -167965 295941 -174016 -151715 -106444 -215411 89906
11578 -13985 7880 10651 142443 -36403 109483 -154723 448255 98784 -225821 269974 -105292
11566 -347543 180491 -47255 167061 79044 110353 85374 -206044 46756 -55447 -13944 -114301
11555 -114301 24279 76891 254413 -163871 -217734 128468 265607 60194 -84854 311024
11544 -111653 311190 332568 26678 19201 14060 121878 -25386 138960 94623 26440 -202101
11532 -3974 75192 -69680 143095 270332 -75206 199758 -44248 418382 81641 447776 127492
11520 44555 254065 202205 106487 230768 40015 30432 48239 -38825 100180 51721 198864
11509 198864 268395 27682 -52576 -70731 195994 33187 251220 195392 -3234 97845 -64880
11497 130983 104790 -157814 -50566 71550 298682 -38285 291784 -63542 -117142 217428 43303
11485 -289112 63980 -102187 118594 -81583 63387 187007 140795 -148957 -71625 248565
11474 26938 170814 83514 24013 193992 399313 105980 222912 291984 58716 31548 39276
11463 39276 -102117 155021 248884 -48205 141856 264248 -20420 53332 -75211 -74661 -47121
11452 -47121 39205 -244266 -91676 179614 42543 11714 302252 -95786 -149921 109765 78102
11441 78102 63065 69808 282115 -29504 -223479 390130 -254213 50752 132714 173050 -111532
11429 -314522 68845 6379 159894 -41392 55024 52533 -169606 42129 -132921 -128436 -146392
11418 -146392 17696 -299450 -56621 105035 46836 -120575 -32664 42336 161296 136926 97871
11407 97871 201850 -25137 15585 95166 25350 -400527 -216489 -5160 -241852 218359 -107139
11395 -41674 -203356 27905 -145678 141260 -81404 -336093 -227903 -182993 86738 -20284 -326195
11384 -326195 40740 129218 97888 -72376 200784 176149 292603 223417 155760 -67165 252216
11372 -6914 -129068 -176972 121031 27020 -123385 -211079 48029 -303098 196762 -96063 -188633
11361 -188633 -31641 -286699 -177760 125565 -105054 -81669 -46848 -140405 80802 -50823 17571
11349 -68144 -81669 -213947 -106196 -254350 113366 19308 -64452 68100 312460 -462 68855
11337 200187 99279 33193 184511 -67578 27421 -191608 -182450 196134 -7209 -544206 103722
11325 27859 -33656 200271 103095 -246053 233514 107664 239790 9753 -195010 -123594 -83706
11314 -83706 -141134 -62179 353414 152671 244328 -346469 110588 168092 -302294 -337102 -55711
11302 -186859 -22473 322236 150885 69261 -78400 -202636 227433 -24654 -44816 190124
11291 63886 -211270 -158329 12507 -126433 275709 -191950 -229091 11247 279315 217051 -115728
11279 29303 132156 -6442 -64209 99943 -203948 58933 116845 38228 -255446 -309831 -215703
11268 -215703 -319582 222590 -32702 -388224 -250708 -58840 -88221 -231539 23648 32611 66503
11257 66503 1118 62510 -81892 -542 40363 -126828 -46471 -322055 16317 -134162 95510 -344382
11244 -183516 -223145 141194 -200153 53309 -90168 -216688 -166622 -183170 -40286 61635 -299342
11232 131629 165874 121001 -72745 -80187 134660 147684 214179 165856 208540 58633 -228511
11220 -284448 -223077 -258835 78073 -133034 -130516 66981 30366 -218341 -69522 -76692 231510
11208 -178348 170028 242621 -309936 -146272 -47411 156660 -152966 -33463 13274 -107568
11197 -29505 -5589 270769 -81624 -92269 -499761 -7901 -260019 16893 -90661 -83529 -232364
11186 -232364 227939 -29572 20360 -173739 -288710 -2441 -190920 38563 123819 72857 -28770
11174 19605 195600 21494 54676 -71381 -378685 -59565 218121 97417 -302925 316943 71957
11162 -114897 112658 -248492 213494 -114407 -101084 -9216 155440 -74043 -71569 47108 277912
11151 277912 -23557 -165049 319412 -191501 110837 72204 -60311 40839 81253 65934 2217
11139 154758 -188850 155600 -148742 14106 154826 -267731 28808 40516 26014 281117
11129 281117 -436502 -5675 -206918 283871 -119391 -110604 6153 133594 175527 178096 -250991
11117 977 46230 37999 187494 -132237 141206 -163231 60840 129187 -327440 -168837 146920
11105 79892 -120543 162534 215097 287318 53218 533320 109317 220736 183310 -242248
11094 233718 21569 176065 550667 90194 264710 -34579 213277 14361 -58798 24063 -66512
11082 -71313 363592 10253 177328 424848 422849 205488 34096 356393 -109932 402176
11071 33013 454488 587881 87970 222826 157611 274495 252154 318766 176669 228566 390936
11060 390936 635649 442540 547069 914741 542528 463415 114809 306469 720856 17140
11049 720556 806657 235840 661690 548503 764452 507590 316366 909678 423128 770538
11039 770538 445745 573968 562951 774087 457456 315705 541644 398803 256888 590516
11029 590516 383493 567309 516555 488576 585627 567661 955308 490735 903879 497295
11019 497295 621176 265903 525028 486304 587416 394687 511697 538954 451056 548675
11009 548675 581825 264497 424238 866747 637411 463797 610323 342356 346005 513453
10999 513453 423592 726293 526836 575360 655725 550764 271843 741343 824808 783641
10989 783641 537985 810107 747512 875306 1032842 825289 839628 651130 1012573 1056686
10979 1056686 1140379 1622038 1703367 1560227 2017664 2328323 2413952 2477725 2435947 2533586
10969 2533586 2359362 2150102 2416187 1551367 1509121 1600479 1604870 1480358 1647535 1283713
10959 1283713 1430906 1686940 1369490 1519958 1739565 1405535 1114470 1010054 401436
10949 859208 678321 633460 532320 103402 228691 353075 167773 476290 325699 193246
10939 193246 114697 289004 -19161 185360 -36880 41306 163151 169540 135798 292868 133138
10927 134817 -67717 216084 -28910 77143 -100517 70358 -147826 105076 -65162 -99569 105487
10915 -193437 -44391 220853 -219409 -95084 -140284 -6092 -4369 -84656 97301 -36739 42634
10903 55678 70978 247565 186008 -14565 17975 72552 -1459 75028 -154837 -281792 21214
10891 3217 -11531 30894 -266617 -211949 78889 -152507 -41700 -94882 318535 303957 89489
10879 23790 102953 312571 -143247 -164231 -368112 118716 94783 24241 -176042 37265 230717
10868 230717 -164125 -67121 315701 -11453 -400089 212549 -362178 101902 -101721 -28677
10857 165183 226018 -21458 -6587 -149730 -147437 -179767 -349851 -338147 32669 -276940 14889
10845 -277369 -44808 129643 -88294 -151324 28697 768 448 -144821 28979 -40939 73995 -96295
10832 -248147 -106247 -58672 22296 -84051 76099 333985 -153069 71554 -160679 33755 -39726
10820 88468 32369 330837 -97549 -13144 -260852 387097 -85692 -59330 129837 124795 -150933
10808 -152711 -182255 -239854 10595 -60121 -23683 33837 -38552 13579 60405 -83892 72654
10796 -215925 -133718 -150433 155763 24091 118580 -58967 -321495 -69823 32148 -242272 -110733
10784 -231654 82233 81487 92817 -291765 124912 35040 -204772 283187 -72147 -25952 -4863
10772 69755 -272280 -97584 -229138 -327398 126959 -180628 3503 -191718 -268218 25414 -211029
10760 151138 -191675 -283413 189114 -360002 -185617 -135572 -266818 -56146 72462 195027
10750 195027 -80801 77759 -218413 -22536 -249686 23748 -67217 -117565 39967 180067 86921
10738 -249201 -153593 -92012 -107496 -291056 232667 -37051 84724 -65043 88338 136433 -130865
10726 -342232 104014 237968 47504 62382 -97456 -83168 -175277 -144061 60628 29008 2099
10714 -38709 -205408 -206914 146992 -172041 159576 42696 -120816 -202543 -240378 -92106 -211008
10703 -211008 -80148 -452148 -13525 1877 -234791 -162042 122563 -237467 -349153 42853 138241
10692 138241 127899 70942 -327811 -153349 -85195 30717 151383 -3251 100389 179415 -275553
10680 -139540 -47989 -126667 -18364 -130924 -117446 -99869 -173250 -224903 -26489 191889 -15253
10668 108557 -65915 161164 -308264 -45093 -291083 -392747 137179 64243 -150801 -38878
10657 179960 -22522 210432 41089 -12936 -107614 83219 164862 18327 203194 108128 -231384
10645 -87474 -73295 38934 -160514 346834 133833 -7762 224661 177028 -255848 42117 -129797
10633 -49655 170849 -275178 12813 582 -246071 70615 77959 363687 -245976 -38695 -16271
10621 -253142 -371760 -437704 -4469 4774 -27985 -64231 -45940 -234913 19881 2304 142685
10610 142685 -58883 -55387 -74091 334158 -180761 -249532 -233339 -114717 -152294 221800 11484
10598 -234581 111004 -11510 71080 327322 122608 -4875 -54289 102921 -380369 -75217 186127
10586 -53419 -176760 214704 201945 -200343 244970 256262 -250792 246080 -248895 -112070
10575 23875 7988 7084 -70735 25149 -196535 175250 -83219 -341707 -211376 -176766 -286239
10564 -286239 -99323 -86827 -51281 41735 11528 34460 -25643 -292080 85077 39883 3419
10552 -174861 -217291 -228992 -40210 -280807 182973 218855 34877 -17150 -231874 -393431 -64517
10540 -27413 -91089 -246530 145966 -107988 64898 -45113 -177866 -109980 -69406 117601 133433
10529 133433 -196988 -69571 -237354 190305 -84711 -97461 -144311 -27223 -226107 45697 323728
10518 323728 101607 106502 -136747 242818 87291 -75648 107220 -293057 -151015 -22787
10507 -262900 -29054 15213 -130628 -75530 -16835 -10638 -303763 260312 71722 -174382 -337842
10496 -337842 111166 -18103 -108600 -40728 58203 61380 104471 104765 -60534 -252228 -262622 178067
10483 58625 149649 238919 158911 196647 14046 248966 235872 432022 169351 366224 -21294
10471 49268 -209217 -81997 -170445 128486 148565 34977 -9765 55199 -70793 -276819 78870
10459 -102209 -95652 -147443 -114303 -46512 -169849 42550 82434 -258500 162786 1865 -42128
10447 -204927 -166524 -33947 -68016 -5660 -183528 -269308 -25743 -35063 -155367 86017 -336238
10435 -221263 335159 194464 191422 191479 -37920 -305033 84887 -45494 187835 -84402 -76328 -224892
10423 -224892 -142250 -283293 50664 -47819 -378723 -139509 -35485 197091 -169868 -62436
10412 -283772 -98246 337929 176521 26977 96685 -266094 -84328 79854 -282732 124732
10401 -82139 142228 134257 -81719 -127706 -22391 194333 39357 185695 117489 194256 -212186
10389 201910 197193 414939 -3146 363036 -93351 -302925 136013 255928 -130935 -131498 246098
10377 269247 3205 140647 85862 -11018 -64611 399128 303616 125397 229656 171079 350753
10366 350753 353500 319378 692300 307746 242263 447722 82974 -221527 88940 -11005 30008
10354 30547 249679 56586 420349 400571 731973 418268 268046 -14684 235816 364370
10344 364370 522408 541414 124378 262751 296413 186331 -74652 788 170740 42440 21374
10333 21374 118725 196327 152590 234692 217232 321431 80376 70369 60513 426668 315431
10322 315431 140461 411151 192593 77588 -60954 -326518 216512 100708 151147 191482
10312 191482 -31834 -168991 -36824 112064 166694 121828 -133579 164217 -88690 42262 123600
10301 123600 27337 -60373 -247648 105647 -259218 -230657 -44996 -215280 -55603 -118833 228502
10289 -112807 -318472 27734 41931 59121 -144902 -262811 -204810 94809 61552 63831 103820
10278 103820 -110130 -242802 79459 -200844 -63864 193018 -4861 167056 244369 -202055
10267 -46085 87701 140832 91669 269081 -39866 327583 345569 388213 335160 68899 237210
10256 237210 365420 173988 129669 134431 153440 -260637 4682 -85447 -68787 93190 -103718
10244 -94307 208135 -194490 -106293 -19931 76055 -124684 -276610 -166117 54660 291092
10234 291092 -37509 -67561 -62659 401435 123626 -321193 -362793 -47910 -16036 167023 -23450
10222 -331541 307946 -175417 50923 3201 125669 -296410 -21507 -165524 75023 -5847 74291
10210 -75277 -59606 151494 -203207 98680 -209028 188073 -34612 31943 -37387 -155020 -350808
10199 -350808 -308226 -207133 32658 75983 268094 -130046 140485 86151 291411 -25294
10188 -156176 -173239 356807 -198902 29214 469751 74451 -270631 20013 -347753 -380506
10178 -380506 249438 -316180 161278 -86172 -172797 -36714 -49941 -33606 186388 104774 149253
10167 149253 81492 23803 -57288 -93316 -18256 -4373 -243555 366651 185331 200026 -222283
10155 -90428 -294480 -209888 92124 -78621 131081 364820 -367865 234776 -335322 -173849
10145 -173849 -165800 -201458 -85520 -3393 -24916 37244 -125886 -395484 87607 189113 -239521
10133 -280075 -106423 -88225 31474 165227 55526 -18361 -223813 -223938 -19337 182248 -218193
10121 -366202 28102 88973 -79246 214945 -33407 105504 102701 -91989 7407 144748 165007
10110 165007 13763 -232629 -73379 -128752 -365508 -82984 237881 -7027 -139337 50852 -22718
10098 -243478 -95612 -376787 -80086 -55257 -197003 -307781 144890 -123079 114331 397654
10088 397654 -341849 -81472 -439403 -142929 -19379 303111 108571 147440 36239 -179286
10077 13625 -184982 -222667 181697 188630 -46489 -285622 10042 -18538 -137405 -80005 70354
10065 -313034 -59170 229020 -60821 -153436 150320 -34799 -53758 -209724 17141 32507 -362054
10053 -482619 57581 -94125 -339704 304199 -380651 -243656 -176584 69122 -124977 144474
10042 -274635 -113450 62225 -80564 93581 -367286 -125176 40701 -161036 94423 38162 -233714
10030 116012 35525 -169724 -16122 -121543 115951 -180947 -95850 -248333 -344738 -108579
10019 112156 108271 -256559 -60842 -235785 -140353 -124026 -58635 -124336 -46398 -237846 -101884
10007 -361701 -90141 -249880 -151248 -1671 200168 64101 -160700 -160342 145899 -8167 -469752
9996 -469752 -232795 261676 -57782 -141903 195406 -192365 92800 -4300 137714 -20823 -114446
9985 -114446 203908 -19327 -38311 -99246 11408 -340115 120154 -317004 -296215 -44695 302458
9973 -151958 32652 100455 22354 -99896 -14398 -200928 4532 12045 104101 -94452 1233 -40979
9960 -78779 -37696 -99771 -72232 15191 -134133 -44540 -271114 -3136 101734 -84962 116146
9948 41855 -144020 -107571 2844 -59950 -24697 -133848 53151 71275 -146848 -116947 -296201
9937 -296201 -78589 7925 -10465 19974 25918 12866 -118261 112433 -49229 -43181 -77822 -102475
9925 -102475 23927 -155196 -36284 -178519 -455179 90936 -40420 -118094 -189160 -111108 82540
9913 -175451 88990 16633 70488 74452 -116552 -79959 111906 -220513 -146216 -12083 -175209
9902 -175209 -491042 91450 123042 -175560 -159199 31320 133899 -158073 -106115 -58333 -212208
9891 -212208 -181649 -554408 -313418 -14435 316864 96960 119676 -27656 -104620 -187306 -15775
9879 -288729 84692 268544 -165366 209612 3239 -3221 -230623 -374174 -120342 -74844 -321412
9868 -321412 -82959 158766 -130169 -106365 -149868 36021 242397 61819 -222511 46255 -359929
9856 -16422 -99164 -141879 26145 -282896 39370 -48955 353380 62547 -110407 -248963 -271197
9845 -271197 -108195 264681 32482 -59632 412368 -208889 31779 -322774 -91493 26342 -89661
9833 -248173 -172722 144500 -93017 123600 230702 -344265 -64548 -257457 168405 -68399
9822 -86355 -68768 -339669 294401 -166604 -133200 -233621 -541780 -241397 17426 92820 103195
9811 103195 -155650 34692 -200077 -95562 21607 -283374 93008 -277028 159586 -107949
9800 -258288 -136932 69027 11639 -102244 -25526 162421 124058 92455 -92861 -342315 73633
9788 149371 -304140 -127466 -137353 490228 -410933 87331 -175126 -14066 -40456 -80975 -32612
9776 -14601 -43445 129016 60501 43452 178 -326916 -71791 66299 172593 -248285 -250297 -151174
9764 -151174 -335346 -203719 -282692 83191 -4793 -110893 -209025 23360 156546 -25069 -224383
9753 -224383 -341914 97941 182539 -62337 10641 -118553 -206512 32928 -131841 -207603 -4622
9741 164094 -280534 60701 -244052 258633 -282927 -162285 76289 -106568 -80411 -250665
9731 -250665 31036 233354 -68466 -136554 56005 351329 -176096 -260338 180763 69815 -215662
9719 -113770 -7499 233144 -99340 -11379 -151737 -215623 -167071 -169682 -9965 -182173 -39345 -25671
9707 -25671 37146 193364 -135633 16658 -138585 -109173 -163001 -454695 -91513 -34741 -46807
9696 -46807 -49070 -105729 71449 -75912 82874 89266 -164009 -139108 109479 -73693 -52928 -31561
9684 -31561 78155 -176108 -75153 -82400 140622 17798 283744 -265103 -534215 187663 -117653
9672 -134787 18659 -254576 -212995 -257508 -125065 65281 224430 -357478 217422 195822 58922
9660 9235 -8989 -300858 111518 79996 20481 -162711 -298214 -82905 90856 -187932 -295007
9649 -295007 34462 4631 101326 -36462 266493 -45137 204440 -226754 -94771 169352 -292760
9637 91235 -344671 72619 -162195 -68218 -232897 -99478 -59864 -169673 116512 -72481 -98836
9626 -98836 -28907 8323 -549666 186048 -108324 -163190 -205243 163686 245153 62470 190425
9615 190425 -451854 234255 -163749 -195455 -217429 -67348 -183036 -14480 79945 -132712 104700
9603 -232756 93278 -106684 -208101 -294537 -486366 27575 225034 -94806 -493098 -79081 -58366
9592 -58366 -11770 39274 -12917 27391 -41897 -214054 108205 26419 78368 -271910 -130288
9580 -344279 121697 -125990 -230433 3839 -174168 -146867 -139703 57033 46011 -19553 171708
9568 -95269 -280011 -117700 -56040 -161698 -52076 118158 9364 95772 -388172 -358614 -79424
9556 149745 156169 -158985 -179708 -91624 113182 -51435 123773 58961 -31061 -27420 24267
9544 28793 55285 65419 -81133 73292 -249681 6296 -159727 -168880 105922 -69498 -172869
9533 -172869 27797 346480 9276 235249 53162 -226412 50965 -90166 -60719 -44954 177649
9521 -99286 -119672 -252659 -172168 29524 -66899 216661 -392436 -199254 135511 -16895 226591
9509 55304 -73613 -58869 -215892 -307414 -193382 294675 -362790 341064 -125316 -153714 -54610
9497 42309 -18908 -26338 60896 -224724 -122987 -127103 215825 -77982 130582 30187 247934
9486 247934 -236007 -14477 -103934 -211182 -180545 114748 10631 197948 71808 14199 -41679
9474 -230934 -200107 18528 -207824 267869 94905 254266 -106037 -83332 -14876 155138 -173165
9462 52456 -3277 -35562 204474 -250581 -231925 -148969 89520 -176151 -206531 -274383 246197
9450 125967 -165128 11155 -58586 -302769 -64118 -12902 57638 9007 -438624 70210 -151352
9438 -227309 -348903 207240 -95418 -60220 -140212 188538 -173501 -143832 156186 47072 81267
9427 81267 222252 35289 -271837 113790 94342 155977 6001 84569 -107206 46451 32097
9416 32097 -36350 29378 45953 -98507 -130642 200461 47195 157694 99506 -127099 -183429
9405 -183429 40340 161112 -177497 -68743 161371 40011 95058 259627 23249 -276058 43009
9393 -52640 -255437 -103380 -1917 133474 -231494 -28624 7929 -28536 -180553 -173481 -83533
9381 -24275 -154165 227123 80486 -46960 -90899 10966 -208206 -190640 -112765 -54017 6074
9369 70125 171090 38123 -163566 -194461 -89188 -72245 -61563 -331399 240802 -66156 -262173
9358 -262173 -499899 -162369 -114295 -167779 -196109 -111332 -159627 -75228 99132 160154 131198
9347 131198 193696 29214 301089 -417340 84717 -169928 -33457 -320160 -255328 -236474 -117243
9335 -387442 -171132 62874 167746 -493192 -115132 -210665 -168416 395898 -250488 -74694
9324 270860 -269267 164429 -116906 119154 -63340 11399 -300309 108087 -41392 -235851
9314 -235851 -272178 -174408 -255286 -199650 -143771 71685 -217366 -228048 -61768 -83923 134598
9302 98602 -408588 -243430 -154953 103230 -146855 288147 -427534 -18648 99060 120385 -174251
9290 22862 -111865 -28871 -262478 -300160 -65055 -51223 92620 -58716 -200541 -187736 -90863
9278 67616 -34797 -57268 251611 -130282 -267576 -18744 -34662 -69383 -304199 56272 -30619
9266 -43345 -130482 -259018 -21304 -128610 -17127 133390 15721 -12528 -242291 4441 275913
9255 275913 -131469 -406342 -12397 -352024 -218267 251051 -166334 78542 76583 -257901
9244 -151401 110929 -175072 153945 -38614 -102925 -538502 42218 -107492 -227443 -16374
9233 -136226 18393 119851 -73803 -329916 69841 -115924 -122703 -83005 -117890 -205644 80820
9221 -75953 -146814 305017 -252851 133138 -89095 167682 234416 -76563 89527 -286924 3164
9209 35868 -41044 38324 -174539 60485 -133102 47350 -22239 -55094 100498 49501 121439
9198 121439 264427 -106427 -105376 43961 -113413 -223760 -13317 -139164 -38120 -221748 -58832
9186 -332204 16039 -88479 52662 -368615 -77653 189008 166881 -129930 -29041 -232314 -71820
9174 -215573 37892 -113917 -224147 -22725 10436 -522409 -15725 -18592 44062 -45716 45226
9162 -238668 -203884 30196 -425812 -53998 -370996 -117448 -133227 36209 24432 -201918 331506
9150 169520 191262 -52653 67008 -79985 191331 226645 -81749 98171 -68257 31491 78147
9139 78147 14921 -58380 -104817 140215 70334 316629 338575 -239174 -16199 51024 -200849
9127 -73613 99469 -238822 -90865 -66690 728 197399 -12615 -165462 -67569 258090 232255
9116 232255 9491 -235763 87654 -142184 -61067 -260177 84018 -5038 -14338 -102001 147509
9104 -12743 171891 270086 -411230 -80472 -328935 178483 260076 223918 -269001 187936 325420
9093 325420 -178176 56826 -200524 -7843 -39788 33411 -272681 12877 75122 -20271 -22014
9082 -22014 9682 64645 -165419 -131486 -89218 -223352 -227785 142028 -454529 -74810 -158790
9071 -158790 -155305 174106 364546 -266947 125519 -244489 183768 -168628 -82273 -260106
9061 -260106 -212409 69491 -127537 -5263 55346 48027 -18591 70883 -202112 221001 114903
9050 114903 -93464 -116058 -169005 -240021 225142 107994 -23548 20477 -141652 -90126 -46942
9039 -46942 -233694 -256592 -202792 -3519 -251167 155093 -253398 -128712 -80477 34138 157220
9028 157220 117691 -46181 -157069 127214 -445226 59574 -297643 -71823 -17417 -51991 -238284
9017 -238284 -536178 -341707 -20223 -93635 -158260 -228290 -313075 -131174 -19278 245829 -216668
9005 97748 -100984 -325977 170920 -44064 165227 42486 -12008 -144057 41085 20010 63766
8994 63766 -429871 124897 -183334 -124508 -164693 -7017 92891 57144 -62491 -331404 10995
8982 -216493 87711 -212137 -155718 232362 -72592 78102 -187070 184244 -287771 -130318
8971 39648 -44899 2642 -136003 245865 80863 -95726 -169497 6257 124191 -166347 -31126
8959 324469 97043 -37067 -302896 110201 -214716 -125080 155748 -126179 31732 95274 42333
8947 22435 -236265 184831 51422 -92359 187577 -36524 -88694 -211660 321224 51289 69952
8936 69952 -78508 60709 -61089 203032 -238582 -149578 131563 -204511 -158955 -74931 21033
8924 14753 361409 679656 2339986 2199333 587837 288883 527980 26898 -133084 134686
8913 -21550 134610 118899 -71019 -174850 -69646 377010 -209793 -127791 -32546 -360618 -67368
8901 -375165 232005 -265581 -353394 117190 -274850 -33068 -108172 66630 -160881 61120 294441
8890 294441 -160599 -349336 85215 158189 222631 -397023 -69325 -36782 -49976 -34238 -303340
8879 -303340 94516 -23362 -110593 -295594 -126357 38656 34537 -38203 -3429 -54913 -66654 -194805
8867 -194805 -212653 -83067 186567 185172 -43671 -43621 -120843 80031 -54452 -43265 -4656 189036
8854 2719 -53741 -140604 -30945 -924 -444431 -233876 102669 -202214 -43777 73983 27836 62927
8842 62927 324803 -198583 -56638 184485 -126529 -380321 -150920 67699 166392 23778 417607
8831 417607 32581 84809 -13974 -148349 -47685 -144813 186863 -91755 289117 -387258 -25130
8819 136850 79545 13252 -113994 -266914 -162660 116944 301056 -22689 -96449 -133623 -78454
8808 -78454 -215746 -409503 -45537 -17319 -20964 -7562 -476302 -136177 175848 68375 344452
8797 344452 210138 63590 -376203 -293442 -112976 -260367 -171337 17173 -79250 -244314 102526
8785 -335659 -157564 178323 -229812 -262537 -49454 -103831 -18635 -31914 120225 -286863 189372
8773 69888 -98024 149359 -49838 -250879 -81442 -199764 -364209 -209723 -160047 141257 53248
8761 219585 151678 -146411 31357 244533 -199788 -235314 1739 -51175 96435 160600 170094
8750 170094 -96340 189641 149739 63700 120388 56504 27712 -120600 -154684 162852 209974
8739 209974 65509 -287114 -173456 30189 -56740 -129707 -39797 61857 -63144 -184103 228198
8727 -209548 -347511 -63002 -176227 -53862 -145170 -89475 238197 229561 42689 -210427 -171172
8716 -171172 12477 17986 380305 96179 -207676 -207711 -57444 -198507 -37255 -159189 -86238 -112208
8704 -112208 -117894 -231674 -341674 23474 -360760 -148915 47337 25109 -155939 -53740 -261035
8693 -261035 -6207 139874 -138398 -333697 -61546 -138232 -90173 65890 212888 -118530 109213
8681 -116133 -10751 -168961 35118 -243614 -62081 49944 -30554 -135364 120474 304121 300083
8670 300083 298993 -145823 -102804 -130254 56600 -67551 -240376 -40200 -151950 -141392 164979
8658 -43729 -32071 38196 -378324 -24637 -133317 -441379 -38462 -43593 -209411 77827 -28610
8646 127176 -148378 70398 -117503 366033 -62791 -407483 -50157 -152976 392980 33798
8635 -144401 -157921 -88960 84454 -172676 -100708 -180095 -192512 -147490 52495 -46600 35749
8623 -333216 258239 -106956 -225646 73627 -236405 -17413 138080 138020 -230196 7459 36047
8612 36047 -144947 31983 10047 -161355 42233 -164558 149081 7751 -164346 133707 7840
8600 -256185 -176033 64921 37790 -141232 -10277 -180558 -102808 -78400 -79304 344577 39190
8588 45923 -50046 -8786 70733 -524316 65698 -148886 13456 182555 -320500 94068 -53428
8576 40835 217871 -61410 -81015 -247095 40364 94688 -144131 -179505 -203383 23730 -75749
8564 -270738 -323719 176161 39033 183881 176102 127392 123743 -106992 -17039 -128739 -259551
8553 -259551 58324 -5736 341949 -173537 -118692 145636 14139 -204103 63093 -233923 -71972
8541 119092 155423 -117339 -167838 89377 20111 -278423 -140856 -96817 -69791 -211478 -146501
8530 -146501 180683 -212 -76864 -91154 -41585 -77041 132271 -213799 -188221 47542 290293
8519 290293 2083 -132024 -114145 86532 -102364 -217030 -259880 21249 355968 81628 -116727
8507 -44246 111679 -100791 -212127 213112 452905 94469 -341516 -142161 64099 4619 -367529
8495 62124 75222 42694 -137343 90512 7977 -148647 -4584 -112073 362027 -137757 -1479
8483 -7361 -231183 -192999 -62151 -116085 282276 57432 290059 -134334 140711 241190 -219485
8471 160558 -50802 78583 -208954 -85205 24313 -14897 -70893 -286514 30492 -40312 -56515
8460 -56515 -42645 357853 174145 -107782 66468 -181571 55923 2786 -36616 -101264 194317
8448 89729 -115874 73143 -151225 168437 -55251 105586 -93829 -80057 89570 74436 72786
8437 72786 58252 130193 83859 -349417 -37591 -137620 -36537 -258437 -185176 -148415 -120525
8426 -120525 79892 -112652 -51191 -156519 91526 168961 372260 -133233 -15080 -346708 -171923
8414 -9928 43704 136668 -66990 -282755 208488 132626 -151573 231090 -241729 -123187 80642
8402 -108479 97870 -74383 -79451 -225055 -138868 63804 -98100 46871 -190042 -6231 -20172 -38148
8390 -38148 -16559 -219580 -149304 227987 -80962 167990 312825 38823 143629 -160587 -162468
8379 -162468 -117919 -41123 -308358 -35833 246295 240427 102151 -21968 205573 43941 -97061
8367 -53002 76769 -185042 -77411 -211619 -48405 81115 -130298 33528 42171 237340 -350706
8355 -349875 46242 -54773 25104 -22180 -4027 118874 -27634 -7628 101425 -4847 -194899 8241
8342 696 -3862 -364085 56755 -66682 -43198 -49294 -121445 -11915 174997 55689 -290188 63247
8329 170272 -154721 33648 -373793 272443 -67064 -77879 20501 -43651 27270 -200614 -251070
8318 -251070 32553 -20966 123049 -117417 -25070 -161993 144081 -105683 -59690 -165566
8308 -165566 22435 18459 41039 -224376 -78307 154297 -25587 -31938 -93720 18399 201631
8297 201631 98483 -158706 -34375 -247730 4940 206925 -67820 -175747 -221380 -55756 63053
8285 5885 158534 -114406 -42051 62227 -93004 125862 22645 -83072 -342090 -101214 -240547
8274 -240547 -250669 -163976 -22970 -307486 119148 152265 37848 -76669 194032 -100561 -95735
8263 -95735 -167897 -65371 406080 -84292 -245353 308247 79167 -10744 138445 -88155 -383314
8252 -383314 -26229 84908 -47135 105063 -51872 -238663 -113928 7021 -64810 -292259 348314
8240 -120052 24204 -123894 283232 -103137 -167575 -321794 -223745 -273695 269750 -88444 173809
8228 -51835 90745 -45400 -26829 -101616 53682 -96664 -50857 -114610 131742 -292427 -38954
8216 -122967 6189 207007 150371 239080 127563 292065 140949 -81679 -285126 78013 -66600
8204 -20204 -162184 -6691 -203375 249770 15015 6803 -463507 -80277 307747 51279 -115583
8192 -56367 221262 -80527 -98289 -151818 132301 39171 24450 264890 -67086 106994 144920
8181 144920 -125128 -189550 -189797 54156 182626 -96522 7210 -87798 -28713 -90458 17908 114222
8169 114222 -241090 -226750 -103538 431942 -185086 1453 -32193 -275606 -118343 -289134
8159 -289134 66076 60901 185385 -213232 20326 -73762 -203256 -150564 1238 -220370 -216564
8148 -216564 160379 88835 -2131 -114040 -178362 -365489 -117525 -2040 75574 -149112 -303574
8137 -303574 -65659 245756 -67596 -64421 -26257 91251 9128 28369 -175504 132053 116019
8126 116019 -61754 259867 -220797 -120860 274830 -156 -70423 -129857 -78338 53680 137457
8115 137457 -36118 170857 -287859 -7621 -118714 -23412 -765 163559 -50683 149477 483923
8104 483923 -57715 80441 123261 -58091 -149189 -83348 -159018 -202490 52790 194804 -113973
8092 -203704 322320 168109 -207554 -217593 -129982 222435 -56962 211301 -126468 -81589
8082 -81589 -281245 -362116 -41159 142656 -54904 317141 -88670 176880 19002 -22653 -43677
8071 -43677 131431 141183 -158031 -59409 -231775 57459 191172 25835 167488 -172705 -139525
8060 -139525 3152 -57701 103719 209915 -340926 -75803 11934 -146369 -167186 371832 311888
8049 311888 -87746 46511 -21978 56032 -33822 -47339 231495 64369 -263169 -205055 209977
8037 -184611 28926 154362 248786 -237672 -120744 -208654 214407 -140494 -124870 -257536
8027 -257536 282336 193799 -5557 51423 -345718 321754 -94879 -154726 -336612 50365 -234943
8015 93661 -15734 104707 108211 -93735 -3628 -171350 75531 61493 -38204 122731 120503 -68644
8002 -27567 260495 -104360 141981 -70989 -62016 -52006 -176829 113962 -70263 45924 -421884
7990 -239136 161969 -27767 -168911 -139712 129446 -91386 -134226 29226 -268255 -111619 -49419
7978 155467 -130533 406173 -359962 -239471 -52997 -218323 -301325 -27163 -112585 -102115 9086
7966 -36359 51081 63408 -187251 71545 -127572 7696 -16492 -201196 165830 43328 -278031
7954 37168 110466 -182729 -35332 79017 151970 -760 -14165 -188150 -56924 -226419 230006
7942 231069 341114 80010 147508 32060 177211 191962 -212211 -369206 -181789 -159835 -48306
7930 -176775 -100780 -308474 -177149 1760 -301945 -85115 75755 -19705 13614 -48156 -173587
7919 -173587 -288268 3550 -66202 82080 -141517 86605 51680 -82550 -203208 -81664 18954
7907 -98528 -254408 -257409 57147 162679 -5216 -161701 -96661 -66474 -57728 -222314 -172911 58553
7894 -263700 45015 -303578 -222626 -213813 78113 -166622 -77075 -274074 -276151 202646 138432
7883 138432 24264 -51936 -257868 29274 64074 1692 -467174 -137480 30123 -219465 161877
7871 36573 -197195 -11869 81132 -82345 -44258 199456 -178631 85426 -12255 -93706 190229
7859 72191 111013 -131517 126673 158917 205173 -194639 151017 -158969 311460 135404
7848 296667 -309049 180986 -134085 -224732 233 34173 221773 88858 7290 -118489 -266700
7837 -266700 -203721 -98646 -194056 20995 -295564 8499 -174496 320038 79400 -246644 25369
7825 583 -9152 -183613 109971 -22710 -73865 29512 72779 92310 -36643 -229534 45757 -155592
7812 38522 2936 -51263 -59205 42417 -267683 -152941 -80637 -28331 -84340 -19193 -42071 -60593
7800 -60593 9450 -159146 -3989 54283 -184742 16533 -143939 -70855 179697 6193 -54693 -108115
7788 -108115 57151 -123804 -245460 146462 210010 -194716 -101906 113305 111627 96436 -174775
7776 -133638 36227 -418529 -315962 -285863 -11157 -257134 314307 202988 -88506 32020 132485
7765 132485 135528 100548 -194019 14635 -164105 177556 -101885 -80626 -55922 20453 -195295
7753 -134216 150250 27701 -156117 -133981 -217521 39049 113771 -148570 113976 -140413 252106
7741 -231781 62419 -142497 -74255 131409 170513 -339687 91729 -150805 199560 40470 126038
7730 126038 1329 -278403 42218 254984 88003 -142876 -54880 -152702 145907 76054 239044
7719 239044 -182962 -173086 214593 270867 -59570 -197149 -113546 143145 -128740 65072 137772
7708 137772 -184218 -147637 -136838 202773 -168797 212426 -287134 134703 21119 -19583
7697 372489 52112 -157398 -42167 67031 -149196 -271286 1066 26106 61124 -43106 -294080
7686 -294080 -126798 142903 -150087 -93075 -182886 23198 139684 -140017 -212495 335431
7675 -66642 -303688 -175769 -104592 -297434 -230479 154064 -135493 -259852 -32020 -370073
7665 -370073 38154 -199376 257851 -160333 -128547 -140247 -13623 -167806 -93263 -72891 -30736
7653 224299 -180724 -194080 -178511 -27335 193427 98584 167805 -119360 -55848 505645 209975
7641 -39463 116414 -60274 -116231 215649 -168136 146533 171354 -127237 22644 -143370 143557
7629 286493 -44795 -89534 -255671 7699 190776 -184911 -18827 22768 -140534 16883 -33056
7617 -50590 -49319 11907 -22355 -161455 78357 -417546 7892 -238194 -183241 -63171 -286654
7606 -286654 -140753 -183682 70522 56693 46775 68182 179137 -145976 28878 -70226 -101372
7595 -101372 -92330 -323117 299382 141204 -9794 100878 129837 217494 -232536 230595 38994
7583 -34528 -98702 -96528 137433 -146754 -35256 -1684 157288 -139958 -36065 -325952 192773
7571 -196501 -17726 8853 34258 -198057 -230951 215296 -38384 148071 204856 31351 -175161
7559 44980 240426 -249757 -74397 249901 -250230 -221821 -14712 126842 -80028 53098 -4824
7547 181977 79837 -67894 -131116 -504481 -227497 138776 39392 125131 263544 90368 79643
7536 79643 -20734 52964 423422 220461 -368473 -227885 -97323 178732 -12875 -431047 -165484
7524 27319 -39114 -160477 -215160 143805 -131533 164213 131730 183680 -179712 -100323 -215908
7513 -215908 22007 -47193 -4888 -100819 33856 -392958 -7465 -89989 -108334 -78473 212355 -180450
7500 -252006 -117940 -181679 -181290 -137755 -290036 -96704 272340 -70406 -119159 -347125 -78465
7488 -274481 124047 -150775 -84408 311211 -344172 -167660 -2892 -384315 -67616 151044
7477 -29170 -154813 -44006 23117 145340 -114150 -3947 -114669 -36549 305287 -236435 -58014
7465 -121309 191368 143362 -135905 70210 190907 142230 -157321 398056 -167901 -145139
7455 -145139 227998 238898 78124 190335 -275209 107447 -134038 -192671 -203905 -60958 114796
7443 -2891 -68446 138282 85120 71400 -85149 -9574 -115753 333101 65996 266785 -234830
7431 -230712 -78463 120791 386374 -79720 -44253 -346641 -424881 -188441 232041 180818 -190886
7419 -47265 67190 110865 376703 -178348 152169 160131 -96599 -126754 43067 -289543 -43539
7407 -328248 161086 282268 -71274 -80150 -335354 100485 -41612 144242 120559 -172661 132619
7395 128240 -114901 56864 -353594 78860 231649 -89283 248485 130000 46440 -297495
7384 -64632 205512 -48561 89926 102652 -307482 84438 264235 -87176 -113327 151338 23530
7372 113553 -68052 -169944 -39955 -82061 130652 -278415 195139 157712 161003 -209820 -8546
7360 -67883 -24735 154548 -34842 15063 146535 -198813 257400 131116 170240 -173457 -72929
7348 -11903 6688 -136009 -173803 -58525 -125722 -3243 -48347 146394 -9335 -295625 -32634 112929
7335 44183 -5128 -150994 84810 -20233 222638 142616 -116210 -288558 -116431 567640 146709
7323 -227382 -234987 202446 -145615 -149380 -359277 -119109 53724 154435 81717 -310015 341983
7311 221453 -364949 178165 144919 130906 29733 -86088 65088 -200180 88534 -511065 -238755
7299 -80900 -182349 -62854 235486 53805 -24278 -72472 111421 49983 -197648 -229731 -96951
7287 19756 -35645 42889 -193673 270731 -49087 -51980 31047 -55085 59156 -191053 -191630 -112127
7275 -112127 260527 -217120 143182 -6101 164619 230612 313545 279149 7434 -348878 27982
7263 -170721 -14965 -205797 -127180 -17517 65564 -168170 224508 177242 216885 -140064 -15886
7251 69011 -51230 -173193 233824 -261747 -139339 317118 137522 255216 -48496 -190409
7241 -190409 -78800 117651 -270459 -335044 39460 -420794 -5024 -219810 -189350 -121566 -110236
7230 -110236 210832 164581 -26678 -90087 -176786 67658 -406197 86778 184404 -438055 -134882
7218 -109403 21336 -179736 25500 137664 -222844 -63572 -41001 -337403 262567 -107925
7207 94048 -192867 210172 155086 -237016 -93348 -77778 130032 -12822 -51172 11661 199287
7196 199287 -111363 225507 -85272 -657 -93316 32907 77501 213699 -56374 -79203 -105874
7185 -105874 83544 -493965 -191918 423230 -82544 120606 -96380 -51990 165262 -168474
7174 341581 -77219 -74876 -17577 -33684 -142674 210932 -117572 244902 -281171 19760 70068
7163 70068 -16610 31800 -51100 -182676 7279 72213 -103641 163562 -209502 -50242 -183872
7152 -183872 106271 -143963 -78931 -46253 60607 -336003 -310228 -116836 -9332 -186925 -154171
7141 -154171 215782 2235 -159387 419974 -40194 179968 -119163 56818 -145 -141606 -77457
7130 -77457 144072 175896 161509 212082 21104 -157298 232234 93878 -200872 -139997 326178
7118 170233 281915 -173974 118807 -50915 223790 245183 -209254 -9849 74510 179842 720
7106 190380 -147126 50872 -9183 -40245 71099 -61000 -244930 -116707 89177 -220050 324909
7094 107546 -24310 153932 -220717 -117678 115235 75584 -266106 130936 -298921 149296
7083 -45776 -62901 -131036 194165 -412674 202149 -383043 -32953 232550 253809 70184 50218
7072 50218 225847 -208134 -283194 318245 -12464 -71120 -173062 47820 -10375 28780 309047
7061 309047 -214043 -100617 22546 -71097 47509 -293972 165464 138066 -16438 319588 -66889
7049 60705 253311 -108561 -237725 221540 -53394 99479 -357282 -78043 -17172 425727 -43966
7037 61966 65340 -326743 -273905 41156 -349202 -5756 -141700 -46515 -210970 -15587 -47167
7026 -47167 125404 -132049 -204541 -484136 -141662 52747 -206200 362954 42679 120420 -182849
7014 -178844 -174521 -159928 141717 -86048 95799 -41022 -83897 409540 84731 76032 -142203
7002 -1504 -124902 -36731 -262469 23848 -252021 -55104 87139 229623 434805 273804 -232535
6990 80590 -124857 237590 -105934 -13868 -10885 -39329 -405047 -129594 137979 145260 -177400
6978 -212064 -5365 -196251 -236813 110051 -94485 359369 -176491 37962 254226 308407 -176572
6966 37164 155940 295432 52025 -15205 -7178 23862 75871 61015 -12686 46555 -216022
6954 193864 23210 -235271 34068 29215 -122259 -195739 -18080 -45579 -107332 71500 133384
6943 133384 117729 -480823 162789 -36477 209378 93159 277297 82824 350306 -36043 -176244
6932 -176244 -113023 -33472 -491390 -11638 -69479 -303979 -245384 -207775 -44909 25019 -6275
6920 3780 -119929 -17302 3079 -128211 -128574 -78702 109955 -101463 -50116 -34320 -60653 -22098
6907 -173026 -184252 -177020 292061 -297058 -217172 -348924 111678 -152093 327032 68604 -284393
6895 410482 -34305 193273 -7552 -72922 -85102 -71187 211308 -84723 -103945 141004 114027
6884 114027 -438202 183914 247004 163366 36011 -130995 -465247 230107 -105144 36050
6873 -330664 92223 109629 -195134 58726 -7542 268261 305153 91003 136061 -103847 -157099
6862 -157099 82937 -298830 2652 74599 -304114 -280385 82082 -81372 51947 302967 9885
6850 -101922 117642 -126285 -92293 -175507 315243 -19397 -135678 90227 -61146 -102871 6854
6838 -44670 74992 7865 -169446 28328 -305058 182931 125052 102468 35109 -137107 -375456
6827 -375456 88809 37983 33265 117083 -138137 54189 69434 -32699 -12640 149341 -523800
6815 -144810 -251914 -158873 23540 249070 105873 -279877 -38413 -164189 -7746 -231394 214901
6803 -161485 -226700 110391 -150147 -224105 46804 -48635 150230 65250 1039 -121498 -235276
6792 -235276 -117905 -134331 -365 173885 -771 80284 -61400 -318084 -115575 81771 146111 -35148
6779 -382787 12969 -25724 108993 55311 35339 -198562 75353 -244935 -90024 -230973 -26935
6767 152015 240569 387694 -253721 -87384 -76333 104319 -75480 -171528 63622 20711 -125924
6755 -118586 68481 -269074 401244 -11809 -153205 -70996 29991 231168 219232 -369436 59570
6743 -57939 -253534 -130795 35003 -241922 164969 -44448 328235 -23561 -67984 -170111 -93542
6732 -93542 113955 10730 333707 304749 14476 105437 2120 -116089 78240 182215 -309688
6720 77804 270982 138533 -167381 76509 -186537 14943 -81414 -169266 138450 241655 16483
6708 321237 -217734 -602724 -38099 -221562 11477 -82172 185054 98969 295095 213229 146713
6697 146713 72533 98222 74190 99798 34853 171191 211367 132916 -52852 -104648 -36785
6685 -108230 111383 237582 160234 -223111 348106 -198825 208974 129235 27051 -59874
6674 -31458 101751 150160 275317 -120125 -179312 87222 -63215 199204 4046 -204692 -362470
6663 -362470 -222161 193889 78854 365190 -217294 138157 -166927 80035 -141338 267239
6652 -41205 -84986 -159420 -19944 -84569 107945 159324 -101206 -130003 -213634 109880 68890
6641 68890 -301645 109787 18019 -42013 -99281 -15941 -217935 239072 -376524 -68420 -161945
6630 -161945 159460 4587 25453 252736 149459 40768 -156418 80409 20447 96498 -213730
6618 8186 -41857 -132823 77315 -49647 84812 -166126 110098 -175496 -264326 -474280 129109
6606 -31071 -235468 122304 102477 148513 -123073 -153382 86850 231672 34701 114740 215761
6595 215761 -227078 34534 -47329 -361079 -210923 32611 -14712 -127743 148535 -175241
6584 -134859 153154 -125588 -188304 262192 -243591 -79720 64669 -96292 -171674 -12117 122318
6572 -136622 148240 -140181 -43033 -268128 181217 54577 -171850 -196057 239986 -62705
6561 -204711 -83072 -126570 -236846 -89215 124444 188491 24524 -38483 57068 -63902 -120922
6550 -120922 -55260 4650 -101562 155396 48363 30230 239130 -160911 -277838 -75337 33697
6538 42476 182546 39428 -58393 8420 -298124 -17168 -104306 -299282 -439005 -177799 74204
6526 -14496 112987 -183721 136153 26496 90382 -139744 -9675 74293 -175112 -236673 293700
6514 -51066 -150371 -84618 170747 152606 8050 190842 80820 243773 -252033 88109 -127043
6502 -65888 -113717 -309493 -56027 -230571 -118501 -228527 -68199 7564 145459 -314986 -23571
6490 213140 50864 -27353 95436 -165529 -234335 215233 101522 -192381 -175228 -97728 172807
6478 -101232 -118920 -84717 26419 45191 -204407 -91995 -74711 -18914 36590 228446 113982
6466 75811 73567 -156122 -142216 -258284 -88824 -123224 161196 306099 7700 255025 23602
6454 149900 -146907 73287 -63367 -115365 -209205 79075 -150771 -108859 40364 121351 -142241
6442 -156382 16347 107902 370638 -148424 -229666 -70104 1211 -35382 45544 -259172 -173630
6431 -173630 72261 262063 27424 75511 -63017 260820 -79243 -104541 235431 -91017 -17938
6419 45704 56176 -152854 -265326 -153266 104923 25887 -165596 -177566 -42277 -310694 34212
6407 22064 -115379 270889 -295593 -298505 2362 -145393 69545 -266589 30778 3926 -72890
6395 151972 65653 -46337 150146 -267904 -137261 -32325 108721 67341 83697 -62658 200707
6383 302825 -76248 293716 76661 -6182 163242 -1588 -360202 -127246 -292653 18372 9989
6372 9989 -335915 -2779 -156200 -194148 -136594 -108804 244380 -87347 -62094 -78529 383511
6360 198982 -195493 169832 -156406 47277 -95354 152200 95971 282464 -309913 -60357
6349 3190 -176081 41603 10626 -209675 165495 163678 162549 -117236 -80278 114611 -225546
6337 -329920 -26076 -69727 100348 -86615 126488 141637 -341040 -8881 -213214 -293958 15616
6325 167501 -163009 67349 -365724 102970 -172518 -168515 247755 -29217 -139638 -25804 -69851
6314 -69851 63157 -184102 183461 250822 -140802 -117 476157 -84355 -301878 -87007 -10705
6302 252602 21240 151635 310771 -150258 -238367 -4402 -97474 -105939 95187 -140742 -160124
6291 -160124 -88264 30914 171205 -139971 -224894 123930 67276 86412 58456 67568 -48926
6279 316738 -168484 67864 223621 -213481 -162741 -36094 218853 6613 30251 -17860 24653
6267 78876 -145442 -135927 173065 -238131 -171516 276 -319499 226312 44846 -359517 -31890
6255 -14078 149248 -37118 69326 31173 288322 106198 -11997 -57368 88167 -224236 188892
6243 173586 2662 228436 27394 190975 110586 71115 39903 -15577 156385 -175676 53699
6231 170249 -222451 148331 -29449 16127 118102 138450 -332351 101397 107747 221715 223822
6220 223822 98569 -195614 57685 245347 -173644 -133610 21819 296860 175457 -308658
6209 -26571 -159362 -193624 225788 -227026 -523538 128867 88090 -40450 121402 -328548
6198 -228660 -249839 222825 17194 4296 -12082 192318 -5059 110205 31989 -117770 -190442
6187 -190442 88759 -33858 -125697 120690 -344691 -116148 -92624 155479 -164452 75263 4783
6175 151124 201014 -1516 91795 -169179 -63257 -48629 -123810 15564 133753 -225237 51264
6163 149649 -5773 -148597 -31978 45803 146601 -70269 -214795 33575 -172276 -185432 -14172
6151 -18432 89898 -62803 -150804 4496 118377 128324 23932 150480 88235 76176 46931 2047
6138 -31460 2577 -71535 -8857 214247 90046 -191038 -106433 43917 97639 -83961 257728 96095
6125 -31066 127632 -63091 -190367 197637 137579 49712 150879 -4058 -21495 119815 -445107
6113 56362 218113 -43739 54776 -18282 -111850 -73287 9857 578 -92169 120515 -119286 75225
6100 121151 95598 -78510 -168866 -184905 -280677 209283 205814 -312589 -29989 -330693 235522
6088 -288313 -251991 -477829 1397 -236817 -318318 26300 -264859 -212942 329417 199760 175711
6077 175711 129638 43359 -61399 -22707 -10574 -210489 104073 145716 249602 123959 243523
6066 243523 75876 -71632 242919 26163 -62595 48289 -427981 15241 -159091 80125 213276
6055 213276 -28040 301241 -107208 73853 -85295 60423 -46032 -273302 -145472 111550 206352
6044 206352 69681 -147639 -261757 -103954 -176700 -89492 -29912 44235 95057 168817 267684
6033 267684 -261591 -65834 113648 446532 -236942 141915 94488 -192332 -110402 20 -121367
6021 -32524 -111847 -257235 -113444 -72453 233165 -58094 6167 141782 12559 74272 -51783
6009 16786 -121996 -130870 -145839 -58698 -43338 283131 42232 237444 -63408 28889 134078
5998 134078 189913 -10943 34730 -249627 -56516 262170 3463 60268 55853 256481 361949
5987 361949 293455 -79973 -67085 -7556 -71258 -83811 247732 178272 -328549 235974 -282940
5975 53586 -69610 396651 -65619 -199654 121338 -20413 -130635 -83760 190694 100021 22397
5963 -70696 -6504 -33685 -61887 -242317 122566 -33172 115019 61528 175480 176541 336575
5952 336575 66591 -19305 -118523 98379 145186 274777 20998 93402 88391 82371 -13411 -145912
5940 -145912 76124 -22737 8917 -19343 -31602 -81364 -140910 105255 -379407 -128270 -78046
5929 -78046 21982 111087 -18397 15124 -117068 209746 136200 32609 243758 43650 6632
5917 14860 53482 139045 78123 -118826 -86793 136058 205652 -131315 -217088 63750 -234174
5905 -29188 119480 -115274 67681 -8207 79191 264529 -394634 -164817 -139016 -18845 -219493
5894 -219493 -205407 -75168 -102974 -193431 -35435 -253983 257051 118637 59492 80382 261639
5883 261639 73478 535 3764 -213306 109111 102808 -57997 -53829 51603 80794 -101929 173827
5870 -89106 -48256 123146 -232512 -96972 51015 105614 145292 74161 177935 163796 -49172
5858 57345 -84447 312493 -81015 -96599 -113015 -266728 67528 -24444 7030 -3474 -111429 -231048
5846 -231048 35120 98626 133881 -163020 7106 -398356 -116123 127813 102426 -174357 -20120
5834 -167438 -181159 1126 11006 -97357 -198696 86917 -64015 -67426 27538 -76741 364203 -67446
5821 -22793 -67167 35842 -54021 -197595 332412 -240843 -193921 -25619 111933 187122 133746
5810 133746 155818 238916 -170215 147910 470595 -11563 12287 19155 10356 -310015 278100
5798 132487 -33206 -192763 -9643 -275685 -11853 37063 -236444 -243967 -97466 227181 151358
5787 151358 -51894 -21449 -129519 112631 -13349 -99358 -425041 -31701 188392 480403 21686
5775 61585 -157310 -60936 85617 -203038 228175 -88493 -333823 139229 -79138 -55713 -39228
5764 -39228 112472 -62528 -25817 -154517 -176998 -16803 -101583 239530 -14896 -109500 77697
5752 177230 -185407 -158345 -25868 -8490 -58782 185085 103319 27466 190266 249061 120900
5740 11361 335703 136791 -26706 -107796 -107539 -21156 124293 157443 18315 30691 20732 32425
5728 32425 -108553 -96101 49499 333965 130275 38000 -22961 -186371 79575 -286011 81754
5716 -23342 119131 -49272 65098 191745 -403708 54355 -60319 124191 177376 6279 50583
5705 50583 -41382 5454 -64138 23418 270231 123417 -22669 91014 -190444 189369 218207
5694 218207 -199541 62949 224319 174276 -193534 2649 -169601 -192218 110926 1160 159099
5683 159099 38698 -382368 171288 74494 326501 25257 226946 53987 9931 -216891 -18171
5671 121906 -50238 -13848 91479 79291 49192 -37439 -82710 -36490 130992 -86170 -101314
5660 -101314 231528 -151434 -84911 -4921 80498 -92206 107365 128221 -24383 -196532 -263741
5649 -263741 156823 158761 69917 -246663 -54596 108991 118877 77763 101433 332691 -167349
5637 -260041 -37515 -152930 156021 143156 -58634 -4612 -62170 -136665 47382 -46901 6535 -156248
5624 -296982 280013 -118149 -278241 8507 101431 129054 -52435 -66812 63405 56400 80146
5613 80146 220553 -412844 -266347 -214777 -143162 -382183 22506 69286 72881 -53139 -238153
5602 -238153 -135097 -259410 -291653 -81129 -151440 108427 94050 -73730 -73529 183955 48690
5590 -19983 -210602 258271 -220811 10020 -137180 -60265 78020 157754 86176 284356 -136930
5578 -69864 -214726 136135 90202 -234548 -106384 -106730 248638 -91535 -94102 -96709 231740
5566 44977 298630 439665 31884 -110433 52124 301419 -8371 112551 70776 107177 -50141
5554 -4948 -163162 149473 -157529 11714 -281171 440258 154366 -44099 13427 33029 24166
5543 24166 -136892 274401 233143 236736 338299 166846 -134085 70015 20491 289949 267316
5532 267316 149719 25576 260581 -159050 -69413 -317266 200575 190780 296717 -39795 194953
5520 -114636 -165198 -141586 108651 -68755 54111 89558 192583 96148 -162919 -35864 242472
5508 -31681 94496 -188586 -146882 178483 -97751 -191575 -89892 -77324 50625 89131 101728
5497 101728 26235 67140 56844 -224574 176365 -289946 191704 221668 93393 -242926 -239437
5486 -239437 291789 47935 -209481 123259 -133664 2738 -52321 -907 -91741 549872 -264902
5474 -210161 171825 -11074 -73423 318934 254546 35117 -78705 149053 135362 114423 -161578
5462 46525 122100 -33796 109328 143502 -74092 -85978 204721 -112450 -172810 -147650 -63792
5450 -61617 -496886 6625 63433 259970 194023 -76267 55636 99805 98550 316404 7950 -145597
5437 20581 -150463 60503 -12927 136837 -23795 -47053 -230402 -96836 -216042 145276 -31438
5425 138402 -185436 182293 -367545 -45716 21963 -135895 21879 854 -19751 -91340 209258
5413 75873 -107470 -95974 -44833 203954 -105458 -28037 -152093 -28268 21888 206346 36848
5401 -292149 -223526 -157003 116297 37034 164756 19743 -8249 -176066 39406 101016 215706
5390 215706 151445 -22363 137347 -45598 176537 248148 68860 -85955 160992 85536 260119
5379 260119 -37689 102505 -155730 -23211 -376940 -88500 -156443 -102216 -303619 -231833 -69929
5367 53737 145340 43140 -406501 -140916 13812 -2506 97326 46868 -55577 -298556 302365
5355 -11902 167572 119431 116803 -170373 58497 -138554 265069 -219612 -108680 -51020 -228486
5344 -228486 123953 -45050 279019 -210287 -95143 -65672 100769 280989 -285860 234948
5333 -182658 -123693 131048 -18475 1851 194514 -7599 135750 -181342 173507 89981 -123617
5321 157214 1250 70128 34329 184979 -96209 -34048 -4238 473633 -179501 265994 49071
5309 -341394 59154 188363 96000 -145961 119846 34685 -56525 -21998 -57605 55206 111828
5298 111828 -76406 -28611 -58673 -50820 -241915 131014 121150 -48608 -96488 139337 211242
5287 211242 352839 230246 105375 -10255 119060 -305483 53452 -222599 22534 29719 -16972
5275 136542 -21782 100247 -299398 -170650 212589 -92646 131908 -68331 -107306 176794
5264 134985 4751 -292643 -609 170378 73670 -241272 62371 36467 -375283 87494 -296785
5252 -376162 180465 -39799 -122388 -151926 1679 89132 72003 93727 19011 28810 -162945 157175
5239 -17177 -45591 -136253 -133337 133088 44380 29024 173483 111201 -108969 191539 65918
5227 47661 -145915 208147 188018 50662 -6573 7916 86834 57813 -12854 80509 53418 -84836
5214 -106777 134699 -279611 267009 -319026 274849 -311916 218390 -262409 -146967 -575
5203 -26609 122115 215048 81815 -78027 77086 -22061 -229426 -62105 -27298 226998 174949
5192 174949 224096 62831 -139206 -113393 9090 -41967 -85829 -152939 -15950 -68625 -5509 148672
5179 45499 365879 136487 159305 -172692 -85878 45068 189836 266928 9799 255769 77048
5167 58350 -158184 108241 -191436 4042 -95307 -83537 145470 205558 -159390 -48837 -327135
5156 -327135 -39821 -63295 -47568 -44587 91367 -282633 -344653 -61875 -163525 -288897 102280
5144 186671 -136813 -98256 -70223 -142840 140979 205557 230592 43379 50807 81959 71359
5133 71359 -172026 -246473 -18373 -53879 -191348 -9312 -52183 24597 -138353 -334977 87001
5121 92997 250397 -184635 207231 203590 -64220 80770 -89049 181767 77119 24804 -103133
5109 174453 -207034 174581 -61126 -103385 -127403 67177 330031 228077 -18262 114155 -138242
5097 208750 -64278 -26707 -20427 -215996 -85084 70683 163929 264958 287608 -90208 -120096
5086 -120096 79787 -264243 33951 120303 -189214 75261 71898 193190 -145090 99394 -175732
5074 -128295 -112656 105711 283291 156446 71387 134362 -171857 105706 -307951 -87249
5063 -167977 276224 -220437 105127 -172931 -68698 3270 -226329 -313944 63524 -132756 -276351
5052 -276351 -31614 23279 -111101 436449 130968 24052 -103255 186477 439600 -191676
5041 377512 -123235 -68628 387671 -73004 177991 175962 -226273 -261959 -17284 188306 -323516
5029 -48795 -281719 -165598 142957 -18648 -258205 3891 25055 -42329 219825 -33564 144620
5017 90295 36327 226027 255766 -62221 1641 92909 -224049 -53768 -28106 -246165 -110754
5005 105750 -279326 -79525 313501 -38961 -80223 -86223 -60312 185845 -317921 -5540 45075
4993 -57385 -160815 265812 -95745 7752 8409 42517 202451 -134984 139312 -322272 134385
4981 230856 233542 289641 298296 154573 -125220 -109228 413538 -39224 166498 -117117 -139864
4970 -139864 -208070 82833 -75626 -195744 274778 246339 123906 -12325 -50805 2550 -130099
4958 -46484 172923 -139699 267508 -47053 -36678 -9749 191102 50829 194790 -79645 -113646
4947 -113646 285977 -50858 312074 227882 161991 -33796 -62804 224594 -47863 14161 -10649
4935 -12090 36771 -271974 -209982 -311030 -18920 -71641 -4161 -12165 -142479 -90632 -98215 107887
4922 -189188 -346293 -93230 -484233 97090 -313813 -225831 -70654 184754 426007 -33743 51802
4910 -34907 257572 -117839 -270168 111891 -54405 -389654 169388 253735 430582 137717
4899 83838 -142079 263937 -135405 -136685 -4896 -236041 72621 110661 -165147 544193 24604
4887 -5621 91526 100065 -106981 -41193 -40983 -105343 127958 49375 63871 109876 215917 -78347
4874 -207554 157959 248507 232099 43848 -317311 290636 241299 -133063 7698 -56851 -48510
4863 -48510 -166169 122801 80640 -89039 -67927 -117066 -345551 10564 290221 -150053 -197293
4852 -197293 99748 4956 -75668 129960 -278318 144313 230691 313776 101169 -57996 -58131
4841 -58131 125045 363638 -150724 -235129 -54826 207970 262404 33553 32530 42775 -15298
4829 101555 -90318 -133476 -15107 187462 176543 92700 -108757 -98572 180965 191236 -7870
4817 -197658 -179560 -11078 222718 18975 -154622 82557 -351348 -105869 208745 -5116 1388
4805 -42222 -111244 -273174 26437 117098 216384 32904 297762 119953 121108 114258 193675 -134806
4792 218257 -225159 9459 -130924 -70735 177547 -103779 184681 92525 -113774 -191984 120546
4780 -181814 -192771 -28913 10017 -49775 249669 61711 -165433 -76351 -190825 79721 -98089
4768 -20434 -45441 -61851 137885 -177797 -214306 59901 -48646 190981 -40725 -229892 -30930
4756 -167011 -44324 63240 -124281 -50928 542737 140980 44725 -131992 -61466 304449 382607
4745 382607 106437 -213369 334439 189132 259236 -75591 69387 -24497 -152890 -68555 -57740
4734 -57740 -205186 -210215 222906 -262743 137780 167101 97260 43643 148674 -299886 -53257
4722 -158719 -302379 188066 -160603 -42944 -100119 33422 -274700 -320030 -151494 -51400 5974
4710 283952 -22073 98748 -90283 -151019 83137 87148 -52734 330145 -312277 9196 -6773 232486
4697 122173 167117 123711 -207630 -251076 -11662 -90164 178575 35289 100826 -107807 477462
4685 -78661 -114797 -19744 160776 -105631 13438 -97609 -217516 12323 20305 -47649 26792
4673 -392379 85754 214557 -87403 62543 106510 -108899 237040 -18626 -204727 -283771 396204
4661 -202601 387492 -92728 -541347 101721 36094 280541 143749 203734 314185 -264403
4650 118947 31527 -7544 -160788 -127423 -159826 46772 112873 -97000 81965 -213576 286478
4638 -101145 -183029 -6090 -169987 -65800 159206 -22755 34147 -337492 65602 -195127 -301562
4627 -301562 122746 -2515 167636 68013 261715 -159470 -35326 468528 -338180 168440
4616 -257982 -156830 206499 -34446 40004 -246048 275021 -126898 -261522 -60811 -126085
4606 -126085 -304074 196985 -81430 38282 -110800 -200479 -41680 24755 -167703 68216 -173646
4594 -47246 122370 14679 210800 50829 -143119 72481 -41082 19866 -259283 217988 333372
4583 333372 -189971 -46932 200713 148232 -273563 -8374 -136217 200445 -89184 93979 214349
4572 214349 110148 -6014 -136814 -108418 367098 -83661 126150 249831 84352 194265 279037
4561 279037 127918 119655 168219 119926 170139 106393 281409 -101148 -91369 27403 86062
4550 86062 56288 274428 152587 -109900 102517 148983 34934 113521 35614 150562 355850
4539 355850 264768 -19365 -81674 122389 -90908 -85414 138480 -146781 168782 5678 133510
4528 133510 40712 -268995 16608 -159815 107561 170676 18785 209318 77381 -246780 -70757
4516 -193761 63226 425923 218943 236379 280700 -188797 -63133 298940 322580 -47910 104857
4504 -195033 -16771 -64070 197077 260563 118681 -118892 190751 42512 33484 -18378 104282
4492 152280 146529 -32720 -245268 151277 -480196 35399 -163047 21839 152156 158815 60820
4480 287582 26582 -235601 -87572 -62478 11350 103837 73964 -121537 -180839 -98640 156198
4468 239086 13976 -224396 256550 275565 -40240 109131 -161388 68879 129593 87990 -53969
$$ [...]
##END NTUPLES=NMR SPECTRUM
##END=
