##TITLE=AC1758_VAR00030_9319999_5vkedlQDku
##JCAMPDX= 6.0         $$ Bruker NMR JCAMP-DX V2.0
##DATA TYPE= NMR SPECTRUM
##DATA CLASS= NTUPLES
##ORIGIN= BRUKER
##OWNER= Administrator
$$ 1.72 TOPSPIN		Version 2.1
$$ 2015-08-12 00:56:40.335 -0700  Administrator@X
$$ Compression mode = diff/dup
##.OBSERVE FREQUENCY= 400.02188249412
##.OBSERVE NUCLEUS= ^1H
##.ACQUISITION MODE= SIMULTANEOUS (DQD)
##.ACQUISITION SCHEME= undefined
##.AVERAGES= 64
##.DIGITISER RES= 22
##SPECTROMETER/DATA SYSTEM= spect
##.PULSE SEQUENCE= noesygpps1d.comp
##.SOLVENT NAME= COFFEE_meoh
##.SHIFT REFERENCE= INTERNAL, COFFEE_meoh, 1, 14.96076
##AUDIT TRAIL= $$ (NUMBER, WHEN, WHO, WHERE, PROCESS, VERSION, WHAT)
$$ ##TITLE= Audit trail, TOPSPIN		Version 2.1
$$ ##JCAMPDX= 5.01
$$ ##ORIGIN= Bruker BioSpin GmbH
$$ ##OWNER= Administrator
$$ $$ E:\/data/COFFEE/nmr/AC1758_VAR00030_9319999_5vkedlQDku/12/pdata/1/auditp.txt
$$ ##AUDIT TRAIL=  $$ (NUMBER, WHEN, WHO, WHERE, PROCESS, VERSION, WHAT)
(   1,<2015-08-12 00:56:35.054 -0700>,<Administrator>,<X>,<go>,<TOPSPIN 2.1>,
      <created by zg
	started at 2015-08-12 00:45:05.460 -0700,
	POWCHK enabled, PULCHK disabled,
       configuration hash MD5:
       21 0F 79 D6 B3 7B B4 F6 88 20 88 DB 03 48 BD 9F
       data hash MD5: 64K
       7D 73 59 20 78 2D 7E B8 C3 53 C0 EA A2 5B 81 4F>)
(   2,<2015-08-12 00:56:38.273 -0700>,<Administrator>,<X>,<proc1d>,<TOPSPIN 2.1>,
      <Start of raw data processing
       efp LB = 0.3 FT_mod = 6 PKNL = 1 PHC0 = 0 PHC1 = 0 SI = 128K 
       data hash MD5: 128K
       1F 1F CA 57 1F 3D 16 98 AD 00 AC 36 5B D2 9D 29>)
(   3,<2015-08-12 00:56:39.148 -0700>,<Administrator>,<X>,<proc1d>,<TOPSPIN 2.1>,
      <pk PHC0 = 269.9011 PHC1 = 0 
       data hash MD5: 128K
       7A 8F 0D 5D FA 30 3E 3C C8 B1 3C 99 1E AC B7 2C>)
(   4,<2015-08-12 00:56:39.539 -0700>,<Administrator>,<X>,<proc1d>,<TOPSPIN 2.1>,
      <abs ABSG = 1 
       data hash MD5: 128K
       11 F8 AA 5F D2 0D C0 29 47 BB C7 5E 70 D4 9B B0>)
(   5,<2015-08-12 00:56:39.632 -0700>,<Administrator>,<X>,<proc1d>,<TOPSPIN 2.1>,
      <abs ABSG = 2 
       data hash MD5: 128K
       9C 60 BE 4B 92 3B 34 66 CE E6 D0 44 6C DB 35 15>)
(   6,<2015-08-12 00:56:39.710 -0700>,<Administrator>,<X>,<proc1d>,<TOPSPIN 2.1>,
      <abs ABSG = 3 
       data hash MD5: 128K
       00 FA 79 90 48 F0 4A 99 3F CA BC 80 4F 9A C8 59>)
(   7,<2015-08-12 00:56:39.804 -0700>,<Administrator>,<X>,<proc1d>,<TOPSPIN 2.1>,
      <abs ABSG = 4 
       data hash MD5: 128K
       64 EC 88 31 90 5E DC 2C D2 D5 2A 7C 79 82 88 83>)
(   8,<2015-08-12 00:56:39.898 -0700>,<Administrator>,<X>,<proc1d>,<TOPSPIN 2.1>,
      <abs ABSG = 5 
       data hash MD5: 128K
       A6 BA 7E 87 FE 45 98 2B FD 24 DF AF 52 03 A6 51>)
$$ ##END=
$$ 
$$ $$ hash MD5
$$ $$ 72 6C EB 63 A2 6F D6 21 3D B0 4F 36 0A C0 C7 F1
##$RELAX= 
##$RELAX= 
##$RELAX= 
##$RELAX= 
##$RELAX= 
##$RELAX= 
##$RELAX= 
##$RELAX= 
$$ Bruker specific parameters
$$ --------------------------
##$DU= <E:\>
##$EXPNO= 12
$$ [...]
##$TP07= 0
##$TPNAME0= <>
##$TPNAME1= <>
##$TPNAME2= <>
##$TPNAME3= <>
##$TPNAME4= <>
##$TPNAME5= <>
##$TPNAME6= <>
##$TPNAME7= <>
##$TPOAL= (0..7)
0.5 0.5 0.5 0.5 0.5 0.5 0.5 0.5
##$TPOFFS= (0..7)
0 0 0 0 0 0 0 0
##$TUNHIN= 0
##$TUNHOUT= 0
##$TUNXOUT= 0
##$USERA1= <user>
##$USERA2= <user>
##$USERA3= <user>
##$USERA4= <user>
##$USERA5= <user>
##$V9= 5
##$VALIST= <valist>
##$VCLIST= <CCCCCCCCCCCCCCC>
##$VD= 0
##$VDLIST= <DDDDDDDDDDDDDDD>
##$VPLIST= <PPPPPPPPPPPPPPP>
##$VTLIST= <TTTTTTTTTTTTTTT>
##$WBST= 2048
##$WBSW= 25
##$XGAIN= (0..3)
0 0 0 0
##$XL= 0
##$YL= 0
##$YMAX_a= 6104430
##$YMIN_a= -11757417
##$ZGOPTNS= <>
##$ZL1= 120
##$ZL2= 120
##$ZL3= 120
##$ZL4= 120
##$ABSF1= 14.96076
##$ABSF2= -5.597422
##$ABSG= 5
##$ABSL= 3
##$ALPHA= 0
##$AQORDER= 0
##$ASSFAC= 0
##$ASSFACI= 0
##$ASSFACX= 0
##$ASSWID= 0
##$AUNMP= <proc_prof1d_extract.lims>
##$AXLEFT= 0
##$AXNAME= <>
##$AXNUC= <1H>
##$AXRIGHT= 0
##$AXTYPE= 0
##$AXUNIT= <>
##$AZFE= 0.1
##$AZFW= 0.1
##$BCFW= 0
##$BC_mod= 0
##$BYTORDP= 0
##$COROFFS= 0
##$CY= 15
##$DATMOD= 1
##$DC= 0
##$DFILT= <>
##$DTYPP= 0
##$F1P= 0
##$F2P= 0
##$FCOR= 0.5
##$FTSIZE= 131072
##$FT_mod= 6
##$GAMMA= 0
##$GB= 0
##$INTBC= 1
##$INTSCL= 1
##$ISEN= 128
##$LB= 0.3
##$LEV0= 0
##$LPBIN= 0
##$MAXI= 10000
##$MC2= 0
##$MEAN= 0
##$ME_mod= 0
##$MI= 0
##$NCOEF= 0
##$NC_proc= -2
##$NLEV= 6
##$NOISF1= 0
##$NOISF2= 0
##$NSP= 0
##$NTH_PI= 0
##$NZP= 0
##$OFFSET= 14.96076
##$PC= 1
##$PHC0= 269.9011
##$PHC1= 0
##$PH_mod= 1
##$PKNL= yes
##$PPARMOD= 0
##$PPDIAG= 0
##$PPIPTYP= 0
##$PPMPNUM= 2147483647
##$PPRESOL= 1
##$PSCAL= 4
##$PSIGN= 0
##$PYNMP= <proc.py>
##$REVERSE= no
##$SF= 400.020009734768
##$SI= 131072
##$SIGF1= 0
##$SIGF2= 0
##$SINO= 400
##$SIOLD= 131072
##$SPECTYP= <>
##$SREGLST= <1H.CDCl3>
##$SSB= 0
##$STSI= 131072
##$STSR= 0
##$SW_p= 8223.68421052631
##$SYMM= 0
##$S_DEV= 0
##$TDeff= 65536
##$TDoff= 0
##$TI= <>
##$TILT= no
##$TM1= 0
##$TM2= 0
##$TOPLEV= 0
##$USERP1= <user>
##$USERP2= <user>
##$USERP3= <user>
##$USERP4= <user>
##$USERP5= <user>
##$WDW= 1
##$XDIM= 131072
##$YMAX_p= 444158519
##$YMIN_p= -12351
##$CURPLOT= <Network HP LaserJet P1505>
##$CURPRIN= <$Network HP LaserJet P1505>
##$DFORMAT= <normdp>
##$LAYOUT= <+/1D_H.xwp>
##$LFORMAT= <normlp>
##$PFORMAT= <normpl>
##$SURQMSG= 1
$$ End of Bruker specific parameters
$$ ---------------------------------
##NTUPLES= NMR SPECTRUM
##VAR_NAME=  FREQUENCY,     SPECTRUM/REAL,   SPECTRUM/IMAG
##SYMBOL=    X,             R,               I
##VAR_TYPE=  INDEPENDENT,   DEPENDENT,       DEPENDENT
##VAR_FORM=  AFFN,          ASDF,            ASDF
##VAR_DIM=   131072,        131072,          131072
##UNITS=     HZ,            ARBITRARY UNITS, ARBITRARY UNITS
##FACTOR=    0.0627417313425164, 1,          1
##FIRST=     8223.62146879497, 2931,         -57948
##LAST=      0,             4945,            -57084
##MIN=       0,             -12351,          0
##MAX=       8223.62146879497, 444158519,    0
$$ Real data points
##PAGE= N=1
##DATA TABLE= (X++(R..R)), XYDATA
$$ [...]
$$ plain form
61627 459789 458804 457162 454853 451930 448521 444707 440564 436423 432830 430012 427657 425483 423700 422470
61613 422470 421224 419114 416047 412714 409563 406291 402387 397777 392760 387654 382651 377767 372904 368114
61599 368114 363734 359969 356478 352743 348778 345062 341822 338802 335784 332902 330344 328062 325847 323498
61585 323498 320941 318470 316752 316204 316399 316373 315503 313767 311389 308719 306303 304512 303067 301442 299717
61570 299717 298502 298074 298199 298777 299946 301381 302229 302078 301484 301225 301526 302266 303393 304817 306314 307909
61554 307909 309911 312264 314300 315530 316305 317298 318672 320131 321464 322611 323405 323721 323772 323963 324530 325522
61538 325522 326910 328472 329783 330695 331716 333588 336441 339506 341669 342338 341889 341295 341192 341281 340864 339777
61522 339777 338473 337307 336240 335343 334999 335368 336065 336605 336860 336892 336725 336467 336234 335761 334546 332657 330955
$$ packed form
61627D59789r85j642k309k923l409l814m143m141l593k818k355k174j783j230
61613D22470j246k110l067l333l151l272l904m610n017n106n003m884m863m790
61599C68114m380l765l491l735l965l716l240l020l018k882k558k282k215k349
61585C23498k557k471j718n48J95k6q70j736k378k670k416j791j445j625j725
61570B99717j215m28J25N78J169J435Q48j51n94k59L01P40J127J424J497J595
61554C07909K002K353K036J230P75R93J374J459J333J147P94L16N1J91N67R92
61538C25522J388J562J311R12J021J872K853L065K163O69m49n94j03Q9m17j087
61522C39777j304j166j067q97l44L69O97N40K55L2j67k58k33m73j215j889j702
$$ plain form
61505 330955 330187 330271 330734 331347 331945 332186 332039 332128 332952 334031 334465 334194 334154 335220 337437 340171 342587 344007
61487 344007 344293 343922 343379 342614 341458 340434 340554 342227 344782 347267 349357 351339 353503 355753 357653
61472 357653 358752 358963 358659 358296 357933 357308 356318 355202 354224 353394 352616 351917 351372 350935 350536 350302 350503 351193
61454 351193 352018 352501 352535 352452 352623 353120 353870 354879 356188 357741 359477 361367 363144 364256 364475 364456 365275
61437 365275 367365 370225 373146 375891 378695 381923 385733 389744 393110 395298 396741 398304 400203 401923
61423 401923 403144 404051 404742 405051 405206 405932 407512 409283 410477 411125 411764 412649 413545 413888 412920 410207 406329
61406 406329 402580 399627 396960 393996 391046 388713 386888 385015 382906 380769 378799 377262 376540 376501 376281
61391 376281 375292 374031 373181 372479 371348 370294 370521 372202 374139 375353 376208 377655 379990 382757 385466
$$ packed form
61505C30955p68Q4M63O13N98K41j47Q9Q24J079M34k71m0J066K217K734K416J420
61487C44007K86l71n43p65j156j024J20J673K555K485K090J982K164K250J900
61472C57653J099K11l04l63l63o25r90j116r78q30p78o99n45m37l99k34K01O90
61454C51193Q25M83L4q3J71M97P50J009J309J553J736J890J777J112K19j9Q19
61437C65275K090K860K921K745K804L228L810M011L366K188J443J563J899J720
61423D01923J221R07O91L09J55P26J580J771J194O48O39Q85Q96L43r68k713l878
61406D06329l749k953k667k964k950k333j825j873k109k137j970j537p22l9k20
61391C76281r89j261q50p02j131j054K27J681J937J214Q55J447K335K767K709
$$ plain form
61376 385466 388061 390843 394088 397629 400886 403445 405464 407328 409239 411409 414158 417299 419866 421171
61362 421171 421875 423208 425300 427153 428272 429439 431638 434951 438843 442916 447015 451062 455288 460435
61348 460435 467330 476137 485942 495083 502220 507438 512082 517135 522108 525941 528586 530918 533377 535645
61334 535645 537610 539647 541684 542848 542439 540653 538031 534821 531229 527715 524613 521885 519532 517733
61320 517733 516258 514301 511408 508220 505863 504818 504778 505324 506350 507997 510502 514095 518824 524528 531010
61305 531010 538173 546075 555076 565702 577862 590230 600966 609111 614753 617896 617959 614692 608855 601540
61291 601540 593360 584669 575966 567557 559323 551347 544341 538825 534255 529618 524694 520145 516577 514098
61277 514098 512689 512409 513202 514966 517833 522017 527393 533534 540093 546790 553129 558576 563135 567393 571940
$$ packed form
61376C85466K595K782L245L541L257K559K019J864J911K170K749L141K567J305
61362D21171P04J333K092J853J119J167K199L313L892M073M099M047M226N147
61348D60435O895Q807R805R141P137N218M644N053M973L833K645K332K459K268
61334E35645J965K037K037J164m09j786k622l210l592l514l102k728k353j799
61320E17733j475j957k893l188k357j045m0N46J026J647K505L593M729N704O482
61305E31010P163P902R001J0626J2160J2368J0736Q145N642L143O3l267n837p315
61291F01540q180q691q703q409q234p976p006n516m570m637m924m549l568k479
61277E14098j409k80P93J764K867M184N376O141O559O697O339N447M559M258M547
$$ plain form
61262 571940 576945 582348 588253 595136 603755 614719 627767 641463 653868 663636 670494 674824 677133
61249 677133 677897 677617 676766 675618 674061 671572 667604 662133 655769 649233 642852 636644 630649 624965 619618
61234 619618 614660 610269 606582 603501 600891 598892 597801 597685 598363 599789 602254 606050 610894 615749 619374
61219 619374 621265 622035 622711 623727 624851 625994 627595 630086 633354 636913 640249 642805 644091 644203 643899
61204 643899 643812 643847 643700 643620 644187 645669 648238 652646 659959 670427 683168 697243 712681 730159 749804
61189 749804 770449 789993 806431 818779 827261 832803 836423 838934 840860 842409 843654 844765 845759
61176 845759 845966 844295 840429 835331 830082 824542 817785 809580 800686 791724 782494 772564 761911 750705
61162 750705 739003 726918 714686 702287 689445 676317 663815 652852 643533 635459 628599 623494
$$ packed form
61262E71940N005N403N905O883Q619J0964J3048J3696J2405R768O858M330K309
61249F77133P64k80q51j148j557k489l968n471o364o536o381o208n995n684n347
61234F19618m958m391l687l081k610j999j091j16O78J426K465L796M844M855L625
61219F19374J891P70O76J016J124J143J601K491L268L559L336K556J286J12l04
61204F43899q7L5j47q0N67J482K569M408P313J0468J2741J4075J5438J7478J9645
61189G49804K0645J9544J6438J2348Q482N542L620K511J926J549J245J111R94
61176H45759K07j671l866n098n249n540o757q205q894q962r230r930j0653j1206
61162G50705j1702j2085j2232j2399j2842j3128j2502j0963r319q074o860n105
$$ plain form
61150 623494 620645 620050 621311 623972 627664 631947 635982 638396 637810 633700 626676 617812 607907 597507
61136 597507 587349 578383 571283 566100 562393 559636 557612 556560 556886 558681 561628 565484 570538 577431
61122 577431 586601 598013 611349 626281 642631 660418 679774 700698 722899 745966 769650 793881
61110 793881 818450 842802 866298 888738 910535 932205 953658 974160 993017 1009983 1024799
61099 1024799 1036630 1044384 1047509 1046031 1039912 1028946 1013488 994800 974284 952569 929630 905591
61087 905591 881126 857129 834228 812508 791611 771193 751336 732354 714265 696901 680617
61076 680617 666384 654787 645294 636891 629147 622308 616645 612252 609253 607635 606944 606642 606832 608201
61062 608201 611174 615425 620174 624763 629020 633433 638907 646004 654452 663630 673310 683566 694314 705493
$$ packed form
61150F23494k849n95J261K661L692M283M035K414n86m110p024q864r905j0400
61136E97507j0158q966p100n183l707k757k024j052L26J795K947L856N054O893
61122E77431R170J1412J3336J4932J6350J7787J9356K0924K2201K3067K3684K4231
61110G93881K4569K4352K3496K2440K1797K1670K1453K0502J8857J6966J4816
61099A024799J1831P754L125j478o119j0966j5458j8688k0516k1715k2939k4039
61087I05591k4465k3997k2901k1720k0897k0418j9857j8982j8089j7364j6284
61076F80617j4233j1597r493q403p744o839n663m393k999j618o91l02J90J369
61062F08201K973M251M749M589M257M413N474P097Q448R178R680J0256J0748J1179
$$ plain form
61048 705493 717535 731057 746185 762822 781374 802394 825507 849591 874226 900185 928184
61037 928184 957894 988601 1020170 1052873 1086708 1121349 1156489 1192083 1228704 1267679 1310131
61026 1310131 1355631 1402315 1448451 1493237 1536245 1577393 1617970 1660620 1707694 1760494 1820392
61015 1820392 1889213 1967648 2054559 2148939 2251631 2364699 2491140 2636909 2811758 3026605
61005 3026605 3291862 3620150 4028456 4535164 5157975 5919217 6851397 7993342 9383967
60996 9383967 11063274 13060679 15338358 17711968 19841823 21361252 22075733 22071900 21647808
60987 21647808 21143934 20822910 20844475 21257963 21952337 22625246 22872919 22387215 21114577
60978 21114577 19252245 17107040 14947259 12939836 11161827 9631386 8332173 7234496
$$ packed form
61048G05493J2042J3522J5128J6637J8552K1020K3113K4084K4635K5959K7999
61037I28184K9710L0707L1569L2703L3835L4641L5140L5594L6621L8975M2452
61026A310131M5500M6684M6136M4786M3008M1148M0577M2650M7074N2800N9898
61015A820392O8821P8435Q6911R4380J02692J13068J26441J45769J74849K14847
61005C026605K65257L28288M08306N06708O22811P61242R32180J141945J390625
60996I383967J679307J997405K277679K373610K129855J519429P14481l833m24092
60987B1647808n03874l21024K1565M13488O94374O72909K47673m85704j272638
60978B1114577j862332k145205k159781k007423j778009j530441j299213j097677
$$ plain form
60970 7234496 6311940 5544856 4914226 4399096 3980513 3643429 3373505 3155452 2975921
60961 2975921 2825684 2698062 2587375 2489832 2403708 2327235 2257688 2193344 2134693 2082540 2036016
60950 2036016 1993274 1952796 1912964 1871531 1826859 1779133 1729437 1678275 1625838 1573016 1521075
60939 1521075 1470547 1421190 1372763 1325223 1278438 1232299 1187010 1142928 1100373 1059841 1022006
60928 1022006 987134 954832 924660 896661 870973 847286 825051 803993 784146 765648 748738
60917 748738 733627 720124 707587 695523 684107 674014 665825 659557 654565 650015 645741 642484 641004
60904 641004 641192 642450 644529 647314 650136 652173 653465 654653 655770 656171 655696 654882 653852 651935 648741
60889 648741 644820 640924 637327 634091 631171 627936 623385 617253 610258 603055 595698 588274 581059 573714
$$ packed form
60970G234496r22556p67084o30630n15130m18583l37084k69924k18053j79531
60961B975921j50237j27622j10687r7543q6124p6473o9547o4344n8651n2153m6524
60950B036016m2742m0478l9832m1433m4672m7726m9696n1162n2437n2822n1941
60939A521075n0528m9357m8427m7540m6785m6139m5289m4082m2555m0532l7835
60928A022006l4872l2302l0172k7999k5688k3687k2235k1058j9847j8498j6910
60917G48738j5111j3503j2537j2064j1416j0093q189o268m992m550m274l257j480
60904F41004J88J258K079K785K822K037J292J188J117M01m75q14j030j917l194
60889F48741l921l896l597l236k920l235m551o132o995p203p357p424p215p345
$$ plain form
60875 573714 565380 556053 546928 538854 531395 523982 516934 510612 504522 498192 492162 487195 483210 479824
60861 479824 477259 475849 475254 474996 475127 475514 475207 473578 471492 470258 469938 469779 469815 470801 472853 475345 477923
60844 477923 480448 482113 481870 479850 477272 474830 472150 468928 465564 462459 459589 457035 455154 453930
60830 453930 452898 451957 451587 452037 452973 454156 455795 457899 459898 461253 462070 462829 463821 465008 466050 466411
60814 466411 465841 464834 464130 463728 462877 461187 459231 457792 456855 455618 453289 449770 445736 442075 439067
60799 439067 436195 432941 429542 426610 424215 421824 419019 415770 412053 407714 402781 397578 392508 387982
60785 387982 384401 381836 379821 377839 375877 374187 372761 371465 370363 369379 367991 365964 364156 363803 365100
60770 365100 367198 369477 371927 374337 376176 377578 379616 383096 387677 392489 397071 401331 405130 408392
$$ packed form
60875E73714q334r327r125q074p459p413p048o322o090o330o030m967l985l386
60861D79824k565j410n95k58J31L87l07j629k086j234l20j59L6R86K052K492K578
60844D77923K525J665k43k020k578k442k680l222l364l105k870k554j881j224
60830D53930j032r41l70M50R36J183J639K104J999J355Q17P59R92J187J042L61
60814D66411n70j007p04m02q51j690j956j439r37j237k329l519m034l661l008
60799D39067k872l254l399k932k395k391k805l249l717m339m933n203n070m526
60785C87982l581k565k015j982j962j690j426j296j102r84j388k027j808l53J297
60770C65100K098K279K450K410J839J402K038L480M581M812M582M260L799L262
$$ plain form
60756 408392 411284 413959 416360 418439 420274 421852 423081 424138 425369 426696 427565 427717 427617 427875 428453
60741 428453 428614 427413 424207 419017 412535 405512 398147 390362 382494 375285 369156 364022 359805 356615
60727 356615 354288 352275 350201 348205 346567 345314 344266 343176 341870 340592 340075 340761 342076 343031 343414
60712 343414 343740 344097 343911 343041 342237 342138 342478 342671 342662 342764 343189 344060 345452 347077 348354 349092 349715 350558 351448
60693 351448 352270 353490 355710 359027 363028 367066 370361 372431 373708 375328 377976 381420 385324 389862
60679 389862 395057 400140 404215 407220 409739 412157 414476 416657 418678 420421 421845 422965 423380 422222
60665 422222 419036 414390 409273 404170 399188 394670 391057 388265 385692 382879 379908 377282 375574 374971
60651 374971 374980 374900 374789 375481 377392 379851 382044 384017 386096 387791 388090 386678 384155 381188 378092 375117
$$ packed form
60756D08392K892K675K401K079J835J578J229J057J231J327Q69J52j00K58N78
60741D28453J61j201l206n190o482p023p365p785p868p209o129n134m217l190
60727C56615k327k013k074j996j638j253j048j090j306j278n17O86J315R55L83
60712C43414L26L57j86q70q04r9L40J93rJ02M25Q71J392J625J277P38O23Q43Q90
60693C51448Q22J220K220L317M001M038L295K070J277J620K648L444L904M538
60679C89862N195N083M075L005K519K418K319K181K021J743J424J120M15j158
60665D22222l186m646n117n103m982m518l613k792k573k813k971k626j708o03
60651C74971Rq0j11O92J911K459K193J973K079J695K99j412k523k967l096k975
$$ plain form
60635 375117 372379 369532 366149 362546 359575 357516 355813 354099 352853 352672 353366 354211 354818 355329 355978 356813
60619 356813 357783 358820 359788 360508 360858 360826 360540 360315 360536 361303 362238 362796 362876 363050 364072 366138 368694 371002
60601 371002 372766 374142 375250 375902 375834 375110 374258 374013 374815 376424 378195 379896 382069 385254 388978 391972
60585 391972 393423 393665 393516 393334 392931 392093 390976 390123 390169 391324 393084 394727 396179 398109 401154 405425
60569 405425 410903 417811 426315 436216 447271 459581 473244 487751 501990 514731 524974 532061
60557 532061 535845 536705 535177 531575 526097 519216 511779 504724 498710 494022 490807 489421 490331 493584 498596
60542 498596 504859 512666 522679 534902 548680 563713 580454 599285 619797 641000 661525 679344
60530 679344 692082 698407 698922 695255 688563 679374 668486 657274 647019 638307 631066 624878 619236
$$ packed form
60635C75117k738k847l383l603k971k059j703j714j246j81O94Q45O07N11O49Q35
60619C56813R70J037R68P20L50l2k86k25K21P67R35N58Q0J74J022K066K556K308
60601C71002J764J376J108O52o8p24q52k45Q02J609J771J701K173L185L724K994
60585C91972J451K42j49j82m03q38j117q53M6J155J760J643J452J930L045M271
60569D05425N478O908Q504R901J1055J2310J3663J4507J4239J2741J0243P087
60557E32061L784Q60j528l602n478o881p437p055o014m688l215j386R10L253N012
60542D98596O263P807J0013J2223J3778J5033J6741J8831K0512K1203K0525J7819
60530F79344J2738O325N15l667o692r189j0888j1212j0255q712p241o188n642
$$ plain form
60517 619236 613772 608348 602962 597808 593507 590941 590509 591664 593392 595115 597061 599955 604519 611111
60503 611111 619733 630479 643966 661096 682512 708619 740038 777369 820357 867841 918786 972848
60491 972848 1029511 1087115 1143128 1195057 1240699 1277803 1303939 1316769 1314543 1296793 1264708 1220535
60479 1220535 1166578 1105308 1040264 975707 914668 857925 805337 757447 715075 678079 645569
60468 645569 617081 592589 571589 553064 536440 521863 509428 498731 489303 481025 473979 468154
60456 468154 463363 459225 455320 451506 447806 443863 439011 433354 428250 425011 423345 421698 419052 415786
60442 415786 412943 411209 410575 410411 409833 408470 406882 405826 405230 404340 402766 400889 399245 397981 396915
60427 396915 395748 394203 392323 390578 389393 388719 388390 388682 390042 392387 395157 397937 400615 403027 404919
$$ packed form
60517F19236n464n424n386n154m301k566m32J155J728J723J946K894M564O592
60503F11111Q622J0746J3487J7130K1416K6107L1419L7331M2988M7484N0945N4062
60491I72848N6663N7604N6013N1929M5642L7104K6136J2830k226j7750l2085m4173
60479A220535n3957o1270o5044o4557o1039n6743n2588m7890m2372l6996l2510
60468F45569k8488k4492k1000j8525j6624j4577j2435j0697r428q278p046n825
60456D68154m791m138l905l814l700l943m852n657n104l239j666j647k646l266
60442D15786k843j734o34j64n78j363j588j056n96q90j574j877j644j264j066
60427C96915j167j545j880j745j185o74l29K92J360K345K770K780K678K412J892
$$ plain form
60412 404919 406237 407070 407407 407316 407225 407628 408619 410070 411982 414216 416166 417310 417894 418542 419359 420083 420893
60395 420893 422352 424617 427390 430614 434405 438297 441360 443354 445104 447458 450388 453367 456068 458364
60381 458364 460124 461439 462798 464759 467493 470734 473938 476528 478289 479643 481287 483522 486110 488700
60367 488700 491146 493504 495934 498491 500808 502251 502720 502932 503540 504354 505058 506288 509185 513934 519521
60352 519521 524940 530015 535134 540880 547908 556372 565314 573249 579498 584329 587813 589283 588204 584894
60338 584894 580150 574724 569336 564513 560085 555350 550016 544581 539638 535329 531600 528387 525310 521766
60324 521766 517604 513241 508952 504629 500422 497010 494831 493586 492807 492508 492997 494517 497328 501664 507313
60309 507313 513725 520920 529855 541540 556090 572964 591811 612770 635988 660791 685062 705670
$$ packed form
60412D04919J318Q33L37r1r1M03R91J451J912K234J950J144N84O48Q17P24Q10
60395D20893J459K265K773L224L791L892L063J994J750K354K930K979K701K296
60381D58364J760J315J359J961K734L241L204K590J761J354J644K235K588K590
60367D88700K446K358K430K557K317J443M69K12O08Q14P04J230K897M749N587
60352E19521N419N075N119N746P028Q464Q942P935O249M831L484J470j079l310
60338E84894m744n426n388m823m428m735n334n435m943m309l729l213l077l544
60324E21766m162m363m289m323m207l412k179j245p79k99M89J520K811M336N649
60309E07313O412P195Q935J1685J4550J6874J8847K0959K3218K4803K4271K0608
$$ plain form
60297 705670 720208 728309 730731 727374 717286 700694 679863 657439 634972 613606 595027 580544
60285 580544 569823 561527 554834 549540 545204 541187 537351 533825 530249 526113 521657 517556 513662 508952
60271 508952 502978 496666 491361 487535 484676 482073 479423 476897 474838 473320 471950 470222 467977 465409
60257 465409 462820 460574 459055 458280 457652 456481 454771 453198 452341 452272 452856 454044 455730 457598 459310 460696
60241 460696 461657 462001 461593 460702 460066 460395 461702 463257 464433 465440 466932 469022 471185 473221 475708 479144
60225 479144 483077 486615 489558 492483 495767 499146 502341 505705 509927 515335 521789 529130 537397 546531
60211 546531 556137 565787 575440 585299 595324 605165 614586 623545 631786 638844 644799 650546 656841 663383
60197 663383 669342 674444 678830 682158 683770 683840 683485 683470 683427 682630 680871 678179 674271 668845 662119 654680
$$ packed form
60297G05670J4538Q101K422l357j0088j6592k0831k2424k2467k1366j8579j4483
60285E80544j0721q296o693n294m336m017l836l526l576m136m456m101l894m710
60271E08952n974o312n305l826k859k603k650k526k059j518j370j728k245k568
60257D65409k589k246j519p75o28j171j710j573q57o9N84J188J686J868J712J386
60241D60696R61L44m08q91o36L29J307J555J176J007J492K090K163K036K487L436
60225D79144L933L538K943K925L284L379L195L364M222N408O454P341Q267R134
60211E46531R606R650R653R859J0025R841R421Q959Q241P058N955N747O295O542
60197F63383N959N102M386L328J612P0l55j5m3p97j759k692l908n426o726p439
$$ plain form
60181 654680 647011 639437 632206 625322 618584 612019 606064 601098 597079 593768 591031 588720 586654 584884
60167 584884 583607 582612 581197 578944 576204 573566 571197 569042 567273 566144 565559 565131 564566 563833 563192 563158
60151 563158 564158 566011 568004 569669 571253 573282 575924 578859 581505 583370 584624 586388 589924 595405
60137 595405 601977 609153 617473 627434 638417 649186 659031 667985 676229 683722 690108 694754 697252 698186
60123 698186 698938 700394 702313 704273 706590 709681 713081 715923 718205 720862 724581 729000 733064 735782
60109 735782 736725 736202 734946 733374 731170 727720 722829 716970 710999 705625 700842 695887 690189 684350 679630
60094 679630 676439 674082 672083 670854 670710 671171 671750 672606 673747 674521 674726 675374 677231 679225 679594 678260
60078 678260 676808 676169 675531 673655 670213 665510 659775 653167 645868 637721 628254 617435 606177 595856
$$ packed form
60181F54680p669p574p231o884o738o565n955m966m019l311k737k311k066j770
60167E84884j277r95j415k253k740k638k369k155j769j129n85m28n65p33o41l4
60151E63158J000J853J993J665J584K029K642K935K646J865J254J764L536N481
60137E95405O572P176Q320R961J0983J0769R845Q954Q244P493O386M646K498R34
60123F98186P52J456J919J960K317L091L400K842K282K657L719M419M064K718
60109G35782R43n23j256j572k204l450m891n859n971n374m783m955n698n839m720
60094F79630l191k357j999j229j44M61N79Q56J141P74K05O48J857J994L69j334
60078F78260j452o39o38j876l442m703n735o608p299q147r467j0819j1258j0321
$$ plain form
60064 595856 587395 580816 575442 570459 565435 560250 554691 548562 542361 537247 533889 531794 530210 529213
60050 529213 529280 530261 531565 533168 535711 539675 545031 551550 558856 566280 573274 579910 586499 592907 598824
60035 598824 604471 610353 616337 621542 625111 626631 626005 623456 619532 614586 608376 600704 592163 583658
60021 583658 575479 567534 560150 553764 547967 541808 535088 528533 522656 517250 512062 507092 502094 496666
60007 496666 491123 486501 483280 480727 477903 474869 472557 471794 472645 474355 475781 476233 476048 476100 476881 478382
59991 478382 480625 483623 486956 490144 493503 497893 503550 509819 516073 522098 527421 531124 532726 532660 531541
59976 531541 529499 526554 523049 519368 515672 512149 509051 506228 503165 499765 496637 494398 493153 492847
59962 492847 493545 495104 497095 499392 502313 505896 509515 512533 514824 516297 516515 515341 513544 512203 511698
$$ packed form
60064E95856q461o579n374m983n024n185n559o129o201n114l358k095j584r97
60050E29213O7R81J304J603K543L964N356O519P306P424O994O636O589O408N917
60035E98824N647N882N984N205L569J520o26k549l924m946o210p672q541q505
60021E83658q179p945p384o386n797o159o720o555n877n406n188m970m998n428
60007D96666n543m622l221k553k824l034k312p63Q51J710J426M52j85N2P81J501
59991D78382K243K998L333L188L359M390N657O269O254O025N323L703J602o6j119
59976E31541k042k945l505l681l696l523l098k823l063l400l128k239j245l06
59962D92847O98J559J991K297K921L583L619L018K291J473K18j174j797j341n05
$$ plain form
59947 511698 511661 511625 511396 511042 510931 511550 512911 514259 514637 513639 511489 508625 505420 502131 498928 496089 494185
59930 494185 493730 494626 496331 498635 501780 505693 509757 513770 518645 525591 534849 545649 557136 568815
59916 568815 580215 590724 599955 607959 614893 620597 624681 627059 628323 629423 630922 632674 634263 635506
59902 635506 636350 636614 636239 635592 635030 634260 632597 629841 626552 623543 621472 620711 621052 621652 621931 622479 624359
59885 624359 627553 630924 633807 636706 640150 643867 647716 652537 659168 667049 674633 680899 685783 689333
59871 689333 691263 691403 689998 687373 683613 678725 672956 666955 661709 658035 655816 653900 651127 647507
59857 647507 644122 641904 640837 640433 640546 641404 642954 644718 646532 649098 653340 659217 665639 671645 677092
59842 677092 681915 685258 686014 684018 680252 676033 672491 670561 670691 672352 674149 674580 672657 668206 662041
$$ packed form
59947E11698l7l6k29l54j11O19J361J348L78r98k150k864l205l289l203k839j904
59930D94185m55Q96J705K304L145L913M064M013M875O946R258J0800J1487J1679
59916E68815J1400J0509R231Q004O934N704M084K378J264J100J499J752J589J243
59902F35506Q44K64l75o47n62p70j663k756l289l009k071p61L41O00K79N48J880
59885F24359L194L371K883K899L444L717L849M821O631P881P584O266M884L550
59871F89333J930J40j405k625l760m888n769o001n246l674k219j916k773l620
59857F47507l385k218j067m04J13Q58J550J764J814K566M242N877O422O006N447
59842F77092M823L343P56j996l766m219l542j930J30J661J797M31j923m451o165
$$ plain form
59827 662041 655592 649816 644580 639365 634149 629090 623898 618386 613289 609591 607287 605789 605277 606338
59813 606338 608272 609183 608136 606079 604156 602262 599863 597173 594660 592206 589594 587211 585405 583680
59799 583680 581263 578155 574979 572142 569730 567888 566659 565603 564148 562188 560048 558027 556220 554537
59785 554537 552674 550344 547656 544989 542469 540042 538024 536879 536342 535512 534059 532604 531687 531191 531140 532128
59769 532128 534403 537348 540486 544191 548753 553529 557809 561836 566187 570737 575095 579478 584333 589651
59755 589651 595518 602775 612061 622553 632682 641910 650965 660520 670474 680327 689378 696683 701764 705340
59741 705340 708627 711930 714615 716288 717200 717493 716916 715424 713408 711105 708342 704961 701087 696977 693004
59726 693004 689728 687446 685717 683763 681319 678670 676057 673547 671312 669505 667954 666485 665363 664814
$$ packed form
59827F62041o449n776n236n215n216n059n192n512n097l698k304j498n12J061
59813F06338J934R11j047k057j923j894k399k690k513k454k612k383j806j725
59799E83680k417l108l176k837k412j842j229j056j455j960k140k021j807j683
59785E54537j863k330k688k667k520k427k018j145n37q30j453j455r17m96n1R88
59769E32128K275K945L138L705M562M776M280M027M351M550M358M383M855N318
59755E89651N867P257R286J0492J0129R228R055R555R954R853R051P305N081L576
59741G05340L287L303K685J673R12K93n77j492k016k303k763l381l874m110l973
59726F93004l276k282j729j954k444k649k613k510k235j807j551j469j122n49
$$ plain form
59712 664814 664345 663262 661773 660798 660721 661087 661614 662712 664825 667940 672008 677187 683321 689768 696184 703059
59696 703059 711081 720283 730188 740523 751346 762458 772921 781244 786091 787060 784919 781053 776650
59683 776650 772392 768670 765663 763187 760739 757847 754277 749869 744433 737948 730796 723578 716594 709574
59669 709574 702094 694289 686885 680375 674498 668872 663881 660386 658749 658749 660323 663587 668056 672805 677702
59654 677702 683732 691662 701072 711093 721268 731131 739696 746164 750598 753126 753028 749477 742903 734790
59640 734790 726224 717242 707421 696530 684829 673253 663055 654799 647989 642120 637542 634677 632895
59627 632895 630965 628267 624783 620288 614464 607573 600176 592342 583977 575717 568545 562553 556969 551412
59613 551412 546228 541551 536973 532409 528546 526087 525100 525353 526749 529118 531947 534559 536414 537286 537383
$$ packed form
59712F64814m69j083j489r75p7L66N27J098K113L115M068N179O134O447O416O875
59696G03059Q022R202R905J0335J0823J1112J0463Q323M847R69k141l866m403
59683G76650m258l722l007k476k448k892l570m408n436o485p152p218o984p020
59669G09574p480p805p404o510n877n626m991l495j637%J574L264M469M749M897
59654F77702O030P930R410J0021J0175R863Q565O468M434K528r8l551o574q113
59640G34790q566q982r821j0891j1701j1576j0198q256o810n869m578k865j782
59627F32895j930k698l484m495n824o891p397p834q365q260p172n992n584n557
59613E51412n184m677m578m564l863k459r87K53J396K369K829K612J855Q72R7
$$ plain form
59598 537383 537209 537053 536809 536530 536707 537600 538752 539732 540881 542619 544505 545870 546942 548281 549320 548626
59582 548626 545709 541559 537314 533335 529726 526727 524184 521410 517978 514165 510436 507078 504439 502845
59568 502845 502018 501159 499815 498191 496602 495211 494286 494013 493978 493576 493047 493333 494707 496317 497381 498110 499102
59551 499102 500457 501931 503469 505163 507015 509042 511369 514066 517212 521185 526541 533629 542628 553895
59537 553895 567963 585373 606651 631543 657227 678010 688540 687864 679584 668235 656694 646777
59525 646777 640045 636812 635718 635635 637223 641529 647765 653633 657546 659466 659842 658718 655947 651478 645300
59510 645300 637580 628904 619933 610822 601346 591620 582391 574529 568365 563526 559321 555333 551694 548771
59496 548771 546706 545448 545036 545460 546310 547006 547456 548090 549268 551014 553319 556175 559269 562168 564959 568254
$$ packed form
59598E37383j74j56k44k79J77Q93J152R80J149J738J886J365J072J339J039o94
59582E48626k917m150m245l979l609k999k543k774l432l813l729l358k639j594
59568E02845q27q59j344j624j589j391r25k73l5m02n29K86J374J610J064P29R92
59551D99102J355J474J538J694J852K027K327K697L146L973N356P088Q999J1267
59537E53895J4068J7410K1278K4892K5684K0783J0530o76q280j1349j1541r917
59525F46777o732l233j094q3J588M306O236N868L913J920L76j124k771m469o178
59510F45300p720q676q971r111r476r726r229p862o164m839m205l988l639k923
59496E48771k065j258m12M24Q50O96M50O34J178J746K305K856L094K899K791L295
$$ plain form
59480 568254 572413 577217 582444 588333 595292 603489 612809 622780 632404 640434 646043 649106 649973 649251 647607
59465 647607 645321 642171 638174 634140 630898 628294 625837 624110 624574 627969 633864 641733 651355 661988
59451 661988 672401 682305 692809 704801 717641 730015 741308 751414 759738 765157 766721 763978
59439 763978 756961 746416 733851 721001 709174 698987 690303 682381 674534 666668 658895 650955 642723
59426 642723 635034 629135 625366 623302 623055 625375 630466 637895 647835 661197 678195 697910 719541
59413 719541 743065 768638 796825 829270 866546 904004 931853 941720 932875 911343 884479 857863
59401 857863 835561 820232 812644 812891 821942 839857 861920 878531 880739 866026 838803 806200
59389 806200 773739 743944 717535 695069 677182 663654 653083 644088 636478 630858 627509 626177
$$ packed form
59480E68254M159M804N227N889O959Q197R320R971R624Q030N609L063Q67p22j644
59465F47607k286l150l997m034l242k604k457j727M64L395N895P869R622J0633
59451F61988J0413R904J0504J1992J2840J2374J1293J0106Q324N419J564k743
59439G63978p017j0545j2565j2850j1827j0187q684p922p847p866p773p940q232
59426F42723p689n899l769k064k47K320N091P429R940J3362J6998J9715K1631
59413G19541K3524K5573K8187L2445L7276L7458K7849R867q845k1532k6864k6616
59401H57863k2302j5329p588K47R051J7915K2063J6611K208j4713k7223l2603
59389H06200l2461k9795k6409k2466j7887j3528j0571q995p610n620l349j332
$$ plain form
59377 626177 626528 628133 630319 632687 635563 639383 643913 648608 653415 658530 663684 668431 672974 677921
59363 677921 683280 688388 692828 696862 700890 705051 709463 714472 720533 727959 736607 745669 754187 762182
59349 762182 770940 781773 794791 809244 824629 840908 858020 875835 894346 913378 932231 950059
59337 950059 966243 979960 989896 995172 996331 994716 990983 984828 975970 964628 951102 935577 918528
59324 918528 900859 883519 867213 852384 839132 827224 816425 806752 798232 790692 783981 778031
59312 778031 772475 766675 760481 754568 749595 745538 742209 739885 738877 739044 740295 743093 747752 753836
59298 753836 760984 769817 780857 792642 801767 804937 800589 789038 771999 752004 731385 711467
59286 711467 692855 676215 662173 650718 641398 634063 628931 626050 625206 626189 628667 632025 635946 640989
$$ packed form
59377F26177L51J605K186K368K876L820M530M695M807N115N154M747M543M947
59363F77921N359N108M440M034M028M161M412N009O061P426Q648R062Q518P995
59349G62182Q758J0833J3018J4453J5385J6279J7112J7815J8511J9032J8853J7828
59337I50059J6184J3717R936N276J159j615l733o155q858j1342j3526j5525j7049
59324I18528j7669j7340j6306j4829j3252j1908j0799r673q520p540o711n950
59312G78031n556n800o194n913m973m057l329k324j008J67J251K798M659O084
59298G53836P148Q833J1040J1785R125L170m348j1551j7039j9995k0619j9918
59286G11467j8612j6640j4042j1455r320p335n132k881q44R83K478L358L921N043
$$ plain form
59272 640989 648125 657847 670095 684611 700757 717379 733517 749033 763866 777068 787432 794825
59260 794825 800026 803326 804127 801947 797038 789908 780951 770667 759723 748662 737870 727744 718490
59247 718490 709930 701985 695179 690172 686967 685078 684221 684334 685205 686715 689241 693136 697940 702712 707024
59232 707024 711137 715397 720011 725079 730172 734133 736047 736265 735819 735030 733336 730262 725832 720154 713426
59217 713426 706308 699670 693898 688863 684391 680333 676545 673353 671590 671505 672067 672029 671284 670393 669398 668046
59201 668046 666679 665702 664496 662099 658751 655561 652828 650014 647361 646105 646783 648490 650177 651709 653349
59186 653349 655210 657611 661053 665439 670055 674573 679325 684274 688614 691771 694159 696581 699411 702585
59172 702585 705868 708998 712039 715589 720160 725520 731343 738188 746929 757285 767954 778184 788183
$$ packed form
59272F40989P136R722J2248J4516J6146J6622J6138J5516J4833J3202J0364P393
59260G94825N201L300Q01k180m909p130q957j0284j0944j1061j0792j0126r254
59247G18490q560p945o806n007l205j889q57J13Q71J510K526L895M804M772M312
59232G07024M113M260M614N068N093L961J914K18m46p89j694l074m430n678o728
59217G13426p118o638n772n035m472m058l788l192j763q5N62l8p45q91r95j352
59201F68046j367r77j206k397l348l190k733k814k653j256O78J707J687J532J640
59186F53349J861K401L442M386M616M518M752M949M340L157K388K422K830L174
59172G02585L283L130L041L550M571N360N823O845Q741J0356J0669J0230R999
$$ plain form
59159 788183 797894 806465 813191 817988 820716 820957 818722 814514 808537 800790 792037 783494 775222 766019
59145 766019 755396 744517 734541 725006 714671 703167 691116 679227 667988 657712 648288 639289
59133 639289 630760 623422 617757 613409 609839 607029 605141 604047 603589 603859 604921 606767 609746 614462 620978
59118 620978 628684 637184 646752 657699 669949 683402 697966 712948 727198 740304 753089 766505
59106 766505 780532 794403 807366 818942 828983 837692 845162 850835 853951 854495 853006 849570 843929
59093 843929 836613 828925 821685 814962 809168 805189 803090 801846 800811 800296 800221 799389 796848 792900 788040
59078 788040 781943 774353 765982 757544 748781 739432 730396 722791 716395 710054 703240 696309 689585 683085
59064 683085 676913 671194 665780 660590 655957 652115 648775 645695 643211 641549 640081 638023 635575 633662
$$ packed form
59159G88183R711Q571O726M797K728K41k235m208n977p747q753q543q272r203
59145G66019j0623j0879r976r535j0335j1504j2051j1889j1239j0276r424q999
59133F39289q529p338n665m348l570k810j888j094m58K70J062J846K979M716O516
59118F20978P706Q500R568J0947J2250J3453J4564J4982J4250J3106J2785J3416
59106G66505J4027J3871J2963J1576J0041Q709P470N673L116N44j489l436n641
59093H43929p316p688p240o723n794l979k099j244j035n15p5q32k541l948m860
59078G88040o097p590q371q438q763r349r036p605o396o341o814o931o724o500
59064F83085o172n719n414n190m633l842l340l080k484j662j468k058k448j913
$$ plain form
59050 633662 632668 632018 630897 628949 626375 623687 621256 619011 616810 615089 614561 615144 615859 616026 615964 616272
59034 616272 617162 618863 621909 626532 632396 639276 647364 656595 666476 677007 688885 702285 716351
59021 716351 730510 745355 761413 777885 793448 807513 819753 829131 834563 836166 834928 831548
59009 831548 826456 820537 814760 809333 804095 799610 796991 796710 798332 801428 806140 812800 821351 831034
58995 831034 840426 848121 853673 857499 859688 859544 856703 851906 846081 839324 831448 822859 814041 804805
58981 804805 794976 785470 777785 772653 769854 768979 769628 771202 773386 776709 781952 789165 797748 807185 817117
58966 817117 827138 837232 848121 860362 873289 885493 896161 905359 913216 919511 923960 926325
58954 926325 926290 923628 918336 910366 899592 886418 872003 857413 842931 828560 814705 801831 789944
$$ packed form
59050F33662r94o50j121j948k574k688k431k245k201j721n28N83P15J67o2L08
59034F16272Q90J701L046M623N864O880Q088R231R881J0531J1878J3400J4066
59021G16351J4159J4845J6058J6472J5563J4065J2240R378N432J603j238l380
59009H31548n092n919n777n427n238m485k619k81J622L096M712O660Q551R683
58995H31034R392P695N552L826K189j44k841m797n825o757p876q589q818r236
58981H04805r829r506p685n132k799q75O49J574K184L323N243P213Q583R437R932
58966H17117J0021J0094J0889J2241J2927J2204J0668R198P857O295M449K365
58954I26325l5k662n292p970j0774j3174j4415j4590j4482j4371j3855j2874j1887
$$ plain form
58941 789944 778976 769230 760926 753812 747768 743244 740467 738686 736868 734718 732477 730301 728515 727848
58927 727848 728591 729971 731154 732388 734350 736765 738612 739385 739359 738909 738378 738388 739519 741866 745488 750935
58911 750935 758650 768237 779008 790864 803841 817169 829675 840979 851586 862072 872799 884083
58899 884083 895841 907202 917116 925165 931348 935575 938024 939566 941193 943439 947006 953344 963804
58886 963804 978565 996995 1018358 1041311 1063500 1082883 1099211 1113242 1124949 1133570 1138979 1141787
58874 1141787 1142287 1140333 1136131 1130087 1122101 1112062 1100891 1089953 1079474 1068569 1056805 1044670
58862 1044670 1032408 1019429 1005177 989782 973643 956969 939903 922557 904881 886951 869312
58851 869312 852581 836917 822287 808889 796802 785638 775174 765758 757350 748748 738739 727686
$$ packed form
58941G89944j0968r746q304p114o044m524k777j781j818k150k241k176j786o67
58927G27848P43J380J183J234J962K415J847P73k6m50n31J0J131K347L622N447
58911G50935P715R587J0771J1856J2977J3328J2506J1304J0607J0486J0727J1284
58899H84083J1758J1361R914Q049O183M227K449J542J627K246L567O338J0460
58886I63804J4761J8430K1363K2953K2189J9383J6328J4031J1707Q621N409K808
58874A141787N00j954m202o044p986j0039j1171j0938j0479j0905j1764j2135
58862A044670j2262j2979j4252j5395j6139j6674j7066j7346j7676j7930j7639
58851H69312j6731j5664j4630j3398j2087j1164j0464r416q408q602j0009j1053
$$ plain form
58839 727686 716964 707110 697470 687452 677222 667306 658323 650914 645134 640129 635095 630236 626131
58826 626131 622703 619690 617571 616974 617555 618505 619802 621983 625106 628964 633845 639951 646431 652125 656861
58811 656861 660944 663922 665193 665334 665339 664964 663328 660871 658944 657580 655476 652328 649510 648041 647423 646926
58795 646926 646620 646518 645905 644178 641533 638458 635367 632892 631635 631472 631961 633482 637013 642836 650514
58780 650514 660062 671955 685930 700980 716612 732911 749292 764351 776982 786369 790968 789173
58768 789173 781464 770502 758634 746483 734236 722696 712321 702498 692634 683010 673905 664837 655458
58755 655458 646478 639092 633998 631268 630436 630421 630096 629248 628410 627812 627388 627706 629708 633341 637611 642275
58739 642275 648320 656364 665671 675165 684495 693684 702608 711264 719793 727964 735309 741875 748055 753745
$$ packed form
58839G27686j0722r854r640j0018j0230r916q983p409n780n005n034m859m105
58826F26131l428l013k119n97N81R50J297K181L123L858M881O106O480N694M736
58811F56861M083K978J271J41Nl75j636k457j927j364k104l148k818j469o18m97
58795F46926l06j02o13j727k645l075l091k475j257j63M89J521L531N823P678
58780F50514R548J1893J3975J5050J5632J6299J6381J5059J2631R387M599j795
58768G89173p709j0962j1868j2151j2247j1540j0375r823r864r624r105r068r379
58755F55458q980p386n094k730q32j5l25q48q38n98m24L18K002L633M270M664
58739F42275O045Q044R307R494R330R189Q924Q656Q529Q171P345O566O180N690
$$ plain form
58725 753745 758622 763123 767973 772758 776243 778254 779949 782105 784510 787295 791430 797370 804389 811666
58711 811666 818873 825393 830220 833115 834652 834740 832333 826971 819351 809915 798164 783817 767402 749278
58697 749278 729420 708665 688731 670305 652455 634601 617803 603303 591097 580724 572303 565823
58685 565823 560395 555085 549668 544053 537984 531916 527110 524180 522449 521246 520716 520893 521208 521627 523053
58670 523053 525928 529664 534160 540604 549930 561674 575300 591475 610848 632343 653445 671442
58658 671442 683839 688839 686519 678882 668055 655146 641185 627763 615818 604796 593894 583298
58646 583298 573513 564544 556503 549996 545079 540764 536401 532632 530300 529358 529524 530986 533716 537054 540675
58631 540675 544980 549897 554414 557975 561157 564286 566603 567595 567937 568238 568044 566995 565803 565200 565061 565397
$$ packed form
58725G53745M877M501M850M785L485K011J695K156K405K785M135N940P019P277
58711H11666P207O520M827K895J537Q8k407n362p620r436j1751j4347j6415j8124
58697G49278j9858k0755j9934j8426j7850j7854j6798j4500j2206j0373q421o480
58685E65823n428n310n417n615o069o068m806k930j731j203n30J77L15M19J426
58670E23053K875L736M496O444R326J1744J3626J6175J9373K1495K1102J7997
58658F71442J2397N000k320p637j0827j2909j3961j3422j1945j1022j0902j0596
58646E83298r785q969q041o507m917m315m363l769k332r42J66J462K730L338L621
58631E40675M305M917M517L561L182L129K317R92L42L01j94j049j192o03j39L36
$$ plain form
58615 565397 566997 570213 574393 579445 586489 595786 605312 612701 617572 620805 622744 623443 623655 624156 624789
58600 624789 625174 625454 625440 624144 621291 618161 615761 613305 609772 605913 603341 602554 603265 605813 610834 618187
58584 618187 627396 638536 651622 665800 680175 694682 709275 723091 735345 746168 755707 763432
58572 763432 769252 774234 779313 784474 790165 798179 809990 825451 844198 866929 893962 923891 955113
58559 955113 987462 1020991 1054499 1086717 1117469 1145929 1169145 1184395 1192100 1194590 1192996 1187267
58547 1187267 1178358 1168223 1158040 1148152 1139271 1131941 1125125 1116753 1105362 1090077 1069784 1043955
58535 1043955 1013949 982243 950735 920553 892574 866944 842945 820515 801034 785555 773387
58524 773387 763490 755948 750775 746745 743002 740459 739895 739955 738896 737087 735888 735148 733738 731552 729120
$$ packed form
58615E65397J600L216M180N052P044R297R526P389M871L233J939O99K12N01O33
58600F24789L85K80j4j296k853l130k400k456l533l859k572p87P11K548N021P353
58584F18187R209J1140J3086J4178J4375J4507J4593J3816J2254J0823R539P725
58572G63432N820M982N079N161N691Q014J1811J5461J8747K2731K7033K9929L1222
58559I55113L2349L3529L3508L2218L0752K8460K3216J5250P705K490j594n729
58547A187267q909j0135j0183r888q881p330o816q372j1391j5285k0293k5829
58535A043955l0006l1706l1508l0182k7979k5630k3999k2430j9481j5479j2168
58524G73387r897p542n173m030l743k543n64O0j059j809j199p40j410k186k432
$$ plain form
58509 729120 726267 722992 720604 719994 719816 718363 716190 714849 714122 712681 710565 708753 707100 704908 702796
58494 702796 701787 701299 700193 699133 699734 702041 704957 708447 713169 718660 724143 730493 739226 750257
58480 750257 762803 777691 796351 818187 841320 865306 890674 916291 939645 959358 975134
58469 975134 985785 989804 987590 980950 970882 958054 944687 933369 924457 917011 911665 909915 911189
58456 911189 913500 916684 922280 930474 939978 950667 963498 977742 990927 1001496 1008994 1011825 1007736
58443 1007736 996764 981289 963173 943268 923434 906121 891765 879152 868405 860954 856604 853452
58431 853452 850934 850304 851890 854644 858631 865306 874921 886166 898627 913025 928734 943545 956178
58418 956178 966584 973670 975434 971799 964931 956420 946387 935379 924589 914052 902974 891865
$$ packed form
58509G29120k853l275k388o10j78j453k173j341p27j441k116j812j653k192k112
58494G02796j009m88j106j060O01K307K916L490M722N491N483O350Q733J1031
58480G50257J2546J4888J8660K1836K3133K3986K5368K5617K3354J9713J5776
58469I75134J0651M019k214o640j0068j2828j3367j1318q912p446n346j750J274
58456I11189K311L184N596Q194R504J0689J2831J4244J3185J0569P498K831m089
58443A007736j0972j5475j8116j9905j9834j7313j4356j2613j0747p451m350l152
58431H53452k518o30J586K754L987O675R615J1245J2461J4398J5709J4811J2633
58418I56178J0406P086J764l635o868q511j0033j1008j0790j0537j1078j1109
$$ plain form
58406 891865 881967 872859 863268 853937 846856 841878 837197 832997 831379 832614 834768 837166 840948 845976
58392 845976 850645 855092 861104 868300 873891 876979 879770 883720 887729 891068 894875 899720 904587 909191
58378 909191 914485 920219 924847 928416 932632 937591 941568 944444 948063 952687 956555 959594 964079 970851
58364 970851 978301 985866 995072 1006304 1018127 1030622 1045733 1063285 1080263 1095092 1109017 1122201
58352 1122201 1132224 1137801 1140489 1141477 1140149 1136992 1134301 1132731 1130658 1128068 1127461 1129744 1133054 1136828
58338 1136828 1143200 1153002 1164236 1175946 1189751 1206187 1223442 1241130 1261248 1283814 1305519 1324352
58326 1324352 1341654 1358066 1371531 1380981 1388004 1393339 1395785 1396049 1397316 1400379 1402632 1403424 1405731 1410821
58312 1410821 1416150 1420559 1426634 1435779 1445830 1455867 1468390 1484275 1500555 1515787 1532578 1552038
$$ packed form
58406H91865r898r108r591r331p081m978m681m200j618J235K154K398L782N028
58392H45976M669M447O012P196N591L088K791L950M009L339L807M845M867M604
58378I09191N294N734M628L569M216M959L977K876L619M624L868L039M485O772
58364I70851P450P565R206J1232J1823J2495J5111J7552J6978J4829J3925J3184
58352A122201J0023N577K688R88j328l157k691j570k073k590o07K283L310L774
58338A136828O372R802J1234J1710J3805J6436J7255J7688K0118K2566K1705J8833
58326A324352J7302J6412J3465R450P023N335K446K64J267L063K253P92K307N090
58312A410821N329M409O075R145J0051J0037J2523J5885J6280J5232J6791J9460
$$ plain form
58300 1552038 1570824 1586699 1602154 1619477 1637053 1653564 1670951 1690194 1708990 1726719 1746798
58289 1746798 1771041 1796625 1821657 1848540 1878676 1909245 1938579 1969290 2002627 2035227 2065000
58278 2065000 2094642 2125750 2155399 2182468 2211370 2245230 2281213 2316884 2355269 2399090 2445914
58267 2445914 2493622 2544762 2600820 2658233 2714851 2774300 2839136 2905950 2972091 3040661 3113743
58256 3113743 3187338 3258416 3330207 3405038 3478951 3549191 3619961 3694894 3771171 3847138 3928150
58245 3928150 4018345 4114272 4213196 4319740 4437494 4562319 4691116 4828677 4978463 5135642
58235 5135642 5297176 5469475 5657710 5857119 6063734 6283794 6523114 6777409 7043111
58226 7043111 7327316 7636530 7966391 8313534 8686464 9093274 9530348 9995210 10498100
$$ packed form
58300A552038J8786J5875J5455J7323J7576J6511J7387J9243J8796J7729K0079
58289A746798K4243K5584K5032K6883L0136L0569K9334L0711L3337L2600K9773
58278B065000K9642L1108K9649K7069K8902L3860L5983L5671L8385M3821M6824
58267B445914M7708N1140N6058N7413N6618N9449O4836O6814O6141O8570P3082
58256C113743P3595P1078P1791P4831P3913P0240P0770P4933P6277P5967Q1012
58245C928150R0195R5927R8924J06544J17754J24825J28797J37561J49786J57179
58235E135642J61534J72299J88235J99409K06615K20060K39320K54295K65702
58226G043111K84205L09214L29861L47143L72930M06810M37074M64862N02890
$$ plain form
58217 10498100 11048087 11641096 12275546 12966109 13727543 14559912 15465685 16465857 17582468
58208 17582468 18822589 20198515 21746311 23505473 25501396 27771107 30386194 33429165
58200 33429165 36976541 41139691 46104510 52110299 59427818 68395380 79441815 93040316
58192 93040316 109692309 130002678 154699338 184496896 219951169 261289886 307736138
58185 307736138 356160125 400219638 431712861 444158519 436111104 411500819 376919276
58178 376919276 338323591 299453627 262139153 227249375 195317396 166729575 141710523
58171 141710523 120260825 102146152 86985993 74370913 63911364 55237435 48020120
58164 48020120 41999482 36968695 32741335 29157085 26102862 23498062 21264834 19331465
$$ packed form
58217A0498100N49987N93009O34450O90563P61434Q32369R05773J000172J116611
58208A7582468J240121J375926J547796J759162J995923K269711K615087L042971
58200C3429165L547376M163150M964819O005789P317519Q967562J1046435J3598501
58192I3040316J6651993K0310369K4696660K9797558L5454273M1338717M6446252
58185C07736138M8423987M4059513L1493223J2445658q047415k4610285l4581543
58178C76919276l8595685l8869964l7314474l4889778l1931979k8587821k5019052
58171A41710523k1449698j8114673j5160159j2615080j0459549q673929p217315
58164D8020120o020638n030787m227360l584250l054223k604800k233228j933369
$$ plain form
58156 19331465 17650569 16188637 14904978 13760090 12734692 11820036 10997313 10244760
58148 10244760 9556420 8935031 8372969 7857027 7385107 6961226 6579600 6229196 5908607
58139 5908607 5621388 5361490 5117282 4885431 4667721 4459226 4252988 4052160 3864813
58130 3864813 3690410 3523037 3363682 3217392 3082125 2952090 2828797 2717616 2616575
58121 2616575 2519312 2426089 2341437 2263901 2188404 2115968 2051002 1991516 1931896 1872920 1819384
58110 1819384 1770153 1720163 1670218 1625231 1584490 1542935 1500644 1462014 1426723 1390299 1352721
58099 1352721 1318020 1286050 1252819 1218432 1186938 1158735 1130531 1102350 1077428 1055655 1034069
58088 1034069 1013386 997253 985389 973879 961705 950721 939948 926369 910821 896742 883606
$$ packed form
58156A9331465j680896j461932j283659j144888j025398r14656q22723p52553
58148A0244760o88340o21389n62062n15942m71920m23881l81626l50404l20589
58139E908607k87219k59898k44208k31851k17710k08495k06238k00828j87347
58130C864813j74403j67373j59355j46290j35267j30035j23293j11181j01041
58121B616575r7263r3223q4652p7536p5497p2436o4966n9486n9620n8976n3536
58110A819384m9231m9990m9945m4987m0741m1555m2291l8630l5291l6424l7578
58099A352721l4701l1970l3231l4387l1494k8203k8204k8181k4922k1773k1586
58088A034069k0683j6133j1864j1510j2174j0984j0773j3579j5548j4079j3136
$$ plain form
58077 883606 867802 849431 832033 816012 798570 779787 762621 747013 730030 711853 695856
58066 695856 682709 670025 657775 648409 641525 633939 625291 618307 613343 607807 601073 594812 588382
58053 588382 579130 567559 557153 548807 540362 531857 526104 523432 520716 516336 511657 507183 501739 495957
58039 495957 492064 489584 485512 479267 473293 468450 463072 456969 451935 447744 441891 434018 426521 420175
58025 420175 413215 405389 398814 394045 389174 383613 378981 375505 371298 365980 361427 358184 354658 350544
58011 350544 347539 345998 344308 342231 341431 342098 342459 342257 343361 346287 349373 351903 354805 357848 359486
57996 359486 359951 361199 363369 364605 364605 364893 365277 363720 360113 356468 352920 347439 340142 333931 329897 325930
57980 325930 320998 316976 314876 312882 309642 306313 303902 301719 299717 299295 300499 301365 301172 301366 302332
$$ packed form
58077H83606j5804j8371j7398j6021j7442j8783j7166j5608j6983j8177j5997
58066F95856j3147j2684j2250r366o884p586q648o984m964n536o734o261o430
58053E88382r252j1571j0406q346q445q505n753k672k716m380m679m474n444n782
58039D95957l893k480m072o245n974m843n378o103n034m191n853p873p497o346
58025D20175o960p826o575m769m871n561m632l476m207n318m553l243l526m114
58011C50544l005j541j690k077q00O67L61k02J104K926L086K530K902L043J638
57996C59486M65J248K170J236%K88L84j557l607l645l548n481p297o211m034l967
57980C25930m932m022k100j994l240l329k411k183k002m22J204Q66j93J94R66
$$ plain form
57965 302332 302419 301281 300855 301823 302341 301668 301791 303875 306158 306936 306746 306128 304240 301303 299471 299543 299556 298270
57947 298270 297256 297838 298727 298585 298248 298551 298507 297670 297958 301088 306253 312113 318994 327380 336289 345010
57931 345010 354492 365288 375909 384792 392071 397974 401397 401669 399959 397471 394002 389514 385155 381276
57917 381276 376424 369719 362374 355524 348619 341470 335833 333235 332954 333753 335845 339604 344038 348198 352653
57902 352653 358075 363773 368854 373301 376766 378002 376754 374554 372545 370228 367362 365120 364144 363497 362795
57887 362795 363269 365278 366859 366409 364811 363310 361245 357720 353644 350209 346872 342608 337615 332171 325527
57872 325527 317643 310371 305147 301062 296929 293581 292250 292297 292547 293458 295957 299445 302940 307044 312800
57857 312800 319675 326527 333629 341929 351178 360392 369295 377850 385356 391450 396985 402550 407234 410139
$$ packed form
57965C02332Q7j138m26R68N18o73J23K084K283P78j90o18j888k937j832P2J3j286
57947B98270j014N82Q89j42l37L03m4q37K88L130N165N860O881Q386Q909Q721
57931C45010R482J0796J0621Q883P279N903L423K72j710k488l469m488m359l879
57917C81276m852o705p345o850o905p149n637k598k81P99K092L759M434M160M455
57902C52653N422N698N081M447L465J236j248k200k009k317k866k242r76o47p02
57887C62795M74K009J581m50j598j501k065l525m076l435l337m264m993n444o644
57872C25527p884p272n224m085m133l348j331M7K50R11K499L488L495M104N756
57857C12800O875O852P102Q300R249R214Q903Q555P506O094N535N565M684K905
$$ plain form
57843 410139 411818 412840 412284 409244 404494 399058 392446 383930 374355 364967 355731 346510 338609 333248
57829 333248 329577 326030 322641 320224 318322 315913 313316 311632 311020 311136 312313 314644 316817 317621 317778
57814 317778 318656 320027 320689 320313 318917 315470 308999 300431 291665 283474 275863 269517 265066 261735 258620
57799 258620 256653 257467 260881 265227 269511 273540 276613 277975 278176 278328 278552 278715 279979 283723 289420
57784 289420 295392 301294 308121 316091 324257 332004 339392 346232 352248 357853 363497 368688 372869 376593
57770 376593 380393 383210 383505 381317 377700 372837 366323 358692 350883 342782 333952 325190 317614 310791
57756 310791 303610 296434 290457 285465 280328 275396 272266 271289 271275 271601 272757 274822 277269 280335 284800
57741 284800 290261 295316 299524 303551 307362 310026 311409 312383 313227 313431 313233 313681 314940 316092 316851 317987
$$ packed form
57843D10139J679J022n56l040m750n436o612q516r575r388r236r221p901n361
57829C33248l671l547l389k417j902k409k597j684o12J16J177K331K173Q04J57
57814C17778Q78J371O62l76j396l447o471q568q766q191p611o346m451l331l115
57799B58620j967Q14L414M346M284M029L073J362K01J52K24J63J264L744N697
57784B89420N972N902O827P970Q166P747P388O840O016N605N644N191M181L724
57770C76593L800K817K95k188l617m863o514p631p809q101q830q762p576o823
57756C10791p181p176n977m992n137m932l130r77j4L26J156K065K447L066M465
57741B84800N461N055M208M027L811K664J383R74Q44K04j98M48J259J152P59J136
$$ plain form
57725 317987 319793 321637 323291 325283 327686 329908 331947 334412 336999 338271 337354 334815 331666 328563
57711 328563 325949 323750 320869 316276 310633 305598 301604 297728 293768 290793 289401 288958 289058 290345 293385
57696 293385 297921 303642 310464 317507 322898 325204 324350 320895 315311 308241 300559 292781 285035 277651
57682 277651 271150 265742 261654 259710 260679 264312 270019 278223 289964 305539 324880 349091 380184
57669 380184 419389 467129 524671 594036 675221 763606 849403 918912 958074 958537 922321 860139
57657 860139 784782 706190 631057 563673 505618 456078 413834 378530 349885 326862 308201
57646 308201 293015 280649 270732 263460 258856 255781 252733 249582 247319 246153 245200 244084 243346 243083
57632 243083 242545 241520 240740 240570 240479 240200 240117 240135 239381 237495 235116 232732 230124 227282 224736 222577 220212
$$ packed form
57725C17987J806J844J654J992K403K222K039K465K587J272r17k539l149l103
57711C28563k614k199k881m593n643n035l994l876l960k975j392m43J00J287L040
57696B93385M536N721O822P043N391K306q54l455n584p070p682p778p746p384
57682B77651o501n408m088j944R69L633N707Q204J1741J5575J9341K4211L1093
57669C80184L9205M7740N7542O9365Q1185Q8385Q5797O9509L9162M63l6216o2182
57657H60139p5357p8592p5133o7384n8055m9540m2244l5304k8645k3023j8661
57646C08201j5186j2366r917p272m604l075l048l151k263j166r53j116p38k63
57632B43083n38j025p80j70r1k79q3J8p54j886k379k384k608k842k546k159k365
$$ plain form
57615 220212 217406 214580 211843 208880 205968 203925 202797 201771 200609 199924 199780 199372 198424 197591 197095 196339
57599 196339 195323 195059 195942 196923 196919 195951 194370 192117 189356 186737 184430 181890 179042 176653 175023 173375
57583 173375 171039 168282 165583 163150 161506 161359 162388 163233 163078 162171 160595 157935 154583 151839 150036
57568 150036 147961 144875 141741 139618 138146 136553 134956 133697 132440 130985 130055 130309 131273 132044 132338
57553 132338 132269 131982 132102 133574 136345 139123 141034 142545 144174 145418 145770 145695 145688 145320 144195 143090 143167
57536 143167 144643 146898 149270 151116 151850 151524 150783 149895 148629 147326 146916 147364 147359 146230 145042 145031 146014
57519 146014 147134 148127 149052 149829 150788 152634 155086 156708 157011 157556 159899 163471 166602 168761 170597 172510
57503 172510 174255 175413 175433 173883 171391 169484 168751 168086 166480 164467 162848 161134 158527 155544 153354
$$ packed form
57615B20212k806k826k737k963k912k043j128j026j162o85j44m08r48q33m96p56
57599A96339j016k64Q83R81mr68j581k253k761k619k307k540k848k389j630j648
57583A73375k336k757k699k433j644j47J029Q45j55r07j576k660l352k744j803
57568A50036k075l086l134k123j472j593j597j259j257j455r30K54R64P71K94
57553A32338o9k87J20J472K771K778J911J511J629J244L52p5pl68j125j105P7
57536A43167J476K255K372J846P34l26p41q88j266j303m10M48nj129j188j1R83
57519A46014J120R93R25P77R59J846K452J622L03N45K343L572L131K159J836J913
57503A72510J745J158K0j550k492j907p33o65j606k013j619j714k607k983k190
$$ plain form
57488 153354 152137 151247 150404 149692 148926 147976 147189 146713 146069 145109 144542 144761 145088 145045 145253 146050 146325 145053
57470 145053 143013 141631 140938 140079 139012 138264 137590 136433 135276 135141 136054 137278 138754 141058 144162 147355
57454 147355 150157 152400 153787 154323 154747 155583 156275 156279 156330 157487 159461 161124 162161 162983 163517 163481 163530 164767
57436 164767 167212 169872 172113 173916 175108 175572 175948 176998 178417 179350 179848 180722 182149 183534 184553
57421 184553 185251 185362 184689 184041 184643 186557 188670 190139 190980 191379 191464 191738 192848 194934 197827 201517 205640
57404 205640 208915 210169 209707 208761 207946 207193 206715 206830 207169 207316 208055 210640 214885 219208 222615 225455
57388 225455 228180 230641 232965 236056 240671 246648 253361 260350 267254 273635 279081 283332 286448 289071
57374 289071 292045 295359 297972 299208 299697 300275 300654 300105 298888 298023 298077 299029 300904 303581 306375 308626
$$ packed form
57488A53354j217q90q43p12p66r50p87m76o44r60n67K19L27m3K08P97K75j272
57470A45053k040j382o93q59j067p48o74j157j157j35R13J224J476K304L104L193
57454A47355K802K243J387N36M24Q36O92MN1J157J974J663J037Q22N34l6M9J237
57436A64767K445K660K241J803J192M64L76J050J419R33M98Q74J427J385J019
57421A84553O98J11o73o48O02J914K113J469Q41L99Q5K74J110K086K893L690M123
57404B05640L275J254m62r46q15p53m78J15L39J47P39K585M245M323L407K840
57388B25455K725K461K324L091M615N977O713O989O904O381N446M251L116K623
57374B89071K974L314K613J236M89N78L79n49j217q65N4R52J875K677K794K251
$$ plain form
57358 308626 310334 311624 312376 313167 315505 319898 324603 327708 329723 332568 336790 341478 346373 352067 358346
57343 358346 364173 369405 374830 380486 385571 390125 395225 401239 407364 413125 418941 424947 430627 435901
57329 435901 441326 446915 452037 456698 461703 467246 472552 477199 481674 486415 491390 496776 502900 509357
57315 509357 515335 520938 526997 533489 539440 544600 549873 555847 562198 568785 575965 583447 590185 595974
57301 595974 601960 609092 617112 625462 633988 642351 650013 657405 666024 676710 688715 700857 712646
57288 712646 723927 734572 745082 756465 768912 781473 793486 805463 818079 831195 844341
57277 844341 857366 870218 882892 895912 910028 925220 940846 956871 973868 991619 1008931
57266 1008931 1025257 1041333 1057800 1074394 1091014 1108361 1126826 1145764 1164630 1183858 1203889
$$ packed form
57358C08626J708J290P52P91K338M393M705L105K015K845M222M688M895N694O279
57343C58346N827N232N425N656N085M554N100O014O125N761N816O006N680N274
57329D35901N425N589N122M661N005N543N306M647M475M741M975N386O124O457
57315E09357N978N603O059O492N951N160N273N974O351O587P180P482O738N789
57301E95974N986P132Q020Q350Q526Q363P662P392Q619J0686J2005J2142J1789
57288G12646J1281J0645J0510J1383J2447J2561J2013J1977J2616J3116J3146
57277H44341J3025J2852J2674J3020J4116J5192J5626J6025J6997J7751J7312
57266A008931J6326J6076J6467J6594J6620J7347J8465J8938J8866J9228K0031
$$ plain form
57255 1203889 1224150 1243827 1263080 1282857 1303916 1326302 1349253 1371480 1392252 1412350 1433193
57244 1433193 1455054 1477098 1499116 1521843 1545406 1568895 1592038 1615906 1641228 1667226 1692973
57233 1692973 1718877 1745954 1774424 1803764 1833431 1862939 1891971 1921048 1951323 1983227 2015954
57222 2015954 2048652 2081254 2113805 2146022 2178088 2210967 2245263 2280505 2316080 2352044 2388577
57211 2388577 2425509 2462872 2501094 2540199 2579666 2619446 2660183 2702026 2744274 2786627 2829695
57200 2829695 2873667 2917593 2960655 3003095 3045181 3086242 3125501 3163019 3199133 3233822 3267362
57189 3267362 3300769 3334861 3369586 3404841 3441210 3479330 3519232 3560708 3603582 3647291 3691068
57178 3691068 3734851 3779001 3822959 3865483 3906534 3947462 3988766 4029116 4067304 4103658 4138704
$$ packed form
57255A203889K0261J9677J9253J9777K1059K2386K2951K2227K0772K0098K0843
57244A433193K1861K2044K2018K2727K3563K3489K3143K3868K5322K5998K5747
57233A692973K5904K7077K8470K9340K9667K9508K9032K9077L0275L1904L2727
57222B015954L2698L2602L2551L2217L2066L2879L4296L5242L5575L5964L6533
57211B388577L6932L7363L8222L9105L9467L9780M0737M1843M2248M2353M3068
57200B829695M3972M3926M3062M2440M2086M1061L9259L7518L6114L4689L3540
57189C267362L3407L4092L4725L5255L6369L8120L9902M1476M2874M3709M3777
57178C691068M3783M4150M3958M2524M1051M0928M1304M0350L8188L6354L5046
$$ plain form
57167 4138704 4171971 4203233 4233524 4263680 4293014 4320645 4346945 4372411 4396184 4417040 4434916
57156 4434916 4450131 4462032 4469818 4473997 4475646 4474824 4471048 4464822 4457469 4449801 4442034 4434596 4428060 4422669
57142 4422669 4418816 4417518 4419604 4424906 4432905 4443498 4456310 4470028 4483350 4496074 4508559 4520933
57130 4520933 4533693 4548303 4566166 4587513 4611989 4639550 4669890 4701708 4733486 4764352 4793521
57119 4793521 4819729 4842212 4861683 4879708 4897888 4918257 4943485 4975769 5016256 5066198 5127764
57108 5127764 5203297 5295051 5406516 5542838 5709360 5911416 6156807 6457409 6827808 7284513
57098 7284513 7848532 8547935 9416960 10493880 11820267 13438986 15388269 17695018 20371268
57089 20371268 23412728 26797738 30488665 34436359 38583636 42865500 47207445 51517960
$$ packed form
57167D138704L3267L1262L0291L0156K9334K7631K6300K5466K3773K0856J7876
57156D434916J5215J1901P786M179J649q22l776o226p353p668p767p438o536n391
57142D422669l853j298K086N302P999J0593J2812J3718J3322J2724J2485J2374
57130D520933J2760J4610J7863K1347K4476K7561L0340L1818L1778L0866K9169
57119D793521K6208K2483J9471J8025J8180K0369K5228L2284M0487M9942O1566
57108E127764P5533R1754J11465J36322J66522K02056K45391L00602L70399M56705
57098G284513N64019O99403Q69025J076920J326387J618719J949283K306749K676250
57089B0371268L041460L385010L690927L947694M147277M281864M341945M310515
$$ plain form
57081 51517960 55668880 59475009 62703996 65129866 66597469 67049179 66505112 65032601
57073 65032601 62734756 59750020 56240951 52371243 48287145 44112357 39951630 35895640
57065 35895640 32023258 28399568 25071182 22063761 19384378 17025852 14969932 13190393
57057 13190393 11657389 10340942 9211971 8242846 7409091 6690406 6069531 5530992 5061525
57048 5061525 4650643 4289845 3971743 3690170 3440140 3217144 3017206 2837743 2677178
57039 2677178 2533289 2403068 2284554 2177467 2081507 1995379 1918225 1850622 1793112 1744790
57029 1744790 1704506 1672676 1650864 1640168 1640836 1652447 1672604 1694840 1708686 1703132 1671598 1615123
57017 1615123 1541407 1460238 1379024 1301709 1230209 1165305 1106483 1052653 1003633 960083 921885
$$ packed form
57081E1517960M150920L806129L228987K425870J467603M51710n44067j472511
57073F5032601k297845k984736l509069l869708m084098m174788m160727m055990
57065C5895640l872382l623690l328386l007421k679383k358526k055920j779539
57057A3190393j533004j316447j128971r69125q33755p18685o20875n38539m69467
57048E061525m10882l60798l18102k81573k50030k22996j99938j79463j60565
57039B677178j43889j30221j18514j07087r5960q6128p7154o7603n7510m8322
57029A744790m0284l1830k1812j0696O68J1611K0157K2236J3846n554l1534n6475
57017A615123p3716q1169q1214p7315p1500o4904n8822n3830m9020m3550l8198
$$ plain form
57006 921885 887715 856518 828374 803439 780995 760064 740188 721173 702666 684340 666050
56995 666050 647710 629578 612560 597451 584024 571726 561152 553743 550109 549844 553043 560661 572913
56982 572913 588252 604071 617390 624921 624203 615563 602083 586984 571697 556550 542013 528606
56970 528606 516497 505853 496979 489846 484253 480663 479935 482048 486189 492422 502123 516240 534142
56957 534142 554614 576773 599085 618273 630207 631818 622238 603040 577823 550684 524345 499830
56945 499830 477730 458841 443507 431349 422062 415735 412315 411715 414637 422283 434953 451886 472716
56932 472716 498059 528268 562278 597493 629565 652389 660352 651884 630278 600739 567543 533856
56920 533856 502266 474127 449152 426544 405913 386847 368695 351546 336579 324828 316234 310181
$$ packed form
57006I21885l4170l1197k8144k4935k2444k0931j9876j9015j8507j8326j8290
56995F66050j8340j8132j7018j5109j3427j2298j0574p409l634k65L199P618J2252
56982E72913J5339J5819J3319P531p18q640j3480j5099j5287j5147j4537j3407
56970E28606j2109j0644q874p133n593l590p28K113M141O233R701J4117J7902
56957E34142K0472K2159K2312J9188J1934J611r580j9198k5217k7139k6339k4515
56945D99830k2100j8889j5334j2158r287o327l420o00K922P646J2670J6933K0830
56932D72716K5343L0209L4010L5215L2072K2824P963q468k1606k9539l3196l3687
56920E33856l1590k8139k4975k2608k0631j9066j8152j7149j4967j1751q594o053
$$ plain form
56908 310181 306010 302697 299118 295122 291463 288424 285605 283280 282505 283378 284580 285332 286571 289460 293989
56893 293989 299763 306950 315612 325285 336087 349175 365385 384428 405829 428926 451002 467230
56881 467230 474144 472254 464159 451433 434868 416408 398730 383293 370322 360308 354019 351343
56869 351343 351519 354468 360893 371278 385797 405075 430135 461782 500668 547429 601518 659513
56857 659513 714813 759033 784391 786751 767933 734707 694604 652646 611801 574689 543275 517796
56845 517796 497627 483104 475464 475335 482373 496261 517327 546440 585025 634825 696869 770764
56833 770764 854936 945995 1036204 1112331 1159509 1168229 1138670 1079401 1002661 919821 838945 764632
56821 764632 699154 643392 597143 559659 530599 510197 498441 494782 498937 511316 532376 562329
$$ packed form
56908C10181m171l313l579l996l659l039k819k325p75Q73J202P52J239K889M529
56893B93989N774P187Q662R673J0802J3088J6210J9043K1401K3097K2076J6228
56881D67230O914j890q095j2726j6565j8460j7678j5437j2971j0014o289k676
56869C51343J76K949O425J0385J4519J9278K5060L1647L8886M6761N4089N7995
56857F59513N5300M4220K5358K360j8818l3226m0103m1958m0845l7112l1414k5479
56845E17796k0169j4523p640j29P038J3888K1066K9113L8585M9800O2044P3895
56833G70764Q4172R1059R0209P6127M7178Q720k9559n9269p6740q2840q0876p4313
56821G64632o5478n5762m6249l7484k9060k0402j1756l659M155J2379K1060K9953
$$ plain form
56809 562329 601821 651901 712392 780184 848806 908737 948785 959912 940038 895236 835707
56798 835707 770751 706839 647957 595879 550672 512132 480536 455752 436755 422830 414346 411591
56786 411591 413866 420585 432326 449884 473203 501945 535673 571965 605053 627804 635118 625384
56774 625384 600283 564480 524266 484544 447043 411948 380155 352762 329440 308967 290921
56763 290921 275580 262684 251556 242092 234488 228377 223153 218684 214868 211102 207125 203657 201280
56750 201280 199391 197230 195091 193491 192010 190108 188220 186859 185525 183773 182454 182436 182908 182536 181583
56735 181583 181339 181986 182594 182776 182839 182708 182184 181920 182717 184162 185235 185868 186636 187388 187599 187655 188409 189798
56717 189798 191180 192559 194163 195381 195568 195454 196228 197668 198654 199044 199491 199845 199471 198841 199105 200265 201345
$$ packed form
56809E62329L9492N0080O0491O7792O8622N9931M0048J1127j9874m4802n9529
56798H35707o4956o3912n8882n2078m5207l8540l1596k4784j8997j3925q484k755
56786D11591K275O719J1741J7558K3319K8742L3728L6292L3088K2751P314r734
56774F25384k5101l5803m0214l9722l7501l5095l1793k7393k3322k0473j8046
56763B90921j5341j2896j1128r464p604o111n224m469l816l766l977l468k377
56750B01280j889k161k139j600j481j902j888j361j334j752j319j8M72l72r53
56735A81583k44O47O08J82O3j31n24k64P97J445J073O33P68P52K11N6P54J389
56717A89798J382J379J604J218J87j14P74J440R86L90M47L54l74o30K64J160J080
$$ plain form
56700 201345 202140 203210 204360 204822 204837 205351 206218 206349 205627 204977 204569 203663 202357 201740 202023 202103 201376 200511
56682 200511 200073 199727 199211 198871 198881 199051 199639 201222 203548 205604 206984 208152 209329 210256 211078 212293 213721
56665 213721 214618 214925 215365 216316 217544 218904 220301 221159 221065 220678 220887 221459 221747 222231 223800 225965 227425
56648 227425 228216 229492 231280 232231 231688 230319 228610 226406 224091 222538 221620 220359 218793 218074 218415 218596
56632 218596 217873 216877 216176 215495 214740 214349 214175 213382 211894 210658 210072 209430 208226 206714 204910 202377 199333
56615 199333 196727 194909 193439 192289 191937 192166 192197 192081 192455 192898 192234 190625 189580 189600 189581 188949 188572 189013
56597 189013 189708 190541 192427 195459 198107 199267 199766 200896 202647 204191 205077 205261 204877 204454 204423 204263 203327
56580 203327 202493 203386 205814 207694 207928 207527 207459 207362 207145 207912 210169 212750 214651 216497 219164 222309 225358
$$ packed form
56700B01345P95J070J150M62J5N14Q67J31p22o50m08r06j306o17K83Q0p27q65
56682B00511m38l46n16l40J0J70N88J583K326K056J380J168J177R27Q22J215J428
56665B13721Q97L07M40R51J228J360J397Q58r4l87K09N72K88M84J569K165J460
56648B27425P91J276J788R51n43j369j709k204k315j553r18j261j566p19L41J81
56632B18596p23r96p01o81p55l91j74p93j488j236n86o42j204j512j804k533l044
56615A99333k606j818j470j150l52K29L1j16L74M43o64j609j045K0j9o32l77M41
56597A89013O95Q33J886L032K648J160M99J130J751J544Q86J84l84m23l1j60r36
56580B03327q34Q93K428J880K34m01o8r7k17P67K257K581J901J846K667L145L049
$$ plain form
56563 225358 228705 232913 237948 244181 252963 265041 279238 293460 306062 315664 320980 321893 319827
56550 319827 316255 311654 306341 301098 296280 291420 286368 281772 277871 273969 269694 265645 262241 259083
56536 259083 255972 253366 251353 249410 247550 246355 245463 243631 240801 238528 237702 237498 237277 237774 239470
56521 239470 241398 242630 243446 244095 243883 242521 240963 239836 238440 236321 234410 233429 232621 231202 229761
56506 229761 228997 228322 227002 225570 224885 224781 224762 224983 225514 225590 224642 223230 222092 221194 220428 220184 220475 220580
56488 220580 220213 219953 220016 219922 219870 220878 222879 224289 224255 223748 223677 223678 223657 224599 226674 228299 228402 228005 228366 229204
56468 229204 230019 231390 233464 234803 234316 232933 231966 231268 230423 230144 230854 231368 230675 229736 229906 230905 231910
56451 231910 233303 235632 238061 239493 240143 240570 240446 239793 240009 241978 244361 245418 245307 245022 244411 243032
$$ packed form
56563B25358L347M208N035O233Q782J2078J4197J4222J2602R602N316R13k066
56550C19827l572m601n313n243m818m860n052m596l901l902m275m049l404l158
56536B59083l111k606k013j943j860j195q92j832k830k273q26k04k21M97J696
56521B39470J928J232Q16O49k12j362j558j127j396k119j911r81q08j419j441
56506B29761p64o75j320j432o85j04j9K21N31P6r48j412j138q98p66k44K91J05
56488B20580l67k60O3r4n2J008K001J410l4n07p1Jk1R42K075J625J03l97L61Q38
56468B29204Q15J371K074J339m87j383r67o98q45k79P10N14o93r39J70R99J005
56451B31910J393K329K429J432O50M27j24o53K16J969K383J057j11k85o11j379
$$ plain form
56435 243032 241698 241295 241139 240235 239091 238595 238288 237524 237156 238194 239829 240614 240649 240816 240857 240070 238935 238283
56417 238283 237796 236979 236625 237518 238751 239132 239266 240366 242016 243008 243508 244462 245688 246477 247274 248894 250766
56400 250766 251729 251878 252014 252117 251961 252308 253713 255074 255088 254294 254032 254334 254506 254702 255221 255409 255031 255526
56382 255526 258003 261147 263092 264143 265584 267070 267519 267481 268264 269575 270229 270337 270637 270696 270025 269873 271496
56365 271496 273628 274176 273520 273610 274625 275169 275074 275271 275434 274459 272948 272650 273705 274830 275869 277770 280288
56348 280288 282063 282785 283107 282840 281452 280021 280428 282828 285903 289051 292289 294727 295555 295999 297966 301273
56332 301273 304429 307381 311007 314614 316651 317466 318803 320989 323110 325371 328577 331825 333509 334207 335817
56317 335817 338217 339575 339607 339663 339891 339266 338187 338125 338811 338748 338346 339509 342171 344421 346113 349215 354258
$$ packed form
56435B43032j334m03j56r04j144m96l07p64l68J038J635P85L5J67M1p87j135o52
56417B38283m87q17l54Q93J233L81J34J100J650R92N00R54J226P89P97J620J872
56400B50766R63J49J36J03j56L47J405J361J4p94k62L02J72J96N19J88l78M95
56382B55526K477L144J945J051J441J486M49l8P83J311O54J08L00N9o71j52J623
56365B71496K132N48o56R0J015N44r5J97J63r75j511k98J055J125J039J901K518
56348B80288J775P22L22k67j388j431M07K400L075L148L238K438Q28M44J967L307
56332C01273L156K952L626L607K037Q15J337K186K121K261L206L248J684O98J610
56317C35817K400J358L2N6K28o25j079o2O86o3m02J163K662K250J692L102N043
$$ plain form
56300 354258 359623 364784 371163 379041 386453 391893 395616 397776 397896 396739 396177 396625 396930 397106 398712
56285 398712 402151 406099 409957 414429 419409 423873 428219 434090 441483 448512 454420 460360 466902 473309
56271 473309 479593 486811 494978 503107 511480 521428 532872 544661 557239 572103 588672 604862 620951
56258 620951 639669 662116 686841 713486 744043 779752 819874 864356 914677 971234 1032777
56247 1032777 1099255 1172301 1252128 1336815 1425398 1518638 1615861 1713934 1810218 1903629 1991929
56236 1991929 2071009 2137929 2191941 2231728 2254655 2259872 2249376 2225027 2187223 2137387 2078827
56225 2078827 2013977 1943402 1868312 1791362 1714213 1637035 1560986 1488234 1418948 1351471 1286057
56214 1286057 1225099 1168973 1115345 1063592 1016225 974611 936887 901569 869686 841631 815299
$$ packed form
56300C54258N365N161O379P878P412N440L723K160J20j157n62M48L05J76J606
56285C98712L439L948L858M472M980M464M346N871P393P029N908N940O542O407
56271D73309O284P218Q167Q129Q373R948J1444J1789J2578J4864J6569J6190J6089
56258F20951J8718K2447K4725K6645L0557L5709M0122M4482N0321N6557O1543
56247A032777O6478P3046P9827Q4687Q8583R3240R7223R8073R6284R3411Q8300
56236A991929P9080O6920N4012L9787K2927N217j0496k4349l7804m9836n8560
56225B078827o4850p0575p5090p6950p7149p7178p6049p2752o9286o7477o5414
56214A286057o0958n6126n3628n1753m7367m1614l7724l5318l1883k8055k6332
$$ plain form
56203 815299 789258 764776 743015 723053 704304 687946 674405 662180 650554 640618 632387 623998
56191 623998 615078 607747 602881 598592 593809 590054 588113 586264 583528 581490 581104 580818 579591 578711 578990
56176 578990 579209 578943 579822 582404 584950 586793 589656 594096 598078 600699 603902 608810 613887 618459 624438
56161 624438 632688 641228 648952 657592 668113 678842 689052 700655 714330 727890 740685 755708
56149 755708 775029 797075 820819 848662 882582 921484 965211 1017325 1080922 1155320 1239675
56138 1239675 1336034 1445629 1565619 1692209 1823052 1953386 2073924 2176757 2260949 2329894
56128 2329894 2386943 2436630 2485791 2538463 2591473 2637919 2672685 2692712 2696015 2684160 2662823
56117 2662823 2636660 2605748 2568382 2523100 2465616 2388670 2289054 2171742 2044531 1912660 1781257
$$ packed form
56203H15299k6041k4482k1761j9962j8749j6358j3541j2225j1626r936q231q389
56191F23998q920p331m866m289m783l755j941j849k736k038l86k86j227q80K79
56176E78990K19k66Q79K582K546J843K863M440L982K621L203M908N077M572N979
56161F24438Q250Q540P724Q640J0521J0729J0210J1603J3675J3560J2795J5023
56149G55708J9321K2046K3744K7843L3920L8902M3727N2114O3597P4398Q4355
56138A239675R6359J09595J19990J26590J30843J30334J20538J02833Q4192O8945
56128B329894N7049M9687M9161N2672N3010M6446L4766K0027L303j1855k1337
56117B662823k6163l0912l7366m5282n7484p6946r9616j17312j27211j31871j31403
$$ plain form
56106 1781257 1657811 1547655 1450512 1365029 1292822 1234591 1186604 1145170 1110833 1084444 1063210
56095 1063210 1044653 1030385 1021799 1015979 1010030 1005470 1004196 1004127 1003132 1003262 1006716 1011518 1015432 1020110
56081 1020110 1027069 1033820 1038461 1043901 1052936 1063372 1072549 1082254 1094385 1106377 1115975 1126090 1139737
56068 1139737 1154623 1167953 1182065 1199821 1218875 1236083 1253243 1272951 1293147 1311326 1329617
56057 1329617 1350124 1369936 1386459 1402796 1421974 1440896 1456142 1470578 1487844 1505615 1521057
56046 1521057 1537567 1558988 1582334 1603544 1625180 1650941 1677852 1701761 1725337 1752508 1780121
56035 1780121 1803562 1825689 1851796 1880590 1908787 1939628 1977875 2021092 2064687 2110700 2162627
56024 2162627 2216595 2267072 2316413 2369407 2423558 2474456 2525528 2582445 2643098 2703170 2766133
$$ packed form
56106A781257j23446j10156r7143q5483p2207n8231m7987m1434l4337k6389k1234
56095A063210j8557j4268q586n820n949m560j274o9r95J30L454M802L914M678
56081A020110O959O751M641N440R035J0436R177R705J2131J1992R598J0115J3647
56068A139737J4886J3330J4112J7756J9054J7208J7160J9708K0196J8179J8291
56057A329617K0507J9812J6523J6337J9178J8922J5246J4436J7266J7771J5442
56046A521057J6510K1421K3346K1210K1636K5761K6911K3909K3576K7171K7613
56035A780121K3441K2127K6107K8794K8197L0841L8247M3217M3595M6013N1927
56024B162627N3968N0477M9341N2994N4151N0898N1072N6917O0653O0072O2963
$$ plain form
56013 2766133 2837138 2912583 2986625 3062443 3145846 3233517 3319294 3406316 3501001 3600839 3700544
56002 3700544 3804323 3919207 4042203 4167082 4297600 4440587 4592596 4747509 4910409
55993 4910409 5089150 5279397 5473610 5677507 5901336 6142445 6393530 6660178 6952073
55984 6952073 7265007 7590975 7938086 8320269 8735473 9175153 9646710 10164095 10725109
55975 10725109 11321943 11965522 12674726 13451220 14291469 15213541 16244002 17389741 18653762
55966 18653762 20067667 21676499 23505684 25580687 27967478 30756918 34028869 37881349
55958 37881349 42485572 48072237 54890992 63242414 73528032 86210726 101765179 120746284
55950 120746284 143856301 171831251 205271674 244537081 289262069 337051769 382219644
$$ packed form
56013B766133P1005P5445P4042P5818Q3403Q7671Q5777Q7022R4685R9838R9705
56002C700544J03779J14884J22996J24879J30518J42987J52009J54913J62900
55993D910409J78741J90247J94213K03897K23829K41109K51085K66648K91895
55984F952073L12934L25968L47111L82183M15204M39680M71557N17385N61014
55975A0725109N96834O43579P09204P76494Q40249R22072J030461J145739J264021
55966A8653762J413905J608832J829185K075003K386791K789440L271951L852480
55958C7881349M604223N586665O818755Q351422J0285618J2682694J5554453J8981105
55950A20746284K3110017K7974950L3440423L9265407M4724988M7789700M5167875
$$ plain form
55943 382219644 416493120 432332533 426731191 402444597 365902584 323919206 281610296
55936 281610296 242029651 206615442 175721227 149120462 126425591 107255754 91201888
55929 91201888 77819297 66701313 57502961 49895641 43566150 38268768 33828190 30088352
55921 30088352 26901347 24162838 21810939 19784307 18015107 16460154 15100899 13909974
55913 13909974 12848607 11896217 11051384 10302475 9625045 9008095 8455558 7960791 7504474
55904 7504474 7078549 6688734 6332720 5998139 5682565 5394043 5130923 4881318 4643016
55895 4643016 4424394 4225018 4034278 3850108 3680873 3527589 3381721 3241790 3115386
55886 3115386 3003257 2897388 2796264 2706744 2629389 2556471 2485665 2421266 2360741 2294477 2220759
$$ packed form
55943C82219644L4273476J5839413n601342k4286594l6542013m1983378m2308910
55936B81610296l9580645l5414209l0894215k6600765k2694871j9169837j6053866
55929I1201888j3382591j1117984r198352p607320o329491n297382m440578l739838
55921C0088352l187005k738509k351899k026632j769200j554953j359255j190925
55913A3909974j061367r52390q44833p48909o77430o16950n52537m94767m56317
55904G504474m25925l89815l56014l34581l15574k88522k63120k49605k38302
55895D643016k18622j99376j90740j84170j69235j53284j45868j39931j26404
55886C115386j12129j05869j01124q9520p7355p2918p0806o4399o0525o6264p3718
$$ plain form
55875 2220759 2147754 2079208 2011049 1943121 1880885 1823702 1764179 1701301 1642281 1589657 1538369
55864 1538369 1487392 1442454 1404922 1369237 1333679 1302924 1277573 1251689 1223234 1196961 1174525
55853 1174525 1151295 1125439 1100848 1078711 1055063 1028828 1003649 979850 953261 923972 897641
55842 897641 876074 854870 832351 812440 796602 781152 764842 751192 741016 730256 717478
55831 717478 706150 697435 688015 677101 668352 662745 656623 648727 642120 637172 629801 618833 608103
55818 608103 599077 588323 574699 562199 553107 544730 535463 527788 522715 517356 510671 505830 504407
55805 504407 503774 502597 503368 507256 511828 516005 521919 529929 537188 543017 550073 558211 562879 561954 558710
55790 558710 555676 550950 542998 533901 525330 516248 506956 500420 497077 492958 485242 475227 464000 450137
$$ packed form
55875B220759p3005o8546o8159o7928o2236n7183n9523o2878n9020n2624n1288
55864A538369n0977m4938l7532l5685l5558l0755k5351k5884k8455k6273k2436
55853A174525k3230k5856k4591k2137k3648k6235k5179k3799k6589k9289k6331
55842H97641k1567k1204k2519j9911j5838j5450j6310j3650j0176j0760j2778
55831G17478j1328q715r420j0914q749n607o122p896o607m948p371j0968j0730
55818F08103r026j0754j3624j2500r092q377r267p675n073n359o685m841j423
55805E04407o33j177P71L888M572M177N914Q010P259N829P056Q138M668r25l244
55790E58710l034m726p952r097q571r082r292o536l343m119p716j0015j1227j3863
$$ plain form
55776 450137 433916 418921 407021 396229 385652 377861 374183 372198 370150 369313 369895 369290 366725 365056
55762 365056 365664 365986 364414 363012 362995 362074 358840 355380 352956 349472 343897 338863 335959 332508 325925
55747 325925 317500 309249 300818 292130 285221 280655 275779 269142 263041 259232 255913 251546 247793 245850
55733 245850 243682 239880 236650 235940 236006 234770 233215 232449 230763 226814 222614 220225 218353 215246 212068
55718 212068 210364 208961 206488 204395 204427 205459 205645 205360 205445 205038 203870 204186 207566 212069 215154 217124
55702 217124 219126 220091 218466 214911 210749 205744 199762 194491 191113 188312 184792 181606 179789 178061
55688 178061 175243 172701 171985 172154 171829 171818 173491 176609 180811 186945 194804 201935 206932 211454 216680
55673 216680 220404 220402 218229 216824 216481 215998 215785 216924 218868 220784 223526 227817 232181 235118 237500 240423
$$ packed form
55776D50137j6221j4995j1900j0792j0577p791l678j985k048q37N82o05k565j669
55762C65056O08L22j572j402j7r21l234l460k424l484n575n034k904l451o583
55747C25925q425q251q431q688o909m566m876o637o101l809l319m367l753j943
55733B45850k168l802l230p10O6j236j555p66j686l949m200k389j872l107l178
55718B12068j704j403k473k093L2J032J86k85Q5m07j168L16L380M503L085J970
55702B17124K002R65j625l555m162n005n982n271l378k801l520l186j817j728
55688A78061k818k542p16J69l25j1J673L118M202O134P859P131M997M522N226
55673B16680L724kk173j405l43m83k13J139J944J916K742M291M364K937K382K923
$$ plain form
55657 240423 242654 242789 242057 242287 242878 242515 242151 243434 245578 246568 246270 245850 245299 243887 241865 239528 235834
55640 235834 230048 223384 217106 210604 203346 196826 192256 188143 182672 176837 172729 170258 168107 166375
55626 166375 165688 165108 163558 162102 162375 164000 165778 167917 170744 172781 172709 171725 171415 170769 168071 164246
55610 164246 161449 159568 157074 154173 152148 150570 148146 145528 144371 144280 143525 142181 141756 142231 142207 141602
55594 141602 141519 141724 140793 138692 136890 136062 135755 136026 137291 138844 139547 139758 140726 142525 144320 146137 148569
55577 148569 151406 154377 158550 165079 173292 181899 191232 202380 215023 228186 242145 257237 271565
55564 271565 282305 288769 292051 292386 289199 283097 275380 266012 254419 241818 230414 220613 211329
55551 211329 202629 195688 190330 185030 179362 174314 170244 166559 163367 161393 160292 158868 156953 155300
$$ packed form
55657B40423K231J35p32K30N91l63l64J283K144R90k98m20n51j412k022k337l694
55640B35834n786o664o278o502p258o520m570m113n471n835m108k471k151j732
55626A66375o87n80j550j456K73J625J778K139K827K037p2r84l10o46k698l825
55610A64246k797j881k494k901k025j578k424k618j157r1p55j344m25M75k4o05
55594A41602q3K05r31k101j802q28l07K71J265J553P03K11R68J799J795J817K432
55577A48569K837K971M173O529Q213Q607R333J1148J2643J3163J3959J5092J4328
55564B71565J0740O464L282L35l187o102p717r368j1593j2601j1404r801r284
55551B11329q700o941n358n300n668n048m070l685l192j974j101j424j915j653
$$ plain form
55537 155300 153855 151954 150021 149253 149767 150678 151672 152826 153402 152657 151465 151260 151777 151573 150297 148616
55521 148616 146511 143633 140757 138872 137315 134827 131862 129738 128189 126041 123707 122507 121947 120256
55507 120256 117415 115138 114031 113214 112645 113207 114470 114913 114545 114791 115639 115463 113995 112889 112812 112498 111328
55490 111328 110423 110387 110219 109365 108791 109087 109428 109276 109381 110197 110953 111104 111180 111568 111895 112214 113255 114927 116053
55471 116053 116109 115772 115367 114315 112570 111038 110021 108793 107210 106235 106341 106813 107131 107606 108220 108309 107861
55454 107861 107699 107929 107674 106725 105999 105907 105782 105390 105536 106581 107811 108730 109625 110407 110333 109408 108643 108465 108300
55435 108300 108129 108883 110669 112094 112128 111322 110577 109996 109582 109708 110205 110186 109428 108853 109089 109741 110484 111609
55417 111609 112973 113735 113769 114078 115189 116379 117085 117821 119002 120028 120288 120015 119478 118418 116937 115858
$$ packed form
55537A55300j445j901j933p68N14R11R94J154N76p45j192k05N17k04j276j681
55521A48616k105k878k876j885j557k488k965k124j549k148k334j200n60j691
55507A20256k841k277j107q17n69N62J263M43l68K46Q48j76j468j106p7l14j170
55490A11328r05l6j68q54n74K96L41j52J05Q16P56J51P6L88L27L19J041J672J126
55471A16053N6l37m05j052j745j532j017j228j583r75J06M72L18M75O14Q9m48
55454A07861j62K30k55r49p26r2j25l92J46J045J230R19Q95P82p4r25p65j78j65
55435A08300j71P54J786J425L4q06p45n81m14J26M97j9p58n75K36O52P43J125
55417A11609J364P62L4L09J111J190P06P36J181J026K60k73n37j060j481j079
$$ plain form
55401 115858 115518 115184 114324 113496 113317 113503 113579 113683 113996 114226 114216 114320 114636 114598 113857 112897 112372 112467 113141 114261
55381 114261 115327 115796 115852 116069 116289 115797 114648 113748 113437 112999 111810 109991 107842 105678 104303 104458 105572
55364 105572 106155 105660 104917 104592 104338 103699 102748 101600 100291 99293 99169 99716 100449 101693 103950 106404 107562
55347 107562 107320 106863 106599 105951 105201 105566 107081 108283 108471 108484 108766 108598 107975 108298 110109 111769 111552 109734
55329 109734 107650 105975 104930 104904 105810 106763 107278 107871 108925 110048 111046 112219 113154 112716 110987 109733
55313 109733 110029 110824 110835 110471 110695 111261 111303 110765 110101 109388 108708 108555 108994 109209 108671 107909 107444 106985 106331
55294 106331 106016 106280 106518 106487 106946 108250 109464 109808 109901 110576 111485 111830 111546 110885 109831 108747 108486 108918
55276 108918 108511 106460 104191 103560 104520 105731 106579 107350 108153 108884 109696 110501 110634 109876 109157 109368 110203 110981
$$ packed form
55401A15858l40l34q60q28j79J86P6J04L13K30j0J04L16l8p41r60n25R5O74J120
55381A14261J066M69N6K17K20m92j149r00l11m38j189j819k149k164j375J55J114
55364A05572N83m95p43l25k54o39r51j148j309r98j24N47P33J244K257K454J158
55347A07562k42m57k64o48p50L65J515J202J88J3K82j68o23L23J811J660k17j818
55329A09734k084j675j045k6R06R53N15N93J054J123R98J173R35m38j729j254
55313A09733K96P95J1l64K24N66M2n38o64p13o80j53M39K15n38p62m65m59o54
55294A06331l15K64K38l1M59J304J214L44R3O75R09L45k84o61j054j084k61M32
55276A08918m07k051k269o31R60J211Q48P71Q03P31Q12Q05J33p58p19K11Q35P78
$$ plain form
55258 110981 111694 112359 112326 111360 110506 110732 111443 111507 111004 110731 110648 110116 109208 108555 108200 107689 107061 106797 106996 107348
55238 107348 107650 107747 107361 106556 105914 105732 105655 105545 105885 106721 107139 106580 105782 105538 105383 104533 103333 102727 102848
55219 102848 103172 103572 104316 105423 106749 108231 109478 109797 109288 109108 109979 111213 111928 112311 112831 113143 112832
55202 112832 112440 112715 113489 114180 114674 114903 114425 113343 112708 112996 113116 112047 110476 109560 109012 107916 106631
55185 106631 106255 106743 107126 107303 108064 109512 110841 111701 112598 113904 115431 116903 118028 118280 117427 116101
55169 116101 115070 114300 113442 112755 112691 112972 113017 112861 112840 112809 112498 112146 111993 111708 111168 111144 112208 113586 114157
55150 114157 113975 113767 113508 112718 111666 111054 110863 110652 110616 111161 111781 111553 110562 109783 109714 110093 110659 111306 111753
55131 111753 111873 111957 111948 111066 109087 107207 106519 106416 105769 104958 105216 106533 107829 108860 110408 112650 114779
$$ packed form
55258A10981P13O65l3r66q54K26P11O4n03k73q3n32r08o53l55n11o28k64J99L52
55238A07348L02R7l86q05o42j82p7j10L40Q36M18n59p98k44j55q50j200o06J21
55219A02848L24M00P44J107J326J482J247L19n09j80Q71J234P15L83N20L12l11
55202A12832l92K75P74O91M94K29m78j082o35K88J20j069j571r16n48j096j285
55185A06631l76M88L83J77P61J448J329Q60Q97J306J527J472J125K52q53j326
55169A16101j031p70q58o87o4K81M5j56k1l1l11l52j53k85n40k4J064J378N71
55150A14157j82k08k59p90j052o12j91k11l6N45O20k28r91p79o9L79N66O47M47
55131A11753J20Q4rq82j979j880o88j03o47q11K58J317J296J031J548K242K129
$$ plain form
55114 114779 116187 116838 116678 115929 115685 116808 118388 118709 117642 116734 116964 117797 118499 118981 119176 118850 118259
55097 118259 117928 117695 117045 116385 116815 118562 120755 122774 124665 126223 126890 126799 126788 127166 127424 127255 126895 126415
55079 126415 125698 125121 125196 125519 125175 124203 123583 123722 124107 124445 124895 125092 124248 122534 121185 120908 121262 121818
55061 121818 122676 123561 123642 122843 122264 122689 123581 124032 123886 123411 122711 122014 121843 122348 122945 123006 122495 121697 120860
55042 120860 120243 120000 119878 119561 119331 119824 121037 122178 122543 122103 121265 120559 120405 120626 120485 119758 119380 120240
55024 120240 121750 122560 122394 122160 122504 123271 124208 125122 125504 125002 124193 123895 123970 123776 123434 123463 123532 122964 122238
55005 122238 122468 123518 124197 124260 124560 125135 124967 123998 123627 124558 125705 125978 125785 125988 126640 127505 128717 130155
54987 130155 131153 131513 131835 132347 132449 132026 132078 133301 135017 136164 136470 136066 134956 133606 133064 133670 134419
$$ packed form
55114A14779J408O51j60p49k44J123J580L21j067r08K30Q33P02M82J95l26n91
55097A18259l31k33o50o60M30J747K193K019J891J558O67r1j1L78K58j69l60m80
55079A26415p17n77P5L23l44r72o20J39L85L38M50J97q44j714j349k77L54N56
55061A21818Q58Q85Q1p99n79M25Q92M51j46m75p00o97j71N05N97O1n11p98q37
55042A20860o17k43j22l17k30M93J213J141L65m40q38p06j54K21j41p27l78Q60
55024A20240J510Q10j66k34L44P67R37R14L82n02q09k98P5j94l42K9O9n68p26
55005A22238K30J050O79O3L00N75j68r69l71R31J147K73j93K03O52Q65J212J438
54987A30155R98L60L22N12J02m23N2J223J716J147L06m04j110j350n42O06P49
$$ plain form
54970 134419 134313 133586 132929 132303 131352 130358 130010 130608 131971 133638 134904 135236 134983 135013 135522 135993 136389 137271
54952 137271 138488 138964 138316 137548 137512 137808 137875 138045 138679 139283 139394 139470 139947 140210 139438 137852 136292 135190
54934 135190 134711 135200 136601 138038 138799 139264 140162 141549 143258 145686 149196 153251 157074 160839 165451
54919 165451 171390 178518 186616 195357 203916 211293 216937 220707 222502 222277 220106 215892 209499 201516
54905 201516 193353 186110 179813 174097 169034 164809 161181 157885 155126 153194 151975 151239 150905 150704 150105
54890 150105 149017 148044 147684 147793 148160 148980 150359 151988 153726 155876 158550 161489 164829 169262 174973
54875 174973 181346 188175 196168 205475 214624 221842 226703 229555 230063 227447 221831 214370 206195 197877
54861 197877 189760 182194 175618 170640 167642 166084 164839 163503 162545 161873 160341 157381 154046 151552 149647
$$ packed form
54970A34419j06p27o57o26r51r94l48N98J363J667J266L32k53L0N09M71L96Q82
54952A37271J217M76o48p68l6K96O7J70O34O04J11P6M77K63p72j586j560j102
54934A35190m79M89J401J437P61M65Q98J387J709K428L510M055L823L765M612
54919A65451N939P128Q098Q741Q559P377N644L770J795k25k171m214o393p983
54905B01516q163p243o297n716n063m225l628l296k759j932j219p36l34k01n99
54890A50105j088r73l60J09L67Q20J379J629J738K150K674K939L340M433N711
54875A74973O373O829P993R307R149P218M861K852N08k616n616p461q175q318
54861A97877q117p566o576m978k998j558j245j336r58o72j532k960l335k494j905
$$ plain form
54846 149647 147478 145152 143286 141712 139986 138652 138634 139555 139906 138912 137242 135885 135222 135162 135342 135133 134186
54829 134186 133023 132484 132676 133004 133096 133093 133123 133078 132864 132463 131841 131197 131015 131499 132267 132979 133869 135211 136699
54810 136699 137851 138635 139195 139401 139184 138820 138408 137641 136643 136359 137441 139329 141203 143185 145720 148291
54794 148291 149797 149906 149180 148160 147127 146423 146137 145804 145169 144836 145337 146079 146230 146201 147065 148773 150151
54777 150151 150622 150791 151336 152432 154345 157440 161281 164659 166962 168901 171662 175928 181849 189265 197693
54762 197693 206614 215924 225634 235049 242750 247519 248931 247184 242895 237040 230467 223324 215353 206689
54748 206689 197977 189807 182492 176271 171147 166651 162294 158289 155356 153803 153188 152801 152157 151182 150321
54733 150321 150296 151327 152789 154012 155149 156820 159202 162003 165040 168344 171935 175988 180932 186887 193284
$$ packed form
54846A49647k169k326j866j574j726j334j8R21L51r94j670j357o63o0J80k09r47
54829A34186j163n39J92L28R2lL0m5k14m01o22o44j82M84P68P12Q90J342J488
54810A36699J152P84N60K06k17l64m12p67r98k84J082J888J874J982K535K571
54794A48291J506J09p26j020j033p04k86l33o35l33N01P42J51k9Q64J708J378
54777A50151M71J69N45J096J913L095L841L378K303J939K761M266N921P416Q428
54762A97693Q921R310R710R415P701M769J412j747m289n855o573p143p971q664
54748B06689q712q170p315o221n124m496m357m005k933j553o15l87o44r75q61
54733A50321k5J031J462J223J137J671K382K801L037L304L591M053M944N955O397
$$ plain form
54718 193284 199518 205574 211457 216442 219563 220490 219376 216307 211573 205979 200064 193492 186064 178830
54704 178830 173125 168881 164987 161118 158061 156337 155503 154866 153968 152443 150359 148648 148231 148730 148881 148163
54688 148163 147051 145850 144432 143146 142731 143078 143178 142613 142026 141788 141275 140014 138617 137982 138201 138755 139161
54671 139161 139034 138138 136836 135980 136000 136490 136877 136983 136769 136178 135439 134942 134590 133910 133006 132728 133562 134950
54653 134950 136038 136591 136863 137119 137575 138327 139042 139140 138543 137830 137554 137816 138526 139468 140073 139811 139023 138676 139046
54634 139046 139371 139122 138911 139600 141064 142344 142649 141859 140441 139238 138943 139391 139635 139069 138153 137761 138111
54617 138111 138667 138901 138818 138791 139044 139306 139079 138348 137777 137882 138283 138213 137542 136773 136314 136363 137244 138935 140405
54598 140405 140392 139040 137847 137817 138491 139056 139483 140108 140912 141813 142997 144399 145370 145431 144964 144716 144929 145319
$$ packed form
54718A93284O234O056N883M985L121R27j114l069m734n594n915o572p428p234
54704A78830n705m244l894l869l057j724q34o37q98j525k084j711m17M99J51p18
54688A48163j112j201j418j286m15L47J00n65n87k38n13j261j397o35K19N54M06
54671A39161j27q96j302q56K0M90L87J06k14n91p39m97l52o80r04k78Q34J388
54653A34950J088N53K72K56M56P52P15R8n97p13k76K62P10R42O05k62p88l47L70
54634A39046L25k49k11O89J464J280L05p90j418j203k95M48K44n66r16l92L50
54617A38111N56K34q3k7K53K62k27p31n71J05M01p0o71p69m59M9Q81J691J470
54598A40405j3j352j193l0O74N65M27O25Q04R01J184J402R71O1m67k48K13L90
$$ plain form
54580 145319 145451 144839 143162 140858 139059 138477 138681 138873 138960 139384 140233 141098 141699 142181 142762 143423 143964 144247
54562 144247 144425 144915 145976 147293 148229 148531 148557 148791 149380 150095 150460 149990 148751 147630 147624 148795 150320 151521
54544 151521 152357 152975 153433 153919 154678 155576 156250 156770 157575 158684 159555 159853 159765 159365 158374 156810 155295 154345
54526 154345 153816 153317 152706 151952 150983 149932 149074 148374 147564 146808 146717 147445 148346 148790 148819 148719 148489 148056 147564
54507 147564 147178 146976 147249 148328 149934 151182 151527 151189 150539 149675 148801 148317 148176 147814 147027 146342 146111 145983
54489 145983 145686 145623 146144 146874 147417 148113 149378 150776 151567 151892 152568 153816 154884 155031 154392 153740 153683 154232
54471 154232 155038 155978 157320 159131 160846 161943 162911 164778 167557 169920 170652 169785 168079 166156 164551
54456 164551 163770 163656 163263 161991 160390 159386 159178 159406 159776 159950 159353 157830 156139 155120 154674 154120 153250
$$ packed form
54580A45319J32o12j677k304j799n82K04J92Q7M24Q49Q65O01M82N81O61N41K83
54562A44247J78M90J061J317R36L02K6K34N89P15L65m70j239j121oJ171J525J201
54544A51521Q36O18M58M86P59Q98O74N20Q05J109Q71K98q8m00r91j564j515r50
54526A54345n29m99o11p54r69j051q58p00q10p56r1P28R01M44K9j00k30m33m92
54507A47564l86k02K73J079J606J248L45l38o50q64q74m84j41l62p87o85k31j28
54489A45983k97o3N21P30N43O96J265J398P91L25O76J248J068J47o39o52n7N49
54471A54232Q06R40J342J811J715J097R68J867K779K363P32q67j706j923j605
54456A64551p81j14l93j272j601j004k08K28L70J74n97j523j691j019m46n54q70
$$ plain form
54439 153250 152426 151904 151655 151672 151989 152578 153573 155243 157319 158769 158796 157798 156824 156440 156590 157257 158570 160364
54421 160364 162141 163405 163813 163339 162574 162418 163038 163569 163307 162674 162421 162430 162094 161527 161458 162067 162782 163239 163753
54402 163753 164652 165681 166234 165892 164789 163673 163434 164222 165319 166238 167534 169978 173210 175912 177188 177187
54386 177187 176495 175521 174479 173421 172235 171019 170389 170929 172381 173783 174370 174011 172968 171747 171031 171157
54370 171157 171664 171860 171799 172157 173145 174141 174610 174948 176095 178511 181682 184583 186653 188373 190691 193762
54354 193762 196600 198224 198768 198963 198870 197833 195578 192715 189991 187542 185068 182417 179770 177446 175630
54339 175630 174214 172932 171741 170902 170523 170281 169838 169322 169087 169140 169150 168857 168202 167228 166194 165638 165936 166862
54321 166862 167914 168954 170229 171841 173531 174935 175793 175998 175725 175424 175425 175525 175151 173892 171817 169416
$$ packed form
54439A53250q24n22k49J7L17N89R95J670K076J450K7r98r74l84J50O67J313J794
54421A60364J777J264M08m74p65j56O20N31k62o33k53Rl36n67o9O09P15M57N14
54402A63753Q99J029N53l42j103j116k39P88J097R19J296K444L232K702J276j
54386A77187o92r74j042j058j186j216o30N40J452J402N87l59j043j221p16J26
54370A71157N07J96o1L58R88R96M69L38J147K416L171K901K070J720K318L071
54354A93762K838J624N44J95r3j037k255k863k724k449k474k651k647k324j816
54339A75630j416j282j191q39l79k42m43n16k35N3J0k93o55r74j034n56K98R26
54321A66862J052J040J275J612J690J404Q58K05k73l01JJ00l74j259k075k401
$$ plain form
54305 169416 167283 165682 164343 162920 161634 161067 161308 161801 162195 162761 163677 164489 164726 164561 164411 164330 164259 164412
54287 164412 164910 165441 165808 166403 167575 168943 169958 170743 171752 172912 173820 174534 175395 176231 176443 175834 174807
54270 174807 173804 173013 172503 172164 171650 170902 170533 171255 173042 175220 177085 178107 178013 177222 176743 177040 177468
54253 177468 177460 177635 178805 180446 181305 181212 181094 181343 181431 181100 180711 180182 178823 176662 174895 174471 174992 175435
54235 175435 175239 174286 172582 170501 168788 167872 167570 167721 168480 169683 170614 170879 171046 171916 173562 175473 177247
54218 177247 178716 179761 180427 181045 181872 182778 183504 184045 184605 185325 186106 186485 185801 183841 181295 179157 177708
54201 177708 176566 175581 174992 174646 173929 172780 172042 172349 173215 173758 173792 173691 173594 173394 173248 173471 173988 174339 174282
54182 174282 174015 173764 173454 172920 172294 172027 172444 173293 173910 173919 173646 173632 173962 174397 174966 175925 177123 177881 177623
$$ packed form
54305A69416k133j601j339j423j286n67K41M93L94N66R16Q12K37j65j50q1p1J53
54287A64412M98N31L67N95J172J368J015P85J009J160R08P14Q61Q36K12o09j027
54270A74807j003p91n10l39n14p48l69P22J787K178J865J022r4p91m79K97M28
54253A77468qJ75J170J641Q59r3j18K49Q8l31l89n29j359k161j767m24N21M43
54235A75435j96r53j704k081j713r16l02J51P59J203R31K65J67Q70J646J911J774
54218A77247J469J045O66O18Q27R06P26N41N60P20P81L79o84j960k546k138j449
54201A77708j142r85n89l46p17j149p38L07Q66N43L4j01r7k00j46K23N17L51n7
54182A74282k67k51l10n34o26k67M17Q49O17Rk73j4L30M35N69R59J198P58k58
$$ plain form
54163 177623 176386 174638 172944 171839 171627 172123 172794 173202 173142 172506 171417 170434 170198 170746 171548 172197 172669
54146 172669 172854 172380 171118 169543 168345 167889 168176 169078 170464 172198 174023 175448 175998 175783 175578 175964
54130 175964 176642 176961 176832 176563 176092 175111 173835 172921 172606 172581 172779 173569 174992 176433 177298 177602 177823 178630
54112 178630 180695 184053 187551 189581 189646 188665 187708 187110 186958 187584 189047 190691 191739 191998 191723 191203 190700
54095 190700 190404 190176 189739 189303 189549 190792 192578 194345 196052 198057 200788 204621 209540 214835 219760
54080 219760 224503 229705 234820 237885 237493 234336 230293 226615 223527 220932 218739 216775 215011 213698
54066 213698 212926 212334 211627 211040 210980 211505 212387 213272 213604 212954 211781 211277 212073 213652 215369 217290 219454
54049 219454 221131 221720 221917 222995 225208 227764 230219 233016 236625 240995 246076 252224 259753 268372 277359
$$ packed form
54163A77623j237j748j694j105k12M96O71M08o0o36j089r83k36N48Q02O49M72
54146A72669J85m74j262j575j198m56K87R02J386J734J825J425N50k15k05L86
54130A75964O78L19j29k69m71r81j276r14l15k5J98P90J423J441Q65L04K21Q07
54112A78630K065L358L498K030O5r81r57n98j52O26J463J644J048K59k75n20n03
54095A90700k96k28m37m36K46J243J786J767J707K005K731L833M919N295M925
54080B19760M743N202N115L065l92l157m043l678l088k595k193j964j764j313
54066B13698p72n92p07n87o0N25Q82Q85L32o50j173n04P96J579J717J921K164
54049B19454J677N89J97J078K213K556K455K797L609M370N081O148P529Q619Q987
$$ plain form
54034 277359 286182 294914 304048 313819 323680 332682 340391 347060 352756 356898 359017 359519 359255 358661 357792
54019 357792 356823 355938 354902 353319 351191 348808 346228 343294 339984 336311 331971 326592 320341 313913 307862
54004 307862 302184 296521 290617 284657 279273 275048 271843 268814 265270 261300 257463 254188 251635 249769
53990 249769 248329 247020 245905 245277 245002 244502 243573 242634 241855 240738 238996 237174 235820 234672 233379 232497
53974 232497 232834 234134 235234 235372 234642 233410 232032 230985 230499 230170 229649 229522 230691 232914 234884 235855
53958 235855 236362 237132 238114 239002 240037 241711 244040 246617 249226 252103 255584 259645 263853 267897 272178
53943 272178 277609 284579 292483 300641 309360 319551 331579 345082 359590 374330 387382 396058 398760
53930 398760 396171 390442 383692 377359 372214 368334 365351 363191 362453 363758 366955 371286 376198 381598
$$ packed form
54034B77359Q823Q732R134R771R861R002P709O669N696M142K119N02k64n94q69
54019C57792r69q85j036j583k128k383k580k934l310l673m340n379o251o428o051
54004C07862n678n663n904n960n384m225l205l029l544l970l837l275k553j866
53990B49769j440j309j115o28k75n00r29r39p79j117j742j822j354j148j293q82
53974B32497L37J300J100J38p30j232j378j047m86l29n21j27J169K223J970R71
53958B35855N07P70R82Q88J035J674K329K577K609K877L481M061M208M044M281
53943B72178N431O970P904Q158Q719J0191J2028J3503J4508J4740J3052Q676K702
53930C98760k589n729o750o333n145l880k983k160p38J305L197M331M912N400
$$ plain form
53916 381598 387435 393446 399537 406217 414293 424005 434542 444614 453467 461127 467701 472856 476206 477877
53902 477877 478352 477996 477050 475873 474754 473499 471505 468194 463244 456690 449090 441287 433586 425366 415952
53887 415952 405629 395266 385207 375176 365170 355705 347091 339101 331577 324781 318929 313837 309247
53874 309247 305074 301131 297080 292878 288896 285307 281802 278103 274371 270763 267001 262830 258651 255232
53860 255232 252851 251100 249493 247936 246582 245451 244312 242883 241143 239436 238175 237431 236929 236474 236127
53845 236127 235886 235475 234671 233687 232974 232716 232742 232856 232979 233007 232768 232269 231802 231622 231604 231335 230598 229659 229053 229134
53825 229134 229809 230682 231401 231911 232360 232811 233195 233657 234720 236758 239341 241568 243189 244926 247412 250324
53809 250324 253032 255647 258706 262099 265224 268211 272064 277353 283490 289658 295805 302277 309043 315769
$$ packed form
53916C81598N837O011O091O680Q076R712J0537J0072Q853P660O574N155L350J671
53902D77877M75l56r46j177j119j255j994l311m950o554p600p803p701q220r414
53887D15952j0323j0363j0059j0031j0006r465q614p990p524o796n852n092m590
53874C09247m173l943m051m202l982l589l505l699l732l608l762m171m179l419
53860B55232k381j751j607j557j354j131j139j429j740j707j261p44n02m55l47
53845B36127k41m11q04r84p13k58K6J14J23K8k39m99m67j80j8k69p37r39o06Q1
53825B29134O75Q73P19N10M49M51L84M62J063K038K583K227J621J737K486K912
53809B50324K708K615L059L393L125K987L853N289O137O168O147O472O766O726
$$ plain form
53795 315769 322257 328345 333714 338269 342441 346739 351210 355548 359393 362315 363982 364669 365084 365292 364387
53780 364387 361690 357720 353361 348638 343080 336852 330620 324544 318296 311987 306200 301004 295735 289970
53766 289970 284157 279068 275045 271910 269230 266559 263725 260909 258251 255537 252600 249782 247553 245868
53752 245868 244335 242861 241658 240795 240254 240199 240653 241119 241026 240384 239461 238205 236685 235716 236090 237374 238413
53735 238413 238915 239479 240105 239990 239053 238458 239090 240505 241980 243602 245516 246979 247195 246659 246784 248416 251348
53718 251348 254942 258517 261363 263141 264332 265758 267672 269628 271206 272460 273744 275405 277626 280295
53704 280295 283068 285777 288617 291781 295105 298336 301608 305387 310039 315586 321647 327383 331767 334297
53690 334297 335398 335836 335833 335032 333297 331185 329502 328553 327906 326901 325314 323535 322041 320861 319682 318388
$$ packed form
53795C15769O488O088N369M555M172M298M471M338L845K922J667O87M15K08r05
53780C64387k697l970m359m723n558o228o232o076o248o309n787n196n269n765
53766B89970n813n089m023l135k680k671k834k816k658k714k937k818k229j685
53752B45868j533j474j203q63n41n5M54M66r3o42r23j256j520r69L74J284J039
53735B38413N02N64O26j15r37n95O32J415J475J622J914J463K16n36J25J632K932
53718B51348L594L575K846J778J191J426J914J956J578J254J284J661K221K669
53704B80295K773K709K840L164L324L231L272L779M652N547O061N736M384K530
53690C34297J101M38lq01j735k112j683r49o47j005j587j779j494j180j179j294
$$ plain form
53674 318388 317167 316077 314837 313223 311433 309893 308810 308048 307321 306446 305541 304999 305080 305473 305498 304807 303675
53657 303675 302524 301466 300464 299688 299405 299613 299963 300084 299936 299912 300590 302233 304469 306585 308154 309310
53641 309310 310441 311810 313494 315492 317741 320035 321976 323125 323421 323546 324555 326872 329845 332555 334876
53626 334876 337402 340518 343979 347360 350456 353202 355608 357913 360575 363972 368231 373236 378660 384210
53612 384210 390076 396856 404661 412590 419618 425760 431774 437858 443347 447665 450849 453071 454387 455202
53598 455202 456282 457921 459556 460494 460586 459976 458694 456872 454933 453168 451361 449100 446292 443185 440113
53583 440113 437306 434721 432034 429107 426405 424561 423508 422540 421265 419954 418826 417540 415656 413137
53569 413137 410292 407631 405862 405396 405699 405689 404985 404148 403548 402804 401697 400813 400656 400807 400658 400469 400936 402069
$$ packed form
53674C18388j221j090j240j614j790j540j083p62p27q75r05n42Q1L93K5o91j132
53657C03675j151j058j002p76k83K08L50J21j48k4O78J643K236K116J569J156
53641C09310J131J369J684J998K249K294J941J149K96J25J009K317K973K710K321
53626C34876K526L116L461L381L096K746K406K305K662L397M259N005N424N550
53612C84210N866O780P805P929P028O142O014O084N489M318L184K222J316Q15
53598D55202J080J639J635R38R2o10j282j822j939j765j807k261k808l107l072
53583D40113k807k585k687k927k702j844j053r68j275j311j128j286j884k519
53569D13137k845k661j769m66L03j0p04q37o00p44j107q84j57J51j49j89M67J133
$$ plain form
53551 402069 403234 404127 405016 406106 407225 408193 409100 410216 411864 414283 417393 420860 424593 428921 434072
53536 434072 439719 445323 450659 455908 461504 468077 476062 485102 494304 503458 513504 525318 538470
53523 538470 551756 564654 577690 591522 606196 621280 636371 651531 667424 684831 703888
53512 703888 724091 745182 767541 791409 816364 842011 868552 895980 923203 948878 972933
53501 972933 996397 1019757 1042222 1062732 1081131 1098209 1115016 1132195 1149609 1166617 1182988
53490 1182988 1199417 1216767 1234958 1253097 1270528 1287262 1303477 1319284 1335050 1351345 1368274
53479 1368274 1385255 1401636 1417233 1432073 1445858 1457831 1467023 1472639 1474473 1473052 1469229 1463589
53467 1463589 1456247 1447029 1435637 1421878 1406055 1389083 1371932 1355004 1338283 1321833 1305720 1289521
$$ packed form
53551D02069J165Q93Q89J090J119R68R07J116J648K419L110L467L733M328N151
53536D34072N647N604N336N249N596O573P985R040R202R154J0046J1814J3152
53523E38470J3286J2898J3036J3832J4674J5084J5091J5160J5893J7407J9057
53512G03888K0203K1091K2359K3868K4955K5647K6541K7428K7223K5675K4055
53501I72933K3464K3360K2465K0510J8399J7078J6807J7179J7414J7008J6371
53490A182988J6429J7350J8191J8139J7431J6734J6215J5807J5766J6295J6929
53479A368274J6981J6381J5597J4840J3785J1973R192N616J834j421l823n640
53467A463589p342r218j1392j3759j5823j6972j7151j6928j6721j6450j6113j6199
$$ plain form
53455 1289521 1272399 1253854 1234118 1213775 1193208 1172520 1151781 1131240 1111372 1092718 1075547
53444 1075547 1059637 1044392 1029244 1014102 999707 987499 978718 973411 970478 968632 967010 965039
53432 965039 962599 960630 960734 963456 967457 971123 974556 979222 985972 994409 1004125 1015486 1028920 1044156
53418 1044156 1060624 1078127 1096775 1116667 1137935 1160790 1185278 1211232 1238685 1268048 1299598
53407 1299598 1332996 1367569 1403005 1439600 1477902 1518241 1560595 1604798 1650794 1698689 1748555
53396 1748555 1800263 1853479 1907748 1962613 2017831 2073452 2129503 2185607 2241158 2295823 2349493
53385 2349493 2401713 2451680 2498979 2543850 2586409 2626086 2662245 2694927 2724459 2750562 2772408
53374 2772408 2789358 2801267 2808200 2810283 2807673 2800237 2787325 2768162 2742349 2709799 2670614 2625474
$$ packed form
53455A289521j7122j8545j9736k0343k0567k0688k0739k0541j9868j8654j7171
53444A075547j5910j5245j5148j5142j4395j2208q781n307k933j846j622j971
53432I65039k440j969J04K722M001L666L433M666O750Q437R716J1361J3434J5236
53418A044156J6468J7503J8648J9892K1268K2855K4488K5954K7453K9363L1550
53407A299598L3398L4573L5436L6595L8302M0339M2354M4203M5996M7895M9866
53396A748555N1708N3216N4269N4865N5218N5621N6051N6104N5551N4665N3670
53385B349493N2220M9967M7299M4871M2559L9677L6159L2682K9532K6103K1846
53374B772408J6950J1909O933K083k610p436j2912j9163k5813l2550l9185m5140
$$ plain form
53362 2625474 2575895 2523603 2469825 2415511 2361737 2309114 2257068 2204536 2151496 2099243 2049188
53351 2049188 2001966 1957674 1916178 1876892 1838763 1800839 1762593 1723732 1684171 1644364 1605212
53340 1605212 1567453 1531397 1497312 1465630 1436598 1410083 1385890 1363934 1343952 1325427 1308064
53329 1308064 1292105 1277852 1264935 1252294 1238901 1224448 1209333 1194076 1178922 1164090 1150250
53318 1150250 1138306 1128652 1120920 1114592 1109486 1105514 1102454 1100322 1099572 1100503 1102798 1106098 1110679 1117079
53304 1117079 1125295 1134901 1145661 1157578 1170585 1184815 1200927 1219484 1240136 1262022 1284904 1309252
53292 1309252 1335299 1362677 1390962 1419865 1448788 1476876 1503669 1529093 1552684 1573454 1590887
53281 1590887 1605540 1618277 1629175 1637447 1642224 1643245 1640942 1636029 1628918 1619556 1607854 1593999 1578152
$$ packed form
53362B625474m9579n2292n3778n4314n3774n2623n2046n2532n3040n2253n0055
53351B049188m7222m4292m1496l9286l8129l7924l8246l8861l9561l9807l9152
53340A605212l7759l6056l4085l1682k9032k6515k4193k1956j9982j8525j7363
53329A308064j5959j4253j2917j2641j3393j4453j5115j5257j5154j4832j3840
53318A150250j1944r654p732o328n106l972l060k132p50R31K295L300M581O400
53304A117079Q216R606J0760J1917J3007J4230J6112J8557K0652K1886K2882K4348
53292A309252K6047K7378K8285K8903K8923K8088K6793K5424K3591K0770J7433
53281A590887J4653J2737J0898Q272M777J021k303m913p111r362j1702j3855j5847
$$ plain form
53268 1578152 1560202 1540155 1518466 1495500 1471042 1444924 1417851 1390876 1364201 1337264 1309856
53257 1309856 1282325 1254636 1226184 1196825 1167356 1138668 1110978 1084190 1058443 1033893 1010338
53246 1010338 987352 964474 941109 916708 891347 865920 841499 818604 797064 776367 756168
53235 756168 736650 718360 701617 686436 673222 662794 655034 648113 640089 630991 622260 614339 606061
53222 606061 596466 585914 575035 563723 551763 539472 527074 514263 501010 488094 476156 464875
53210 464875 453765 443224 434083 426523 420078 414341 409047 403792 398304 392826 387718 382808 377577 371814
53196 371814 365716 359479 353171 346925 341044 335893 331725 328397 325306 321970 318647 315979 314002 312044
53182 312044 309707 307326 305281 303454 301626 299843 298107 296215 294199 292410 290856 289026 286662 284207
$$ packed form
53268A578152j7950k0047k1689k2966k4458k6118k7073k6975k6675k6937k7408
53257A309856k7531k7689k8452k9359k9469k8688k7690k6788k5747k4550k3555
53246A010338k2986k2878k3365k4401k5361k5427k4421k2895k1540k0697k0199
53235G56168j9518j8290j6743j5181j3214j0428p760o921q024r098q731p921q278
53222F06061r595j0552j0879j1312j1960j2291j2398j2811j3253j2916j1938j1281
53210D64875j1110j0541r141p560o445n737n294n255n488n478n108m910n231n763
53196C71814o098o237o308o246n881n151m168l328l091l336l323k668j977j958
53182C12044k337k381k045j827j828j783j736j892k016j789j554j830k364k455
$$ plain form
53168 284207 282186 280739 280012 280311 281330 281898 281117 279285 277241 275307 273438 271852 270746 269728 268273
53153 268273 266577 265378 265057 265400 266074 266872 267551 267872 267772 267340 266741 266276 266257 266660 267224 267957 269130 270650
53135 270650 271993 272984 273995 275062 275477 274772 273583 272929 273091 273636 274139 274342 274083 273640 273802 275003 276693
53118 276693 278016 278807 279510 280476 281881 283883 286302 288456 289831 290668 291434 292033 292031 291294 289914 287887 285381
53101 285381 282900 280633 278080 274909 271836 269922 269306 269246 269123 268764 268102 267240 266683 266855 267503 268052 268309
53084 268309 268259 267595 266172 264673 264068 264545 265570 266738 267821 268285 267720 266733 266518 267317 268006 267463 265882
53067 265882 264509 264388 265428 266411 266023 264121 261852 260321 259466 258615 257622 256855 256427 256147 256038 256240 256563
53050 256563 256732 256909 257436 258302 259415 261020 263188 265210 266270 266468 266396 266006 264859 263255 262114 261655
$$ packed form
53168B84207k021j447p27K99J019N68p81j832k044j934j869j586j106j018j455
53153B68273j696j199l21L43O74P98O79L21j00m32n99m65j9M03N64P33J173J520
53135B70650J343R91J011J067M15p05j189o54J62N45N03K03k59m43J62J201J690
53118B76693J323P91P03R66J405K002K419K154J375Q37P66N99kp37j380k027k506
53101B85381k481k267k553l171l073j914o16o0j23l59o62q62n57J72O48N49K57
53084B68309n0o64j423j499o05M77J025J168J083M64n65r87k15P99O89n43j581
53067B65882j373j21J040R83l88j902k269j531q55q51r93p67m28k80j09K02L23
53050B56563J69J77N27Q66J113J605K168K022J060J98p2l90j147j604j141m59
$$ plain form
53034 261655 261118 259886 258119 256294 254837 254192 254386 254561 253766 252263 251220 251154 251606 252348 253793 255926
53018 255926 257916 259150 259803 260051 259668 258893 258729 259706 261018 261618 261615 261947 263031 264370 265265 265430 264968 264107
53000 264107 262986 261715 260692 260514 261238 262049 262347 262806 264489 267045 268936 269474 269495 269757 269928 269698 269729
52983 269729 270656 272031 273173 274325 276027 277890 279046 279523 280304 282091 284669 287374 289600 290961 291498
52968 291498 291690 291957 292351 292942 294059 295746 297389 298393 298881 299221 299297 298856 298245 297953 297633 296353 293857
52951 293857 290860 288035 285395 282876 280863 279707 279088 278319 277181 276126 275694 275910 276301 276405 276087 275396
52935 275396 274320 272883 271385 270259 269688 269550 269687 269930 269951 269501 268842 268506 268555 268532 268267 268144 268303 268144
52917 268144 267132 265704 264777 264591 264596 264357 264110 264318 265080 266059 266817 267137 267067 266667 265797 264445 263240 263111
$$ packed form
53034B61655n37j232j767j825j457o45J94J75p95j503j043o6M52P42J445K133
53018B55926J990J234O53K48l83p75j64R77J312O00lL32J084J339Q95J65m62q61
53000B64107j121j271j023j78P24Q11K98M59J683K556J891N38K1K62J71k30L1
52983B69729R27J375J142J152J702J863J156M77P81J787K578K705K226J361N37
52968B91498J92K67L94N91J117J687J643J004M88L40P6m41o11k92l20j280k496
52951B93857k997k825k640k519k013j156o19p69j138j055m32K16L91J04l18o91
52935B75396j076j437j498j126n71j38J37K43K1m50o59l36M9k3k65j23J59j59
52917B68144j012j428r27j86Nk39k47K08P62R79P58L20p0m00q70j352j205j29
$$ plain form
52899 263111 264147 265181 264945 263440 261785 260920 260953 261587 262608 263759 264624 264973 265053 265307 265794 266078 265741
52882 265741 264923 264208 263940 263860 263551 263049 262750 262848 263273 264133 265729 267997 270333 272211 273754 275506 277852
52865 277852 280838 284270 287817 291146 294137 296772 298802 299804 299692 298848 297629 296005 293809 291016 287633
52850 287633 283690 279558 275906 273058 270619 267982 264931 261596 258199 255194 253213 252388 251962 251052 249679
52835 249679 248565 248019 247494 246383 244917 244101 244880 247373 250744 253780 255651 256167 255455 253656 251064 248322
52819 248322 246181 245081 244969 245375 245587 245049 243823 242608 242184 242860 244495 246834 249679 252797 255754 257860
52803 257860 258422 257279 255046 252597 250376 248437 246947 246151 245859 245452 244541 243230 241698 240037 238625
52788 238625 238070 238529 239503 240530 241559 242408 242496 241612 240500 240132 240661 241517 242281 243013 243902 244952 245894 246213
$$ packed form
52899B63111J036J034k36j505j655q65L3O34J021J151Q65L49Q0K54M87K84l37
52882B65741q18p15k68q0l09n02k99R8M25Q60J596K268K336J878J543J752K346
52865B77852K986L432L547L329K991K635K030J002j12q44j219j624k196k793l383
52850B87633l943m132l652k848k439k637l051l335l397l005j981q25m26r10j373
52835B49679j114n46n25j111j466q16P79K493L371L036J871N16p12j799k592k742
52819B48322k141j100j12M06K12n38j226j215m24O76J635K339K845L118K957K106
52803B57860N62j143k233k449k221j939j490p96k92m07r11j311j532j661j412
52788B38625n55M59R74J027J029Q49Q8q84j112l68N29Q56P64P32Q89J050R42L19
$$ plain form
52770 246213 245601 244568 244125 244523 244792 244007 242577 241687 241836 242539 243189 243534 243464 243088 243030 243963 245715 247310
52752 247310 248006 247967 247885 248302 249367 250850 252350 253724 255280 257283 259392 261071 262451 264286 266894 269604
52736 269604 271444 272112 272042 271816 271746 271945 272524 273609 275161 276865 278288 279121 279169 278258 276505 274666 273718
52719 273718 273826 274064 273421 271774 269609 267251 264822 262687 261271 260518 259970 259393 258975 258957 259387 260199 261208
52702 261208 262107 262715 263173 263625 263901 263809 263526 263343 263232 263076 263152 263848 265046 266281 267451 268796 270157 270865
52684 270865 270546 269612 268698 267988 267261 266287 264963 263340 261725 260562 260038 259982 260178 260558 260987 261155 260923 260627
52666 260627 260771 261471 262369 263179 264112 265600 267621 269591 271068 272292 273673 275027 275927 276795 278843 282592
52650 282592 287074 290883 293386 294421 293570 290700 286870 283620 281357 279299 277019 275082 273893 272835
$$ packed form
52770B46213o12j033m43L98K69p85j430q90J49P03O50L45p0l76n8R33J752J595
52752B47310O96l9q2M17J065J483J500J374J556K003K109J679J380J835K608K710
52736B69604J840O68p0k26p0J99N79J085J552J704J423Q33M8r11j753j839r48
52719B73718J08K38o43j647k165k358k429k135j416p53n48n77m18j8M30Q12J009
52702B61208Q99O08M58M52K76r2k83j83j11j56P6O96J198J235J170J345J361P08
52684B70865l19r34r14p10p27r74j324j623j615j163n24n6J96L80M29J68k32k96
52666B60627J44P00Q98Q10R33J488K021J970J477J224J381J354R00Q68K048L749
52650B82592M482L809K503J035q51k870l830l250k263k058k280j937j189j058
$$ plain form
52636 272835 271193 269368 268511 269185 270887 272781 274463 276019 277691 279590 281574 283272 284228 284150 283125
52621 283125 281627 280185 278972 277874 276959 276567 276788 277169 277260 277171 277265 277514 277589 277471 277495 277816 278203 278359 278205
52602 278205 277907 277898 278722 280470 282445 283707 283929 283442 282659 281880 281469 281683 282293 282776 282971 283208 283855 285063
52584 285063 286821 288858 290645 291990 293485 295784 298513 300510 301166 300866 300135 299097 298007 297549 298078
52569 298078 299048 299584 299317 298396 297059 295541 294064 292627 291069 289575 288758 288894 289339 289065 287680 285713
52553 285713 284037 283185 283081 283209 283145 282925 282793 282712 282474 282267 282607 283584 284677 285567 286628 288217 289877 290788
52535 290788 290824 290690 291020 291797 292629 293241 293495 293209 292314 291195 290614 291095 292418 293954 295473 297255 299310
52518 299310 300979 301695 301836 302325 303588 305384 307470 309845 312484 315443 319180 324033 329260 333307 335273
$$ packed form
52636B72835j642j825q57O74J702J894J682J556J672J899J984J698R56p8j025
52621B83125j498j442j213j098r15l92K21L81R1q9R4K49P5j18K4L21L87J56j54
52602B78205k98rQ24J748J975J262K22m87p83p79m11K14O10M83J95K37O47J208
52584B85063J758K037J787J345J495K299K729J997O56l00p31j038j090m58N29
52569B98078R70N36k67r21j337j518j477j437j558j494q17J36M45k74j385j967
52553B85713j676q52j04J28o4k20j32q1k38k07L40R77J093Q90J061J589J660R11
52535B90788L6j34L30P77Q32O12K54k86q95j119n81M81J323J536J519J782K055
52518B99310J669P16J41M89J263J796K086K375K639K959L737M853N227M047J966
$$ plain form
52503 335273 335501 334591 332587 329517 326007 322690 319452 315837 311887 308069 304678 301835 299766 298544 297687
52488 297687 296573 295189 294077 293573 293522 293691 294082 294741 295567 296427 297334 298465 299998 301832 303478 304484
52472 304484 305070 306026 307783 309951 312020 314156 316867 320110 323329 326343 329623 333512 337526 340698 342474
52457 342474 343062 342958 342292 340724 337918 333957 329247 324162 318970 314008 309625 305944 302949 300791 299660
52442 299660 299275 298867 297922 296680 295696 295127 294685 294077 293262 292394 291712 291385 291390 291619 292097 292847 293489 293420 292619
52423 292619 291897 292038 292880 293621 293831 293802 294059 294932 296607 299188 302545 306274 310046 313998 318709 324731
52407 324731 332135 340616 350145 361218 374041 387471 399124 406696 409029 406132 398882 389016 378782
52394 378782 369807 362262 355419 348918 343188 338787 335780 333827 332579 331830 331418 331182 331085 331319 332085 333210
$$ packed form
52503C35273K28r10k004l070l510l317l238l615l950l818l391k843k069j222q57
52488B97687j114j384j112n04n1J69L91O59Q26Q60R07J131J533J834J646J006
52472C04484N86R56J757K168K069K136K711L243L219L014L280L889M014L172J776
52457C42474N88j04o66j568k806l961m710n085n192m962m383l681k995k158j131
52442B99660l85m08r45j242r84n69m42o08q15q68o82l27NK29M78P50O42o9q01
52423B92619p22J41Q42P41K10k9K57Q73J675K581L357L729L772L952M711O022
52407C24731P404Q481R529J1073J2823J3430J1653P572K333k897p250r866j0234
52394C78782q975p545o843o501n730m401l007j953j248p49m12k36r7K34P66J125
$$ plain form
52378 333210 334224 335067 336471 339161 342785 346218 348974 351801 355708 360935 367093 373665 379946 385004
52364 385004 388384 390635 392662 394649 396000 396154 395134 393447 391768 390530 389555 388213 386235 384126 382555
52349 382555 381686 381438 381969 383309 384805 385675 386096 387195 389861 393995 398947 404169 409323 414214 418939
52334 418939 423946 429777 436810 445135 454472 464265 474153 484340 495339 507476 520955 536240 553823
52321 553823 573485 594159 614638 634157 652272 668716 683700 698086 712827 728251 744068
52310 744068 759916 775615 791009 805954 820676 835825 851895 868596 885069 900694 915466
52299 915466 929544 942841 955216 966693 977022 985254 990283 991802 990309 986267 979832 971460 962134
52286 962134 952662 943195 933738 924720 916686 909775 903906 899262 896227 895013 895599 897820 901316 905655
$$ packed form
52378C33210J014Q43J404K690L624L433K756K827L907N227O158O572O281N058
52364C85004L380K251K027J987J351J54j020j687j679j238r75j342j978k109j571
52349C82555q69k48N31J340J496Q70M21J099K666M134M952N222N154M891M725
52334D18939N007N831P033Q325R337R793R888J0187J0999J2137J3479J5285J7583
52321E53823J9662K0674K0479J9519J8115J6444J4984J4386J4741J5424J5817
52310G44068J5848J5699J5394J4945J4722J5149J6070J6701J6473J5625J4772
52299I15466J4078J3297J2375J1477J0329Q232N029J519j493m042o435q372r326
52286I62134r472r467r457r018q034o911n869m644l035j214N86K221L496M339
$$ plain form
52272 905655 910796 917250 925542 935696 947339 959908 972556 984341 994934 1004895 1014916 1025142
52260 1025142 1035519 1046371 1058186 1071147 1085271 1100627 1116936 1133386 1149413 1165276 1181194
52249 1181194 1196245 1208889 1218416 1225129 1229216 1230326 1228369 1224039 1218274 1211636 1204397 1196713 1188581
52236 1188581 1179988 1171197 1162591 1154327 1146527 1139648 1134080 1129418 1124779 1119884 1115262 1111325 1107888 1104766
52222 1104766 1102207 1100416 1099210 1098486 1098627 1100031 1102569 1105813 1109609 1114160 1119729 1126390 1133880 1141597
52208 1141597 1148978 1155968 1162863 1169705 1176116 1181719 1186419 1190354 1194034 1198412 1204157 1210702 1216743 1221941
52194 1221941 1227468 1234430 1242383 1250070 1257134 1264295 1272005 1279714 1286617 1292483 1297308 1300537 1301131 1298504
52180 1298504 1293078 1285688 1276551 1265263 1251970 1238127 1225519 1214623 1204498 1194387 1184845 1176933
$$ packed form
52272I05655N141O454Q292J0154J1643J2569J2648J1785J0593R961J0021J0226
52260A025142J0377J0852J1815J2961J4124J5356J6309J6450J6027J5863J5918
52249A181194J5051J2644R527O713M087J110j957m330n765o638p239p684q132
52236A188581q593q791q606q264p800o879n568m662m639m895m622l937l437l122
52222A104766k559j791j206p24J41J404K538L244L796M551N569O661P490P717
52208A141597P381O990O895O842O411N603M700L935L680M378N745O545O041N198
52194A221941N527O962P953P687P064P161P710P709O903N866M825L229N94k627
52180A298504n426p390r137j1288j3293j3843j2608j0896j0125j0111r542p912
$$ plain form
52168 1176933 1170771 1165478 1160457 1156276 1154137 1154632 1157141 1160404 1163666 1167152 1171390 1176219 1180708 1183958
52154 1183958 1185659 1185880 1184718 1182381 1179345 1176202 1173381 1171109 1169462 1168403 1167886 1167944 1168432 1168779 1168312 1166975
52138 1166975 1165396 1164064 1162745 1160904 1158496 1156105 1154500 1154267 1155773 1159217 1164661 1172162 1181906 1194199
52124 1194199 1209335 1227392 1248062 1270759 1294991 1320564 1347290 1374677 1402130 1429335 1456149
52113 1456149 1482220 1507075 1530476 1552322 1572219 1589625 1604487 1617313 1628502 1637995 1645742 1652145
52101 1652145 1657813 1663187 1668550 1674079 1679602 1684482 1687925 1689258 1687974 1683850 1677115 1668079 1656475 1641588
52087 1641588 1623318 1602764 1581505 1560644 1540862 1522984 1507950 1496233 1487569 1481244 1476483 1472817
52075 1472817 1470326 1469511 1470798 1474263 1479887 1487750 1497791 1509597 1522670 1536653 1551142 1565559 1579500
$$ packed form
52168A176933o162n293n021m181k139M95K509L263L262L486M238M829M489L250
52154A183958J701K21j162k337l036l143k821k272j647j059n17N8M88L47m67j337
52138A166975j579j332j319j841k408k391j605k33J506L444N444P501R744J2293
52124A194199J5136J8057K0670K2697K4232K5573K6726K7387K7453K7205K6814
52113A456149K6071K4855K3401K1846J9897J7406J4862J2826J1189R493P747O403
52101A652145N668N374N363N529N523M880L443J333j284m124o735r036j1604j4887
52087A641588j8270k0554k1259k0861j9782j7878j5034j1717q664o325m761l666
52075A472817k491q15J287L465N624P863J0041J1806J3073J3983J4489J4417J3941
$$ plain form
52062 1579500 1592985 1606084 1618553 1630137 1641021 1651520 1661430 1670156 1677549 1684255 1691000 1697669
52050 1697669 1703153 1706081 1705617 1701640 1694294 1683589 1669593 1652807 1634029 1613830 1592437 1570148
52038 1570148 1547521 1525032 1502955 1481808 1462564 1446010 1432074 1420111 1409755 1401089 1393964 1387493
52026 1387493 1380517 1372595 1364443 1357159 1350914 1344585 1336964 1328171 1319451 1311650 1304383 1296850 1288857 1280709
52012 1280709 1272521 1264091 1255207 1245600 1234739 1222051 1207342 1190784 1172641 1153206 1132796 1111497
52000 1111497 1089026 1065237 1040736 1016676 993928 972652 952731 934400 918287 904843 893709
51989 893709 883688 873394 861986 849316 835655 821561 807737 794361 780453 764527 746192
51978 746192 726731 707821 690100 673267 657078 641646 627128 613781 602308 593524 587653 584301
$$ packed form
52062A579500J3485J3099J2469J1584J0884J0499R910Q726P393O706O745O669
52050A697669N484K928m64l977p346j0705j3996j6786j8778k0199k1393k2289
52038A570148k2627k2489k2077k1147j9244j6554j3936j1963j0356q666p125o471
52026A387493o976p922q152p284o245o329p621q793q720p801p267p533p993q148
52012A280709q188q430q884r607j0861j2688j4709j6558j8143j9435k0410k1299
52000A111497k2471k3789k4501k4060k2748k1276j9921j8331j6113j3444j1134
51989H93709j0021j0294j1408j2670j3661j4094j3824j3376j3908j5926j8335
51978G46192j9461j8910j7721j6833j6189j5432j4518j3347j1473q784n871l352
$$ plain form
51966 584301 583173 584430 588267 594471 602566 612141 622807 633861 644135 652351 657828 660801 661779 660575
51952 660575 656384 648947 639281 628984 619143 610273 602886 597488 594130 592520 592712 595320 600945 609693
51938 609693 621278 635307 651247 668288 685457 702014 717732 732635 746242 757134 763636 765033
51926 765033 761961 755631 747096 737284 727122 717199 707718 699139 692491 688582 687133 687001 686788 684715
51912 684715 678482 666402 649023 629094 609683 592515 577968 566063 557070 551381 548997 549276 551326
51899 551326 554708 559460 565218 570661 574127 574510 571285 564171 553465 540485 526988 514091 502165
51886 502165 491523 482564 475287 469329 464614 461475 460146 460673 463245 467997 474430 481728 489754 498969
51872 498969 509131 518872 527001 533604 539302 543869 546275 545868 542968 538408 532916 526926 520601 514037
$$ packed form
51966E84301j128J257L837O204Q095R575J0666J1054J0274Q216N477K973R78j204
51952F60575m191p437r666j0297r841q870p387n398l358j610J92K608N625Q748
51938F09693J1585J4029J5940J7041J7169J6557J5718J4903J3607J0892O502J397
51926G65033l072o330q535r812j0162r923r481q579o648l909j449j32k13k073
51912F84715o233j2080j7379j9929j9411j7168j4547j1905q993n689k384K79K050
51899E51326L382M752N758N443L466L83l225p114j0706j2980j3497j2897j1926
51886E02165j0642q959p277n958m715l139j329N27K572M752O433P298Q026R215
51872D98969J0162R741Q129O603N698M567K406m07k900m560n492n990o325o564
$$ plain form
51858 514037 507668 502472 499586 499627 502440 507337 513414 519688 525154 528918 530433 529687 527040 522733 516695
51843 516695 509001 500336 491700 483712 476493 470059 464406 459292 454466 450207 447190 445708 445447 446132 447846
51828 447846 450469 453254 455352 456450 456573 455584 453257 449649 445076 439948 434864 430614 427674 425799 424472
51813 424472 423661 423828 425246 427637 430534 433671 436907 439956 442395 443914 444519 444504 444233 443981 443935 444200 444680
51796 444680 445075 445181 445114 444985 444405 442656 439482 435459 431502 428160 425451 423112 420914 418935 417686 417699
51780 417699 418858 420302 421180 421309 421009 420590 420289 420475 421589 423838 427162 431565 437326 444902 454627 466456
51764 466456 479888 494108 508210 521283 532413 540805 545945 547558 545458 539672 530742 519704 507647
51751 507647 495333 483149 471235 459722 449068 440121 433521 429014 425661 422876 421003 420789 422579
$$ packed form
51858E14037o369n196k886M1K813M897O077O274N466L764J515p46k647m307o038
51843E16695p694q665q636p988p219o434n653n114m826m259l017j482k61O85J714
51828D47846K623K785K098J098J23r89k327l608m573n128n084m250k940j875j327
51813D24472q11J67J418K391K897L137L236L049K439J519O05j5k71k52m6K65M80
51796D44680L95J06o7j29n80j749l174m023l957l342k709k339k198j979j249J3
51780D17699J159J444Q78J29l00m19l01J86J114K249L324M403N761P576R725J1829
51764D66456J3432J4220J4102J3073J1130Q392N140J613k100n786q930j1038j2057
51751E07647j2314j2184j1914j1513j0654q947o600m507l353k785j873k14J790
$$ plain form
51738 422579 426191 431368 438120 446697 457229 469175 481070 491104 498144 502151 503680 503345 501920
51725 501920 500649 501025 504023 509269 514779 517774 516386 510853 502937 494385 486340 479874 475986 474617
51711 474617 474337 473637 472129 470132 467713 464930 462728 462730 466006 472374 480697 489244 495956 499267 499127 496919
51695 496919 494145 491465 489066 487460 487492 489642 493489 497683 500324 499692 495156 487635 479048 471081 464321
51680 464321 458451 453117 448487 444989 442847 442056 442657 444655 447701 451195 454814 458686 463009 467873 473599
51665 473599 480891 490246 501334 513041 523887 532232 536451 535535 529747 520668 510628 502013 496572
51652 496572 494864 496389 500431 506661 514696 523234 529995 532652 529905 521963 510319 496933 483306
51639 483306 470129 457673 446234 436049 427138 419506 413339 408827 405968 404706 404969 406369 408245
$$ packed form
51738D22579L612N177O752Q577J0532J1946J1895J0034P040M007J529l35j425
51725E01920j271L76K998N246N510K995j388n533p916q552q045o466l888j369
51711D74617k80p00j508j997k419k783k202KL276O368Q323Q547O712L311j40k208
51695D96919k774k680k399j606L2K150L847M194K641o32m536p521q587p967o760
51680D64321n870n334m630l498k142p91O01J998L046L494L619L872M323M864N726
51665D73599P292R355J1088J1707J0846Q345M219r16n788r079j0040q615n441
51652D96572j708J525M042O230Q035Q538O761K657k747p942j1644j3386j3627
51639D83306j3177j2456j1439j0185q911p632o167m512k859j262K63J400J876
$$ plain form
51626 408245 410316 412854 415862 418484 419920 420646 422001 424593 427691 430169 431468 431547 430553 428794 426631
51611 426631 424165 421280 418060 414817 411695 408639 405824 403677 402417 401975 402424 404030 406781 410475 415407
51596 415407 422424 431951 443473 456232 469701 482761 492977 497743 496292 490142 481602 472385 463586
51583 463586 456171 450904 448001 447289 448714 452592 459337 469111 481810 497267 515219 534887 554819
51570 554819 573699 591530 609724 629600 650806 671291 688653 701518 710257 717179 725978 740199
51558 740199 761668 790316 825374 866070 910749 955688 995600 1025809 1044189 1051318 1049098 1039212
51546 1039212 1022477 999177 969761 935193 896833 856233 815111 775204 737770 703247 671609
51535 671609 643080 618182 597042 578994 563108 548904 536320 525294 515820 508300 503235 500433
$$ packed form
51626D08245K071K538L008K622J436P26J355K592L098K478J299P9r94j759k163
51611D26631k466k885l220l243l122l056k815k147j260m42M49J606K751L694M932
51596D15407P017R527J1522J2759J3469J3060J0216M766j451o150q540r217q799
51583D63586p415n267k903p12J425L878O745R774J2699J5457J7952J9668J9932
51570E54819J8880J7831J8194J9876K1206K0485J7362J2865Q739O922Q799J4221
51558G40199K1469K8648L5058M0696M4679M4939L9912L0209J8380P129k220r886
51546A039212j6735k3300k9416l4568l8360m0600m1122l9907l7434l4523l1638
51535F71609k8529k4898k1140j8048j5886j4204j2584j1026r474p520n065k802
$$ plain form
51523 500433 498885 497672 496684 496292 496715 498006 500263 503219 505657 505838 502803 497118 490246 483411 477103
51508 477103 471346 466066 461169 456472 451740 446850 441924 437236 433049 429624 427291 426218 425983 425743 425115
51493 425115 424699 425313 426878 428478 429461 429923 430010 429404 427916 426139 424881 424045 422676 420211 417258 414861
51477 414861 413302 411977 410333 408514 406954 405637 404074 401923 399302 396452 393427 390285 387291 384619
51463 384619 382057 379406 377091 375934 376147 376909 377171 376719 376231 376455 377544 379138 380872 382718 384954 387939
51447 387939 392018 397615 405178 414956 426989 441566 459337 480352 502819 523275 538354 546458
51435 546458 547995 544747 539358 534700 532628 532898 533455 531836 526395 516750 503854 489796 476949 466786
51421 466786 459403 454113 450248 447430 445493 444438 444310 444914 445781 446562 447295 448056 448524 448182 446940 445289
$$ packed form
51523E00433j548j213r88l92M23J291K257K956K438J81l035n685o872o835o308
51508D77103n757n280m897m697m732m890m926m688m187l425k333j073k35k40o28
51493D25115m16O14J565J600R83M62Q7o06j488j777j258q36j369k465k953k397
51477D14861j559j325j644j819j560j317j563k151k621k850l025l142k994k672
51463C84619k562k651k315j157K13P62K62m52m88K24J089J594J734J846K236K985
51447C87939M079N597P563R778J2033J4577J7771K1015K2467K0456J5079Q104
51435E46458J537l248n389m658k072K70N57j619n441r645j2896j4058j2847j0163
51421D66786p383n290l865k818j937j055j28O04Q67P81P33P61M68l42j242j651
$$ plain form
51405 445289 443743 442319 440754 439140 438060 437973 438649 439434 440055 440875 442308 444281 446544 449221 452735 457302
51389 457302 462989 470183 479442 490726 503335 516981 532553 551487 574813 603274 637840 679135
51377 679135 726413 777997 832969 891508 952815 1013254 1067384 1110955 1142576 1162799 1172388 1171647
51365 1171647 1160754 1140114 1110392 1072554 1028014 978690 926754 874187 822457 772606 725593
51354 725593 682372 643548 609151 578924 552670 530139 510727 493668 478494 465085 453334
51343 453334 443050 434152 426622 420210 414544 409537 405352 401903 398810 396051 394169 393445 393240 392552 391042
51328 391042 389105 387107 385083 383136 381613 380755 380501 380800 381804 383550 385694 387777 389595 391106 392205
51313 392205 392882 393606 395181 398020 401634 404945 407092 407833 407282 405550 402773 399332 395753 392422 389545
$$ packed form
51405D45289j546j424j565j614j080q7O76P85O21Q20J433J973K263K677L514M567
51389D57302N687P194R259J1284J2609J3646J5572J8934K3326K8461L4566M1295
51377F79135M7278N1584N4972N8539O1307O0439N4130M3571L1621K0223R589p41
51365A171647j0893k0640k9722l7838m4540m9324n1936n2567n1730m9851m7013
51354G25593m3221l8824l4397l0227k6254k2531j9412j7059j5174j3409j1751
51343D53334j0284q898p530o412n666n007m185l449l093k759j882p24k05o88j510
51328C91042j937j998k024j947j523q58k54K99J004J746K144K083J818J511J099
51313C92205O77P24J575K839L614L311K147P41n51j732k777l441l579l331k877
$$ plain form
51298 389545 387263 385485 383627 380981 377587 374362 372118 370711 369562 368676 368594 369403 370436 371137 371768 373042
51282 373042 375418 379014 383851 389801 396424 403139 409395 414512 417755 419040 419416 420225 421746 423152 423897
51267 423897 424534 425860 427824 429877 432074 435033 438779 442265 444240 444167 442187 438782 434853 431614 429724
51252 429724 428618 427106 424580 421303 417723 414010 410233 406505 402822 399116 395517 392229 389162 386103
51238 386103 383307 381426 380671 380472 380177 379707 379299 379056 379046 379434 380136 380619 380532 380284 380603 381647 382946 384095
51220 384095 385178 386583 388709 391707 395211 398453 400961 402999 405055 407082 408609 409434 409870 410431 411676
51205 411676 414096 417624 421330 424159 426041 427805 430016 432369 434231 435214 435095 433754 431477 428909 426431
51190 426431 423884 421082 418294 415985 414388 413534 413367 413624 413835 413727 413455 413309 413415 413794 414424 415051 415246
$$ packed form
51298C89545k282j778j858k646l394l225k244j407j149q86q2Q09J033P01O31J274
51282C73042K376L596M837N950O623O715O256N117L243J285L76Q09J521J406P45
51267D23897O37J326J964K053K197K959L746L486J975p3j980l405l929l239j890
51252D29724j106j512k526l277l580l713l777l728l683l706l599l288l067l059
51238C86103k796j881p55j99k95m70m08k43j0L88P02M83q7k48L19J044J299J149
51220C84095J083J405K126K998L504L242K508K038K056K027J527Q25M36N61J245
51205D11676K420L528L706K829J882J764K211K353J862R83j19j341k277k568k478
51190D26431k547k802k788k309j597q54j67K57K11j08k72j46J06L79O30O27J95
$$ plain form
51173 415246 414837 414093 413347 412735 412365 412349 412445 412124 411316 410777 411347 413140 415854 419513 424336 429980 435484
51156 435484 440057 443638 446610 449183 451076 451619 450220 446957 442648 438209 434049 430238 426950 424294
51142 424294 421872 419023 415582 412018 408765 405884 403571 402593 403663 406441 409488 411382 411793 411467 411309
51127 411309 411632 412275 413236 414880 417521 420973 424699 428275 431572 434603 437429 440174 442943 445656 448125
51112 448125 450356 452628 455154 457778 460127 462070 463851 465704 467409 468441 468580 468244 468126 468618 469736
51097 469736 471356 473226 474780 475357 474801 473668 472686 472148 471917 471813 471839 472087 472571 473076 473172 472585 471560 470714
51079 470714 470461 470778 471533 472642 473777 474390 474434 474770 476355 479147 482292 485356 488900 493689 499740 506420
51063 506420 513325 520838 529955 541808 557277 576645 599116 622444 643387 659212 669390 676002
$$ packed form
51173D15246m09p44p46o12l70j6R6l21q08n39N70J793K714L659M823N644N504
51156D35484M573L581K972K573J893N43j399l263m309m439m160l811l288k656
51142D24294k422k849l441l564l253k881k313r78J070K778L047J894M11l26j58
51127D11309L23O43R61J644K641L452L726L576L297L031K826K745K769K713K469
51112D48125K231K272K526K624K349J943J781J853J705J032J39l36j18M92J118
51097D69736J620J870J554N77n56j133r82n38k31j04K6K48M84N05R6n87j025q46
51079D70714k53L17P55J109J135O13M4L36J585K792L145L064L544M789O051O680
51063E06420O905P513R117J1853J5469J9368K2471K3328K0943J5825J0178O612
$$ plain form
51051 676002 682451 691636 704896 721869 740715 758691 773247 783185 788828 791028 790001 785081 775532
51038 775532 761652 745183 728786 714952 705062 698741 693647 686186 673481 655363 634451 614145
51026 614145 596665 582820 572761 566167 562072 559436 558066 558458 560591 563449 566075 568747 572698 578752
51012 578752 586447 594466 601777 608383 615119 622835 631800 641772 652360 663161 673778 683993 693857
50999 693857 703391 712254 719950 726371 731896 736960 741650 745704 748727 750451 750899 750230 748381 745220 741332
50984 741332 738346 738015 741110 747536 757183 769858 784409 798827 811652 822868 833260 843519 854361
50971 854361 866955 882535 901778 924924 952235 983884 1019650 1059176 1102378 1149180 1199095
50960 1199095 1251646 1307009 1365569 1426681 1488447 1548927 1607128 1662662 1715013 1763606 1808312
$$ packed form
51051F76002O449R185J3260J6973J8846J7976J4556R938N643K200j027m920r549
51038G75532j3880j6469j6397j3834r890o321n094p461j2705j8118k0912k0306
51026F14145j7480j3845j0059o594m095k636j370L92K133K858K626K672L951O054
51012E78752P695Q019P311O606O736P716Q965R972J0588J0801J0617J0215R864
50999F93857R534Q863P696O421N525N064M690M054L023J724M48o69j849l161l888
50984G41332k986l31L095O426R647J2675J4551J4418J2825J1216J0392J0259J0842
50971H54361J2594J5580J9243K3146K7311L1649L5766L9526M3202M6802M9915
50960A199095N2551N5363N8560O1112O1766O0480N8201N5534N2351M8593M4706
$$ plain form
50949 1808312 1849355 1886825 1920641 1950925 1978109 2002763 2025764 2048662 2073316 2100629 2129565
50938 2129565 2157567 2182044 2201620 2216363 2227139 2234685 2238999 2239379 2234963 2225108 2209269 2186821
50926 2186821 2157293 2120688 2077290 2027216 1970557 1908052 1841303 1772123 1701907 1631680 1562433
50915 1562433 1495158 1430805 1370473 1315353 1266119 1222488 1183668 1149082 1118438 1091341 1067251
50904 1067251 1045691 1026055 1007397 988954 970877 954000 938936 925895 915262 907480 902048 897383
50892 897383 892243 886932 882627 879931 878562 878143 878628 879984 881934 884004 885610 886254 886074 886071 887401 890480
50876 890480 895091 901118 908623 917226 926087 934718 943446 952916 963484 975265 988327 1002595 1017887
50863 1017887 1034396 1052903 1074193 1098354 1124906 1153553 1184670 1219159 1258030 1302030 1351483
$$ packed form
50949A808312M1043L7470L3816L0284K7184K4654K3001K2898K4654K7313K8936
50938B129565K8002K4477J9576J4743J0776P546M314L80m416r855j5839k2448
50926B186821k9528l6605m3398n0074n6659o2505o6749o9180p0216p0227o9247
50915A562433o7275o4353o0332n5120m9234m3631l8820l4586l0644k7097k4090
50904A067251k1560j9636j8658j8443j8077j6877j5064j3041j0633p782n432m665
50892H97383n140n311m305k696j369m19M85J356J950K070J606O44j80lJ330L079
50876H90480M611O027P505Q603Q861Q631Q728R470J0568J1781J3062J4268J5292
50863A017887J6509J8507K1290K4161K6552K8647L1117L4489L8871M4000M9453
$$ plain form
50852 1351483 1406515 1467516 1535261 1610491 1693555 1784593 1883808 1991176 2105992 2227001 2353084
50841 2353084 2483552 2617680 2754027 2890108 3022507 3147352 3261191 3361844 3448516 3521122
50831 3521122 3579706 3624635 3657165 3679521 3694439 3704812 3713695 3724240 3739279 3760886 3790396
50820 3790396 3828706 3876173 3931815 3992403 4052381 4104984 4143884 4164318 4163239 4138906 4090532
50809 4090532 4018246 3923125 3807055 3672432 3521953 3358727 3186649 3010543 2835530 2665931
50799 2665931 2504714 2353998 2215824 2091988 1983095 1888188 1805584 1734008 1672836 1621643
50789 1621643 1579963 1547358 1523193 1506189 1494521 1486600 1481482 1478398 1476248 1473981 1471297 1468442 1465310
50776 1465310 1461183 1455506 1448508 1440676 1431884 1421430 1408903 1394632 1379145 1362490 1344271 1324289
$$ packed form
50852A351483N5032O1001O7745P5230Q3064R1038R9215J07368J14816J21009J26083
50841B353084J30468J34128J36347J36081J32399J24845J13839J00653Q6672P2606
50831C521122N8584M4929L2530K2356J4918J0373Q883J0545J5039K1607K9510
50820C790396L8310M7467N5642O0588N9978N2603L8900K0434j079k4333m8374
50809D090532p2286r5121j16070j34623j50479j63226j72078j76106j75013j69599
50799B665931j61217j50716j38174j23836j08893r4907q2604p1576o1172n1193
50789A621643m1680l2605k4165j7004j1668p921n118l084k150k267k684k855l132
50776A465310m127n677o998p832q792j0454j2527j4271j5487j6655j8219j9982
$$ plain form
50764 1324289 1302929 1280886 1258652 1236380 1214248 1192806 1172763 1154490 1137913 1122939 1109707
50753 1109707 1098294 1088412 1079771 1072584 1067332 1064128 1062756 1063472 1067266 1075005 1086647 1101616 1119760
50740 1119760 1141568 1167574 1197963 1232768 1272109 1316114 1364802 1418033 1475337 1535736 1598013
50729 1598013 1661372 1725730 1791236 1857626 1924105 1989804 2054163 2116850 2177399 2234983 2288545
50718 2288545 2336921 2378588 2411377 2432974 2442225 2440013 2428787 2411418 2390722 2369739 2351741 2339532
50706 2339532 2334757 2337870 2348644 2366702 2391708 2422944 2458528 2495246 2529530 2558513 2579753 2590134
50694 2590134 2585772 2563398 2521709 2461516 2385256 2296645 2200154 2100108 2000052 1902917 1811275
50683 1811275 1727109 1651583 1585339 1528800 1482055 1444710 1416154 1395827 1383208 1377960 1380203 1390155
$$ packed form
50764A324289k1360k2043k2234k2272k2132k1442k0043j8273j6577j4974j3232
50753A109707j1413r882q641p187n252l204j372P16L794P739J1642J4969J8144
50740A119760K1808K6006L0389L4805L9341M4005M8688N3231N7304O0399O2277
50729A598013O3359O4358O5506O6390O6479O5699O4359O2687O0549N7584N3562
50718B288545M8376M1667L2789K1597R251k212j1226j7369k0696k0983j7998j2209
50706B339532m775L113J0774J8058K5006L1236L5584L6718L4284K8983K1240J0381
50694B590134m362k2374m1689o0193p6260q8611r6491j00046j00056r7135r1642
50683A811275q4166p5526o6244n6539m6745l7345k8556k0327j2619n248K243R952
$$ plain form
50671 1390155 1407186 1429724 1456357 1486412 1518965 1551945 1583045 1611191 1636400 1658571 1677406
50660 1677406 1693360 1707656 1721150 1733959 1746330 1759035 1772514 1786268 1799573 1812355 1825129
50649 1825129 1838580 1853572 1871100 1891777 1915660 1942945 1974487 2011154 2052895 2098865 2148342
50638 2148342 2201102 2256855 2314674 2373081 2430501 2485557 2537102 2584321 2627048 2665930 2701995
50627 2701995 2736034 2768651 2800583 2831526 2857416 2869515 2858361 2820209 2759915 2687687 2613551
50616 2613551 2544425 2484413 2435784 2399334 2374636 2360543 2355611 2358388 2367543 2381443 2397371 2411625
50604 2411625 2420860 2423065 2416885 2400446 2371641 2329501 2274750 2209131 2134797 2054462 1971411 1888851
50592 1888851 1809145 1733605 1662794 1596974 1536398 1481124 1430573 1383714 1340026 1300011 1264315
$$ packed form
50671A390155J7031K2538K6633L0055L2553L2980L1100K8146K5209K2171J8835
50660A677406J5954J4296J3494J2809J2371J2705J3479J3754J3305J2782J2774
50649A825129J3451J4992J7528K0677K3883K7285L1542L6667M1741M5970M9477
50638B148342N2760N5753N7819N8407N7420N5056N1545M7219M2727L8882L6065
50627B701995L4039L2617L1932L0943K5890J2099j1154l8152o0294p2228p4136
50616B613551o9126o0012m8629l6450k4698j4093m932K777R155J3900J5928J4254
50604B411625R235K205o180j6439k8805m2140n4751o5619p4334q0335q3051q2560
50592A888851p9706p5540p0811o5820o0576n5274n0551m6859m3688m0015l5696
$$ plain form
50581 1264315 1232595 1203797 1177363 1153563 1132739 1114948 1100428 1089596 1082198 1077047 1073101 1070433
50569 1070433 1069789 1071580 1075804 1082573 1091996 1103549 1116116 1128951 1142466 1158007 1176967 1199961
50557 1199961 1226534 1255602 1286363 1318765 1352906 1388171 1423386 1457886 1491949 1525891 1559126
50546 1559126 1590586 1619962 1648066 1676083 1704958 1735558 1768886 1805764 1846645 1892080 1943089
50535 1943089 2000674 2065130 2136283 2214209 2299200 2391102 2489304 2593626 2704831 2823965 2951447
50524 2951447 3086851 3229029 3376090 3525531 3674793 3821514 3963096 4096270 4217431
50515 4217431 4323159 4410190 4475304 4515937 4531022 4520852 4486134 4427455 4345694 4242707 4121657
50504 4121657 3987013 3844296 3699505 3558473 3426484 3308077 3206849 3125510 3066243 3030641
$$ packed form
50581A264315l1720k8798k6434k3800k0824j7791j4520j0832p398n151l946k668
50569A070433o44J791M224O769R423J1553J2567J2835J3515J5541J8960K2994
50557A199961K6573K9068L0761L2402L4141L5265L5215L4500L4063L3942L3235
50546A559126L1460K9376K8104K8017K8875L0600L3328L6878M0881M5435N1009
50535A943089N7585O4456P1153P7926Q4991R1902R8202J04322J11205J19134J27482
50524B951447J35404J42178J47061J49441J49262J46721J41582J33174J21161
50515D217431J05728Q7031O5114M0633J5085j0170l4718n8679q1761j02987j21050
50504D121657j34644j42717j44791j41032j31989j18407j01228q1339n9267l5602
$$ plain form
50494 3030641 3018874 3029079 3058167 3103276 3161984 3230911 3304316 3374058 3430793 3465715 3472395
50483 3472395 3447962 3392863 3309713 3202536 3076581 2937732 2791380 2642029 2493953 2351329
50473 2351329 2217081 2092063 1976077 1869438 1772931 1686642 1609801 1541849 1482820 1432363
50463 1432363 1389149 1351712 1319346 1291603 1267334 1244995 1223888 1204551 1187791 1173718 1161874
50452 1161874 1151946 1144084 1138607 1135620 1134957 1136487 1140441 1147279 1157174 1169862 1185174 1203392 1224470
50439 1224470 1246919 1267993 1285228 1297602 1305341 1309346 1311214 1313099 1316777 1322811 1331017 1341425 1354233
50426 1354233 1369059 1385004 1401581 1419089 1437991 1458408 1480392 1504264 1530529 1559797 1592891
50415 1592891 1630674 1673584 1721631 1774841 1833335 1896952 1965247 2037800 2113900 2191825 2269222
$$ packed form
50494C030641j1767J0205K9088M5109N8708O8927P3405O9742N6735L4922O680
50483C472395k4433n5099q3150j07177j25955j38849j46352j49351j48076j42624
50473B351329j34248j25018j15986j06639r6507q6289p6841o7952n9029n0457
50463A432363m3214l7437l2366k7743k4269k2339k1107j9337j6760j4073j1844
50452A161874r928p862n477k987o63J530L954O838R895J2688J5312J8218K1078
50439A224470K2449K1074J7235J2374P739M005J868J885L678O034Q206J0408J2808
50426A354233J4826J5945J6577J7508J8902K0417K1984K3872K6265K9268L3094
50415A592891L7783M2910M8047N3210N8494O3617O8295P2553P6100P7925P7397
$$ plain form
50404 2269222 2344551 2417522 2487759 2553768 2613823 2667153 2713320 2750806 2777063 2789853 2787852
50393 2787852 2770193 2736327 2686577 2622269 2545374 2458541 2365471 2270529 2177656 2089867 2009614
50382 2009614 1938921 1879072 1830747 1794611 1771231 1760252 1760303 1770031 1788648 1815081 1846918 1880538
50370 1880538 1911889 1936830 1951383 1952595 1939437 1912603 1873531 1823896 1765895 1702396 1636397
50359 1636397 1570321 1505832 1444073 1385828 1331415 1280629 1233077 1188708 1147945 1111230 1078554
50348 1078554 1049685 1024846 1005009 991404 984631 984145 988532 996389 1006841 1018905 1030298 1037446
50336 1037446 1037265 1028976 1014177 995568 975931 957610 941922 928874 917963 909266 903275 899904
50324 899904 898520 899052 902149 907854 914919 922079 929473 938055 947831 957387 965203 971054 976045 981555
$$ packed form
50404B269222P5329P2971P0237O6009O0055N3330M6167L7486K6257J2790k001
50393B787852j7659l3866m9750o4308p6895q6833r3070r4942r2873q7789q0253
50382B009614p0693n9849m8325l6136k3380j0979N1R728J8617K6433L1837L3620
50370A880538L1351K4941J4553J212j3158k6834l9072m9635n8001o3499o5999
50359A636397o6076o4489o1759n8245n4413n0786m7552m4369m0763l6715l2676
50348A078554k8869k4839j9837j3605o773m86M387P857J0452J2064J1393P148
50336A037446j81q289j4799j8609j9637j8321j5688j3048j0911q697n991l371
50324H99904j384N32L097N705P065P160P394Q582R776R556P816N851M991N510
$$ plain form
50310 981555 988153 995402 1002623 1009775 1017364 1025577 1034017 1042464 1051363 1061177 1071570 1081767 1091587 1101721
50296 1101721 1113052 1126045 1140663 1156556 1173390 1191347 1211301 1234214 1260535 1290636 1325639
50285 1325639 1366583 1411476 1453097 1480956 1487096 1471099 1439900 1402940 1367377 1336808 1312487
50274 1312487 1294235 1280630 1269848 1261000 1254264 1249642 1246274 1243175 1239887 1235990 1230666 1223403 1214688
50261 1214688 1205464 1196271 1187516 1180169 1175390 1173478 1173791 1175638 1178692 1182709 1187624 1194127 1203423 1215933
50247 1215933 1230581 1245756 1260727 1275823 1291456 1307462 1323449 1339407 1355785 1373106 1391634
50236 1391634 1411166 1430691 1448179 1461108 1467613 1467136 1459925 1446293 1426823 1403061 1377395 1352080
50224 1352080 1328702 1308394 1291875 1279026 1268914 1260369 1251872 1240686 1223089 1196570 1161872 1122544
$$ packed form
50310I81555O598P249P221P152P589Q213Q440Q447Q899R814J0393J0197R820J0134
50296A101721J1331J2993J4618J5893J6834J7957J9954K2913K6321L0101L5003
50285A325639M0944M4893M1621K7859O140j5997l1199l6960l5563l0569k4321
50274A312487j8252j3605j0782q848o736m622l368l099l288l897n324p263q715
50261A214688r224r193q755p347m779j912L13J847L054M017M915O503R296J2510
50247A215933J4648J5175J4971J5096J5633J6006J5987J5958J6378J7321J8528
50236A391634J9532J9525J7488J2929O505m77p211j3632j9470k3762k5666k5315
50224A352080k3378k0308j6519j2849j0112q545q497j1186j7597k6519l4698l9328
$$ plain form
50212 1122544 1082710 1045416 1012290 983649 958789 936832 917555 901197 887652 876348 866844
50201 866844 859003 852517 846708 840923 834860 828538 822302 816754 812253 808396 804332 799649 794631 789613
50187 789613 784480 778882 772654 765934 759125 752793 747311 742491 737773 732801 727595 722174 716358 710156
50173 710156 704146 699245 696004 694086 692489 690493 688425 687251 687348 688101 688888 689952 691820 694374 697221
50158 697221 700731 705880 712988 721355 730334 740211 751760 765359 780717 797023 813073 827593 839815
50145 839815 849657 857414 863509 868555 873155 877499 881511 885635 891243 900036 913221 931341 954605
50132 954605 983074 1016375 1053260 1091535 1128924 1164375 1198413 1231984 1265359 1298576 1332414
50121 1332414 1367936 1405005 1441905 1476356 1506086 1528557 1541383 1543709 1536593 1521600 1499636 1471500
$$ packed form
50212A122544l9834l7294l3126k8641k4860k1957j9277j6358j3545j1304r504
50201H66844p841o486n809n785o063o322o236n548m501l857m064m683n018n018
50187G89613n133n598o228o720o809o332n482m820m718m972n206n421n816o202
50173G10156o010m901l241j918j597j996k068j174R7P53P87J064J868K554K847
50158F97221L510N149P108Q367Q979R877J1549J3599J5358J6306J6050J4520J2222
50145H39815R842P757O095N046M600M344M012M124N608Q793J3185J8120K3264
50132I54605K8469L3301L6885L8275L7389L5451L4038L3571L3375L3217L3838
50121A332414L5522L7069L6900L4451K9730K2471J2826K326p116j4993k1964k8136
$$ plain form
50109 1471500 1438766 1403395 1366836 1330055 1294024 1259630 1227459 1198146 1172551 1151033 1132797
50098 1132797 1116415 1100666 1084561 1067171 1048219 1028573 1009516 991830 976147 963670 955482
50087 955482 951251 949579 949749 952230 957227 963654 970130 976392 983148 990853 999214 1007725 1016156 1024372
50073 1024372 1032005 1038574 1043923 1048322 1051936 1054306 1054699 1053066 1050270 1047088 1043427 1038820 1033282 1027015
50059 1027015 1019645 1010662 1000649 991225 983398 976637 969954 963341 957644 953400 950429 948379 947227 947268
50045 947268 948977 952850 959062 967342 977399 989329 1003205 1018360 1033553 1048029 1062085 1076447
50033 1076447 1091426 1106948 1122986 1139388 1155379 1169822 1182168 1192637 1201226 1207097 1209539 1209220
50021 1209220 1207825 1206502 1205308 1204158 1203522 1203883 1205188 1207282 1210257 1213832 1216968 1218934 1220491 1223181
$$ packed form
50109A471500l2734l5371l6559l6781l6031l4394l2171k9313k5595k1518j8236
50098A132797j6382j5749j6105j7390j8952j9646j9057j7686j5683j2477q188
50087I55482m231j672J70K481M997O427O476O262O756P705Q361Q511Q431Q216
50073A024372P633O569N349M399L614K370L93j633k796l182l661m607n538o267
50059A027015p370q983j0013r424p827o761o683o613n697m244k971k050j152M1
50045I47268J709L873O212Q280J0057J1930J3876J5155J5193J4476J4056J4362
50033A076447J4979J5522J6038J6402J5991J4443J2346J0469Q589N871K442l19
50021A209220j395j323j194j150o36L61J305K094K975L575L136J966J557K690
$$ plain form
50007 1223181 1227503 1232457 1236838 1240303 1243231 1246473 1251531 1260128 1272928 1288938 1306286 1322975 1336494
49994 1336494 1343575 1341455 1329467 1308977 1281971 1250284 1215888 1180922 1146903 1114206 1082514 1051521
49982 1051521 1021127 991375 962543 935136 909593 886156 865071 846550 830277 815321 800948
49971 800948 787443 775682 765923 757456 749484 741923 735092 728978 723218 717675 712729 708922 706534 705384
49957 705384 704940 704734 704962 706537 710296 716289 724105 733702 745264 758202 770925 781985 791053 798514
49943 798514 804589 809345 813180 816594 819478 821116 820934 818864 815011 809312 801486 790992 777146 759854
49929 759854 740361 720848 703068 687569 674186 662680 652760 644075 636721 631445 628874 628673 629885
49916 629885 631944 634886 638648 642683 646500 650225 654289 658734 663220 667831 673530 681447 691700 703183
$$ packed form
50007A223181M322M954M381L465K928L242N058Q597J2800J6010J7348J6689J3519
49994A336494P081k120j1988k0490k7006l1687l4396l4966l4019l2697l1692l0993
49982A051521l0394k9752k8832k7407k5543k3437k1085j8521j6273j4956j4373
49971H00948j3505j1761r759q467p972p561o831o114n760n543m946l807k388j150
49957G05384m44k06K28J575L759N993P816R597J1562J2938J2723J1060R068P461
49943G98514O075M756L835L414K884J638j82k070l853n699p826j0494j3846j7292
49929G59854j9493j9513j7780j5499j3383j1506r920q685p354n276k571k01J212
49916F29885K059K942L762M035L817L725M064M445M486M611N699P917J0253J1483
$$ plain form
49902 703183 714703 726084 738014 751070 765276 780313 795482 809346 820151 827143 831226 833838
$$ packed form
49902G03183J1520J1381J1930J3056J4206J5037J5169J3864J0805O992M083K612
$$ [...]
##END NTUPLES=NMR SPECTRUM
##END=
