##TITLE=AC1760_VAR00032_9320049_fEDgkB0HtX
##JCAMPDX= 6.0         $$ Bruker NMR JCAMP-DX V2.0
##DATA TYPE= NMR SPECTRUM
##DATA CLASS= NTUPLES
##ORIGIN= BRUKER
##OWNER= Administrator
$$ 1.72 TOPSPIN		Version 2.1
$$ 2015-08-11 22:54:48.882 -0700  Administrator@X
$$ Compression mode = diff/dup
##.OBSERVE FREQUENCY= 400.02188249412
##.OBSERVE NUCLEUS= ^1H
##.ACQUISITION MODE= SIMULTANEOUS (DQD)
##.ACQUISITION SCHEME= undefined
##.AVERAGES= 8
##.DIGITISER RES= 22
##SPECTROMETER/DATA SYSTEM= spect
##.PULSE SEQUENCE= zg30
##.SOLVENT NAME= COFFEE_meoh
##.SHIFT REFERENCE= INTERNAL, COFFEE_meoh, 1, 14.98509
##AUDIT TRAIL= $$ (NUMBER, WHEN, WHO, WHERE, PROCESS, VERSION, WHAT)
$$ ##TITLE= Audit trail, TOPSPIN		Version 2.1
$$ ##JCAMPDX= 5.01
$$ ##ORIGIN= Bruker BioSpin GmbH
$$ ##OWNER= Administrator
$$ $$ E:\/data/COFFEE/nmr/AC1760_VAR00032_9320049_fEDgkB0HtX/10/pdata/1/auditp.txt
$$ ##AUDIT TRAIL=  $$ (NUMBER, WHEN, WHO, WHERE, PROCESS, VERSION, WHAT)
(   1,<2015-08-11 22:54:41.585 -0700>,<Administrator>,<X>,<go>,<TOPSPIN 2.1>,
      <created by zg
	started at 2015-08-11 22:53:35.648 -0700,
	POWCHK enabled, PULCHK disabled,
       configuration hash MD5:
       21 0F 79 D6 B3 7B B4 F6 88 20 88 DB 03 48 BD 9F
       data hash MD5: 64K
       AC 09 3B C7 52 8C 23 5F 9E 3E B1 65 BD 80 23 EB>)
(   2,<2015-08-11 22:54:44.710 -0700>,<Administrator>,<X>,<proc1d>,<TOPSPIN 2.1>,
      <Start of raw data processing
       efp LB = 0 FT_mod = 6 PKNL = 1 PHC0 = 0 PHC1 = 0 SI = 32K 
       data hash MD5: 32K
       0D 8F 31 C8 7E 5B 30 4E FF 23 52 CE 42 19 13 D3>)
(   3,<2015-08-11 22:54:44.992 -0700>,<Administrator>,<X>,<proc1d>,<TOPSPIN 2.1>,
      <pk PHC0 = 88.33557 PHC1 = 0 
       data hash MD5: 32K
       9D 45 9E 21 3C A7 1E E3 E1 C9 09 B1 1F D4 70 47>)
(   4,<2015-08-11 22:54:45.117 -0700>,<Administrator>,<X>,<proc1d>,<TOPSPIN 2.1>,
      <abs ABSG = 1 
       data hash MD5: 32K
       DF CE D1 A3 CF D9 AE 0B D4 33 30 FB 48 4B 07 EB>)
(   5,<2015-08-11 22:54:45.179 -0700>,<Administrator>,<X>,<proc1d>,<TOPSPIN 2.1>,
      <abs ABSG = 2 
       data hash MD5: 32K
       2A 03 CF D5 3B 68 AD DA F8 AC BA 38 17 86 C6 2F>)
(   6,<2015-08-11 22:54:45.242 -0700>,<Administrator>,<X>,<proc1d>,<TOPSPIN 2.1>,
      <abs ABSG = 3 
       data hash MD5: 32K
       C3 12 FF 3D 5F BF 7B 07 30 E0 49 24 C5 A1 D4 13>)
(   7,<2015-08-11 22:54:45.304 -0700>,<Administrator>,<X>,<proc1d>,<TOPSPIN 2.1>,
      <abs ABSG = 4 
       data hash MD5: 32K
       C2 27 97 45 05 3F 03 DF 6B CA 0E 8D 0C 77 F3 EC>)
(   8,<2015-08-11 22:54:45.367 -0700>,<Administrator>,<X>,<proc1d>,<TOPSPIN 2.1>,
      <abs ABSG = 5 
       data hash MD5: 32K
       61 6F 0C C7 D1 95 B6 2C A6 7B 9B 9E BA 7E 9C C5>)
$$ ##END=
$$ 
$$ $$ hash MD5
$$ $$ 99 7A 0A 7C 54 C0 D8 3A 98 CB 08 29 23 00 7F D3
##$RELAX= 
##$RELAX= 
##$RELAX= 
##$RELAX= 
##$RELAX= 
##$RELAX= 
##$RELAX= 
$$ Bruker specific parameters
$$ --------------------------
##$DU= <E:\>
##$EXPNO= 10
##$NAME= <AC1760_VAR00032_9320049_fEDgkB0HtX>
$$ [...]
150 150 150 150 150 150 150 150
##$TP07= 0
##$TPNAME0= <>
##$TPNAME1= <>
##$TPNAME2= <>
##$TPNAME3= <>
##$TPNAME4= <>
##$TPNAME5= <>
##$TPNAME6= <>
##$TPNAME7= <>
##$TPOAL= (0..7)
0.5 0.5 0.5 0.5 0.5 0.5 0.5 0.5
##$TPOFFS= (0..7)
0 0 0 0 0 0 0 0
##$TUNHIN= 0
##$TUNHOUT= 0
##$TUNXOUT= 0
##$USERA1= <user>
##$USERA2= <user>
##$USERA3= <user>
##$USERA4= <user>
##$USERA5= <user>
##$V9= 5
##$VALIST= <valist>
##$VCLIST= <CCCCCCCCCCCCCCC>
##$VD= 0
##$VDLIST= <DDDDDDDDDDDDDDD>
##$VPLIST= <PPPPPPPPPPPPPPP>
##$VTLIST= <TTTTTTTTTTTTTTT>
##$WBST= 2048
##$WBSW= 25
##$XGAIN= (0..3)
0 0 0 0
##$XL= 0
##$YL= 0
##$YMAX_a= 547589
##$YMIN_a= -479145
##$ZGOPTNS= <>
##$ZL1= 120
##$ZL2= 120
##$ZL3= 120
##$ZL4= 120
##$ABSF1= 14.98509
##$ABSF2= -5.573092
##$ABSG= 5
##$ABSL= 3
##$ALPHA= 0
##$AQORDER= 0
##$ASSFAC= 0
##$ASSFACI= 0
##$ASSFACX= 0
##$ASSWID= 0
##$AUNMP= <proc_prof1d_extract_pilot.lims>
##$AXLEFT= 0
##$AXNAME= <>
##$AXNUC= <1H>
##$AXRIGHT= 0
##$AXTYPE= 0
##$AXUNIT= <>
##$AZFE= 0.1
##$AZFW= 0.1
##$BCFW= 0
##$BC_mod= 0
##$BYTORDP= 0
##$COROFFS= 0
##$CY= 15
##$DATMOD= 1
##$DC= 0
##$DFILT= <>
##$DTYPP= 0
##$F1P= 0
##$F2P= 0
##$FCOR= 0.5
##$FTSIZE= 32768
##$FT_mod= 6
##$GAMMA= 0
##$GB= 0
##$INTBC= 1
##$INTSCL= 1
##$ISEN= 128
##$LB= 0
##$LEV0= 0
##$LPBIN= 0
##$MAXI= 10000
##$MC2= 0
##$MEAN= 0
##$ME_mod= 0
##$MI= 0
##$NCOEF= 0
##$NC_proc= -8
##$NLEV= 6
##$NOISF1= 0
##$NOISF2= 0
##$NSP= 0
##$NTH_PI= 0
##$NZP= 0
##$OFFSET= 14.98509
##$PC= 1
##$PHC0= 88.33557
##$PHC1= 0
##$PH_mod= 1
##$PKNL= yes
##$PPARMOD= 0
##$PPDIAG= 0
##$PPIPTYP= 0
##$PPMPNUM= 2147483647
##$PPRESOL= 1
##$PSCAL= 4
##$PSIGN= 0
##$PYNMP= <proc.py>
##$REVERSE= no
##$SF= 400.02
##$SI= 32768
##$SIGF1= 0
##$SIGF2= 0
##$SINO= 400
##$SIOLD= 32768
##$SPECTYP= <>
##$SREGLST= <1H.CDCl3>
##$SSB= 0
##$STSI= 32768
##$STSR= 0
##$SW_p= 8223.68421052631
##$SYMM= 0
##$S_DEV= 0
##$TDeff= 65536
##$TDoff= 0
##$TI= <>
##$TILT= no
##$TM1= 0
##$TM2= 0
##$TOPLEV= 0
##$USERP1= <user>
##$USERP2= <user>
##$USERP3= <user>
##$USERP4= <user>
##$USERP5= <user>
##$WDW= 1
##$XDIM= 32768
##$YMAX_p= 415769217
##$YMIN_p= -646082
##$CURPLOT= <Network HP LaserJet P1505>
##$CURPRIN= <$Network HP LaserJet P1505>
##$DFORMAT= <normdp>
##$LAYOUT= <+/1D_H.xwp>
##$LFORMAT= <normlp>
##$PFORMAT= <normpl>
##$SURQMSG= 1
$$ End of Bruker specific parameters
$$ ---------------------------------
##NTUPLES= NMR SPECTRUM
##VAR_NAME=  FREQUENCY,     SPECTRUM/REAL,   SPECTRUM/IMAG
##SYMBOL=    X,             R,               I
##VAR_TYPE=  INDEPENDENT,   DEPENDENT,       DEPENDENT
##VAR_FORM=  AFFN,          ASDF,            ASDF
##VAR_DIM=   32768,         32768,           32768
##UNITS=     HZ,            ARBITRARY UNITS, ARBITRARY UNITS
##FACTOR=    0.250966925370066, 1,           1
##FIRST=     8223.43324360094, -84375,       135273
##LAST=      0,             112588,          171830
##MIN=       0,             -646082,         0
##MAX=       8223.43324360094, 415769217,    0
$$ Real data points
##PAGE= N=1
##DATA TABLE= (X++(R..R)), XYDATA
$$ [...]
19575E138d32561d0663k335B5291e3939k96298J73903I4774m3785a45961F6854
19563a08631O235d6394j37818L0375C3758a57233c4712F4721k6477b30538h2470
19551a69108D0997a52571j14247P7439h6394j01365f0392j74537A81261J8575
19541A99836c46980B07904N0291o9298D1324a45586B1418c4960k77504h0132E2816
19529B32017g8929A43483a0268j38109j91539H7501J6662h2906q0528f294j18120
19518a24414B71781f8528j55384N242j30780a49217l0239j31004L63B1167b27581
19506h7444l59593g1463a9199p7177l74130b4839A91284d17985J34416a1088E65172
19494a33357f2229H4266P2019b2058j8955j23645p0306G8558a03186n4639k699
$$ y = [5138, -432561, -40663, -42998, 25291, -53939, -350237, -176334, 94774, 50989, -145961, 66854, -108631, -102396, -46394, -184212, -153837, 33758, -157233, -34712, 64721, 38244, -230538, -82470, -169108, 40997, -152571, -266818, -189379, -86394, -187759, -60392, -234929, 181261, 199836, -346980, 207904, 258195, 188897, 41324, -145586, 21418, -34960, -312464, -80132, 52816, 232017, -78929, 143483, -10268, -148377, -339916, 87501, 104163, -82906, -163434, -6294, -124414, 271781, -68528, -223912, -218670, -349450, -149217, -179456, -310460, -310097, 21167, -227581, -87444, -447037, -71463, -19199, -96376, -470506, -24839, 191284, -417985, -283569, -11088, 565172, -133357, -62229, 84266, 156285, -22058, -41013, -164658, -234964, 78558, -103186, -157825, -160524]
19483a60524j59833i7683k55271f6771l2004B51108b34776a955l12457D8396J35989
19472A84385O7388b66358P2082G4413M8177E4375c670I5697a27937k6740B0286
19460I6590N6671R0994c8052l09637a47234D7210a50500P798A55657m9710a9620
19448D3701k1553f0545a4253G2785b11970j2460A03471b06819A09801a12343L476
19437a08867l2621A76277A7210P4934g7174k83904a92j03410A07945A9797J98056
19426B17853i7191D9614L3376d37467c1842l007A16484b69181h3335j08614d195
19414i7889B1920b04299F9211f3527R737n4413j1645C9822a71717O5700r1915
19403a97932B39028c0453k634g346C7437b28576a13098P49B7093a86921F0487
$$ y = [-160524, -320357, -97683, -352954, -66771, -98775, 251108, -234776, -1955, -314412, 48396, 184385, 251773, -266358, -194276, 74413, 122590, 54375, -3670, 95697, -127937, -154677, 20286, 96590, 153261, 244255, -38052, -347689, -147234, 47210, -150500, -142702, 155657, 105947, -19620, 43701, 22148, -60545, -14253, 72785, -211970, -224430, 103471, -206819, 109801, -112343, -108867, -141488, 176277, 17210, 92144, -77174, -361078, -192, -103602, 107945, 19797, 217853, -97191, 49614, 82990, -437467, -31842, -34849, 116484, -269181, -83335, -191949, -4195, -97889, 21920, -204299, 69211, -63527, -53790, -108203, -119848, 39822, -171717, -106017, -197932, 239028, -30453, -33087, -7346, 37437, -228576, -113098, -112349, 27093, -186921, 60487]
19391F5685k9787f8627K5283l25251A0940a4940j48954A21686b42029Q9111f0218
19379b7883E7450b91803R1065a6488j19287j98337C7527L16801E970N7896k7911
19368C5955a74683J0511a0887q5281B41282r4375B6074P7670a28718A1277N9947
19357G1224A3772M3454L7419Q2298E3128j522e0430l21900h3256j6752j51861
19346b51869d8474j96514B19022d6365A05683c15311J21008e4784j78756o8250
19336c01790A73396a54133A05340Q6230G1951i5141A17853c3851j16446j06841
19326b57138A26324D4509c30438J30636r2737B55401b68374I6742b04868R8229
19316a06639b266j11492M929o1448J2255n3640a03327b6673A08169l7184c73827
$$ y = [65685, 35898, -68627, -43344, -368595, 10940, -14940, -163894, 121686, -242029, -152918, -60218, -27883, 57450, -291803, -200738, -16488, -135775, -334112, 37527, 354328, 5970, 63866, 35955, -174683, -164172, -10887, -96168, 241282, 146907, 26074, 103744, -128718, 11277, 71224, 13772, 57226, 94645, 176943, 53128, 51606, -50430, -372330, -83256, -100008, -251869, -48474, -244988, 219022, -46365, 105683, -315311, -194303, -54784, -233540, -301790, 173396, -154133, 105340, 191570, 71951, -95141, 117853, -33851, -150297, -257138, 126324, 44509, -330438, -199802, -292539, 255401, -268374, 96742, -204868, -106639, -2266, -113758, -108829, -170277, -158022, -211662, -103327, -26673, 108169, 70985, -373827]
19304d19628g2635j20531R3917r5546E6857k3439o124a02195I6972b04798j8404
19293b23202D1370J87274e6230j12761C2430A131c4058j67486F4380c0677l00698
19282c31375A53526a60234A6814Q3372c11560J09931C7631b34181l9720i5196
19271A35639e3173k63950F4013L4494N877a58700J6842j27136A78856a21936B6161
19259c23617b3807q0993j26066i0863C9363J11997J55495a1206p8495A27096a04942
19247a68237A39546F2529b16672m1475a06753H1246C6787i4159r8983p2508a12896
19235b90477J10392O5187p4223f1729m7362c2406k8803k68115B8536b67032J8598
19224b48434C55980d027k02758A58947F2138c2607m4546A82423d5259r8862L7452
$$ y = [-419628, -72635, -193166, -99249, -194795, 56857, 33418, 27294, -102195, 96972, -204798, -223202, 41370, 228644, -56230, -168991, 32430, 1131, -34058, -201544, 64380, -30677, -331375, 153526, -160234, 16814, 100186, -311560, -201629, 37631, -234181, -273901, -95196, 135639, -53173, -317123, 64013, 98507, 104384, -158700, -141858, -268994, 178856, -121936, 26161, -323617, -23807, -104800, -230866, -90863, 39363, 151360, 306855, -11206, -89701, 127096, -104942, -168237, 139546, 62529, -216672, -258147, -106753, 81246, 36787, -94159, -193142, -265650, -112896, -290477, -180085, -114898, -189121, -61729, -109091, -32406, -61209, -329324, 28536, -267032, -248434, 355980, -4027, -206785, 158947, 62138, -32607, -77153, 182423, -45259, -144121, -106669]
19213a06669A6083d0428j23880p8100k97300a57405A1581a11068k91657c0341
19202a7399k52421B34315c42557r1530a13793a2388A60552o6771C469h7471k21534
19191c09005e8787k2926K2553A84030a65436A75945o4098b68900d8831k63965
19181c12796c6964C9923F166c43036a36840b5370D8616Q4937g2493K0658H6076
19169a50671C00288j26733l422D442b37219c916H3248b13357B54822f3660J542
19158f2118j59232j41618a21958L4968A21044e4301o4585A73512a56311g710F8577
19146a9960G2063f8192j30146Q9109p8631E8247a21325q0667c5129B12623a13287
19134b52240i7777B29950b77081b2178n5202C14168a44049k8042f7756A26107
$$ y = [-106669, 16083, -40428, -164308, -242408, -539708, -157405, 11581, -111068, -402725, -30341, -17399, -269820, 234315, -342557, -434087, -113793, -12388, 160552, 93781, 3469, -87471, -309005, -58787, -81713, -59160, 184030, -165436, 175945, 111847, -268900, -48831, -312796, -36964, 39923, 6166, -343036, -136840, -25370, 48616, 133553, -72493, -51835, 86076, -150671, 300288, 173555, 170133, 4442, -237219, -3916, 83248, -213357, 254822, -63660, -62118, -221350, -362968, -121958, -86990, 121044, -54301, -118886, 173512, -156311, -7710, 68577, -19960, 72063, -68192, -198338, -109229, -187860, 58247, -121325, -201992, -35129, 212623, -113287, -252240, -97777, 229950, -277081, -22178, -77380, 314168, -144049, -172091, -67756, 126107]
19123h4310b0431k41079h7742C251d66614i5518G3838j9255L31123a52138N4533
19112i7605A12010K29392e1524A11716e9939F0274d6679o2202j5197j02735A80834
19100d6937A38803c20489o9026d5499C88696F0475B1799J13291E1081b00093M9485
19089a50608j1704e3658C2847a38613K3694C38386a31627d6396m9609c1073j11940
19078a43013f2695k14374j4808a18774N1075K2162k17891a0600k93346a1830q2206
19067i4036l7675D0546E132Q0384C3780a25520b7197k37658a05728j40762J11282
19056a35208d1061B9834P6615b98921J32446A35872D4913a50215r9359N9956L9358
19045a50260O6970m0881d8873j46257E5760f8290j69639A22481J06679C4726a10634
$$ y = [-84310, -20431, -261510, -87742, 3251, -466614, -95518, 73838, 54583, 385706, -152138, -97605, 112010, 341402, -51524, 111716, -59939, 60274, -46679, -108881, -124078, -226813, 180834, -46937, 138803, -320489, -389515, -45499, 388696, 60475, 21799, 135090, 51081, -200093, -150608, -162312, -53658, 32847, -138613, -114919, 338386, -131627, -46396, -96005, -31073, -143013, -62695, -277069, -291877, -118774, -67699, -45537, -263428, -10600, -303946, -11830, -94036, -131711, 40546, 5132, 85516, 33780, -125520, -27197, -264855, -105728, -246490, -135208, -41061, 29834, 106449, -298921, -166475, 135872, 44913, -150215, -249574, -189618, -150260, -83290, -124171, -48873, -195130, 55760, -68290, -237929, 122481, 229160, 34726, -110634]
19033A67128c1442i954A90993a36914L013B50954D315L51557a56637A05305B6605
19021D15765b21470N7983g4898j71415c9553A53641C2364e7600A8128J50785c58485
19009D4753a36243A49952a67298g4122j13103G5014a285A16996b51667A63867
18998A30282c65641A61893C615a56054D1707b9061j28589D7109a22918j35872
18988b58790c5922j58317G9403R8879D6022a46301F3207a95215A90654H7471J95159
18977B82630d56694K24458M5831d3929I8444b40618A43611b47011H9770l3814
18967E5956d7557K1725k66217a1962B50432B7787b9021n1886m1588G2829a53846
18955e7189h536l6221A21862N1167c38523a47867B20424f3551a5374C5035b23319
$$ y = [167128, -31442, -9954, 190993, -136914, -133901, 250954, 4315, 355872, -156637, 105305, 26605, 415765, -221470, -163487, -74898, -246313, -39553, 153641, 32364, -57600, 18128, 168913, -358485, 44753, -136243, 149952, -167298, -74122, -187225, 75014, -1285, 116996, -251667, 163867, 130282, -365641, 161893, 3615, -156054, 41707, -29061, -157650, 47109, -122918, -258790, -35922, -194239, 79403, 178282, 46022, -146301, 63207, -195215, 190654, 87471, 282630, -456694, -232236, -186405, -43929, 98444, -240618, 143611, -247011, 89770, 55956, -47557, -25832, -292049, -11962, 250432, 27787, -29021, -80907, -122495, 72829, -153846, -57189, -8536, -44757, 121862, 173029, -338523, -147867, 220424, -63551, -15374, 35035, -223319]
18943b59439M1229j10848A76267b8333j58692B53316b21988A79492A5821g7305
18932G8199c8195j23502N4865A04339M5495D2897K10068C1406b07381A7739a89794
18920A54152g3956E9668R9447a5321A14633a22062L7505j17042A33508h6292B30792
18908A48591c25040A5020a53992A50479a6378o0830K5826j5984B02530c66166
18897e11175F6577P932c3478A07454e4887D4027A8820a68606P9077D771c54745
18885A83023a24787j7850d0662q0651d4840j34356A60965B5772i2176C5117J18057
18874A53174c1531k82312a01574h576A88779C7959c5583G7594j8515b7011k73066
18863c00077j01695a17223k1224L8477d3705k16804I7338d5792m0127E9635a38273
$$ y = [-259439, -218210, -329058, 176267, -28333, -187025, 253316, -221988, 179492, 15821, -77305, 78199, -38195, -161697, -106832, 104339, 149834, 42897, 252965, 31406, -207381, 17739, -189794, 154152, -73956, 59668, 159115, -15321, 114633, -122062, -84557, -201599, 133508, -86292, 230792, 148591, -325040, 15020, -153992, 150479, -16378, -77208, -51382, -67366, 202530, -366166, -511175, 66577, 74509, -33478, 107454, -54887, 44027, 18820, -168606, -89529, 4771, -354745, 183023, -124787, -142637, -40662, -121313, -44840, -179196, 160965, 25772, -92176, 35117, 153174, -31531, -313843, -101574, -8576, 188779, 37959, -35583, 77594, 59079, -27011, -300077, -401772, -117223, -138447, -99970, -43705, -260509, 97338, -45792, -85919, 59635, -138273]
18851a24352A29814b44522C5398a27396k6587G0855K5071l8727N5051A4196J1544
18840B5740b03623j01278h6979J4278l66196A4820b02811k30343b1889k93959
18830c15848h2528j45935E9982b23231Q6625j11076c0869D41794A4868b97864
18819G7937a48046A35096J22914b91777J32341r1508h3048A26570h7839B54043
18808e5013C69398f2265o5887C7516K3748c36179A02558a5486j79757N4476M4285
18797i6482A16780d4249J6192G2445i9120l77512a35191q5004J03847B73163a9184
18785i4925j14969i868A27112j8608i4938J6666E4582g2144j82668k62775E889
18773h0344k22917A7387a1078m06666a979I7493d9399A56978d3586p8672N2968
$$ y = [-124352, 129814, -244522, 35398, -127396, -153983, 70855, 95926, 57199, 112250, 14196, 25740, -203623, -304901, -86979, -72701, -438897, 14820, -202811, -433154, -21889, -315848, -82528, -228463, 59982, -223231, -136606, -247682, -30869, 441794, 14868, -297864, 77937, -148046, 135096, 258010, -291777, -159436, -250944, -83048, 126570, -87839, 254043, -55013, 369398, -62265, -128152, 37516, 61264, -336179, 102558, -15486, -195243, -140767, -96482, 116780, -44249, -28057, 72445, -99120, -476632, -135191, -220195, -116348, 273163, -19184, -94925, -209894, -9868, 127112, 108504, -94938, -78272, 54582, -72144, -254812, -517587, 5889, -80344, -303261, 17387, -11078, -417744, -1979, 97493, -49399, 156978, -43586, -122258, -69290]
18762f9290k67925d7854k80589D1004a13406C87429b31166h4568j04578O4869
18752a24277M6054A67206a90216Q7366j19812P5101K0778E4457c02211B18316
18741e48874A61760P8869H5522a06208j1421k15295a8072j17667F5492g2654J717
18730g0937H0360a97134B51245d0288o8165j96368a08275L5618J9599j83446m4520
18719b81024C37004b06515H7739a57153f3432A91470K1343b41274d4820l340k08418
18708b56578l9282H3328E165d6258j69206a352k24232E6496h5831p1245G5204
18696b51203A28637Q1140a96755D4250b68211a05630c3943F6574L40323A16228
18685c13571Q3289D05758e8340m2685C5006d13643a91105a5938B453K2060J92264
$$ y = [-69290, -337215, -47854, -328443, 41004, -113406, 387429, -231166, -84568, -189146, -124277, -78223, 167206, -190216, -102850, -222662, -147561, -126783, 54457, -302211, 218316, -548874, 161760, 240629, 85522, -106208, -117629, -332924, -18072, -135739, 65492, -72654, -70937, 80360, -197134, 251245, -40288, -108453, -304821, -108275, -72657, -53058, -236504, -281024, 337004, -206515, 87739, -157153, -63432, 191470, 212813, -241274, -44820, -48160, -256578, -295860, 83328, 5165, -46258, -215464, -1352, -225584, 56496, -85831, -157076, 75204, -251203, 128637, 209777, -196755, 44250, -268211, -105630, -33943, 66574, 406897, 116228, -313571, -230282, 405758, -58340, -101025, 35006, -413643, -191105, -15938, 2453, 24513, 216777]
18674B16777A0334b96939D3270a68501H6040b59741J14865o8434I2072r743a23907
18662b10636C5382F67J24752l8268b25893c0963j01385B27083B7300g3063b1166
18650C6592O2960h7699F9048b14126g5076j55720j10029Q4975g6258j26185f1254
18638a82134D2623N4390J03035e8442j14421j98472f7117A79529J84418E4908
18627a92547A2367b26227B5988c8406j79292m319d7416r0471r6515d1328m26120
18616d67448A46973a10204C20586g9032r0335B39487a78953j1998a140A55338
18605d591j26206C35479a4893k02332j20065I0146i8983A48267L5390b2389A76379
18593G6100R6809D7398g9590B23524K7519a3356R36p9540B4278c97840a12322
$$ y = [216777, 10334, -296939, 43270, -168501, 86040, -259741, -144876, -213310, 92072, 82329, -123907, -210636, 35382, 667, 125419, 87151, -225893, -30963, -132348, 227083, 27300, -73063, -21166, 36592, 99552, -87699, 69048, -214126, -75076, -230796, -340825, -255850, -76258, -202443, -61254, -182134, 42623, 97013, 200048, -58442, -172863, -371335, -67117, 179529, 363947, 54908, -192547, 12367, -226227, 25988, -38406, -217698, -222017, -47416, -137887, -234402, -41328, -467448, 146973, -110204, 320586, -79032, -169367, 239487, -178953, -190951, -1140, 155338, -4591, -130797, 335479, -14893, -217225, -337290, 90146, -98983, 148267, 183657, -22389, 176379, 76100, 172909, 47398, -79590, 223524, 251043, -13356, -12420, -91960, 24278, -397840, -112322]
18581d1630b0526j58587E09078a61976j05602I5335J2260J66933d7186j16938
18571a64124o7166A2691K2243a66310j11873A79706f7716k02815D2272c44377
18560f4489E8014Q3020D5897J24294D3001R8304E8580N4240P6077a23797A29235
18548b41273F4719j9272c34308D5430N5167c75572J03523N8528L8886O7777m0509
18537a47367D9323b22131I4944a89832g1187k43874B371e6141D9729b04719J854
18526b02865D4080b73612M3318B35928a07213b8761E5206a12030B21888a54988
18515a60703A25410A26d23357d5470k82336n0489G4800B8757a74117d6249A67750
18503A23339b80324a21618l39360J12651B13724a08164M695B15204e2330A17665
$$ y = [-41630, -20526, -179113, 509078, -161976, -267578, 95335, 107595, 274528, -47186, -164124, -231290, 12691, 34934, -166310, -278183, 179706, -67716, -270531, 42272, -344377, -64489, 58014, 141034, 45897, 170191, 43001, 141305, 58580, 112820, 188897, -123797, 129235, -241273, 64719, 45447, -334308, 45430, 100597, -375572, -272049, -213521, -174635, -106858, -147367, 49323, -222131, 94944, -189832, -71187, -315061, 2371, -56141, 49729, -204719, -202865, 44080, -273612, -230294, 235928, -107213, -28761, 55206, -112030, 221888, -154988, -160703, 125410, 126, -423357, -45470, -327806, -378295, 74800, 28757, -174117, -46249, 167750, 123339, -280324, -121618, -460978, -348327, 213724, -108164, -103469, 215204, -52330, 117665]
18492a45721L7690j09971E5423K3282C2014b45754A20359C7055L12092a25693
18481a50984g0393j7641c8891E994a55959O2546B92210P9106a4855E4051c44597
18469d02043h5838l0872L8232k6655j98811A2690f46A76304a2322l47539E6546
18457A59977a53846F6134b45004C5009c1043A87191g9560m11319C4945a90905
18446A62194a39954A22585g5564L6116m1984j44675L7831A33222a17734n8727
18436a76461A11141a20598H6007a80598o0059A4044a53350N7052j2668p3289j11661
18425b93916a45615C1982b82215i1937M333p5027B23861b05391E569K59822H2244
18413F8382c32071C15281h5943C36869c46645A02134q927f3805G8062d9507p7964
$$ y = [-145721, -108031, -218002, 55423, 78705, 32014, -245754, 120359, 37055, 349147, -125693, -150984, -70393, -88034, -38891, 5994, -155959, -93413, 292210, 371316, -14855, 54051, -344597, -402043, -85838, -116710, -78478, -105133, -303944, 12690, -646, 176304, -12322, -359861, 56546, 159977, -153846, 66134, -245004, 35009, -31043, 187191, -79560, -490879, 34945, -190905, 162194, -139954, 122585, -75564, -39448, -81432, -226107, -188276, 133222, -117734, -176461, 111141, -120598, 86007, -180598, -240657, 14044, -153350, -96298, -108966, -182255, -293916, -145615, 31982, -282215, -91937, -87604, -162631, 223861, -205391, 5569, 265391, 82244, 68382, -332071, 315281, -85943, 336869, -346645, 102134, 93207, -63805, 78062, -49507, -127471]
18402a27471b3248j33656B34918c9106o6911r4174i673k8991o743f063j63894
18391a69957C8973P7621g9041G478a89688L7491E356c3007K222k71731K834A907
18378a3564j0254j06367l1068K550A85833c4694j21606b8423l8220j06689B58354
18366b5845j94930g8919j14790Q7805D51628a20058J0385l77827a95730f6704
18355A16911m0373c47705f5979j09256e8858m1202i435n1945p5033k8376g0666
18343A7134a54839E8755i5281l594b1565k2007M460j94348B76978b5979I5254
18331H4629h131m6166j5097k43337B08081I6723K52681j40218i7332m9048n8475
18320b04855F59547i904j64925o1980B25334b51369B23316e8826F1271c56709
$$ y = [-127471, -23248, -156904, 234918, -39106, -106017, -200191, -9673, -38664, -45407, -6063, -169957, 38973, 116594, -79041, 7478, -189688, -152197, 5356, -33007, -30785, -302516, -299682, 1907, -13564, -23818, -130185, -161253, -158703, 185833, -34694, -156300, -28423, -66643, -173332, 258354, -25845, -220775, -78919, -193709, -105904, 451628, -120058, -109673, -487500, -195730, -66704, 116911, 76538, -347705, -65979, -175235, -58858, -100060, -9435, -61380, -136413, -164789, -70666, 17134, -154839, 58755, -95281, -98875, -21565, -43572, -39112, -233460, 276978, -25979, 95254, 84629, -8131, -54297, -69394, -312731, 208081, 96723, 349404, 209186, -97332, -146380, -204855, 659547, -9904, -174829, -236809, 225334, -251369, 223316, -58826, 61271, -356709]
18309a51051I072Q5136a85395o2127f1329C4039c71873g351I4263a33995C38689
18297c26161a35975k459E08238F8112f657k43019c02m412k4683C7878L33977a13421
18284D29453b22531E723b06986J8556j74865f9012j00383E6481B7143a86378B79049
18272i1448B0295a22105d6142h650C20428b74625b9162k30133a15437j56408J18681
18261a53164g4786A02957J4813d5932j24203C4617M535a68763j21756h1597H7302
18249a41509F5335K42715e489j35971M1437r2827O3225j47826K4391Q3196f0336
18237f8748A30190c59671a75087F4657l1739K11056d2456m6615G4656c19178M3015
18226b76163G8535l20n544d13042a76164B39015A3140H85Q0302j9760K9446b91204
$$ y = [-151051, 9072, 94208, -185395, -247522, -61329, 34039, -371873, -7351, 94263, -133995, 338689, -326161, -135975, -138434, 508238, 68112, -6657, -249676, -302, -4714, -29397, 37878, 371855, -113421, 429453, -222531, 5723, -206986, -188430, -363295, -69012, -169395, 56481, 27143, -186378, 279049, -91448, 20295, -122105, -46142, -8650, 320428, -274625, -29162, -259295, -115437, -271845, -153164, -74786, 102957, 117770, -45932, -170135, 34617, 39152, -168763, -290519, -81597, 87302, -141509, 65335, 308050, -5489, -141460, -100023, -192850, -129625, -277451, -253060, -169864, -60336, -68748, 130190, -359671, -175087, 64657, 32918, 243974, -42456, -89071, 74656, -319178, -276163, 78535, 78215, 72671, -413042, -176164, 239015, 13140, 885, 81187, 61427, 90873, -291204]
18213c95934g820A64366b68879o7505O5294j36782J68157K6731R6158o0365f8894
18201b24844Q5535f1165j57972C33236a36863A4870M7867a62474E6147a69354
18190a33625j64691A22440c2444C5475L5776K5049f8890A35449a2047B27853a72525
18178c08529i641k07640A08150a00749B4569I798K07479b91064e706m4924B01163
18166B1648f9847m8262N178A51887l8644a61494A16538l1220c06160e0979j35495
18155a86474k6283P8588j42607e5681k72567h5660B896b00995R5493A88067a74769
18143d8133j12466O2442j29605d9788Q441k87135B18666e6148j67460o7502P9283
18132b11827D2242a07740A39287a23850A19022C0266J67687G4642P3524a36242
$$ y = [-395934, -7820, 164366, -268879, -336384, -271090, -407872, -239715, -212984, -116826, -177191, -68894, -224844, -139309, -61165, -219137, 333236, -136863, 14870, 62737, -162474, 56147, -169354, -133625, -298316, 122440, -32444, 35475, 71251, 96300, -68890, 135449, -12047, 227853, -172525, -308529, -9641, -217281, 108150, -100749, 24569, 9798, 217277, -291064, -5706, -50630, 201163, 21648, -69847, -118109, -112931, 151887, 113243, -161494, 116538, 85318, -306160, -50979, -186474, -212757, -134169, -276776, -55681, -328248, -85660, 2896, -200995, -105502, 188067, -174769, -48133, -160599, -98157, -227762, -49788, -41347, -328482, 218666, -56148, -223608, -291110, -211827, 42242, -107740, 139287, -123850, 119022, 30266, 197953, 74642, 148166, -136242]
18121A87650D6754b37531E3712c74244f5766j12362A13411b07709N5651K9789
18111a22269C3527K71b2171r509k13557D6483L7250a51859B53295a34281j46156
18100b80437e7578D2294b61149I8153a16490k5421A90922a30044C9803P2239r152
18089A02890h4576b5130D3731c45852j65319K29282a21341B37846A4363J06342
18079A20705J11571a81542e8384j23060A68567f4338a5982E7877i9621B61257
18068b63217i2859B33458N8937b42710Q2805e2451k12074p2104N153j4073a0336
18056a94261J3422K5601D3686I643a39838A10778b1172l1099B13753c6525k8376
18045f4901r1829B21449a18802j28236G9763J08538M2640f365G2920b2017l86388
$$ y = [187650, 46754, -237531, 53712, -374244, -65766, -178128, 113411, -207709, -152058, -122269, 33527, 33798, -22171, -31680, -245237, 46483, 83733, -151859, 253295, -134281, -280437, -57578, 42294, -261149, 98153, -116490, -141911, 190922, -130044, 39803, 112042, 102890, -84576, -25130, 43731, -345852, -511171, -281889, -121341, 237846, 14363, 120705, 232276, -181542, -58384, -181444, 168567, -64338, -15982, 57877, -99621, 261257, -263217, -92859, 233458, 292395, -242710, -159905, -52451, -264525, -336629, -331476, -345549, -10336, -194261, -180839, -155238, 43686, 9643, -139838, 110778, -21172, -52271, 213753, -36525, -64901, -156730, 221449, -118802, -247038, 79763, 188301, 230941, -6365, 72920, -22017, -408405]
18034d08405a51007p1458o6579A9005i4597J8973l569l02290J27102a20259G4803
18022B2367b91508J3319A09571A575J4391M9658D253N3739J44921o6708k8630
18011A07575N4562e23205i6472G4999f8792k3148j82807a25825j62285J37823
18001a50287M9082m5342B11556c50530i2835I2210h3730D9431k4685K75153c00122
17989a88883A48412F5725P9699b41089h7733C96630a15515d5676A4445b40969
17978A83672a29853K3483N1514A59144b62095Q4838I9385b4645j406l32242a20408
17966c72239J78826A32017c13738R2463A26679n6032a34870B32726q3431i6024
17955a13037K4185I787b78690B22926A03656b8871j53437j4447J2504e4533j25165
$$ y = [-408405, -151007, -222465, -289044, 19005, -94597, -75624, -79193, -381483, -254381, -120259, 74803, 22367, -291508, -278189, 109571, 1575, 15966, 65624, 4253, 57992, 202913, 136205, 107575, 162137, -523205, -96472, 74999, -68792, -91940, -274747, -125825, -288110, -150287, -101205, -146547, 211556, -350530, -92835, 92210, -83730, 49431, 24746, 299899, -300122, -188883, 148412, 65725, 145424, -241089, -87733, 396630, -115515, -45676, 14445, -240969, 183672, -129853, -106370, -54856, 159144, -262095, -177257, 99385, -24645, -26051, -358293, -120408, -372239, -193413, 132017, -313738, -221275, 126679, 70647, -134870, 232726, 149295, -96024, -113037, -88852, 9787, -278690, 222926, 103656, -28871, -182308, -196755, -184251, -54533, -179698]
17944a79698J1540j76205J25169o5610A22909E9327a97894g3501A40316a07910
17933b74606A37551D0192a47326c1862B33420A04224J7172C0306a50485Q331A96585
17921a34961D3838a8705l9720E63324F4802O2227p953a93128P0038B07783A789
17909a85219K7920A10427E2121Q0543D054a61076k9513D9785K05410h6888l43815
17898d30703D7736P1681a10482b9517J3398n8970B17770E3813a25273F0242a12401
17886g2826A84184h1237c7966q8205B63628c52452a2557l4676A50194i8962j2423
17875a11385a2199l22341J66981L5869A05851g5939A16984b6342j79267H4597
17864f1244J9826A14322d7518A28204i6255D0394J25735a63477I6885B8268a2019
$$ y = [-179698, -168158, -344363, -219194, -284804, 122909, 59327, -197894, -73501, 140316, -107910, -274606, 137551, 40192, -147326, -31862, 233420, 104224, 121396, 30306, -150485, -142154, 196585, -134961, 43838, -18705, -58425, 563324, 64802, 127029, 119076, -193128, -123090, 207783, 1789, -185219, -157299, 110427, 52121, 132664, 4054, -161076, -190589, 49785, 255195, -86888, -430703, 47736, 119417, -110482, -29517, -16119, -75089, 217770, 53813, -125273, 60242, -112401, -72826, 184184, -81237, -37966, -126171, 263628, -352452, -12557, -47233, 150194, -98962, -111385, -12199, -334540, -167559, -131690, 105851, -75939, 116984, -26342, -205609, 84597, -61244, -41418, 114322, -47518, 128204, -96255, 40394, 166129, -163477, 96885, 28268, -12019]
17852I0049a39529l5303m4672I8838a61092H6582g0365B98981m6116a7233B54375
17840F4920c69853a13438B31847p8453h5381H6720c54752A51360b25547a7539
17829B56971c32056B01296b8666j73153R8098D9183A7394b4690A28858D991J78620
17818A83611b0962E0422b01526f0216j51158P2029n6538B27182E3585J65516e8869
17806c6512l4058C51124g0814A64284h8569r9721B0699a01023d7121F2864K09079
17795B71943k0602K2240a58158M9216K8822A62675B2117K16356h6059l755B46337
17783C43598i3484k68909C58686g9115j54170f7078F6951e1258A17314c6465A90475
17771A85081a82056q071A44782h1939C11441i506k06155e4007A22798b09086h1242
$$ y = [90049, -139529, -174832, -219504, 98838, -161092, 86582, -70365, 298981, 252865, -17233, 254375, 64920, -369853, -113438, 231847, 153394, -85381, 86720, -354752, 151360, -225547, -17539, 256971, -332056, 201296, -28666, -201819, -103721, 49183, 17394, -24690, 128858, 4991, 183611, -20962, 50422, -201526, -60216, -211374, -139345, -195883, 227182, 53585, 219101, -58869, -36512, -70570, 351124, -70814, 164284, -88569, -188290, 20699, -101023, -47121, 62864, 271943, 251341, 273581, -158158, -108942, -80120, 162675, 22117, 238473, -86059, -89814, 246337, 343598, -93484, -362393, 358686, -79115, -233285, -67078, 66951, -51258, 117314, -36465, 190475, 185081, -182056, -190127, 144782, -81939, 311441, -9506, -215661, -54007, 122798, -209086, -81242]
17759a21641A0878J27054I104f1176r697j5648L0138B16597A0041b07255E5512
17747c01322a15188d3188j16660A04652i148A81638R9607b15122i8248n0007D4194
17735f9584i045C9820a55212f8726m7284A78240K38097i7364p4754b2114o8300
17724i0414H4731m1892d7154B28125a82786g1805a1471H361a34873a4104a277
17712G0952J23613c09031B74916j02243R4660q2847G6584K7347n294b51135A79151
17700b9167H1893l8065f9610F8770a62427O8121G7471b9054k08128J12791j28042
17689b52433A80076K6783N4502q6281a32313d6736B43754c936q7683B6472e4727
17677a97152e4664B39454b66445d4861B3918a71518I5706a05189J233B02553c07249
$$ y = [-121641, 10878, 137932, 9104, -61176, -70873, -86521, -56383, 216597, 10041, -207255, 55512, -301322, -115188, -43188, -159848, 104652, -9148, 181638, 281245, -215122, -98248, -148255, 44194, -69584, -9045, 39820, -155212, -68726, -116010, 178240, 416337, -97364, -172118, -22114, -90414, 84731, 42839, -47154, 228125, -182786, -71805, -11471, 8361, -134873, -14104, -1277, 70952, 194565, -309031, 274916, 172673, 267333, 184486, 76584, 103931, 98637, -251135, 179151, -29167, 81893, 43828, -69610, 68770, -162427, -94306, 77471, -29054, -237182, -124391, -252433, 180076, 206859, 261361, 175080, -132313, -46736, 243754, -3936, -91619, 26472, -54727, -197152, -54664, 239454, -266445, -44861, 23918, -171518, 95706, -105189, -103956, 202553, -307249]
17665h9464M135C68211b41697Q0083j10791J15893M8272q0291C89569A43344b49278
17653a10731q2044F3914M8642a87527d7086A47883m5826R6550a85942e0594B03240
17641a9860D9429M9648F655P3461c00890c6614r3030n0498d9180b2037m3762A29456
17628c0834l68242i6371k900C7074M50616b64229A72900b27447A22147F0777K1888
17617H2665b74800E2134K11248A26201K8766j7548A1369M2544c728j92883B03300
17605B70944O5336b33119b0844B85768F8994b67410k05671a17492a4884A77513
17594a22740C43885n7564g7232A23078c71061A38073b45334b6515A07417c6835
17583a27381C97225d4337A05809R6325A9088h8472B57417a64607A34171J09570
$$ y = [-89464, -85329, 368211, -241697, -161614, -272405, -156512, -108240, -188531, 389569, 143344, -249278, -110731, -192775, 63914, 112556, -187527, -47086, 147883, 102057, 198607, -185942, -50594, 203240, -19860, 49429, 99077, 6655, 80116, -300890, -36614, -129644, -180142, -49180, -22037, -65799, 129456, -30834, -399076, -96371, -99271, 37074, 487690, -264229, 172900, -227447, 122147, 60777, 82665, -274800, 52134, 263382, 126201, 154967, 137419, 11369, 53913, -3728, -196611, 203300, 270944, 336280, -233119, -20844, 285768, 68994, -267410, -473081, -117492, -14884, 177513, -122740, 343885, 286321, -77232, 123078, -371061, 138073, -245334, -26515, 107417, -36835, -127381, 397225, -44337, 105809, 202134, 19088, -88472, 257417, -164607, 134171, 243741]
17573B43741f5988A8551O4716d922j00775A6494j9L92333q9302H4393C620L11757
17561C15377b82020A8357M8137K64730F5094e8765G3893j1289e0780E7023J24096
17550A81119n0284K9112B1406b52583A33272b9552A6862P601J9359d5664H5729
17538A45318h7104c4775j53683F5001J53485l7936b2573k18663B66283K1944E4878
17526B27085j10084A561K26917q3081a45864f1666j68257J5033j04923D9157K13661
17515B62818A17205h339C59934I3399K325f5234o2233F9687K13972e2538A5137
17503a26411C9958c010E2706i4056A52013n8367L5411L3392a69207K327j29010
17492b95890H5948j9564b5828A63266K4761g8657A41355a82712A59611g0629j20149
$$ y = [243741, -65988, 18551, 83267, -4922, -105697, 16494, 16475, 408808, 319506, 84393, 3620, 315377, -282020, 18357, 66494, 331224, 65094, -58765, 73893, 62604, -50780, 57023, 181119, 130835, 159947, 21406, -252583, 133272, -29552, 16862, 24463, 43822, -45664, 85729, 145318, -87104, -34775, -188458, 65001, 218486, 180550, -22573, -241236, 266283, 288227, 54878, 227085, 117001, 1561, 228478, 145397, -145864, -61666, -229923, -214890, -319813, 49157, 262818, 117205, -8339, 359934, 93399, 95724, -65234, -127467, 69687, 283659, -52538, 15137, -126411, 39958, -3010, 52706, -94056, 152013, 93646, 129057, 162449, -169207, -166880, -295890, 85948, 66384, -25828, 163266, 188027, -78657, 141355, -182712, 159611, -70629, -190778]
17481a90778A48190R3944j04029a93587L5660A13231k6865B1068J55482a54944
17470a73048f2177E23076a8679A59899f5712A01995a64725g7484H3032P2284D2127
17458h6530F8590K56001p6634p8297J54726A49319M0103p7029K25427j12470R8588
17447C23938R0498A85282j3146L1639p40c7032E0064L35626B2513K08380H8760
17435H0240K48619d0031E9774H839L2363J28455J46026I2138J83040J03898p8310
17424C00766n7429L5702M4536P5726A71277M2402q7037L29721A29390a0625G2775
17412A2250L17586K41772A06836f5808A59986K10697A35448C8635J0776P7575
17402A26986o246E9516K37320F6807J10566J34701e950B63074l9314N8563A25629
$$ y = [-190778, 148190, 242134, 138105, -193587, -157927, 113231, 86366, 21068, 176550, -154944, -173048, -62177, 523076, -18679, 159899, -65712, 101995, -164725, -77484, 83032, 155316, 42127, -86530, 68590, 324591, 247957, 169660, 324386, 149319, 189422, 112393, 337820, 225350, 323938, 414436, 185282, 172136, 203775, 203035, -37032, 50064, 385690, 22513, 230893, 88760, 80240, 328859, -40031, 59774, 8839, 41202, 169657, 315683, 92138, 275178, 379076, 300766, 243337, 279039, 323575, 399301, 171277, 213679, 126642, 456363, 129390, -10625, 72775, 12250, 329836, 571608, 106836, -65808, 159986, 370683, 135448, 38635, 49411, 126986, 120740, 59516, 296836, 66807, 177373, 312074, -5950, 263074, 223760, 282323, 125629]
17390b79442A5101h0879C20562m9232h9944l1090l8267d0603p89A73332A1408
17378A37326a52236A48800d4739B12280D6031a25272j16491B24391A08011C2825
17367A6294J78650I370K31211f8596G2199J65792J12169q7356b12543E9309L38798
17356C98107e28427C02416a6304B08421h6657I8053D6521a87560A26819C084K26819
17345B29903C0965Q1371J24279r2F6281a07830C30056A12892D3299a57277a9343
17333B43050d2872B35982j03498Q1822g6374n0766h527B27928n432Q2196j6633
17322B88059D5009F854J57794p3943L4570k6449K13790c3386m2334j71506D07010
17310A1429K34167I7622K9545P8566h156j42034b1011A46397f5806l9610n0299
$$ y = [-279442, 15101, -80879, 320562, 271330, -89944, -121034, -159301, -40603, -41392, 173332, 11408, 137326, -152236, 148800, -44739, 212280, 46031, -125272, -241763, 224391, 108011, 32825, 16294, 194944, 9370, 240581, -68596, 72199, 237991, 350160, 262804, -212543, 59309, 398107, -528427, 302416, -16304, 208421, -86657, 98053, 46521, -187560, 126819, 3084, 229903, 30965, 112336, 236615, 236523, 66281, -107830, 330056, 112892, 43299, -157277, -19343, 243050, -42872, 235982, 132484, 214306, -76374, -127140, -8527, 227928, 222496, 304692, 288059, 45009, 6854, 164648, 90705, 125275, 98826, 312616, -33386, -75720, -247226, 407010, 11429, 245596, 97622, 127167, 205733, -8156, -150190, -21011, 146397, -65806, -105416, -155715]
17299a55715A57160P7622m0324R5316H204J45886F5404F018K41349G7994e4934
17287I4110J15129M93825k90372j47424A19052J47523j21374c9959E28491B09048
17276A47619J8502q2843a47486N8442H9872J21015Q4269Q696A18097J70119k3397
17265B64819a89447j17384a29193A22387d48697A65356J0939A1393Q8777J76095
17255B76265K67886B42608h7588B02638L7267E359K3249P6690n381b31623A79436
17243A95011o5578e8841I2188a4490B34186J39495A6311M41012H012J45887F8361
17231C39569A6223K37138i5108H61J20043K1330C0701J4418L16074J48042B50627
17219A77969a35698I9714J32402K8129o8028R4477F8259J67583K64144a17950
$$ y = [-155715, 157160, 234782, 194458, 289774, 8204, 154090, 65404, 6018, 247367, 77994, -54934, 94110, 209239, 703064, 412692, 265268, 119052, 266575, 145201, -39959, 528491, 209048, 147619, 166121, 83278, -147486, -89044, 89872, 210887, 295156, 303852, 118097, 288216, 264819, -189447, -306831, -129193, 122387, -448697, 165356, 176295, 11393, 100170, 276265, 544151, 242608, -87588, 202638, 239905, 5359, 28608, 105298, 99917, -231623, 179436, 195011, 129433, -58841, 92188, -14490, 234186, 373681, 16311, 457323, 8012, 153899, 68361, 339569, 16223, 253361, -95108, 861, 120904, 142234, 30701, 45119, 361193, 509235, 250627, 177969, -135698, 99714, 232116, 260245, 192217, 286694, 68259, 235842, 499986, -117950]
17208I1581l1520P6488q285J84661j56409Q6289J78906A53513p3065J94039n940
17197B68547a13042I8870Q2469J57536l0640N0219E9748K42205B527L58137j73997
17186A86667H6035j4928J056R1903K09014r6471A34356M3146K56326j57062A13976
17174b5580n648B39415A04645N9934J07183I8001b0305D0644R1105Q5263q073
17163B08939q2730L6792J47074f9920E3513a38853A78166a49469B32428J0284
17153B42712m3067J82468A11746L08886N0248j51069J4271l9235J4177A29643
17142b45562B43288J22789E0991j2249J17447L22319r9952j00347M2775A27984
17131B98309m1361r8852o5715J71826A24940J83363J22730n6157A67586K09687
$$ y = [91581, 60061, 136549, 128264, 312925, 156516, 242805, 421711, 153513, 80448, 274487, 268547, -113042, 98870, 181339, 338875, 308235, 358454, 59748, 301953, 2527, 360664, 186667, 86035, 71107, 72163, 164066, 373080, 276609, 134356, 177502, 433828, 276766, 113976, -25580, -31228, 239415, 104645, 164579, 271762, 98001, -20305, 40644, 131749, 217012, 208939, 126209, 163001, 310075, -69920, 53513, -138853, 178166, -149469, 232428, 242712, 199645, 382113, 111746, 420632, 470880, 319811, 334082, 294847, 309024, 129643, -245562, 243288, 366077, 50991, 38742, 156189, 478508, 378556, 278209, 320984, 127984, 298309, 256948, 158096, 92381, 264207, 124940, 308303, 431033, 374876, 167586, 377273]
17121C77273n2121P424k7165L00694C7260J34392Q2602j17852o2696J45471O15508
17110H34685A57767J32087L7271G6684J86211r9226K87907Q9582l5905A64853
17099E18010B11551M2689j5745O2314P5373O4890Q6111m5589j37431j58915C8038
17087H0549J73966I2086M82194k52632J96526j25483j73995K8627J72221l8156
17077C81388R5382B11986L56391j03801A61757K25531J67554j50807J60237I6985
17066B14838L6208M0099J71827j22618J68173L3579J9332j03888j15927K44164
17056E85787r6256k20755C1302L64282O7796j63257A24240L35712k16291N8695
17046C02356L51724k17226Q8996j59188J79981k17330j26811L68987Q3968C17401
$$ y = [377273, 325152, 332576, 305411, 606105, 37260, 171652, 254254, 136402, 73706, 219177, 834685, 157767, 289854, 327125, 76684, 262895, 163669, 451576, 541158, 505253, 164853, 518010, 211551, 254240, 238495, 300809, 376182, 441072, 527183, 481594, 344163, 185248, 38038, 80549, 254515, 92086, 574280, 321648, 518174, 392691, 218696, 247323, 419544, 381388, 476770, 211986, 568377, 464576, 161757, 387288, 554842, 404035, 564272, 96985, 214838, 251046, 291145, 462972, 340354, 508527, 542106, 561438, 457550, 341623, 585787, 489531, 268776, 31302, 395584, 463380, 300123, 124240, 459952, 243661, 302356, 654080, 436854, 525850, 366662, 546643, 329313, 202502, 571489, 655457, 317401]
17035E52878p9287j04521R0100J49856k53148J21156K0675l2758R9150A24990
17024F97084j7983l6897j15568Q6126j98942K59727j50227B20219K7381M28883
17014F76483k23009J2394j70488K31107k0546l749J00703B60889M13848j46900
17004E27837J37418j67173N7903J49482j92022K78886k22432M1445K38603A99195
16993G93859j04609l15124O34930J54692E68470L76575l43512M1250O9056J29898
16983H41737k65095M71143k12954j78403K92279m9798M6947K6047l1642l02468
16973F37793q4709J37699L37312k8786l38251p8744K89514k32637J31349J66999
16963I37539k11651R4344J87966J60413j40115m24193K17259K49767l21494K81532
$$ y = [552878, 473591, 369070, 459170, 609026, 355878, 477034, 497709, 464951, 564101, 124990, 697084, 679101, 642204, 526636, 612762, 413820, 673547, 523320, 220219, 247600, 676483, 453474, 465868, 295380, 526487, 505941, 502192, 602895, 260889, 674737, 527837, 665255, 498082, 555985, 705467, 513445, 792331, 569899, 611344, 849947, 199195, 793859, 689250, 374126, 1009056, 1163748, 568470, 945045, 601533, 642783, 711839, 841737, 576642, 1047785, 834831, 656428, 948707, 898909, 945856, 971903, 940261, 637793, 553084, 690783, 1028095, 999309, 661058, 582314, 871828, 639191, 770540, 937539, 725888, 820232, 1008198, 1168611, 1028496, 604303, 821562, 1071329, 749835, 1031367]
16953A031367k76273P7362Q1603n4260L37268l48743l109K40701l56798J73563
16943I02681k3311L85408n0072l24298J15939Q7938k2439k78845N94393j62355
16933A225039q5830j68604k48340N01215j72860o5875O3182k5914R4083j36191
16923I79905K88207J23366q0428l26408m385J66537K04249J92814m52125K16038
16913A307770p8701K26231J33860l62704J94782r8072L19023m16503L73488k97396
16903A301778J0025J26660K78726k55017n7428M60190n6952j69010P6338J01055
16893A816365j63139O884P188k14357K81726L20592m10357K81028k859k82870
16883A640201M50726k44080j19702L38326k89768O680L27245j94368m6730K42775
$$ y = [1031367, 755094, 832456, 914059, 859799, 1197067, 848324, 845215, 1085916, 729118, 902681, 879370, 1264778, 1214706, 890408, 1006347, 1094285, 1071846, 793001, 1387394, 1225039, 1139209, 970605, 722265, 1223480, 1050620, 984745, 1047927, 1022013, 1116096, 979905, 1268112, 1391478, 1311050, 984642, 980257, 1146794, 1351043, 1543857, 1091732, 1307770, 1229069, 1455300, 1589160, 1226456, 1421238, 1323166, 1642189, 1225686, 1599174, 1301778, 1311803, 1438463, 1717189, 1462172, 1404744, 1864934, 1807982, 1638972, 1715310, 1816365, 1653226, 1660110, 1667298, 1452941, 1734667, 2055259, 1644902, 1925930, 1923071, 1640201, 2090927, 1846847, 1727145, 2065471, 1775703, 1782383, 2109628, 1915260, 1868530, 2111305]
16873B111305j73521L07284o9527O9981j1137J82167k37085R5707K44585j66352
16863B353407J50438j23204K48200m519k17509j74730L65732r821L67069j95355
16853B759708l6532k34841L32667j25420K52797q9578J90034K55411k50567L06537
16843C360216j69136k3376P17601p46242K90687N0029p388k5099K70737L02584
16833D020613l58147K30264k62184K47621J31720K97386j41861N14822l65871
16824D314363l2960M25747k82637N14455K1362j88447J40489P8939O0063K89276
16814E340650K83152o2978L3578j8745L57392l77061P90678P8588K76513k89585
16804F412182K72998K68324O365M89578J97455k61807L32876m6719L51357N36371
$$ y = [2111305, 1937784, 2245068, 2175541, 2245522, 2234385, 2416552, 2179467, 2275174, 2519759, 2353407, 2503845, 2380641, 2628841, 2624322, 2406813, 2232083, 2597815, 2587994, 2955063, 2759708, 2723176, 2488335, 2821002, 2695582, 2948379, 2858801, 3048835, 3304246, 3053679, 3360216, 3191080, 3167704, 3885305, 3139063, 3429750, 3479779, 3472391, 3447292, 3718029, 4020613, 3662466, 3892730, 3630546, 3878167, 4009887, 4307273, 4165412, 4680234, 4314363, 4281403, 4707150, 4424513, 4938968, 4960330, 4771883, 4912372, 4991311, 5051374, 5340650, 5623802, 5560824, 5594402, 5575657, 5933049, 5555988, 6346666, 6425254, 6701767, 6412182, 6685180, 6953504, 6959869, 7449447, 7646902, 7385095, 7717971, 7671252, 8022609, 8558980]
16794H558980j5820Q3880L71862R8954L13477M90997J17087K89670J96500M01936
16784A0907523O98891Q1126j54824N77336P29545K54571K30959N14726O21018
16775A4460871L07312L65777M91135J043321q3708O58715Q58990O36321L98090
16766A9136824J170671P98160P40210J127503O59535J264975Q20394J383941Q57835
16757B7960048J470303J254510J150783J694072J688778J844096J763185J958608
16749D0784383K128823K579561K555540K588691K941502K797055L035548L617737
16741F3028840L961106L955316M518624M557439M878667M834956N864297N802258
16733A01401503O127944N947021P149451O504576O768565O575490O595280N933933
$$ y = [8558980, 8543160, 8627040, 8998902, 9097856, 9411333, 9902330, 10019417, 10309087, 10505587, 10907523, 11606414, 11687540, 11532716, 12110052, 12839597, 13094168, 13325127, 13839853, 14460871, 14768183, 15133960, 15625095, 16668416, 16584708, 17243423, 18102413, 18738734, 19136824, 20307495, 21105655, 21845865, 22973368, 23632903, 24897878, 25718272, 27102213, 27960048, 29430351, 30684861, 31835644, 33529716, 35218494, 37062590, 38825775, 40784383, 42913206, 45492767, 48048307, 50636998, 53578500, 56375555, 59411103, 63028840, 66989946, 70945262, 75463886, 80021325, 84899992, 89734948, 95599245, 101401503, 107529447, 113476468, 120625919, 127130495, 133899060, 140474550, 147069830, 153003763]
16725A53003763N671221N036706L925493K754393K461470O06358m73064j369868
16717A71616472k790462l891635m345707n553528o171234o851201o296863p009431
16709A28706411p132006o351469o722372o296987o006563n594957n517685n412428
16701G9671944m587244m307388m185803l813468l695293l393829k924311l457925
16693D9306683k312670k440325k603166k205306j645122j952877j884203j785696
16685C2477318j587845j362374j312650j262603j250476j012226q90816j236520
16677B2561808n29033j342431n42305j032412m72570r83877o26708n93065p74442
16668A5664965m24982k94048o52867o76156l70261m3262o97825l29598p29285
$$ y = [153003763, 158674984, 163711690, 167637183, 170391576, 172853046, 173459404, 172986340, 171616472, 168826010, 164934375, 160588668, 155035140, 148863906, 142012705, 135715842, 128706411, 121574405, 115222936, 108500564, 102203577, 96197014, 90602057, 85084372, 79671944, 75084700, 70777312, 66591509, 62778041, 59082748, 55688919, 52764608, 49306683, 46994013, 44553688, 41950522, 39745216, 38100094, 36147217, 34263014, 32477318, 30889473, 29527099, 28214449, 26951846, 25701370, 24689144, 23798328, 22561808, 22032775, 20690344, 20148039, 19115627, 18643057, 17659180, 17032472, 16439407, 15664965, 15239983, 14945935, 14293068, 13616912, 13246651, 13203389, 12505564, 12175966, 11446681]
16659A1446681k51149m10922l21780n9770m15789n53560n3981J58527p70433k0118
16649H747706n34857l31907n5220j90428P8348k39423n51061l0859m1279j94473
16639F656547n72004o3645L33111l57343J96898n33293R3426k15327k13575k09413
16629E115382j45647q7152j39353j20980q5902q7868o1555J2354R1705j42781
16619D348203l09192P080n7085j61500k1772j08558n9577J04004k54272l71006
16609C116325J67213j00615j00275J65380l50072K36825p2402J36548o29554K68108
16599B837481j61136K28619j28193q5891k90471J50918j57130K46294j43679J26722
16589B623534l21631j61042J57826j944j37633K14279J4359j63617j10929j53685
$$ y = [11446681, 11195532, 10784610, 10462830, 10403060, 9987271, 9433711, 9379730, 9538257, 8767824, 8747706, 8212849, 7880942, 7825722, 7635294, 7713642, 7474219, 6923158, 6892299, 6851020, 6656547, 6084543, 6020898, 6354009, 5996666, 6193564, 5660271, 5753697, 5538370, 5324795, 5115382, 4969735, 4882583, 4743230, 4622250, 4536348, 4448480, 4386925, 4399279, 4490984, 4348203, 4039011, 4046091, 3989006, 3827506, 3805734, 3697176, 3637599, 3741603, 3487331, 3116325, 3283538, 3182923, 3082648, 3248028, 2897956, 3134781, 3062379, 3198927, 2569373, 2837481, 2676345, 2904964, 2776771, 2690880, 2400409, 2551327, 2394197, 2640491, 2496812, 2623534, 2301903, 2140861, 2298687, 2296743, 2159110, 2373389, 2387748, 2224131, 2113202, 1959517]
16579A959517k02828J24954J04580k39940q8058K75496j4813M6816l81226M6559
16569A631057N18353q33930L68425j01452j7702k1311N9507j11449K14081J97048
16559A902627p89674N00052j97981K35540k43071M42518k84847J1759k36006J67696
16549A508613o9311l59136K84117M9343l79120K45315m17873K41270J26222j4097
16539A215343n0117J50980j14392k48353p341j8987r2482K44081R0626j74253
16529I95105l08031L90982k2171j35270j7671k7460Q7758N1590j10102K74642
16519A179372l84351K51441l77432J53301q9758j6261L09065l93784J44031n7461
16509G18163L36713j38326j10357m7353r1845j13220L07678j30801o4530J97238
$$ y = [1959517, 1756689, 1881643, 1986223, 1746283, 1658225, 1933721, 1918908, 1965724, 1584498, 1631057, 2149410, 1315480, 1683905, 1582453, 1564751, 1543440, 1602947, 1491498, 1705579, 1902627, 1112953, 1613005, 1415024, 1650564, 1407493, 1850011, 1565164, 1576923, 1340917, 1508613, 1439302, 1080166, 1364283, 1413626, 1034506, 1279821, 861948, 1103218, 1229440, 1215343, 1165226, 1316206, 1201814, 953461, 946120, 927133, 834651, 1078732, 1169358, 995105, 687074, 1078056, 1055885, 920615, 902944, 875484, 963242, 1014832, 904730, 1179372, 795021, 1046462, 669030, 822331, 732573, 716312, 1025377, 631593, 775624, 718163, 1054876, 916550, 806193, 758840, 666995, 553775, 861453, 730652, 666122, 863360]
16499H63360k97869K7742M8319O7721r7377M9763j34073k83J84474L5332J12335
16488H59444l07087j38560J70917O5086j83376K8836L10419j44872j40013L38691
16478H59485j32166B41049N61117C92254K25866J78420l19137j34703Q8733K85560
16468G16993l7997n4595L784k94517L95140k01603B09615J82970O3475B18800
16457C42085M03487l65028K44320k54033j5213L5190J72117R63j55069J40027
16447E48846j77167J54950k15645K40204A08258L11966J30287G1220N41443k02750
16437D09913J41270K28719A37029K10370m1458K48024k20921J57788k02227j29221
16427A59384M0737J17401L46511A49757K84231A25273L00519n6882H5571J47624
$$ y = [863360, 565491, 593233, 641552, 709273, 611896, 661659, 527586, 527303, 711777, 747109, 859444, 552357, 413797, 584714, 649800, 466424, 495260, 805679, 660807, 520794, 859485, 727319, 241049, 802166, 392254, 618120, 796540, 477403, 342700, 431433, 716993, 678996, 624401, 628185, 333668, 728808, 527205, 209615, 392585, 456060, 218800, 342085, 745572, 380544, 624864, 370831, 355618, 390808, 562925, 563888, 408819, 548846, 371679, 526629, 310984, 551188, 108258, 420224, 550511, 71220, 612663, 409913, 551183, 779902, 137029, 347399, 305941, 553965, 333044, 490832, 288605, 159384, 200121, 317522, 664033, 149757, 433988, 125273, 425792, 368910, 85571, 233195]
16417B33195K75669j63042A69938P2220l70J04921Q2146L3447j42541o4942H8969
16405C43668q9949A08307K12470M10113B48240J5862J5946n3875L2892e8089C32754
16393B9674K28502p2736l729K32388P8704E5062M54184h9118B09420J4104P5458
16382B98982K86500C2159J84457J07856d0294E18927j72108j41449C8320J06262
16372A44582J31746I0446J21008I3141K76118a44970B04046O7349H8568K15461
16362C04029m7307E9253e8509A06876c4651B26450K5861J02209q5023j06250J62064
16351C25311j17883B8442a1957H3729j7741L47320M4834A3818J55011N5711I9151
16339A96220J03J3752l0738D5379M19679D6090b15832B30946f7489C59336j54463
$$ y = [233195, 508864, 345822, 169938, 242158, 241788, 346709, 428855, 462302, 319761, 254819, 88969, 343668, 253719, 108307, 320777, 730890, 248240, 264102, 280048, 226173, 259065, -58089, 332754, 29674, 258176, 185440, 181711, 414099, 492803, 55062, 509246, -89118, 209420, 223524, 298982, 585482, 32159, 216616, 324472, -40294, 518927, 346819, 205370, 38320, 144582, 276328, 90446, 211454, 93141, 369259, -144970, 204046, 271395, 88568, 304029, 256722, 59253, -58509, 106876, -34651, 226450, 252311, 354520, 269497, 163247, 325311, 207428, 28442, -11957, 83729, 65988, 413308, 458142, 13818, 168829, 224540, 99151, 196220, 196323, 210075, 179337, 45379, 465058, 46090, -215832, 230946, -67489, 359336, 204873]
16328B04873J07377J65546j32278r3054J87526A71548m8348L35250l6635A35213
16317B14965H585L34038C5907M0444K99824m1225J9932j72547b35993L1818C94064
16305C26221i8442B57248a00852j12411C29080a60629B91162j14694q7495A0677
16294I7647m1619J40893q996b62344B97001E6459J50569a32103A57801I184J08235
16283A17419k2565b24285B92056a86473n9267A37314J97947j48716J81712A35095
16272e6834k9139p2729C21712a35055B23667a4395B28239a68974d2097J8508B04080
16260A36475g8937A27975n9497B5629L21858A33997O7696j4896O199f1791A21023
16248b25843B69120a22274A66034K23818b79712I3026Q3752m8680J24623A12574
$$ y = [204873, 312250, 477796, 345518, 252464, 439990, 171548, 123200, 458450, 421815, 135213, 214965, 8585, 342623, 35907, 76351, 376175, 334950, 354882, 182335, -235993, -204175, 394064, 326221, -98442, 257248, -100852, -213263, 329080, -160629, 291162, 176468, 88973, 10677, 97647, 56028, 196921, 187925, -262344, 297001, 56459, 207028, -132103, 157801, 9184, 117419, 94854, -224285, 292056, -186473, -245740, 137314, 335261, 186545, 368257, 135095, -56834, -85973, -158702, 321712, -135055, 223667, -14395, 228239, -168974, -42097, -23589, 204080, 136475, -78937, 127975, 68478, 25629, 347487, 133997, 201693, 186797, 192996, -61791, 121023, -225843, 269120, -122274, 166034, 389852, -279712, 93026, 176778, 128098, 252721, 112574]
16237c55298a4605C17755b00453H0557d8788N472E5173J38549k9003o4536h8705
16225a45197E9014L7057J64289a81120C83052A47680j2432a7114B29862E9448
16214B09085B3545j645P0280j5244B1181M6315J13869K7080m1889c67170a24653
16202a54906j25048Q622E0501b5369F1077k8888i8008A02255a11469F0258a72718
16190d0059r0348j8652d3450A88774e14956D9129c37849B24212c24965e8093B4480
16178A08387f1234m5770M7453K2369A8979g6909m4398K6641l7122l3362A38452
16166C00248g9521H8009m1332I395Q935J11071B5905i8394k9496B11048e7446
16154H7919c09926B09272G6459N1757J02183a53972L5061B06447j02941a34740
$$ y = [-355298, -14605, 317755, -200453, 80557, -48788, -43316, 55173, 193722, 164719, 100183, -88705, -145197, 59014, 96071, 260360, -181120, 383052, 147680, 135248, -17114, 229862, 59448, 209085, 23545, 21900, 92180, 76936, 21181, 67496, 181365, 208445, 166556, -367170, -124653, -154906, -279954, -271332, 50501, -25369, 61077, 32189, -98008, 102255, -111469, 60258, -172718, -40059, -130407, -149059, -43450, 188774, -514956, 49129, -337849, 224212, -324965, -58093, 24480, 108387, -61234, -107004, -59551, -37182, 18979, -76909, -121307, -94666, -131788, -165150, 138452, 300248, -79521, 88009, 46677, 9395, 18330, 129401, 25905, -98394, -127890, 211048, -57446, 87919, -309926, 209272, 76459, 128216, 230399, -153972, -118911, 206447, 103506, -134740]
16143b37597J0984a9676B17749H99J08128a57958g0808B1033e6176k56248B37781
16131I8371b17000H6755j3329J63996A3830a9628r4175J7407a651j46904A22339
16119D8280K5503k7387c8535B08030c80590Q3838f4257K1634I692a04906F7113
16107D28775r2419g558A01059c8126f333q6701B57749F5145J35254b7805A79230
16095A11821g764H4256a86324A4756K51505E166b01022D2979i1893k6932C38307
16083a74431F597c01565a1657D99601B31779A13327R0841i3614A23785O7826n4423
16072A37188o6904R511d5345j96906g6531j18702N0499b8484A43148a20286A07570
16060A6279J4886a30304B95433b8918m32B35181B7916J39821b0661n707j99584
$$ y = [-237597, -226613, -19676, 217749, 899, 109027, -157958, -70808, 21033, -56176, -312424, 237781, 98371, -217000, 86755, 73426, 237422, 13830, -19628, -113803, -96396, -1651, -148555, 122339, 48280, 73783, 46396, -38535, 208030, -380590, -296752, -64257, -42623, 9692, -104906, 67113, 428775, 336356, -7558, 101059, -38126, -6333, -93034, 257749, 65145, 200399, -27805, 179230, 111821, -7764, 84256, -186324, 14756, 266261, 5166, -201022, 42979, -91893, -118825, 338307, -174431, 6597, -301565, -11657, 499601, 231779, 113327, 204168, -93614, 123785, 191611, 137188, 70284, 79795, -45345, -242251, -76531, -195233, -144734, -28484, 143148, -120286, 107570, 16279, 31165, -130304, 295433, -28918, -29350, 235181, 27916, 167737, -20661, -26368, -225952]
16049b25952B42179c59232H649c36756B31470C5102Q69J37067b17761e221A56836
16037d8107A22534c9795I3882h9875k4357N3589k39239A80309b65462F8732b21380
16025A47066N8272F9351a93077h9773m10407H3788A091a64988A01989a60051e9201
16013b49513G7512b19318k6452J7442C3376a29801o3674e6501p5070N216j63835
16002b90190b7808m23577e6082A181J51850B1951a10649G875a97056I2262b76599
15990H0781a33517j37995f527l14776A80336M41242k99663D9009N4297m7624P0055
15979A25737O1516K182e2773C3277M4326J47697i748j91791b1420O001B6112b86134
15966C05576i3401K1127A51476d7404D0464c5292a1230A62753Q332J09816a25654
$$ y = [-225952, 242179, -359232, 8649, -336756, 231470, 35102, 35971, 173038, -217761, -5221, 156836, -48107, 122534, -39795, 93882, -89875, -114232, -60643, -299882, 180309, -265462, 68732, -221380, 147066, 205338, 69351, -193077, -89773, -500180, 83788, 1091, -164988, 101989, -160051, -59201, -249513, 77512, -219318, -245770, -228328, 33376, -129801, -193475, -56501, -131571, -126355, -290190, -27808, -451385, -56082, 1181, 153031, 21951, -110649, 7875, -197056, 92262, -276599, 80781, -133517, -271512, -6527, -321303, 180336, 621578, 321915, 49009, 103306, 55682, 125737, 187253, 189435, -52773, 33277, 77603, 225300, -9748, -201539, -21420, -15419, 26112, -286134, 305576, -93401, -72274, 151476, -47404, 40464, -35292, -11230, 162753, 171085, 280901, -125654]
15954g464q100H184e7627A7335J97309j05326b83243l35406b78533e6876B7159
15942H0888a96933k8194A46325h8694C4010j5426c08666J50756m6685A83139E3989
15930C8227a22101C4898e2375A6899J08663a4405A71616b25912A17863D8878Q2359
15919A31237L65553b84313a848k12328m1942J17399c6098A13528B8934N4519b4748
15907a20780m2782A8614a42249O1670o6793F1574a03999j59261e0010m1766A33018
15895a07981j34264a14207A37744B1811K06224I4978Q0831c64973K5479B71599
15884e8863E974O7870O139K53414k1670a93223P7108d6087A23739n7333L459J71177
15872B41042g4482k57786B36030C7197d8702H2811b438n07640C2920i5258I7016
$$ y = [-7464, -15564, 8184, -57627, 17335, 214644, 109318, -283243, -618649, -278533, -56876, 27159, 80888, -196933, -225127, 146325, -88694, 34010, 18584, -308666, -157910, -204595, 183139, 53989, 38227, -122101, 34898, -52375, 16899, 125562, -14405, 171616, -225912, 117863, 48878, 131237, 496790, -284313, -1848, -214176, -256118, -138719, -36098, 113528, 28934, 83453, -24748, -120780, -163562, 18614, -142249, -80579, -147372, 61574, -103999, -263260, -50010, -91776, 133018, -107981, -242245, -114207, 137744, 21811, 228035, 94978, 175809, -364973, -339494, 271599, -58863, 5974, 73844, 79983, 333397, 311727, -193223, -116115, -46087, 123739, 66406, 69865, 241042, -74482, -332268, 236030, 37197, -48702, 82811, -2438, -510078, 32920, -95258, 97016]
15860a89464N642h2508o0519G822a33243a5829I8483g6411m6310o2473o6634B99063
15847e4223j13495C27011A472b19814B72695l9725a51321g207B9780a56960K9285
15836a27675A2163e6678j4274p4322P0802p4144K4940c3943B7692k175b27370
15824G4701K70966B6104b13601I023J26489h5394j71974j11300a19920l7309N6489
15813a00740I9905h5764j78857A0329a72129e9164B33311A3623J9616d5908m26596
15802d72504b16701i6573A55945n5255k5823a835B06607a22812B11358H9373k5063
15791F4310j8150H131f3035A35044b1644A44066a20060C57103a3370D4963J48585
15780A93548b6236A0336K37820i496B20982a5869k16163F2221b43976f1028Q202
$$ y = [-189464, -183822, -82508, -143027, 7822, -133243, -15829, 98483, -76411, -122721, -185194, -251828, 299063, -54223, -167718, 327011, 1472, -219814, 272695, 232970, -151321, -7207, 29780, -156960, -127675, 12163, -56678, -70952, -145274, -74472, -148616, -123676, -33943, 27692, 25517, -227370, 74701, 345667, 26104, -213601, 9023, 135512, -85394, -257368, -368668, -119920, -157229, -100740, 99905, -85764, -264621, 10329, -172129, -59164, 233311, 13623, 33239, -45908, -472504, -216701, -96573, 155945, 100690, 74867, -1835, 206607, -122812, 211358, 89373, 64310, 46160, 8131, -63035, 135044, -21644, 144066, -120060, 357103, -13370, 44963, 193548, -26236, 10336, 248156, -9496, 220982, -15869, -232032, 62221, -243976, -61028, -52826]
15769e2826k706a1979j95539l7932A5656a39716A02693a78902c7281C469K27281
15758B30750b3774j13462b1204j47089c6116A07441a53324n5899B72608D1464
15747a70172B6301b68068N3568B48080a12951B76674I3771a63639j19127f1960
15736H279M2764K3295a68641J220A61861e6235j64934b0393k7384r1411C6005
15724A40497b41351B29108b23770A06155J28180g0862H0856c0405a842j33870
15714a35712p307B01003b01759c0346k17882a732H6396b58207Q2004j22187A22249
15702e3469p2374J5527L9077k63719A72857C6458O0272c33762H5925a9136l5716
15691e4852F638K34321a74452B02476G026a24967B60439I4903P126K304B551a11374
$$ y = [-52826, -55532, -11979, -207518, -245450, 15656, -139716, 102693, -178902, -37281, 3469, 230750, -23774, -137236, -21204, -168293, -36116, 107441, -153324, -209223, 272608, 41464, -170172, 26301, -268068, -214500, 248080, -112951, 276674, 93771, -163639, -282766, -61960, 8279, 51043, 74338, -168641, -167421, 161861, -56235, -221169, -20393, -47777, -139188, 36005, 140497, -241351, 229108, -223770, 106155, 234335, -70862, 80856, -30405, -1842, -135712, -143019, 201003, -201759, -30346, -248228, -1732, 86396, -258207, -176203, -298390, 122249, -53469, -125843, -110316, -71239, -334958, 172857, 36458, 96730, -333762, 85925, -19136, -54852, 6638, 240959, -174452, 202476, 7026, -124967, 260439, 94903, 102029, 104333, 2551, -111374]
15678a11329j27523G6093J96314g2789A22267b52679j9752F0395J27466r0658
15668I7203j7688d0735D7474c5273g693p2280j14931O7796C235P0518l1416J32536
15656A74873b87871K9059L3636F6688K52403n9663I6091K57820A62974f1678P639
15645e4039B0859e2389A01436O1416A57a09625a7390m4236B71729K03928a40736
15633c4909E3506a47572j66694a45124e0260j14453B82900f5427I7904a64420
15622A48030a39366A44730a0699l3552A37364K45084A02959c96429D21860h5756
15611D4017R4642o558K26080A079c87921C530a82766C2654a92501b52A74696E0092
15598A63259c4800n9064b6292k49538R2698B13064e2915A22220b54200E0680b37421
$$ y = [-111329, -238852, 76093, 272407, -72789, 122267, -252679, -272431, 60395, 187861, 97203, 79515, -40735, 47474, -35273, -7693, -79973, -194904, -127108, 3235, 73753, 42337, 174873, -287871, -258812, -225176, 66688, 319091, 259428, 96091, 353911, 162974, -61678, -54039, 20859, -52389, 101436, 162852, 157, -109625, -17390, -61626, 271729, 475657, -140736, -34909, 53506, -147572, -314266, -145124, -50260, -164713, 282900, -65427, 97904, -164420, 148030, -139366, 144730, -10699, -44251, 137364, 382448, 102959, -396429, 421860, -85756, 44017, 138659, 132101, 358181, 1079, -387921, 3530, -182766, 32654, -192501, -252, 174696, 50092, 163259, -34800, -93864, -26292, -275830, -183132, 213064, -52915, 122220, -254200, 50680, -237421]
15586B68950A31637k3013a97809e4978j81908B07071p5946a97217B5366L2524
15576E7890c44811C43228g9177j12525A59207a11754k03043P1103P7023O1970
15566a04701B25418a4265p0600p0983A91515b60568B8113E239K1473b20401q3299
15555c03700B9338J02505a42745e8689j2459A9347a02170j98393a24606j64529
15545b89135K0057o9750R1223B32299e9780B83370j35186a23466C24334d6964
15534G6336h3995b2976A25321j6486i2504B89807d9211B01956a22981k6676c34
15522H4353b23527F3251c37847P5585a12872j87415J44255G3724g6761M572l4328
15511a06517L1515k69140a71571B72024c40074a7714C99864j74715j07853g9047
$$ y = [268950, 131637, 108624, -197809, -54978, -236886, 207071, 131125, -197217, 25366, 57890, -344811, 343228, -79177, -191702, 159207, -111754, -314797, -243694, -166671, -104701, 225418, -14265, -84865, -155848, 191515, -260568, 28113, 5239, 26712, -220401, -303700, 29338, 131843, -142745, -58689, -71148, 19347, -102170, -300563, -124606, -289135, -269078, -338828, -247605, 232299, -59780, 283370, 148184, -123466, 324334, -46964, 76336, -83995, -22976, 125321, 108835, -92504, 289807, -49211, 201956, -122981, -149657, -334, 84353, -223527, 63251, -337847, -262262, -112872, -300287, -156032, 73724, -76761, -72189, -106517, -75002, -344142, -171571, 272024, -340074, -17714, 399864, 225149, 117296, -79047]
15500E7567J92065a7507D5061A4083b2467A57605A070J41659k2467g3744r9489
15489a73233c2891m4561j27332j19974B62539j08652o0957b82387a36610C5876
15478i1440c3689p1522j11717A1845Q4168A2436Q2539a26250o8012a2458G3396
15466h9127p849b0284A94787a90440e1101C6215i5143r0368B13828a72521A20582
15454g9094A5384c34071A95920b07440l2223i4892j58065C94853a01269o9177
15444a70446D0826N8273c40475A07701b27734A78268a70541b1973B55293g409
15433h1962B87962c45091A28337C7329a40349k3443I9445a67442B34175a7147
15422c0753D5250A2043b26866a02451c8618A08114c73018g8126B0785c69459a79983
$$ y = [57567, 249632, -17507, 45061, 14083, -22467, 157605, 1070, 142729, 120262, -73744, -173233, -32891, -77452, -204784, -324758, 262539, 153887, 92930, -282387, -136610, 35876, -91440, -33689, -105211, -216928, 11845, 96013, 12436, 94975, -126250, -194262, -12458, 73396, -89127, -96976, -20284, 194787, -190440, -51101, 36215, -95143, -185511, 213828, -172521, 120582, -79094, 15384, -334071, 195920, -207440, -239663, -94892, -252957, 394853, -101269, -170446, 40826, 99099, -340475, 107701, -227734, 178268, -170541, -21973, 255293, -7409, -81962, 287962, -345091, 128337, 37329, -140349, -163792, 99445, -167442, 234175, -17147, -30753, 45250, 12043, -226866, -102451, -38618, 108114, -373018, -78126, 20785, -369459, -179983]
15410A6947e2386B42050g3290K0650k92661F3096j2107J78320a59114b6233q9801
15399a16034a3454j52017L1559j5363H1699j6604J97934o1255d261p6665A60882
15387a71439A90896F9931a05736A32661a72947j2407A16180Q7349C6568c22844
15376C0321a76059a7644F5356L01655C9132J38586c14978J34577h2054h056n4111
15365f2167n2358M2263k9422a7743k26323b777A05145j8766c49116B09460q0994
15354A28466c03261D3122J60758m0957c4489B33464A00936J5765J62610b77578
15343E0630J13995i9938b1397F0016r876c0994j46811c6682j27557A79639e1964
15331i9044A73572L4444o5221a04471j35130B41237q4965a36939A39161b49503
$$ y = [16947, -52386, 242050, -73290, -52640, -345301, 63096, 50989, 229309, -159114, -26233, -116034, -13454, -165471, -133912, -149275, 81699, 65095, 263029, 201774, -4261, -80926, 160882, -171439, 190896, 69931, -105736, 132661, -172947, -185354, 116180, 203529, 36568, -322844, 30321, -176059, -17644, 65356, 367011, 39132, 177718, -314978, -180401, -82054, -8056, -62167, -114525, -72262, -101684, -17743, -244066, -2777, 105145, 86379, -349116, 209460, 128466, -303261, 43122, 203880, 162923, -34489, 233464, 100936, 116701, 279311, -277578, 50630, 164625, -99938, -21397, 60016, 50140, -30994, -177805, -36682, -164239, 179639, -51964, -99044, 173572, 208016, 142795, -104471, -239601, 241237, 156272, -136939, 139161, -249503]
15320E2378f9912A01690f2746B93618C5159j3727b57913J25758b3024m9559B95469
15308b97076J33234a7131A64608F0553p735h3654C15143H9784Q3423b75961j05515
15297c81476B7512N8007J7387d0426A1195a539m2383B77400o8400r685D8923e0558
15284B04078b13322I3197i4317B6019e5367B28588l2196h2995D7923Q003O4002
15273A19928E6581a61120B20512b9923j06190A28171D0802a10229l6975P2008
15263g5196J2866q964C26349A27501p783b3313A98823G9767K10875j30976h4872
15251A96990C4131M99350j72043O27318K90098l69061K08650k84414A60692p4810
15241H5882J61960c18566C39179G4941a496q1542j34100K9528d1423H3365O286
$$ y = [52378, -69912, 101690, -62746, 293618, 35159, 21432, -257913, -132155, -23024, -72583, 295469, -297076, -163842, -17131, 164608, 60553, 52818, -83654, 315143, 89784, 173207, -275961, -381476, 27512, 85519, 102906, -40426, 11195, -1539, -43922, 277400, 209000, 199315, 48923, -50558, 204078, -213322, 93197, -94317, 26019, -55367, 228588, 196392, -82995, 47923, 55926, 119928, 56581, -161120, 220512, -29923, -136113, 128171, 40802, -110229, -147204, -75196, -62330, -71294, 326349, 127501, 119718, -23313, 198823, 79767, 290642, 159666, -84872, 196990, 34131, 533481, 361438, 988756, 1278854, 909793, 1118443, 834029, 160692, 85882, 247842, -318566, 339179, 74941, -1496, -83038, -217138, -187610, -41423, 83365, 89651]
15230H9651b25952G3190c517o2981E1185b31718A06823D6756k1688m077J09240
15219A30231a06845C93397j90482M465E8977c96047H0381K092L9746b7717p2515
15208a00232A27991D3552a20669H9505k3886J27490r4956G743d20532J84456Q6822
15197a49254E8262c5457j44285D59276A9501M9568e6028p3982j5123d6695j38550
15186a85245B03598q2900d063E2346g17A57788N6042e7470k4468b1745G0457A8579
15173e9584C6550a9975q945n5145c4077A60628a6434d939B21127g8302C10531
15161B63540E0291i8384b2955G3528J16403a37169B96690r3132Q0129M7444j16271
15150B14860P8908A29874a03727F0684J58641C0841M8826N9661l6868J39797L8872
$$ y = [89651, -225952, 73190, -3517, -66498, 51185, -231718, 106823, 46756, 25068, 20991, 130231, -106845, 393397, 202915, 207380, 58977, -396047, 80381, 82473, 122219, -27717, -100232, 127991, 43552, -120669, 89505, 65619, 193109, 98153, 7743, -420532, -236076, -149254, 58262, -35457, -179742, 459276, 19501, 69069, -56028, -130010, -145133, -46695, -185245, 203598, 120698, -4063, 52346, -717, 157788, 213830, -57470, -81938, -21745, 70457, 18579, -59584, 36550, -19975, -28920, -84065, -34077, 160628, -16434, -4939, 221127, -78302, 310531, 263540, 50291, -98384, -22955, 73528, 189931, -137169, 296690, 203558, 283687, 331131, 214860, 293768, 129874, -103727, 60684, 219325, 30841, 79667, 139328, 102460, 242257, 281129]
15139B81129D7883b26860A96754D2714g0566A64540O5519a21449N7856A20405
15128A00433o19Q5208g4632D9924N6524O8858J1037b03068C39169j69253E5145
15116a56315D14517c22962b7585A77938h0885A11718j7149b09363B28952p4957
15106A53995B6934K02900m1670m0002m6746a35071e0822B73873j08839H2404p526
15095G4878A0785K04436r3847d9306C57861J5059F8846d4901j52578K1286d5529
15083A50635E8324a28734C63544A79144h8846A92024a36230N2371a5543r4758
15073a10301n1651A43768f4077K6969k40940B10206a10385F1641J10176a13092
15062C90925K1504c9752A57199J52329N6153D775d881C22088D9112P3159K23981
$$ y = [281129, 47883, -226860, 196754, 42714, -70566, 164540, 230059, -121449, -63593, 120405, 100433, 99814, 185022, -74632, 49924, 106448, 175306, 186343, -203068, 339169, 169916, 55145, -156315, 414517, -322962, -27585, 177938, -80885, 111718, 94569, -209363, 228952, 153995, 26934, 229834, 188164, 148162, 101416, -135071, -50822, 273873, 165034, 82404, 74878, 10785, 215221, 121374, -49306, 357861, 372920, 68846, -44901, -197479, -176193, -45529, 150635, 58324, -128734, 363544, 179144, -88846, 192024, -136230, -83859, -15543, -110301, -161952, 143768, -64077, -37108, -278048, 210206, -110385, 61641, 171817, -113092, 390925, 412429, -39752, 157199, 309528, 365681, 4775, -4881, 322088, 49112, 122271, 346252]
15051C46252b1343A68018J49798e5915A42769J12302J32524A35277R8924a34845
15040A71242M7533G1499g6050B13722a17258D08516J25555A39147O3849n9925
15030A43071M2137n5524a42752r3863A74123b0508C54830N3365b7662D3296L28615
15019C71911A25328n8246L374a42450j35953A03484L9478E2726N3770l240E0617
15007B3087K28823m0944m4972J22093J03502B1437a15328N6115E78334F986P8228
14996H5214J09982R5519a08186A00679h734k90588B31372L270n5899b2240F06378
14984D4641J24441L9464I1544f8345H3508j6486R7870L7059J48833A37700M01703
14973E39403H0519j0406b9624B22970A7934J38031D2051K24719J04960j83554
$$ y = [346252, -21343, 168018, 317816, -55915, 142769, 255071, 387595, 135277, 234201, -134845, 171242, 218775, 71499, -76050, 213722, -117258, 408516, 534071, 139147, 202996, 143071, 185208, 129684, -142752, -236615, 174123, -20508, 354830, 408195, -27662, 43296, 371911, 125328, 67082, 70456, -142450, -278403, 103484, 142962, 52726, 106496, 103256, 50617, 23087, 251910, 210966, 165994, 288087, 391589, 21437, -115328, -59213, 578334, 6986, 85214, 195196, 290715, -108186, 100679, -8734, -299322, 231372, 234642, 178743, -22240, 606378, 44641, 169082, 208546, 91544, -68345, 83508, 67022, 164892, 201951, 350784, 137700, 539403, 80519, 70113, -29624, 222970, 17934, 155965, 42051, 266770, 371730, 188176]
14963A88176K0757G6343J22493b01388B48233J5636h4909A15928P8463p2834p336
14952A14221D1108K36280o6751l500K1548p5960J22711H6350L10375b8570B10018
14940B56813I9893M3267j5589J34477a03157j611A47125K21529J23744A48152
14929E02850B03448M78834A62324e5936B58049K2674C352L19098j21179K03287
14919D04558A30078J28425A2998K2082O0115k6366J33512J80785r6783A40340
14908B30865K20338f9247j6565C50289j44432L7356J72044F910J73089K8490o4104
14897A44385o1544M31422B18744a2936D23081j83346n5229M6889j8608M2898q802
14886B46883H4482j2997M87110A94637K57547A89877J28379j50691K9975K64325
$$ y = [188176, 208933, 76343, 198836, -201388, 248233, 263869, -84909, 115928, 194391, 121557, 114221, 41108, 277388, 210637, 207137, 228685, 152725, 275436, 86350, 396725, -28570, 210018, 256813, 99893, 143160, 127571, 262048, -103157, -104768, 147125, 368654, 492398, 148152, 502850, 203448, 682282, 162324, -55936, 258049, 280723, 3352, 322450, 201271, 404558, 130078, 258503, 12998, 35080, 95195, 68829, 202341, 383126, 286343, 140340, 230865, 451203, -69247, -85812, 350289, 205857, 243213, 415257, 6910, 179999, 208489, 144385, 82841, 514263, 218744, -12936, 423081, 239735, 184506, 231395, 212787, 255685, 246883, 84482, 71485, 558595, 194637, 452184, 189877, 318256, 167565, 197540, 461865]
14876D61865j76554r4411J82694j8469M6531A24526M3526k3214P4994L0242J15882
14865C65956q5744r1920K78028j9424k00971c0057A41876p189K26512j40325J62981
14854C83855l2897j33478K4505M1074o7382N9618J33300j43515q0134o0190J3871
14843A38627J03413K8613J69712H3017L69761k8081l4870j50607b02976B52924
14832C26548K87033B45851N3787O473k3020J3478F5428M71345l9852A66418K25089
14821C91507F8424K11092J56835K2583J21294j2767J05606E5077M01846j63228
14811B93695Q4630R6212R517B23822L02324l5957m8384l2464K72198B69168K65358
14800E34526O4669j9866N2092j09097k41213K13818j56462j01735L333K54804
$$ y = [461865, 285311, 190900, 373594, 355125, 401656, 124526, 168052, 144838, 219832, 250074, 365956, 280212, 188292, 466320, 446896, 245925, -30057, 141876, 134687, 361199, 220874, 383855, 350958, 217480, 241985, 283059, 215677, 275295, 408595, 265080, 184946, 124756, 138627, 242040, 270653, 440365, 83017, 452778, 424697, 389827, 239220, -202976, 252924, 326548, 613581, 245851, 299638, 306111, 283091, 296569, 65428, 536773, 496921, 166418, 391507, 68424, 279516, 436351, 458934, 580228, 567461, 673067, 55077, 456923, 293695, 378325, 474537, 484054, 223822, 526146, 490189, 441805, 409341, 681539, 269168, 534526, 599195, 579329, 631421, 522324, 281111, 494929, 338467, 236732, 240065, 494869]
14790D94869j48898J75483K33937A61301K27372N7935Q1418k9559B40936K51868
14780D92804K6471M6341J19624Q6116B80301J07651k1955J01066O9064J23639
14770F59766B09975J92354Q2767E6017Q36892j74940A69962R4991k4769L02093
14760E42277K0880K1111j62730J33476j51004J70708j57215Q8277L9207j62581
14750C82406Q1454N1633M0973K14565r6359Q3882j74637m5699j10199A87300M33281
14739F20581j08402J1179B26289q4296L52305k45349L08255J48466j2963j88332
14729E04375K21743k86864P9559J4143L65870j95039J89470k94427p1890q197
14719E18743J19171j13950Q1449J73526M2322l88065N0830k5939K77367p5699
$$ y = [494869, 345971, 521454, 755391, 161301, 388673, 446608, 528026, 498467, 240936, 492804, 519275, 565616, 685240, 771356, 280301, 387952, 365997, 467063, 536127, 659766, 209975, 402329, 485096, 56017, 892909, 717969, 169962, 264953, 240184, 542277, 563157, 584268, 421538, 555014, 404010, 574718, 417503, 505780, 544987, 382406, 463860, 515493, 556466, 771031, 674672, 758554, 583917, 538218, 428019, 187300, 620581, 512179, 523358, 226289, 141993, 494298, 248949, 557204, 705670, 692707, 504375, 726118, 439254, 518813, 532956, 898826, 703787, 893257, 598830, 526940, 518743, 637914, 523964, 605413, 778939, 821261, 433196, 484026, 458087, 735454, 659755]
14709F59755J6382l00893M81585j92363K15522k38280r1112L99667k95178K03376
14699H58461M984j07589k9520Q9811r4221k01301j39339J30800L22349j46317
14689F88118o4875N32673m97125l7618K31453l19818N01704n7752m24409K13952
14679G66303N860m7172L4367n6432K44730l95700O7691L42986J5885J20819j70277
14668I29060n6850j3637j48380k717R045K08805q9500M7320j12841o6793j03339
14657F00173O04974j50527k00242k22667N24899l15021J61413l5337J50068k2944
14647A094789j05656k91816J16687J52859j68484R0247j12067M32294l17978K81433
14637A172308M8020k99293J63357J99679j43232l67947J71108J39620K55936o5717
$$ y = [659755, 676137, 375244, 856829, 664466, 879988, 641708, 550596, 950263, 655085, 858461, 863445, 755856, 726336, 816147, 721926, 520625, 381286, 512086, 834435, 688118, 623243, 1155916, 658791, 621173, 852626, 532808, 1034512, 976760, 552351, 766303, 772163, 724991, 759358, 702926, 947656, 551956, 619647, 962633, 978518, 1099337, 929060, 872210, 858573, 710193, 707476, 716521, 925326, 835826, 883146, 770305, 703512, 600173, 1205147, 1054620, 854378, 631711, 1156610, 841589, 1003002, 967665, 1117733, 1094789, 989133, 697317, 814004, 966863, 798379, 888626, 776559, 1208853, 890875, 1172308, 1220328, 921035, 1084392, 1284071, 1140839, 772892, 944000, 1083620, 1339556, 1273839]
14627A273839j87010j23606L51782j64872J34325J9833o3467r1173j66086J91685
14617A175250M8620m1389j75060K71667k54086K29472k69082M08151n059L13040
14607A701524l05680j43902J58112r1892J50205n9701j19162q254N7077j14248
14597A224079K34189L5909m7634j95713J40766J05619J78482k93058k0052O5173
14587A427760k01758M59841j36723j12340M3071M5192J75452j17484K8127J13756
14577A724894k20484K87084l81717N24107m70800K51151j3126J22473j24099j15050
14567A584433M61960J09666o02919L72813j36862L56379j58552J85973J72866
14558B345757J26138P8845M699J03786l3908M08543J44644P84255M61660J806885
$$ y = [1273839, 1086829, 963223, 1315005, 1150133, 1284458, 1304291, 1240824, 1149651, 983565, 1175250, 1223870, 1182481, 1007421, 1279088, 1025002, 1254474, 985392, 1393543, 1388484, 1701524, 1395844, 1251942, 1410054, 1318162, 1468367, 1408666, 1289504, 1281250, 1338327, 1224079, 1458268, 1494177, 1446543, 1250830, 1391596, 1497215, 1675697, 1382639, 1362587, 1427760, 1226002, 1685843, 1549120, 1436780, 1479851, 1525043, 1700495, 1583011, 1611138, 1724894, 1504410, 1791494, 1409777, 1933884, 1463084, 1714235, 1701109, 1823582, 1699483, 1584433, 2046393, 2156059, 1553140, 1925953, 1789091, 2145470, 1986918, 2172891, 2345757, 2471895, 2550740, 2555439, 2659225, 2625317, 3033860, 3178504, 3962759, 4424419, 6231304]
14548F231304L649453R177180J9506532J014529A7241452H226816C765276j367448
14540B397828j01087p88109m93j24446K66297K2760j3553R3857k6290n2421K78857
14529A953200j87427j25387j48706L16067l58464O36427j31914K53842l79878
14520A827760L91939j742l55930N73548k55997j98767L51453J23061O9638l28395
14510B196568K9707J05891j2704P2090P4337O8708P7122K17054m33063J79492
14500B575202j14790M34442j69345o5754K35714m06r9488J86779l46925K44219
14490B879648k16398L21338J71221K5038k27720L7382J28685N3339k47451M00412
14480C325494M15533m13669R3901k19074K41163m60435M23063l931j9525N4751
$$ y = [6231304, 9880757, 19057937, 38564469, 39578998, 17241452, 8226816, 3765276, 2397828, 2296741, 1508632, 1508139, 1383693, 1649990, 1672750, 1659197, 1753054, 1726764, 1674343, 1953200, 1765773, 1640386, 1491680, 1807747, 1449283, 2085710, 1953796, 2207638, 1827760, 2219699, 2217957, 1862027, 2435575, 2179578, 1980811, 2332264, 2455325, 2524963, 2196568, 2226275, 2332166, 2319462, 2391552, 2465889, 2534597, 2611719, 2828773, 2395710, 2575202, 2460412, 2894854, 2725509, 2659755, 2895469, 2895063, 2795575, 2982354, 2635429, 2879648, 2663250, 2984588, 3155809, 3180847, 2953127, 2990509, 3119194, 3172533, 2925082, 3325494, 3741027, 3327358, 3421259, 3202185, 3443348, 2982913, 3405976, 3402045, 3382520, 3437271]
14470C437271R2186J78251k3432J16560K2608o8647l9900K55838j36096M84187
14460D318826k30329j05422L54505l55172N6107O36K53766K04556k8243q2423
14450D386807J24772J3177J26295p5812p1902M63205l35537L48168k01918K64739
14440E041994j05295j29309N62514N1556M5295j96042K89664r5812J3853K24473
14430E702891L67512j30184K79759P3503l20752M27033j93487k9306K39683J56542
14420F573194j17109L07210Q3032K5143J74357j71386L53704j9108M41204p201
14410G643040J32454M22695l6930N0846L03490j56785j43388N53376k79785J54977
14400H643990m4427N63669k9953K57358J83387J71969M39883j61663O11736l02213
$$ y = [3437271, 3529457, 3707708, 3684276, 3800836, 3823444, 3754797, 3714897, 3970735, 3834639, 4318826, 4088497, 3983075, 4337580, 3982408, 4038515, 4039151, 4292917, 4497473, 4469230, 4386807, 4511579, 4524756, 4651051, 4575239, 4503337, 4966542, 4631005, 4979173, 4777255, 5041994, 4936699, 4807390, 5369904, 5421460, 5466755, 5270713, 5560377, 5464565, 5478418, 5702891, 6070403, 5940219, 6219978, 6293481, 5972729, 6399762, 6206275, 6176969, 6416652, 6573194, 6456085, 6763295, 6846327, 6871470, 7045827, 6874441, 7228145, 7209037, 7650241, 7643040, 7775494, 8198189, 8161259, 8212105, 8515595, 8358810, 8215422, 8768798, 8489013, 8643990, 8599563, 9163232, 9133279, 9390637, 9574024, 9745993, 10185876, 10024213, 10635949, 10333736]
14390A0333736M1414N72064m5312L36576K14178J4423P72040k59629J45589L74645
14380A2499724L61862K88729K50188l29504Q04862J63445L38930k8827N26574
14371A4875983O22714J4643L07550J71644M77258J06383K84967M45274N18339
14362A7824755J75754Q85918J74037L9431P81190N20926O92910K31548M98182
14353B1824651M51166K50440J083627M68245M59416R20785K58349R10245J102687
14344B7729611R4599O38544Q84791P17562J064010O30834R34296J098365Q06540
14335C4599152J162019J158402Q40317J026263J207349J654871Q99049J592273
14327D4139695J446753J515659J815092J476857J893152J662322J907556K153882
$$ y = [10333736, 10375150, 10947214, 10901902, 11238478, 11452656, 11467079, 12239119, 11979490, 12125079, 12499724, 12861586, 13150315, 13400503, 13070999, 13875861, 14039306, 14378236, 14349409, 14875983, 15498697, 15513340, 15820890, 15992534, 16469792, 16576175, 16861142, 17306416, 17824755, 18000509, 18886427, 19060464, 19099895, 19881085, 20402011, 21094921, 21326469, 21824651, 22275817, 22526257, 23609884, 24078129, 24537545, 25458330, 25716679, 26626924, 27729611, 27824210, 28462754, 29347545, 30065107, 31129117, 31759951, 32694247, 33792612, 34599152, 35761171, 36919573, 37759890, 38786153, 39993502, 41648373, 42547422, 44139695, 45586448, 47102107, 48917199, 50394056, 52287208, 53949530, 55857086, 58010968]
14319E8010968K311015J758787K522212K864143K243454K663713L022455L008948
14311G8405695L351930L599429L819763L583122L929656M616692M746426M922309
14303A10975022N047492N751226N587488N971004O646860P086600P731341P756535
14295A62553568Q288731Q956362R366408R775963J0529047J0883287J1419412
14288B31772778J2305091J2383705J2623796J3592285J3436285J3582663J3812815
14281C23509418J3856692J3376076J3015772J2126762J1051355R859454Q358241
14274D05153770O850795L764652j95133k686964j678468k503153n132000p133822
14266C96439677p044200r125375j1102386j2176910j3546074j3806071j4266101
$$ y = [58010968, 60321983, 62080770, 64602982, 67467125, 69710579, 72374292, 75396747, 78405695, 81757625, 85357054, 89176817, 92759939, 96689595, 101306287, 106052713, 110975022, 116022514, 121773740, 127361228, 133332232, 139979092, 147065692, 154797033, 162553568, 170842299, 179798661, 189165069, 198941032, 209470079, 220353366, 231772778, 244077869, 256461574, 269085370, 282677655, 296113940, 309696603, 323509418, 337366110, 350742186, 363757958, 375884720, 386936075, 396795529, 405153770, 412004565, 415769217, 415574084, 412887120, 411208652, 408705499, 403573499, 396439677, 389395477, 380270102, 369167716, 356990806, 343444732, 329638661, 315372560]
14259C15372560j4262264j4113150j3781718j3271092j3159970j1485334j1695298
14252B23603734j1447102j0493416j0392845r442424r217866q337193p982312
14245A56290576p572552o723614o793520o406665n972753n808261m874820m953308
14237A07185083m104252m624345m396535l813254l994433l282759k751853l550109
14229G6667543k780952l040865k609027k590081k304879k805640j905408j921227
14221E6709464j863442j692634k090108j488736j814331j527845j436470r48570
14213D3847328j438539j270080j279145j260838j097091j178340k69455j174478
14205C4879362j422924q91167q66050q40959n25961q37222m22607j019709p51595
$$ y = [315372560, 301110296, 286997146, 273215428, 259944336, 246784366, 235299032, 223603734, 212156632, 201663216, 191270371, 181827947, 172610081, 164272888, 156290576, 148718024, 141994410, 135200890, 128794225, 122821472, 117013211, 112138391, 107185083, 103080831, 98456486, 94059951, 90246697, 86252264, 82969505, 80217652, 76667543, 73886591, 70845726, 68236699, 65646618, 63341739, 60536099, 58630691, 56709464, 54846022, 53153388, 51063280, 49574544, 47760213, 46232368, 44795898, 43847328, 42408789, 41138709, 39859564, 38598726, 37501635, 36323295, 36053840, 34879362, 33456438, 32565271, 31699221, 30858262, 30332301, 29495079, 29072472, 28052763, 27301168]
14196B7301168j036965m12435o76664o33793p37011m18059l56873p20421l82481
14187B1926466o54836o84711j87665l52225o31095k79390m25433l97576m30749
14178A7882786m67993k99592m04373k35766k78157m51629k83468m63723O1351
14169A5059436l71279k03773j16194l82332m07909l28741k35107r0997m48327
14160A2474777J26488k85506J22980q63541J57060l92223j45937q3889l27751
14151A0782458M2073n9640j48309k66729m51653p9495k90642O844j13073j08471
14141I313363j26860l15112L63091l31645o5396j76418n15893N42417m74410K3442
14131H236579j74848j63684j85536j98097K01481k27687j54791L680k16541r0933
$$ y = [27301168, 26264203, 25851768, 25175104, 24541311, 23804300, 23386241, 23029368, 22308947, 21926466, 21271630, 20586919, 20399254, 20047029, 19415934, 19136544, 18711111, 18313535, 17882786, 17414793, 17115201, 16710828, 16475062, 16196905, 15745276, 15461808, 14998085, 15059436, 14688157, 14484384, 14368190, 13985858, 13577949, 13249208, 13014101, 12923104, 12474777, 12601265, 12315759, 12438739, 11575198, 11732258, 11340035, 11194098, 11110209, 10782458, 10824531, 10764891, 10616582, 10349853, 9898200, 9818705, 9528063, 9534907, 9421834, 9313363, 9186503, 8871391, 9234482, 8902837, 8837441, 8661023, 8145130, 8687547, 8213137, 8236579, 8061731, 7898047, 7712511, 7514414, 7715895, 7488208, 7333417, 7337097, 7120556, 7029623]
14121G029623j70458j96322M80534m37465k26384K07185l57322L14333m53164
14112F190560k6801j72357l26118L28355j58301j2555j41910n5666l36809L96347
14102E684745k06925J97616l26727N6719k50771M8498j33223n7588m6845j42971
14092D822528J77364l6659m19469K08972L56664p85726L39775O0626j00106j55457
14082D468512J72809k91842R5769k21806l97049J24660J66858l2057j48755k6540
14072C910559J53013j46196k71281J23562K75028n49839K40404j81161m4285J37694
14062C647498J8552J99046j29774j90003p5782L00395l07884k1672O6109J45893
14052C652378m72819l902J11479k3784J07938j78099l69050K87197q9303J52002
$$ y = [7029623, 6859165, 6662843, 7143377, 6705912, 6479528, 6686713, 6329391, 6643724, 6190560, 6163759, 5991402, 5665284, 5993639, 5835338, 5822783, 5680873, 5625207, 5288398, 5684745, 5477820, 5675436, 5348709, 5405428, 5154657, 5203155, 5069932, 5012344, 4965499, 4822528, 4999892, 4963233, 4543764, 4752736, 5109400, 4323674, 4663449, 4724075, 4623969, 4468512, 4641321, 4349479, 4445248, 4223442, 3826393, 3951053, 4117911, 4085854, 3937099, 3910559, 4063572, 3917376, 3646095, 3769657, 4044685, 3494846, 3735250, 3554089, 3509804, 3647498, 3666050, 3865096, 3735322, 3545319, 3469537, 3769932, 3462048, 3440376, 3506485, 3652378, 3179559, 3175657, 3287136, 3263352, 3371290, 3193191, 2824141, 3111338, 3022035, 3174037]
14042C174037j34529J01835P5241p8067k04128J48087j32128m35344K11438j01117
14032B625325r9193M69479j01748l48671r8432L55451j80021j83088k4411k12489
14022B202202K81719k15421K50617n5410l90097L28748m6794j46791L2828N04917
14012B746518m30011m8918j89732J25410K156j15419m4171J20020l27915J3642
14002A851580M206j44945J05426J04732K51349J8799q6578k31034j89403K4218
13992A708350J83932r5845M06498N60765K631738P061670J8594485J1710863B1101708
13982A1069377m110872j861779o38006p62009n97986o9997l04388J60885k24646
13973B660579k28328k74636J7531j40885K01220K47759l95362L64367m18662j68834
$$ y = [3174037, 3039508, 3141343, 3216584, 3138517, 2934389, 3082476, 2950348, 2515004, 2726442, 2625325, 2526132, 2995611, 2893863, 2545192, 2446760, 2802211, 2622190, 2439102, 2414691, 2202202, 2483921, 2268500, 2519117, 2463707, 2073610, 2402358, 2355564, 2208773, 2241601, 2746518, 2316507, 2267589, 2077857, 2203267, 2205423, 2090004, 2045833, 2165853, 1837938, 1851580, 1855786, 1710841, 1816267, 1920999, 2172348, 2191147, 2104569, 1873535, 1684132, 1708350, 1892282, 1796437, 2202935, 2763700, 5395438, 12457108, 31051593, 42762456, 21101708, 11069377, 6958505, 5096726, 4458720, 3696711, 3098725, 3028728, 2724340, 2885225, 2660579, 2432251, 2157615, 2175146, 2034261, 2235481, 2483240, 2087878, 2452245, 2033583, 1864749]
13963A864749L21123j63670M62679l61330k54596L83022l45331k47103R1289j47849
13953A602983J35323J37861R878j01068k71314K23502L4973n097l21156N15448
13943A961333k9783l4419q1953j49720k33708r4410K48462k39461J35283J67017
13933A648641N216m11867J41640j37304j29181N96565n12894J61351N61723n22129
13923A401761j36571L51145O4954m65884K47703K14679m21375j4509J34886m9836
13913A326953l54984P00226k41357j98508J23929l8347k94424M89690k18163l7185
13903A257830l5739J77912m1969j87921N43994m61466j37571K7356p0187n9023
13893A013216L71795l75705L22323k47348J5894p3674L39005q4651j82674J86834
$$ y = [1864749, 2185872, 2022202, 2484881, 2123551, 1868955, 2251977, 1906646, 1659543, 1750832, 1602983, 1738306, 1876167, 1886045, 1784977, 1513663, 1737165, 1772138, 1767041, 1445885, 1961333, 1931550, 1897131, 1815178, 1665458, 1431750, 1337340, 1585802, 1346341, 1481624, 1648641, 1653857, 1241990, 1383630, 1246326, 1117145, 1713710, 1200816, 1362167, 1923890, 1401761, 1265190, 1616335, 1681289, 1215405, 1463108, 1677787, 1256412, 1241903, 1376789, 1326953, 971969, 1672195, 1430838, 1232330, 1356259, 1317912, 1023488, 1513178, 1295015, 1257830, 1222091, 1400003, 1358034, 1170113, 1714107, 1252641, 1115070, 1142426, 1072239, 1013216, 1385011, 1009306, 1331629, 1084281, 1100175, 1026501, 1365506, 1280855, 1098181, 1285015]
13883A285015J0155l07749L16004k20631j51461n6552L14428k27230J80050L44107
13873A486136o27059K78166L4968k7964k69049K8652R5283R6180K9207J05292
13863A229812j06693j34169j77291J72367j18798L25520k96117M5236K75231j22534
13853A092564j29797k42157J14208L79821l8716l5826q2252O0844j93112K49421
13843A174998k29167Q8283q0105o315k2768m06917M06966L1772m52101M25474
13833I30120k03916O4976K2301j98780J34673K90944k95110L60356q2575m10787
13823F12202N3309K29019r6790N7534k26442L63886j80564m1861r360L91934l76602
13812G76265J5321L8333J32418l51006j9174M65728j92683R491l05239L97255
$$ y = [1285015, 1295170, 987421, 1303425, 1082794, 931333, 874781, 1189209, 961979, 1142029, 1486136, 859077, 1137243, 1172211, 1144247, 875198, 903850, 999133, 1095313, 1124520, 1229812, 1123119, 988950, 811659, 984026, 865228, 1190748, 894631, 939867, 1215098, 1092564, 962767, 720610, 834818, 1214639, 1175923, 1140097, 1057845, 1118689, 925577, 1174998, 945831, 1034114, 954009, 947694, 924926, 518009, 924975, 956747, 504646, 930120, 726204, 791180, 813481, 614701, 749374, 1040318, 745208, 1105564, 1022989, 612202, 665511, 894530, 797740, 855274, 628832, 992718, 812154, 770293, 760933, 1152867, 776265, 791586, 829919, 962337, 611331, 592157, 1057885, 865202, 874693, 569454, 966709]
13802I66709O0422l72004J56369j04522j79192J10704j68071L3233M44141l05885
13792F41904L60246m7814k11682p6563q9370Q226K53116l51034J8409J03788O8500
13781F77726J2107p0810j36456L51744l22674K30719N5230O7279l29505J62285
13771F97645K38346k31466K2926k58874J98720k86523J78346P2252j47511K99938
13761G83799k47551J620K26861k61638O8947M577j4441M30281m21911j34782K79076
13750G14838M4770k20425j67659M0473K78554j66574j20335K68661j24179k16314
13740C31810J08900Q8890J26055j43351j69372K01331P4671j96590M1569P8589
13730E42502j18624J72948p5215J03380J80291l83103K27701J09378J86467C53890
$$ y = [966709, 1027131, 655127, 811496, 706974, 527782, 638486, 470415, 503648, 947789, 641904, 1002150, 954336, 742654, 666091, 576721, 584947, 838063, 487029, 505438, 609226, 677726, 689833, 619023, 482567, 834311, 511637, 742356, 797586, 864865, 535360, 697645, 935991, 704525, 727451, 468577, 667297, 380774, 559120, 631372, 483861, 783799, 536248, 537868, 764729, 503091, 572038, 576615, 562174, 992455, 570544, 435762, 714838, 759608, 539183, 371524, 411997, 690551, 523977, 403642, 672303, 548124, 331810, 440710, 529600, 655655, 512304, 342932, 544263, 618934, 422344, 463913, 542502, 423878, 596826, 521611, 624991, 805282, 422179, 649880, 759258, 945725, 353890]
13719F20212J36463C24646M15376l35527R281J06207J1724J34947l7892M7358
13709F76120k90908L37649k62550J43170L98197B69272M94246l20538M67754B74621
13698A38797P38761k44964j87578L1877J86080j40688q5684J28292Q8756j40036
13688E13613L2214P1837j05561O6211P4500A91361M59633k19325j91568J71837
13678D11938j43206m1471L91783o1457B29442k1196L14518j10087o9533O5662
13668D08806j56473K22279M0322j95954M8253L54055B35906J76977l9087J95860
13658E69656B09431M29611j55027j00335l3050K98042j56259A3070M02417J37022
13648E52509m4780j21136p9826l4248L00561j15642l5314j07600K51084j40037
$$ y = [620212, 756675, 324646, 740022, 404495, 413776, 519983, 531707, 666654, 628762, 676120, 385212, 722861, 460311, 603481, 1001678, 269272, 763518, 442980, 910734, 274621, 138797, 877558, 632594, 445016, 476893, 662973, 522285, 436601, 564893, 653649, 513613, 545827, 617664, 512103, 578314, 652814, 191361, 650994, 431669, 240101, 411938, 268732, 227261, 619044, 557587, 229442, 208246, 522764, 412677, 343144, 408806, 252333, 474612, 514934, 318980, 367233, 721288, 235906, 412883, 373796, 569656, 209431, 639042, 484015, 383680, 350630, 648672, 492413, 13070, 415487, 552509, 507729, 386593, 306767, 272519, 573080, 457438, 422124, 314524, 565608, 425571]
13638D25571P6068k1950j32198A24119J97607J67840j6053j59031N9861p3929
13628C00414R7614k6575O3240j02142q269A47208J11221J05823o1530A45116L71830
13617E16946B06504K01894r0813K80632j76565q4822q7396J28638J40502B05349
13606D03537L82796C30334R7001j68316K65365J09275k67892A78170L16925O8845
13596E63940q3714A29962K51766K6319j51780R1061N3594o6674m6718A18071J53854
13585B71925J12670n0401H9819L00699A34278D2001K80247M21684l30577A79348
13574B10086J00109l5949M39563j82905A63233M98555k37089A69506J92502J03522
13564D65530N4231M124j57072H5313M36737k53127K77065n0468K6636r9390j83678
$$ y = [425571, 501639, 479689, 347491, 124119, 321726, 489566, 473513, 314482, 374343, 300414, 398028, 371453, 434693, 332551, 324282, 147208, 258429, 364252, 302722, 145116, 516946, 206504, 408398, 317585, 598217, 421652, 336830, 249434, 378072, 518574, 205349, 403537, 786333, 330334, 427335, 259019, 524384, 633659, 365767, 178170, 495095, 563940, 480226, 129962, 381728, 408047, 256267, 347328, 400922, 334248, 287530, 118071, 271925, 384595, 334194, 89819, 390518, 134278, 42001, 322248, 743932, 413355, 179348, 210086, 310195, 274246, 713809, 530904, 163233, 661788, 424699, 169506, 362008, 465530, 519761, 523885, 366813, 85313, 522050, 268923, 545988, 495520, 522156, 422766, 239088]
13553B39088L24612B20605L05634I8557M50851A74264J47100L3131A52393L83680
13543E36073A65412G6427N8847M02450k26288K53255B09849K35856A18879L84447
13533E03326k16942a6445A05025L74538j00231K81672l27743J41989e442D39681
13522B84269A12477M24097k41974K3656Q7143j64431H3320J56038J76454B03931
13511A05178L48284j75856K3459j36684n4394Q5680P4685K81410j47133R2289
13501D96918j76850J1651A25967J58381K04171k40592n3310O9754J17159j33381
13491B48149j13585K66903F2010r777J49341J13266j24238q1065A0903K43363
13481B54266D5021L29469H1553N7766L2873N2800J80963j89746k4721J94689b02403
$$ y = [239088, 563700, 220605, 526239, 98557, 549408, 174264, 321364, 354495, 152393, 536073, 165412, 76427, 135274, 537724, 311436, 564691, 209849, 445705, 118879, 503326, 286384, -16445, 105025, 479563, 379332, 661004, 333261, 475250, -5442, 439681, 284269, 112477, 536574, 294600, 318256, 405399, 240968, 83320, 239358, 415812, 203931, 105178, 453462, 277606, 301065, 164381, 109987, 195667, 270352, 551762, 404629, 496918, 320068, 331719, 125967, 284348, 488519, 247927, 194617, 264371, 381530, 248149, 134564, 401467, 62010, 52233, 201574, 314840, 190602, 109537, 10903, 254266, 45021, 374490, 81553, 139319, 172192, 224992, 405955, 216209, 191488, 386177, -202403]
13469A473K17451E172L031L12225J04171K4909k23731N9520b2377B04994I9854
13457B47506b9692B09038b8992B56416l8088K10587J16240Q441G9359J77340C1455
13445A5139J79156l5555J80425j52527K39967j28644m6947J13859A5674K10140
13435B25814J12414F4718L0325K05961k9471O8416p5157J13798j10788q3825k5144
13424A58833k6984J62722J05409a21439A07579M00717a79442D3612J26997J96821
13414C67430A72883K15566m0097o751h8104A64975B2140L65725A42644J68694
13404C11338P7413H4790J29276J09024m6073I4889J15386M4801b6363A57069R2970
13393B50039A2524K93963F0064c6793D36156R2306j52119c8140B86605a40377
$$ y = [1473, 218924, 5172, 8203, 320428, 424599, 449508, 225777, 285297, -22377, 204994, 99854, 247506, -29692, 209038, -28992, 256416, 218328, 428915, 545155, 553596, 79359, 256699, 31455, 15139, 194295, 158740, 339165, 186638, 426605, 297961, 251014, 364873, 15674, 225814, 338228, 64718, 95043, 301004, 271533, 339949, 264792, 378590, 267802, 183977, 158833, 131849, 294571, 399980, -121439, 107579, 508296, -179442, 43612, 170609, 367430, 172883, 388449, 348352, 341601, -88104, 164975, 22140, 387865, 142644, 311338, 388751, 84790, 214066, 323090, 277017, 94889, 210275, 255076, -26363, 157069, 250039, 12524, 306487, 60064, -36793, 436156, 528462, 376343, -38140, 286605, -140377]
13382D69488b8311A83972c3750A77324K9220o1392J98856p1761K5065F796J33360
13371A40156J54713j38713A4358a04033C21017A26864K40079k9862O1400A39253
13360B22517J71656D5529N16421j22329D4340N62244j01070A76363M7715K23024
13350D47102k14437c12246D27226A1730L56766l8786M6241n5031J53792j52287
13340C22425j6207A52320J6188J0082J38241q9318J20406p3897a9842C83592L8918
13329D22510A58890B3426d6237A64524d6006D47937B17132A9813L40178M8530
13319D08521j65402F6253K08327m4830A14606J96752A08444J6563m1302J27323
13309B11028n5402F8228Q2107L54350f3914C72135p3296K06845H4983c24568H3943
$$ y = [469488, -28311, 183972, -33750, 177324, 206544, 145152, 344008, 272247, 297312, 6796, 140156, 294869, 156156, 14358, -104033, 321017, 126864, 366943, 337081, 398481, 139253, 222517, 394173, 45529, 561950, 439621, 44340, 606584, 505514, 176363, 224078, 447102, 232665, -312246, 427226, 11730, 368496, 329710, 375951, 320920, 474712, 322425, 306218, 152320, 168508, 178590, 316831, 227513, 347919, 274022, -19842, 383592, 422510, 158890, 23426, -46237, 164524, -46006, 447937, 217132, 19813, 359991, 408521, 243119, 66253, 274580, 229750, 114606, 311358, 108444, 125007, 83705, 211028, 155626, 68228, 150335, 504685, -63914, 372135, 298839, 505684, 84983, -324568, 83943]
13297D56811j49267C2892J98022K6576L5317l7648J47232A00310Q789n2339Q8513
13286A45273N27176b36250J17097C2994H302P3194K11921A31225Q7834p5831J19080
13275B62308J17685n7598b9454B8226N16546G5926m022r355K06245n8205F9436
13263C6623L21686j50133e0920H3681D1168J51523N3282j12402B3915L93904a53649
13251a70979C79966F7111L2107A5805K44942O4038A05156J81934j40413E0287
13240e8505D4106N0756b3180B07095K7353K00914B06363e6980B6773a09861A423
13228A82184r281K34895F6394E801M1522B1914J90740A01334M5734J21878n768
13217B63178A04004C7067L24902a63169a1469B95722a08715A33512A2037e5237
$$ y = [456811, 307544, 32892, 230914, 257490, 292807, 255159, 402391, 100310, 109099, 56760, 145273, 672449, -236250, -119153, 32994, 8302, 81496, 293417, 131225, 219059, 143228, 262308, 379993, 322395, -29454, 28226, 544772, 75926, 71904, 62549, 268794, 210589, 69436, 36623, 358309, 208176, -50920, 83681, 41168, 192691, 245973, 133571, 23915, 417819, -153649, -170979, 379966, 67111, 99218, 15805, 260747, 324785, 105156, 287090, 146677, 50287, -58505, 44106, 94862, -23180, 207095, 234448, 435362, 206363, -56980, 26773, -109861, 1423, 182184, 172903, 407798, 66394, 5801, 47323, 21914, 212654, 101334, 147068, 268946, 263178, 104004, 37067, 361969, -163169, -11469, 295722, -108715, 133512, 12037, -55237]
13206B92031p3069p7828D6385h9946B00538h7611j88295A68207n3058c4310A25431
13194C50031a68364j82714E6333J31208C4755a67046C9513J34604f5534G1416
13183a66778G9418B0042J75842R1256b133E3571A1184b93813B54498R5091l5486
13172C14103I3299K20977G1882N6300A7241K09059o5394M7247G1093j1684a48298
13160A58221f7724A48375J35635A05707L2593d7837A25934L9617j2850E9684J50990
13149B10674L22657g5012B01755D7554J06140J07921f875B24526n7118g0313m0344
13138a10657C09786a08945B93593I4231J85788I8835j0770i9688A92217o0430
13128A31787J43415A1282i9269C0349J69996b38793P7443A42859Q0345Q5501j06900
$$ y = [292031, 218962, 141134, 46385, -89946, 200538, -87611, -275906, 168207, 115149, -34310, 125431, 350031, -168364, -351078, 56333, 187541, 34755, -167046, 39513, 174117, -65534, 71416, -166778, 79418, 20042, 195884, 287140, -2133, 53571, 11184, -293813, 254498, 349589, 314103, 93299, 314276, 71882, 128182, 17241, 226300, 160906, 208153, 71093, 59409, -148298, 158221, -67724, 148375, 284010, 105707, 138300, -47837, 125934, 165551, 152701, 59684, 210674, 533331, -75012, 201755, 47554, 153694, 261615, -6875, 224526, 167408, -70313, -110657, 309786, -108945, 293593, 94231, 280019, 98835, 88065, -99688, 192217, 131787, 275202, 11282, -99269, 30349, 200345, -238793, -161350, 142859, 223204, 308705, 201805]
13117B01805a1186F9976M2256b3823A80793c1133j17666B34248b18808D27853
13106B60280k5044o0153o9061J90403I337K12899r0913a63762g6608C04383c74591
13094A1707J80683J0801r0161g0819B00866J49809p1691a34607A82195D5538J31731
13083A77269G6710O651d7266A94402A2338J75043R8130r6819e6726B27765H1286
13071A11891A4787J10123J04334d9341l8759D2166J80059I4199m3551K26174r3369
13060A83453G4441O3002L59193a75893A7932J12543F497c3575B04005a2707l2783
13049d5490G1768J00195J38119j05017p8642b1493j72904d2426i658j14802A64340
13037H8266L50647j66027a71839I0646Q5090a33801a1886A80144a0789B35298
$$ y = [201805, -11186, 69976, 112232, -23823, 180793, -31133, -148799, 234248, -218808, 427853, 260280, 235236, 175083, 106022, 296425, 9337, 222236, 131323, -163762, -76608, 304383, -374591, 11707, 192390, 203191, 113030, -70819, 200866, 350675, 278984, -134607, 182195, 45538, 177269, 76710, 83361, -47266, 194402, 12338, 187381, 285511, 188692, -56726, 227765, 81286, 111891, 14787, 124910, 229244, -49341, -88100, 42166, 222225, 94199, 50648, 276822, 183453, 74441, 137443, 496636, -175893, 17932, 130475, 6497, -33575, 204005, -12707, -45490, 71768, 171963, 310082, 205065, 126423, -21493, -194397, -42426, -9658, -124460, 164340, 88266, 438913, 272886, -171839, 90646, 175736, -133801, -11886, 180144, -10789, 235298]
13026A51827l2609n617M816J12538k7967A7516J02581k0135e8302C19439b24394
13014D65467A29310m5737K7142n1057a19615p1710A94790q7212R5875F1780K4178
13003H5958J12835B9889J42682G669K4755J70305f5010i451C17560j22911r5238
12992I9411J63117j04079j2577f1151B18735n6369p5008K77155r5811A21374J99824
12981C21198f8747H0740a24592k17439a02185E3144J35267A7370Q8814J11999
12971B18183l3917E167a71211g3240A07766d2064l7952j01977H9893j81c0328
12959f5968a2891j28528D18537o2573j73649L01999A63218K46351E0132i4686
12948B94511F573a8206r1354C54567h6141K1127C37344A47455E3576i974l8822
$$ y = [151827, 119218, 113601, 118417, 230955, 202988, 17516, 120097, 99962, -58302, 319439, -224394, 465467, 129310, 83573, 110715, 59658, -119615, -191325, 194790, 107578, 203453, 61780, 85958, 198793, 29889, 172571, 7669, 32424, 202729, -65010, -9451, 317560, 194649, 99411, 262528, 158449, 145872, -61151, 218735, 162366, 87358, 364513, 268702, 121374, 321198, -68747, 80740, -124592, -342031, -102185, 53144, 188411, 17370, 106184, 218183, 184266, 5167, -171211, -73240, 107766, -42064, -80016, -181993, 89893, 89712, -30328, -65968, -12891, -141419, 418537, 355964, 182315, 484314, 163218, 409569, 50132, -94686, 294511, 6573, -18206, -109560, 354567, -86141, -65014, 337344, 147455, 53576, -9974, -48796]
12937d8796C74984h5025I5430L7423q168g2912i766l3050q1538I6189c25418B44966
12924H0447R2898a20048A42107C6875R9343K5645c6990M559A3625a45350B04668
12912A85660J06416G4841l1900c8119n0272a5160k18365A10305f1386k66957M3826
12901b84517C4895a65036B26097D2612a62962A34254R1725a51709A32399Q7781
12891B20180A08923J4463a81809i311A69154p8885K48046A27621i1541A80919
12880g4758A40515b10753G7260L00866k3718J3257j49547G1999M9972n6390a46365
12868a2600E0442b35268O8846B51821h9558j02125A12164g827F3704a15277k5494
12857a40771e1658A78237C833b62605A75554h1008b6329m8231G6306J02788q1699
$$ y = [-48796, 374984, -85025, 95430, 132853, 124685, -72912, -9766, -42816, -124354, 96189, -325418, 244966, 80447, 173345, -120048, 142107, 36875, 136218, 161863, -36990, -32431, 13625, -145350, 204668, 185660, 292076, 74841, 42941, -38119, -88391, -15160, -233525, 110305, -61386, -328343, -284517, 34895, -165036, 226097, 42612, -162962, 134254, 225979, -151709, 132399, 220180, 108923, 123386, -181809, -9311, 169154, 90269, 338315, 127621, -91541, 180919, -74758, 140515, -210753, 77260, 378126, 354408, 367665, 218118, 71999, 121971, 65581, -146365, -12600, 50442, -235268, -166422, 251821, -89558, -191683, 112164, -7827, 63704, -115277, -140771, -51658, 178237, 3833, -262605, 175554, -81008, -26329, -74560, 76306, 179094, 97395]
12846I7395A2331O836a1738B69886n2899K30258c8014E0188L71611b80450e2905
12834C1659d7173I0515d8886B63286A22460i3264K2686A65407E5833K0893a1316
12822C31344H0079n367a14632A55893f6293r6602j28820f5444C99630b23296A45841
12810B61286a21664j48093B95801f3418B52318a02495B6133j0633g3131B71468
12799h1921p8366A64267A0558B006K86609a29986k07891A89532E6201B4526a36458
12787a92846B43147a02392A26825C3926J83016E828i6117j48671b3910A37659
12776a88558J5951H0616c1636j46021g5200J1710I4461L2718L9328a70341B90024
12764B39604d9485C8912a74309j81267J54928D1850a76396M0318H2477J80071
$$ y = [97395, 12331, 19167, -11738, 269886, 216987, 447245, -38014, 50188, 421799, -280450, -52905, 31659, -47173, 90515, -48886, 263286, 122460, -93264, -70578, 165407, 55833, 76726, -11316, 331344, 80079, 74712, -114632, 155893, -66293, -162895, -291715, -65444, 399630, -223296, 145841, 261286, -121664, -269757, 295801, -63418, 252318, -102495, 26133, 15500, -73131, 271468, -81921, -160287, 164267, 10558, 2006, 288615, -129986, -337877, 189532, 56201, 24526, -136458, -192846, 243147, -102392, 126825, 33926, 216942, 5828, -96117, -244788, -23910, 137659, -188558, -172607, 80616, -31636, -177657, -75200, -63490, 94461, 127179, 166507, -170341, 290024, 239604, -49485, 38912, -174309, -355576, -200648, 41850, -176396, -136078, 82477, 262548]
12754B62548a79445A05357J61011r5860b3771j3410A26471b17351f5691C23895
12743a31533A7471i3790A2373O6449a55469b4376p5328B2038K86014q1448k1630
12732B04974J63226B6319K44593A13013K49163j63348c8079H9126d7237H2320
12721F9723J22885M9263I2044J15944J40796d0980g425k62094c3626k1497q5135
12710a40258A66202J16878p4553r6931R247L01255J13909A35652c0922D20315
12699A84964f623j95979C87674F8341i2497E37798j78546j79497b2776j04899
12689a27675J1466j8087K8030j70998a1900A93435f9088H8443K2230J16152a67270
12677F2173L7852C3574J72819a04387b7715B96140L3483E5008M9576L7440J82216
$$ y = [262548, -179445, 105357, 266368, 170508, -23771, -37181, 126471, -217351, -65691, 323895, -131533, 17471, -93790, 12373, 78822, -155469, -24376, -99704, 22038, 308052, 226604, 204974, 368200, 26319, 270912, 113013, 362176, 198828, -38079, 89126, -47237, 82320, 69723, 192608, 241871, 92044, 207988, 348784, -40980, -7425, -269519, -33626, -55123, -140258, 166202, 283080, 208527, 111596, 120843, 422098, 536007, 135652, -30922, 420315, 184964, -6623, -202602, 387674, 68341, -92497, 537798, 359252, 179755, -22776, -127675, -116209, -134296, -106266, -277264, -11900, 193435, -69088, 88443, 110673, 226825, -167270, 62173, 100025, 33574, 206393, -104387, -27715, 296140, 329623, 55008, 104584, 142024, 324240]
12666C24240E1269d6393j75306L9467E663a15906G0523f1989A27192n089j1760
12655A10343Q1709P3851g4218A18595f000D10201K04769B09946J38765a00884
12644b37478A71953L4785C7746b3078I9742L01156h8874A2535N6671e0421C561
12632d3407H2231b58580F2258K49763K42788D3087K21195a07118B26022A8395
12621B27045P5429q5161a00789A07454a23978A49533p1873l4383Q6704a1242A53506
12609a15502d4488k88986C68R57b66198A47741J00084p7121E4738J68050o2996
12598A59792n4338b4827j54689k33422C6209c2448B05699a82743B34451L1661
12588B66112n2704b68516A14230c8722a6054B87465p3280L14583B64000A00184
$$ y = [324240, 51269, -46393, -221699, -182232, 5663, -115906, 70523, -61989, 127192, 122103, 110343, 192052, 265903, -74218, 118595, -6000, 410201, 614970, 209946, 348711, -100884, -237478, 171953, 206738, 37746, -23078, 99742, 400898, -88874, 12535, 69206, -50421, 3561, -43407, 82231, -258580, 62258, 312021, 554809, 43087, 264282, -107118, 226022, 18395, 227045, 302474, 217313, -100789, 107454, -123978, 149533, 77660, 43277, 129981, -11242, 153506, -115502, -44488, -333474, 368, 1325, -266198, 147741, 247825, 170704, 54738, 222788, 159792, 105454, -24827, -179516, -412938, 36209, -32448, 205699, -182743, 234451, 266112, 213408, -268516, 114230, -38722, -16054, 287465, 214185, 528768, 264000, 100184]
12577B0330J09681a4496j08397p49A01487b203j55530A21760O197E400J05495
12566A10895a74507A9575b01381i8641j11536p6010h7709c1680A34815N6727F0426
12554a14440A97831b07950A61565J04023e7544j3902H1695a04529L5190F9939
12543a56939E1708f3262m2519n0634A35361b18333c4887j21907E3913c1266E1927
12531C33359a48894E7961J26515G3463P3061C6882J78694b356A17046b5082C58228
12519b5034C68247I9837J03716h6628A09624Q4733j6541b48878I8538A5510N4244
12508F9754e288B01543l3104o7698a28613C10200H4417o374J28441A579O5398
12497F6977b74586E9922e0332k8310B82563f7350B50114i770j29816I3693J87845
$$ y = [20330, 130011, -14496, -122893, -123642, 101487, -2203, -157733, 121760, 127957, 5400, 110895, -174507, 19575, -201381, -98641, -210177, -286187, -87709, -31680, 134815, 191542, 60426, -114440, 197831, -207950, 161565, 265588, -57544, -71446, 81695, -104529, -69339, 69939, -156939, 51708, -63262, -105781, -156415, 135361, -218333, -34887, -156794, 53913, -31266, 51927, 333359, -148894, 57961, 184476, 73463, 146524, 36882, 215576, -2356, 117046, -25082, 358228, -25034, 368247, 99837, 203553, -86628, 109624, 194357, 177816, -248878, 98538, 15510, 69754, -5288, 201543, 168439, 100741, -128613, 310200, 84417, 78043, 206484, 1579, 66977, -274586, 59922, -50332, -78642, 282563, -67350, 250114, -9770, -139586, 93693, 281538]
12486B81538k8115I4332b16400n6018C46241c0213A05929B5925d5181E0469a13400
12474f7866A34759g322A68523o3820b12690c1617j14449B65777F8862L6612c05343
12462B7710b16164a08024k14A42811m7295a63454d7407I5751a24743Q968A59407
12450C6683j7412i782A88492f2506H8478c2680A47162M2196E8758J62903f4080
12438h2529B16465a26967C06996j6128a4343D7209a49030D3740c52776E4774b32864
12426F207J91910J89974A04984b8054A45739e6599K0735r0259A18104g2888F4526
12414C4282d6514l9412G2891J6811R6323c9248A15349P6237c2266G958a37564
12402b8593A24122d2409j51553B22359K0722j0639b28854D8983g7838A87040F6727
$$ y = [281538, 253423, 94332, -216400, -272418, 346241, -30213, 105929, 25925, -45181, 50469, -113400, -67866, 134759, -7322, 168523, 104703, -212690, -31617, -146066, 265777, 68862, 105474, -305343, 27710, -216164, -108024, -108238, 142811, 95516, -163454, -47407, 95751, -124743, -115775, 159407, 36683, 19271, -9782, 188492, -62506, 88478, -32680, 147162, 189358, 58758, 221661, -64080, -82529, 216465, -126967, 306996, 290868, -14343, 47209, -149030, 43740, -352776, 54774, -232864, 6207, 198117, 388091, 104984, -28054, 145739, -56599, -35864, -126123, 118104, -72888, 64526, 34282, -46514, -85926, 72891, 89702, 186025, -39248, 115349, 191586, -32266, 7958, -137564, -28593, 124122, -42409, -193962, 222359, 243081, 232442, -228854, 48983, -77838, 187040, 66727]
12390A7346e8875B8910L2809a76843G5899A2127h4024A59560a54290e6227m5517
12379a01744C2848c3052A27820a58061A75944l5635N7891H8949N6259a29124d0794
12367h4579G9083a25723d8912r2101a6899o9752j80301f3233A5226J71437g1833
12355d28064f8575J7637D3150J63398b05881I6980n080b65971E7547e8668C6779
12343A18004C6245a7222C44947A24363j3446b07155h5103C96637j54719a12269
12332b62716B1319K81866J0486A21687a05497A42993R0039h0698l6960a0087A49796
12320g3241A49788a88013M7602B09171n6861J35230A41480m5962K33151B9899
12309B34906q5931b05686I6238a71332B3663J07074d0714r2424B61201a33735
$$ y = [17346, -58875, 28910, 61719, -176843, 75899, 12127, -84024, 159560, -154290, -56227, -101744, 32848, -33052, 127820, -158061, 175944, 140309, 198200, 88949, 145208, -129124, -40794, -84579, 79083, -125723, -48912, -141013, -16899, -86651, -266952, -63233, 15226, 186663, -71833, -428064, -68575, -50938, 43150, 206548, -205881, 96980, 91900, -265971, 57547, -58668, 36779, 118004, 36245, -17222, 344947, 124363, 110917, -207155, -85103, 396637, 241918, -112269, -262716, 21319, 303185, 313671, 121687, -105497, 142993, 233032, -80698, -117658, -10087, 149796, -73241, 149788, -188013, -140411, 209171, 152310, 287540, 141480, 95518, 328669, 29899, 234906, 148975, -205686, 96238, -171332, 23663, 130737, -40714, -133138, 261201, -133735]
12298b04667D80042a06232A48537J06893a08151A98947a42852H1053J53175a75229
12287E3491K39949a12260A86870i0898B50281F5517M2544e4715B60986a13216
12276A14822P2689J53814A41389J13813E3878b05018B62144c88j39020B42338
12265H4543b8217m2252m0492A29558a8948B76314a51920B0856h7885b2239H190
12253D2309L1433b45594A83693B3316b04859C13266H9390J30020a06504K2566
12243h3938A71811a89070A80533J53278P3794I8604m8927Q5804J9334P6521J75934
12232D07270A2933K72672I2319J34791J96451A93712B0671R5751K68349n9917
12222C24854P3436b4269D08042A35980B1085O8829K59357o7953r8391k9895J08778
$$ y = [-204667, 480042, -106232, 148537, 255430, -108151, 198947, -142852, 81053, 234228, -175229, 53491, 293440, -112260, 186870, -90898, 250281, 65517, 108061, -54715, 260986, -113216, 114822, 187511, 341325, 141389, 255202, 53878, -205018, 262144, -388, -139408, 242338, 84543, -28217, -70469, -110961, 129558, -18948, 276314, -151920, 20856, -87885, -22239, 8190, 42309, 73742, -245594, 183693, 23316, -204859, 313266, 89390, 219410, -106504, -83938, 171811, -189070, 180533, 333811, 407605, 98604, 49677, 135481, 154815, 231336, 407270, 12933, 285605, 92319, 227110, 423561, 193712, 20671, 116422, 384771, 324854, 398290, -24269, 408042, 135980, 21085, 89914, 349271, 281318, 182927, 153032, 261810]
12211B61810e2205j15544B60487A20751J45194a2386q8184A62125J18702j23751
12201A57076J50079H7721c6575E78699a44103F09685a97985D00759A68117M6497
12191B14614K3004j17359m9465e4066A43433J5131C7914F202K56408E6159j367
12180E4792J76629J1683q4502C2486c3782A28573C1032K23142j18383K33151a73222
12168A20862a397B00771G2090P3994C2573a47650M7678B17659b14499a7908C26774
12156f9712B79953C3692J5596J37244b46579B62820F2754J55447p1264n8865J80307
12145B68379K5014j12363R1381I0792J1430J6639b0605A7482Q4379c3497m3643
12134g7140A27895N7991I1929b03156A31626c42C60057E9438J7670J81790D2373
$$ y = [261810, -52205, -167749, 260487, 120751, 265945, -12386, -100570, 162125, 280827, 157076, 307155, 87721, -36575, 578699, -144103, 609685, -197985, 400759, 168117, 214614, 237618, 120259, 70794, -54066, 143433, 158564, 37914, 6202, 262610, 56159, 54792, 231421, 243104, 158602, 32486, -33782, 128573, 31032, 254174, 135791, 368942, -173222, 120862, -1397, 200771, 72090, 146084, 32573, -147650, -99972, 217659, -214499, -17908, 326774, -69712, 279953, 33692, 49288, 186532, -246579, 262820, 62754, 218201, 146937, 88072, 268379, 293393, 181030, 272411, 90792, 102222, 118861, -20605, 17482, 101861, -33497, -77140, 127895, 185886, 91929, -203156, 131626, -342, 360057, 59438, 77108, 258898, 42373]
12122i3110c7772D85710B17732C3643b39948R2930B42207l2516B8358b4180E0968
12110b29322A00539K97246f8905r776j46026A4239J37416a71413G789c75720C3396
12098a59901M5629I8214f9558j38650A27494k2582a98305B6837a12018G3321a65286
12086A12374j4392A3041e3948l04J582B17967j06702M65513N03438Q48324D58446
12074C37835b9470a4595B25120r6082D0221c3972o2532H5843a82739B0877l469
12063A7408c1544j89899J03454c9087o1054a7430E4566c0822M472B69066o998
12052B62068A4717h5993G5535C2716L3615L6135d7392A10397c26209A45010e5516
12040E8804F392a42306j5911M1002F3682R7785J39780I0596O0787a31433I451
$$ y = [-93110, -37772, 485710, 217732, 33643, -239948, -147018, 242207, 209691, 28358, -24180, 50968, -229322, 100539, 397785, -68905, -78681, -224707, 14239, 151655, -171413, 7789, -375720, 33396, -159901, -114272, 98214, -69558, -208208, 127494, 104912, -198305, 26837, -112018, 73321, -165286, 112374, 97982, 13041, -53948, -54252, -52670, 217967, 111265, 576778, 1080216, 1928540, 458446, 337835, -29470, -14595, 225120, 129038, 40221, -33972, -96504, 85843, -182739, 20877, 17408, -31544, -221443, -117989, -39087, -100141, -17430, 54566, -30822, -26350, 269066, 262068, 14717, -85993, 75535, 32716, 66331, 102466, -47392, 110397, -326209, 145010, -55516, 58804, 6392, -142306, -158217, -117215, 63682, 161467, 301247, 90596, 151383, -131433, 9451]
12028a2575j38640A72435B9299d8404F7865J10678e8454F8532a24870b3827m40535
12017d64362b08081f2464j3223A890J51213m3846A4065b59812C3315a78954P5967
12006a02987B11176I7976h1966q8219b8729A50003a50461B13022r7555a18432
11995A07826J06388H2501f2992j7527k05372k73363d5249B98K22294l9054a4444
11983I5409J34445D3871a54145A29784Q0017a22342G6501j3610l0918a38260B89994
11971a11355I7331B4274h9040A43872c1593A69267d1589j50119M2284f5330j1986
11960g7316F6462d375j10421C02486A03241N9790a80745c5073C3872a65567c4683
11948A37155b66844A93765C9829L9338a54765p0930i2088j7551j60720B40332
$$ y = [-12575, -151215, 172435, 29299, -48404, 67865, 178543, -58454, 68532, -124870, -23827, -464362, -208081, -62464, -75687, 1890, 153103, 109257, 14065, -259812, 33315, -178954, -102987, 211176, 97976, -81966, -170185, -28729, 150003, -150461, 213022, 115467, -118432, 107826, 214214, 82501, -62992, -80519, -285891, -559254, -45249, 298, 222592, 183538, -14444, 95409, 229854, 43871, -154145, 129784, 209801, -122342, 76501, 62891, 31973, -138260, 289994, -111355, 97331, 24274, -89040, 143872, -31593, 169267, -41589, -191708, -149424, -65330, -77316, 66462, -4375, -114796, 302486, 103241, 163031, -180745, -35073, 33872, -165567, -34683, 137155, -266844, 193765, 39829, 79167, -154765, -225695, -92088, -109639, -270359, 240332]
11937B823J70812g0754A57963a79184g4914j77595R3214b3193p3939j76548C85083
11925a57092L9377n7911O7102b2377o7988j49933c6187A46829b83632a9799A84822
11913C4763b23454A90734D7874c14567B02228I0815a73242o7049D7086O5842j9161
11902I3767J38406l2381d1338B61719n8758F2554I458J38790n3965H036K34617
11891B42653o5437q906e4213r6210e9399A67207D3797M3013a13014o6471k7988
11880b07473B09262J17429a270B04316a71948k46690G3536Q453f989B2271a89171
11868c043E5956J02754p9204i4979A09895a19175m1140O9931I7967i861C8458
11856g7888l5241M0891C45250a48287L516A84704b313q4796B75922j05969i4849
$$ y = [2823, 173635, -70754, 157963, -179184, -74914, -252509, -159295, -23193, -97132, -273680, 385083, -157092, -117715, -175626, -108524, -22377, -90365, -240298, -36187, 146829, -283632, -19799, 184822, 34763, -223454, 190734, 47874, -314567, 202228, 90815, -173242, -240291, 47086, 112928, 93767, 232173, 199792, -41338, 261719, 202961, 62554, 9458, 148248, 94283, 8036, 242653, 177216, 168310, -54213, -150423, -59399, 167207, 43797, 86810, -113014, -179485, -207473, 209262, 326691, -1270, 204316, -171948, -418638, 73536, 81989, -6989, 22271, -189171, -3043, 55956, 158710, 79506, -94979, 109895, -119175, -160315, -90384, 97967, -9861, 38458, -77888, -113129, -72238, 345250, -148287, -144771, 184704, -2313, -87109, 275922, 169953, -94849]
11844C07751f2670A55639b70433a135j27534k5270e9251j50882P5544A34233a98397
11832e3935j64684F1317a44072A15749A6893c68070f2816p1644d8449A44900c211
11820A37329b20054i3841A55236b17688A798L4466L66844b53218I844a13640m9203
11809a62843j94832C89030A19295a93258B14051F3138i2892B98407D8257D759
11798b24085A09919f47l7069D86897B552K41828a0445B89481a78912A87848G5936
11786b93576A05822B3392i4302a3640j48017N00D21814H7955d1285p2845C70541
11774E5022J685a78536B36494q8188A0430b7478F2207e309q756p3835B25687a41130
11761A23673l9987K45940f0702B2517J68863c2360A03092g3097L4681j97901j42329
$$ y = [307751, -62670, 155639, -270433, -1135, -128669, -153939, -59251, -210133, -134589, 134233, -198397, -53935, -218619, 61317, -144072, 115749, 16893, -368070, -62816, -134460, -48449, 144900, -3211, 137329, -220054, -93841, 155236, -217688, 1798, 36264, 403108, -253218, 9844, -113640, -162843, -357675, 389030, 119295, -193258, 214051, 63138, -92892, 298407, 48257, 4759, -224085, 109919, -647, -37716, 486897, 2552, 244380, -10445, 289481, -178912, 187848, 75936, -293576, 105822, 23392, -94302, -13640, -161657, -161157, 421814, 87955, -41285, -114130, 370541, 55022, 56707, -178536, 236494, 148306, 10430, -27478, 62207, -5309, -14065, -87900, 225687, -141130, 123673, 83686, 329626, -60702, 22517, 191380, -32360, 103092, -73097, -38416, -236317, -378646]
11750c78646f2717B17680A0599b5912j77247c4188F4301a89894F4024c07439E9072
11738a99186O8715C5110c48813G3254b70955O2331H7982L3395a04370k07211a15975
11726D16930a22832E4992J27295c8860D0150q964M71719a16336F5026j3776J27578
11715A78828k0323D6576J55929r7182A4482K9629L2862Q2273G9260J39634l1931
11704A86963k2574i1751p0478E4499b36103q6433A99054c7913C28499H3902J57658
11693B41560a65403F2972a29387E1071M4829J92011a80988h9600B4376b31822
11682g617p1083a3940F0743j9918d2990B30336c2462d982j90378C30856A31506
11670a8255A88477D4642O4604i103H2784K82026b8397B4808N275K45358a80449
$$ y = [-378646, -62717, 217680, 10599, -25912, -203159, -34188, 64301, -189894, 64024, -307439, 59072, -199186, -130471, 35110, -348813, 73254, -270955, -208624, 87982, 121377, -104370, -311581, -115975, 416930, -122832, 54992, 182287, -38860, 40150, 31186, 502905, -116336, 65026, 51250, 178828, 158505, 46576, 202505, 105323, 14482, 44111, 76973, 159246, 79260, 218894, 186963, 164389, -91751, -162229, 54499, -236103, -322536, 199054, -37913, 328499, 83902, 241560, -165403, 62972, -129387, 51071, 95900, 287911, -180988, -89600, 24376, -231822, -7617, -78700, -13940, 60743, 40825, -42990, 230336, -32462, -4982, -195360, 330856, 131506, -18255, 188477, 44642, 109246, -9103, 82784, 364810, -28397, 24808, 30083, 275441, -180449]
11658D9930a50942A17179M51020B69261a3772p6282f275I818K52637j24456K345
11647A40344b15178A17255g5178G5600J3013Q6879g4257g106B96443j28509L4923
11636B02857a99426G9799A8408L853J33191i2733I4795N4198f6569A05510B2945
11624A923i3561B98949j12205a5254q7625B05729q5165J52025a47196G8664j4581
11613F4083c40941O8589B91560A09541K99660F3029L05915E2622K52845q6309
11603B19158f6056j39479H1343Q3442J17668p9988G7219a00391M8127E5215e5560
11591a61067e2616D6902a54728A22948a22942a1677A47652C6473R5476N5923c6640
11579b97848A70534d7003D2772P0646P3030d012B38286j16148J81143L429f6443
$$ y = [49930, -150942, 117179, 568199, 269261, -13772, -90054, -6275, 9818, 262455, 137999, 140344, -215178, 117255, -75178, 75600, 88613, 175492, -74257, -7106, 296443, 167934, 202857, -199426, 79799, 18408, 22261, 155452, -92733, 94795, 148993, -66569, 105510, 22945, 1923, -93561, 298949, 186744, -15254, -102879, 205729, 120564, 272589, -147196, 78664, 64083, -340941, -272352, 291560, 109541, 409201, 63029, 368944, 52622, 305467, 219158, -66056, -205535, 81343, 164785, 282453, 202465, 77219, -100391, -52264, 55215, -55560, -161067, -52616, 46902, -154728, 122948, -122942, -11677, 147652, 36473, 131949, 187872, -36640, -297848, 170534, -47003, 42772, 113418, 186448, -4012, 238286, 122138, 303281, 306710, -66443]
11567A72945B5159h6511A01083j349L63931A48987c1093R820B81083j38179K1552
11556A64456a3007D06574D1942M00301B19761K07252b42632F9242c0189H8214
11545c4600A87283c3234C13561E0063b21302b7022k2641A60302E2311g381A7522
11533A75536N0887c80342J73349e2615k2681j69909A18653l7226J79163l9509
11523B21081b9190B53009L7912a13631E1292L112h2835K9099D23544E6691O7337
11512A24028d1785A45444r607M689c3596G7917a28895l9162G2409j4938Q0425
11501A37896b8237m3295B45044C8731R5710F1457K6587N762b58742B2742a48104
11489C24679a39425K5202B48460q6007K94198a74647K8932A17246a2991j21678
$$ y = [172945, 25159, -86511, 101083, 99734, 463665, 148987, -31093, -21273, 281083, 142904, 164456, -13007, 406574, 41942, 442243, 219761, 427013, -242632, 69242, -30189, 88214, -34600, 187283, -33234, 313561, 50063, -221302, -27022, -49663, 160302, 52311, -7381, 17522, 175536, 226423, -380342, -206993, -52615, -75296, -245205, 118653, 81427, 260590, 221081, -29190, 253009, 290921, -113631, 51292, 54404, -82835, -53736, 423544, 56691, 124028, -41785, 145444, 135837, 140526, -33596, 77917, -128895, -168057, 72409, 57471, 137896, -28237, -71532, 245044, 38731, 134441, 61457, 88044, 93806, -258742, 22742, -148104, 324679, -139425, -114223, 248460, 162453, 456651, -174647, -145715, 117246, -12991, -134669]
11479a34669I1952e3914C0513M71677D6178L5116Q0680K24715G4490O1886J86987
11468C23363R8854A85785l5826a66302e2138C48030a28556A66381M2172k0596
11458A87957l8426l4856M1400P8020l7032B2817a57175A28115k9740i2302B8420
11446I811J48516C9451J5144K10975M3771q8552K42362a24802l41538F2556b08444
11434a99090I738K22578j5290r2563d936p9883G4721f1654l13495N9633G0040
11422B10530R6253a87440A69466a50160M2363j1560A18022B6181L11930J6327
11412C54438a30956D38621A50617c40547A47251a89660B20720A00555N5082K9501
11402A85138C8758J86064a83850c6090C63173I5006b21452M679r7744A90137p4071
$$ y = [-134669, 91952, -53914, 30513, 502190, 46178, 81294, 161974, 386689, 74490, 136376, 323363, 422217, 185785, 149959, -166302, -52138, 348030, -128556, 166381, 208553, 187957, 149531, 114675, 156075, 234095, 197063, 22817, -157175, 128115, 98375, -92302, 28420, 9811, 158327, 39451, 54595, 265570, 309341, 220789, 463151, -124802, -466340, 62556, -208444, -199090, 9738, 232316, 217026, 124463, -4936, -84819, 74721, -61654, -375149, -315516, 70040, 210530, 306783, -187440, 169466, -150160, -107797, -119357, 118022, 26181, 338111, 354438, -130956, 438621, 150617, -340547, 147251, -189660, 220720, 100555, 155637, 185138, 38758, 224822, -183850, -36090, 363173, 95006, -221452, -216773, -314517, 190137, 116066]
11391A16066L77347A75636a32709F0902k9396c00482G8274a14770l924c8593q0573
11380a19166D6751i1527B8643e9296B43260b39753A48273J98377a35616d2327
11369F8084a87521E6962e9862k02975C31597j600c6863B1058L80111a68528A01261
11357d5379D2741d6221F4899c779I018b76798O8391B53035r9749D1545a85611
11345B28175N1589f4300j64411A56923d1113N49A9779G680b9816j01054j94856
11334c25726d7682A18671l8700g5378k9719c4182j83258c5186A74888A4579b05613
11322e01003c5840B41863C1236b43371A12441a78578B19277M0692b91383B34485
11311E6441a53281F1340i4592D44038c56254F3629j5253a01276B10057B1558g7904
$$ y = [116066, 493413, 175636, -132709, 60902, 31506, -300482, 78274, -114770, -118694, -38593, -119166, 46751, -91527, 28643, -59296, 243260, -239753, 148273, 346650, -135616, -42327, 68084, -187521, 56962, -59862, -262837, 331597, 329997, -36863, 21058, 401169, -168528, 101261, -45379, 42741, -46221, 64899, -3779, 9018, -276798, -208407, 253035, 153286, 41545, -185611, 228175, 279764, -64300, -228711, 156923, -41113, -40564, 19779, 7680, -29816, -130870, -325726, -47682, 118671, 79971, -75378, -105097, -34182, -217440, -35186, 174888, 14579, -205613, -501003, -35840, 241863, 31236, -243371, 112441, -178578, 219277, 259969, -291383, 234485, 56441, -153281, 61340, -94592, 444038, -356254, 63629, 48376, -101276, 210057, 21558, -77904]
11299a55441H6792J48475c2018E9151j1421j6803a15807B4868N0699N5408f3969
11287B23143c3593r8606J4929k69581i245A49329a58170j86604H7889J98212p7381
11276B08720a28524j33040K957F3981A6889g3163A32581K52000a03012j36516
11266b39528K7177Q5248B31151J24649i7736j19820h4127A31132f6471m8676K303
11255a12844o2660I707J44919F5725a95996L9762f0950A73843N5840C7418J15158
11244A52576J28993c48142a13534B3468l067J51263a62859j45716G2873C6345
11233a11448K541A93328A9742a0282l7037m0055q7503F3627j5389K9132b15284
11221B25591a72732g6444k1285A94320j7781b49002A09950b32758B7230a01151
$$ y = [-155441, 86792, 235267, -32018, 59151, 47730, 30927, -115807, 24868, 75567, 130975, -63969, 223143, -33593, -132199, -117270, -386851, -9245, 149329, -158170, -344774, 87889, 286101, 208720, -128524, -261564, -258607, 63981, 16889, -73163, 132581, 384581, -103012, -239528, -212351, -127103, 231151, 355800, -97736, -217556, -84127, 131132, -66471, -115147, -112844, -175504, 9707, 154626, 65725, -195996, -156234, -60950, 173843, 229683, 37418, 152576, 281569, -348142, -113534, 23468, 20401, 171664, -162859, -308575, 72873, 36345, -111448, -108907, 193328, 19742, -10282, -47319, -87374, -174877, 63627, 48238, 77370, -215284, 225591, -172732, -76444, -97729, 194320, 176539, -249002, 109950, -232758, 27230, -101151]
11210b25472A5379a86844B5820b8385j59704B42323o4603P6283a30479j90608
11200c21087A37587b52145g9644A54544b05528A72797n0738c8021C62807j34512
11190B28295c44279B72634C7452M803A1369J29740a9180A20427b17342B52550
11179A94815k9942p2432b56024G4623h2801o7473A41604J92889A9105M2666a5857
11167c80088h1432j38298C5037K07477b71110A76779b17574F5580c35042J7037
11157c18005a50164e9135j04524J5638B19989b80022a2765a453I9620a73218D854
11145a8314B53915o638c40612d5192H6055J03018a28145A4215a59288h39j92712
11134a93551H0470N6300K24352j34675N6641A31987B3599d6110n8127B94184r5005
$$ y = [-225472, 15379, -186844, 25820, -28385, -188089, 242323, 177720, 254003, -130479, -321087, 137587, -252145, -79644, 154544, -205528, 172797, 122059, -38021, 362807, 228295, -344279, 272634, 37452, 42255, 11369, 141109, -19180, 120427, -217342, 252550, 194815, 164873, 92441, -256024, 74623, -82801, -150274, 141604, 334493, 19105, 61771, -15857, -380088, -81432, -219730, 35037, 242514, -271110, 176779, -217574, 65580, -335042, -318005, -150164, -59135, -163659, -148021, 219989, -280022, -12765, -1453, 99620, -173218, 4854, -18314, 253915, 247277, -340612, -45192, 86055, 189073, -128145, 14215, -159288, -839, -193551, 80470, 136770, 361122, 226447, 283088, 131987, 23599, -46110, -104237, 294184, 199179]
11123A99179O9051A2809a94945A96661a73058l0406R9921m0891A58356Q4227j1510
11112B31073h4368J7527E2707K76476n2846a37502g544q8454o8511C82965A75112
11100I3723Q7136J80668r6948N716J00171A31558j9574J41966A20395P6650h4419
11088B06639l7732R4618R6574A28570e2284B54282C4023L16688O2034j09386P507
11077C10866a69139F5800K11132a11424D93107j37668A53650g9456C26924m4392
11067B82532o0610K75158j14725j03096J28924K41956B73211k4033J32873k3625
11057C58426K01916M6580k4750j84892K17343j53338n4613K41747j66180M26569
11047I08808l55101J44017L9766k46303k8670R9686K76397m1101j98578J29309
$$ y = [199179, 268230, 12809, -194945, 196661, -173058, -203464, -103543, -144434, 158356, 242583, 231073, -84368, -66841, 52707, 329183, 276337, -137502, -7544, -95998, -164509, 382965, 175112, 93723, 180859, 361527, 264579, 270295, 370466, 131558, 111984, 253950, 120395, 197045, -84419, 206639, 168907, 263525, 360099, 128570, -52284, 254282, 34023, 350711, 412745, 303359, 310866, -169139, 65800, 276932, -111424, 493107, 355439, 153650, -79456, 326924, 282532, 221922, 497080, 382355, 279259, 408183, 650139, 273211, 249178, 382051, 358426, 560342, 606922, 582172, 397280, 614623, 461285, 406672, 648419, 482239, 908808, 553707, 697724, 737490, 491187, 462517, 562203, 838600, 797499, 598921, 728230]
11037G28230p7728j9577J46350n0875j42100r7461Q4027q9300n7376l1937J74796
11026E67049J54308K66787D20571K92364J1879k97858o85J25739p5000k364J63233
11015F37879K4574O8310j58824j13774J45437j116J26326i3751E62806B64612
11004B97005p9400K03911j17881K61019j03656K82460K50444l66807k66923M72823
10994H32995C11445K28670J64777l24023P5508J72264q3887K33765M2147Q7606
10984I08272N758J68932l10995J00089L14786j01787O8927J34818M06162K12541
10974A907503J3592M7372L64583J94729P461m2573o24872P1924M671k45266k28504
10963A470620j94078L9415j64526L96148q7935K66202j54255r7931k65898J77368
$$ y = [728230, 650502, 630925, 777275, 726400, 584300, 486839, 570866, 481566, 424190, 392253, 567049, 721357, 988144, 420571, 712935, 724814, 426956, 426271, 552010, 477010, 474646, 637879, 662453, 730763, 571939, 458165, 603602, 602486, 728812, -93751, 562806, 264612, 297005, 217605, 421516, 303635, 564654, 460998, 743458, 993902, 627095, 360172, 832995, 311445, 540115, 704892, 380869, 456377, 628641, 544754, 778519, 820666, 908272, 914030, 1082962, 771967, 872056, 1186842, 1085055, 1153982, 1288800, 1694962, 1907503, 1921095, 1968467, 2333050, 2527779, 2535240, 2492667, 1867795, 1939719, 1944390, 1699124, 1470620, 1276542, 1315957, 1151431, 1547579, 1459644, 1725846, 1571591, 1473660, 1207762, 1385130]
10953A385130k38705k34811Q9552k20104m7163l27578Q0480J87062J5177C16840
10942B14917L47781l6783C447N91691j50269A62617a01302B90259j03991P5570
10932B61838q1263m1616L3821J033o1715D8586K74121A13906J55241e5846G6809
10920g1167G8553a0577A39251g1125B00679a28266D3629J950c4395j74024a5735
10908a55203f7085l22068B17112d88425d1258n806o8599B35256n884H3586a82780
10896c38059g2619K4598C5286f8786K0318G0603a19838F8435K88047a45898B68666
10884D7390b08369I8517b75102H6237f7013o5033C378f626C39601A11776f1409
10872f8709G2937a98815C07814b11000A43734e3985B68129H7514R7638n9718f8056
$$ y = [1385130, 1146425, 911614, 1001166, 781062, 733899, 406321, 486801, 673863, 689040, 316840, 214917, 562698, 525915, 3447, 595138, 444869, 162617, -101302, 290259, 186268, 261838, 180575, 138959, 172780, 173813, 112098, 48586, 322707, 113906, 269147, -55846, 76809, -71167, 78553, -10577, 139251, -71125, 200679, -128266, 43629, 45579, -34395, -208419, -15735, -155203, -67085, -389153, 217112, -488425, -41258, -47064, -115663, 235256, 229372, 83586, -182780, -338059, -72619, -48021, 35286, -68786, -48468, 70603, -119838, 68435, 356482, -145898, 268666, 47390, -208369, 98517, -275102, 86237, -67013, -132046, 3378, -6626, 339601, 111776, -61409, -68709, 72937, -198815, 307814, -211000, 143734, -53985, 268129, 87514, 185152, 125434, -68056]
10860H7445J1307K97090e0399A74235b3163m2802C0178K5839J06967c0824j70991
10849b01815E3132a36715B93681c9918I2483a69106J4969N9815b3809A08759h6458
10837a86516H1201l663J51462a36415f4866c0968o0129c0243J2674r347k27991
10826b54907E2752a31086l4188K2927A9851a97439h525j05167C6078L3896N7530
10815A27504k5232h1077G7665c26382B74017a13172B0984a12724B9749g2076D0897
10803b9193A65344F1005J57753n8122F31i2489B77370G2276B105a700j13638E4801
10790F66J1531a99185l6096r926F6065b45937j3662D5610a78816j72684D7420
10778c9176B26847o7299h5954a3080B77081a47131O6614j95874a23744h461o6844
$$ y = [87445, 98752, 395842, -50399, 174235, -23163, -65965, 30178, 56017, 162984, -30824, -201815, 53132, -136715, 293681, -39918, 92483, -169106, -154137, -94322, -23809, 108759, -86458, -186516, 81201, 77538, 229000, -136415, -64866, -30968, -91097, -30243, -17569, -26916, -254907, 52752, -131086, -165274, -142347, 19851, -197439, -8525, -113692, 36078, 69974, 127504, 102272, -81077, 77665, -326382, 274017, -113172, 20984, -112724, 29749, -72076, 40897, -29193, 165344, 61005, 218758, 160636, 631, -92489, 277370, 72276, 2105, -1700, -115338, 54801, 666, 12197, -199185, -235281, -245207, 66065, -245937, -259599, 45610, -178816, -351500, 47420, -39176, 226847, 159548, -85954, -13080, 277081, -147131, -80517, -276391, -123744, -8461, -75305]
10767g5305j6887L8119j56800a6466j20440E4461J0491d5953l64432A58355a01329
10755d50729F6g6876L6205a1658k8879n6667k52053J05723a3867m8789r7409M134
10743a55931A45621a86426A43786e3055k4943E7735J63538D416L45503a53812
10732g6000K1428B1612b14827b7956l37769h1968K611A29741b79430F2218K07394
10721B69612a25723N5353l38887d2897k7182A6864a54598j79698C48612a30434
10710C1963d1913B29443b4802A0160c4397l33122a04438C42962b10234h2520H0285
10698f3586j32156j8883A04162K71276c29436a09861A10968a30585k02761B08674
10687B1697a46311A73786K0858b91333C38177B5157J57453a5577n1242A25914
$$ y = [-75305, -92192, -54073, -210873, -16466, -136906, 54461, 64952, -45953, -410385, 158355, -101329, -450729, 66, -76876, -40671, -11658, -40537, -97204, -349257, -243534, -13867, -62656, -160065, -155931, 145621, -186426, 143786, -53055, -77998, 57735, 221273, 4416, 349919, -153812, -76000, -54572, 21612, -214827, -27956, -365725, -81968, -79357, 129741, -279430, 62218, 269612, -125723, -70370, -409257, -42897, -70079, 16864, -154598, -334296, 348612, -130434, 31963, -41913, 229443, -24802, 10160, -34397, -367519, -104438, 342962, -210234, -82520, 80285, -63586, -195742, -214625, 104162, 375438, -329436, -109861, 110968, -130585, -333346, 208674, 21697, -146311, 173786, 194644, -291333, 338177, 25157, 182610, -15577, -66819, 125914]
10676A56873M158D262A545Q5747P0420b31679e1337r3125B4857J70861E7868b64927
10663d3900H640b71514k6427G3864P0955a20370j68815a02803G0640A472d1480
10651a68466d500A5918J63613C121a38796E324c4320o0130M821q4701a1162l7903
10639d9065j11455l3804B7717a72909B07300b18550c7116a1200C7955g7637K9129
10628d8508A12293a39543p5359A14626a42530A29406a59055e8517a7893k79856
10618b97749B76923a37458a5219A72232G9674c6077I7435E307P8913g5109b7630
10606a04519J5741r5073P7192G5560j7872A7904e8628A9998M4186h445A96667
10594c68922d5066m0789D07771j98780e8023B2003b00994k4852c0671q9726r9630
$$ y = [156873, 161031, 4262, 1545, 87292, 157712, -231679, -51337, -144462, 24857, 195718, 57868, -264927, -43900, 8640, -271514, -297941, 73864, 144819, -120370, -289185, -102803, 70640, 1472, -41480, -168466, -4500, 15918, 179531, 3121, -138796, 5324, -34320, -94450, -89629, -174330, -11162, -49065, -160520, -194324, 27717, -172909, 207300, -218550, -37116, -11200, 37955, -77637, -48508, 112293, -139543, -214902, 114626, -142530, 129406, -159055, -58517, -17893, -297749, 276923, -137458, -15219, 172232, 79674, -36077, 97435, 5307, 84220, -75109, -27630, -104519, -88778, -183851, -106659, 75560, 57688, 17904, -58628, 19998, 64184, -8445, 196667, -368922, -45066, -85855, 407771, 208991, -58023, 22003, -200994, -225846, -30671, -120397, -220027]
10583b20027D4094f9359k08779f9573m9324m1833d3182o9482a6382A27406O1143
10572A88549N3869b07598A16645d953j92579B25809J6288h4106A65484a32759
10561A03896b07262K9470B01961b68089B25762k5686C5539a84560H1167a0599
10550E4310J48380g5809D9387b75029d4547j31988p9394F6199i228q2734j57660
10539b49622b2328M45I9658A4967c41317a43389E3651K06075f666A40187a8740
10527a03535j49291d8644A65687m745a5059A53604c40389A54927a74908F9654
10516C24066L1716J9754a78865B3764c08203d106l19141A22175a55196E5685a43833
10504A12805b72864C3455b97825A74164c66219D3678g9767j6787D51845r2476
$$ y = [-220027, 44094, -69359, -278138, -69573, -118897, -160730, -43182, -112664, -16382, 127406, 188549, 242418, -207598, 116645, -4953, -197532, 225809, 242097, -84106, 165484, -132759, 103896, -207262, -177792, 201961, -268089, 225762, 200076, 35539, -184560, 81167, -10599, 54310, 202690, -75809, 49387, -275029, -44547, -176535, -255929, 66199, -9228, -91962, -249622, -22328, -21883, 99658, 14967, -341317, -143389, 53651, 259726, -6666, 140187, -18740, -103535, -252826, -48644, 165687, 160942, -15059, 153604, -340389, 154927, -174908, 69654, 324066, 355782, 375536, -178865, 23764, -308203, -4106, -323247, 122175, -155196, 55685, -143833, 112805, -272864, 33455, -297825, 174164, -366219, 43678, -79767, -96554, 451845, 359369]
10494C59369A48819l8711E3699h0137A16939g4426O599C81645E7402b1104A44191
10482e9402D2163b570C35541J17469O1583F2342Q809J38666K12I1366k9182l0441
10470C1743J88286a53491a4632O936j55189c7890C6275K18680E0191A7078J42460
10459A59538b17109f6297a9466P120j20862B04199G442a56939N0100o556b2412
10447a30467B33138g0233j5916j07216A10316B8540a96968G0365a49827b6282
10436d9502j09265D670L2912J65800i401C8187c08116H3502h0743B0553P7517
10425I8070a43035j51238A79352n1856b9761e480A37429J92390c6863l1346l6042
10414a04251N0828A47612a69110A12629j2266J7844e0234j01921A66012a7865
$$ y = [359369, 148819, 110108, 53699, -80137, 116939, -74426, -67827, 381645, 57402, -21104, 144191, -59402, 42163, -2570, 335541, 453010, 514593, 62342, 71151, 209817, 210029, 91366, 62184, 31743, 220029, -153491, -14632, -7696, -162885, -37890, 36275, 254955, 50191, 17078, 159538, -217109, -66297, -19466, -12346, -133208, 204199, 7442, -156939, -106839, -113395, -22412, -130467, 233138, -70233, -86149, -193365, 110316, 28540, -196968, 70365, -149827, -26282, -49502, -158767, 4670, 37582, 203382, -9401, 38187, -308116, 83502, -80743, 20553, 98070, -143035, -294273, 179352, 127496, -29761, -5480, 137429, 329819, -36863, -68209, -104251, -53423, 147612, -169110, 112629, 100363, 118207, -50234, -152155, 166012, -17865]
10403a95221A88682a37850A12452b79901i7118H2363a55356p1974f3558Jk44803
10392c08360A99804J72373G6330N0408M7504c47779a31271G5970g3287D6569R5638
10381A42207J8831J9368f5506A80846o073E1266a07968C12740n016Q8908j23133
10370B73499l2832L70434m8894C0319J61813L126J84450N1396r4561F6930K19439
10359B86369i8511G8139K25194J3498A5606a5601B51959A14991M30214K4003B08775
10347C80815A89823M3099p1697C2322J96007N7339A25544J98736c7440H20L58871
10336C59691j25255K68115D0729f0864B2516o186K32624a22579A51436J8697C0694
10324A26286j126L21562q2443A73140J40804b63793C60554g2186m8951J8795H5219
$$ y = [-195221, 188682, -137850, 112452, -279901, -97118, 82363, -155356, -227330, -63558, -63557, -308360, 199804, 372177, 76330, 126738, 174242, -347779, -131271, 75970, -73287, 46569, 142207, 161038, 180406, -65506, 180846, 174773, 51266, -107968, 312740, 307724, 396632, 273499, 240667, 611101, 562207, 30319, 192132, 195258, 379708, 431104, 336543, 66930, 286369, -98511, 78139, 303333, 316831, 15606, -15601, 251959, 114991, 545205, 569208, 208775, 380815, 189823, 232922, 161225, 32322, 228329, 285668, 125544, 324280, -37440, 820, 359691, 234436, 502551, 40729, -60864, 22516, 16330, 248954, -122579, 151436, 170133, 30694, 126286, 125160, 446722, 364279, 173140, 313944, -263793, 360554, -72186, -121137, -102342, 85219]
10312A27089b49862J01889a9804A04138J06426A01505l6457e950j64518P468A24894
10300I6312K516P6295j8864o732B0894Q9046R990i6289j70355A97205e523o0204
10288f5727K500b8189B25278j5502A1858a13666e2769o0535D7567f6918j16837
10277a83755G011g5790A73920A5374K5419K27635i9733j12187A50696F3836b00156
10265b2690l1185l9013K3216B9827J1263K78376C0176R0772L25620j30199j17422
10254A98947N5412p7610C8353M12303c4027j07075G9311a70969j09577F0189P0790
10243A30979b24056d7511k00065g1879D2966O2061g209k36427q3768A24847c41935
10231A23666e2320m585F6625j1050B058b82590L9243O2289F3344b4981B30027
$$ y = [127089, -249862, -147973, -19804, 104138, 210564, 101505, 65048, -5950, -170468, -163000, 124894, 96312, 98828, 175123, 156259, 149527, 20894, 109940, 119930, -96289, -266644, 197205, -5523, -65727, -63227, -28189, 225278, 209776, 11858, -113666, -52769, -113304, 47567, -66918, -183755, 7011, -75790, 173920, 15374, 40793, 268428, -99733, -211920, 150696, 63836, -200156, -22690, -53875, -92888, -69672, 29827, 41090, 319466, 30176, 120948, 446568, 316369, 198947, 254359, 176749, 38353, 450656, -34027, -141102, 79311, -170969, -280546, 60189, 130979, -224056, -47511, -247576, -71879, 42966, 105027, -7209, -243636, -327404, 124847, -341935, 123666, -52320, -56905, 66625, 55575, 2058, -282590, -243347, -181058, 63344, -24981, 230027]
10219B00579f9148B64466a75066p1502A69179f6906B7421a94438I2811e5809j36051
10208a91860h9618A78747G0829a07779j9159k24559d8017E9859a18498B0617f543
10196G5538J34694a24642j4825E7813Q9206e5879A4399f9686A85319e6952K0286
10185c6666p5290A93336a7786A95848b5230A13973P3341k5028E3094j1073R5781
10174A37802d6321q9050B534a46876b6124n2360A0880J87506a62754j28918b0142
10162F4724i4899C25666h8433k13932J24736c8133r5808B748c51679A86488q2317
10151A04171h6766k22737a309j27314o424N5785C89067a3972j75034h2617c4675
10139a17987B15595a95983A23903a26190B43944d8931G2310J25167b68242A1945
$$ y = [200579, -69148, 264466, -175066, -246568, 169179, -66906, 27421, -194438, 92811, -55809, -191860, -89618, 178747, 70829, -107779, -126938, -351497, -48017, 59859, -118498, 20617, -6543, 75538, 210232, -124642, -139467, 57813, 147019, -55879, 14399, -69686, 185319, -56952, -36666, -111956, 193336, -17786, 195848, -25230, 113973, 187314, 162286, 53094, 42021, 137802, -46321, -135371, 2534, -146876, -26124, -78484, 10880, 198386, -162754, -291672, -20142, 64724, -94899, 325666, -88433, -302365, -177629, -38133, -133941, 2748, -351679, 186488, 104171, -86766, -309503, -1309, -128623, -135047, -79262, 389067, -13972, -189006, -82617, -34675, -117987, 215595, -195983, 123903, -126190, 243944, -48931, 72310, 197477, -268242, 11945]
10128c76561C20092f5887p4017A20704b73432J20044b8903p8694B94a94335l5089
10117b29424l1311j17915A01293O2453H1420d04841B51842b33078Q5704j08195
10107b55569G7336b12296j71847d2095q6774d5372A309a64606n34k21962a41436
10095a39016a6771j85993C6315g2971j23607j4428H1404F732d9398j52508R7511
10084a04395A22475j1830c49061b5764B22777r7310b06000F1312a91303j27213
10074c18516j97550g3025A9119b11055L5498a2661q5870A34746c76271a44378
10063E5448c632k57330a15805q3428Q7603A42623o8454c73044G6795a24824c7751
10051C12196r4836A5012L15019e6578D7337c1807j85163B13224k2795l7584F4830
$$ y = [-376561, 320092, -65887, -139904, 120704, -273432, -153388, -28903, -107597, 294, -194335, -229424, -260735, -378650, 101293, 163746, 81420, -404841, 251842, -233078, -147374, -255569, 77336, -212296, -384143, -42095, -128869, -45372, 1309, -164606, -165140, -387102, -141436, -139016, -16771, -202764, 36315, -72971, -196578, -211006, 81404, 6732, -49398, -201906, -104395, 122475, 110645, -349061, -25764, 222777, 125467, -206000, 61312, -191303, -318516, -516066, -73025, 19119, -211055, -175557, -12661, -98531, 134746, -376271, -144378, 55448, -3632, -260962, -115805, -199233, -111630, 142623, 74169, -373044, 76795, -124824, -37751, 312196, 217360, 15012, 330031, -56578, 47337, -31807, -216970, 213224, 190429, 152845, 64830]
10039H8495a30339j5787B9383J65662b69116j08821a30926A12931n6371a39189
10028a6880H0389R2992L818k6484C4168c6734A96912a99554j6730e3801B84824
10016I8488a11306j93764A90371I1163b26685J12629j50064P3069E9349f1637
10005b65963j9878A4805J81357G4493i2398j71096e152l57146A31141c49177Q8872
9994b60305E8724h4650L3735A72662F8461E527c70309E37092q932a89465A6529
9982i6985A9853P1740c06265J43103N9141j62446C02082a04572m3388k9618B6685
9970I9749N3868h5775H1881j9850h9312j95301L5164H133h9586o3566G0655a16400
9957a17577B6593b3959n422k1095A18641q675E3319b27439F7169O8869i0599k2691
$$ y = [88495, -130339, -146126, 29383, 195045, -269116, -377937, -130926, 112931, 56560, -139189, -16880, 80389, 173381, 177199, 150715, 34168, -36734, 196912, -199554, -216284, -53801, 284824, 98488, -111306, -305070, 190371, 91163, -226685, -114056, -264120, -191051, 59349, -61637, -265963, -285841, 14805, 196162, 74493, -92398, -263494, -5152, -362298, 131141, -349177, -260305, 58724, -84650, -50915, 172662, 68461, 5527, -370309, 537092, 528160, -189465, 16529, -96985, 19853, 91593, -306265, -163162, -104021, -266467, 302082, -104572, -147960, -177578, 26685, 99749, 153617, -85775, 81881, 62031, -89312, -284613, -249449, 8133, -89586, -153152, 70655, -116400, -117577, 26593, -23959, -29381, -50476, 118641, 109966, 53319, -227439, 67169, 136038, -90599, -113290]
9945a13290L4644D8892b6141E2680N654a9987j98255c4418r1132A93228a09980
9933b84545J7368A80233c9859F8169L5139b5940j6728j54182A26935E1708a96186
9921A42583l7915f7533k7250k2180I8110a57240j65338J08392R8286a0122A06111
9909i393j52366F5344b4465j62901j63664a11865B37822H1117N3149B5834J50037
9898A75871J9655a00972a8931F9447C3673J16339a23779j5458f1441j55522G9779
9886i2093G5970g2641o4266j35727a15476M0145B2171L3716a79298J458l0167
9875b08007C4282h5738n2998j64652D0023J38987p3280c34548H1247b21744c6548
9863c2561a0363j89229d8255F0243K0677d9754k3348m3668B09037G102J22270
$$ y = [-113290, -78646, 48892, -26141, 52680, 58334, -19987, -218242, -34418, -125550, 193228, -109980, -284545, -267177, 180233, -39859, 68169, 103308, -25940, -42668, -196850, 126935, 51708, -196186, 142583, 104668, -67533, -94783, -116963, 98110, -157240, -322578, -214186, -115900, -10122, 106111, -9393, -161759, 65344, -24465, -187366, -351030, -111865, 237822, 81117, 134266, 25834, 175871, 195526, -100972, -18931, 69447, 33673, 150012, -123779, -139237, -61441, -216963, 79779, -92093, 75970, -72641, -136907, -272634, -115476, -75331, 22171, 55887, -179298, -177840, -208007, 34282, -85738, -138736, -303388, 40023, 179010, 105730, -334548, 81247, -221744, -36548, -32561, -10363, -199592, -48255, 60243, 80920, -49754, -73102, -116770, 209037, 7102, 129372]
9852A29372h4089j86732K3155k0231N390E0768R5318C3416c74668A96429a13547
9840a10482k8836A986J70197a30493A62152c05875f8795b5036D1007d64640F2735
9828E6745i8169A42833d13301d1434o0112A88852a88642C231a11439k9915C1558
9816c11174i3873K7347l00025A4087a9587B6723K081i2213c4297j10238j7346
9805a61881d8465A42673C1935K99918D8874h7912L8838P696j62620A33438k5314
9794A08124l6463d33400J57486A76169A8599J7263A7488a41809j26684B75301
9783C1629g5937A4732a99106o3466G7138b41366c5247o3864l5157N1372B50467
9771d06398A73124a74402Q6200p6167A74679C9989J65280H1008a13771n574A12957
$$ y = [129372, -84089, -270821, -247666, -267897, -262507, 50768, 146086, 33416, -374668, 196429, -113547, -110482, -139318, 1986, 172183, -130493, 162152, -305875, -68795, -25036, 41007, -464640, 62735, 56745, -98169, 142833, -413301, -41434, -101546, 188852, -188642, 3231, -111439, -141354, 31558, -311174, -93873, -66526, -366551, 14087, -19587, 26723, 28804, -92213, -34297, -144535, -161881, -48465, 142673, 31935, 331853, 48874, -87912, -49074, -41378, -203998, 133438, 108124, 71661, -433400, -275914, 176169, 18599, 35862, 17488, -141809, -268493, 275301, 31629, -75937, 14732, -199106, -262572, 77138, -241366, -35247, -99111, -134268, -82896, 250467, -406398, 173124, -174402, -88202, -164369, 174679, 39989, 205269, 81008, -113771, -119345, 112957]
9759c7239C8137C613f09213J57029B40342c9147j52702I1271a76374h8051l15058
9748d03109J29012g7919l77790H3774c28961D5191Q4641b71802B8595a41514j25288
9737b66802l0228J35783K819H448R0728g0028A93873E8791O5950a5635m1001j46529
9725b03165H8976J23412a21117r0774M167A24881a084j70469K2647A23457b42188
9713a24024B5499J0745a98423g1042k159A21514a57063j68451B16212C6663q969
9702B7694a87933l6859R8227K8377L9300k91871f0940k5788a4090j3994A02141
9690c37707J27653P8378C25074a66846B6987P5250a90086O1226K7183j06836I6352
9678a3205l31355C80418d2113n9244A14032R6046F8634h4597r0993n8795L4168
$$ y = [-37239, 38137, 3613, -609213, -452184, 240342, -39147, -191849, 91271, -176374, -88051, -403109, -274097, -77919, -455709, 83774, -328961, 45191, 129832, -271802, 28595, -141514, -266802, -297030, -161247, -158428, 8448, 99176, -70028, 193873, 58791, 124741, -15635, -56636, -203165, 88976, 212388, -121117, -211891, -207724, 124881, -1084, -171553, -148906, 123457, -242188, -124024, 25499, 36244, -198423, -71042, -73201, 121514, -157063, -325514, 216212, 36663, 27694, -187933, -224792, -126565, -98188, -58888, -350759, -60940, -86728, -14090, -28084, 102141, -337707, -210054, -131676, 325074, -166846, 26987, 102237, -190086, -128860, -101677, -208513, 96352, -13205, -344560, 380418, -42113, -101357, 114032, 210078, 68634, -84597, -175590, -234385, -200217]
9667b00217d4948C40733I7272B3498K20613a32350D541Q9119b04420A1023M1514
9656E2537K0114a7221B768K80436j0490j18378f4988i938o342A16973a04638A25439
9643b20627G6694c68224a57561j44002f7672L566A6419b87287H9691a40613B24210
9631a18874B7440a6249k43000Q3763I6184a68955m7045b6189k61273d2138k17446
9620b59584F4875L4029a14753l8844O4821a065j81842R058f6379P000j6013c4536
9607G0076j7402a16597B8593J90057C255b57398f0350j5240D2249K20073f1998
9595b81059a31383F946g3950L4625l73759C9311A7575a02475k0165A50999o1455
9584H9544d8138k00638h3213b7606l1056n6093j50833L5187b8504D8678a12344
$$ y = [-200217, -44948, 340733, 97272, 23498, 244111, -132350, 4541, 93660, -204420, 11023, 52537, 72651, -17221, 2768, 283204, 272714, 154336, -64988, -9938, -16280, 116973, -104638, 125439, -220627, 76694, -368224, -157561, -301563, -67672, -64106, 16419, -287287, 89691, -140613, 224210, -118874, 27440, -16249, -259249, -175486, 96184, -168955, -216000, -26189, -287462, -42138, -259584, 64875, 98904, -114753, -153597, -88776, -1065, -182907, -173849, -66379, -59379, -75392, -34536, 70076, 52674, -116597, 28593, 218650, 3255, -257398, -60350, -75590, 42249, 262322, -61998, -281059, -131383, 6946, -73950, -39325, -413084, 39311, 17575, -102475, -122640, 150999, 89544, -48138, -248776, -83213, -27606, -58662, -114755, -265588, -230401, -28504, 48678, -112344]
9572b14551A91533b35128B03472a02140A0423g6299j98731J27667j37264f1172
9561a44243e6976L02A6406a31481k77466a50339C8468a69090F1105a98342E3558
9549c37947A47170J27727e952A36553a50998p7666d0048j18741g2606j50542N4026
9538a69122l3262b0267j13800A15487d3330l0209B7744c0682a3987B24897A03272
9526e1192j95527h5235j2034k52443c320C43771D2842a52004b2527j13765A50969
9514C40785F6400K9f9854K6690o108B29059a31420B35903a01899M3642l2110M2627
9502d7740H4487d0892A56220C8914d7108o1637r8611J0475A91500h0733B72969
9490B03541a30834C306K74535j00566c14242B8509e4667G6576a09389j73382R1548
$$ y = [-214551, 191533, -235128, 203472, -102140, 10423, -76299, -275030, -147363, -284627, -61172, -144243, -56976, -56674, 16406, -131481, -408947, -150339, 38468, -169090, 61105, -198342, 53558, -337947, 147170, 274897, -5952, 136553, -150998, -228664, -40048, -158789, -72606, -223148, -169122, -202384, -20267, -134067, 115487, -43330, -73539, 27744, -30682, -13987, 224897, 103272, -51192, -246719, -85235, -97269, -349712, -3320, 343771, 42842, -152004, -22527, -136292, 150969, 340785, 66400, 66429, -69854, -43164, -49272, 229059, -131420, 235903, -101899, -58257, -90367, -47740, 84487, -40892, 156220, 38914, -47108, -108745, -207356, -196881, 191500, -80733, 272969, 203541, -130834, 3306, 277841, 177275, -314242, 28509, -54667, 76576, -109389, -282771, -191223]
9479a91223K8167k2448A4685b03164a2758B03087o1234e60922d7898C47425c1639
9467A36888a66168f5161j58973j81563b7027l23274E2445J11836c43405J9702
9457c23703C30063A08381c14575A07986a31205k04927J47983d6368k7875o8372
9447a42615e7565m0014A19949b25121n8480J13941g2097F9490a91139e5620A45612
9435E2010a61246B68637a20515A5607L40h6734p6261B68275i0511j81644J8352
9424b53803M7378F4610a85067k3872B09411p6418a43844l0976q7635C32096C4959
9412B592b8776H3658j4087e21969a08196A26187m1826a96365H7705b29843B9437
9400a06696A52599o7653i5853d4849B2567c33067A03854d30267h825j64513E0304
$$ y = [-191223, -163056, -185504, 14685, -203164, -12758, 203087, 141853, -560922, -47898, 347425, -31639, 136888, -166168, -65161, -224134, -405697, -27027, -350301, 52445, 164281, -343405, -323703, 330063, 108381, -314575, 107986, -131205, -336132, -188149, -46368, -74243, -142615, -57565, -97579, 119949, -225121, -283601, -169660, -72097, 69490, -191139, -55620, 145612, 52010, -161246, 268637, -120515, 15607, 15947, -86734, -162995, 268275, -90511, -272155, -253803, -206425, 64610, -185067, -208939, 209411, 132993, -143844, -174820, -262455, 332096, 34959, 2592, -28776, 83658, 69571, -521969, -108196, 126187, 84361, -196365, 87705, -229843, 29437, -106696, 152599, 84946, -95853, -44849, 22567, -333067, 103854, -430267, -8825, -173338, 50304]
9388b4782k95657c7824j14626j4798M791r1015C0746b09221j00374B61609a36718
9376d46132f6774A53484a10222k65118A47775k4465D2944k0373a44227l4887D6563
9364F8960c07995Q1190A67342a93747A817M4067b2050l7258J9469C10216C615
9352A7134L04975f4424a2863o307k28637d4879j35340j32051f2601D3082a05165
9340a39854d7837A24050c41988f048n2530G1821a14944j46275i8229K7877e984
9328C0920a77497N5062j40504A13480a30029l9502f8461A87993c52976c2062j43274
9317a75336j02482J33182F5191a30780n2201P067j63231e6380k79812D1633a29715
9305g6835A71828F2327Q0512a0085G7312a59548A27031c9874j54269A7253M3593
$$ y = [-24782, -320439, -37824, -152450, -167248, -162457, -253472, 30746, -209221, -309595, 261609, -136718, -446132, -66774, 153484, -110222, -375340, 147775, 123310, 42944, 22571, -144227, -179114, 46563, 68960, -307995, -226805, 167342, -193747, 1817, 45884, -22050, -59308, -39839, 310216, 3615, 17134, 322109, -64424, -12863, -19170, -247807, -44879, -180219, -312270, -62601, 43082, -105165, -139854, -47837, 124050, -341988, -6048, -58578, 71821, -114944, -261219, -98229, -70352, -5984, 30920, -177497, -122435, -262939, 113480, -130029, -169531, -68461, 187993, -352976, -32062, -175336, -277818, -144636, 65191, -130780, -182981, -175914, -339145, -56380, -336192, 41633, -129715, -76835, 171828, 62327, 142839, -10085, 77312, -159548, 127031, -39874, -194143, 17253, 60846]
9294F0846e79751a64051A95577F3424b3129l38665d5566A8609d3905k31954N7790
9283b18069B73403a44788A64815a27540j05425e9017j9372j9993j03042O8831
9273a32593H3107c89780a26255k24795a56984B89004a27119D0439a7965I6887
9262C38818B36a36433C39448a48675A42559d50318F5641a07046b314j44142o4927
9251b11383e3379o4840l44998H2156e4175D6139g7345A81959L3203I6808a65247
9239c72652A00471C7678L995b65602B59182A3049b85617A64701j8254b25479N6815
9228a68664d4759k24524B50250b83335K9636k0326J22119e1255A3800R6063b88478
9216B13776a02222c5259i068B38127a68680a8054k99327E47396a13944K2043D977
$$ y = [60846, -579751, -164051, 195577, 63424, -23129, -361794, -45566, 18609, -43905, -275859, -218069, 273403, -144788, 164815, -127540, -232965, -59017, -78389, -98382, -201424, -132593, 83107, -389780, -126255, -351050, -156984, 289004, -127119, 40439, -17965, 96887, 338818, 236, -136433, 339448, -148675, 142559, -450318, 65641, -107046, -2314, -146456, -211383, -53379, -118219, -463217, 82156, -54175, 46139, -77345, 181959, 215162, 96808, -165247, -372652, 100471, 37678, 41673, -265602, 259182, 13049, -285617, 164701, 146447, -225479, -168664, -44759, -269283, 250250, -283335, -253699, -274025, -151906, -51255, 13800, 109863, -288478, 213776, -102222, -35259, -9068, 238127, -168680, -18054, -317381, 547396, -113944, -91901, 4977]
9204a22080p9156D3671j1696R6758K03164g2120A68737c22355a45399B23318i4180
9192a06799k49283B00095b08543c8202j98016j34347B07973m6444c2814D2753
9181H1294A0838M8444g0242A54544i2412L6633r6133C8183b87812B73976D918
9169H5461A2937b02540c1175j8183J3778k51323j76438b3551B2361O5582b56475
9157h3608A5655i9561F074i0248k22283l5997A89607b02888C9572N7197d2914
9145H5916c32246I318P2024L83693E0593a69999M4426A52851b15207A10072K6217
9134A36289O7099f9400n4244A79531H9007n072c5600k63368d1280k32722J02103
9123a71899B00271K52032A0176b87249E5496K8701a41343a4105E6338A3240b81028
$$ y = [-122080, -201236, 43671, 31975, 128733, 331897, -72120, 168737, -322355, -145399, 223318, -94180, -106799, -356082, 200095, -208543, -38202, -236218, -370565, 207973, 161529, -32814, 42753, 81294, 10838, 59282, -70242, 154544, -92412, -55779, -151912, 38183, -287812, 273976, 4918, 85461, 12937, -202540, -31175, -49358, -35580, -286903, -463341, -23551, 22361, 87943, -256475, -83608, 15655, -99561, 6074, -90248, -312531, -348528, 189607, -202888, 39572, 96769, -42914, 85916, -332246, 9318, 81342, 465035, 50593, -169999, -125573, 152851, -215207, 110072, 136289, 203388, -69400, -123644, 179531, 89007, 83935, -35600, -298968, -41280, -274002, -171899, 200271, 452303, 10176, -287249, 55496, 84197, -141343, -14105, 56338, 13240, -281028]
9111a57562N2710a6970A1753K33664g3153C1945c03442J101D10596d41597a24591
9099f6891B34194C5007d01082A96292B7066a56810k43827D2620b53088d3005d22
9087i67m18750f3637m5303a8249A29065a3636j77322J7044i752j08167j50471
9076b68390B09221b72768L4829a06873A06060b95538g8509k0884k07916J50710
9066a56599o5996H8583d1986A39937a50121F7313b448A30960n9751f0538o3388
9055a23926e6101j12536o8030f0357B43022b03407A25824a25388j42582A04843
9044h5563A78016H5053L6556a44310G0933a1711p3125j16560B39193b74140c3866
9032b17077Q8697j98868B53874a04877h677E6160c45988D3913b22047G3516a7126
$$ y = [-157562, -104852, -16970, 11753, 245417, -73153, 31945, -303442, -302341, 410596, -441597, -124591, -66891, 234194, 35007, -401082, 196292, 27066, -156810, -400637, 42620, -253088, -43005, -422, -967, -419717, -63637, -108940, -18249, 129065, -13636, -190958, -173914, -9752, -117919, -268390, 209221, -272768, -237939, -106873, 106060, -295538, -78509, -99393, -307309, -156599, -222595, 88583, -41986, 139937, -150121, 67313, -2448, 130960, 71209, -60538, -123926, -56101, -168637, -236667, -60357, 243022, -203407, 125824, -125388, -267970, 104843, -85563, 178016, 85053, 121609, -144310, 70933, -11711, -84836, -201396, 239193, -274140, -33866, -217077, -128380, -327248, 253874, -104877, -8677, 56160, -345988, 43913, -222047, 73516, -17126]
9020b8083C6490c89536A40552e2297A78230n2794f7960B12205d42388g1035j49722
9009b20757D4809h8304h145C2492J09454b19449R8726m4592B0388b5568A20735
8997a94064J9485B44970a03919d0557l01044c602C7372O1797d1383A63475G0553
8985b1788j31631j74219d4249F0396A1606g4633a2131C7864b09612G2564b58111
8973A00134a10452B15210D4258M3352A7285a3245l12297J29337f7693j69843D4104
8961f3437J3781m5426I4659c3386D6388K24423G9522N3775a53037m4675R5406
8950a02306A75720i0154k38123E4947F395h4992A92754q2258b14794d1390m18173
8939d59563f5812A29579a43563B85921g2939A16361Q6499B661g6479k60458h6383
$$ y = [-28083, 36490, -389536, 140552, -52297, 178230, 125436, -67960, 212205, -442388, -71035, -220757, 44809, -88304, -8145, 32492, 141946, -219449, -120723, -165315, 20388, -25568, 120735, -194064, -174579, 244970, -103919, -40557, -341601, -3602, 37372, 99169, -41383, 163475, 70553, -21788, -153419, -327638, -44249, 60396, 11606, -74633, -12131, 37864, -209612, 72564, -258111, 100134, -110452, 215210, 44258, 87610, 17285, -13245, -325542, -196205, -67693, -237536, 44104, -63437, -49656, -95082, 94659, -33386, 46388, 270811, 79522, 133297, -153037, -197712, -102306, 175720, -90154, -328277, 54947, 6395, -84992, 192754, 110496, -214794, -41390, -459563, -65812, 129579, -143563, 285921, -72939, 116361, 202860, 2661, -76479, -336937, -86383]
8927C83981A19803J33046F8460J67563N35000J942686m46303E03769j62470I7223
8916B92648e8596D6105c72306J26478d7296j83992H3228B7226b931j61933j48232
8905c13096E0208L5282a15126A90175a69592c8473p6618r3719i6240l09768C07708
8893a81782M7061A22606a81545j61422H885O6906b9097r8279m9646O1276I4225
8881c11697B19246p5512b01447D756O0608h3935j03137r2974I447Q2466a9939
8869A09185a37419C863c8437o985r5363E0012c3961K700A20793n1112a53509p1021
$$ y = [383981, 119803, 252849, 68460, 236023, 771023, 2713709, 2267406, 503769, 341299, 97223, 292648, -58596, 46105, -372306, -245828, -47296, -231288, 83228, 27226, -2931, -164864, -313096, 50208, 85490, -115126, 190175, -169592, -38473, -115091, -208810, -96240, -406008, 307708, -181782, -134721, 122606, -181545, -342967, 8885, 75791, -29097, -127376, -177022, -115746, 94225, -311697, 219246, 143734, -201447, 4756, 65364, -83935, -187072, -280046, 9447, 91913, -19939, 109185, -137419, 3863, -38437, -45422, -140785, 50012, -33961, -31261, 120793, 69681, -153509, -224530]
$$ [...]
##END NTUPLES=NMR SPECTRUM
##END=
