##TITLE=AC1761_NAR_3_9683236_BUEhHdfWFN
##JCAMPDX= 6.0         $$ Bruker NMR JCAMP-DX V2.0
##DATA TYPE= NMR SPECTRUM
##DATA CLASS= NTUPLES
##ORIGIN= BRUKER
##OWNER= Administrator
$$ 1.72 TOPSPIN		Version 2.1
$$ 2016-04-17 01:08:09.829 -0700  Administrator@X
$$ Compression mode = diff/dup
##.OBSERVE FREQUENCY= 400.02188249412
##.OBSERVE NUCLEUS= ^1H
##.ACQUISITION MODE= SIMULTANEOUS (DQD)
##.ACQUISITION SCHEME= undefined
##.AVERAGES= 8
##.DIGITISER RES= 22
##SPECTROMETER/DATA SYSTEM= spect
##.PULSE SEQUENCE= zg30
##.SOLVENT NAME= COFFEE_meoh
##.SHIFT REFERENCE= INTERNAL, COFFEE_meoh, 1, 14.98509
##AUDIT TRAIL= $$ (NUMBER, WHEN, WHO, WHERE, PROCESS, VERSION, WHAT)
$$ ##TITLE= Audit trail, TOPSPIN		Version 2.1
$$ ##JCAMPDX= 5.01
$$ ##ORIGIN= Bruker BioSpin GmbH
$$ ##OWNER= Administrator
$$ $$ E:\/data/COFFEE/nmr/AC1761_NAR_3_9683236_BUEhHdfWFN/50/pdata/1/auditp.txt
$$ ##AUDIT TRAIL=  $$ (NUMBER, WHEN, WHO, WHERE, PROCESS, VERSION, WHAT)
(   1,<2016-04-17 01:08:02.704 -0700>,<Administrator>,<X>,<go>,<TOPSPIN 2.1>,
      <created by zg
	started at 2016-04-17 01:06:56.439 -0700,
	POWCHK enabled, PULCHK disabled,
       configuration hash MD5:
       21 0F 79 D6 B3 7B B4 F6 88 20 88 DB 03 48 BD 9F
       data hash MD5: 64K
       4A CE E0 7C 67 89 68 A2 B5 89 20 71 D2 12 DE 8A>)
(   2,<2016-04-17 01:08:05.829 -0700>,<Administrator>,<X>,<proc1d>,<TOPSPIN 2.1>,
      <Start of raw data processing
       efp LB = 0 FT_mod = 6 PKNL = 1 PHC0 = 0 PHC1 = 0 SI = 32K 
       data hash MD5: 32K
       7C BE 6E 52 39 AC 9D 94 EE 21 01 1F FD CA 4E 49>)
(   3,<2016-04-17 01:08:06.126 -0700>,<Administrator>,<X>,<proc1d>,<TOPSPIN 2.1>,
      <pk PHC0 = 91.3678 PHC1 = 0 
       data hash MD5: 32K
       8D CF F3 69 8C 92 B3 BB 0E DF D8 D0 1F F1 5A 75>)
(   4,<2016-04-17 01:08:06.220 -0700>,<Administrator>,<X>,<proc1d>,<TOPSPIN 2.1>,
      <abs ABSG = 1 
       data hash MD5: 32K
       C7 75 37 B1 E1 5C F7 79 50 D1 66 CE 87 31 3D 36>)
(   5,<2016-04-17 01:08:06.283 -0700>,<Administrator>,<X>,<proc1d>,<TOPSPIN 2.1>,
      <abs ABSG = 2 
       data hash MD5: 32K
       8C 67 E7 A0 BC F0 44 9A 48 82 C6 E0 6A A4 91 F7>)
(   6,<2016-04-17 01:08:06.361 -0700>,<Administrator>,<X>,<proc1d>,<TOPSPIN 2.1>,
      <abs ABSG = 3 
       data hash MD5: 32K
       42 EA FF 2A 01 D6 E7 03 9B 99 C1 68 41 97 FC D3>)
(   7,<2016-04-17 01:08:06.408 -0700>,<Administrator>,<X>,<proc1d>,<TOPSPIN 2.1>,
      <abs ABSG = 4 
       data hash MD5: 32K
       1E 04 6D A0 52 55 71 0C F3 B7 BE 53 0B C8 70 D2>)
(   8,<2016-04-17 01:08:06.470 -0700>,<Administrator>,<X>,<proc1d>,<TOPSPIN 2.1>,
      <abs ABSG = 5 
       data hash MD5: 32K
       23 28 C3 DD 90 D0 65 FD 58 27 A9 87 16 F7 08 EC>)
$$ ##END=
$$ 
$$ $$ hash MD5
$$ $$ 6D 9D D5 92 A1 C2 9E 24 CE BF 89 0F 52 50 CC 18
##$RELAX= 
##$RELAX= 
##$RELAX= 
##$RELAX= 
##$RELAX= 
##$RELAX= 
##$RELAX= 
$$ Bruker specific parameters
$$ --------------------------
##$DU= <E:\>
##$EXPNO= 50
##$NAME= <AC1761_NAR_3_9683236_BUEhHdfWFN>
##$PROCNO= 1
$$ [...]
150 150 150 150 150 150 150 150
##$TP07= 0
##$TPNAME0= <>
##$TPNAME1= <>
##$TPNAME2= <>
##$TPNAME3= <>
##$TPNAME4= <>
##$TPNAME5= <>
##$TPNAME6= <>
##$TPNAME7= <>
##$TPOAL= (0..7)
0.5 0.5 0.5 0.5 0.5 0.5 0.5 0.5
##$TPOFFS= (0..7)
0 0 0 0 0 0 0 0
##$TUNHIN= 0
##$TUNHOUT= 0
##$TUNXOUT= 0
##$USERA1= <user>
##$USERA2= <user>
##$USERA3= <user>
##$USERA4= <user>
##$USERA5= <user>
##$V9= 5
##$VALIST= <valist>
##$VCLIST= <CCCCCCCCCCCCCCC>
##$VD= 0
##$VDLIST= <DDDDDDDDDDDDDDD>
##$VPLIST= <PPPPPPPPPPPPPPP>
##$VTLIST= <TTTTTTTTTTTTTTT>
##$WBST= 2048
##$WBSW= 25
##$XGAIN= (0..3)
0 0 0 0
##$XL= 0
##$YL= 0
##$YMAX_a= 594231
##$YMIN_a= -507322
##$ZGOPTNS= <>
##$ZL1= 120
##$ZL2= 120
##$ZL3= 120
##$ZL4= 120
##$ABSF1= 14.98509
##$ABSF2= -5.573092
##$ABSG= 5
##$ABSL= 3
##$ALPHA= 0
##$AQORDER= 0
##$ASSFAC= 0
##$ASSFACI= 0
##$ASSFACX= 0
##$ASSWID= 0
##$AUNMP= <proc_prof1d_extract_pilot.lims>
##$AXLEFT= 0
##$AXNAME= <>
##$AXNUC= <1H>
##$AXRIGHT= 0
##$AXTYPE= 0
##$AXUNIT= <>
##$AZFE= 0.1
##$AZFW= 0.1
##$BCFW= 0
##$BC_mod= 0
##$BYTORDP= 0
##$COROFFS= 0
##$CY= 15
##$DATMOD= 1
##$DC= 0
##$DFILT= <>
##$DTYPP= 0
##$F1P= 0
##$F2P= 0
##$FCOR= 0.5
##$FTSIZE= 32768
##$FT_mod= 6
##$GAMMA= 0
##$GB= 0
##$INTBC= 1
##$INTSCL= 1
##$ISEN= 128
##$LB= 0
##$LEV0= 0
##$LPBIN= 0
##$MAXI= 10000
##$MC2= 0
##$MEAN= 0
##$ME_mod= 0
##$MI= 0
##$NCOEF= 0
##$NC_proc= -8
##$NLEV= 6
##$NOISF1= 0
##$NOISF2= 0
##$NSP= 0
##$NTH_PI= 0
##$NZP= 0
##$OFFSET= 14.98509
##$PC= 1
##$PHC0= 91.3678
##$PHC1= 0
##$PH_mod= 1
##$PKNL= yes
##$PPARMOD= 0
##$PPDIAG= 0
##$PPIPTYP= 0
##$PPMPNUM= 2147483647
##$PPRESOL= 1
##$PSCAL= 4
##$PSIGN= 0
##$PYNMP= <proc.py>
##$REVERSE= no
##$SF= 400.02
##$SI= 32768
##$SIGF1= 0
##$SIGF2= 0
##$SINO= 400
##$SIOLD= 32768
##$SPECTYP= <>
##$SREGLST= <1H.CDCl3>
##$SSB= 0
##$STSI= 32768
##$STSR= 0
##$SW_p= 8223.68421052631
##$SYMM= 0
##$S_DEV= 0
##$TDeff= 65536
##$TDoff= 0
##$TI= <>
##$TILT= no
##$TM1= 0
##$TM2= 0
##$TOPLEV= 0
##$USERP1= <user>
##$USERP2= <user>
##$USERP3= <user>
##$USERP4= <user>
##$USERP5= <user>
##$WDW= 1
##$XDIM= 32768
##$YMAX_p= 425578262
##$YMIN_p= -628121
##$CURPLOT= <Network HP LaserJet P1505>
##$CURPRIN= <$Network HP LaserJet P1505>
##$DFORMAT= <normdp>
##$LAYOUT= <+/1D_H.xwp>
##$LFORMAT= <normlp>
##$PFORMAT= <normpl>
##$SURQMSG= 1
$$ End of Bruker specific parameters
$$ ---------------------------------
##NTUPLES= NMR SPECTRUM
##VAR_NAME=  FREQUENCY,     SPECTRUM/REAL,   SPECTRUM/IMAG
##SYMBOL=    X,             R,               I
##VAR_TYPE=  INDEPENDENT,   DEPENDENT,       DEPENDENT
##VAR_FORM=  AFFN,          ASDF,            ASDF
##VAR_DIM=   32768,         32768,           32768
##UNITS=     HZ,            ARBITRARY UNITS, ARBITRARY UNITS
##FACTOR=    0.250966925370066, 1,           1
##FIRST=     8223.43324360094, 91147,        -113398
##LAST=      0,             -151035,         252188
##MIN=       0,             -628121,         0
##MAX=       8223.43324360094, 425578262,    0
$$ Real data points
##PAGE= N=1
##DATA TABLE= (X++(R..R)), XYDATA
$$ [...]
23865 -383760 -97689 94253 307582 -41014 -216605 182002 111073 149870 75615 -2180 211522
23853 91491 -168368 210418 229477 1402 -118746 192325 292947 -22713 -319912 -480901
23843 -480901 -40842 86962 -361296 191724 -46197 -132306 -208181 74403 -150418 -153083 -204339
23832 -204339 105258 112719 -140384 -230615 -361695 72506 15985 102015 192095 56720 -36616
23820 -306111 275944 -89931 -12305 -328118 87473 -128170 1496 -227529 269457 -145101
23809 265456 -320956 7870 53382 -27878 101564 -128447 253254 -269392 -240242 205629
23798 -114791 -137056 -182840 -152320 35170 -44143 -85625 165509 -176337 151750 203396 -71307
23786 141759 334975 -84904 27200 124296 109858 112712 -13047 159578 -88534 -276174 310415
23774 22296 233547 34184 -159994 262403 -79361 131136 -151068 129309 -92013 -243634
23764 -243634 193591 116418 122938 -269283 69733 -136905 -179356 84007 138397 -75080 -8983
23752 267625 120842 -120988 175936 -213652 367938 149935 75227 -251094 368830 -132578
23741 110617 -166370 -19667 192901 240023 -49511 -467914 -339418 -169090 -81353 -275805
23731 -275805 127828 -254754 -185059 -109274 -155850 77927 -201251 4074 -77427 -80564 186944
23719 113720 97901 -117245 -269368 26792 356173 96460 -127776 -109546 462283 -1918 -51016
23708 -51016 -6215 -77201 79868 119107 202173 -409135 97863 129294 -251479 243086 -215621
23696 -324140 -122225 73962 136962 -128077 104665 38994 107916 133052 -23949 -348198 27040
23684 -12122 -241923 89160 -89474 -47263 -95498 38342 -200327 -366506 -149860 -51316 -4469
23672 -339137 183447 167447 -263651 215773 85671 -21840 -238009 25192 -176133 52164
23661 -140536 -62582 -49053 -251418 -48117 80324 245698 -50821 45745 -49677 27082 -85893
23649 42345 17436 146880 -22920 -258100 -188049 13903 -88516 -61884 34860 221893 -249506
23637 162617 -70676 72013 -50291 49238 -221555 -112679 24775 -200521 -176053 176304 -294486
23625 -63698 99524 -207284 -163723 14410 208787 -104500 8215 168392 123009 112045 -233506
23613 -62029 -244903 205595 -23684 149357 119024 60273 -63821 235333 89986 -335440 78653
23601 17308 -22345 -2335 157837 -44723 -33849 -151780 -166469 -237561 -231148 281266 -18552
23589 279239 147727 161567 270207 -107034 -54468 83246 -31346 -80355 -294566 -265568 -196436
23578 -196436 76828 -372984 -73832 -24473 -20252 -60063 188842 -65304 -377959 -116931 151638
23566 -201265 51721 -165074 -17357 -84293 26174 -274618 94828 -314547 -148402 -257230
23556 -257230 -100976 -152090 -249571 253154 -31445 -98455 -14895 -95380 142815 81673 -61343
23544 221204 65362 -41481 69308 138908 130593 9751 78020 -68951 -51382 48448 -307 27719
23531 -78833 84109 56154 -146090 -324420 -202748 -143798 70342 -180724 -82529 126495 -46134
23519 -27872 59381 -349730 100812 41639 126501 -46258 168949 -143249 155939 129680 -179006
23507 127561 93487 155671 -286654 113609 168515 -21619 -220504 92561 290005 246997 -92282
23495 52192 341087 149672 97938 226625 -99530 -147600 -241259 -143642 15189 131368 -115243
23483 -76415 -175361 32796 43807 -208639 203619 -31920 -11624 232329 -19664 -11170 -138696
23472 -138696 -127127 -101325 86572 10762 76598 -119887 31649 -110845 85637 40496 -70036
23460 136998 -129058 95652 101029 -142047 -115254 70225 -158927 -92143 325838 18474 -268563
23448 98312 -42615 150137 227531 -167666 -19555 -75533 65445 -131986 26641 321400 -307483
23436 -49421 -62578 -214211 101210 169189 170635 18638 108236 21268 -149096 -112766 287782
23424 44018 89447 -152864 185219 -80028 -7508 283780 -49408 405893 -162081 1388 32591
23413 32591 89247 -138993 87486 193460 4078 42961 -270801 197896 33715 -148064 35728
23401 -422465 49029 -96468 156607 103516 -3902 -182611 139351 -450756 187004 -121529
23390 -70825 -278875 302477 29618 -35410 -28021 -342579 -13490 -53873 -90250 265284 -43662
23378 129404 -202319 114379 -17585 106442 4564 64434 15611 -396458 124734 -133574
23367 111799 209863 43319 81962 -52668 317762 144466 -113100 92181 56705 -113661 147805
23355 63298 -1884 27421 -1743 180371 -77123 -13393 103539 44398 -133044 -171638 319633
23343 -189338 22728 -38283 -406610 -216073 -11755 -11412 300606 200411 -18555 214026 -103193
23331 -16666 30345 -6472 229359 -88803 88809 -6692 -161795 -93882 145969 -89593 -150519
23320 -150519 -87694 -147549 -70886 146585 -281661 127292 79941 -143935 -289864 159 -8362
23308 -430974 -5174 -75963 -15921 -313645 8017 -4574 -82654 -72576 162902 -130161 155166
23296 -219890 28893 143213 -170880 6812 -185348 -18572 -150446 -146505 -94241 -278581 111226
23284 -170125 -157063 -251858 41755 88204 -79829 339704 31806 -22805 -95800 -71211 249969
23272 -244206 125206 -20558 224635 -106141 -58747 -220487 -185088 186314 -118528 -147507
23262 -147507 -281057 58502 -241678 -61513 -80242 -163661 324737 -46075 -73363 16397 -90765
23250 -216292 81503 -146056 -129272 -202502 226060 -129662 45386 -66165 -10394 299343 -253174
23238 107057 223043 -118401 141312 -361257 263691 -11158 62348 -155712 -66048 -281653
23228 -281653 -33351 7651 381473 -230457 204840 -207217 90199 68553 -63417 -63803 -104252
23217 -104252 157771 293000 -14166 9336 -108290 148446 -92879 -17422 -165334 -66931 89691
23205 152251 24 -113370 -129403 138009 -229254 -114319 -177737 98507 -317860 -183134 -3140
23193 114671 -39645 60495 206182 -152430 53950 103085 -32312 374156 -234996 -22887 264668
23181 -134725 317548 -34298 2156 -56863 -55509 106126 -110971 -29925 40550 -141113 -194715
23170 -194715 181337 -157103 -98842 -402720 -89577 -100147 154379 69100 14081 56401 91225
23159 91225 -12320 102172 -130882 -171627 -70988 45096 141011 -182240 72434 -250703 8316
23147 -132214 -70476 -171105 285317 221370 77205 -59846 271628 233314 74844 -99042 308970
23135 33717 27418 79454 -224069 181613 82950 259071 54646 52838 142316 123355 -137847
23123 71249 59509 -6863 172307 -4356 212931 153722 211266 -332282 270645 125259 98726
23112 98726 27451 -41973 263177 179568 -143895 -192411 -61629 10883 -79333 -100791 66550
23100 -104562 51953 -11961 53034 41249 -110092 51329 62007 -21589 -151110 -214516 -279275
23089 -279275 -170534 129549 129989 -151306 -230971 73190 -21046 -35980 -38778 130304 11723
23077 59152 -146029 633 -86350 97744 -8807 178822 -226181 -56990 -59058 -385627 -70499 5773
23064 -181078 -35041 -222100 -72278 4969 -93744 254830 126607 -281421 -28978 165209 -62781
23052 -34739 28809 44826 -58185 -396406 45795 -695 205434 93326 370936 -4671 224696
23040 -200501 34210 503965 -223551 -81970 99328 -59336 -81035 -68219 42232 77136 -100524
23028 -34446 -106883 64392 57493 415982 -5560 12840 140361 -202254 -234431 -143963 -152356 100183
23015 -267533 -85046 -245140 -221703 -120976 -359366 131632 -38139 -221193 53961 -236477
23004 38293 49557 254023 -14742 -228139 -349069 -352894 161053 -6874 -89455 -179175 -3066
22992 336500 -254208 -117518 -136909 136598 142576 -229142 -596 -4048 -69211 115960 -233220
22980 -2095 -94465 -214143 -7489 140701 37709 106706 3668 58252 -30176 148854 410526
22969 410526 -230044 153785 -36524 -14973 -68823 -352775 -149253 97929 -83277 -104217 -54698
22958 -54698 -76138 110957 -84414 -257176 -183271 -88268 -334351 -37923 22869 92159 -61719
22946 102900 194224 336859 84218 -421336 -113608 -17712 107064 256605 130265 -23275
22935 -74336 -311574 -1766 -123948 -182422 76752 64018 28449 148676 -28055 -178048 -196917
22924 -196917 -213349 -161932 74123 66148 90624 -92196 -50265 167798 -299023 -218142 -62167
22912 26461 -174068 -139262 -10576 279789 16400 -298838 -379703 -278304 -30412 63814 22357
22900 3984 -70785 85008 -125414 53312 192515 -60895 -226797 206567 -97430 457031 -183925
22888 -34067 5769 -85072 -933 193590 136761 -219575 155373 -117265 113427 236049 -68979
22876 -54075 -107953 107251 113429 -273814 322469 -217074 -287485 -211589 37535 -193082 -107432
22865 -107432 -168212 -30074 27497 -112121 -208666 -12549 -398644 76573 399528 -202674 34497
22853 54154 102545 20339 -132737 227732 -170362 -88612 -51814 90214 -145216 -86057 -189076
22842 -189076 424122 137921 -255324 147431 -61468 201617 56783 -432381 -227337 271924
22831 103190 -202749 -344149 -247142 -263824 -536346 48298 -288108 51616 -121152 244957
22820 -66745 315380 258798 55658 -114213 -79182 124640 154252 19596 -31573 209240 -22366
22808 -6773 -152412 121016 -315051 445 -211153 -24023 -74150 -47788 90090 -273361 -186035
22797 -186035 60840 24498 97085 14605 110562 -403789 226547 159938 119016 -4743 -46894
22786 -46894 251596 -155413 -190098 -54823 39841 268900 -166210 59302 -102590 8649 -53977
22774 182518 -113776 2490 117408 250586 -196526 -80209 -387196 201644 108060 9725 -197897
22762 -339222 -154265 166714 180613 115383 74450 277116 -85089 210884 -246028 -178965
22752 -178965 -87809 -232002 -74215 76863 -32739 62144 150216 -238838 123980 -169237 22321
22740 6469 -433 -174460 -153830 -78007 102767 -121290 -123724 259332 61142 -180669 -195257
22729 -195257 275439 24200 -150247 -76465 26564 18165 120612 -67102 75650 -116527 -304753
22718 -304753 -103600 163585 -296796 -246979 104194 -45437 24269 -135557 -62592 -120613
22708 -120613 -362134 36403 -154851 183743 -79915 -151438 146982 74336 -54530 43663 46661
22697 46661 -87496 -40016 41836 32688 125740 26748 54493 -108828 -197699 -91224 312746
22685 -217701 -223175 -245195 -87679 186714 140419 80076 -10680 -91679 -15941 -22080 149010
22673 -203619 44562 -59160 -360798 129924 -233563 -26475 -360418 192281 91508 -42601
22662 -147369 -280826 -183173 -7702 21442 -180623 53549 59206 -115416 -24952 -68971 -139098
22651 -139098 155768 -50840 -253764 -152595 68935 68915 178512 60780 -86879 -315074 -81141
22639 -223689 201773 -43751 228085 29604 103707 207923 -124177 83468 13156 83469 -102852
22627 -263869 -229870 264454 -523943 -1734 76475 18982 -261540 -89154 103463 144164 -122379
22615 -220588 -36997 -179027 -290960 87245 54256 -57332 -250144 51431 -162616 110892
22604 -124236 -174393 -157898 -106676 -93236 -112286 -143775 -23204 79315 108074 -112534 -101047
22593 -101047 -323652 -132749 192638 173792 2057 -640 -275522 -139324 -66646 -178031 194938
22581 -267029 -207849 91601 164646 -196598 -132134 -64693 -62171 79458 66519 76710 22416
22569 -63767 -200091 -321001 -190867 -80898 -240942 -54641 118078 2577 -31346 -279891 229153
22557 18228 -146130 163482 41847 -304221 375016 -119629 -309631 150581 -185395 5625
22546 77390 -248015 113644 64666 -131909 128029 -132283 -59387 157145 -168280 -31011
22535 -51670 158379 -26819 120330 -91905 -170230 162892 -206699 -136751 37400 158770 -239570
22523 201929 246844 -55297 60187 149923 -61237 -165706 -18960 -7657 -46793 -42316 61128 117337
22511 117337 -160803 -294154 182445 8613 137062 -332831 -41421 -145173 50031 6755 125586
22500 125586 -8481 545772 24272 -144062 -10294 -282801 -182510 100711 -137649 119891
22489 -39843 57515 72648 261371 1334 -151309 21589 -237424 12151 -122100 9886 32807
22478 32807 143430 -124536 107025 30344 -149540 179943 -145038 262813 -345469 -255028
22468 -255028 126089 654 178976 -228522 -169547 117874 -140813 77466 -53013 63328 -396497
22456 -5027 -153460 135144 145902 -18111 -34699 -107523 161558 -30879 -19167 -374927 -171418
22444 -351113 63270 -139954 -265661 167204 277256 -69583 -26372 12060 -25715 -133715
22434 -133715 -27784 104422 -167569 -187344 39241 304477 172428 -36266 -244323 -19542
22423 -182828 3068 -244162 13475 -51047 281222 -15498 -107117 -309891 87093 -284507 -93659
22411 -5907 -91650 375811 -25431 227316 -169268 -10641 -160328 -121578 -235856 259068 280259
22400 280259 -99736 -65464 347266 -359558 -270489 -241980 41549 131786 -327376 -168083 167617
22388 -82186 115805 -83533 -70754 262031 -4159 -18123 73110 -241690 -184112 -433805 -124199
22376 264688 -65778 -151901 230602 96745 254222 12724 -238825 -178569 197011 66361 268236
22365 268236 -66998 71652 208436 37502 -43838 88086 115142 -332186 -53506 -45806 112787
22353 -56028 28951 -242625 95934 -68624 -5286 -166748 70192 325409 -84064 165467 22999
22341 -154707 -89427 1644 -353267 66976 -97551 -146331 181561 -28877 -211315 -199155 272494
22329 -8130 -60571 -291831 -290568 165460 123143 -35051 -17040 -177080 -58311 -197466 29234
22317 191521 -85396 165571 -111343 -104221 139492 -169990 -395382 -118978 258762 -99205
22306 5120 92180 -66370 -164664 358769 30190 130229 147606 -226676 150441 116242 99426
22295 99426 28514 -92623 186162 -214799 -405261 -182374 -45121 -5619 -238341 241696 -109447
22283 -214923 137798 -11073 -35606 324759 6035 3037 137024 -18987 210045 189010 -161682
22271 -116682 -84012 108447 191964 -221643 189387 12299 139356 54016 -263578 -9394 -30311
22260 -30311 9940 231713 134113 88097 -55323 -79505 -62611 78949 120299 38399 56984 35061
22248 35061 96877 13548 -99820 31724 -58649 -367837 -88578 110296 85068 133549 116480
22237 116480 238198 -31551 -163082 -151628 -78827 -97507 -102915 -88640 261935 1156 52053
22226 52053 -42680 -428212 19029 -59601 -62515 53890 -304623 229656 -24820 -87450 107500
22214 4564 114562 25851 -211804 -147069 -18412 -158047 54330 -191536 158551 -275755 -363518
22203 -363518 61683 -437684 -29526 160653 -83630 34384 243520 -255400 -101711 -10972
22192 -336344 -157477 -347224 -63395 257762 -362465 213334 121633 -196074 49415 -240252
22181 -206577 21545 294246 -389723 -198820 -27958 -9546 -192092 -398326 -139500 -77707
22171 -77707 99406 43354 41630 -61409 -24934 -201539 -129146 -75460 -56785 321839 40647
22159 -112180 -26361 -57974 58346 -20554 -237436 39800 21037 -84885 181829 92274 117829
22148 117829 -50408 -305667 -64589 -142783 262674 59300 55528 89133 -479536 -56690 -158484
22137 -158484 -110517 -293368 -249438 -208414 -292260 -290656 -29562 -70337 -2233 -93849 -65340 18103
22124 -108524 -37832 -119917 -60816 -325530 70777 105091 -131498 134984 207341 10816 -315649
22112 -146018 24921 -339330 96670 67245 77199 -66252 -216972 -79534 -48490 -16223 -336981
22101 -336981 -95443 76993 -85930 -28390 66006 -192583 -5154 -520172 -144788 -79338 110488
22089 12840 78709 -24117 260591 182787 -96289 175345 130145 -373741 -174975 -78413 -61250
22078 -61250 -54625 -25457 220309 -187591 -145610 62108 40711 26201 -74282 -66267 88865 -41737
22065 -179228 -18635 88488 60293 -60793 -158529 -32465 -151655 131452 -111699 80448 -263156
22053 -177830 -184363 33598 -78030 105127 -29641 50013 -242001 -159203 -28817 121922 -96085
22041 -92070 -10237 -44808 80128 45542 -56527 -94082 -24182 -446168 -272802 145257 -233611
22029 -455920 -159214 -32780 34329 -42712 -355637 -42811 139737 -56370 -241187 -219500 -35228
22017 52113 -14214 -67796 115916 -157498 36625 -35731 37216 72845 244093 -42522 -160526
22006 -160526 -208391 153204 -54333 52333 -106859 74895 142827 -58812 -35751 -136832 55349
21994 2558 -905 9255 -205052 -482690 176436 -52180 -11244 -158864 -21878 -245687 -174121
21983 -174121 -121809 5041 -205084 -120998 63101 -132436 -166731 86325 250956 112751 167294
21972 167294 86602 109976 115755 202330 -310746 58916 36550 -188030 274242 110816 -32377
21960 -13032 -128474 -55365 41460 -349977 -246601 -115748 -65860 -300567 -89417 145661
21949 -205288 -228831 -131677 -38308 203157 75876 -210680 -113361 109852 -212156 -148166 38300
21937 161241 -64023 49374 -127407 -190640 -133563 -210725 -268058 -152627 -107913 36004 545
21925 58653 -210578 66591 -250940 -244674 251037 -84573 -234398 -1505 133827 114194 -78511
21913 -3584 50540 20472 368277 -220869 -144014 -207036 132779 84737 -138782 -21434 12890
21901 -266648 28015 -534288 -221859 502130 -36106 -77439 -4170 -107777 178174 167637 -102017
21889 -240474 -87255 408004 174054 257393 -171309 264593 3848 -196699 -167043 259607
21878 -373382 32785 -74426 -148305 -49988 65628 -322187 241973 -112131 -251531 -173025 66212
21866 114327 -91942 -73695 -25711 8029 179597 -52491 -56807 -114918 13481 -115035 170747
21854 -49940 -74755 -215439 -12718 -135317 -148898 159740 -157895 -178994 -78143 109841 285099
21843 285099 -231902 -36327 -335398 84894 -73429 -179108 -147773 60003 -338922 -142496
21832 111285 -235284 -248679 -364885 171984 -160030 -87246 -199772 73352 -49007 -13350
21821 -103859 -176402 -88343 -359836 81100 -119006 -64068 -51073 -49871 -302795 177091 7183
21809 -112959 -189744 -193271 247955 14037 -256043 68596 123124 -101551 100965 535358 -108609
21797 184539 -368233 378594 -199321 99961 -30461 152851 109612 8874 150182 209329 -191187
21785 91149 76575 -18086 242924 -44188 -252396 91832 -257205 49970 -231203 -303441 94641
21773 20394 -20273 -27330 8845 366990 236610 -468648 -171012 48634 267380 -171122 -40339
21761 -53505 -224262 43663 34176 -197784 -370171 -131444 -302714 102939 -422594 519361
21750 96159 272422 -3991 -18808 80887 -82990 -67968 -20046 -25152 -2250 89137 -291909 446146
21737 199783 -158465 -4721 -56091 88368 -13216 -198987 -287000 -70398 -107842 118498 -309229
21725 38085 -134208 62582 -203913 -133261 -58512 14678 48857 -197810 102217 32117 50662
21714 50662 1084 268168 -27023 106211 -156189 -20464 -231027 -215559 -101038 -193093 146872
21702 -84632 70592 -160538 -28941 -14826 80175 -148140 73456 -140599 -117172 276225 184174
21691 184174 -104511 -317232 -137246 -93912 -365634 -71974 -69237 13183 262905 125860
21680 -88485 -7689 -22702 74865 19608 63640 -164711 -310953 44155 -109889 -32241 -109592
21669 -109592 -52579 325838 73464 157181 -38729 -359861 160020 29692 -21536 -44955 -266838
21658 -266838 -206470 -210363 -39810 128650 39164 -44768 -71488 46647 158404 -58030 -82080
21647 -82080 326224 -435535 192651 198778 101162 134013 33963 118883 95255 -411281 -222377
21636 -222377 210528 23015 96987 -121923 -71900 179335 327232 316090 103456 25653
21625 28849 -147216 -12133 62130 206810 47715 -302076 -9840 -10031 225742 -54235 -160618
21614 -160618 -441248 -132990 134524 -180374 -308325 -80262 -182187 -222394 183731 30001
21603 170833 262554 170736 -24085 -17926 212237 -35216 284844 91123 -228346 -3150 -157464
21592 -157464 -98722 -36423 63551 -243845 -83069 -96112 57169 -342768 -225068 -272140 -480978
21581 -480978 290309 131037 -109635 -118258 45693 -60250 32535 28346 48277 -79438 -157220
21570 -157220 124085 -229238 208486 -223401 -103772 -68820 -388781 96569 -63894 -117512
21560 -117512 -43723 -112621 -17356 193055 -126241 -59422 -80672 71119 -315501 -175953 196943
21548 181719 -180277 -104390 -333534 -249150 -228464 -178932 -249255 193288 -245803 242018
21537 -131306 107379 -203415 135834 -332061 7868 -127950 -62534 -7170 -327289 -69077 103668
21525 -94556 101621 -163607 -203362 -32884 -16138 -263432 -125355 207543 29215 92871 36123
21513 -415795 -71814 -203108 174143 65666 -209568 -51370 37116 -265668 27123 -214227
21502 244798 271653 -186953 -133792 -255121 -33212 -107271 -491320 113664 98128 -281205
21491 146885 -63525 -21287 209313 -125109 15538 -274798 141557 -79773 -435262 -221034
21481 -221034 -93198 -22201 -169080 182287 -179834 55420 151523 -139896 -81566 -9311 -111686
21470 -111686 189521 78512 -170973 -91723 312342 45580 -100608 -75281 1592 227870 -38050
21458 202776 -147214 -24012 -66171 99559 -118692 71622 -152140 -415197 -455631 -44637 -37236
21447 -37236 -83098 -78680 -247485 -309496 -114583 -317732 19807 81554 164078 201004 53599
21435 19900 218517 176392 -48634 183038 -60103 -215155 48956 100321 -15620 -282995 300112
21423 -52759 146691 -308707 -78988 205495 -159575 3328 -94753 -89215 93056 -192597 1256
21411 55190 -145531 197781 270685 -158937 -122433 69316 99780 -144432 -106857 168620 -232472
21399 125683 -368337 -76891 -317509 121816 202685 -135539 -122237 232687 -184586 -429188
21389 -429188 363460 -139909 50594 -274128 -373075 -33866 91406 24137 722 -249436 56894
21377 5212 397664 -183270 92458 13976 -182642 -87221 -27269 17845 -104815 -210230 -205156
21366 -205156 -195666 -56635 150153 -39275 238516 137281 -57873 205281 2782 -384488 -266105
21355 -266105 -101315 6236 -45689 -34510 -87791 74810 -10992 -143540 -344499 -25920 -119452
21344 -119452 -154283 -105280 38817 -108653 -91989 -297139 -45495 17574 -328085 -46524 -99092
21333 -99092 57840 334561 80357 -311200 38358 100246 -65129 6879 -186532 -92020 168735
21321 -17025 252383 162677 15473 245882 -194430 138143 22877 -123473 -155817 -61253 28727
21309 100608 -30936 -264107 264272 77430 -140347 -142365 -56442 50066 26302 -284037 -64736
21297 -220588 73463 59391 45419 -93974 117877 -98748 241009 121938 -21836 -296027 168173
21285 74514 180962 -63638 -194936 -26444 -144024 -137827 15594 -291737 25491 -219208 -63107
21273 -128954 143870 140210 -153646 166524 -153381 -155433 47708 -42426 -161768 -192141 34355
21261 -82433 -247089 189971 -203118 -247750 90847 -165344 -262162 -72755 -87626 -105633 -325487
21250 -325487 -201595 -251094 -258587 -77878 -250606 -199647 -104057 -135098 229008 104784 59150
21239 59150 74234 -163124 209421 82167 -274817 -212669 -141947 -12612 -27666 227738 113107
21227 -88831 165376 31132 -16681 -6293 -3168 -275105 8522 -339675 -209629 11885 62472
21216 62472 -181301 -295048 -329368 313394 25633 -95971 -15566 -44472 -241116 -381489 -88254
21204 -56644 -178154 -173316 1225 173010 -74692 -282983 -208922 -82377 -59782 10218 -59093
21192 98376 105987 -177624 -489579 -124777 152835 40552 -92837 -346497 -65163 -499247 17601
21180 -220947 -274264 42907 27011 -86343 -241114 -48364 -240241 -70873 -8005 -59654 8570
21168 44470 -29035 96330 31467 -48825 -221990 -32858 63042 -71426 -51243 -146537 -198649
21157 -198649 117967 52358 165806 42257 143639 -96337 -111759 -176306 103416 14344 72495
21146 72495 -213271 -275888 -197210 13008 38851 -84040 68742 -190192 -24046 -256771 -98283
21134 192377 -126827 76016 -198339 37335 114707 -107623 -33624 -16071 96842 177086 -271059
21122 287461 -44960 327854 281328 -43195 -18494 25494 -91089 -42880 -238676 268602 -270746
21110 69635 218527 67521 171394 233967 -30219 59833 188302 70359 -232016 -223617 150482
21098 102929 -139212 -114612 -216882 -6931 -154757 -262677 -69497 205782 -153333 111616
21087 35420 -31160 -40706 93783 -459986 -84562 -58920 -213744 61491 44438 -145913 -328827
21076 -328827 158340 -24449 -24326 -189007 -31036 -66422 45025 -26661 -418338 137051 -12891
21064 384609 -11478 -101446 -306031 -19356 -293335 -272450 177891 -234833 -88257 -11555 160329
21052 -168739 -113182 -68944 -71297 -14060 -178205 66788 -231451 107407 152950 32365 20939
21041 20939 -52975 185451 -54471 -18902 -176656 -57942 -107060 273418 69647 -49135 8109
21029 -81492 -56094 64116 -179317 -52477 -311137 -81381 -86170 -34836 -331594 -207902 -251709
21018 -251709 63474 37189 -6139 -33340 191881 -46770 -85262 -171188 38750 -109669 88932
21006 63131 -146044 153124 128568 90269 -307405 -273808 -25902 -110515 187364 -139562 100989
20994 -5030 -39727 -153485 -24325 -7025 24578 16134 -119511 -47829 -145657 243961 -21339 -74962
20982 -74962 -135107 -183496 135465 -112153 -76653 -238829 22676 335767 66534 -73102 -189667
20971 -189667 46336 -127335 186869 -154642 -62934 257582 -171559 165959 -74415 133734
20960 208141 339444 -63087 -143934 151808 -175723 -268570 -441 -113719 -57924 -102397 -86567
20949 -86567 -419064 -218631 41730 -238663 -106752 -413437 -143142 79047 -195304 161942
20938 89879 -100684 -120417 -147842 247247 -169354 -151359 -142290 -34644 -270318 276525 -189311
20926 -232629 -4252 -363540 188029 -136739 31052 5519 -371283 -4813 213141 -409440 32568
20914 -129461 96550 128430 266814 -50516 -144569 -89489 134436 78724 -24405 133822 -200647
20902 -136916 72590 -120537 -204689 -58605 -197338 378451 -158308 -186025 -20570 -306651
20892 -306651 -104208 289076 -288239 94669 -246327 -340902 -149813 66933 -178656 -368647
20882 -368647 65216 61769 -159424 -250168 112315 -594832 103156 -13352 50139 159843 99825
20871 99825 -52079 -140676 -71423 116272 83648 131178 -358227 11780 123227 236758 -141792
20859 -194720 23669 63002 14420 118587 -300761 -113200 14397 26115 61045 145570 -179969
20847 58808 -257826 -255498 -14930 -372927 -168688 -395428 97395 -85345 7337 59473 -227464
20835 -14079 -364650 -287237 -24685 14405 -179797 46892 -102832 122540 154239 -188985 -301090
20824 -301090 23872 -116273 74903 -358251 158299 -46981 -209436 17148 -306441 -241102
20814 -241102 108222 -274513 -482755 60102 34546 -55441 187966 -202362 -92974 -206387
20804 -206387 -71000 -27422 -290232 139010 -2397 199735 -164230 -231485 -56997 -159083 -22705
20792 240133 -527634 -99364 -160974 -122180 -49412 -245739 -38933 -111097 80276 -25616 -77499
20781 -77499 -58213 -66479 207323 -74902 72385 -94785 86485 -285029 153608 -367568 -27511
20769 2117 -12677 -256363 115391 -193298 -218357 -418383 253420 -31703 189284 -276704
20758 -248811 -180209 -220872 -239884 -89710 -241791 89199 140098 -146891 46016 153331 44910
20746 -87692 -98534 13576 41273 -92722 120637 -217550 80428 -113304 -71871 -3382 55628
20734 101072 -106342 10037 -136358 126809 -66980 -89497 -302631 126365 -199058 80303
20723 -109120 -205220 -209288 116290 11174 -187517 -161432 245886 64071 -34628 -222288 129996
20711 -137247 80113 -318578 -81770 179663 104825 -70134 -189879 -61315 92019 15440 -111470
20699 -231572 184765 -289254 -22287 -342652 162716 -357288 347519 -22003 53794 170522
20689 170522 -350823 239398 -201577 57147 254519 -73858 226487 -89878 138193 -118522
20678 215371 -160088 -142012 -75932 -54588 -110310 78550 -101917 409189 -163713 192933
20667 -110836 -187508 19492 195274 -35515 9226 -126742 127582 -61135 -152733 -126733 159024
20655 -46011 -138810 -179499 245940 -308389 -285619 176414 222111 -12083 -25818 84216 50589
20644 50589 -213077 -106523 117975 -116659 -264435 -209487 8272 -179638 -151390 27811 -65802
20632 188969 -52010 114181 -198945 -188886 33208 -119005 -81729 49412 4046 -233029 191558
20620 -1478 246898 -30928 47066 -31128 -434862 -76071 29200 -342758 13987 -15169 268154
20608 -50252 34319 -102984 54658 -141160 172867 -237545 -253288 246188 -313905 212269
20597 -260251 -144833 154515 -50377 -73010 -185805 -396836 181120 -312137 68238 138692
20587 138692 -54541 60981 63019 -74854 36352 143331 61509 -129607 -10440 -10128 68157 274002
20575 274002 91207 -131345 135880 127304 -51809 -216056 -181556 251316 17777 -193296 -103868
20564 -103868 -146762 -322161 -192593 -39096 -123895 -177118 204511 -251689 -135556 115194
20553 122694 308897 -9795 -5916 -354712 -14068 -85885 37558 378872 52572 149360 85604
20542 85604 314169 5798 -38303 -122590 43539 -86092 -212515 -160246 -111974 -7801 32054 150844
20530 150844 -259009 -287773 -351251 234234 -514624 116688 -147466 -142810 40700 -164770
20519 -25340 -13759 -364475 43529 290984 3779 13168 49190 -61085 51845 -210325 -339048
20508 -339048 97640 -44060 35067 58273 -155049 1107 -45755 -12400 -166063 -269126 -27478
20496 -43669 -4073 -256822 -67832 -185491 9864 -90535 156812 -302936 181997 -87155 164905
20484 -137211 -238915 -111728 -170379 101635 44910 -86702 52731 -72123 -226788 38446 154
20472 -67933 -223895 -83834 -82741 76346 197947 218172 -272174 -10586 -262580 31051 -51888
20460 110228 -54226 82762 214757 36590 27397 132589 -87407 197489 -90032 -107662 154688
20448 48520 -82272 305403 29183 80815 77567 28236 -219816 -317357 -57966 222604 196551
20437 196551 90524 155853 -117604 -118968 -102916 -224781 18779 -136269 -368080 245881 119652
20425 -276227 -101130 -16890 -24863 181561 -314914 92796 135537 -271196 -26890 25063 189995
20414 189995 178809 192123 -200179 286696 -298530 -295699 -52776 374060 158057 -49961 156162
20402 65677 -292564 -35358 -170948 -184720 120002 189706 -251923 -76389 171707 59133 -34143
20390 -135322 77700 151548 -94795 -432197 -64792 -37723 -365617 -109537 -32327 178586 -270921
20378 -137155 -87042 -283026 191270 -208517 -91947 103947 71906 -31295 48728 -399494
20367 -64509 268338 121820 128978 -391798 -86147 -280758 -97800 -123710 201631 -22902 156772
20355 -155954 73205 -67517 118806 -172836 145200 -45978 55862 143761 -57428 -4635 144009
20343 -377585 -330007 -13410 -145835 -253902 260084 -25943 149831 -311998 138187 -13964
20332 -235984 -81561 28492 120196 133280 -69230 -232465 -456324 -243301 -143846 -27719 -163100
20321 -163100 400094 107951 -95757 -1593 102430 130277 -39416 -75079 -187139 -106168 123817
20309 -171169 -31849 -445573 -194409 -192532 -32537 -174275 -279640 -149720 -95135 389686
20298 105248 -140684 -205330 101496 -101404 95003 231682 76829 -413084 -86690 -227283
20288 -227283 -338953 -40550 -75787 -215338 69417 9967 -296861 -180713 -183565 -73190 23566
20276 -199251 191551 -466285 -140420 179612 -223109 -141051 -265808 -512632 -68587 -175157
20266 -175157 -81071 311922 80988 -87239 -85206 -285382 -22656 74997 221707 -230597 -40897
20254 -249646 -145034 -32320 46065 -57530 107089 -261434 432677 -311160 248327 -74795
20243 -57272 52307 -364591 -40593 41635 -12427 31029 -162654 -117369 -193459 -227479 -210505
20232 -210505 -291705 -80788 21297 138838 -5710 -133689 -59750 -47024 139241 -71381 -214590
20221 -214590 -308387 224343 123523 24022 -53409 -115701 -170980 -337709 1998 -352881 -233898
20210 -233898 -87289 -130670 88310 -370885 -123584 155629 2513 -19593 45084 10814 -92175
20198 -41553 24534 -30347 -7740 -166778 105365 73087 -59654 276132 226612 -174421 56013
20186 -191273 171470 -271695 -103257 140859 -146197 137997 -10601 -169857 -36742 22061
20175 22269 419794 -38704 -81540 -281678 -67651 -271523 -49445 -199273 -34904 -26082 -30374
20164 -30374 -113559 -146178 87390 157134 135465 -124698 -55928 -165614 -112336 -127975 -24602
20152 23310 -264411 -188934 163583 180864 -56086 254389 -111474 -157475 -52294 -62430 -355247
20141 -355247 31751 29566 -101424 183995 205666 276004 -91120 -231566 119950 49147 -54749
20129 -337127 86727 136625 177151 62868 -48548 284660 53812 -8456 25972 -266296 94442
20117 146524 -148885 42441 100019 -4971 175821 -321770 -354673 -367071 -166450 73334 -247694
20105 31152 80380 -45094 25256 -119386 -55412 -207591 -153966 22935 -310212 107534 -309477
20093 155049 70498 -344646 -110559 73090 -240503 -82030 191905 -37112 64966 47968 172969
20082 172969 -127223 -246814 -124164 -262489 -417459 -35060 -70543 -192505 -78698 177899
20071 -138695 -132291 -83406 232215 -187049 -134080 170025 456651 -219934 19385 -214086
20060 -94326 -73605 -126287 12364 70554 68266 -186870 -121659 -189542 -153001 156076 112150
20049 112150 -17528 -233729 -253105 53076 -503297 59584 60307 -299696 115736 -12606 -3372
20037 -14165 -76928 -242751 -84106 137751 -41132 -90687 -289795 -80167 270493 -296384 -319020
20026 -319020 -6380 -64509 -59670 -256743 28644 -117390 -539462 186583 -94481 89178 -167216
20014 -256260 -334794 -226858 97159 -13588 152469 -363484 -262633 87914 -48117 63477 -194512
20002 -210165 68321 -231407 165851 -291866 183210 76601 -322806 120174 -36730 -29303
19992 -29303 -283332 33248 142971 -16396 -222111 59916 -347957 224933 -335861 -14724
19981 -118280 -106528 -40245 -40458 53004 -107038 119994 112228 -83104 -79442 -131397 -166606 -261
19968 -106053 48287 -118307 4449 106677 3814 -39053 43359 -188344 -48794 -58858 -5479
19956 -247912 -268463 27518 -254925 13647 -116108 110346 -135115 -108750 -153851 -330887
19946 -330887 -296608 -281984 363805 252540 182773 72296 -270785 -6528 -233657 -89413 -104957
19935 -104957 231268 -173128 -414590 121759 186570 227306 -370703 -144386 8719 -254223
19924 245960 368651 -55382 -49876 -197489 63046 -68419 126722 -299844 41909 37114 189892
19913 189892 43042 -210821 24296 -156041 60024 -222018 -182724 3081 -31538 121833 -18062
19901 93159 -94080 -73126 -110732 -92710 -30451 -322978 -95684 -61639 -37970 32921 -40232
19889 -67139 -11288 254103 -212362 129639 89173 -332315 180989 -23954 118186 52161
19878 -416289 -191384 -41741 106093 -128451 -115250 61801 65165 247295 15307 -258864 3888
19866 6504 100531 -203137 -34732 113316 83824 -65715 -107337 -271957 185893 72508 -399889
19854 -57875 -230701 81740 -120183 267263 -13080 -60793 44679 -237532 38265 -102304 -262731
19843 -262731 8213 74083 -3564 -160258 -285586 -201822 -142415 65477 21254 82491 -194028
19831 296969 245507 -272744 -230291 127107 -13547 -27188 5768 248217 -93215 -190467 92830
19819 -103952 -12994 -69483 -163679 -200927 -274721 67093 -216842 -159241 330578 -3348 -259522
19808 -259522 -122011 57662 -144514 60402 -204489 -22073 153702 -28193 62100 45617 -21455
19796 -132169 -90259 -170595 41861 -111534 -30926 -109343 -172230 153752 -72462 -16299 22732
19784 -83543 -16534 -475046 203905 -18091 -4569 152528 310782 89914 -214601 3604 8510
19773 8510 29180 -101867 -259105 268578 -516719 -121885 -319051 245497 -171891 -394168
19763 -394168 -284059 -107300 -239196 10891 -34859 -361180 -158503 -138932 -434867 -222196
19753 -222196 34173 245120 -25654 159090 -137051 -187422 -307461 -48938 -311511 -47919
19742 67820 3138 154067 -38441 18066 77267 -129292 42065 163328 -280364 -283856 -133428
19730 -106918 -56934 123314 -160300 15782 20267 270376 176950 -16128 -97521 270144 153353
19719 153353 -151691 162876 -13767 11457 -26110 277702 -134393 68277 -191111 87645
19708 -288492 234506 -52923 -356717 -246344 -99525 152262 -68244 16987 -200402 136340
19697 -163000 45361 -48676 -115677 -31657 121056 -206183 126629 8795 123343 -203037 -302525
19686 -302525 -77067 80473 -233457 -278962 228793 -41509 22822 106505 -131893 -183323 304016
19674 149107 -226851 26162 -164483 -26142 52062 119059 -267746 39859 -126229 -61873 -188987
19663 -188987 -139198 21169 -27451 -351196 140437 -312502 98907 -56057 -81819 254748 -76851
19651 -504643 22298 530679 10778 -121610 428903 -78216 -455645 -240387 79023 152068
19641 152068 -11942 -15110 3074 -37028 156588 -341068 -133955 -79311 -61827 171395 -257792
19629 -240072 -184711 -164185 188218 -314347 -85632 -106346 226631 -344905 -191832 -331991
19619 -331991 -220022 167198 124001 -377526 -41212 -500543 -104601 139618 281959 -22535
19608 136709 289092 -19395 158812 -119561 319633 -218293 -271769 -129690 -148264 -153805
19598 -153805 206651 -113360 -193494 83494 -108559 71959 -3155 173703 -70526 137214 210888
19587 210888 -425529 -60899 -139078 131591 12060 -15040 -207977 -30168 -234803 -159183 -72207
19575 190921 114203 -228472 -249204 18035 86847 -20973 210722 74075 229164 -42910 -73379
19564 -73379 59722 -62935 -143147 207644 -1979 -23278 119417 -194441 -156554 259736 208740
19553 208740 -144588 -77212 -18077 31072 -315783 33429 -25619 -215369 -136573 -155548 -231765
19542 -231765 87111 -65912 -299401 -107949 31806 -89240 -143532 81026 111556 166917 216590
19531 216590 -58879 160263 -158241 -226795 -455934 133860 70831 -558096 -322975 -221308
19521 -221308 21337 -339331 -48913 -168584 316323 -113135 37480 -189294 -59051 122563
19510 -195485 -280753 -160589 -221016 71768 46176 79994 -118709 -90977 -20090 -183956 -102592
19499 -102592 -302913 122885 -143632 -103639 149698 -22009 9378 162004 240804 65533 44299
19488 44299 112652 -83114 -107874 -127865 68788 -187814 -240432 28798 -159037 -493667 -137750
19476 77055 17045 46897 -20787 132467 -160600 -267475 -89229 -19228 -130441 -343056 -3115
19464 146616 -224831 -94664 2671 -23329 25176 225662 -211268 -213576 588 -210508 -235299
19453 -235299 -159793 -147825 -90818 183146 -11443 -264453 -109742 92371 19858 201081 64642
19441 -327308 955 -127123 6985 -115618 105272 -43519 71116 -378386 5406 -6194 -188368
19430 -188368 -117987 33911 217928 -198418 -37289 444514 -246136 -8187 -262950 -119421
19419 3151 -149994 -132871 -317976 271124 82475 -93961 -81576 328046 -154261 -187654 117890
19407 169567 -202865 232520 62501 323921 261685 27902 -99832 -226715 -356107 -76197
19396 37738 -353883 -50360 -164427 -55655 -202033 -258566 -18763 -224103 -133475 -163718 -153123
19385 -153123 -68990 325220 -126070 -108119 -167089 -257408 -18183 -229978 163887 -34400 56455
19373 39572 -12369 199368 -105137 64245 292974 -620450 -266560 -432564 154135 73853
19362 198298 21308 26373 -178196 -18251 -239470 -255593 -67628 -131284 52114 162932 72570
19350 -62654 319168 -309187 -5715 150950 -132427 -317869 86222 -161187 73739 -51241 -87614
19339 -87614 -186291 -159869 -280974 -37359 55977 -163087 212877 -92235 -188410 -11499 15960
19327 93589 -249444 -29561 -221911 -157155 -308609 -78767 530 -360799 -99013 51847 -180074
19315 -42566 17197 110904 -79989 -170833 -241473 -253797 -369301 -70336 -199696 206011 -107070
19303 221536 88041 -248242 8305 -253379 133569 -136064 26420 -150998 -438048 -154927
19292 81350 -454769 -123088 30600 107362 139055 221276 -236613 -405995 151695 -295942
19281 107928 -191417 -134792 -107486 -48916 -15504 43899 -285910 -58943 -267677 -136540 -111278
19270 -111278 -178639 23629 -112228 -128712 160533 -39747 291721 58935 79137 14668 -111337
19258 275650 -201135 15081 -56592 -32399 -32843 -11050 -174325 -264402 -110088 -84510 -118339
19247 -118339 -358278 -117393 93452 93180 -143321 -161621 -193661 -190357 244174 -130256 -136058
19236 -136058 -4256 -280418 -255850 -206141 19478 -281477 -159858 -254290 61543 -109640 -72897
19225 -72897 -135110 34452 147315 -157794 -69515 146287 50462 87387 168035 148516 155179
19214 155179 -228565 -176618 -3808 -14340 62368 -267905 16631 65593 -65186 -125229 -211248
19203 -211248 201198 -66883 -117868 42137 80784 44695 -49113 -184733 -58628 -294836 -80011
19191 141861 -213206 -110001 148820 4218 -27727 -27902 52087 -88926 -27509 -325089 -157210
19179 -263600 -136688 17963 -160201 -168313 -51562 -78728 -122483 -85469 273219 169674 72766
19167 12531 132374 22594 303852 -500026 -15846 -51199 366954 -136493 -87955 102708
19156 96002 167867 81989 22926 -327896 -203246 -4991 -279453 172090 -102417 -243067 -108624
19144 56069 85113 221786 -340803 21303 -185701 -162550 44954 387601 -141634 -158148 -4062
19132 -262103 -296131 157669 -225105 -57460 82422 -48202 47818 4619 -82695 -72525 -182228
19121 -182228 -309394 69880 -154829 -231012 -70534 188796 -403754 -33525 -340391 -196017
19111 -196017 91226 -196815 -37831 -107330 -371208 -375060 -225382 -15481 52295 -9238 183556
19099 -140858 14692 -84403 163786 182836 -184761 -169091 4212 -160085 -287965 -215573 -282622
19088 -282622 68567 302447 -82016 15527 26089 53447 -50656 149531 -97957 -393490 -77104
19076 232325 -306875 331774 -238081 -166352 145631 -19580 -327220 -30620 -95202 -81991
19066 -81991 -105 51295 176019 60373 -11583 104394 120809 110314 104398 -221518 174357
19054 -200072 124328 36430 30400 -22721 -239875 -250073 91180 -186738 66100 -161276 28100
19042 -230780 43418 -369643 -51208 9921 391950 24672 28860 -262711 -24417 893 -96499 235140
19029 243455 9678 201613 -4069 360731 202706 -149211 -14022 -322400 -57441 -41241 -41845
19018 -41845 150866 240411 -275899 44153 -22551 3201 -272914 -235565 11546 -174376 -16822
19006 30294 -62912 -94032 299419 -150793 -67958 19599 37137 -49845 186324 123210 -209343
18994 179145 -109080 -146157 -137886 -120529 2794 -9172 6747 318417 -88662 -86674 -277039 171839
18981 -173827 -294909 -19279 -95454 -215856 -109582 -155879 -166303 -78704 -108091 -309338 25086
18969 -131394 129114 -294290 101611 -103203 -138431 -187906 -107247 16025 -70029 -93114 41691
18957 -162438 -174229 264663 25135 110031 147240 -346526 152664 -40839 -41795 -114436 -28288
18945 -206428 -192867 14566 -119372 173949 -122973 124184 179213 -157213 -158608 -203278 -201554
18934 -201554 -3422 -66672 -175718 -62533 81563 21611 -189977 -97404 -137089 100366 -369581
18922 -1363 190752 81830 -45384 43991 91266 241696 269302 114430 -217521 -40070 -60841
18911 -60841 -251828 57515 207471 12653 -367092 294543 12248 -171450 -54957 -76817 -52993
18900 -52993 -39982 7741 -49136 -1195 -417949 144721 -94536 73720 56673 -328262 -231501
18889 -231501 -43559 61174 -113298 -201379 -150251 -191191 -273858 -187933 -42356 231310 31551
18877 -56577 -178797 -112506 -157780 -28731 -88123 -202338 -90084 -57178 235334 -189769 44639
18865 50096 107660 -233315 -86955 108897 -302335 131021 -251811 -359736 37356 89560
18855 89560 268252 -65845 -68850 50548 295599 -400209 233550 215941 -62980 99097 177898
18844 177898 160497 -108707 -164456 -146458 3579 14724 -277394 -161302 97475 -135466 138958
18832 -180434 -48026 -97542 -3618 87805 39277 -103675 178098 35896 -24830 -3950 -82676
18821 -82676 162981 -37316 263508 -344401 471684 123726 23521 381484 -46461 87457
18810 83403 74407 -80051 -94671 24340 201425 6476 -107727 148149 135029 -46070 81682
18798 -125343 -282613 -68600 12631 -214345 -62973 -289699 174313 -170025 -168133 -278635
18788 -278635 -317757 -6188 -96520 -226396 -87300 -78574 130003 -124933 135515 -92279 2777
18776 18633 -372164 208720 181911 -134205 37565 181901 33252 165129 -284299 -197317
18766 -197317 -326620 -212982 -394554 -233441 -253817 -73981 -141180 -93954 -313 128685 -25578
18754 8076 -124404 144684 100960 128237 -131754 -97081 91882 -145181 -217708 106 -100060
18742 125606 -229422 -342630 -66229 -278742 182197 -329135 6094 -182597 53454 -64031
18731 73296 113687 -15572 -149285 -28606 -86940 43261 -74165 -279026 -21778 20827 -172410
18719 -9854 -39289 -128289 -229386 129651 -320224 51649 -273051 -136493 -171732 -47219 -200700
18708 -200700 141474 178804 14503 -343241 -118360 69226 -170969 -126527 1053 -199916 22492
18696 158460 -308478 161566 -1192 265616 63036 118942 312926 61364 -92005 87273 -5417
18684 -178298 103537 -133978 -269213 58608 -239166 102722 333056 24614 -146783 -234053
18674 -234053 20723 -36698 23919 -56025 -183598 -209260 -214820 109514 215456 126072 -48467
18662 -495863 -384257 -160973 -42617 287182 -13695 71139 49169 -68845 -33010 40126 50927
18651 50927 -144849 -9486 160886 -27186 133674 109584 321252 77106 -113934 107029 2446
18639 74215 -46779 -245651 -5339 -45607 -436324 -211447 -181487 -18146 -50276 188151 77405
18627 -220481 -409448 -206014 -75156 63584 -5475 -160770 -577268 -42357 -53904 19778 -145118
18615 -171412 173691 -51912 -91146 -212098 -166446 199866 86013 -210416 -158944 118782
18604 112135 136923 138953 -23082 -142528 45046 3713 146641 -100111 -102015 -3019 -128112
18593 -128112 -71325 233505 -131049 -168793 91473 -98303 297401 -147384 324732 -102928
18582 -259059 -77795 -104493 7503 12134 -62124 -288413 -398143 -78603 292934 -103376 62964
18570 55388 -346718 428268 -250203 102721 -317454 56192 84419 -1024 211876 -31919 85096
18558 -202309 45307 229675 221129 163773 -205632 -441752 66680 53975 -53001 253190 -288676
18546 86556 -21876 180051 123272 124029 -82572 -115866 57957 -201600 -65572 245632 156103
18535 156103 39335 -45064 67659 6471 105983 -86151 -479314 -104665 -204 -289108 92812
18523 177718 124217 -163253 86042 -164662 -27279 -239795 -70767 -28268 -300873 -161767
18513 -161767 -66001 -293364 -235928 -237968 371439 74558 130162 -118634 174309 33936 104946
18502 104946 138314 -134210 -50392 6747 -58106 -210780 70557 -153745 110948 -24868 212598
18490 30478 68251 -24700 -304061 -220216 -373202 -187912 -233469 -68053 -211910 -94042 59634
18478 132273 612 -24920 124123 -62572 -61794 -414815 173248 -58918 205071 -112685 -267595
18467 -267595 107355 -215865 -64417 165329 -86180 115571 13436 -116797 81764 -78644
18456 52483 36907 -159282 -51595 262953 8049 -28002 31056 -227790 44966 -233518 32132
18444 -269650 147425 -260221 -263740 344220 189302 29635 127254 151164 -130336 -418612
18434 -418612 -30576 -132058 -137234 54524 98688 369253 -170735 12520 220164 183625 -78918
18422 -77473 -348469 -143792 218565 127787 -134098 -112838 42254 -200308 -223991 -104569
18411 248904 172348 -204295 -178719 105527 -175115 -44628 188999 153815 198444 -99829 -128353
18400 -128353 -172255 196557 -190879 25570 3523 2833 70945 -269721 -147032 -301368 172738
18388 -233216 29887 -140859 -197222 -341425 -257445 -177605 -341925 50595 -228966 -86323 -221609
18377 -221609 -334108 19782 126606 -104133 267835 151570 -97673 -12711 -44058 -261873
18367 -261873 -111442 -107186 -17794 132680 146614 36437 -362955 -17216 -112940 319417 -130024
18355 -195232 31668 -53295 -74332 -25029 232295 115776 114170 -455174 -102912 -172185 -92654
18344 -92654 -84045 -33599 5622 112257 -30467 407641 -212669 153542 -12962 274393 -221588
18332 -254695 56247 -268306 24912 71386 249265 -452570 13091 13549 -104335 -151050 -202509
18321 -202509 -377718 -43724 -162054 -408654 -78063 -67760 -180802 359082 -333460 -22375
18310 79848 -61587 -78467 297170 215801 -18969 150288 219573 -4272 -18723 -347287 -404700
18299 -404700 176400 61877 -47197 -172272 40388 -106281 186945 57617 -44212 116843
18288 -24226 135493 -28862 248065 73398 -88112 -299022 74732 -207475 92761 -155270 -84953
18277 -84953 -91145 -353251 100333 41762 35768 20573 11698 -45706 -61173 86097 232156 264423
18265 264423 122379 56956 190216 -145855 172316 242559 86112 9394 110092 108770 -196763
18253 164818 -68174 -239581 -28495 235755 153317 39775 73331 -31675 -72242 80204 -192
18241 -73236 315184 -170116 -185546 -105967 12134 -86354 -143230 -128157 38144 -163173 -156185
18230 -156185 -156359 259054 52892 -167901 96962 28766 79129 -45779 3336 -569596 174576
18218 -353478 -85304 31773 -96555 178831 -40503 293821 -311471 -137300 -144630 -95603 -133382
18207 -133382 -268077 134432 11288 -82796 54613 -26143 -150531 -207164 -320066 79996 126475
18196 126475 92995 -131238 -16033 -180197 -144735 -79618 157558 239408 -205004 -50580 117565
18184 -164745 -236159 -104580 93127 -55998 -225144 -167311 -376966 -105009 -175456 218676
18173 130221 -48078 -274466 -261279 -42458 -108906 -157274 22359 -102168 74528 -13226 -270687
18162 -270687 162979 -197009 -72963 422157 -124542 133873 101069 68918 -138230 242990
18151 -179730 24959 -272168 49386 416033 -70208 189478 9430 -138183 4335 95807 153525
18140 153525 -67073 -87384 131961 -85924 199840 33264 -2538 -126189 -93600 -12239 -189471
18129 -189471 126760 3876 -406678 -265060 -140778 -187338 141978 39 -160506 -76229 -191525
18118 -191525 83219 -11154 -233513 -309 -10047 -79506 140405 258119 -234523 -240819 -17481
18106 -286040 100395 132442 8478 -83558 258395 -204608 -163041 -190158 -38257 -93974 130142
18094 255242 -131094 -280168 -190416 -197317 71342 -359018 119923 -135126 -91785 -149935 -42170
18082 203572 -434526 -16513 -59997 106189 -68026 -97576 -114026 132350 -20605 -255100 106139
18070 -107089 -42435 237294 157544 -309848 -145235 166520 30292 216464 11476 -203438
18059 -190408 -49812 -148804 165519 -95600 244054 13025 -40639 -154648 92542 67545 95792
18048 95792 70514 -13076 40863 -232572 217824 -54735 71963 -136143 23030 82277 37858
18036 131026 -185719 -324716 182255 -314919 -146301 -113076 -64982 -57701 -78183 -187270
18026 -187270 160006 355453 138205 132232 142926 -3944 -119054 -213766 -4503 54546 -318294
18014 -84042 126288 102477 23156 -187012 86119 -306385 -110247 24713 63872 -303098 -124030
18002 -249307 -343468 265147 -119242 43499 126684 -7826 -237570 10960 -27514 -230389 52325
17990 -84518 81114 313386 -233550 -219297 149956 -23771 84244 194261 -194596 -13767 -103900
17979 -103900 58587 1764 -194132 -88088 259950 -44294 332928 -38601 114849 -120007 -274993
17968 -274993 -122594 44867 -7720 185492 -157325 139925 -141671 -19431 -72688 -28449 61220
17956 121575 -69623 135869 -118004 -174514 -367083 -23288 -26478 -147243 -67409 -26849 111623
17944 -272089 35076 -31950 161818 71272 -82067 9999 -91691 397007 -209789 -89497 -96964
17933 -96964 43011 141545 318762 130051 167530 206078 87839 -63498 -13783 134815 78520
17922 78520 62991 -200911 -5416 -56970 27096 -13437 -56125 -250418 249986 -123459 -112816
17911 -112816 -93291 -298399 171274 -161385 332861 -130493 178497 -105336 -127187 48420
17900 -251630 -228087 -324234 -101684 190246 54015 -158351 -37816 150001 -142593 -14691
17889 -97725 -229920 -228837 -100897 -350011 -225092 -186799 343359 -205412 -6296 451410 -77620
17877 -151263 -181186 35041 73609 193680 -312537 -156278 -243483 170376 381317 -235252
17866 -257088 -214047 -100702 -191600 -253985 148754 269733 -149441 -97874 -39766 150022
17855 -37031 -363763 66388 -9611 102111 108903 -44799 -107535 134540 -55893 258294 49521
17843 -85758 -71738 -214981 57411 -286583 -54783 -90629 -180528 -15495 4398 -235800 20135
17831 -16352 137757 66169 11589 -140016 81649 -161290 -49748 -156636 -23210 -140433 -272260
17820 -272260 328533 84506 -445964 -24983 89223 143419 21571 -4842 114762 85269 201812
17809 201812 151500 218021 -177822 150675 -3069 290979 112981 -108991 246335 41489
17798 205729 -198986 -41049 -134297 -154641 215548 54139 -160828 -42850 -26580 342653 -65265
17786 -178477 -53105 126373 -120271 -65883 -340935 8658 -53681 30102 34099 282499 161590
17775 161590 -145213 50230 101564 180780 13880 12368 -266362 262209 255978 -251703 -117134
17763 19174 357006 -145200 -169491 41996 85661 145534 37032 -124202 -83958 65318 78127
17752 78127 -40313 -125272 3209 -104022 223643 -119520 -42697 -5811 -12827 205607 317733
17741 317733 285422 -62242 75439 212093 90970 103231 49871 -36620 280368 212878 -196583
17729 90597 86225 -145850 -52472 111249 -90238 97278 -14109 -181962 -19575 -194267 -79773
17717 -259623 -294737 -104130 2663 -314279 -71044 -138059 -110731 -196579 -66313 -18505 122207
17705 95612 -104713 157775 181113 -31540 244644 -90543 136715 152920 -158364 -43179 -77122
17694 -77122 -2377 -32483 212404 287922 -83017 -203149 -62404 -103588 -48444 55835 -31849
17682 -21381 -261401 -28638 -55555 64509 11225 -158225 -88782 -15905 178143 459909 149263
17670 17295 238905 -190079 -14220 -33625 -61979 -335262 -164062 11846 24549 23798 -107352
17658 45747 16814 -296656 73219 -131672 43153 51678 99882 -125869 8822 -23324 -312881
17647 -312881 213373 95479 -174081 13044 10416 211248 74161 238253 15814 151484 -213961
17635 -54695 294049 -199332 -193993 -169519 1124 119287 297928 -67702 14784 64718 242651
17624 242651 -264136 570509 226945 -7147 59410 401903 -130865 121008 77526 201350
17614 201350 349128 61916 -15517 -6712 245263 7175 247241 115793 -34479 193523 -41289
17602 113870 146427 -75084 -210342 67483 -155302 -71583 177003 -133612 45384 -120770
17591 -29950 560936 48689 134255 -27727 113404 -11873 -30914 94006 202272 -127089 145183
17579 15766 188398 33828 68812 61017 358927 181390 -42083 173312 48843 103322 64769
17568 64769 -140251 53716 74780 -154458 -42040 -44588 277284 -284356 -16187 150382 -21254
17556 356498 -7936 100542 267358 168970 344127 -92902 -100021 -7145 -449 111868 -223496
17544 14268 196042 -40951 -28629 -51184 -12252 -126620 -31061 156798 10889 -116515 -65437
17533 -65437 311805 233308 -16327 135750 105217 68563 12456 90129 -187767 -22105 117948
17521 121769 90069 -40927 -132134 260843 131378 -32118 -63478 -96482 -158073 220 299399
17510 299399 54659 150279 223417 -152065 150992 49077 -23090 38435 107286 86577 232604
17499 232604 -194671 -12565 270406 -140 225065 -54161 85887 -47525 -47895 44244 33194 317399
17487 317399 -26628 37646 127809 86079 -78892 144039 13862 249748 64052 103124 -5979
17475 140037 -304586 158852 192316 -161316 181356 120873 107997 101795 255982 388690
17465 388690 360692 -71612 -115567 33882 -71463 66724 41746 284509 247830 170271 66494
17453 2319 249703 70222 520468 361717 265776 125140 362342 371701 333344 193048 233407
17442 233407 461550 291412 -61566 259196 151240 481943 159764 760540 410080 600708
17432 600708 237240 197231 451994 359665 500920 274164 169120 288176 431345 431705
17422 431705 49015 37030 154320 113456 156136 -82303 -47875 462354 207695 361201 -248781
17410 197726 196178 238554 499131 108940 338905 -16973 130091 365094 -35606 47382 250451
17399 250451 16669 -80679 184705 143771 493585 -107240 366226 54425 110709 23524 241905
17388 241905 182211 131784 265915 313711 -7573 -172817 165303 -12550 -549 320824 -38914
17376 307423 -191415 157818 159723 115822 -54282 -63485 152445 -67912 263334 -102512 84151
17364 236542 235009 233820 -52150 -6431 130354 -44945 134919 -139579 -208948 75455 96403
17353 96403 -35279 58896 185715 -209030 162890 100286 -76747 -49130 274293 63763 175507
17342 175507 265019 164655 227813 79107 257566 130767 70658 395587 76317 130924 -217488
17330 -186239 204620 30738 -102198 152802 147252 114064 214955 435630 55017 -192126
17319 140118 -48978 63938 176355 77302 320174 -31729 194033 23442 59887 295387 94982
17307 92715 -173475 172679 296923 592677 244822 113957 57863 375313 -67744 156543
17296 106385 -123305 214309 452163 368936 424728 -91590 148338 312333 87325 214521
17286 214521 56832 133762 335915 233375 252253 218875 271588 307009 249259 213171 141739
17275 141739 298385 93752 104083 48716 312142 49606 421723 125463 -84273 384043
17264 74868 267707 239069 120930 -82921 226340 331819 293289 406449 412734 305699 227143
17253 227143 154269 127631 263486 169162 363340 273942 287366 -221068 155102 303167
17243 303167 320772 218587 250394 160259 162623 195779 198430 276599 437281 224557 482402
17232 482402 124188 -33177 431437 123587 -177356 53714 566269 -132684 119703 407998
17222 407998 98257 36669 102458 338523 30894 353140 391827 546895 366548 -282191
17211 92985 187116 51480 -43815 173866 375285 -12157 364734 194636 210228 369114 272483
17200 272483 309589 324702 140540 66427 -79957 174694 110213 130859 500800 15309 306000
17189 306000 581476 94588 317608 262290 483293 18138 311747 169816 312957 399675
17179 399675 212584 149426 315140 398406 218310 448881 362305 -34142 391279 284696
17169 284696 119037 58624 271808 25335 401108 584775 382969 727014 384749 434867
17159 434867 318290 429405 446149 241895 249795 132897 108703 66338 -14551 -190202 261777
17147 447806 63047 563174 241845 472582 -40153 88652 436190 -83426 293408 680023
17137 680023 241026 556076 214968 -138821 732518 284323 254377 525374 626140 211647
17126 321117 205929 183075 214932 352454 253350 295645 176292 396311 306341 525301
17116 525301 89625 456995 278126 564293 432882 172495 470278 347322 865598 313496
17105 208697 463324 320962 503011 242153 506297 341105 410392 463405 445852 513031
17095 513031 170970 268328 377501 386044 668529 753495 357075 531362 182577 389162
17085 389162 277700 334207 839444 404124 329624 152929 309189 513060 184749 196585
17075 196585 328252 555428 628328 491102 474980 362309 462816 329522 328185 410705
17065 410705 205404 417123 388166 579601 656811 365252 599345 647416 478049 831488
17055 831488 327021 847585 575776 582038 392028 671174 372731 642712 596828 455981
17045 455981 584831 734186 347170 642728 551388 766189 616453 258111 662344 247248
17034 560942 732623 316944 703014 401658 911207 296045 661410 668364 541787 571503
17024 571503 780996 858930 484712 696469 442501 681451 616641 484248 655961 441079
17014 441079 762360 708072 717962 624661 636049 642114 638852 539168 737536 852112 673360
17003 673360 667164 812141 1004290 660060 895296 815513 684240 809910 832292 624683
16993 624683 644956 995082 712810 751554 730668 632420 640235 741683 705891 1042094 1145734
16982 1145734 787391 1028051 1168473 698096 463242 1120960 852167 613845 809586
16973 809586 761243 897573 732617 886485 1059955 801487 872210 970044 1078439 1234486
16963 1234486 911236 901477 1001881 853853 1006655 1188455 897836 1130298 954676 877383
16953 877383 860871 867187 1023213 1202363 1360850 1166035 1168483 1076778 991796 979625 987419
16942 987419 1295397 1022070 1055207 1301051 1128621 1124100 1238930 1086730 1019113 1033243
16932 1033243 1246546 1297718 1343507 1372548 1502778 1456192 1550818 1381283 1340679 1608809
16922 1608809 1562567 1294259 1362347 1254225 1526278 1697514 1635887 1808596 1470604 1449676
16912 1449676 1477002 1605055 1547619 1837034 1733292 1560774 1651447 1528716 1930894 1820405
16902 1820405 1706220 1563294 1577830 1900292 1565176 1710547 1916017 1873978 1471954 1731549
16892 1731549 2137175 1857994 2267800 1785145 1815060 2131987 2103472 2205709 2054707 2187398
16882 2187398 2310682 2368178 2180069 1910030 2412788 2213942 2348930 2728259 2538531 2302571
16872 2302571 2372862 2462269 2576234 2680692 2718331 2742890 2639423 2610320 3002639 2761735
16862 2761735 2745130 2949481 2838623 2880521 2924566 3195547 3002797 3341659 3145507 3481458
16852 3481458 3187702 3426090 3275519 3557856 3535166 3549293 3956034 3844490 3538399 3698978
16842 3698978 3770284 3647595 4073507 3905956 4150841 4219925 4407136 4242785 4334217 4545814
16832 4545814 4181477 4583395 4209495 4801071 4949634 4798378 4959649 5226922 5151941 5209931
16822 5209931 5160636 5183606 5323753 5788219 5740003 6046870 5915062 6170752 6004190 6516109
16812 6516109 6389931 6583312 6791397 6742625 7178185 7053273 7292748 7224655 7674372 7901182
16802 7901182 8078873 8032508 8253785 8452486 8901268 8805320 8908123 9668879 9412378 9813639
16792 9813639 10036938 10247057 10846430 10742832 11225336 11380871 11528122 11845130 12607864
16783 12607864 12921404 13131770 13928591 14094111 14280899 14772461 15570311 15926740 16033846
16774 16033846 16548967 17489196 17863315 18484000 19124687 19845559 20645392 21329563 22065876
16765 22065876 22865818 23946535 24307246 25488821 26547505 27723683 28899196 29916155
16757 29916155 31186973 32539104 33933160 35260161 36745080 39113122 40233503 42262577
16749 42262577 44503097 46514502 48804518 51049701 53467072 56208126 59509312 62710915
16741 62710915 66047767 69723629 73181723 77261216 81853777 85807434 90450081 95633656
16733 95633656 100962621 106540568 112293842 118076649 123813572 129338351 135447498 140978970
16725 140978970 146838130 152202357 156512747 160634245 164030376 166438863 168038493 168920407
16717 168920407 168735329 167264892 165392846 162154867 158325811 153790717 148525381 142792978
16709 142792978 137312475 131358756 125071752 119178535 112836336 107270761 101395699 95839886
16701 95839886 90862281 85723392 81102124 76572722 72476887 68181922 64630969 61262412
16693 61262412 58114936 54989568 52193120 49527705 46884269 45046212 42529502 40568078
16685 40568078 38697413 36687013 35325256 33406477 32125577 30193254 29173716 28186450
16677 28186450 26856767 25587656 24599620 23486517 22734336 22129536 21049517 20059598 19542971
16668 19542971 19073125 18508463 17926225 16597485 16530040 15912090 15111786 14704832 14308035
16659 14308035 13990695 13412403 12943902 12650239 12562071 11891138 11966189 11446235 11039693 10661389
16649 10661389 10345475 9983693 9785578 9384535 9242218 8961080 8929780 8474567 8380541 7997699
16639 7997699 7794404 7913259 7471276 7472213 7133006 6871230 6839329 6907817 6802919 6475258
16629 6475258 6579326 5988981 6188009 6215223 5867299 5519995 5485933 5296764 4987208 5239248
16619 5239248 4992498 4845204 4598160 4464668 4528254 4596690 4120790 4452953 4331764 4428883
16609 4428883 4061541 3948784 4331060 3877372 3724897 4066802 3285211 3680561 3427468
16600 3427468 3352650 3525235 3353722 3365529 3172796 3070448 3247524 3128403 3055174 2805807
16590 2805807 2807656 3102333 2741999 2914978 2581122 2753227 2622450 2767270 2690946 2428294
16580 2428294 2460416 2494615 2390515 2001360 2419307 2471429 2372063 2038114 2044109 2237827
16570 2237827 2339948 1970061 2284313 2127172 1868977 1906605 1876068 1913302 1796343 1971188
16560 1971188 2109867 1852784 1825508 1948247 2107000 1557461 1565328 1661592 1828802 1556952
16550 1556952 1538142 1485646 1719008 1237706 1356881 1602135 1710053 1800970 1572332 1629332
16540 1629332 1186424 1596135 1703956 1307876 1554668 1402040 1035164 1557984 1460387 1422228
16530 1422228 1174234 1289529 855017 1263312 1038293 1167520 1099929 1074659 1015032 1071348
16520 1071348 1146996 887437 1174203 1131354 1012658 1178675 1049072 962753 1017282 1024377
16510 1024377 975242 963052 1302135 1008677 737442 1127646 1221287 894766 908415 889136
16500 889136 957843 1020721 819348 1007114 778634 984345 870014 864484 1237828 850531
16490 850531 1148624 662114 998337 769662 717556 474536 962091 676210 992569 628817
16480 628817 820062 797571 836653 540950 905262 280680 972746 480301 616114 919727
16470 919727 613457 660188 466007 643632 726934 663434 575014 608186 526940 668126 618688
16459 618688 570073 289267 596445 477312 515126 578557 771765 912617 549761 415480
16449 415480 538413 381671 477086 525595 507512 473186 543552 419491 457520 649074 419724
16438 419724 469127 382619 524126 412757 474828 285765 537190 557628 319091 524024
16428 524024 465680 390241 596548 703868 339594 359900 585683 578589 652317 461776 487830
16417 487830 275072 807386 473761 516815 544328 305950 533883 289699 385725 198985
16407 198985 326705 397673 385624 244933 356484 12554 400288 793049 280362 -41857
16396 87954 236935 264677 290405 448937 429301 584561 232209 255807 274911 488922 401418
16385 401418 331720 431757 485201 321088 457108 363419 308468 128792 -234274 20004
16374 385906 208216 254698 388841 409196 324360 404091 84862 69775 290721 328706 655306
16363 655306 107401 307922 203205 -40349 457318 218960 332563 237401 389779 212849
16353 212849 232388 220424 77200 235249 48370 418063 523931 207250 154949 -19799 440121
16341 216892 66879 92081 40412 291413 350714 215899 107473 295205 -9809 48212 249906
16330 249906 193213 349752 270927 221716 104105 201801 229023 68652 525230 412716 103898
16318 60150 57970 94020 387676 -22284 587132 345717 290370 171396 89206 190731 387587
16307 387587 190875 213148 111172 150494 17987 121607 -24712 238902 -70689 -88232 500241
16295 396613 526167 285173 308257 -131687 -122557 277896 -49137 -336000 52965 -314753
16284 363496 264123 127871 145802 96527 67563 -50756 167155 99612 756 174619 115497
16273 115497 48603 230197 211611 111951 233554 -216623 315569 313700 349777 58446 340127
16262 340127 77171 195308 -157293 303929 159190 -109093 -112416 358814 -118498 -160805
16252 -160805 491204 176731 171093 186550 191418 352616 244329 -49225 -53415 -169267 154475
16240 255804 -115033 72392 244209 141705 -19422 156752 -108965 55979 -287965 24337
16229 -23100 11650 -16019 133239 248781 165286 237554 -12268 38719 -139932 -53713 479772
16217 172426 344520 210499 244773 56483 120365 -248273 -25376 -150675 145297 -58034
16206 51600 109762 78388 -25411 -36122 217755 6011 103388 -19547 -57919 -311250 91485
16194 126220 103466 -247607 -125243 2949 273139 64877 179139 1694 -88807 188156 -146226
16182 76102 221724 311176 29860 -137698 -210920 -111914 90018 -217933 253479 98425 63531
16171 63531 -13686 -40070 -5363 135638 -20325 -170233 69775 -69641 21371 97589 92021 93356
16159 93356 221564 80289 377164 -73218 -54396 -22536 40054 110803 -157874 179357 -47792
16147 -129308 165267 77481 -10294 153389 22970 59853 -14070 326199 -408695 267840
16136 179452 198239 199685 -177072 56796 -137060 89550 125326 -146883 154591 131983 87711
16125 87711 89404 -90084 -11706 178947 127005 -34813 -89798 -228400 122440 -270918 -115288
16113 -10910 -166091 -16317 -107038 -168526 447195 67686 20305 -67309 241898 168599 72177
16101 -269994 145982 -164497 268923 -72332 169790 -87070 -145444 48986 -34387 225879
16090 160993 -311467 -14022 109209 231107 195205 219767 158608 107086 315800 -52927 -294076
16079 -294076 -43908 245953 -198708 -80633 -97416 89212 -99806 127967 249918 -20265 191229
16067 212009 -117708 94119 171471 319735 -285124 67803 -142900 -148501 -209035 273533 144878
16056 144878 -217250 -36136 -121722 50365 -132381 -48563 -24551 -90264 -73261 299757 325161
16045 325161 80778 -198379 -3171 -60827 -250254 -208477 -155526 3689 136225 159673 20372
16033 27739 -233975 169972 -59100 3086 -102526 34933 84173 -28648 241441 -111977 -16556
16021 -78621 227291 -280276 39713 27066 -96760 102082 72991 -17114 116248 -56530 78994
16009 33975 -181589 -45181 262626 24481 -20047 79973 -262113 -111202 91672 113778 20397
15997 12805 -113324 14080 337179 177791 239924 -119243 -78556 20751 174547 58744 -99576
15985 -286999 7773 148247 184771 112371 311181 190278 561161 98196 164425 -119079 97973
15973 -169855 192896 54675 31680 -262667 -370329 240367 77363 102365 115356 253593
15963 253593 -96 -239124 14544 -159728 -58242 -422738 16231 168050 -200026 54239 -168961
15951 94920 -187339 -33173 48727 -175955 -245591 -62253 10030 -153819 -202826 -83273 52069
15939 138098 -219395 -230594 60690 96218 -44793 31663 -143902 -330321 -56216 -21195 9475
15927 101361 106221 3239 -156817 210439 -189774 -127199 -261356 -49157 -72282 235502 -127084
15915 -44663 -126786 -70162 -159113 227473 -301932 85770 187485 116413 138345 -45569 -37712
15904 -37712 284970 -127053 228875 307448 27888 -58211 -92173 94135 118 -124784 -15105
15892 -182179 -92630 -202007 4274 -8008 25267 60533 -149971 -45373 229388 240136 -142454
15880 -27957 23466 85624 43321 -324596 30019 -55920 12591 -370370 -23946 9124 -41483
15868 99401 -41800 -47832 -91566 -311189 -11558 48865 116633 -43841 247138 -227399 77364
15856 19631 26005 316397 -47310 -1752 160869 194383 134140 -109271 395133 -371840 -90877
15844 -35348 30353 308903 -189101 -200178 -153101 -238929 172252 128623 -208243 -332479 -24631
15832 -35719 161642 -266518 -340331 -71949 161888 -173517 93895 -136759 122487 -4108 -100255
15821 -100255 -70465 29381 89311 249412 -315034 107874 -365162 63742 186349 -153278
15810 128743 -5554 -301061 -103810 59364 106491 -104007 -54795 109098 -188443 77235 271149
15799 271149 180205 36964 26020 9820 -7779 70007 -6252 254495 -155207 193757 -141833
15787 -80098 33055 145954 -196430 -18009 -126273 -93010 133584 -228257 314945 244724
15777 244724 69178 -171778 6220 274205 -185210 27601 -148898 -98127 63751 -422283 -117379
15765 160598 -211852 90103 -163618 -27120 27236 127503 164946 57258 -244010 219698
15754 280766 -148528 -46991 301660 -30249 271181 150814 -46216 73532 -69749 -303711
15744 -303711 292208 205795 -89670 118630 -165747 -235720 -105099 -322265 172177 -263645
15733 -194758 228070 27155 -234427 28272 -17777 214298 -130857 -266918 -334127 -64052
15722 236692 -71991 -35631 77454 -158584 -37985 258675 157911 79360 -73852 -3145 52972
15710 -3577 -150886 117091 260931 -200436 -394962 -150317 -95912 -104684 -40135 -129511 132343
15698 -111514 17347 18835 -319109 16975 90495 64058 37771 -118803 -571116 47757 -191502
15686 -56743 150447 89259 66553 -38981 168505 262617 164775 -149573 162596 147832 -123463
15674 -72395 198290 60470 10876 250873 131520 189237 84787 200905 19951 15637 -144039
15662 160516 224708 -571032 60314 -632 -60267 -135885 21937 -62727 -150380 -333754 -90380
15650 139839 90240 279738 -273886 135497 -154074 112221 12380 -268980 -17124 11776
15639 -9536 134390 -286525 43639 -219773 29452 -177768 -284464 231756 -75227 -38387 -50379
15628 -50379 42531 8502 -71107 12507 -211644 -192777 209780 56579 291582 -100634 -5053
15616 -143756 -272880 -62544 185442 -180609 -187497 -93654 -61423 285564 -464879 -242045
15606 -242045 82193 -182685 -46949 13224 29218 -237139 -19627 -13962 -193495 -14031 -202327
15595 -202327 -30184 -357484 141502 -112158 120826 202143 105814 -368495 46068 122425
15585 122425 73123 -148584 -44255 27756 90748 51100 84642 -36591 107385 141225 -90451
15573 85084 -46730 1244 -113952 -21869 -92644 28041 -245549 177015 -146561 136359 48009
15561 47409 -48361 -10908 315767 296945 16678 152591 278136 -180268 116933 59767 66440
15550 66440 -133691 225024 17566 -83091 123413 -289041 177009 -208489 -170033 -30682
15539 26066 275954 463566 157695 106026 87148 -39305 82924 -82283 155878 84639 -171273
15527 -72837 22497 165542 35564 73862 34694 -66415 -52730 -228109 -258707 -129461 99679
15515 -115315 146477 212645 82853 22257 150568 178276 46312 33194 174995 -56970 232803
15503 -222769 -77697 109427 -86621 -57794 -261777 72722 -11849 -127216 69383 -250711 90258
15491 -182476 129400 -1870 102911 159128 -186045 -70680 188944 -127174 127972 -125441
15480 -21095 -123110 93308 37946 28984 183245 -65801 49174 291782 57643 -209701 9729
15468 94504 -26923 -157342 201323 -334941 292900 -21975 259833 89689 -106495 -132526
15458 -132526 -104064 167110 -278296 -100734 -252003 -134758 -396916 -107784 158326 168608
15448 168608 111157 -58687 289332 -303354 -139998 48315 19523 -163420 112923 -241819
15437 102883 251733 -265623 -116974 -334728 -58602 -50363 40513 -114788 6876 29396 96814
15426 96814 8534 66369 -206978 -26428 97995 153670 -141325 38338 21745 -31126 -103189
15415 -103189 -330855 -287913 35149 -203820 -275336 -274199 -370741 -177436 -14260 -126518 56615
15403 80295 37311 -13752 8874 -70399 -211242 75685 -304780 190707 22732 -85001 -238034
15392 -238034 -155987 44140 35710 -96807 -169134 191152 -91760 -123441 -353412 197609 -94098
15380 -151532 -171100 -67397 -140216 -165449 231146 -66664 184184 -84592 -75035 -91013 350166
15368 -32097 -193512 207541 174279 228159 237123 63438 23785 207703 -33111 -419916 177394
15356 -5967 -169928 84454 4950 40767 135028 20577 213866 -94670 51513 266485 155139
15345 155139 319451 92069 57239 -141520 -45088 -349288 159960 166471 -9872 120661 -34749
15333 -229880 -82115 9253 39207 -49112 -182073 15024 -39864 -34353 141444 142408 52061 -81764
15320 -356520 -23572 -191798 -51488 -8393 89000 73663 15299 -22766 -135153 -107203 126543
15308 -21044 51524 -142016 241413 -33704 313617 102707 346593 -361007 204145 235729
15298 235729 -201329 194544 226761 204068 -48491 8452 -45578 91221 63322 -224192 116272
15286 218250 -173929 -122535 106930 -2836 -17491 -197285 -352437 24673 49105 -117178 -32048
15274 -56891 -9537 283540 226633 -119565 43504 128449 -51844 26227 231134 -20373 118031
15262 241021 -53226 -27535 91608 84909 280944 -81903 141441 160361 398615 -124196 262570
15250 378185 237772 132554 705251 941093 1064689 925920 1251287 403204 188671 206972
15240 206972 72408 61264 93432 23301 5046 218683 -169481 -177752 121816 26639 11459
15228 63144 -240586 119774 -177496 15021 -198756 99376 -20950 -308092 -9844 -265957 360882
15216 -116946 402717 311668 -26562 -55596 203010 65809 -46472 136022 -161764 103249
15205 255077 66300 307874 22367 -46512 232776 -116532 -14343 223732 69570 11043 94409
15194 94409 30937 236611 105283 76058 20691 94710 113413 -120169 11815 121565 -80873
15182 -201168 150539 211137 301119 80270 -42715 201695 5229 -9097 158791 -66198 22919
15170 312951 129799 82353 126099 117299 -252517 219689 -207425 -114070 161725 340410
15160 340410 -40394 108689 31873 23364 348715 270236 151672 -388667 -166074 -27183 164464
15148 296857 247064 258382 -134479 -16505 391059 196534 4969 -39345 28536 341745 55575
15136 -59414 331533 393276 64772 210510 187655 435462 193050 39739 63741 12743 97471
15125 97471 -152191 147271 54457 -85518 116147 -118510 271309 -126046 181422 127670
15115 127670 251051 220031 10120 196227 270798 -268220 -123359 23728 -104991 -63727
15105 -63727 54793 163325 288557 58642 318922 279560 -248463 7553 -88519 -107849 -55919
15094 -55919 325852 -110 340781 455893 -66752 -19761 56968 -271772 -267999 332 77400 7155
15081 -7493 12047 -41558 449923 -139936 -36294 -132439 167595 97874 128929 254354 79352
15069 270289 42456 -64561 288317 265074 107009 481788 132706 13369 190781 -71406
15058 156263 205438 225819 -15279 215678 28866 380550 44425 95275 282559 61319 324161
15047 324161 239082 236700 -25725 -18705 5431 194975 114790 124696 98629 -47170 113013 144503
15035 144503 112294 308456 418709 472966 79445 61683 308111 145629 384925 260735
15025 260735 276925 134527 313854 265506 332311 29084 131992 354371 -59578 240685
15014 -142494 18541 565600 311685 148239 106157 222508 295464 312003 71138 -207487
15003 386910 272741 459667 497013 -44053 -51855 143883 135107 97640 259443 504053 -71339
14991 118119 392692 86828 38156 318060 219928 -116493 169071 176512 301857 206698 280993
14980 280993 -13751 114344 -44037 189660 243260 -139882 -154059 77355 346047 154478
14969 269679 262382 227154 55298 283989 -209881 51854 137254 3543 483350 114494 103631
14958 103631 297635 125109 -65833 104146 442520 199168 340439 562970 360016 187202
14948 187202 129193 268336 29134 357491 354464 -111967 202135 509977 -9743 307346 418338
14937 418338 203639 359074 34082 443521 287354 314091 484137 411755 671936 -99107
14926 383001 359911 282065 -17301 249995 327494 160723 -53947 151382 278002 282193 179403
14915 179403 276199 363706 -34335 513795 146767 406344 552375 328046 339538 223072
14905 223072 351145 269282 271121 371284 415461 224422 257637 428470 392751 331920 855594
14894 855594 -23729 640622 258761 338338 164686 59246 131289 102388 522037 394980
14884 394980 97678 189708 404477 425671 156055 181205 307264 365932 549638 115264
14873 305772 90137 321897 208262 390449 428310 530220 311140 152736 366140 408089
14863 408089 126409 477894 608627 399907 269876 544594 292962 581280 150099 294673
14853 294673 615047 337403 53905 389100 277960 214654 63105 550477 128174 497608
14843 497608 397587 420201 539293 552941 459382 414721 401719 463321 246929 402571 621186
14832 621186 366380 600111 223372 625103 362790 148215 86082 398497 407016 308256
14822 308256 473000 623967 733137 426256 690774 315543 329946 609776 640141 638264
14812 638264 403862 833154 499470 606715 684456 633247 461395 484962 599434 296485
14801 598277 773429 695349 227479 317587 346214 199248 573588 206006 586148 288221
14790 671248 574087 402497 918516 389343 858157 437353 245953 572112 629749 545798
14780 545798 490825 518470 274736 356691 368299 553008 735587 605882 650052 911073
14770 911073 628291 814700 544081 386105 486719 426573 387246 541965 294145 520920
14760 520920 307996 521890 533824 516165 814975 551153 457871 584310 513839 707676
14750 707676 500793 559898 874024 732441 677085 599092 416681 661290 640186 538099
14740 538099 922875 693880 581925 477701 740713 794562 607792 663020 737046 701617
14730 701617 653123 794797 653596 715089 572949 757972 466719 1069541 754708 522385
14720 522385 829241 849159 930131 667650 585381 529007 822152 639638 578153 586925 477533
14709 477533 864204 1013000 408122 772174 971457 664804 609908 854041 557017 560281
14699 560281 708208 530583 652841 845936 807794 761343 385343 1239722 929831 753060
14689 753060 728027 739102 1214850 932710 617979 706047 721300 970355 957268 767021
14679 767021 712387 880137 1127707 920175 951387 1336149 885413 754144 1087589 1173953
14669 1173953 835587 1410855 1110811 934378 973893 994295 908413 724068 1367897 948030
14659 948030 1086400 964641 1286440 1071763 848336 856941 1204549 1282491 842025 1036847
14649 1036847 628192 1069987 1527113 1549751 1059896 1110219 983994 831319 1567488 1126795
14639 1126795 1259023 1178206 1070184 1111376 1204301 1269007 1370498 1194693 1340746 1157030
14629 1157030 1092920 1193767 1170123 1245870 1237338 1313018 1057244 1550104 1317278 974500
14619 974500 1366925 1318528 1044318 1417883 1562085 1343303 1267758 1457928 1448312 1295198
14609 1295198 1502413 1531002 1113014 1727206 1475303 1732203 1588156 1462178 1436442 1756360
14599 1756360 1455571 1307641 1526890 1458660 1618030 1381352 1671861 1234486 1534650 1785352
14589 1785352 1938822 1667092 1837563 1536017 1863719 1535850 1766569 1691649 1762918 1837417
14579 1837417 1721619 1675564 2006763 2186171 1783018 1781400 2055827 2022280 2188995 2076928
14569 2076928 2166542 2124565 2065570 2202422 2554295 2648195 2228494 2251247 2617374 2393413
14559 2393413 2595525 2785469 3117719 3126224 3452009 3265709 3378664 4117177 4441320 6086026
14549 6086026 8587175 12593223 21512408 37765413 35504376 17905939 8235444 4433079
14541 4433079 2528464 2299407 2290442 2117163 1749390 1763629 2165399 2118068 2179272 2052634
14531 2052634 2223503 1916920 2317970 2028252 2313115 2177681 2292506 2230684 2145459 2497369
14521 2497369 2258432 2537002 2550861 2607731 2804761 2461861 2602692 2809149 2312497 2491605
14511 2491605 2504926 2545565 2769062 2579930 2776033 2924810 2936227 2775364 3111185 2751351
14501 2751351 2910297 2804043 2844174 3152987 3298224 3161248 2841905 3033950 3088282 2903933
14491 2903933 3414315 3442894 3378918 3373593 3275409 3359921 3460692 3695231 3605920 3904836 3863935
14480 3863935 3764083 3911257 3968247 3722172 3623302 3968727 3706927 4060384 3994935 3960201
14470 3960201 3907836 4262672 4017411 4153388 4065469 4320471 4223266 4290179 4477644 4390860
14460 4390860 4757173 4569066 4615985 4471737 4614877 5047629 5026338 4780779 5211159 5056054
14450 5056054 5153597 5445378 5160380 5034958 5267802 5358370 5758680 5549456 5654709 5679817
14440 5679817 5766441 5899120 5524635 5937261 6102458 6270445 6438040 6247271 6375790 6566634
14430 6566634 6278658 6486433 6803878 6602859 6748457 7193406 7099494 7151718 7344505 7528368
14420 7528368 7432773 7486970 7826397 8118200 8388972 8254783 8295873 8507226 8787371 8392953
14410 8392953 8567149 8825561 9087565 8814775 9360784 9597996 9535993 9860958 10022153 9993366
14400 9993366 10062405 10253948 10457877 10754652 10613724 10739476 11183454 11373207 11488863 11623351
14390 11623351 12065251 12143360 12208820 12753824 12681714 12560545 13117093 13442073 13906770 13917344
14380 13917344 14355930 14318448 14876972 15110534 15207054 15451110 15723723 16146715 16583110 17092260
14370 17092260 17026973 17439187 17935944 17887613 18558303 18915273 19361658 19537024 19948693 20804077
14360 20804077 20987287 21747601 21914769 22458615 23148610 23989072 24428075 24612450 25520851
14351 25520851 25770326 26490129 27109660 27654336 28777844 29333375 29893330 30878169 32033345
14342 32033345 32245844 33206326 34229088 35238048 36345069 37205219 38266270 39317326
14334 39317326 40366255 41778604 43195870 44381874 45513405 46995972 48833775 49866139
14326 49866139 51882740 53439832 55450764 57038483 59130647 61112939 63475044 65764170
14318 65764170 67553451 70375442 72910687 75758392 78721812 81774323 85185610 88193322
14310 88193322 92028357 95918090 99475462 104090592 108491655 112947492 118363768 123672365
14302 123672365 128820331 134946342 141066563 147673807 154408399 162215064 169875218 178619397
14294 178619397 187180703 196043475 205723018 215903198 226862960 238060205 249996125
14287 249996125 262015532 274990537 287935993 301273168 314923648 328396099 342451052
14280 342451052 355880709 369208718 382241965 394560363 405501504 414822232 421028018
14273 421028018 422918896 423579518 424521715 425578262 423427474 422329481 417893924 410632029
14265 410632029 402161913 392410156 381815906 369749181 356013564 342103442 327571022
14258 327571022 312723170 298089335 283964804 270559346 257699928 245088311 232740519
14251 232740519 221249193 210143495 199971125 189668519 180570867 171657803 163626214
14244 163626214 156221104 148535071 141599415 134989304 128907321 123342892 118234117 113222493
14236 113222493 108217413 103293324 99155365 94725398 91346389 88217524 84713708 81003980
14228 81003980 77793868 75062348 72064147 69433508 67222473 64432941 62571277 59961886
14220 59961886 58041625 56279821 54231380 52488804 51238785 49538091 48069872 46514672
14212 46514672 45070128 43828724 42364659 41309195 40098201 39326819 38111424 37153180
14204 37153180 36051182 35008737 33851842 33491087 32572602 31805246 30645472 30259079 29014173
14195 29014173 28360653 27914662 27416797 26422652 25822794 25084609 24555615 24309236 23510652
14186 23510652 23207393 22435806 22173826 21411183 21097889 20608141 19947088 19662559 19195492
14177 19195492 19248590 18730617 17984611 17873215 17452233 17233814 16951960 16407949 15876528
14168 15876528 15849757 15202199 15174059 14860366 14626758 14252782 14241848 14178572 13654749 13543801
14158 13543801 13296452 12905327 12880511 12749894 11993305 11957082 11833567 11620774 11667913 11297035
14148 11297035 10992736 11141532 11015365 10606741 10255856 10112082 10325965 9796634 9607594
14139 9607594 9652763 9348461 9358714 9202952 8985803 9103461 8686654 8946187 8744407 8308682
14129 8308682 8463293 7982919 8089180 7945170 7837946 7938916 7957149 7510732 7136986 7297499
14119 7297499 7197260 7264405 7346968 6937523 6887469 6643230 6859189 6884559 6539664 6769533
14109 6769533 6780359 6536255 6328915 6030395 5974722 6142215 6069262 6156519 5713450 5704954
14099 5704954 5821951 5773348 5520306 5469606 5563397 5333324 5360835 5425068 5077165 5193665
14089 5193665 4857943 5039402 4878322 4870061 4810923 5007553 4884566 5005306 4563429 4610536
14079 4610536 4487960 4446686 4446810 4475478 4302099 4296042 4465435 4344525 4174259 3959950 4089014
14068 4089014 4219104 4101863 4363362 3814792 3658627 3781687 3846080 4286630 3921707 3849718
14058 3849718 3556347 4246243 4007602 3624630 3929399 3560267 3755616 3565617 3212046
14049 3212046 3383394 3282847 3095305 3519430 3013786 3097824 3371399 3102721 3162623 2977529
14039 2977529 3218463 3120618 2990502 2947525 2879788 2995518 2940081 3073543 3144227 3052639
14029 3052639 2806731 2793741 3024269 2692329 2716144 2593902 2468284 2835202 2744272 2803703
14019 2803703 2777405 2304742 2648962 2764507 2558776 2308400 2337873 2598808 2435304 2331246
14009 2331246 2413706 2421352 2450113 2482234 2449829 2239465 2149245 1897766 1987414 1975213 2000177
13998 2000177 2144363 2261858 2100452 2078865 2286290 1871605 2238401 2380296 3079651 4728585
13988 4728585 7947213 15199356 31793682 38626682 22867326 11221157 7389584 5509539
13980 5509539 4253547 3655395 3257145 3099809 3083516 2717722 2499235 2587575 2349128 2393990
13970 2393990 2183598 2247668 2193510 2030033 2470588 2018355 2256031 2087964 1914864 2493997
13960 2493997 1944880 1807090 2129297 1941750 1959771 1853421 1947339 1999556 1749833 1955742
13950 1955742 1775077 1525381 1878765 1661807 1958568 1864022 1616302 1334446 1836389 1788125
13940 1788125 1987029 1926306 1507738 1402269 1622260 1521448 1572706 1484840 1882531 1773301
13930 1773301 1588937 1392313 1515375 1257624 1836677 1687310 1746983 1587696 1758606 1465662
13920 1465662 1142896 1603953 1457704 1635282 1254995 1351686 1232626 1345657 1516142 1331464
13910 1331464 1544031 1285230 1424832 1511875 1393257 1133472 1620913 1157191 979668 1280833
13900 1280833 1461564 1042581 1153672 1181815 1164647 1308431 1258526 1350920 1264135 1654811
13890 1654811 1399771 1053047 1406464 1298884 1335325 1112527 675288 922263 1210225 987628
13880 987628 1396570 1142683 1351307 814344 1281287 1092282 1155196 1111919 1122896 1191275
13870 1191275 1089592 1135166 806900 1211530 1030341 1088932 1111485 1044763 913071 843340
13860 843340 1303346 1394763 996291 952523 1068364 982431 1048045 1095421 1009405 1138925 859938
13849 859938 1116250 1159975 1182723 925623 995183 976869 929165 1102290 819642 835144 880216
13838 880216 1085670 881731 458480 1109376 1299969 883479 1026595 926175 831223 1105051
13828 1105051 703054 1044733 1143103 789199 466728 826083 912123 955272 871793 986727
13818 986727 669671 746255 859547 792815 807410 730022 678784 916527 952606 741306 874173
13807 874173 753558 691611 772069 584209 661077 641378 780935 792640 966073 710495
13797 710495 660405 555591 719720 648833 818873 675348 866057 553922 752418 741192
13787 741192 686349 757419 1002172 548187 250317 676973 417960 572777 724798 780242
13777 780242 605410 617096 631451 504311 531305 835191 642713 805472 629366 669180
13767 669180 927236 619549 650462 565680 743783 760435 673117 601799 618961 482470 535005
13756 535005 433164 830942 577131 782851 719861 586407 506934 395199 650690 703402
13746 703402 707350 662838 493708 840004 544778 635916 732235 704563 579375 247707 468447
13735 468447 847282 400737 625904 361471 230263 533553 584755 568478 297776 704688
13725 704688 660302 454954 286526 637736 668904 631003 852232 784163 468848 482064
13715 482064 651152 781692 310728 542357 844626 682862 357108 720929 581370 113132
13704 568762 551619 339399 476462 598323 432103 232504 549572 286686 290993 706642
13694 706642 658312 397335 568135 633089 358310 520015 489476 446914 567252 720678
13684 720678 649286 619117 441284 129187 391820 579089 215383 538241 473939 264953
13674 264953 371027 760138 565654 320104 369058 769451 250464 577806 299195 511064
13664 511064 419805 196068 640489 392358 600931 435087 306147 586620 329620 269523
13654 269523 308732 303016 482541 603421 356785 25120 367543 515863 459617 282588
13644 282588 501392 241319 473687 640456 184547 424764 452476 298686 545564 558726
13634 558726 111422 334278 227376 609057 612392 261616 721202 369754 349672 363696
13624 363696 450936 283986 237848 549002 147484 422440 134022 137331 381771 228361
13614 228361 576836 278873 502828 938875 183947 -101823 120783 648859 184618 412518
13604 412518 192837 155596 486103 461116 308989 -225018 245721 662711 456566 283245
13594 283245 416051 230352 72653 435633 128626 672219 393660 273987 216629 222596
13584 222596 173820 15189 548442 365950 131510 296187 350313 505762 175800 249335
13574 249335 209391 290466 388287 180570 877656 359150 609139 331496 183193 380414
13564 380414 269368 41539 626260 353708 543534 411658 303293 502116 287070 159705
13554 159705 171790 380246 367417 610072 298214 256503 249534 285988 108573 606206 354161
13543 354161 519123 255745 270202 499491 684741 445197 135830 272648 140686 275740
13533 275740 411910 291673 329586 219483 480519 391763 218385 80149 170253 271673
13523 271673 28264 262072 236640 436272 370438 439840 95071 170447 305154 46275 510010
13512 510010 52701 383740 416783 477043 12393 52501 190445 121027 258087 397243 299857
13501 299857 495907 122595 31450 296380 235105 260402 24493 255081 318165 285280 112381
13489 281163 282781 -57034 298078 67511 1986 100240 171973 226511 296293 516102 499335
13478 499335 86807 517073 271370 584178 184284 377598 379445 527205 -100730 257347
13467 -98312 147306 289742 79946 330329 37367 214678 327111 124713 227741 534302
13457 534302 111314 311190 389259 332271 216702 359274 183448 158507 148725 459600
13447 459600 -54437 -59413 360579 305759 174153 62420 58661 -80910 150132 200839 533413
13436 533413 213551 -18346 172881 323922 263737 4966 -18283 183400 146261 167566 -46010
13424 279792 241333 -38773 -140216 121696 283016 325239 207788 108125 -231125 280724
13413 117526 141345 244133 13586 137077 40515 417932 248936 83530 237035 129526
13403 129526 57986 378023 242791 85198 51635 317056 426734 288247 226887 72075
13392 -112906 -92112 9936 221366 -40648 452712 192824 54536 214960 199212 12936 308153
13381 308153 88761 70719 -56662 224248 357956 -45125 344967 65296 38597 551965 254268
13369 88822 403001 284780 99311 -2637 299651 313433 47575 145037 195301 262074 212716
13358 212716 -162247 317650 174102 -42940 45731 -90858 276410 150815 230860 131113
13348 131113 297112 471730 233686 18128 194927 -101992 419882 482314 318331 418039
13338 418039 383902 112966 338724 246820 124107 103016 353239 -52270 96067 704425
13328 704425 195182 255192 -45380 -9903 510661 63777 263611 61592 318888 280647 313923
13317 313923 315620 152258 346167 216024 31530 152846 181652 300982 90212 130709 213713
13306 213713 136156 -66721 148224 377157 -60313 109235 322337 -7820 428772 69347 -119603
13294 339917 113754 174644 300138 235218 -67563 495080 310138 159158 69900 188034
13284 188034 248528 328543 116606 139580 160946 291414 -51683 206718 470998 148755
13273 346731 264895 105888 376024 119365 193676 227660 221413 17422 149785 -15291 266525
13261 -120486 209901 -124200 232886 48141 219718 214211 121299 229756 140435 244696
13251 244696 1895 276353 162991 25371 195484 157052 327436 147331 -43341 173304
13240 68874 53835 -230354 201592 6212 5030 -6401 257148 173997 178798 339877 240703 199303
13228 199303 -21162 351445 92405 -75302 11612 53546 368530 189204 238300 203930 -17219
13216 118099 198964 378018 9007 155368 43874 -201694 293507 -225525 492740 200335
13205 335374 2571 -13543 341246 -108415 199704 206771 -103494 -20186 181784 -174006 263696
13193 226714 148901 274498 343982 759995 229705 -5822 101336 -22467 252254 25153 15891
13182 15891 95883 26431 112684 -168802 50732 -33437 169016 104173 -34777 212933 230457
13171 230457 219777 175332 106262 322475 42577 -253840 -219040 129749 209337 -73439 315128
13159 -21489 384724 -109594 -8412 102135 137260 -58341 263806 145823 -16865 48232 42068
13148 42068 91366 -56823 7836 290730 100182 -99068 -71653 -3298 192269 -35492 -163195
13137 -163195 9964 -65773 -123303 -124186 -327631 -46384 29272 137964 -222216 88428 36923
13125 162187 -280213 -36513 8574 31694 104490 -31104 75934 139321 -207174 351533 -81140
13113 -311311 -123844 361976 55208 60271 97487 -53531 121736 124057 158863 57063 -20074
13101 154904 141443 -47606 41268 -83445 290569 52525 -172724 139129 -156936 196489
13090 45563 195401 -97023 -142716 403585 224653 251528 185172 206658 10425 6923 47562
13079 47562 -15028 10779 64112 113638 140468 272404 57413 175555 190563 276754 111549
13067 108729 120201 60209 5941 -133093 125711 453427 119440 174984 202547 -251892 3113
13055 227001 22427 506276 -101385 5071 -21764 150154 310113 -34294 215078 35319 -30129
13043 -206626 28206 116919 100221 131046 346540 74438 204214 316340 154589 -7718 -112058
13032 -112058 157799 175801 -134696 154522 195379 -34427 225719 250696 233146 207018 -176141
13020 217918 -145896 7424 204893 -160935 -6356 -85074 194760 -136815 280714 -115636
13009 -10456 215867 134387 -242054 93400 229801 124770 267469 -20754 51865 2067 174704
12998 174704 222476 50174 -201732 -26010 193691 76336 -97074 52175 69130 46952 281509
12987 281509 192650 -112645 7552 -2789 275399 3624 -115635 -35597 -126468 53339 -5345 257779
12974 -58763 -131888 6091 82187 -116509 -96984 48938 362870 264834 -140834 199080 145895
12963 145895 266760 -15813 62486 -147623 67666 -172191 75399 74914 -92019 -5528 -91808
12952 -91808 7303 354038 72015 -59665 -34817 30285 -108828 -125704 -26595 9514 118937
12941 118937 178033 -92041 27228 -239830 -119535 65304 -13305 -55015 271082 -47068 -156828
12930 -156828 110732 -135848 42090 231222 -202332 -52232 50544 75505 145148 -216062
12919 -83051 -64534 -52642 -221893 -272831 -162872 -240748 203172 248873 229026 197670 106219
12908 106219 -52955 3877 54435 177527 -261129 -23477 145332 -209688 43810 176864 102011
12897 102011 207516 251864 454657 20567 54041 -272622 -154119 -114034 110913 353867
12887 353867 -61205 460343 216721 -150134 100451 142770 91663 69754 380736 158001
12876 -73062 -308024 280549 -76352 -70250 99881 -17961 -297935 343810 -303524 -345189 -87686
12864 22520 99772 -212844 114389 -447599 -67481 -117472 172599 -1337 -147059 -51379 12038
12852 216391 -251054 -5768 238825 -194874 -52381 233483 224883 166141 -10012 184885 267008
12841 267008 280187 111116 243601 104128 171173 -6401 82534 -212645 -23041 234982 147996
12830 147996 309097 206599 3048 124887 -205954 49717 -83409 73140 93451 -64197 -42594
12819 -42594 -276328 -13891 30420 263826 -289276 2560 -403832 148576 157182 -112709 74035
12807 -124059 -4372 -194744 157653 158376 301921 168703 83722 331884 -123990 123436 -75962
12795 -56824 195287 -19217 28017 20485 -30838 -22671 -143301 223250 -33830 -204176 381137
12783 -27052 -231615 229288 -112821 2015 286759 -72031 125485 147245 -23512 -153396 -107275
12772 -107275 68798 244770 28799 243619 33164 -45980 -118822 -143435 -5399 -214559 138675
12760 -43270 118830 315678 -169165 77631 62432 -234065 -27722 114267 -178030 67317
12749 6783 56042 -314494 -56931 -19241 -582863 143349 -8855 -18001 -182006 183029 100050
12738 100050 159694 302636 140867 16665 43573 -66669 84342 88933 40845 -130085 447095
12726 79621 -209210 106709 167707 -6172 79488 255572 93946 -275823 4633 -252068 322714
12714 -202136 93778 120318 144155 127511 152789 334298 -1579 171055 173836 34715 433679
12703 433679 61422 325430 453844 36817 249764 -26494 49056 -133964 72192 -169052
12692 -24703 -108029 220865 65037 2113 -163735 99211 -58180 113202 38456 425059 288674
12681 288674 -71132 82552 -30993 512388 73676 393277 -6322 -137185 260489 65040 64170
12670 64170 223272 65348 1623 172922 416672 430281 -5646 -92822 245474 121420 -133481
12658 55785 -70870 -102253 185996 -15718 132769 91816 204845 206647 -124903 172483 32817
12646 -17339 23503 25326 -329141 -75522 24594 -282693 237300 -27120 7705 73977 -33813
12634 -45195 -125281 -50755 122240 293468 339843 163588 142097 319743 202618 41043 157773
12623 157773 -84603 44133 106931 316550 223330 18003 17759 -126159 88482 8482 160101
12612 160101 148939 -158604 -162176 94246 -117278 238574 -104314 -79261 -320862 125597
12601 131354 123243 213224 1291 161595 527792 195960 140632 -113022 106591 1381 -255548
12589 -402992 305632 90107 163081 -34748 46154 77393 -172249 -313223 231094 -14459 8423
12577 -67625 -100477 -43531 15840 176814 -132702 676244 205092 185188 -6037 1517 71028
12566 71028 -320561 207421 77469 244621 64936 -47924 -242544 249165 31847 6115 235778
12555 235778 257831 158417 -87000 41336 167904 218817 91386 114517 88229 -37727 92595
12543 -22688 -251508 -109989 -14863 -50265 64854 -296871 178946 65344 92750 300106 71911
12531 -35580 194640 291093 -100515 -151354 249605 18561 -130952 294105 130376 -44595
12520 51898 55319 88502 -219530 28778 -157305 -126659 41969 -143764 177983 -52934 24612
12508 -186783 -143103 87415 -76127 10234 109254 19180 -88661 13918 176873 428134 117084
12496 -276712 -23766 -135596 156366 -103092 209990 170426 -210949 -94409 2974 -13483 94343
12484 171270 -15850 -82245 106111 -39013 96834 -162633 -87595 -39833 67817 -352843 31148
12472 -33703 -54026 -137147 -42476 12584 -263398 -180338 -18748 -221875 -183300 -173863 135002
12460 141896 520684 19238 176272 -220677 -56155 93670 -130315 -310320 338622 -259144
12449 -81255 -24205 26724 141806 -211568 21692 -91879 66351 106266 -212267 122369 -299136
12437 -81314 -123040 -22684 272394 -123849 -17067 136940 51376 -81986 -11582 -10791 236370
12425 122430 87908 170686 66217 26837 -107471 -209169 -129162 288089 123408 67020 -331052
12413 -161897 -82138 32489 -172596 -90841 -77134 -136400 233399 73323 45127 -90748 -18980
12401 279237 -22270 330679 54523 -4514 -251234 -109694 18000 -68158 -201305 -82645 -21409
12389 -134803 -76222 -104869 299294 -78135 61495 -87586 -52044 114980 121666 55861 9510
12377 -129053 -385847 106924 21727 159675 -233705 -14312 149615 113416 -35155 15633
12366 152356 238525 167163 331915 -258040 119086 -240674 -366036 87295 93460 100997 -83358
12354 170104 -136099 49646 -204457 60496 179825 176381 -148173 9519 -30051 68626 -121795
12342 12313 -217 126125 -298561 -232726 -308373 -19642 -273295 -185571 -113922 133667 101133
12331 101133 -81299 112186 215101 -38079 221555 -490620 -38008 -197854 -203479 -140474 -180321
12320 -180321 8084 254211 278345 -275489 -172625 -160562 534185 5817 171775 1079 157201
12309 157201 300479 23237 119655 -49584 -255797 84134 7041 -165313 57606 12848 284761
12298 284761 -322388 31991 153891 78157 -55097 187806 144999 379024 65604 120227 132456
12287 132456 197961 24599 68366 -110791 172210 197824 -154814 88337 191783 195547 176844
12276 176844 297875 101651 155801 256808 48732 -30638 144385 436051 263349 22966
12265 178493 13897 -231531 65038 299934 -25378 32654 -44687 105938 -73706 215364 -20050
12253 189969 -338040 172274 -132056 4780 -11458 -153582 5527 -301943 36974 125222 33341
12241 155526 351510 108076 133516 68822 -148520 -220823 -62584 15442 -54405 150481 309360
12230 309360 337996 -117438 167945 -104587 79702 469112 133406 17584 247894 233171
12220 233171 137704 -10943 -31019 231095 -144419 -5887 -124961 184864 228636 -67187 302046
12208 256261 381070 -147973 14449 -5954 164070 119222 25599 174773 86357 339776 41652
12196 213770 96725 165381 127022 382650 48808 -11062 217613 79524 -242711 -48555 59842
12184 158351 147809 127039 119956 -45762 123613 52190 179658 162961 335623 -13627 205484
12172 67264 334352 43437 122869 189725 305499 -21156 -86559 287835 78801 178262 204019
12161 204019 253537 -125208 195925 216349 184972 301688 -178199 -29579 -227881 122213
12150 -13599 102344 192332 41681 94828 31180 77593 -49964 41646 -348479 166721 131639
12139 131639 -243482 286676 -29662 -21939 123184 -37793 208955 53037 123279 -128778 -216305
12128 -216305 118027 -15769 280798 67689 11439 -222833 -51052 180590 85640 126812 83635
12117 83635 -69100 156599 -11140 16937 123701 107639 -110181 255325 -21509 -94585 -60299
12106 -60299 87012 -91521 -101648 145601 -269443 -48700 -254273 2172 379232 70253 132841
12095 132841 305063 -2133 -72163 -10083 81197 -851 -160189 -19256 -165908 193829 230925
12084 230925 -293068 -231374 -186885 33002 63742 479722 1121063 1647488 872386 226446
12073 -3305 -89653 -14631 212432 155484 13823 313894 -180132 295008 18033 -108557 26070
12061 -164315 114225 126601 36485 -104901 175857 151037 135235 -71991 -99619 27973 77662
12050 77662 92729 -168065 138079 13868 -282170 -259172 178980 -325292 65295 532 183168
12039 183168 9258 221507 -463356 -215198 -175663 -201347 2463 -402087 -394230 163613 66715
12027 -289555 -225963 135093 -194758 -53502 -48241 -337633 82345 8893 295939 136835 281942
12016 281942 -72943 91494 -126947 32621 476778 57226 -34226 228687 -243393 -135793
12006 -135793 84464 -143579 136314 -170885 186793 -32097 114677 -182095 -181315 -48514 -222848
11995 -222848 -107532 65026 -33662 136633 30387 210255 -325874 114380 -253063 -51124
11984 -81905 -234171 -107735 97194 199200 -6168 34391 114381 -88645 -212794 97240 119842
11973 119842 -127261 -94419 53325 -259486 220295 65893 381692 66359 -62788 -84022 53383
11961 -340386 239585 135400 180885 130089 93504 -214320 -133379 -82303 4861 357014 288513
11950 288513 58583 -141698 -300626 -13394 -309328 -12090 -2863 -70440 -87717 152931 -256498
11938 204889 335515 -67607 -132888 -7587 -26908 89721 -366006 -37339 -151374 108863 155846
11927 155846 -147027 -66715 -92929 45093 -126171 62737 89592 238806 134680 436347
11917 436347 90627 276332 183828 -92975 -246543 45777 -222145 -54181 -78265 119659 -29657
11905 112981 218085 142567 38148 122212 -124676 -170290 64767 -57411 -181994 -25707 -14918
11894 -14918 79011 -203631 -124594 -191086 -73839 -256354 -124522 155438 -6386 -155492 231938
11882 -41738 -130614 45946 -110698 -239899 219478 -37472 -278095 25778 -269903 37317 -59375
11870 -183470 -53598 169924 -39410 -233266 -176524 -82156 29755 -145295 -186971 21846 5504
11858 -226179 -162606 -99918 -254274 39666 160886 78789 -145435 -69087 -135688 -158878 -15985
11846 19447 -257831 -90299 33685 -46148 -109693 -47592 -119461 68768 114897 34902 -141510
11834 -2485 -434032 84223 -217048 360181 125577 -174614 -63373 -64342 73201 -175745 -50033
11822 199090 -135958 10014 -19298 93970 51139 -151699 131119 97638 -217786 63574 275048
11811 275048 228983 37875 -111165 -280771 -68063 -110732 -28928 127083 92053 -29615 -98778
11800 -98778 -116794 15593 -100834 72444 279851 182628 355172 -90321 -31068 -16297 253273
11788 339873 49160 -169757 -361136 65288 -28046 -49173 -127785 -66439 -349164 135133 -136144
11776 -30253 -28381 -26486 -124783 40051 -262606 158476 -61236 197505 83342 53867 44280 6622
11763 -29285 -106450 547 -263669 155256 -62255 -165418 188917 -39068 168018 -4036 -323578
11752 -323578 -82075 218370 -31972 -29781 -315917 258682 31971 22650 61497 -93276 -308966
11741 -308966 -104862 82384 85369 -47246 -276459 -118643 14519 77203 150691 -106614 -125593
11730 -125593 -161219 133985 150045 7607 137873 -8937 141164 3210 -103557 -39121 186775
11718 158575 -171062 -55335 66799 26293 115262 -193631 -148772 145782 -102292 -96297 25000
11706 178930 314931 126926 56715 -460178 106572 377841 317958 -256149 -165956 166284
11695 3114 57931 258472 -38701 -34167 198784 118531 126445 -151369 22182 -86885 129652
11683 201089 -139193 343348 261761 69711 126814 13500 263352 5684 247225 237102 164523
11672 164523 186675 37379 100953 42164 142338 -66119 -3232 135168 -44874 -103270 -25846
11660 -60169 -126039 223617 -228252 95702 -211875 201462 45560 -85898 -12334 67003 475188
11649 475188 20223 -10478 124730 222145 195033 161187 320089 110032 174462 174456 102344 -28495
11636 -40587 189622 160914 204952 43191 151261 161757 -243386 163067 147397 -50165 -22196
11624 76995 275191 192376 165844 8728 -167631 61526 -72021 78561 -16284 -168367 -106491
11613 -106491 78549 -156712 229411 -133596 120695 -35172 -90777 100673 224900 -100188
11602 173483 -18166 367641 94 -61849 377585 151198 105540 -70244 -33870 157577 311585
11591 311585 -69646 79562 131941 345069 212435 -188242 -10224 118532 294260 29386
11580 29926 -106588 179014 -154184 -23804 145846 74874 60216 131909 40193 77390 203424
11569 203424 66042 40009 145234 -7519 286442 -176418 63290 137250 37900 153064 196297
11558 196297 71098 31443 260350 176869 152057 167238 264436 -33011 78045 134680 -151399
11546 221641 -51754 95860 174306 73871 -24233 -75875 -123273 -188275 193232 214486 281106
11535 281106 -12313 -1331 -41455 265816 -6364 578 130406 -143944 -362225 21664 -214597
11523 195919 447330 205094 -12734 334052 146866 51700 -199921 -1568 325039 -56774
11512 195026 -46931 -55482 252838 62847 85589 180738 130170 112301 59747 342132 -9862
11500 57985 -77415 -184567 -61348 -195714 11729 213373 145688 1000 24556 91236 224542
11489 224542 43555 111988 27060 145399 419137 275099 -158403 355412 322150 427879
11479 427879 52581 260587 220510 156846 -196103 -1309 33774 17313 168318 293945 33860
11467 -28924 237984 77081 102331 66883 174458 276333 98710 56486 119839 286132 295131
11456 295131 193191 71173 116780 -241625 40 315786 85317 31763 -157423 -96893 56745
11444 136469 123514 -88491 54532 304935 207811 436399 50072 -95966 61070 78836 -16701
11432 15197 81615 124311 105693 220152 -62386 47822 40568 243217 107701 -82047 268134
11420 -129213 164123 -39344 -270082 -143498 103840 78197 89690 -184300 208934 89298
11409 146019 -303123 -55579 -198735 23614 -109548 21772 -36932 315970 134706 -67286
11398 167208 108289 135054 17361 156758 73455 55331 -128811 -90695 -45323 -228620 -85415
11386 81079 27333 -131524 -137157 -51449 100920 116326 332041 -185736 135934 -107986 -77247
11375 -77247 155087 81555 245255 -60485 -161027 -218940 154157 108415 51836 -898 -22141
11364 -22141 -172932 -320833 60594 70022 15807 -145297 -110507 -141737 143393 -37283 -109644
11353 -109644 -55100 297654 160511 173660 -90049 -10024 -137642 116527 51742 168557
11343 168557 129468 322229 -405995 38214 130224 -128423 -88763 -243719 -111578 120369
11332 -140706 -159786 -382341 418797 21697 -39121 128499 25776 -166912 120475 -92796
11321 -179994 -230811 60440 -196685 -22799 -247076 208737 -240431 -16226 167173 65648
11310 68591 38103 -27601 292585 -96361 -25770 -237945 -150591 -69287 -208866 60243 38993
11299 38993 88274 -53802 168110 -380282 -6266 20981 -353505 7672 -55097 -209387 215112
11287 -282997 -234087 -141378 21461 141927 -274940 26231 -395348 -55942 -347334 211258
11276 135373 -209916 -134953 -84548 -397644 230929 -14892 237775 -84495 -220948 -58205
11265 48100 -87316 23632 -60439 -72911 -161904 -31397 -57911 160442 320473 101221 -30356
11253 -56841 -204402 -64069 -246474 60451 -153662 28516 -141295 -72193 -170520 -218302 32221
11241 -343763 -222309 -84332 -546747 -179926 -119392 -16335 -14890 93910 95548 -81257 37782
11229 -12677 -191549 -40752 -292995 -113709 -28921 -126951 155905 -121127 -59757 134392
11218 206348 63999 -321439 116018 -81034 219419 108890 34912 66547 -60001 142131
11207 77642 -20498 212842 146388 32010 -159294 -5788 -384961 140517 -75470 78340 209057
11196 209057 -401041 44017 130347 -18004 35497 -146579 -384772 27493 307051 -47658 84510
11184 -21063 -133910 -248119 -253251 -412448 -124801 -59956 -322634 -53930 19507 193793 50321
11172 82632 -99662 153862 -78147 -82528 -125986 -431105 -44465 -278375 103966 29325 -91972
11160 115263 -465961 172936 288294 -361618 240102 99512 370742 -268890 -211681 -60360
11149 -20151 -82114 107119 -91534 -41750 -143640 -176527 -3140 -163431 -24844 157541 40957
11137 113390 244879 18811 21201 84240 -40958 -60099 -98430 319152 188786 33326 138589
11126 138589 275123 -47112 -97105 118693 61121 -16271 -348035 58550 113094 -82731 -140439
11115 -140439 3374 -251996 223189 -190198 -262499 67452 -148215 63806 290380 400211
11105 400211 96615 238949 303422 316949 -2419 -138981 38581 -89440 553753 27573 155292
11094 155292 -60875 -77601 674226 386893 -48193 -66567 217157 364610 393555 119626
11083 253153 410595 176535 448760 377243 155620 83174 163893 379922 -165038 -98551
11073 -98551 143138 335694 124106 474664 207840 208235 -174092 353016 538100 331780
11063 331780 535558 275379 569747 707394 228692 537144 448352 810217 404276 861641
11053 861641 382192 582467 807452 265135 605965 496019 276099 781778 693500 569317
11043 569317 722721 728128 604566 877504 735868 526529 480599 394625 824449 589366
11033 589366 523622 436945 352243 631101 462143 558461 411213 737797 832481 623430
11023 623430 454372 436501 417473 548940 393652 880049 681108 578678 415617 444614
11013 444614 459780 339998 628665 600499 557233 509065 512579 459400 483238 553856 846789
11002 846789 670523 678226 750405 284239 805646 747732 857870 618250 861167 549498
10992 549498 601596 640320 849890 589950 862585 1047841 760797 967870 1046305 1018579
10982 1018579 1101856 971367 1127233 1168640 1609946 1600077 1751062 1992074 2126385 2235611
10972 2235611 2450545 2427324 2312928 2552750 2345910 2293848 2163275 1844323 1817571 1701088
10962 1701088 1829245 1579219 2317063 2174460 1825384 1981000 2212546 2305354 2199164 1809304
10952 1809304 1512015 1440209 1103783 1028180 904809 711448 437156 848057 788185 138546
10941 314051 531659 132242 98268 287504 -47869 8246 240574 120206 13789 256262
10931 256262 197659 117000 34914 349766 213603 256547 -8139 -11376 157015 306858 251617
10920 251617 201856 -102077 94100 -20163 307797 -151350 -153854 -111577 109923 102551 -183230
10908 139641 -30386 -33596 30415 -182524 117135 -70558 -285591 235504 165989 25634 380150
10897 380150 200606 201161 -38436 -103709 48943 191995 -228373 99724 -215030 59378 106733
10886 106733 16763 57105 159960 -31779 94327 -41365 170914 7320 60318 -60192 248496
10874 -143301 -30070 -213795 -265622 -7402 87319 -111404 472126 -233543 32138 34285 6220
10862 -131184 -194877 41311 5163 -79444 -253222 -3821 -164087 -401402 72488 -155988 -19355
10850 -121205 -207626 4678 -207828 36443 478058 30425 -13255 -52085 252866 113546 -11593
10838 190504 57678 154229 -14009 -24368 -41585 -66720 43679 207852 30255 -231600 48295
10826 -246323 -69978 -130166 148318 -161499 354612 193089 -66577 191766 -169469 83039
10815 -10105 122130 210813 -31531 18361 -490733 -143823 -67745 217122 320851 143088
10804 -275911 -206412 -110248 -3976 390643 -61355 -250647 -204246 102027 -33554 12594 -172144
10792 -13999 371365 -3716 106055 4552 82848 96355 -196102 108419 -176214 38982 -158150
10780 -198664 215286 -125444 -231839 -84111 8346 24969 210635 -203469 -36481 137384
10769 -98585 86280 126514 -315218 266264 -135724 35420 -312174 106637 -340701 -88968
10758 -184770 -123354 9560 153288 -232303 -86087 220302 120771 -68993 -483561 -77865 -257779
10747 -257779 -216435 61726 29954 44611 101263 -134181 -42794 93944 -158231 -256623 -628121
10736 -628121 69189 -226900 -107545 38863 -229853 157080 -98610 132704 87715 -100764
10725 157737 -187050 -164359 -36283 205505 -33524 50735 105410 148557 -91382 -62457 47479
10713 -305174 104259 183605 -110231 -194438 -158806 -26349 152253 -221698 -191700 12972 -296200
10701 -139039 200464 63718 -104117 37626 -87229 17330 -34305 -66399 1362 -286879 133402
10689 371543 221004 27118 -218868 95627 171686 -187696 -159570 -238601 56939 -26021 -87300
10678 -87300 -282461 -65346 -150615 -27455 52149 -141890 15437 -471036 -6876 16812 102634
10667 102634 -96688 -81826 54726 -97162 32184 127900 -41389 -219948 340985 223932 196348
10656 196348 190664 183285 -202283 -167830 336324 -71897 -111197 -215429 19889 44006 -75805
10644 -347800 -248747 -68842 -48092 -402018 91514 -228672 184799 -173700 -219329 -20633 -134644
10633 -134644 130315 -8584 -5429 87148 -269989 -144277 -67882 -272959 58262 -91259 -85613
10622 -85613 -101890 -300620 -103767 -61866 -69265 -249844 27753 145248 -243597 237109 -301744
10610 81637 4477 118846 169085 141028 28857 -216505 280844 -55807 -51 226248 -60779 192293
10597 -150579 -308896 -151300 -178566 236858 -227006 -156953 -57583 71342 73249 -176399 106200
10585 80639 -73902 -158465 -33700 -47971 8756 12890 122286 -65025 80180 -32115 106394 -300517
10572 8359 -107519 -306220 -137907 250158 -87115 -24498 -170280 -469344 37849 163000
10562 163000 14736 644 -176135 176537 -131644 112018 -193345 77725 78602 -145244 145362
10550 138134 148839 4063 291835 131183 -242374 -214167 294104 -215609 -104592 -193959
10540 -193959 135813 163535 199796 -125400 77259 -86676 261992 -298178 -238111 -311454 -407494
10529 -407494 98939 -317183 -105883 -148826 12984 252138 -177391 27838 -136286 360134
10518 104444 -184792 -44525 45277 77531 -255931 -168840 -224034 -76312 -216258 -455788 255571
10506 117827 -161592 -58108 322043 26922 -36936 -313417 -87538 -278864 141786 -77296
10495 88577 47115 -361762 -45169 -236754 55383 8981 -262359 213407 261760 -108414 -85829
10484 -85829 267127 169513 564869 101921 520712 603181 391651 215048 229266 179553
10474 179553 -458260 95835 -4359 -217873 95830 -84310 -13046 33563 270550 -94008 146081
10462 268312 -331427 -71226 -21233 -94 -125713 -67747 125202 -179798 160503 107457 -338043
10450 87621 40879 212523 56301 -155194 -90454 181350 274140 -212721 171128 -5848 400230
10438 125977 -217533 -336812 78270 -428762 107678 -32951 -299388 30564 -111160 -305627
10428 -305627 105233 298360 -40611 109564 348980 300228 39837 98241 -275121 119960
10417 -202903 360601 -45109 -124813 -57796 3423 -9941 -544100 109617 144937 79291 -132421
10405 -24870 -13655 112445 -183903 -329229 -300077 -110834 154159 -20362 300919 -55043
10394 -268925 122080 326757 -229078 -192513 98473 142372 -64630 -87041 408502 131263
10383 388209 45806 146952 32758 286732 -68933 134870 337584 -142526 563285 183325
10372 -8735 -277545 518464 230433 80286 49834 482742 631197 419675 287219 440504
10362 440504 161204 345930 264576 360937 313033 177365 105752 24034 221255 367030
10352 367030 197433 167514 207576 505199 580082 -33805 219126 205803 387985 428460 370250
10341 370250 264968 327641 402371 178176 358701 -45366 293510 -14629 295572 187123
10331 187123 251380 377643 20395 258936 -23758 223304 1676 203657 247233 180376 115824
10320 115824 77633 79471 69855 50285 345321 65410 101407 101875 263249 -228928 123429
10308 -216084 -355690 -105368 -63609 -184169 128236 376795 -222165 263041 -3531 131508
10297 111984 -295240 -28755 128412 -267904 -238640 48312 118272 198897 -273573 -81311 101730
10285 -352903 -323421 2573 -94261 53796 271149 107661 33582 -37639 261413 170631 51251
10273 58688 -62258 176466 171493 55716 82306 -324113 30950 152505 -102294 90721 42576
10261 376411 -177693 -9190 102337 378679 318787 182868 205097 163648 2868 276474 58953
10249 -90905 11184 114005 210131 -376559 118686 -11124 -66874 5012 -17480 -318190 -30510
10237 160749 -92606 13957 -139013 -74334 -38580 168055 11634 -130875 -99879 -1706 -288223
10226 -288223 102759 178952 -32827 -275946 103952 -215737 -114817 -308406 -192758 -98254
10216 -98254 -119268 -245449 -126675 -28635 -327976 -62195 -277479 -233482 -12205 -167679 102269
10204 -138664 106933 198311 57586 -98867 -114996 -97388 -168783 -54049 -78527 -58564 -154364
10193 -154364 -200148 -201280 -319232 -38824 -60312 -89480 -187615 -63040 62597 140845 -139025
10181 -264924 -217833 -105683 -69260 -69808 -144662 3499 -250520 -17367 163991 236828 -308331
10169 63804 -239306 83822 -213354 55157 -61871 -211045 286403 18695 -204748 -423504
10159 -423504 -169194 61906 -265439 -212956 170023 -24889 29992 -336368 66637 165044 -317400
10147 180534 -96179 -290369 -48230 76602 -246253 104411 -106056 300155 -185149 -191256
10137 -191256 -14807 -262342 -91149 -22422 37663 -97973 -288276 -173659 5187 -160911 -47415
10125 -7263 -26526 -204684 -476910 -122537 -209092 -164703 -118274 -133683 -28050 190359 -130799
10113 246364 -333645 685 -186766 -212367 66280 -268354 -41734 -169579 -295029 -205548 -46940
10101 -258171 -230269 21775 86478 -104116 154107 -69209 4396 202182 -165745 60743 99759
10090 99759 -122639 34943 -239951 65222 23685 93602 -54196 -350714 34545 -208830 -42691
10078 -31634 -50289 -353199 -79597 -352704 -137128 125795 33462 54236 198642 25962 18580
10067 18580 25688 -158988 -50646 117830 -65518 273742 -63268 -245207 21470 -166678 -421392
10056 -421392 -165904 -233289 -105126 -78324 -107374 25016 -36214 59014 40473 -96066 25030
10044 150564 -145266 -26224 -111457 102786 -312892 -106282 61514 -278374 -148949 81650
10033 46708 144583 141469 86701 -192417 -211831 -124256 -20068 -310487 -6063 -178393 -194088
10022 -194088 -158243 230361 -244904 -211538 -87741 -109951 23000 -272114 -95295 -219391 10559
10010 207192 -73120 -240576 421693 -208402 -250244 141674 185083 3996 34056 93120 -131390
9998 -271501 -350063 -11851 -182828 -41729 -127643 -469744 -122433 -260707 -59892 -167768 -93075
9987 -93075 -72786 -86647 -66214 -98763 -357704 -29331 159237 -196360 130904 -152375 -425560
9976 -425560 82671 78563 167585 -41118 -131993 47785 -238208 -170676 67542 -453933 -314349
9965 -314349 -100261 -121428 126055 -264138 -206336 -198593 276157 -39764 7297 -135062 -166041
9954 -166041 42439 259267 -50409 -81786 -63015 -235489 353193 47347 -30258 -30662 262631
9942 205756 80089 33452 189122 -24154 32820 -322675 -111900 64552 -201513 59179 49433
9931 49433 -295230 -37044 -110111 -287217 -128223 37388 -120882 278585 -9904 -166764 -200109
9920 -200109 63799 -189464 -3341 59780 -96482 168396 -387928 -161605 72686 -211828 -99141
9908 -68509 -32081 -164162 -246074 -533637 -617617 -123406 -51466 76752 -225498 -198253 172956
9896 -66370 38504 -198373 -15032 -116761 72559 -402161 -207571 -184553 -337821 -11548 168448
9884 -47454 149502 -93061 -97479 -65199 87436 43675 78004 191071 -174780 -3019 -69432 43366
9871 23913 212205 -40533 -647 -96031 118763 -132407 127822 -270138 71832 111051 27259
9859 -56489 -126697 26323 -91849 -21896 19273 -327474 -93209 -138373 -69281 -122360 71447 -40047
9846 90325 -88979 -289995 -365331 11139 -197577 -44263 -179842 -153622 -50214 -179313 247828
9834 82748 -31843 88744 -25291 -20006 -133467 166668 -435387 -127567 62699 -53160 -101687
9823 -101687 -105035 77470 6734 43117 -45082 84905 -71312 -43000 -224626 374272 130532
9811 -21454 34231 288881 29475 42345 -65800 -92058 97943 -35178 -114719 154560 89421
9800 89421 13282 -258200 -209598 71710 126628 -331499 132542 -163166 -25774 -145029 136
9788 -70042 -20954 -15635 -289239 -91051 -256767 12382 -87361 171724 -169593 58031 -264307
9776 -83940 53428 -31962 3991 85658 171057 220029 -62087 -385249 -127002 10808 -194880
9764 -147784 -96712 -317676 -41223 62015 -216408 17629 156224 -114610 -437742 -23119 -47622
9753 -47622 -299818 182266 -111417 -178601 -247569 -176932 6873 -254580 -95783 -121907 -132858
9742 -132858 33982 -40045 41181 -350873 -51260 -127468 185840 -244571 -347114 -139843 -468902
9731 -468902 -124245 -54154 -338026 -48769 -192498 -264219 80981 117175 139426 -55553 77618
9719 -9975 -53339 -99591 -216588 -332616 35958 -153644 -130276 -45534 -301482 -125121 111448
9707 -77393 -323082 51508 -422739 -395265 121297 -33016 -39945 214174 -216878 -240751 75980
9695 -48383 27608 -96934 193105 92755 -141742 -207646 150780 -115438 128575 -46478 293119
9683 -84128 204604 -193593 -138866 130738 -163259 224051 109158 -395797 -178351 -176391
9673 -176391 140112 -39481 -248327 187575 -86029 -130949 -120598 37576 -332555 -134651 -162735
9662 -162735 -216067 254516 -124815 -106396 207398 -91734 -67273 335412 193726 -217222
9651 -72426 -127683 43534 -92332 -271193 98778 133507 -181812 95194 279127 -95569 -103200
9640 -103200 1311 -306236 145085 267808 -313528 -96003 -193836 -117746 -71371 -55780 -219363
9629 -219363 -111193 -67168 -225905 -252430 -30186 -108136 34813 -95056 -196281 53815 -69700
9617 217802 226385 53712 -92533 -111755 -205647 6725 205193 43438 -335298 -19272 -205298
9606 -205298 -21869 -175296 -189304 -125935 -56447 35906 -146013 -287880 76446 156910 78839
9595 78839 60909 -72640 -141160 27183 -288865 -199105 350487 -93928 88401 -377140 74418
9583 52341 -319487 -74594 270492 150281 160772 -79825 -45691 103928 154669 -49076 182100
9571 -78084 170384 19053 -214694 194792 102018 7563 53858 -243265 -261845 -111534 78251
9559 -223187 -117585 -303748 -27253 -206367 -454232 38875 -58411 32782 -289360 86057 -159289
9547 -83613 -162430 -897 -183239 -91296 -162242 -213631 -284508 197982 -179035 17174 -120849
9535 -237560 144705 113541 127885 -74292 -19133 -167527 -64490 -112880 -121124 271103 429036
9524 429036 37712 -206685 -64161 33306 -228536 -24946 -136382 71185 15228 -189976 -403096
9513 -403096 -1491 -152559 -36673 14875 -221486 170672 61751 -129392 -379274 175364 21710
9501 127724 -272988 -227882 -262056 -132979 -29675 51471 -150126 20899 -228315 28236 -309099
9489 -42588 -161778 118460 200685 -83027 -130018 -100150 -185560 -151664 127027 32356 -420701
9477 -173128 -175884 -220710 -27736 -82053 -48685 -122233 52220 20323 84588 167055 -67395 -201271
9465 -201271 -5924 -159995 -103974 -18998 156195 -25838 23878 189929 -58794 -250324 3270
9453 202918 53464 -54708 -259376 -100745 9238 287693 -32242 -347437 -35208 -18427 -24794
9442 -24794 -55698 -345505 -31051 -74553 197510 -108495 -92704 56060 -352650 60130 136073
9431 136073 -12985 24777 -271506 387657 -110694 191226 159548 -153887 -26958 28332 -300079
9419 150750 -68678 -181060 180133 -255211 -302104 -171873 51174 -383762 31338 -52113 224941
9407 -313494 -130917 -9727 -50313 7180 -128417 132095 -402316 -85200 179850 191339 373693
9396 373693 19968 256101 -315934 -41970 -86389 -118222 -22228 1002 80749 -103044 -156902
9385 -156902 58490 -58787 -239706 -29055 -217409 -13691 116202 339326 74624 -48151 91990
9373 186266 -115592 185551 -69772 -38008 -20395 22094 -220810 264800 -44260 262329 105343
9361 244873 73334 -25624 58247 124554 -97996 33767 187270 243136 32283 -258463 144118
9349 206104 -83515 -263673 -116734 68467 25021 -357515 -43039 71321 -229910 12809 -324914
9337 -63417 -34382 404899 -222493 -141435 18509 -331276 -290821 -38200 333269 69433 89844
9326 89844 -276906 114884 61623 -78686 -153017 -377709 -112706 137755 -26150 445504 -367491
9314 -113191 -160947 -35850 -375144 62613 -141232 170038 161244 -280108 51585 -291724 -96327
9302 -8412 -39626 12163 -137247 -177254 31987 -172074 126724 -258286 -115343 -308663 7295
9290 161657 -240838 -102229 144371 -129046 -12886 142293 -106232 -9131 -26053 -69465 100028
9278 406905 -146474 -318326 -403875 -334276 -214895 -182467 -73022 20898 -225395 -319302 -65291
9266 -121835 159127 -216293 -115745 109682 378726 9825 -72657 269514 -120815 383554
9255 -70804 -180165 26451 231448 118847 178339 20559 -275371 -78522 -333790 -212522 -49172
9243 42280 -51383 -458350 -154555 145372 257246 -218245 -3816 -181741 -481969 -97492 -177486
9232 -177486 -377723 106818 -35352 -49523 -370130 -31215 -73691 147813 -287172 -5412 65297
9220 -28054 257874 -151959 134747 -93664 -208459 90651 -147135 -88942 17917 -7428 -211432
9209 -211432 236128 100195 -18156 -92529 115727 -627775 -436038 -45086 -93294 -44748 -348656
9198 -348656 -185486 107079 154240 -113522 57019 42394 -192747 142278 -186064 -228057
9188 -228057 -206444 -181613 75322 -247964 10638 192774 29930 100024 -54242 -186668 5927
9176 82070 -121164 25024 -399056 255124 -137387 -49848 -103986 101715 -17551 -245551 -73867
9164 184795 190728 147415 6431 6787 -267683 -49083 159523 61183 -128208 -112251 326055 -112704
9151 118906 -255987 283418 96566 -197129 -278503 -136174 -15272 -74471 195415 -30316 171490
9139 -134739 -8035 -373321 -31980 174313 -1088 -205534 13383 -339382 2482 126660 189603
9128 189603 -12273 165367 -1492 -70514 55274 11829 -219565 -150082 -206392 -341546 -343131
9117 -343131 -64804 47421 -144861 -163156 -176037 -401312 -239704 -414211 -224056 -92514 47588
9105 -60063 -60809 49562 38398 98279 71571 135341 -58388 -250380 -347843 314495 -148077 -41767
9092 65002 -172578 120496 -149135 -124551 -313233 40748 199396 -69520 58567 -27821 33744
9080 89810 483725 -188118 -210432 -240621 -152261 16715 11467 39775 -112121 -251609 -70139
9068 132092 199729 136276 -316278 -115762 -175161 -65371 -197278 110557 64705 180943 -449896
9056 67883 -380521 -52423 147924 -54527 -363289 139105 286417 137063 109507 2081 -410615
9044 -422249 134762 -153506 4579 7740 160336 69537 49897 265532 15280 -401113 133560
9032 -185012 -116707 -109947 -9437 -368643 212754 -248180 27464 -209890 131532 63578 106034
9021 106034 58847 -243373 -208860 51555 -145507 -119203 -75832 -124963 -89030 -62295 327973
9009 -255367 -26645 -59190 -145256 -71703 -44833 -78426 12934 -221801 -177886 -107307 113878
8997 -169889 368738 292693 114144 25156 -52884 103497 -26353 -356740 -50202 51520 -247541
8985 -92007 -133609 -31505 25502 50897 -145240 -47960 -74513 -209922 -88263 -199060 -73161
8973 -106715 -67051 35122 84805 -97916 -132112 -421873 -159194 59728 188268 -19251 -49275
8962 -49275 81341 -17199 132821 -106077 82541 -73655 90868 33719 -118497 -124966 -265955
8951 -265955 -147540 -65243 -143229 -65881 -342928 -83873 -112688 -283704 214955 -38619 -16926
8939 -222335 120448 -49100 98244 83622 94398 472809 -112536 -169596 -65352 153840 118522
8928 118522 -55538 178459 249763 655139 1036295 2052022 5027248 13829653 6884807
8918 2066254 802565 486168 403678 111161 161643 -8565 -108475 -239079 141506 126763 200423
8907 200423 293426 104168 -341640 -179477 134644 -77592 -166747 -77838 -113147 -150754 111481
8895 -123884 -104481 35283 -121345 171024 111651 294709 249184 213521 -101455 -164982 184981
8883 32843 -175160 -94641 -209513 -78451 207541 -247490 -98717 -55825 343322 -154626 7780
8871 124178 88984 184129 -51338 -251724 64988 37159 -96911 -262039 246918 -80489 123836
8859 46685 -322424 -158532 -197741 -43390 -64241 132425 -316491 16128 86060 -24378 -36253
8848 -36253 214812 137413 -158797 72494 20597 -72969 164821 -175852 -6408 140695 -67545
8836 -57899 17080 -97529 105479 49943 -145461 -285798 -120328 -19340 -186124 112478 -264093
8824 -174999 -296136 125546 -15440 -197803 -151737 118447 290455 -85017 -342876 93137
8813 35931 -276283 106148 -331010 33349 -381959 100632 -10119 76681 -7180 -305292 -187799
8802 -187799 -35017 -155013 -81948 -90490 -213070 61601 -219108 9642 -47642 -153942 41936
8790 -42442 78628 45022 -124376 -179573 145121 -210832 -41773 377510 205416 69543 -119884
8778 -8573 24001 63036 -157214 180250 -47568 163072 197728 -356949 -239243 -315249 58201
8766 -168339 66230 141624 17469 105990 -74109 -78860 322617 84687 63490 -139415 -274775
8755 -274775 -32283 -112323 217104 -194177 25509 -369557 -66974 21308 -86184 -30472 -37792
8744 -37792 156936 -101152 -104605 1176 -115865 60638 29269 184190 -157788 240695 -212711
8732 -266905 -410511 -174365 -108378 283308 -246744 -31046 -79253 -132151 5044 28505 -108991
8720 -137257 26575 101704 -92577 -285039 26263 -145607 105936 32731 -41651 182558 49456
8708 -111981 -67193 -301740 -327576 270219 -146744 -92444 -106810 -195148 -26549 -116712 266039
8696 346079 34895 89393 -20773 -25464 -22187 126856 -88614 71472 -229048 -21257 68665 67045
8684 67045 -115589 204511 67562 50509 359578 -23826 -222479 56325 81804 -382674 -127446
8672 70578 137648 70535 -6630 -146424 22215 -92637 218649 185863 -350220 -109509 -207730
8661 -207730 -375631 97366 -218333 -199566 131475 -358149 -81068 -266999 -57685 -213719
8651 -213719 -93179 -5776 -232232 -180148 -68610 73160 -99568 -102912 -24077 -67160 -22509 -145110
8639 -145110 -221972 189891 -46650 -4298 146209 -53436 139801 -213936 -44393 -151762 -90522
8628 -90522 -115323 220741 -12130 -393110 145825 -58675 132767 5701 -20438 17143 -44868
8616 4433 458923 62064 138639 242833 -39060 -175049 -104236 118916 -45791 -97112 -71074
8605 -71074 -129614 -137988 -381527 165269 -45293 -31086 -41998 7102 -92711 -247194 74841 -99099
8592 46687 -111169 71292 -96932 178187 142163 2713 -67580 -62324 -119967 -192624 216647 -41975
8579 14719 -215430 96552 270994 -51107 -47372 184751 158631 298534 -210575 -478181 207327
8567 -91282 -27189 53763 -125947 -119013 -10492 -2369 -82598 -140211 -11298 -6358 12392 36947
8555 36947 -2803 -93958 -2733 -95772 -396049 -376763 -253480 -63054 -339418 -10327 -64476 -175782
8543 -175782 -59376 304016 -30423 14940 -50664 62197 -160826 -362569 92135 37543 66829
8532 66829 -213509 -206516 -12640 -47652 -198226 -100299 -132047 -150945 21132 51182 95011 219431
8520 219431 -309030 -89282 149856 -178233 -88593 -278157 -198309 -206597 31216 -312246 108096
8508 -247108 248005 83270 298216 106968 161499 27032 -10429 10117 -14070 -61418 71895
8496 -107952 94142 189932 -69815 -110158 155702 200033 75362 46626 261844 -157902 -73486
8484 202867 -58840 -178929 -318321 -221128 166607 166363 -49617 98665 -24797 -283485 -138781
8472 -179961 -65979 -127964 -83048 263866 -33595 -1625 -320475 -453287 47931 -209961 -347561
8461 -347561 188159 62673 13567 -89510 53153 88244 -69531 20115 -41767 -1769 65436 -206418
8448 -282719 -227339 16669 -186956 -177029 -40288 52423 40219 67881 -474282 -126860 -19270
8436 137648 31784 127706 -119502 -159285 -138922 196923 232646 -354052 -329695 168544 98982
8425 98982 -35639 -251254 28803 -85169 -269714 311360 -144734 -146556 -13179 174812 -263562
8413 -156268 -235623 138236 -96899 21067 124279 -93448 -173907 -89862 -145544 -121174 -256906
8402 -256906 -61821 224875 10987 -528560 85696 77302 -82926 -77784 93276 -39904 -275346
8391 -275346 -39139 109493 -275223 33588 100347 -35326 1152 25858 269944 62694 -152886
8379 -97159 148157 273605 143649 -323150 122345 -231378 -126047 9356 -340770 -251334
8369 -251334 -106746 83846 3113 -92311 16620 -271022 6356 -71068 67778 21147 -107791
8357 7454 -374439 217813 -13046 -143365 -225264 -83179 -103541 215859 -93666 140615 -736
8345 39761 183693 373385 66941 -147797 157241 3299 -2929 485033 100655 -247391 -53942
8333 207650 76984 -89869 -115098 -83492 -26700 29094 -370133 -131951 203476 -35451 196843
8321 49181 -63523 -142955 14158 4787 -141727 -93471 114161 138903 -334201 -29631 13884
8309 91966 -164455 29725 8943 -203059 132377 -314723 -279884 326289 7908 -6096 -14166 -204990
8297 -204990 -101551 -259167 466063 -275367 -191574 -166405 79300 61211 -171662 141252
8286 -89229 -54253 -306473 85643 28710 325742 7662 83071 -446365 38401 -91950 20525
8274 -37079 -294310 -190869 -177086 133526 16804 48050 61199 -217415 -148972 101154 -31730
8262 -28287 -243710 -529797 -88248 92243 -88945 -136657 68564 269611 -287231 -148710 -216386
8251 -216386 132477 -2335 -32773 -103367 -274716 -336891 106671 -137367 -148319 59776 172586
8240 172586 -134863 101549 156928 -230577 -198311 -228309 -82030 -262722 -182082 -249035 -213571
8229 -213571 66957 66389 -46968 170065 86625 1007 -401020 99744 -186108 100587 184184
8218 184184 -118955 -226232 -164068 9697 -205765 119679 102508 -25657 -69406 122595 -125456
8206 -193997 255120 -204274 92961 538180 -41262 386314 244143 276643 160108 150625 60021
8194 -252053 65830 94705 -69635 -86366 64483 -149843 -117675 60221 29129 127441 151418
8183 151418 -3313 -237547 -181800 -110007 -196050 27321 -105231 88619 11774 174497 116647
8172 116647 213873 -140309 -5111 54068 243580 210751 -20416 -456 -34312 -197354 -114264 7783
8159 -192934 -47541 153198 110493 -62974 36740 -77896 -64753 -107420 -31397 -91854 -78050
8148 -78050 -97509 -93728 -329530 -76649 -8854 -184332 42839 77280 38196 -91047 -48748 -48036
8136 -48036 -17500 -19546 20024 -348401 51730 -68629 35184 -335046 -173028 -74304 63282
8124 -943 143538 -18099 -52220 -181600 -51006 -16132 40361 112454 -201279 -213600 38507 54116
8112 54116 -155438 -20651 14829 84493 -343715 119217 92002 -199773 124769 -62456 241996
8100 84135 -156881 -184612 -73362 -11676 34806 308771 160582 -82778 -87821 -33521 1822 62948
8088 62948 116382 -75159 58475 -59172 193883 -41337 -155235 -135040 178672 -310050 -7467
8076 -270387 -321363 117548 -138470 -21894 102330 79362 -161944 -87773 -260059 -98978 -76747
8065 -76747 75218 53009 -100762 -43837 134695 -227859 109930 -219233 -137367 -68881 117457
8053 630 215501 340507 -215092 -211867 -324804 73625 -258274 -10787 -180704 -357443 -90355
8041 -58632 -4746 -9800 -209082 47885 -247849 -163280 -1812 -305850 87453 -151228 148861
8029 81405 -147812 -116145 189346 32295 -84493 469 270482 -81986 -106860 -24373 -159384
8018 -159384 -157449 -213453 38590 -364839 -108381 -239668 -48171 -154811 201747 -39333 -29854
8007 -29854 -14832 58749 196064 -362155 14780 -117895 -103962 168251 -195167 217617 107746
7995 -49905 -192758 -209703 -488958 10470 -59644 -268795 -164180 -84366 72105 13211 -257024
7983 305182 46608 15622 -18191 -47232 -147048 -44884 -66277 -51937 -197032 455958 210770
7971 -225916 -127824 83998 -171968 -196409 -225116 -382958 -275449 -229400 254741 151467 -147537
7959 123284 -184138 -125387 -115229 -31176 -26987 -134062 102241 80795 -83511 -293190 -251434
7948 -251434 -173822 -183465 -89726 53801 -97255 -464628 -71194 167975 92966 -7648 214805
7936 -277988 -217486 -333414 -321929 87846 74471 59211 134403 -62106 -323325 -256500 -255537 -76060
7923 467697 297198 -2261 -135970 -157061 -56251 -49506 215672 120079 34603 -131120 -98916
7912 -98916 9973 -118196 138634 75910 175551 -180957 -329958 -282953 334871 9188 7633
7901 7633 -244468 140473 108335 -299745 -52048 -320244 -203823 -1076 40448 -191735 125420
7889 -4137 -262931 292779 -95034 -10291 -78771 90504 143565 47387 -121095 -8553 -98115 340099
7876 302205 85153 35399 110567 -166532 -10743 -105179 -320831 77996 -235976 -281741 183958
7864 -116604 -206479 73158 66221 -133488 -143988 34603 -7533 -1216 -237534 84759 -14770 -210340
7852 -210340 -21709 -265740 4326 -169294 74450 -60204 88443 249450 72214 411905 61725
7840 48470 -144517 -51371 -62272 -175873 11085 -210922 -82351 9956 -140000 377436 -45152
7828 135798 11411 37143 -288877 -122965 -270048 -69791 -62254 165528 -196835 -485447 16896
7816 -368779 296461 -302212 134739 48800 58041 -31357 171851 -308 -129831 253156 79309
7804 -98104 -293116 -198809 38274 156141 112438 -218114 84443 -224458 -313297 20861 -106451
7792 16904 107848 35890 -196661 -284645 228969 223961 274710 6936 -199703 -96238 83404 36256
7779 -209205 -141658 81145 180212 80455 47865 198553 120387 8401 -241960 -88684 38313
7767 124381 -259108 158261 33437 -114972 177228 -32077 -106256 -284981 29109 -28091 -9358
7755 -197860 245207 -92725 -182461 -72808 -87667 -38964 -336597 61691 43486 -104354 -148282
7744 -148282 -49033 -71923 -12096 -374 -40391 -240337 -20210 -106622 -77341 -30253 35784 -225423
7731 149021 -162852 209254 -276980 87169 109617 -196582 -4788 -106641 -266528 128822
7720 195070 -123770 -267803 70853 -80211 -315783 47749 58882 -245702 85068 30558 -36730
7708 -29864 201209 -40508 239733 -17174 -192630 -104972 -52389 178506 -94399 12600 -125621
7696 -301372 38741 100175 92452 180164 -180219 -180364 242531 -180067 155437 127659 152599
7685 152599 108613 41029 -143098 -58583 -235104 -327778 -61916 30493 205847 -39879 -216300
7674 -216300 -308552 -54810 174134 93362 -45895 62078 -26335 63778 -318440 145870 234254
7663 234254 -20923 70671 22705 -234829 -147203 -285120 -247201 37159 154324 69295 -512763
7651 -164115 224185 407405 120074 53061 -338974 -8567 105653 -53718 -86811 -135182 -132819
7640 -132819 -215893 -154918 -226944 -352567 -18133 38168 116140 -23373 -177560 -48899 -120732
7629 -120732 286232 -161374 -365632 6338 -150610 -183599 -160357 -191453 -367595 -122482 -210259
7618 -210259 -113876 203646 -18760 -323765 81898 199196 -314284 -137638 34832 -160277
7607 7301 -153890 -131941 -199311 181519 168293 -282248 153058 46426 -140790 74250 -83663
7595 4285 -410066 161575 52708 250381 -185451 150844 152388 -30309 234948 -275440 -228883
7584 -228883 -198411 155135 -187987 208647 -179574 26263 -152758 -328653 -381460 198675
7573 -379222 180825 149409 -12444 -13393 203790 215910 -44120 -157985 75383 -82019 -309509
7562 -309509 71631 345895 -200477 -198769 198420 -139232 -397625 59962 -219692 44318 -41569
7550 192240 270168 -180209 -55341 -82005 -193509 26607 -321531 -98622 102896 -131413 31487
7538 -146388 -156141 -218362 -64557 223260 -90163 -287879 -276852 284210 -180754 8214 -33863
7526 360791 35120 -39244 257700 123913 -153952 -55312 -41819 -143946 156881 10834 -59270
7514 -89919 109100 -107968 -135359 110984 -90531 140973 -272050 70460 110617 98517 94490
7503 94490 -237755 -61879 182615 -199307 180719 123088 145725 114779 -183830 -113061 67966
7491 -30005 213930 -106215 -153859 -109423 -217377 -89641 -323497 -739 259124 -97494 135246
7479 -64129 -67256 -82027 -365052 41741 -175113 -300199 -345712 -87940 166716 -212526 -124391
7468 -124391 145009 -191125 35265 -7700 5447 90067 -92556 -114093 46291 -215231 200057
7456 107181 -48283 -102471 58497 106430 -44561 -51105 141436 -84503 -8091 -18990 216 -204435
7443 -47132 72751 -14144 59217 107598 106749 52137 28998 -45068 170685 24839 -158354 -55173
7430 -67450 -113084 -173829 -185178 -89696 33731 -171037 -23126 335656 -182689 -211255 169630
7418 -18896 31491 96640 -55195 53155 -12753 4685 -432097 10575 213267 -6873 44903 532290
7406 532290 -31664 -56133 -156505 87549 21515 -270148 -132901 -373086 -263269 147270
7395 -282393 -19998 -112245 -227889 -239029 -308085 -102022 -289053 -121489 -53795 89354 -202892
7383 37310 1282 -291048 -166946 288107 -95764 -226554 39942 -74842 -162306 -210015 -102480
7371 -173508 -70323 5392 87720 -83386 -229260 -81566 -237367 92640 75785 -144173 -156725
7360 -156725 2290 140333 30347 -104589 62333 41132 299049 -1080 -183956 -132537 -140374
7349 -140374 -162910 -158739 114795 -424592 -68535 -137473 -10960 33134 193744 -50341 -196302
7338 -196302 -261783 25083 -197313 -308285 -86360 66173 -190070 -281026 -75195 191738 76779
7326 49574 -86748 115531 39158 -67700 -119811 108166 148758 -59429 69460 -88353 177365
7314 -39380 -201081 -16495 -56693 -121137 -183867 66882 115107 -217331 -37036 121701 187864
7303 187864 73722 882 -73543 -234788 -53646 -344139 -70599 95817 13061 197241 43567
7291 23244 968 119095 -80231 213760 -51802 -106557 -287934 179053 3 246264 -202725 -163437
7279 -163437 -319689 -68228 70545 109161 -13871 -181350 105160 19102 131473 93921 -70373
7267 126604 -58814 4893 -108334 -113240 -61218 125086 113004 92125 -128486 -131336 -26585 -156261
7255 -156261 -340260 -21495 48811 -47867 356760 122427 -23690 -181240 71203 152575 -184742
7243 -75867 109625 143708 -213777 75661 -6089 -119978 -36470 78057 180564 -148351 189540
7231 -132231 372171 -82221 -143906 113930 126035 -106905 -9373 222347 164892 8971 -83776
7219 -264612 -169406 -100829 -245292 180715 257445 -114271 242703 98763 -199953 340331
7208 -325149 49180 -199731 -62538 -237330 -166668 92983 196306 -243148 176685 -110851
7197 -206643 -60153 -13858 135355 -129508 -2148 -55704 -65962 -195944 -7792 -237846 -336395
7186 -336395 -19234 -145834 99219 -93014 -186028 -129369 100159 40015 -17066 -64206 -176985
7175 -176985 198790 -4624 -68577 -35240 -228944 89684 92671 -56451 -7449 403046 45577 274682
7163 274682 -282992 216852 -246752 32400 87131 104178 38613 66102 10582 -48303 -75347
7152 -75347 155426 -6599 -255345 -227551 -77584 -270475 -153613 -40029 182488 -50799 20281
7140 -162384 -223670 -88104 -1797 -54 27139 -270014 196000 -136797 -88126 100408 24048 124901
7128 124901 -214691 19051 22264 33887 -8164 319088 -58504 -102831 -335825 -41376 42533
7116 -134845 114060 -168768 24379 -319012 -19027 49722 -32432 -51045 -61871 130912 198460
7105 198460 -179352 -341630 13614 -246161 -157253 -110571 -207549 72458 201581 86293 123472
7094 123472 -19819 -41385 129329 -97315 -31265 122780 -66225 -108820 13116 274556 39054
7082 -123713 -134946 -102969 -133740 -40945 63004 124221 74824 -27137 -205743 -184632 -429558
7071 -429558 247290 -195667 124800 -49600 49417 -190580 81356 -350477 -142242 -8386 190962
7059 -70746 -2471 91247 -118465 -332962 -289374 -83531 136941 -167695 143145 -22192 -83043
7048 -83043 -12705 -383319 288624 34686 -283207 138750 -212029 243059 -50188 -49346 -120111
7037 -120111 7473 32106 -382074 -102239 38624 -106918 -112054 39610 -400220 -10543 -36101
7026 -36101 76981 216075 -142035 -137078 -148366 -119107 288393 -198806 84622 -77385 -186010
7015 -186010 35354 85269 -51605 -91255 -78972 33216 -150198 -57599 -220484 158492 81390
7004 81390 193418 -328839 -213127 -50094 59211 -191254 -267655 262755 -73970 249658 133959
6993 133959 -63408 -83663 124853 -170465 -99124 141902 -39758 -52586 -319236 -155732 160606
6981 -248441 -33419 -180870 -120957 8703 226539 -70248 -234871 -35031 -103417 -270231 50250
6969 66632 159824 -210263 -33988 -189305 -46095 176629 -167679 -95256 165376 -37869 -158596
6958 -158596 -142233 -56179 222943 -178862 -227472 90861 24146 10114 -28071 -50099 204439
6946 -7795 39702 -143030 -292208 -75157 39377 121525 78856 176367 349868 52378 -227615
6934 25231 -141360 81803 -248780 -310229 53646 -67132 -79780 -164063 58266 -3593 68405 -107209
6921 332055 145968 -210859 303474 342783 -45134 -879 -101171 17715 -34682 49794 2222
6909 -51394 -112277 87645 101161 -343705 233503 3723 324181 55202 214518 -247840 43705
6897 -440774 265267 34735 265420 257014 54613 14283 62719 -18373 60201 -340770 58808
6885 -304582 -200590 175463 195546 138050 -43214 -156050 -233354 273103 100454 -191237
6874 -308951 -11395 -69796 -295079 -286671 -180003 16790 -76041 141377 26963 123426 -60433
6862 -343230 -131449 -204108 -349111 162820 17014 44177 -122399 87368 -266825 103456
6851 -28887 -428349 -39583 -3411 -331747 183515 -40677 105125 -76867 -62550 79483 -86841
6839 70345 90436 239693 83939 4337 -37740 -75874 -312802 -192746 33133 126369 -103920
6827 -272710 -184680 -396722 225579 113667 -44405 -456440 -169548 -117778 -94898 195113
6816 68647 -255921 185970 14322 33222 -170816 -14995 62831 104958 -134210 51036 12868
6804 -229540 5136 152043 -190747 -188804 117730 -131558 23726 -43265 48355 -102422 95885
6792 -25663 16543 -101357 48569 -114607 -223377 237160 168719 -286871 105564 156354 -14727
6780 124801 234302 189415 219870 57786 -31551 -30464 -148430 47171 90780 -124770 81115
6768 129714 34906 -210034 76555 47102 101413 218151 35958 -309570 -40477 -122651 -45015
6756 -67197 -43040 -58493 -6037 135141 22819 120272 83839 135340 547394 -102033 -151719
6745 -151719 2840 -171871 -85457 221007 -106595 153494 -97843 33518 -77291 -225445 115626
6733 -166002 -142115 -126939 155470 59950 62110 66215 -134748 -46552 -66755 60437 22794 -221220
6720 -40559 -61578 63954 -104748 -164919 -112592 98430 -280781 140278 -80431 -62424 -206045
6709 -206045 208362 -64827 -253888 -125738 -37794 141688 101724 -71294 102064 -197014
6698 -248561 139565 -171315 -195562 -318832 -140558 -2576 210860 -80845 -14658 -45589 -91764
6687 -91764 -373944 270655 165887 165485 112335 39641 -48111 23423 -18304 133565 66928
6676 66928 -95862 -241890 -7951 -281898 -133243 -76302 -118063 -232118 205250 -194753 -87689
6664 132483 -396520 -99083 185224 -262854 -235557 -343419 -224510 -85910 548592 -8035 139513
6652 -153844 -239788 51334 21121 -259705 136686 -61045 152572 -37417 139784 179728 32680
6640 134410 75762 -52639 -112902 -67498 131941 -328397 255253 183140 189727 78432 71318
6629 71318 21173 -90034 -70321 -105595 -282888 -192509 -230671 -216513 -179908 165563 -58982
6617 3787 -151060 -32639 -147352 133105 -187609 -95094 6696 -179735 226105 -145466 294395
6605 -92852 -12181 276649 -333667 222115 -158301 -285023 164312 -312182 159629 109874
6595 109874 -82705 -220419 103239 -40400 -133320 -17275 -77301 -33953 -1262 71678 46007
6584 46007 -40003 -82094 44062 -178059 75485 41420 169541 150801 72176 407904 -114879
6572 -44176 -545646 -328767 -247008 6668 150778 135688 -51979 118816 -306153 -222509 267839
6560 -110829 -59790 60325 -13517 -55355 -23067 -248800 28532 -72034 158685 4457 -70790
6548 -186676 -64363 3572 -194885 -133066 111813 86019 -42727 -215744 -147969 113090 54235
6536 -247672 8130 46499 -16183 88138 190779 258966 197734 -77548 4854 -62842 401710 36010
6523 -288481 -108600 -136443 -141225 -38084 -82511 24815 -90887 -169353 -16402 -488751 -65484
6511 -57934 91188 251853 1934 208472 -101144 -128285 305354 -26275 144199 -251529 -90516
6499 267731 129735 225797 96470 85286 -67236 -14089 -62745 -7464 -9784 -61770 77507 -179934
6486 50979 6120 141734 -200779 -231398 72602 -211378 13736 331634 255825 -22940 -170575
6475 -170575 46959 -207995 -85296 -102459 192205 -33942 -264534 20478 247639 -89011 24098
6463 -168650 -290852 -38434 -11850 -27732 52920 341696 -61302 101148 -193638 12578 -203451
6451 -6035 66188 -70618 -72783 285012 -295782 -164672 17944 -449177 55453 -78616 -16278
6439 -224746 112020 -12081 186851 157992 -19935 -183162 -85703 -169994 -105229 -141020 -83348
6428 -83348 -15877 271496 -30910 59181 -107811 -9539 -87561 -180242 -77494 -306552 -257186
6417 -257186 -63045 -61845 -119361 183077 -159800 -174631 -213985 195094 67416 -15338 -48177
6406 -48177 -14556 -128883 267575 -25891 448409 274266 -121671 -158014 129096 -253583
6395 85188 62541 -106263 -165795 -141304 308012 95231 -8230 111989 77209 -7361 4017 190378
6383 190378 130770 -5588 -96248 100382 -121519 142921 230569 -141044 -19826 142529 179008
6372 179008 -133152 -144876 -109113 -284162 96514 -203777 -193295 186977 87862 -150465 102426
6360 42878 -23105 104567 162118 -47210 332973 185107 51576 42893 175925 9542 35023
6349 35023 27771 73594 21847 95882 -112240 296608 -44592 -92870 251496 -179477 87500
6337 111492 183167 -164788 -169991 69335 -142498 112804 -99964 302304 226823 -75198 -88948
6326 -88948 164643 -97726 -126326 -29477 192535 206660 -30438 159467 -66337 -152157 116613
6314 43077 15241 -92006 38396 187163 65030 14309 -184072 -84572 128796 -281011 -140169
6302 123685 147999 41659 129622 -171890 -184810 92279 -100862 73121 22251 -208080 141090
6290 -1537 -433308 -204988 -28844 299095 -328183 -11251 113270 -25043 -139135 -93037 55715
6278 -88487 97849 110749 -121868 204140 -264349 83179 -363594 15610 87168 120187 -64319
6266 90817 138092 82884 -230137 -40685 -292254 103030 -344508 -192570 6248 -322538 -115690
6254 122738 -25770 -161303 -103959 -218878 -35391 -185709 -95671 -66836 -132680 6532 204782
6243 204782 25018 82576 962 11163 259910 -18582 -156094 54437 -29329 -99678 21644 95422
6231 95422 222497 -17915 -29193 -46910 -316595 150216 170574 123032 -96697 248624 -1725
6219 -229716 -278092 42714 41807 -118812 168982 22665 258074 -386919 250841 -146702 68638
6207 -151755 167974 23312 -52778 200134 -116981 107726 -197705 -357797 113133 -52843
6196 -57327 -228166 8072 -135189 37249 -188021 -3745 -17845 48655 -180431 -46841 -232484
6185 -232484 -62079 -143381 -150398 -167847 -206695 258556 -56325 274755 257304 -28941 24134
6173 47937 13127 -141295 -71868 131786 272880 -23355 347378 -121930 128297 14075 8096
6162 8096 -71822 -26158 -291545 67183 -82583 189734 -21834 60203 100025 19057 236490
6151 236490 186028 104141 -257889 29641 129627 17769 6989 -115341 -114135 -21224 150015
6139 62783 347210 94653 -146358 144369 -62373 151736 227996 47320 -38527 133454 -31345
6127 170008 -128441 49121 -52961 107805 31847 87399 -196570 -72573 -307215 -24002 38735
6115 14307 138858 35584 133183 -335365 -63527 134328 1534 -59043 134771 -199203 -4701
6103 -76183 -21297 -118370 -140432 -72518 -61095 202358 120388 13779 -159971 162565 -11573
6091 -371850 179857 183486 -197374 163979 148410 -150288 -315803 342574 -32801 -54107 20234
6079 -102089 -86109 -93910 -47725 -223124 -3604 21747 199082 -221178 47605 168352 216749
6068 216749 340634 -13567 298351 -33015 97189 -211033 128818 -175939 -21324 228782
6057 -6840 132828 41698 -158568 -136022 -287584 -147505 -10997 -161915 -299586 -21477 -175838
6046 -175838 184240 273361 83027 244014 31824 95936 -84952 89983 -3264 -86498 -62556
6035 -62556 -209140 -15622 115968 -42631 10051 285456 -120254 21947 -39181 19974 10105
6024 10105 129392 145101 175748 -270815 -163689 267083 -25361 -13229 46456 134951 10277
6012 -67332 59971 23466 -207329 150743 -197944 73114 130168 4104 73102 -142512 346877
6000 -74195 -207108 -60269 176696 285015 122503 -19744 19684 270955 33828 352781 -261227
5988 -38589 -84359 94405 -245633 -173251 52110 -171113 3506 -14542 53522 -12785 -30838 18268
5975 38658 36942 287427 -16909 -99623 125052 -234231 -301461 -506372 211876 30544 -171378
5963 114580 391400 -151798 45364 36454 -251350 -202369 -69354 -17779 85637 -56446 125656
5951 244557 142026 48514 208456 30688 6705 -154126 56053 312301 -16040 211765 -34110
5939 125479 117707 -178859 78224 -71049 -39325 194241 -191085 -51421 -163276 -46331 -211278
5928 -211278 -2330 46419 -141401 -321797 -198236 -106973 -131569 103120 42115 24368 -182669
5916 95110 80333 192487 72768 -6499 -111499 -204820 -398722 -40053 -320558 -175079 -32962
5904 83589 -51296 -68520 365210 163407 -121100 92129 -145111 132957 9257 89351 137691
5893 137691 193188 -241589 72407 -5732 33148 -235189 -201342 -183315 117107 295993 23479
5881 -13321 -129601 -116296 -157395 -256045 -79635 -39010 33174 -89800 -253207 223083 172695
5870 172695 -25533 -139078 -62162 -158354 38157 178252 -313810 34196 166868 -335138 6750
5858 103770 -151830 168858 -180095 -39971 -281089 -20 84020 316098 -247558 308264 4412
5846 39629 68227 342140 -9652 58676 -164608 151043 -25138 -62959 4446 61811 35422 -70607
5833 47261 -26952 -26111 143494 -331475 214578 252796 70239 46059 33540 33065 -152032 -151421
5821 -151421 234831 153317 -54036 28795 -151891 -61161 50702 -78388 94946 211301 15566
5809 20265 25144 12813 240314 -45167 -66168 -9458 71756 120079 -131099 -156872 -20308 -124058
5797 -124058 252417 -108963 -10592 -337062 67011 121911 -234534 -44408 221966 344737
5787 344737 -189392 320 45424 -189057 95423 -202026 201684 232448 480987 -224685 13810
5775 99805 -321915 -152762 156597 420567 55495 38331 -84682 -206410 -709 -115676 209564
5763 40987 -6158 -181136 112177 106936 2385 -429710 -131728 29090 82252 -12598 -344142
5752 -344142 339028 -582537 -179959 -29119 -247500 -19505 -27675 217153 92461 94922 52756
5741 52756 -55476 174550 150940 -221867 -68357 -123494 -179339 -22295 180841 50460 37005
5730 37005 302729 -57589 -20225 -527 20064 420 -113514 -3414 143661 -18174 -4758 -190319
5718 -190319 -19745 115851 -137482 9440 -3498 271998 -149192 37043 84962 -45744 -12953
5706 38336 -76541 44452 302600 -154981 149681 -183157 -10327 -25123 -79294 -70617 -198337
5695 -198337 115208 -45582 51975 -152990 -157051 -138372 -44259 -262669 -68422 -192769 -51324
5683 154657 7937 -220555 -117218 493834 73382 125473 90119 -156523 260832 213101 34155
5671 180124 -6332 -133004 -243546 -227999 128454 4387 -455010 -7654 214440 -66935 411215
5659 228843 -61533 146435 145122 29743 -14127 -62120 139980 58031 227055 -92762 -53680
5648 -53680 84597 -59077 -124203 229201 -197941 114304 225642 46873 73104 -26226 47088
5636 94988 -208671 -88016 38878 -52817 -7819 -213690 243005 338511 -38679 -46664 234401
5624 12232 525 42422 -345890 22111 104890 127740 190568 -93480 -329241 38254 39892 34479
5612 34479 -174689 187785 -270269 -286471 32173 55749 -277002 61893 -142019 9007 169840
5601 169840 56156 341447 71971 -169393 80961 -188467 125275 271989 22081 176602
5591 176602 55242 212696 -142973 203483 271604 207386 -35996 113879 113812 208836 -91691
5579 131239 -217713 274203 -218476 140337 -86989 99716 -239524 -33868 -108057 87009 -206946
5567 -140540 -129471 181680 -65802 224184 -8968 -250682 -291155 109188 292685 29414 -136817
5555 8590 50733 -276198 96485 -17559 -184633 -70920 -106179 254558 459753 -301782 143367
5543 201270 102597 -121402 -209430 183954 -451503 -18499 198783 -136466 330911 163652
5532 -329137 122541 62163 -516759 -229097 197313 -91457 -265472 58976 -67798 7555 368987
5521 368987 107147 -73935 124682 155735 -94560 120249 -221729 -104100 -7377 240184 -196915
5509 -224607 -248250 -59168 63980 76635 337369 43661 -82385 -367630 -76754 -265110 80004
5497 52884 -86258 -259008 -115487 5156 -142239 255923 -172707 -380406 244805 77914 218038
5486 218038 -114680 -95443 65097 64965 88659 -25100 -126744 -452155 109446 8320 13038 148589
5474 148589 -210764 101782 273608 -122946 144263 118677 286846 -145267 133299 46203
5463 30371 -67637 -81654 112035 -191568 60414 -290591 86393 -114428 -28246 136297 57539
5451 143631 311889 53162 159195 -46236 211115 -248592 -239486 -175231 40948 -44405 224337
5439 292054 -117596 2848 -155212 67610 -91499 7969 -134844 -228332 -378991 331014 107848
5427 -267452 53031 230518 -30647 -10798 -190088 -70381 -11623 -88012 -55741 -248000 160375
5415 158183 61508 197714 53756 -120868 138023 96321 -155866 100279 -3016 182233 4652
5403 -257888 156404 145395 17698 -318890 246342 -253726 222621 -161552 -214486 26057
5392 -61156 -204692 -69965 -5925 209167 96652 151477 -221375 74009 115143 93277 -211856
5380 299159 -9508 105957 -151296 -9040 116423 83917 -187744 206724 50623 14063 1573
5368 251559 -121738 -80507 -216236 25597 63601 -60050 132567 151318 -261394 -173749 206094
5356 177021 71424 -104365 -89798 277879 -231013 104480 -34075 97042 61815 -16775 64991
5344 -144347 57657 33619 194425 -21980 -386365 53701 -16923 -76477 60904 -138491 -113086
5333 -113086 -46176 -69952 -166647 -2140 127876 1227 -61 -429928 -6142 -118363 99111 182550
5321 182550 -276330 -133137 21146 -147167 328657 152602 -108173 -116727 15643 43125 -60759
5309 64779 110265 -96426 58467 99792 19565 111006 95240 -206220 163366 18864 36420
5298 36420 -18197 -106442 -26399 95523 145245 -58551 -33163 -252509 105593 -57556 -102409
5287 -102409 -283266 -178192 36216 167437 -361025 -222956 -150140 62732 -141816 -340819
5277 -340819 12785 33713 167840 -175846 102247 -43568 121376 -98637 -225685 42744 -28571
5265 -96515 293476 111028 116527 -20362 66059 -20496 -55675 -28394 237945 -43592 97949
5253 147140 -122625 -165751 22339 142509 217706 91019 51035 -90709 -19211 -71252 -384823
5242 -384823 225818 -126871 129681 -84578 164610 -70268 -245522 35807 -20709 -279196
5232 -279196 -29867 -60142 -218923 6196 23477 143280 78987 246595 -134847 -31461 -330584
5221 -330584 -171557 -90293 -121185 -125766 225996 234925 108383 53524 32546 6613 -14569 253877
5208 -27386 213689 256400 -280968 74551 -366267 292884 68645 -597 -151514 93233 -262075
5196 147430 -94043 -439048 -15283 -8387 -278320 -64455 -291933 75175 37433 6126 123876
5185 123876 -63313 55054 136627 232725 -164944 2306 -39685 -35524 -70111 -203969 -99568 -183825
5173 -183825 60357 14316 216156 9895 79344 -166090 -164332 108444 103458 -616 -346372 16617
5160 229291 199094 -212391 342138 176440 -182556 127523 -15108 70237 149047 59496 36664
5149 36664 -49690 72104 -247671 -137843 265704 -169644 211278 -336942 -300088 -27454 100023
5137 426374 -9143 -50993 162810 121493 -157356 -162996 64320 -144006 -112721 -21322 184443
5125 -44689 38280 -32201 -35912 9205 49774 137259 -228338 152915 129497 10624 -262758 98664
5112 -140365 303 298617 -57489 -44895 -11102 -105460 314796 -406278 -67690 -10567 87332
5100 -424 64058 -72130 118650 -111550 -73860 -230744 130041 -305937 50615 -104342 247450
5088 30804 215052 -209416 -108141 135918 -187817 -177110 27150 96032 143716 47427 -262482
5076 -72966 119540 268064 128663 -145455 -139046 2735 1324 -207154 45490 232709 -18289
5064 4092 198393 -311695 132437 130113 -116185 36291 -81974 -74505 86460 -139143 -114176
5053 -114176 50580 290389 -135867 -94394 47138 -139091 95722 -171888 98014 146432 -2213
5041 216522 299917 19017 -140958 75795 -24897 -22201 77940 109112 20657 -27968 94621 54056
5029 54056 -125506 -65052 21461 -22800 92798 -241837 -48410 -22045 80295 -277301 -112402
5017 38374 24474 137363 76695 -268387 52042 -11601 -103220 196337 -53025 114361 -188896
5005 24902 273964 -217722 -142534 330923 -95746 310465 -124356 -200113 -59227 -123895 -22866
4993 35699 14349 154041 435045 16238 -321060 120645 154814 54487 255123 -80615 311292
4981 -254529 9373 248455 12277 464782 -37997 4479 43313 -98311 67785 -179678 29413
4969 -290185 -83701 -195791 199781 50407 162426 -225436 681389 -85706 -510235 -172158
4958 210977 -186884 -4570 -148556 -115646 280305 36334 136910 92295 57434 138603 281085
4947 281085 67741 -130880 -28315 -150968 230721 14859 169617 -134149 -42544 67269 -69996
4935 372954 -86381 162676 -162451 241034 134917 271155 -223149 43116 114891 292374
4925 292374 272387 83038 336836 -89152 -351698 -33582 -233930 -279475 -72017 342252 186816
4914 186816 -90662 116133 156206 -145049 8519 61717 21923 -57278 -42248 147114 70069
4902 182153 253894 -103285 -38284 -303649 -4531 101511 39578 -27840 -273099 27387 42246
4891 42246 318533 157635 220492 32925 137490 -150366 81975 31130 74719 -125347 -108366
4880 -108366 -44987 -52284 -5413 281659 -238808 133934 -113978 257794 41027 -54331 -11131
4868 -30748 -213404 90019 -152838 127883 133787 -200990 -150109 -141855 -43682 -283608 -116414
4856 115175 211094 139368 294534 -266433 -75624 -189268 -182086 -96870 51794 208209 263463
4845 263463 -93916 -248709 142096 149607 -182196 87265 -5548 -131242 41205 -375374 -183818
4833 66442 -103750 15165 -49425 -99849 -201224 281798 65152 -180060 -212633 176329 102595
4822 102595 -115686 -184492 49971 -9465 -48720 175381 216873 249828 240106 235615 -62422 -24522
4809 -246681 149139 149963 172731 137794 -145136 70466 -8942 112128 -169510 105668 -6099
4797 221020 79035 -6808 126750 -179083 16807 139337 321036 -282648 -145558 17216 91041
4786 91041 -356120 42254 -5904 -240724 82423 131652 178114 -63152 -158753 118651 -108447
4774 -31131 73664 -116820 103390 -110072 -163548 -40927 149694 -2120 208530 -128905 -197302
4763 -197302 -188982 -92166 -90278 74564 -218828 51163 -62865 256104 -273920 -161192 -61518
4751 -444969 -265736 -29007 -137528 -45559 -169813 269912 249324 102359 -21753 167368
4740 -41165 -65321 -34416 -283747 -572209 55405 213859 188578 -13111 -61912 153944 -121064
4728 165564 -136437 -65241 -13502 169615 -65597 52319 68419 199843 -25502 -198019 -54159
4716 189383 -22497 70897 102833 177032 -19062 177181 54119 -71938 -166621 -197465 41256
4704 137976 -144432 -114697 110249 -10556 -125681 71435 -290470 -295139 203515 110904 -202312
4692 -23021 309252 106062 132963 -454167 138791 -184176 188529 -68682 173214 -37106
4681 -204686 193571 -232731 161785 340037 -154243 90875 21182 42001 209342 2672 -192262
4669 -116867 24058 -214313 306011 -101258 -63242 35984 157124 132773 142369 -11609 130970
4657 245930 -80600 344953 -178761 27230 -19626 -65192 -43170 -78396 -22097 -160412 -6313
4645 48545 117810 44169 -27655 -53247 354380 -131567 -87900 -844 -28066 -1896 -58976 -179745
4633 -179745 -95566 -45343 19054 -236010 -162755 248077 -209672 -8522 -81968 -216435 97136
4621 -128044 -127379 -172364 421077 -121144 293827 218642 -74264 321405 246323 -59743 -404797
4610 -404797 150822 270939 -368695 113635 -24132 153679 -27177 116340 120730 -312933
4599 265495 49001 -60799 -96474 172270 -40576 -46500 237108 -220865 13186 -203241 -103566
4588 -103566 100391 -341810 -186359 32302 -265448 -41514 80967 -103664 -38686 271631
4577 -219499 300813 -48015 16955 -72215 71538 101702 -104465 32399 48799 204193 114346
4566 114346 -113423 96548 576760 -546417 -7093 71096 -27979 35772 -11227 262882 29554
4554 -203898 -62369 120349 95445 33301 146997 159507 158648 18630 125724 -60979 159833
4542 120645 -185561 53660 105950 7147 76464 -38544 217816 37241 44988 -135271 125400
4530 -403452 135387 -72560 338151 -68637 96679 -130399 -3376 170599 126230 165708 -14447
4518 -124663 -27647 -45232 118068 42303 -27321 -234924 107997 -83910 65664 -47612 -148148
4507 -148148 -155390 73685 164194 -319919 152646 -244273 -44760 -23648 -111689 -14435 132592
4495 55845 -181247 181208 -469490 90858 89287 -356758 40528 -83126 30372 -26775 -58055
$$ [...]
##END NTUPLES=NMR SPECTRUM
##END=
