##TITLE=AC1761_NAR_3_9683236_BUEhHdfWFN
##JCAMPDX= 6.0         $$ Bruker NMR JCAMP-DX V2.0
##DATA TYPE= NMR SPECTRUM
##DATA CLASS= NTUPLES
##ORIGIN= BRUKER
##OWNER= Administrator
$$ 1.72 TOPSPIN		Version 2.1
$$ 2016-04-17 01:21:12.845 -0700  Administrator@X
$$ Compression mode = diff/dup
##.OBSERVE FREQUENCY= 400.02188249412
##.OBSERVE NUCLEUS= ^1H
##.ACQUISITION MODE= SIMULTANEOUS (DQD)
##.ACQUISITION SCHEME= undefined
##.AVERAGES= 64
##.DIGITISER RES= 22
##SPECTROMETER/DATA SYSTEM= spect
##.PULSE SEQUENCE= noesygpps1d.comp
##.SOLVENT NAME= COFFEE_meoh
##.SHIFT REFERENCE= INTERNAL, COFFEE_meoh, 1, 14.96123
##AUDIT TRAIL= $$ (NUMBER, WHEN, WHO, WHERE, PROCESS, VERSION, WHAT)
$$ ##TITLE= Audit trail, TOPSPIN		Version 2.1
$$ ##JCAMPDX= 5.01
$$ ##ORIGIN= Bruker BioSpin GmbH
$$ ##OWNER= Administrator
$$ $$ E:\/data/COFFEE/nmr/AC1761_NAR_3_9683236_BUEhHdfWFN/52/pdata/1/auditp.txt
$$ ##AUDIT TRAIL=  $$ (NUMBER, WHEN, WHO, WHERE, PROCESS, VERSION, WHAT)
(   1,<2016-04-17 01:21:07.658 -0700>,<Administrator>,<X>,<go>,<TOPSPIN 2.1>,
      <created by zg
	started at 2016-04-17 01:09:38.189 -0700,
	POWCHK enabled, PULCHK disabled,
       configuration hash MD5:
       21 0F 79 D6 B3 7B B4 F6 88 20 88 DB 03 48 BD 9F
       data hash MD5: 64K
       BA 58 C9 2A A5 A1 59 0D 33 59 7F E6 0E 88 D9 0A>)
(   2,<2016-04-17 01:21:10.783 -0700>,<Administrator>,<X>,<proc1d>,<TOPSPIN 2.1>,
      <Start of raw data processing
       efp LB = 0.3 FT_mod = 6 PKNL = 1 PHC0 = 0 PHC1 = 0 SI = 128K 
       data hash MD5: 128K
       C0 8F 9E 25 B8 4A BA 01 59 49 BB 77 66 C2 CF 43>)
(   3,<2016-04-17 01:21:11.642 -0700>,<Administrator>,<X>,<proc1d>,<TOPSPIN 2.1>,
      <pk PHC0 = -84.88037 PHC1 = 0 
       data hash MD5: 128K
       90 B5 AB 91 9A 6B B0 87 AB 00 B8 1A 6D DB C3 E5>)
(   4,<2016-04-17 01:21:12.033 -0700>,<Administrator>,<X>,<proc1d>,<TOPSPIN 2.1>,
      <abs ABSG = 1 
       data hash MD5: 128K
       81 55 B6 5A CB 5F 4B 91 A8 8E FC 20 E3 F1 62 4B>)
(   5,<2016-04-17 01:21:12.126 -0700>,<Administrator>,<X>,<proc1d>,<TOPSPIN 2.1>,
      <abs ABSG = 2 
       data hash MD5: 128K
       20 0F 54 A5 6B 9F B7 F5 C9 B1 B2 88 38 B1 22 37>)
(   6,<2016-04-17 01:21:12.204 -0700>,<Administrator>,<X>,<proc1d>,<TOPSPIN 2.1>,
      <abs ABSG = 3 
       data hash MD5: 128K
       B9 33 88 36 40 DF 4B 48 4F FB 44 3B 20 21 76 ED>)
(   7,<2016-04-17 01:21:12.298 -0700>,<Administrator>,<X>,<proc1d>,<TOPSPIN 2.1>,
      <abs ABSG = 4 
       data hash MD5: 128K
       BF A6 9E CB F5 E9 6D B6 C4 E3 19 48 5B 31 AE 8A>)
(   8,<2016-04-17 01:21:12.392 -0700>,<Administrator>,<X>,<proc1d>,<TOPSPIN 2.1>,
      <abs ABSG = 5 
       data hash MD5: 128K
       03 FD 12 9F 8B ED ED 6C 48 57 F6 73 C4 A7 22 F9>)
$$ ##END=
$$ 
$$ $$ hash MD5
$$ $$ 08 5D A6 89 A6 FA 87 80 B5 B2 C8 00 AA 9F B0 6C
##$RELAX= 
##$RELAX= 
##$RELAX= 
##$RELAX= 
##$RELAX= 
##$RELAX= 
##$RELAX= 
##$RELAX= 
$$ Bruker specific parameters
$$ --------------------------
##$DU= <E:\>
##$EXPNO= 52
$$ [...]
##$TP07= 0
##$TPNAME0= <>
##$TPNAME1= <>
##$TPNAME2= <>
##$TPNAME3= <>
##$TPNAME4= <>
##$TPNAME5= <>
##$TPNAME6= <>
##$TPNAME7= <>
##$TPOAL= (0..7)
0.5 0.5 0.5 0.5 0.5 0.5 0.5 0.5
##$TPOFFS= (0..7)
0 0 0 0 0 0 0 0
##$TUNHIN= 0
##$TUNHOUT= 0
##$TUNXOUT= 0
##$USERA1= <user>
##$USERA2= <user>
##$USERA3= <user>
##$USERA4= <user>
##$USERA5= <user>
##$V9= 5
##$VALIST= <valist>
##$VCLIST= <CCCCCCCCCCCCCCC>
##$VD= 0
##$VDLIST= <DDDDDDDDDDDDDDD>
##$VPLIST= <PPPPPPPPPPPPPPP>
##$VTLIST= <TTTTTTTTTTTTTTT>
##$WBST= 2048
##$WBSW= 25
##$XGAIN= (0..3)
0 0 0 0
##$XL= 0
##$YL= 0
##$YMAX_a= 6411344
##$YMIN_a= -13201795
##$ZGOPTNS= <>
##$ZL1= 120
##$ZL2= 120
##$ZL3= 120
##$ZL4= 120
##$ABSF1= 14.96123
##$ABSF2= -5.596951
##$ABSG= 5
##$ABSL= 3
##$ALPHA= 0
##$AQORDER= 0
##$ASSFAC= 0
##$ASSFACI= 0
##$ASSFACX= 0
##$ASSWID= 0
##$AUNMP= <proc_prof1d_extract.lims>
##$AXLEFT= 0
##$AXNAME= <>
##$AXNUC= <1H>
##$AXRIGHT= 0
##$AXTYPE= 0
##$AXUNIT= <>
##$AZFE= 0.1
##$AZFW= 0.1
##$BCFW= 0
##$BC_mod= 0
##$BYTORDP= 0
##$COROFFS= 0
##$CY= 15
##$DATMOD= 1
##$DC= 0
##$DFILT= <>
##$DTYPP= 0
##$F1P= 0
##$F2P= 0
##$FCOR= 0.5
##$FTSIZE= 131072
##$FT_mod= 6
##$GAMMA= 0
##$GB= 0
##$INTBC= 1
##$INTSCL= 1
##$ISEN= 128
##$LB= 0.3
##$LEV0= 0
##$LPBIN= 0
##$MAXI= 10000
##$MC2= 0
##$MEAN= 0
##$ME_mod= 0
##$MI= 0
##$NCOEF= 0
##$NC_proc= -2
##$NLEV= 6
##$NOISF1= 0
##$NOISF2= 0
##$NSP= 0
##$NTH_PI= 0
##$NZP= 0
##$OFFSET= 14.96123
##$PC= 1
##$PHC0= -84.88037
##$PHC1= 0
##$PH_mod= 1
##$PKNL= yes
##$PPARMOD= 0
##$PPDIAG= 0
##$PPIPTYP= 0
##$PPMPNUM= 2147483647
##$PPRESOL= 1
##$PSCAL= 4
##$PSIGN= 0
##$PYNMP= <proc.py>
##$REVERSE= no
##$SF= 400.020009545562
##$SI= 131072
##$SIGF1= 0
##$SIGF2= 0
##$SINO= 400
##$SIOLD= 131072
##$SPECTYP= <>
##$SREGLST= <1H.CDCl3>
##$SSB= 0
##$STSI= 131072
##$STSR= 0
##$SW_p= 8223.68421052631
##$SYMM= 0
##$S_DEV= 0
##$TDeff= 65536
##$TDoff= 0
##$TI= <>
##$TILT= no
##$TM1= 0
##$TM2= 0
##$TOPLEV= 0
##$USERP1= <user>
##$USERP2= <user>
##$USERP3= <user>
##$USERP4= <user>
##$USERP5= <user>
##$WDW= 1
##$XDIM= 131072
##$YMAX_p= 421452809
##$YMIN_p= -21978
##$CURPLOT= <Network HP LaserJet P1505>
##$CURPRIN= <$Network HP LaserJet P1505>
##$DFORMAT= <normdp>
##$LAYOUT= <+/1D_H.xwp>
##$LFORMAT= <normlp>
##$PFORMAT= <normpl>
##$SURQMSG= 1
$$ End of Bruker specific parameters
$$ ---------------------------------
##NTUPLES= NMR SPECTRUM
##VAR_NAME=  FREQUENCY,     SPECTRUM/REAL,   SPECTRUM/IMAG
##SYMBOL=    X,             R,               I
##VAR_TYPE=  INDEPENDENT,   DEPENDENT,       DEPENDENT
##VAR_FORM=  AFFN,          ASDF,            ASDF
##VAR_DIM=   131072,        131072,          131072
##UNITS=     HZ,            ARBITRARY UNITS, ARBITRARY UNITS
##FACTOR=    0.0627417313425164, 1,          1
##FIRST=     8223.62146879497, 1271,         -64174
##LAST=      0,             2491,            -64413
##MIN=       0,             -21978,          0
##MAX=       8223.62146879497, 421452809,    0
$$ Real data points
##PAGE= N=1
##DATA TABLE= (X++(R..R)), XYDATA
$$ [...]
61568C39223L76L09Q34J391J416J092R71J301J888K349K480K484K628K693K170
61553C63605J159M17K29l0o73q66J34J532J872R87J05J12O84J101J020M53k65
61536C71576m33L41J420J781J377J185J806K729L052K393R78n67j534j691j562
61521C82851j709j964j918j738j745j520n03P12Q57j40r40p28j45Q2L42J179K078
61504C75051K137J469J079J613K779L804M074L559K939L054L930M691M638L975
61490D18792L257K569J727Q68L64L05M80P16R98J325J652J904J974J893J953K359
61474D43136K748K478J456K53o92j463k139k453k292k063k131k274k137j890j996
61459D28541k438k640k159j159j80L92N47M70K70kj82n7L24O85R80J447K038K241
$$ y = [339223, 339599, 339908, 340742, 342133, 343549, 344641, 345612, 346913, 348801, 351150, 353630, 356114, 358742, 361435, 363605, 364764, 365181, 365410, 365380, 364707, 363841, 363975, 365507, 367379, 368366, 368471, 368583, 369267, 370368, 371388, 371841, 371576, 371143, 371484, 372904, 374685, 376062, 377247, 379053, 381782, 384834, 387227, 388205, 387638, 386104, 384413, 382851, 381142, 379178, 377260, 375522, 373777, 372257, 371754, 372466, 373323, 373183, 372243, 371515, 371370, 371452, 371794, 372973, 375051, 377188, 378657, 379736, 381349, 384128, 387932, 392006, 395565, 398504, 401558, 405488, 410179, 414817, 418792, 422049, 424618, 426345, 427213, 427577, 427882, 428362, 429078, 430076, 431401, 433053, 434957, 436931, 438824, 440777, 443136, 445884, 448362, 449818, 450071, 449379, 447916, 445777, 443324, 441032, 438969, 436838, 434564, 432427, 430537, 428541, 426103, 423463, 421304, 420145, 419965, 420357, 420904, 421374, 421644, 421642, 421460, 421403, 421727, 422412, 423392, 424839, 426877, 429118]
61441D29118J871J530J787K344K583K511K390J927P99l11l36N30R84M62j94j60
61425D47835M05J077J797K332K146J365R81J496K159K205J937J883J705Q39l44
61410D69818j005j060j100j337j430j184q16n57m41l91k33K44R46J504J794K043
61394D66795K292K296K174K481L231L586L095K543K869L843M525M590M373L956
61380E12649L090J871P75R5j75m1M43R16J054R26P25L51l87j461k773m163n032
61363E08863m576k908j338r40j402j810j916j839j287q5J052J345J210J660K704
61348D98733L422L411L071K651K055J554J524J549Q82m4R3J474K590K243J058
61333E26266L09K49L68N47R69J362J210O38L81Q54J743K493K898L170L625M289
$$ y = [429118, 430989, 432519, 434306, 436650, 439233, 441744, 444134, 446061, 446860, 446549, 446213, 446743, 447727, 448189, 447995, 447835, 448240, 449317, 451114, 453446, 455592, 456957, 457938, 459434, 461593, 463798, 465735, 467618, 469323, 470162, 469818, 468813, 467753, 466653, 465316, 463886, 462702, 461886, 461329, 460888, 460497, 460264, 460508, 461454, 462958, 464752, 466795, 469087, 471383, 473557, 476038, 479269, 482855, 485950, 488493, 491362, 495205, 499730, 504320, 508693, 512649, 515739, 517610, 518385, 518480, 518305, 518264, 518707, 519623, 520677, 521603, 522328, 522679, 522292, 520831, 518058, 513895, 508863, 504287, 501379, 500041, 499101, 497699, 495889, 493973, 492134, 490847, 490762, 491814, 493159, 494369, 496029, 498733, 502155, 505566, 508637, 511288, 513343, 514897, 516421, 517970, 518852, 518808, 518901, 520375, 522965, 525208, 526266, 526575, 526824, 527192, 527739, 528708, 530070, 531280, 531918, 532299, 533153, 534896, 537389, 540287, 543457, 547082, 551371]
61317E51371M805M848M641M780N533O647P817R005J0136J0955J1434J2003J3003
61304F56978J4091J4546J4090J3105J1959J0450Q149N240K595P88o73k641n026
61291G43651o891p885q753j0074j1276j1587j1294j1190j1222j0689r522q380
61279F24888p543o660n653m912m431l677k601j913j913j911j312o21o55j207j255
61264E78624k79J200K371K990L460M241N295O089O148N519M552L395K056P97j0
61249F26448m14p94j238j419j214q96p19o95q55j199j291n30R08J982J940J122
61233F21136L40n5j00K70J191K563M132N687O999P892Q586R517J0633J1253J0950
61218G00994J0177R661R569R650R806R969R749Q746P137N510M244L346K785K579
$$ y = [551371, 556176, 561024, 565665, 570445, 575978, 582625, 590442, 599447, 609583, 620538, 631972, 643975, 656978, 671069, 685615, 699705, 712810, 724769, 735219, 743368, 748608, 751203, 751991, 751318, 748677, 743651, 736760, 728875, 720122, 710048, 698772, 687185, 675891, 664701, 653479, 642790, 633268, 624888, 617345, 610685, 605032, 600120, 595689, 592012, 589411, 587498, 585585, 583674, 582362, 581741, 581086, 579879, 578624, 578345, 579545, 581916, 584906, 588366, 592607, 597902, 603991, 610139, 615658, 620210, 623605, 625661, 626458, 626448, 626034, 625240, 624002, 622583, 621369, 620473, 619754, 619059, 618204, 617005, 615714, 615184, 616092, 618074, 620014, 621136, 621476, 621421, 621321, 621591, 622782, 625345, 629477, 635164, 642163, 650055, 658641, 668158, 678791, 690044, 700994, 711171, 720832, 730401, 740051, 749857, 759826, 769575, 778321, 785458, 790968, 795212, 798558, 801343, 803922]
61204H03922K657K952L543M432N382O220P125Q246R311J0006J0557J1328J2020
61191H97701J1828J0511Q707P004N245L082P11j406l288n288p294q693r313r889
61177H99618j1185j2965j4285j4752j4901j5219j5387j4863j3851j3130j2980
61166G46100j2875j2312j1516j1077j1168j1345j1034j0020q547p073n906n053
61154F28174m308l411k115l18J724L476M558M984M819L929K370O96n01j223j798
61139F41056k189k090j543q48J19J762L832N400O069O612P935R971J2029J3842
61125G01957J5580J7179J8313J9066K0015K1519K3259K4671K5610K6372K7270
61114I40811K8307K9249K9862L0004K9597K8699K7624K6775K6157K5227K3520
$$ y = [803922, 806579, 809531, 813074, 817506, 822888, 829108, 836233, 844479, 853790, 863796, 874353, 885681, 897701, 909529, 920040, 928747, 935751, 940996, 944078, 944789, 943383, 940095, 934807, 927513, 918820, 909507, 899618, 888433, 875468, 861183, 846431, 831530, 816311, 800924, 786061, 772210, 759080, 746100, 733225, 720913, 709397, 698320, 687152, 675807, 664773, 654753, 646206, 639133, 633227, 628174, 623866, 620455, 618340, 618022, 619746, 623222, 627780, 632764, 637583, 641512, 643882, 644578, 644077, 642854, 641056, 638867, 636777, 635234, 634386, 634505, 636267, 640099, 645499, 651568, 658180, 666115, 676086, 688115, 701957, 717537, 734716, 753029, 772095, 792110, 813629, 836888, 861559, 887169, 913541, 940811, 969118, 998367, 1028229, 1058233, 1087830, 1116529, 1144153, 1170928, 1197085, 1222312, 1245832]
61103A245832K1299J9249J7586J5874J3756J1480R458P661N698L411J200l37r99
61090A371168j244j684k344k681k459k257k663l412l808l840m217n345o972q835
61076A319407j0931j3014j4518j5252j5625j5973j6207j6362j6801j7573j8143
61065A149008j8211j8175j8378j8457j7971j7154j6418j5575j4200j2452j0903
61054I71114r724q643p449o055m243j953L11J993L295M919O986Q718R337Q870
61040I77476Q078P859Q650J0093J1329J1871J2087J2584J3378J4075J4532J4850
61028A116862J4927J4708J4752J5885J8194K0860K3053K4515K5342K5868K6902
61017A341868K9394L3582L8903M4982N2154O0678O9979P9224Q8449R8859J12177
$$ y = [1245832, 1267131, 1286380, 1303966, 1319840, 1333596, 1345076, 1354534, 1362195, 1367893, 1371304, 1372504, 1372167, 1371168, 1369924, 1368240, 1365896, 1363215, 1360756, 1358499, 1355836, 1352424, 1348616, 1344776, 1340559, 1335214, 1328242, 1319407, 1308476, 1295462, 1280944, 1265692, 1250067, 1234094, 1217887, 1201525, 1184724, 1167151, 1149008, 1130797, 1112622, 1094244, 1075787, 1057816, 1040662, 1024244, 1008669, 994469, 982017, 971114, 961390, 952747, 945298, 939243, 935000, 933047, 933358, 935351, 938646, 943565, 950551, 959269, 968606, 977476, 985554, 993413, 1002063, 1012156, 1023485, 1035356, 1047443, 1060027, 1073405, 1087480, 1102012, 1116862, 1131789, 1146497, 1161249, 1177134, 1195328, 1216188, 1239241, 1263756, 1289098, 1314966, 1341868, 1371262, 1404844, 1443747, 1488729, 1540883, 1601561, 1671540, 1750764, 1839213, 1938072, 2050249]
61006B050249J29987J53311J82606K18401K62068L15395L79274M53737N40068
60997D685096O42089P64683R11859J085807J281256J470540J591756J565039J342232
60988A5340357R54211N07758J27213j08631j83847j22627K8005J91546K64298
60979A6998283J58179j40388n54133r62248j268905j437297j477941j421290j301225
60970H593035j149461r91150q41197p05792n87347m86949m03697l34928k78203
60961B814311k32289j96070j67752j45464j27756j13135j00106q8141p7856o9626
60951A496116o2670n5992m9579m4016l9404l5481l2422l0681l0120l0038k9978
60940A055735k9917k9741k9201k8384k7530k6389k4459k2020k0170j9489j9214
$$ y = [2050249, 2180236, 2333547, 2516153, 2734554, 2996622, 3312017, 3691291, 4145028, 4685096, 5327185, 6091868, 7003727, 8089534, 9370790, 10841330, 12433086, 13998125, 15340357, 16294568, 16802326, 16929539, 16820908, 16637061, 16514434, 16542439, 16733985, 16998283, 17156462, 17016074, 16461941, 15499693, 14230788, 12793491, 11315550, 9894260, 8593035, 7443574, 6452424, 5611227, 4905435, 4318088, 3831139, 3427442, 3092514, 2814311, 2582022, 2385952, 2218200, 2072736, 1944980, 1831845, 1731739, 1643598, 1565742, 1496116, 1433446, 1377454, 1327875, 1283859, 1244455, 1208974, 1176552, 1145871, 1115751, 1085713, 1055735, 1025818, 996077, 966876, 938492, 910962, 884573, 860114, 838094, 817924, 798435, 779221]
60929G79221j8172j6109j3755j1917j0854j0281r688q830p996p595p493p173o568
60916F42790o129n951n514m581l700l324l016k182j164q91j614k658l340l593
60902E95133l690l836m091m382m573m676m905n321n640n652n631n959o571o981
60888E23225o798n978m776l692l146k965k515j699j316j971k996l207k428j567
60874D78171j256j199r05l76K19Q56J459J814J989K480L535M687N161M670L610
60859E04915K676K340K554K816K677K111J310L38p11j357j124k69L55L22J3j74
60843E18792m67j209k232l115l832m646n552o320o998p851q742r069q507p503
60829D42749o732o299n789m971m041l187k340j503r94j047j408j672j812k073
$$ y = [779221, 761049, 744940, 731185, 719268, 708414, 698133, 688445, 679615, 671619, 664024, 656531, 649358, 642790, 636661, 630710, 625196, 620615, 616915, 613591, 610575, 608393, 607229, 606338, 604724, 602066, 598726, 595133, 591443, 587607, 583516, 579134, 574561, 569885, 564980, 559659, 554019, 548367, 542736, 536777, 530206, 523225, 516427, 510449, 505673, 501981, 498835, 495870, 493355, 491656, 490340, 488369, 485373, 482166, 479738, 478171, 476915, 475716, 474811, 474435, 474654, 475510, 476969, 478783, 480772, 483252, 486787, 491474, 496635, 501305, 504915, 507591, 509931, 512485, 515301, 517978, 520089, 521399, 521737, 521026, 519669, 518545, 518276, 518631, 518953, 518966, 518792, 518325, 517116, 514884, 511769, 507937, 503291, 497739, 491419, 484421, 476570, 467828, 458759, 450252, 442749, 436017, 429718, 423929, 418958, 414917, 411730, 409390, 407887, 406893, 405846, 404438, 402766, 400954, 398881]
60815C98881k425k528k233j716j122n41k62n66j147j268p09qM24Q43J463J812
60799C88898J419O72L62O77J177J535J677J487R85O59R51J500J552J029N35L33
60783D05448O5m39q25r07r64j129j091p91p83j458k376k876k974l077l159k762
60767C79902j716l99O94J273J220O29p2l87k07J46L08J73j91o18q49o51o9N36
60749C79722Q40Q38Q30J122J773K462K619J871M39r75j822k141k231k107j605
60734C81635r94r40j637k293j959o55P39J560J828J780J526J325J586K269K741
60719C88511K515J835J221Q81Q33J169J742K003J595Q94M45J78l17r76j381j576
60703C99572k034k757l113k739k115j904k092k138j788j362j285j538j696j517
$$ y = [398881, 396456, 393928, 391695, 389979, 388857, 388316, 388054, 387488, 386341, 385073, 384364, 384356, 384780, 385623, 387086, 388898, 390317, 390989, 391351, 392028, 393205, 394740, 396417, 397904, 398889, 399548, 400499, 401999, 403551, 404580, 405115, 405448, 405513, 405074, 404249, 403342, 402378, 401249, 400158, 399367, 398584, 397126, 394750, 391874, 388900, 385823, 382664, 379902, 378186, 377787, 378481, 379754, 380974, 381603, 381531, 381144, 380937, 381083, 381391, 381564, 381373, 380755, 379906, 379255, 379186, 379722, 380562, 381400, 382230, 383352, 385125, 387587, 390206, 392077, 392516, 391541, 389719, 387578, 385347, 383240, 381635, 380641, 379701, 378064, 375771, 373812, 373157, 373896, 375456, 377284, 379064, 380590, 381915, 383501, 385770, 388511, 391026, 392861, 394082, 394963, 395796, 396965, 398707, 400710, 402305, 403199, 403644, 403822, 403505, 402529, 401148, 399572, 397538, 394781, 391668, 388929, 386814, 384910, 382818, 380680, 378892, 377530, 376245, 374707, 373011, 371494]
60689C71494j260j232j129l51R51J705J254L43K84J401K842L721L762L073J984
60674C88842J199J329K153K822K924K837K889K766K009P03o63j725k364k591k465
60659D00665k025j261l65J51o2n27l17P98K026K557K476K428K711L042K988K330
60643D17615J170j51j296k156k723k811k300j583j357j790k310k371k107j887
60629C93943j599q07N57J927K579K249J332N72M30O46N29j83r30q59K99J915K924
60612D05524K630J264j76p89n68k03j45q1M73J303J505N00j134k132j869r92m71
60595D04639l43J26J138J963K044J765J683J583R41l7n76l50K42P06Q52O91M18
60578D17485M18P75J014P90O15J217K398L286L579L818M385N081N709O387P106
$$ y = [371494, 370234, 369002, 367873, 367522, 368473, 370178, 371432, 371775, 372059, 373460, 376302, 380023, 383785, 386858, 388842, 390041, 391370, 393523, 396345, 399269, 402106, 404995, 407761, 409770, 410473, 409810, 408085, 405721, 403130, 400665, 398640, 397379, 397014, 397165, 397103, 396576, 396259, 397057, 399083, 401640, 404116, 406544, 409255, 412297, 415285, 417615, 418785, 418634, 417338, 415182, 412459, 409648, 407348, 405765, 404408, 402618, 400308, 397937, 395830, 393943, 392344, 391537, 392094, 394021, 396600, 398849, 400181, 400753, 401183, 401829, 402358, 402175, 401245, 400386, 400685, 402600, 405524, 408154, 409418, 409242, 408453, 407885, 407682, 407537, 407456, 407929, 409232, 410737, 411237, 410103, 407971, 406102, 405110, 404639, 404296, 404422, 405560, 407523, 409567, 411332, 413015, 414598, 415539, 415502, 414926, 414576, 414818, 415524, 416376, 417067, 417485, 417903, 418678, 419692, 420482, 421097, 422314, 424712, 427998, 431577, 435395, 439780, 444861, 450570, 456957, 464063]
60563D64063P650Q053Q492Q627P813O074M198K627J076n84j825k299k398k476
60549E09091k252j492o94l89k18O03K147L681M536M643M397M358M952O124P391
60534E46878Q466R602J1124J2873J4385J5406J5858J5573J4341J2244R709P157
60522F93616M631J797j612n244q228r960j0627j0682j0212r167p832o555n293
60509F14632m006l129k906k613j386M71J965L030M518O608Q607J0447J2957J6190
60495F65385J8869K0262K1336K3183K5268K6279K5882K4643K2870K0498J7658
60484I12133J4594J1463Q882P994R149J0998J1677J0470P706L676j479p328j3479
60471I86456j9886k6182l1233l4243l5762l6712l6927l5651l2965k9672k6149
$$ y = [464063, 471713, 479766, 488258, 496885, 504698, 510772, 514970, 517597, 518673, 518089, 516264, 513965, 511567, 509091, 506839, 505347, 504653, 504264, 504046, 504649, 506796, 510477, 515013, 519656, 524053, 528411, 533363, 539487, 546878, 555344, 564946, 576070, 588943, 603328, 618734, 634592, 650165, 664506, 676750, 686459, 693616, 698247, 700044, 698432, 693188, 684960, 675000, 664373, 653691, 643479, 634312, 626480, 619925, 614632, 610626, 607497, 604591, 601978, 600592, 601063, 603028, 606058, 610576, 617184, 625791, 636238, 649195, 665385, 684254, 704516, 725852, 749035, 774303, 800582, 826464, 851107, 873977, 894475, 912133, 926727, 938190, 947072, 955066, 964215, 975213, 986890, 997360, 1005066, 1008742, 1007263, 999935, 986456, 966570, 940388, 909155, 874912, 839150, 802438, 765511, 729860, 696895, 667223, 641074]
60460F41074k2431j9135j7083j6034j4848j2944j0779r020q028p985q545q534
60448D85708p028m695l069k588k372j897j626j798j813j275o95n93p67r17j250
60433D53325j919k422k212j507r86r36j008o54L27J425J727Q88k36m64K75R98
60417D46621J092R31J009J310J758K500L316L509K871K134J951J971J546Q28N07
60402D73854P10R34Q97Q62J041J241J286J418J944K731L315L448L258K867K168
60387E01974J220N73P56J462J843J704J795K564L299L100K220J652J616J393O19
60372E27790q1p3L42L80j45n75j92Q98J759J624Q60N56J043J446J042M42P18J771
60354E39605K593K838L192M044M837M976M656M372M200L924L415K636J595M75
$$ y = [641074, 618643, 599508, 582425, 566391, 551543, 538599, 527820, 518800, 510772, 502787, 494242, 485708, 478680, 473985, 470916, 468328, 465956, 464059, 462433, 460635, 458822, 457547, 456852, 456259, 455492, 454575, 453325, 451406, 448984, 446772, 445265, 444279, 443343, 442335, 441681, 442008, 443433, 445160, 446048, 445812, 445348, 445623, 446621, 447713, 448644, 449653, 450963, 452721, 455221, 458537, 462046, 464917, 467051, 469002, 470973, 472519, 473347, 473854, 474564, 475498, 476395, 477257, 478298, 479539, 480825, 482243, 484187, 486918, 490233, 493681, 496939, 499806, 501974, 503194, 503767, 504523, 505985, 507828, 509532, 511327, 513891, 517190, 520290, 522510, 524162, 525778, 527171, 527790, 527709, 527636, 527978, 528358, 528213, 527638, 527446, 528344, 530103, 531727, 532587, 533143, 534186, 535632, 536674, 537116, 537834, 539605, 542198, 545036, 548228, 552272, 557109, 562085, 566741, 571113, 575313, 579237, 582652, 585288, 586883, 587358]
60340E87358n47j601k812l744l759l055k615k961l550l683l420l208l122k935
60326E46346k579k194j934j921k133k201j713q46k54q0L32J468K843L596L584
60311E42314L383L533M115M967N832O367O368O027N801O011O635P391P945Q065
60297F24754P659O672N032K843M42j871m102o268p998q766q504p669o706n761
60283E89757m916m316m024l981m162m519m785m645m113l543l290l505m072m589
60269E31297m637m348m317m639m491l271j699r40j018j004o01m74q22p97K66J818
60253E00323K843L006K622K079J697J726K077K313K225J958J423K30j480k674
60239E20368k494j334m22m84j218j813j694q51L00J408K454L457M134M278M353
$$ y = [587358, 586811, 585210, 582398, 578654, 574895, 571840, 569225, 566264, 562714, 559031, 555611, 552403, 549281, 546346, 543767, 541573, 539639, 537718, 535585, 533384, 531671, 530825, 530571, 530491, 530823, 532291, 535134, 538730, 542314, 545697, 549230, 553345, 558312, 564144, 570511, 576879, 582906, 588707, 594718, 601353, 608744, 616689, 624754, 632413, 639085, 644117, 646960, 647402, 645531, 641429, 635161, 627163, 618397, 609893, 602224, 595518, 589757, 584841, 580525, 576501, 572520, 568358, 563839, 559054, 554409, 550296, 546753, 543463, 539958, 535886, 531297, 526660, 522312, 517995, 513356, 508865, 505594, 503895, 502955, 501937, 500933, 500332, 499858, 499036, 498239, 498505, 500323, 503166, 506172, 508794, 510873, 512570, 514296, 516373, 518686, 520911, 522869, 524292, 524522, 523042, 520368, 517874, 516540, 516118, 515634, 514416, 512603, 510909, 510058, 510358, 511766, 514220, 517677, 521811, 526089, 530442]
60224E30442M977N915O237N715N341O058P573Q825R234R056Q878R146R945J0860
60210F38202J1257J0861R982R111Q565Q461Q621Q500P650O316N132M349L798L462
60196G44267L326K770J098j247k897l356l632m731o393p819q785r410r575r250
60182F84366q863q641q184p187o095n384m807l999l250k985k938k583j978j499
60168F15973j165r00j011j657k282k393k462l123l821l395j891o88o32j040r12
60153E88601l01J30L03P59J661K419K480K245K726M201N562N484M154L153L505
60138F27082M525N024M934N126O019P139P845P905P416O692O142N816N174L796
60124G10635K126J046P99Q37P67R31J874L527N052N459M511L038K104J862J535
$$ y = [530442, 535419, 541334, 547571, 553286, 558627, 564685, 572258, 581083, 590317, 599373, 608251, 617397, 627342, 638202, 649459, 660320, 670302, 679413, 687978, 696439, 705060, 713560, 721210, 727526, 732658, 737007, 740805, 744267, 747593, 750363, 751461, 750214, 747317, 743961, 740329, 735598, 729205, 721386, 712601, 703191, 693616, 684366, 675503, 666862, 658678, 651491, 645396, 640012, 635205, 631206, 627956, 624971, 622033, 619450, 617472, 615973, 614808, 613908, 612897, 611240, 608958, 606565, 604103, 600980, 597159, 593764, 591873, 591185, 590553, 589513, 588601, 588300, 588430, 588733, 589492, 591153, 593572, 596052, 598297, 601023, 605224, 610786, 616270, 620424, 623577, 627082, 631607, 636631, 641565, 646691, 652710, 659849, 667694, 675599, 683015, 689707, 695849, 701665, 706839, 710635, 712761, 713807, 714606, 715443, 716210, 717141, 719015, 722542, 727594, 733053, 737564, 740602, 742706, 744568, 746103]
60109G46103O84j22k35R6J51k85j047k171l545m321l650k001q63r20j263p84K33
60092G26060M66q15k883m363m573m023l640l819m302m787n184n317m921m168l745
60077F69986m065m751n212n377n496n578n554n678o226o932p208o895o387o026
60063E88601n726n165m170k900j772j067o04p1L82L60M8K56J257K344K909L290
60047E77972L955M570M624M486M867N548N632M951M299M214M275L816K664J099
60033F36972n01j788k663l379m074m374l952l359l619m990o685p925q664r128
60019E71871r223q827q209p810p660p339o506n314m288l766l548l168k494j849
60005D91870j513j394j268j003n26R6M96L62R3M46J434K151K066J754K002K838
$$ y = [746103, 746787, 746665, 746430, 746526, 746677, 746392, 745345, 743174, 739629, 735308, 731658, 729657, 728794, 727874, 726611, 725827, 726060, 726526, 725711, 722828, 718465, 713892, 709869, 706229, 702410, 698108, 693321, 688137, 682820, 677899, 673731, 669986, 665921, 661170, 655958, 650581, 645085, 639507, 633953, 628275, 622049, 615117, 607909, 601014, 594627, 588601, 582875, 577710, 573540, 570640, 568868, 567801, 567197, 567126, 567508, 567868, 567916, 568172, 569429, 571773, 574682, 577972, 581927, 586497, 591121, 595607, 600474, 606022, 611654, 616605, 620904, 625118, 629393, 633209, 635873, 636972, 636471, 634683, 632020, 628641, 624567, 620193, 616241, 612882, 609263, 604273, 597588, 589663, 580999, 571871, 562648, 553821, 545612, 537802, 530142, 522803, 516297, 510983, 506695, 502929, 499381, 496213, 493719, 491870, 490357, 488963, 487695, 486692, 486166, 486262, 486758, 487120, 487213, 487659, 489093, 491244, 493310, 495064, 497066, 499904]
59989D99904L900N073O062O142N085L789L134K776J932P59n2o03j538k700l260
59974E30403l085k850k808k514j957j848k437k924k464j149K72J146J216Q15Q42
59959E10658J966L650M593M287L491L054K913K515J692P45N5j65LK12K06J62L65
59942E40402O88P69M96l1q00j556j569m42J070J845J869K135L160M460N489O179
59926E64164O440O001M942L712K435Q83p42j754j872j484q84P2J389K724L913
59911E89939N057N914N989N306M416L502K268Q66m8m18j060k364l600l971l601
59896F08195k988k240j372o78k44M10J569K737L372L730M394N348O059O230O037
59881F40559N863O071O793P633P905P393O522N678M773L733K853K333J904J217
$$ y = [499904, 503804, 508877, 514939, 521081, 526166, 529955, 533089, 535865, 537797, 538556, 538504, 537901, 536363, 533663, 530403, 527318, 524468, 521660, 519146, 517189, 515341, 512904, 509980, 507516, 506367, 506639, 507785, 509001, 509816, 510658, 512624, 516274, 520867, 525154, 528645, 531699, 534612, 537127, 538819, 539564, 539619, 539454, 539457, 539669, 539875, 540037, 540402, 541090, 541859, 542355, 542324, 541524, 539968, 538399, 537957, 539027, 540872, 542741, 544876, 548036, 552496, 557985, 564164, 570604, 576605, 581547, 585259, 587694, 588577, 587835, 586081, 584209, 582725, 581841, 581913, 583302, 586026, 589939, 594996, 600910, 606899, 612205, 616621, 620123, 622391, 623257, 623209, 622791, 621731, 619367, 615767, 611796, 608195, 605207, 602967, 601595, 600917, 600673, 601083, 602652, 605389, 608761, 612491, 616885, 622233, 628292, 634522, 640559, 646422, 652493, 659286, 666919, 674824, 682217, 688739, 694417, 699190, 702923, 705776, 708109, 710013, 711230]
59867G11230K96o56j511k124k367k417k599k829k706k211j726j381r78o60q03
59852F86558j126q06J70P41L38j90K15J431K707L825M872N386M714K968R68o70
59836G12101j771k226j871p10J070L109M691N030M012K300M66j485l481m955n537
59821G10743n592n545n231m436l567l098k833k261j350m23L36P95P15J71k81l70
59805F77773m66p36o18J78Q25M11p52j757k531l610m820n372n137m812m777m781
59789F39018m748m955n250n006m100l198k784k662k611k769l013k698j535j82
59775E93507N13N29M75P44J307K113L202M413N337N640N371M960M983N723O918
59760F45735Q000Q671R073R428R739R986J0315J0760J0943J0359R025P554O509
$$ y = [711230, 711526, 710870, 709359, 707235, 704868, 702451, 699852, 697023, 694317, 692106, 690380, 688999, 688021, 687361, 686558, 685432, 684626, 684796, 685537, 685875, 685685, 685900, 687331, 690038, 693863, 698735, 704121, 708835, 711803, 712771, 712101, 710330, 708104, 706233, 705523, 706593, 709702, 714393, 719423, 723435, 725735, 726201, 724716, 721235, 716280, 710743, 705151, 699606, 694375, 689939, 686372, 683274, 680441, 678180, 676830, 676407, 676743, 677538, 678253, 678424, 678143, 677773, 677307, 676571, 675953, 676131, 676956, 677367, 676615, 674858, 672327, 668717, 663897, 658525, 653388, 648576, 643799, 639018, 634270, 629315, 624065, 619059, 614959, 611761, 608977, 606315, 603704, 600935, 597922, 595224, 593689, 593507, 594020, 594549, 595024, 595768, 597075, 599188, 602390, 606803, 612140, 617780, 623151, 628111, 633094, 638817, 645735, 653735, 662406, 671479, 680907, 690646, 700632, 710947, 721707, 732650, 743009, 752034, 759588, 766097]
59747G66097N856N249M582L915L064J754K81n74n35l31p75j734k496k792k829
59732G78732k598j903j026n33l60J65J170J790J275L2q30o30M29J601K186K046
59716G81546J667J478J266O59O1L06J398K427K886L255M032N027N978P053Q225
59701H27264Q908Q843Q659Q945R312R106Q539Q353Q673Q860Q370P170N451L393
59687I39846J138j219l475n135n827n987o481p392p925p840q034r121j0249j0182
59673H52117q974p762p310p466p674p312n922l734j656k27R68K368L564M143M654
59658H09777N784P068P486P096O979P650Q438Q452P404N503L232J102q92l439
59644H81640o873j0292j2479j3458j4223j5156j5656j5289j4334j3066j1380r422
$$ y = [766097, 771953, 777202, 781784, 785699, 788763, 790517, 790798, 790224, 789689, 789358, 788583, 786849, 784353, 781561, 778732, 776134, 774231, 773205, 772672, 772312, 772477, 773647, 775437, 776712, 776744, 775914, 775284, 775713, 777314, 779500, 781546, 783213, 784691, 785957, 786616, 786677, 786983, 788381, 790808, 793694, 796949, 800981, 806008, 811986, 819039, 827264, 836172, 845015, 853674, 862619, 871931, 881037, 889576, 897929, 906602, 915462, 923832, 931002, 936453, 939846, 940984, 939765, 936290, 931155, 925328, 919341, 912860, 905468, 897543, 889703, 881669, 872548, 862299, 852117, 843143, 835381, 828071, 820605, 812931, 805619, 799697, 795963, 794307, 794080, 795048, 797416, 800980, 805123, 809777, 815561, 822629, 830115, 837211, 844190, 851840, 860278, 868730, 876134, 881637, 884869, 885971, 885079, 881640, 874767, 864475, 851996, 838538, 824315, 809159, 793503, 778214, 763880, 750814, 739434, 730012]
59632G30012p828p003o739o662o616o463o067n616n577o134p035p956q686q977
59618F32653q596p595o262m906l878l447l375l012k206j634j666j542m96Q58J259
59603E86155O04r3k85l27l22J09P85Q51J77j78M95J457J655J188Q66Q66P35M14
59585E95152M05Q42J090N27o27j582j906j795j598j392j295j711k785l803l784
59570E75738k708j544r52o80m34m56q41j046p24l59m12n12k36J1k53n52k09M17
59552E64248M58M8J02Q53J594J874J968K229K788L800N268O710P764Q819J0363
59537F18886J2173J4081J6836K0714K3640K2462J6418Q046M57m970q017q562p020
59524G25144m757l073k305k316l058m174m984n397o100p383q537q911q749q491
$$ y = [730012, 722184, 715181, 708442, 701780, 695164, 688701, 682634, 677018, 671441, 665307, 658272, 650316, 641630, 632653, 624057, 616462, 610200, 605294, 601416, 597969, 594594, 591582, 589376, 587742, 586076, 584534, 584038, 584896, 586155, 586759, 586666, 586381, 586054, 585732, 585841, 586626, 587477, 587654, 587476, 587971, 589428, 591083, 592271, 593137, 594003, 594738, 595152, 595557, 596399, 597489, 598016, 597389, 595807, 593901, 592106, 590508, 589116, 587821, 586110, 583325, 579522, 575738, 573030, 571486, 570534, 569854, 569420, 568964, 568123, 567077, 566353, 565994, 565582, 565070, 564834, 564845, 564592, 564040, 563831, 564248, 564706, 564754, 564856, 565709, 567303, 569177, 571145, 573374, 576162, 579962, 585230, 591940, 599704, 608523, 618886, 631059, 645140, 661976, 682690, 706330, 728792, 745210, 753256, 753713, 748743, 740726, 732164, 725144, 720387, 717314, 715009, 712693, 709635, 705461, 700477, 695080, 688980, 681597, 673060, 664149, 655400, 646909]
59510F46909q013p169o364n926n515m758l974l587l339k667j549m14M62R99J128
59495E96223J008J155J954L128L981M032L389K709K736L508M149L974L585M137
59481F39668N586O601O399N684N377N346N016M523M530N225O040O158N064K879
59467G14096M62j168j678j487j112p60m69m2J023K847M578N271N204N403N997
59452G38165O185N856N848O247N896M231K348J404J028K00j198k634l949n137
59438G64490n741n409m520l576k449r81L33J021J386J824K070J944K192L487N180
59423G61251O185O728Q052J0500J3056J4778J5765J6573J7457J8399J9294K0128
59411I28166K1355K3723K6882K8343K4975J6035M201o523j3516j6327j5794j3025
$$ y = [646909, 638896, 631727, 625363, 619437, 613922, 609164, 605190, 601603, 598264, 595597, 594048, 593634, 594096, 595095, 596223, 597231, 598386, 600340, 603468, 607449, 611481, 614870, 617579, 620315, 623823, 627972, 631946, 635531, 639668, 645254, 651855, 658254, 663938, 669315, 674661, 679677, 684200, 688730, 693955, 699995, 706153, 711217, 714096, 714558, 713390, 711712, 710225, 709113, 708353, 707884, 707842, 708865, 711712, 716290, 721561, 726765, 732168, 738165, 744350, 750206, 756054, 762301, 768197, 772428, 774776, 776180, 777208, 777408, 776210, 773576, 769627, 764490, 758749, 753340, 748820, 745244, 742795, 741814, 742147, 743168, 744554, 746378, 748448, 750392, 752584, 756071, 761251, 767436, 774164, 782216, 792716, 805772, 820550, 836315, 852888, 870345, 888744, 908038, 928166, 949521, 973244, 1000126, 1028469, 1053444, 1069479, 1073680, 1067157, 1053641, 1037314, 1021520, 1008495]
59399A008495q782l258L431J0207J4555J3672O586m670j6135k4480k8720k9675
59387I41226k8408k5626k2165j8983j6356j3728j0685p602n031l021j442m25q
59374G87746K58Q41J621K182K451K754L439M649O168P319P446O824O615P561R148
59359H57022J0328J0645J0349R893R716J0057J0629J0866J0766J0946J1617J2171
59347I85005J2212J2162J2264J1721R738O877M440K832J363n57k856n249p547
59334A042405r568j1328j3121j4907j5926j5625j4677j4269j4582j4742j4255
59323H89405j3577j3196j2952j2568j2238j2272j2551j2627j2150j1058r584q240
59311G46392p518p458p571p293o465n418m602m126l582k410m50J946M353O580
$$ y = [1008495, 999713, 996455, 999886, 1010093, 1024648, 1038320, 1044906, 1040236, 1024101, 999621, 970901, 941226, 912818, 887192, 865027, 846044, 829688, 815960, 805275, 797673, 792642, 789621, 788179, 787754, 787746, 788004, 788845, 790466, 792648, 795099, 797853, 801292, 805941, 812109, 819428, 826874, 833698, 840313, 847874, 857022, 867350, 877995, 888344, 898237, 907953, 918010, 928639, 939505, 950271, 961217, 972834, 985005, 997217, 1009379, 1021643, 1033364, 1043102, 1049979, 1054419, 1057251, 1058614, 1058057, 1055201, 1049952, 1042405, 1032837, 1021509, 1008388, 993481, 977555, 961930, 947253, 932984, 918402, 903660, 889405, 875828, 862632, 849680, 837112, 824874, 812602, 800051, 787424, 775274, 764216, 754632, 746392, 738874, 731416, 723845, 716552, 710087, 704669, 700067, 695941, 692359, 689949, 689499, 691445, 695798, 702378]
59297G02378Q642J0537J2030J2438J0932P469L220n22l594o418q484q585o657
59284G33386m181k284m93J946M617O610P940R270J0858J2610J4630J6830J8372
59271H30111J8474J7439J6191J5084J3976J3003J2358J1568J0028Q071O542N386
59259I78231L635R43j789l619m683n744p041q057q235p697p235p487q178q381
59245I04663p654o525n665n102m500l805l107k383j830k054l342n081o390p024
59231H40201p230p147o950p123p949q985r549r488q924p792o198m805m079l583
59217G40399k658j496o85k00L67Q63Q71O68R69J800K499K765K777K415J392J94
59201G52940j11O25J213N99q73j985k023j265n29m03p58r34n66l0K14L73Q16J215
$$ y = [702378, 711020, 721557, 733587, 746025, 756957, 764426, 767646, 767124, 763530, 757112, 748628, 740043, 733386, 729205, 726921, 726428, 728374, 732991, 739601, 747541, 756811, 767669, 780279, 794909, 811739, 830111, 848585, 866024, 882215, 897299, 911275, 924278, 936636, 948204, 958232, 966303, 972845, 978231, 981866, 982809, 981020, 977401, 972718, 966974, 959933, 951876, 943641, 935944, 928709, 921222, 913044, 904663, 897009, 890484, 884819, 879717, 875217, 871412, 868305, 865922, 864092, 862038, 858696, 853615, 847225, 840201, 832971, 825824, 818874, 811751, 803802, 794817, 785268, 775780, 766856, 759064, 752866, 748061, 743982, 740399, 737741, 736245, 735560, 735360, 735727, 736590, 737461, 738129, 739098, 740898, 743397, 746162, 748939, 751354, 752746, 752940, 752829, 753454, 754667, 755266, 754393, 752408, 750385, 749120, 748591, 748188, 747430, 746496, 745930, 745900, 746114, 746487, 747303, 748518]
59183G48518R15J07k57J85O44K72p67j622j825j640j600j879k149j988j356n37
59167G35021L00J134J664J467P02J4n30j654l482m842m786m088m234n356o284
59152G05046o280n717n154m849n092o008o942o992o280n884o323o926o871o148
59138F19580n230m490m130m111l923l004j519k13O78J673L034M108M203L685L723
59123F14064M969O863Q316Q906R226J0048J1319J2392J3022J3582J4209J4363
59111G41279J3579J2066J0304Q555P055O059N265L882J738l48j723k706l735m576
59097G96694n070n737o782p361o798n732m980m161k656j151o92q27l62M55K26
59082G45066j247k568k902k983l671m763n663o146o126n551m769m228l768l018
$$ y = [748518, 749433, 749540, 749283, 749468, 750112, 750384, 749617, 747995, 746170, 744530, 742930, 741051, 738902, 736914, 735558, 735021, 735321, 736455, 738119, 739586, 740288, 740302, 739772, 738118, 734636, 729794, 725008, 720920, 716686, 711330, 705046, 698766, 693049, 687895, 683046, 677954, 671946, 665004, 658012, 651732, 645848, 639525, 632599, 625728, 619580, 614350, 609860, 605730, 601619, 597696, 594692, 593173, 592960, 593638, 595311, 598345, 602453, 606656, 610341, 614064, 619033, 625896, 634212, 643118, 652344, 662392, 673711, 686103, 699125, 712707, 726916, 741279, 754858, 766924, 777228, 785783, 792838, 798897, 804162, 808044, 809782, 809434, 807711, 805005, 801270, 796694, 791624, 785887, 779105, 771744, 764946, 759214, 754234, 750073, 747417, 746266, 745574, 744747, 744385, 744840, 745066, 743819, 741251, 738349, 735366, 731695, 726932, 721269, 715123, 708997, 703446, 698677, 694449, 690681, 687663]
59068F87663k382k592l378l725l387l077l129l114k923l002l334l303k741k125
59054F45451j632j022n41p07j132q40O2L30m04r30l02Q15J244P70j23j008j448
59037F38583j003J16J064J487J920K777L738M427M918N279N408N578O300P446
59023F88038Q381R053R931J0662J0082P978N716M426L675K519R15o31j980l096
59009G55669l677l641l431l241k556j051O89J859K368K641L074L924N167O135
58995G63929O013M985M169M043L799K669J113J16j01n2j41l13k38M14J638K967
58979G95010M082N321P091R034J0543J1785J3211J4405J4598J4187J4371J5237
58967I28875J5650J5192J4740J4729J4319J2851J0806Q705O307L503Q00j692m594
$$ y = [687663, 685281, 682689, 679311, 675586, 672199, 669122, 665993, 662879, 659956, 656954, 653620, 650317, 647576, 645451, 643819, 642797, 642256, 641549, 640417, 639577, 639639, 639969, 639565, 638635, 638333, 639148, 640392, 641162, 641039, 640031, 638583, 637580, 637696, 638760, 640247, 642167, 644944, 648682, 653109, 658027, 663306, 668714, 674292, 680592, 688038, 696419, 705472, 715403, 726065, 736147, 744125, 749841, 754267, 757942, 760461, 761376, 760745, 758765, 755669, 751992, 748351, 744920, 741679, 739123, 738072, 738761, 740620, 742988, 745629, 748703, 752627, 757794, 763929, 769942, 774927, 779096, 783139, 786938, 789607, 790720, 790836, 790735, 790683, 790542, 790229, 789991, 790405, 792043, 795010, 799092, 804413, 811504, 820538, 831081, 842866, 856077, 870482, 885080, 899267, 913638, 928875, 944525, 959717, 974457, 989186, 1003505, 1016356, 1027162, 1035867, 1042174, 1045677, 1046477, 1044785, 1040191]
58954A040191q008j1087j3351j5239j6816j7333j6768j6382j6832j7110j6270
58943H74995j4946j4009j3016j1214r043p341n977m521l394l110l033k214r17
58930G82260j01J21L83Q42J107J120J148J080N79k71j037j445j396q55o6N79J147
58913G85195J996K909L260L346M254O096P549P917Q234R464J0927J1715J2418
58900H75280J3958J5705J6322J5934J5867J6507J6773J5712J3600J1494J0451
58889A037603J1028J2856J4831J6119J6660J6489J5315J3240J1051R167P062M384
58877A185805J738l76k456m942p153q229q375q182p511o115m733m453n422p009
58863A112587q742j0261j1043j1054j1119j1865j2862j3537j4061j4602j4599
$$ y = [1040191, 1032183, 1021096, 1007745, 992506, 975690, 958357, 941589, 925207, 908375, 891265, 874995, 860049, 846040, 833024, 821810, 812767, 805426, 799449, 794928, 791534, 788424, 785391, 783177, 782260, 782159, 782280, 782663, 783505, 784612, 785732, 786880, 787960, 788539, 788268, 787231, 785786, 784390, 783535, 783469, 784048, 785195, 787191, 790100, 793360, 796706, 800960, 807056, 814605, 822522, 830756, 840220, 851147, 862862, 875280, 889238, 904943, 921265, 937199, 953066, 969573, 986346, 1002058, 1015658, 1027152, 1037603, 1048631, 1061487, 1076318, 1092437, 1109097, 1125586, 1140901, 1154141, 1165192, 1174359, 1181421, 1185805, 1187543, 1187167, 1184711, 1179769, 1172616, 1164387, 1156012, 1147830, 1140319, 1134204, 1129471, 1125018, 1119596, 1112587, 1103845, 1093584, 1082541, 1071487, 1060368, 1048503, 1035641, 1022104, 1008043, 993441, 978842]
58852I78842j3764j2953j3006j3475j3554j3388j3403j3190j2309j1481j1691
58841H36628j2660j3369j3601j3707j3485j2509j1181j0234r532q456p110o031
58829G04753n105l809k241r42kQ43J661K527L740N124N864N821O116P400Q556
58814G40306Q249O911N878N319M440L121J893Q28k85j106j296j441k246l289l764
58799G63518l910m463n272n685n772n965n994n454m812m626m385l431k271j608
58785F99870q10J035L235M374M605N256O522P308P217O961O781O018M347K118
58771G64837m75l353n853p300q039q746r108q576p816p899q385p948o643n801
58757F68895n737n351m159l079k851l099l287l417l492l215k462j259M78K493
$$ y = [978842, 965078, 952125, 939119, 925644, 912090, 898702, 885299, 872109, 859800, 848319, 836628, 823968, 810599, 796998, 783291, 769806, 757297, 746116, 735882, 726350, 717894, 710784, 704753, 699648, 695839, 693598, 692656, 692654, 693497, 695158, 697685, 701425, 706549, 712413, 718234, 724350, 731750, 740306, 748555, 755466, 761344, 766663, 771103, 774224, 776117, 776945, 776660, 775554, 774258, 772817, 770571, 767282, 763518, 759608, 755145, 749873, 744188, 738416, 732451, 726457, 721003, 716191, 711565, 707180, 703749, 701478, 699870, 699060, 700095, 703330, 707704, 712309, 717565, 724087, 731395, 738612, 745573, 752354, 758372, 762719, 764837, 764362, 761009, 755156, 747856, 739817, 731071, 721963, 713387, 705571, 697672, 689287, 681339, 674696, 668895, 663158, 657807, 653648, 650569, 647718, 644619, 641332, 637915, 634423, 631208, 628746, 627487, 627965, 630458]
58743F30458L948M568N427P355R312R713Q760P896P514O989O448O611P050O501
58729G28550M936L643L191K957K650K721L171L474L717M433N366N809N966O467
58715G87051O823O073M750M347M861M685L002N29k171n300q566j1129j3022j5035
58701G66898j7037j8113j8392j8954j9734j9381j7582j5680j4582j3631j2132
58690E81680j0370q755p250o085n650n498m787l812l647m234m360l561k514j551
58676E09606m33M27L72P3Q84K508L299K972K986M079N427O581Q041R474R526P953
58660E73775O033M305J872j456m367o065p152p887p590o418n718n862n708m872
58646E22890m451m715m268k546j009o44l05J160K936L775L854L818L455K645K105
$$ y = [630458, 634406, 638974, 644401, 651756, 661068, 670781, 679541, 687437, 694951, 701940, 708388, 714999, 722049, 728550, 733486, 737129, 740320, 743277, 745927, 748648, 751819, 755293, 759010, 763443, 768809, 774618, 780584, 787051, 793874, 799947, 804697, 809044, 813905, 818590, 821592, 822121, 819950, 814650, 806084, 794955, 781933, 766898, 749861, 731748, 713356, 694402, 674668, 655287, 637705, 622025, 607443, 593812, 581680, 571310, 562555, 555305, 549220, 543570, 538072, 533285, 529473, 525826, 521592, 517232, 513671, 511157, 509606, 509173, 509600, 509972, 510045, 510929, 513437, 516736, 519708, 522694, 526773, 532200, 538781, 546822, 556296, 565822, 573775, 579808, 584113, 585985, 584529, 580162, 574097, 566945, 559058, 551468, 545050, 539332, 533470, 527762, 522890, 518439, 513724, 509456, 506910, 505901, 505257, 504952, 506112, 509048, 512823, 516677, 520495, 523950, 526595, 528700]
58631E28700K052J464j24j501j556q28k24L96J256J652J119M81O56J433K286L256
58615E40518M279M803M827N117N806O087N792N758O080N683M351L444L713M128
58601F10386L791L281L132K659J512P05Q94J054K52o72l77J108K915M618O095
58586F41353P193Q378J0507J3282J5093J5085J4048J2835J1411R950R166Q907
58574G77208Q114O823O407P270Q222Q857J0400J3381J6583J9289K2415K6307K9524
58561I60800L1004L1269L0446K7305K1674J5492J0034M300k281p916j0982j2245
58549A098900j2715j1555q348n313m780o091p295q391j0635j3999j7552k1192
58537I71034k4861k7198k7060k5375k3759k2289k0273j7959j5795j3240j0094
$$ y = [528700, 530752, 532216, 532092, 530591, 529035, 528207, 527983, 528379, 529635, 531287, 532406, 532887, 533543, 534976, 537262, 540518, 544797, 549600, 554427, 559544, 565350, 571437, 577229, 582987, 589067, 594750, 599101, 602545, 606258, 610386, 614177, 617458, 620590, 623249, 624761, 625466, 626360, 627414, 627666, 626994, 626617, 627725, 630640, 635258, 641353, 648546, 656924, 667431, 680713, 695806, 710891, 724939, 737774, 749185, 759135, 768301, 777208, 785322, 792145, 798552, 805822, 814044, 822901, 833301, 846682, 863265, 882554, 904969, 931276, 960800, 991804, 1023073, 1053519, 1080824, 1102498, 1117990, 1128024, 1132324, 1130043, 1122127, 1111145, 1098900, 1086185, 1074630, 1066282, 1060969, 1056189, 1050098, 1042803, 1034412, 1023777, 1009778, 992226, 971034, 946173, 918975, 891915, 866540, 842781, 820492, 800219, 782260, 766465, 753225, 743131]
58526G43131p715p151p330o811n983n776n601m521l265l059l500l436k919k538
58512F73526j947p40J77j06r08j116r19q72n53L89J053P45L04N42P59K75o6N12
58494F71055J232J432K054L782N484O206O982Q708J0210J0446J0793J2829J5599
58481G66812J7464J8894K0941K2547K2087K0194J8365J6062J1833O273J237k961
58469I39748p101j0788j2993j4023j4610j3994j1066o596k244J691N581Q784J0732
58456H73121J2415J4680J6305J5913J4379J3070J1169P253K089k593o846j1438
58444I59517j5335j6962j6873j6630j6120j4357j1895r888p893n048k241p19K38
58431H25794J841L417L914M369O225Q557R615R675R774R190O960M320K736J143
$$ y = [743131, 735416, 728265, 720935, 714124, 708141, 702365, 696764, 692243, 688978, 685919, 682419, 678983, 676064, 673526, 671579, 670839, 671016, 670910, 670002, 668886, 667967, 667095, 666542, 666931, 667984, 668729, 669033, 669575, 670334, 670609, 670543, 671055, 672287, 673719, 675773, 679555, 685039, 691245, 698227, 706935, 717145, 727591, 738384, 751213, 766812, 784276, 803170, 824111, 846658, 868745, 888939, 907304, 923366, 935199, 941472, 942709, 939748, 932647, 921859, 908866, 894843, 880233, 866239, 855173, 848577, 846333, 848024, 853605, 862389, 873121, 885536, 900216, 916521, 932434, 946813, 959883, 971052, 978305, 980394, 977801, 970955, 959517, 944182, 927220, 910347, 893717, 877597, 863240, 851345, 841457, 833564, 828516, 826275, 825556, 825794, 827635, 831052, 834966, 839335, 845560, 854117, 863732, 873407, 883181, 892371, 899331, 903651, 906387, 907530]
58417I07530j947n164o354o296p065q179p859o673o442o709n843m426m027l860
58403H26686k285m33n59j792j359Q51K654L578M782N800N227L990M266N699O174
58388H63279N597N409N342M273L294M145N480M727K734K565M414N798O104O792
58374I29953P728P507O827P570R018R053Q286Q917J0398J0584J0288J1978J4702
58361A052809J5264J3897J3696J4720J3857J0566P706O358M742K594J794K143
58349A160146J329m40l69J920L826M558N956Q250R541R876J1236J3302J3848J3521
58335A256500J5321J9034K1140K0716K0349K0771J9645J6485J3728J2141R836
58324A445666O647M727M240L135J676K333M787O018N741O655Q958R925R354J0031
$$ y = [907530, 905583, 900419, 894065, 887769, 880704, 872525, 864666, 857993, 851551, 844842, 838999, 834573, 830546, 826686, 824401, 823968, 823409, 821617, 820258, 821109, 823763, 827341, 832123, 837923, 843150, 847140, 851406, 857105, 863279, 868876, 874285, 879627, 883900, 887194, 891339, 896819, 901546, 904280, 906845, 911259, 917057, 923161, 929953, 937681, 945188, 952015, 959585, 968603, 977656, 985942, 994859, 1005257, 1015841, 1026129, 1038107, 1052809, 1068073, 1081970, 1095666, 1110386, 1124243, 1134809, 1142515, 1148873, 1153615, 1156209, 1158003, 1160146, 1161475, 1161035, 1160666, 1162586, 1166412, 1170970, 1176926, 1185176, 1194717, 1204593, 1215829, 1229131, 1242979, 1256500, 1271821, 1290855, 1311995, 1332711, 1353060, 1373831, 1393476, 1409961, 1423689, 1435830, 1445666, 1452313, 1457040, 1461280, 1464415, 1466091, 1468424, 1473211, 1479229, 1484970, 1491625, 1500583, 1510508, 1519862, 1529893]
58310A529893J2265J3402J3280J4610J7396J8630J8091J8729K0712K1001J9407
58299A717416J9084K0367K0265J8709J9067K1646K3053K2718K3647K5962K6449
58288A958383K5275K6211K9294L0398K9074K9474L2410L4053L3696L5056L8522
58277B301846M0083L9523M1476M6545M9711M9535N0500N4017N5756N4433N4513
58266B837938N7452N9005N8024N9207O4009O7600O7861O8565P0778P0306O6800
58255C547545O5956O9360P1657P1065P2836P8811Q3801Q5995R0515R8840J05341
58244D441722J08372J13762J23205J30604J34271J40733J51880J60761J65199
58235E670509J72686J86237J98647K06698K17454K34127K49682K61157K76112
$$ y = [1529893, 1542158, 1555560, 1568840, 1583450, 1600846, 1619476, 1637567, 1656296, 1677008, 1698009, 1717416, 1736500, 1756867, 1777132, 1795841, 1814908, 1836554, 1859607, 1882325, 1905972, 1931934, 1958383, 1983658, 2009869, 2039163, 2069561, 2098635, 2128109, 2160519, 2194572, 2228268, 2263324, 2301846, 2341929, 2381452, 2422928, 2469473, 2519184, 2568719, 2619219, 2673236, 2728992, 2783425, 2837938, 2895390, 2954395, 3012419, 3071626, 3135635, 3203235, 3271096, 3339661, 3410439, 3480745, 3547545, 3613501, 3682861, 3754518, 3825583, 3898419, 3977230, 4061031, 4147026, 4237541, 4336381, 4441722, 4550094, 4663856, 4787061, 4917665, 5051936, 5192669, 5344549, 5505310, 5670509, 5843195, 6029432, 6228079, 6434777, 6652231, 6886358, 7136040, 7397197, 7673309]
58226G673309K97812L18791L36357L59088L90325M21264M48534M81799N25454
58217A1252733N70554O14033O67239P35615Q09591Q86011R77801J091450J217408
58208A8822435J354910J522462J731137J973730K254793K603398L041061L568541
58200C6872467M201559M984740N950385P102147Q462106J0091886J2044183J4345191
58192A04054664J7053542K0277969K4103693K8543016L3470896L8276921M1347402
58185C07128103M0196137L2816158J9413324K827086j2960338k4933316l2069056
58178C32418098l4936861l4774840l2835880l0075955k7036481k3927603k0852229
58171A27978249j7940431j5301878j2963366j0914278r162806p708839o508951
$$ y = [7673309, 7971121, 8289912, 8626269, 8985357, 9375682, 9796946, 10245480, 10727279, 11252733, 11823287, 12437320, 13104559, 13840174, 14649765, 15535776, 16513577, 17605027, 18822435, 20177345, 21699807, 23430944, 25404674, 27659467, 30262865, 33303926, 36872467, 41074026, 46058766, 52009151, 59111298, 67573404, 77665290, 89709473, 104054664, 121108206, 141386175, 165489868, 194032884, 227503780, 265780701, 307128103, 347324240, 380140398, 399553722, 402380808, 389420470, 364487154, 332418098, 297481237, 262706397, 229870517, 199794562, 172758081, 148830478, 127978249, 110037818, 94735940, 81772574, 70858296, 61695490, 53986651, 47477700]
58164D7477700n509867m686508m019686l469139k998016k598471k268838j989102
58156A9938073j740554j526828j354051j209512j078823r65569q75841q00117
58148A0386778p27307o61159o07156n57672n04990m55327m15973l81192l43857
58139E732145l08810k82220k59449k35382k15562k05323j98451j87609j76113
58130C663226j68871j61590j49425j36890j29095j22035j11230j01231r7044r4458
58120B391357q8141q1329p8413p5892o9662o3659o2369o1918n7427n2237n1202
58109A649108n1473m8518m4953m4857m5286m1829l7160l5903l6088l3595l0223
58098A199223k9681l0072k7727k4280k3084k2724k0587j8562j8933j9017j6067
$$ y = [47477700, 41967833, 37281325, 33261639, 29792500, 26794484, 24196013, 21927175, 19938073, 18197519, 16670691, 15316640, 14107128, 13028305, 12062736, 11186895, 10386778, 9659471, 8998312, 8391156, 7833484, 7328494, 6873167, 6457194, 6076002, 5732145, 5423335, 5141115, 4881666, 4646284, 4430722, 4225399, 4026948, 3839339, 3663226, 3494355, 3332765, 3183340, 3046450, 2917355, 2795320, 2684090, 2582859, 2485815, 2391357, 2303216, 2221887, 2143474, 2067582, 1997920, 1934261, 1871892, 1809974, 1752547, 1700310, 1649108, 1597635, 1549117, 1504164, 1459307, 1414021, 1372192, 1335032, 1299129, 1263041, 1229446, 1199223, 1169542, 1139470, 1111743, 1087463, 1064379, 1041655, 1021068, 1002506, 983573, 964556, 948489]
58087I48489j3069j3486j4762j3316j1488j2987j5754j5937j4962j6132j7881
58076G88715j6986j5126j5775j7642j7348j5635j5058j4441j1543q468q568j0426
58064F21699j0387q673p747p118n056l020l347m796n165n730q396j1054j0769
58051E30441q997q788r356q278o570o564p091n709l602l385m231l910l419m810
58037D45731o589o154m757n141o312n555l838m159o094o890o533o999p825p065
58023C61820n480n164n340l861j665j254j963j301J21l53k299k765j410p47j576
58008C26763k220k024j941j866q66L57M21N4Q72K260K570K250K614K743J124q70
57992C32241q22N01M02j172k025j812k022k575k032p65m43q97p23k57p87j533
$$ y = [948489, 935420, 921934, 907172, 893856, 882368, 869381, 853627, 837690, 822728, 806596, 788715, 771729, 756603, 740828, 723186, 705838, 690203, 675145, 660704, 649161, 640693, 632125, 621699, 611312, 602639, 594892, 587774, 582718, 579698, 576351, 571555, 566390, 560660, 552264, 541210, 530441, 521444, 512656, 503300, 495022, 488452, 481888, 474797, 469088, 465486, 462101, 457870, 453960, 450541, 445731, 439142, 432988, 428231, 423090, 416778, 411223, 407385, 403226, 397132, 390242, 383709, 376710, 368885, 361820, 356340, 351176, 345836, 341975, 340310, 339056, 337093, 335792, 335913, 335560, 333261, 330496, 329086, 328339, 326763, 324543, 322519, 320578, 318712, 317846, 318203, 318624, 318678, 319550, 321810, 324380, 326630, 329244, 331987, 333111, 332241, 331419, 331920, 332322, 331150, 329125, 327313, 325291, 322716, 320684, 319919, 319476, 318579, 317856, 317599, 316812, 315279]
57976C15279p71P94J133N60R67K182K524K180K601L206K255M34m8O00J79j532
57960C32543k681k847l211l643l027k114k623l878l750k564k470l234k465k5J518
57945B95529J111L99L54J16l44K54J826K743K783L349M503M844M534N314P093
57930C34408P632O253M819M382L743K124M46q19k387m061m432l496l106m031m885
57915C36590m672m088l639k779j587j147j523j422m26L48L47L13M50r5j444k440
57899C12786k453k066j716j327j276j984k563j729QR93R92J176J820K235K604
57884C07500L603M475L962K877L112M308M286K796J821J978J716N24jQ42J607
57869C45406J375J120J523J897K027K728L719L419J804R76J870K740K108R71P68
$$ y = [315279, 314508, 315302, 316435, 316995, 317962, 320144, 322668, 324848, 327449, 330655, 332910, 333344, 333296, 333896, 334075, 332543, 329862, 327015, 323804, 320161, 317134, 315020, 312397, 308519, 304769, 302205, 299735, 296501, 294036, 294011, 295529, 296640, 297039, 297393, 297509, 297165, 297419, 299245, 301988, 304771, 308120, 312623, 317467, 322001, 327315, 334408, 342040, 348293, 353112, 357494, 361237, 363361, 363807, 362988, 360601, 356540, 352108, 348612, 345506, 341475, 336590, 331918, 327830, 324191, 321412, 319825, 318678, 317155, 315733, 315307, 315655, 316002, 316315, 316765, 316670, 315226, 312786, 310333, 308267, 306551, 305224, 303948, 301964, 299401, 297672, 297680, 298673, 299665, 300841, 302661, 304896, 307500, 311103, 315578, 319540, 322417, 325529, 329837, 334123, 336919, 338740, 340718, 342434, 342958, 342957, 343799, 345406, 346781, 347901, 349424, 351321, 353348, 356076, 359795, 363214, 365018, 365994, 367864, 370604, 372712, 373683, 374451]
57854C74451J190J397J596K167K710K987L393L779L315K149J537J750J592O27
57840D04640J5M09Q92P39N24O92P54N67P53J157P13n74j235n89L91J038J932L205
57822D16023L817L368K829K708K252J148K51j32q31j974k460k024j975l015m244
57807D15741n054o103p465p904p009o055n719m880k899j138p98j053p90n07r46
57792C57421j367p93J83M29Q1L7M85J034J495J740J604J554K382L797M550M378
57776C79010M378M931M994M074L201L082L006K459K134K356K205J247M39L43J05
57761D17964o99r95j88N35L04J44R98J822J423P29J354L087M578N541O528P292
57745D50417P126O303N763N712N667N386M891M061L042K361K009J282J15m34J74
$$ y = [374451, 375641, 377038, 378634, 380801, 383511, 386498, 389891, 393670, 396985, 399134, 400671, 402421, 404013, 404640, 404655, 405064, 405956, 406695, 407219, 407911, 408665, 409232, 409985, 411142, 411855, 411281, 410046, 409457, 409848, 410886, 412818, 416023, 419840, 423208, 426037, 428745, 430997, 432145, 432396, 432264, 431433, 429459, 426999, 424975, 423000, 419985, 415741, 410687, 404584, 397119, 389215, 382206, 376151, 370432, 365552, 362653, 361515, 360717, 359664, 358874, 358367, 357421, 356054, 355261, 355444, 355873, 355954, 355991, 356476, 357510, 359005, 360745, 362349, 363903, 366285, 370082, 374632, 379010, 383388, 388319, 393313, 397387, 400588, 403670, 406676, 409135, 411269, 413625, 415830, 417077, 417516, 417859, 417964, 417265, 416270, 416082, 416617, 416921, 417065, 418063, 419885, 421308, 422037, 423391, 426478, 431056, 436597, 443125, 450417, 457543, 463846, 469609, 475321, 480988, 486374, 491265, 495326, 498368, 500729, 502738, 504020, 504135, 503701, 503875]
57730E03875R77R65M26O5j01j03N36J783K623K500K157K224K198J640J096R01
57714E23762L46r00j771j305p9Q21J137R56J36q95j060k62K84J26M16J712K691
57697E26115K352J805K375L441L781L631L757L745K910J824J259P31m11j442j347
57682E54526n26J42Q66K166L542M474N787Q483J2182J6119K0629K6204L2214L8155
57668G24963M5048N3912O3912P3479Q1726Q6658Q3359O7029L8114K923l0508n6138
57656A234477p1149p6241p4781o9918o2541n2877m2778l4473k8039k2181j6913
57645F82586j3306j1108q883o301m352l380k736k212k030j644l07J375K164K131
57631F31997K227K341J700Q51J165K437L008K345J507J017L09n77o94M7N88N66
$$ y = [503875, 504852, 505817, 506243, 506308, 506207, 506104, 506640, 508423, 511046, 513546, 515703, 517927, 520125, 521765, 522861, 523762, 524108, 523208, 521437, 520132, 520053, 520874, 522011, 522967, 523103, 522208, 521148, 520886, 521170, 521296, 521712, 523424, 526115, 528467, 530272, 532647, 536088, 539869, 543500, 547257, 551002, 553912, 555736, 556995, 557726, 557315, 555873, 554526, 554000, 554142, 555008, 557174, 560716, 565190, 570977, 579460, 591642, 607761, 628390, 654594, 686808, 724963, 770011, 823923, 887835, 961314, 1043040, 1129698, 1213057, 1280086, 1318200, 1321123, 1290615, 1234477, 1163328, 1087087, 1012306, 942388, 879847, 826970, 784192, 749719, 721680, 699499, 682586, 669280, 658172, 649289, 642988, 638636, 635256, 632520, 630308, 628278, 626634, 626327, 627702, 629866, 631997, 634224, 636565, 638265, 639116, 640281, 642718, 645726, 648071, 649578, 650595, 650904, 650327, 649633, 649680, 650268, 650834]
57615F50834P34J289J543J522K075L013K983J776R46J399K074J903J519J929K775
57600F78314L101K864K659K584K342J925J573J333J124Q96N35Pl73l16n3P6L22
57583F98913J068J973K361K204J939J628J221J172J748K149J565O76P08J381J378
57568G22084O19L34Q93J340J281J513K364L047L185L467M150M394L792L281L675
57553G59419M462M864N072N574O182O510O752P180P477P217O568O010N716N617
57539H44620N673N890O362P201Q041P937O517M868M338M738M911M723N090O102
57525I27011O749O686O734P149P051O194N842O899Q420R033Q848Q880R329R615
57511A034440R580R608R788R711R077P996O865O206O325O902P222O987O570O369
$$ y = [650834, 651568, 652857, 654400, 655922, 657997, 661010, 663993, 665769, 666715, 668114, 670188, 672091, 673610, 675539, 678314, 681415, 684279, 686938, 689522, 691864, 693789, 695362, 696695, 697819, 698715, 699250, 699257, 698884, 698568, 698515, 698591, 698913, 699981, 701954, 704315, 706519, 708458, 710086, 711307, 712479, 714227, 716376, 717941, 718617, 719325, 720706, 722084, 722703, 723037, 723930, 725270, 726551, 728064, 730428, 733475, 736660, 740127, 744277, 748671, 752463, 755744, 759419, 763881, 768745, 773817, 779391, 785573, 792083, 798835, 806015, 813492, 820709, 827277, 833287, 839003, 844620, 850293, 856183, 862545, 869746, 877787, 885724, 892241, 897109, 901447, 906185, 911096, 915819, 920909, 927011, 933760, 940446, 947180, 954329, 961380, 967574, 973416, 980315, 988735, 997768, 1006616, 1015496, 1024825, 1034440, 1044020, 1053628, 1063416, 1073127, 1082204, 1090200, 1097065, 1103271, 1109596, 1116498, 1123720, 1130707, 1137277, 1143646]
57497A143646O396O550O793O875O464N716N241N400O038O817P325P043N917M832
57483A231053M771N528O103O200O419O988P372P347P413P879Q333Q344P998P530
57469A329278P174P317Q117Q927Q965Q570Q792R783J0660J0977J1207J1581J1646
57456A452994J1232J0799J0493J0014R594R981J1006J1468J0929J0408J0751J1468
57444A581137J1870J2221J2885J3394J3248J2938J3118J3506J3401J2854J2515
57433A723087J2706J3211J3675J3763J3361J2909J3108J3945J4630J4677J4377
57422A873449J4039J3521J2919J2851J3536J4360J4781J4977J5171J5156J4964
57411B029724J5238J6283J7415J7873J7773J7644J7530J7186J6617J5977J5341
$$ y = [1143646, 1150042, 1156592, 1163385, 1170260, 1176724, 1182440, 1187681, 1193081, 1199119, 1205936, 1213261, 1220304, 1226221, 1231053, 1235824, 1241352, 1247455, 1253655, 1260074, 1267062, 1274434, 1281781, 1289194, 1297073, 1305406, 1313750, 1321748, 1329278, 1336452, 1343769, 1351886, 1360813, 1369778, 1378348, 1387140, 1396923, 1407583, 1418560, 1429767, 1441348, 1452994, 1464226, 1475025, 1485518, 1495532, 1505126, 1515107, 1526113, 1537581, 1548510, 1558918, 1569669, 1581137, 1593007, 1605228, 1618113, 1631507, 1644755, 1657693, 1670811, 1684317, 1697718, 1710572, 1723087, 1735793, 1749004, 1762679, 1776442, 1789803, 1802712, 1815820, 1829765, 1844395, 1859072, 1873449, 1887488, 1901009, 1913928, 1926779, 1940315, 1954675, 1969456, 1984433, 1999604, 2014760, 2029724, 2044962, 2061245, 2078660, 2096533, 2114306, 2131950, 2149480, 2166666, 2183283, 2199260, 2214601]
57400B214601J5011J5403J6333J6937J6795J6574J7098J8254J9233J9459J8995
57389B404693J8414J8460J9329K0215K0204J9617J9726K0959K2364K3010K3024
57378B630015K2849K2457K1827K1396K1455K1739K1971K2146K2015K1088J9572
57367B868530J8481J8375J8770J9137J9696K0700K1669K1933K1404K0468J9678
57356C088841J9695K0799K2313K3224K3498K3923K4662K5123K5262K5756K6588
57345C349684K6883K6482K6348K6885K7298K7155K7114K7443K7354K6689K6689
57334C646024K8052K9569K9928K9531K9362K9264K8735K8291K8607K9202K9279
57323C965844K9058K9024K8834K8244K8163K9277L0499L0376K9293K8745K9003
$$ y = [2214601, 2229612, 2245015, 2261348, 2278285, 2295080, 2311654, 2328752, 2347006, 2366239, 2385698, 2404693, 2423107, 2441567, 2460896, 2481111, 2501315, 2520932, 2540658, 2561617, 2583981, 2606991, 2630015, 2652864, 2675321, 2697148, 2718544, 2739999, 2761738, 2783709, 2805855, 2827870, 2848958, 2868530, 2887011, 2905386, 2924156, 2943293, 2962989, 2983689, 3005358, 3027291, 3048695, 3069163, 3088841, 3108536, 3129335, 3151648, 3174872, 3198370, 3222293, 3246955, 3272078, 3297340, 3323096, 3349684, 3376567, 3403049, 3429397, 3456282, 3483580, 3510735, 3537849, 3565292, 3592646, 3619335, 3646024, 3674076, 3703645, 3733573, 3763104, 3792466, 3821730, 3850465, 3878756, 3907363, 3936565, 3965844, 3994902, 4023926, 4052760, 4081004, 4109167, 4138444, 4168943, 4199319, 4228612, 4257357, 4286360]
57312D286360K9168K9118K9610L0612L1119L0678K9916K9441K9343K9689L0500
57301D615554L1235L1219L0569K9987K9845L0068L0532L0921L0692K9930K9582
57290D950134L0105L0588L0128K9301K9145K9541K9778K9946L0435L0779L0448
57279E280328L0145L0794L1719L1499L0234K9278K8982K8455K7473K6932K7192
57268E603031K7571K7669K7843K8118K7977K7540K7615K8309K8753K8472K7924
57257E910822K7379K6431K4956K3499K2422K1563K1029K1198K1774K1765K0805
57246F163643J9614J8896J8632J8634J8900J9160J9011J8695J8979K0012K1099
57235F375275K1730K2026K2057K1651K1004K0595K0335J9673J8671J8049J7900
$$ y = [4286360, 4315528, 4344646, 4374256, 4404868, 4435987, 4466665, 4496581, 4526022, 4555365, 4585054, 4615554, 4646789, 4678008, 4708577, 4738564, 4768409, 4798477, 4829009, 4859930, 4890622, 4920552, 4950134, 4980239, 5010827, 5040955, 5070256, 5099401, 5128942, 5158720, 5188666, 5219101, 5249880, 5280328, 5310473, 5341267, 5372986, 5404485, 5434719, 5463997, 5492979, 5521434, 5548907, 5575839, 5603031, 5630602, 5658271, 5686114, 5714232, 5742209, 5769749, 5797364, 5825673, 5854426, 5882898, 5910822, 5938201, 5964632, 5989588, 6013087, 6035509, 6057072, 6078101, 6099299, 6121073, 6142838, 6163643, 6183257, 6202153, 6220785, 6239419, 6258319, 6277479, 6296490, 6315185, 6334164, 6354176, 6375275, 6397005, 6419031, 6441088, 6462739, 6483743, 6504338, 6524673, 6544346, 6563017, 6581066, 6598966]
57224F598966J7348J5782J3606J1413R258P081N042L104R23j513l708n375o727
57211F665200p923q825r468j0120j0806j1280j1565j1908j2220j2165j1724j1019
57199F536177r804p961o285n774o258o652o505o265o109n771n609o561q655j0761
57185F437207j2160j3329j4741j6006j6751j7392j8370j9411k0159k0889k1998
57174F246001k3335k4482k5236k5490k5161k4487k3913k3572k3330k3289k3543
57163E980163k3524k2514k0863j9752j9575j9533j9035j8494j8425j8717j9161
57152E760570j9831k0564k0963k1278k2408k4647k7234k9573l1980l4822l7798
57141E469472m0542m3198m5812m7940m9303n0063n0115m8916m6377m3178l9735
$$ y = [6598966, 6616314, 6632096, 6645702, 6657115, 6666373, 6673454, 6678496, 6681600, 6682523, 6681010, 6677302, 6671927, 6665200, 6657277, 6648452, 6638984, 6628864, 6618058, 6606778, 6595213, 6583305, 6571085, 6558920, 6547196, 6536177, 6526373, 6518412, 6512127, 6506353, 6500095, 6493443, 6486938, 6480673, 6474564, 6468793, 6463184, 6456623, 6447968, 6437207, 6425047, 6411718, 6396977, 6380971, 6364220, 6346828, 6328458, 6309047, 6288888, 6267999, 6246001, 6222666, 6198184, 6172948, 6147458, 6122297, 6097810, 6073897, 6050325, 6026995, 6003706, 5980163, 5956639, 5934125, 5913262, 5893510, 5873935, 5854402, 5835367, 5816873, 5798448, 5779731, 5760570, 5740739, 5720175, 5699212, 5677934, 5655526, 5630879, 5603645, 5574072, 5542092, 5507270, 5469472, 5428930, 5385732, 5339920, 5291980, 5242677, 5192614, 5142499, 5093583, 5047206, 5004028, 4964293]
57130D964293l5690l0865k5771k0742j5389r602m218l2L067N228N506K483m188
57117D834080j3138k1677k6724k6195k0090r910L025J8009L3997M9723O5368Q3089
57105D969557J05350J33825J70468K18441K81142L61426M62665N89658P47425
57096H039957R39777J169477J438417J746128K088542K458895K848851L247737
57088B3977781L641485M013439M345700M619663M817656M925841M933332M825061
57080F0099958M576588M161075L565308K799991J895974Q93554j63755j228881
57072G6599812k250164l173784l949288m536553m912857n077448n050700m867819
57064D2781199m570508m200237l794175l382724k987918k623112k294397k002966
$$ y = [4964293, 4928603, 4897738, 4871967, 4851225, 4835836, 4826234, 4822016, 4821984, 4825051, 4830279, 4835785, 4838268, 4834080, 4820942, 4799265, 4772541, 4746346, 4726256, 4716346, 4719371, 4737380, 4771377, 4821100, 4886468, 4969557, 5074907, 5208732, 5379200, 5597641, 5878783, 6240209, 6702874, 7292532, 8039957, 8979734, 10149211, 11587628, 13333756, 15422298, 17881193, 20730044, 23977781, 27619266, 31632705, 35978405, 40598068, 45415724, 50341565, 55274897, 60099958, 64676546, 68837621, 72402929, 75202920, 77098894, 77992448, 77828693, 76599812, 74349648, 71175864, 67226576, 62690023, 57777166, 52699718, 47649018, 42781199, 38210691, 34010454, 30216279, 26833555, 23845637, 21222525, 18928128, 16925162]
57056A6925162j747107j523540j328596j159112j012393q85664p76149o81792
57048G810809o01395n33856m77602m30746l91227l56792l25523k96598k70023
57039D127047k45453k22125j99966j79802j61955j45456j29257j13549r9134q6077
57029B544273p3566o0742m7119l2609j7554k649J1027K1053K2891J2060j1431
57018B365634m1371o9114q8905r9438j01901r8320r1231q2989p4676o6345n8264
57007A493080n1185m5459m0737l6610l3001k9932k7463k5784k4870k4148k2993
56996A130898k1388j9665j7881j5918j3933j2113j0229p990n510k958j6L639P566
56983A014502J0678J1925J0496N951j137r041j6002k1264k4698k6099k5553k3859
$$ y = [16925162, 15178055, 13654515, 12325919, 11166807, 10154414, 9268750, 8492601, 7810809, 7209414, 6675558, 6197956, 5767210, 5375983, 5019191, 4693668, 4397070, 4127047, 3881594, 3659469, 3459503, 3279701, 3117746, 2972290, 2843033, 2729484, 2630350, 2544273, 2470707, 2409965, 2362846, 2330237, 2312683, 2310034, 2321061, 2342114, 2365005, 2377065, 2365634, 2324263, 2255149, 2166244, 2066806, 1964905, 1866585, 1775354, 1692365, 1617689, 1551344, 1493080, 1441895, 1396436, 1355699, 1319089, 1286088, 1256156, 1228693, 1202909, 1178039, 1153891, 1130898, 1109510, 1089845, 1071964, 1056046, 1042113, 1030000, 1019771, 1011781, 1006271, 1003313, 1003297, 1006936, 1014502, 1025180, 1037105, 1047601, 1053552, 1052415, 1043374, 1027372, 1006108, 981410, 955311, 929758, 905899]
56971I05899k1715j8969j5474j2065r646p760n235j949J187L838O682J0216J4220
56958H49229J8385K2339K4720K3364J7031O590n658j7308k6518l2293l4624l4135
56946H11122l1520k7482k2917j8559j4544j0740p254m074n98L687Q299J2437J6397
56933G14254K1336K7513L3452L6885L5859K9160J6901J147j4735k7836l6708m0967
56921G96261m0933l7887l3775l0075k7122k4594k2151j9540j6675j3908j1810
56910E17791j0519r573q446o984n382m089l536l653l763l386k809k410j892q70
56896D50479J67N10N57J487L550N726P245Q593J0650J3544J6545J8475J8048J4551
56882E70127Q619J883m254r180j2567j4125j4051j2978j1259q783n693k623l4
$$ y = [905899, 884184, 865215, 849741, 837676, 828030, 820270, 815035, 813086, 814273, 818111, 824793, 835009, 849229, 867614, 889953, 914673, 938037, 955068, 961658, 956000, 938692, 912174, 879881, 845257, 811122, 779602, 752120, 729203, 710644, 696100, 685360, 678106, 674032, 673434, 677121, 685420, 697857, 714254, 735590, 763103, 796555, 833440, 869299, 898459, 915360, 916507, 901772, 873936, 837228, 796261, 755328, 717441, 683666, 653591, 626469, 601875, 579724, 560184, 543509, 529601, 517791, 507272, 497699, 489253, 482269, 476887, 472798, 469262, 465609, 461846, 458460, 455651, 453241, 451349, 450479, 450646, 451156, 451713, 453200, 456750, 462476, 469721, 478314, 488964, 502508, 519053, 537528, 555576, 570127, 578746, 580629, 576375, 567195, 554628, 540503, 526452, 513474, 502215, 493432, 487739, 485116, 485082]
56869D85082K212M446O840R619J3036J7030K1341K6042L1387L6871M0871M1402
56857G36179L7027K7380J3604j674j5498k6088l2960l5936l4925l0709k5008j9238
56845E92154j3736q305k981K154P298J2749J8715K5347L2677M0488M8654N7218
56833H12432O5090O8741O3583M7697K3851k424k6275m4966n7222o2662o1968n6903
56821G68974m9604m1744l4106k6741j9491j2499o088k86N336J1281J7785K4828
56809F37645L2272L9822M6672N0882M9374L9564K1882L78j9750l5183m5013m9405
56797G69140m8943m5043l9685l4264k9139k4190j9220j3977q574l823l96K246
56785E04132N382R477J3890J7981K1561K3991K3756J9414J0821o22j2490k2294
$$ y = [485082, 487294, 491740, 498580, 508199, 521235, 538265, 559606, 585648, 617035, 653906, 694777, 736179, 773206, 800586, 814190, 812516, 797018, 770930, 737970, 702034, 667109, 636400, 611392, 592154, 578418, 570113, 567132, 569286, 576584, 589333, 608048, 633395, 666072, 706560, 755214, 812432, 877522, 946263, 1009846, 1057543, 1081394, 1078970, 1052695, 1007729, 950507, 887845, 825877, 768974, 719370, 677626, 643520, 616779, 597288, 584789, 578701, 578415, 583751, 595032, 612817, 637645, 669917, 709739, 756411, 807293, 856667, 896231, 918113, 918491, 898741, 863558, 818545, 769140, 720197, 675154, 635469, 601205, 572066, 547876, 528656, 514679, 506105, 502282, 501886, 504132, 509514, 518991, 532881, 550862, 572423, 596414, 620170, 639584, 650405, 649783, 637293, 614999]
56773F14999k8650l1672l2096l0431k7315k3962k1247j8824j6098j3545j1996
56762C59163j1072r724q013o872o257n171l576k651k783k929k488k284k958l763
56748B88622l831l429l107k630j669o69j81n0Qk19p58r09j97P37Q85J04r63j687
56730B70057j695r34Q6N65L70J74M13P57R15J185J776K293K323J973J507J046
56714B82811P63P48N85j26q06m64O83J362J214J251K017K676K590K405K710K847
56698C03266K027O45m54j171j756k083k085k125k186j632m67J96k76r63p94kO70
56681B90810J158J498J181K24j81O57J561J131j95j091j527k307l109k820j537
56666B85453n87m71l18M41J130R26k3r66j291p93K31J054J115N89K7k78k16L27
$$ y = [614999, 586349, 554677, 522581, 492150, 464835, 440873, 419626, 400802, 384704, 371159, 359163, 348091, 338367, 330354, 323482, 317225, 312054, 308478, 305827, 303044, 300115, 297627, 295343, 292385, 288622, 284791, 281362, 278255, 275625, 273956, 273287, 273106, 273056, 273064, 272845, 272087, 271178, 270981, 271718, 272603, 272707, 271744, 270057, 268362, 267428, 267514, 268079, 268449, 268623, 269036, 269793, 270708, 271893, 273669, 275962, 278285, 280258, 281765, 282811, 283574, 284322, 284907, 284781, 283975, 283511, 284194, 285556, 286770, 288021, 290038, 292714, 295304, 297709, 300419, 303266, 305293, 305938, 305484, 304313, 302557, 300474, 298389, 296264, 294078, 292446, 291979, 292175, 291899, 290936, 290142, 290140, 290810, 291968, 293466, 294647, 294871, 294690, 295347, 296908, 298039, 297844, 296753, 295226, 292919, 289810, 286990, 285453, 284866, 284395, 284077, 284518, 285648, 286574, 286551, 285585, 284294, 283501, 283732, 284786, 285901, 286490, 286517, 286239, 286023, 286350]
56648B86350J101J395R14L13L01O79P97N01qo49j186j047j64O32O63K85L7l49
56630B90565j249k146k298j858j471j244j019j091j721k298k034j129m86m76p25
56615B69320q14n65l8L10o3q96j253r20p34j038r64k7Q20P32L70N69P80K23n04
56596B65308m28O4J27J98J134K246K087P82j34j2L81M17K37p9n83q26m28Pk93
56577B70205p84k75J215K586L258L390K884J679O81Q51J620J630Q91O86J581K999
56561B95097M592O508Q421R775J0866J2135J2625J0740O596K072j501m158n983
56548C67785o684o618o592o423n263l458k437k557k682k195j852k160k479k266
56534C14119j830j470j033p07q38q90N2J469J720N13n35k77N15P40N29L93J51
$$ y = [286350, 287451, 288846, 289760, 290073, 290374, 291053, 291850, 292351, 292343, 291694, 290508, 289461, 289297, 289929, 290592, 290877, 290914, 290565, 289316, 287170, 284872, 283014, 281543, 280299, 279280, 278189, 276468, 274170, 272136, 271007, 270521, 270045, 269320, 268506, 267941, 267903, 268213, 268150, 267254, 266001, 265081, 264347, 263309, 262345, 262318, 263138, 263870, 264240, 264809, 265589, 265812, 265308, 264880, 264944, 265071, 265269, 266403, 268649, 270736, 271518, 271384, 271372, 271753, 272170, 272407, 272328, 271745, 270919, 270491, 270498, 270205, 269421, 269146, 270361, 272947, 276205, 279595, 282479, 284158, 284839, 285690, 287310, 288940, 289831, 290517, 292098, 295097, 299689, 306197, 314618, 324393, 335259, 347394, 360019, 370759, 377355, 379427, 377926, 373768, 367785, 361101, 354483, 347891, 341468, 336205, 332747, 330310, 327753, 325071, 322876, 321024, 318864, 316385, 314119, 312289, 310819, 309786, 309079, 308241, 307351, 307403, 308872, 310592, 311105, 310570, 310293, 310808, 311548, 312077, 312470, 312621]
56517C12621n05j306j951k476k719k320j600j383j743j984j974k257k641k168
56503B85594r23l61j218k343k340j316l25J1k63p84r62m13M37Q39P61O60M69j09
56485B77414n54j30O48O00j66m48o4Jm21l49L71O06q8p04n92l31l23n7N95R40
56465B76948Q64J106J681J558N30k42r6K56K77L32L72l27j459j584m26N72P03
56448B81065J101K434L534L448K945K765K153N35r97j353j124j208j190m97K04
56433B93815J31k82m48p74j485j657p59J16j23q58r63n40k08J61O99P59Q7l08
56415B87363L12J154J294J094J096Q47Q9k72L29R05O13J97M40N78k10j072r22
56398B93835k92q4K17J333K377K179J337J190J611J723J740K272K585J544l16
$$ y = [312621, 312116, 310810, 308859, 306383, 303664, 301344, 299744, 298361, 296618, 294634, 292660, 290403, 287762, 285594, 284671, 284310, 283092, 280749, 278409, 277093, 276768, 276779, 276516, 275732, 274770, 274357, 274794, 275633, 276394, 277054, 277523, 277414, 276860, 276730, 277378, 277978, 277812, 277364, 277300, 277301, 276880, 276531, 276902, 277508, 277420, 276716, 276124, 275793, 275470, 275413, 276008, 276948, 277812, 278918, 280599, 282157, 282687, 282445, 282349, 282605, 282882, 283214, 283586, 283259, 281800, 280216, 279790, 280362, 281065, 282166, 284600, 288134, 291582, 294527, 297292, 299445, 299980, 298983, 297630, 296506, 295298, 294108, 293611, 293815, 293946, 293664, 293216, 292442, 290957, 289300, 288541, 288657, 288534, 287676, 286713, 286173, 285965, 286126, 286825, 287584, 287671, 287363, 287675, 288829, 290123, 291217, 292313, 293160, 293249, 292977, 293306, 294211, 294824, 295021, 295461, 296039, 295829, 294757, 293835, 293543, 293459, 293676, 295009, 297386, 299565, 300902, 302092, 303703, 305426, 307166, 309438, 312023, 313567, 313251]
56383C13251j472j590j373r07J77J425K043K159K209J763M95n26j35R67J219N90
56367C20295L44R56J806K464K842K536J423L61M6l0l12J04J876L631L608K271
56351C44221J419J379J077K92k08l85q94j527j451p49j76L80J552K914L410L119
56335C54373K991L165L086K971L458M106L861K996K888L869M798M873M464M056
56321D05955L585K975K362J715R70M00K07J22N3M66J469K293K405K240K148J791
56305D31156J390K111M102N675N830N940P394R112R296Q185P116O176M919M133
56291E12535M654N467N236M651N123O168O519O706Q055R939J0653J0257J0107
56278F06070J0289J0010R801J0675J1757J1484J0661J1434J3655J5146J5369J5951
$$ y = [313251, 311779, 310189, 308816, 307909, 308086, 309511, 311554, 313713, 315922, 317685, 318180, 317654, 317519, 318486, 319705, 320295, 320639, 321595, 323401, 325865, 328707, 331243, 332666, 333027, 333073, 333043, 332731, 332835, 334711, 338342, 341950, 344221, 345640, 347019, 348096, 348388, 348180, 347795, 346901, 345374, 343923, 343174, 342998, 343378, 344930, 347844, 351254, 354373, 357364, 360529, 363615, 366586, 370044, 374150, 378011, 381007, 383895, 387764, 392562, 397435, 401899, 405955, 409540, 412515, 414877, 416592, 417562, 417962, 418169, 418291, 418344, 418810, 420279, 422572, 424977, 427217, 429365, 431156, 432546, 434657, 438759, 444434, 450264, 456204, 463598, 472710, 482006, 490191, 497307, 503483, 508402, 512535, 517189, 522656, 527892, 532543, 537666, 543834, 550353, 557059, 565114, 575053, 585706, 595963, 606070, 616359, 626369, 636170, 646845, 658602, 670086, 680747, 692181, 705836, 720982, 736351, 752302]
56266G52302J7627J9444K1130K3526K6525K9051L1321L4673L9083M3278M7390
56255A085350N2953O0161O7701P5449Q4776R5865J07262J18445J30424J43366
56245B021752J55979J67638J78906J89506J97973K03579K06460K05654J99409
56236C726856J87660J71855J52167J27240R7043O3554K8388p860m3562p5985j03851
56225D323505j27770j47746j62650j72536j79037j82844j83202j80237j75402
56216B812081j69098j60351j49533j38893j29682j20948j11902j03230r5350q7645
56206A545449q0104p3711o8553o3498n8139n3158m8558m3634l8780l5023l1789
56195I50502k7637k3259k0878k0473j9537j7091j4899j4071j3345j1710r917q526
$$ y = [752302, 769929, 789373, 810503, 834029, 860554, 889605, 920926, 955599, 994682, 1037960, 1085350, 1138303, 1198464, 1266165, 1341614, 1426390, 1522255, 1629517, 1747962, 1878386, 2021752, 2177731, 2345369, 2524275, 2713781, 2911754, 3115333, 3321793, 3527447, 3726856, 3914516, 4086371, 4238538, 4365778, 4462821, 4526375, 4554763, 4546903, 4503341, 4427356, 4323505, 4195735, 4047989, 3885339, 3712803, 3533766, 3350922, 3167720, 2987483, 2812081, 2642983, 2482632, 2333099, 2194206, 2064524, 1943576, 1831674, 1728444, 1633094, 1545449, 1465345, 1391634, 1323081, 1259583, 1201444, 1148286, 1099728, 1056094, 1017314, 982291, 950502, 922865, 899606, 878728, 858255, 838718, 821627, 806728, 792657, 779312, 767602, 757685, 749159]
56183G49159p018n665n673o655o631n213m170m097l434j635l55l80k14J071K186
56168G01276K126J815K140K627L043M017N280N678N586O734R042J0436J0352J0499
56154G80651J1505J1947J1559J2096J3962J5269J5390J6230J8716K1307K3310
56143I51942K6489L1860L8018M4024N0882N8686O5589P1096P7090Q3889Q8441
56132A588006Q8259Q4190P7662O8491N7346M7349M0908L7312L4889L2847K9610
56121B186869K2647J1796J94r531j7257k2885k5496k6482k9750l6973m5852n4494
56109A952786o3681p3133p9547q0728p8143p3484o6336n7217m8958m2728l6342
56098A252489k8711k2131j8012j4383r973o696n477l790k36K553K583K074L332
$$ y = [749159, 742141, 736476, 730803, 724148, 717517, 712304, 708134, 704037, 700603, 698968, 698613, 698233, 698019, 699090, 701276, 703402, 705217, 707357, 709984, 713027, 717044, 722324, 728002, 733588, 740322, 749364, 759800, 770152, 780651, 792156, 804103, 815662, 827758, 841720, 856989, 872379, 888609, 907325, 928632, 951942, 978431, 1010291, 1048309, 1092333, 1143215, 1201901, 1267490, 1338586, 1415676, 1499565, 1588006, 1676265, 1760455, 1838117, 1906608, 1963954, 2011303, 2052211, 2089523, 2124412, 2157259, 2186869, 2209516, 2221312, 2221506, 2211975, 2194718, 2171833, 2146337, 2119855, 2090105, 2053132, 2007280, 1952786, 1889105, 1815972, 1736425, 1655697, 1577554, 1504070, 1437734, 1380517, 1331559, 1288831, 1252489, 1223778, 1201647, 1183635, 1169252, 1159279, 1152583, 1147106, 1143316, 1143080, 1145633, 1148216, 1150290, 1153622]
56085A153622M931N183N596P563R278R172Q975J0272J1599J1780J2486J4530J5622
56072A280609J4702J4471J6585J8599J8791J9525K2377K4577K3929K2759K3191
56061A500115K3134K0889J8967J9165J8606J5197J2290J3133J5257J5277J4823
56050A686853J6562J8730J8863J8954K1530K4510K5108K5018K6717K8526K8425
56039A939796K8692L1677L4965L5858L6529L9635M3068M4169M4886M7594N0268
56028B377137N0942N2147N5747N8378N7417N6207N7758N8942N6844N5062N7358
56017B993939O0918O2443O4814P0850P6727P8824Q0839Q6645R2569R4588R6473
56006C859629J02560J09220J12097J14953J22391J30814J35823J41260J51332
$$ y = [1153622, 1158553, 1163736, 1169332, 1176895, 1186173, 1195345, 1204320, 1214592, 1226191, 1237971, 1250457, 1264987, 1280609, 1295311, 1309782, 1326367, 1344966, 1363757, 1383282, 1405659, 1430236, 1454165, 1476924, 1500115, 1523249, 1544138, 1563105, 1582270, 1600876, 1616073, 1628363, 1641496, 1656753, 1672030, 1686853, 1703415, 1722145, 1741008, 1759962, 1781492, 1806002, 1831110, 1856128, 1882845, 1911371, 1939796, 1968488, 2000165, 2035130, 2070988, 2107517, 2147152, 2190220, 2234389, 2279275, 2326869, 2377137, 2428079, 2480226, 2535973, 2594351, 2651768, 2707975, 2765733, 2824675, 2881519, 2936581, 2993939, 3054857, 3117300, 3182114, 3252964, 3329691, 3408515, 3489354, 3575999, 3668568, 3763156, 3859629, 3962189, 4071409, 4183506, 4298459, 4420850, 4551664, 4687487, 4828747, 4980079]
55997D980079J61383J66688J72502J84636J98172K06953K15850K31361K48563
55988F766187K60437K71758K90130L11685L29869L49676L78275M10294M38151
55979I806462M67938N08765N55787O00948O50727P15035P88958Q64743R50968
55970A5910331J059403J184888J320334J479110J678862J917306K190486K520620
55962B9261340K937894L451476M070158M833130N784153O934846Q293667R909997
55954G5476661J1846692J4137626J6825658K0012649K3813651K8285888L3382026
55947B23780851L8695667M2904856M3563680L8108649K5761890Q637216r213797
55940D12239012k4046710l3999905l9048882m0090113l8254332l4667785l0309515
$$ y = [4980079, 5141462, 5308150, 5480652, 5665288, 5863460, 6070413, 6286263, 6517624, 6766187, 7026624, 7298382, 7588512, 7900197, 8230066, 8579742, 8958017, 9368311, 9806462, 10274400, 10783165, 11338952, 11939900, 12590627, 13305662, 14094620, 14959363, 15910331, 16969734, 18154622, 19474956, 20954066, 22632928, 24550234, 26740720, 29261340, 32199234, 35650710, 39720868, 44553998, 50338151, 57272997, 65566664, 75476661, 87323353, 101460979, 118286637, 138299286, 162112937, 190398825, 223780851, 262476518, 305381374, 348945054, 387053703, 412815593, 421452809, 412239012, 388192302, 354192397, 315143515, 275053402, 236799070, 202131285, 171821770]
55933A71821770k5860021k1696868j8016723j4906584j2345419j0247487q539080
55926F0209588p170066o075436n180494m440822l838049l342740k916966k546117
55918B4698898k234039j971364j738018j530652j358623j216978j089532r74186
55910A2585506q80320q04739p33463o64325o06053n57773n09903m62805m25023
55901F941102l95130l63563l30408l04015k83963k62125k38824k21689k10018
55892D331367j95767j78802j66318j58220j47407j33686j23605j17212j08263
55883C002087r6912q9345q5367p8905p0471o6878o8572o9020o6695o6304o8009
55872B175609o6675o2361o0816o2699o2418n8486n5284n3754m9795m2908l7398
$$ y = [171821770, 145961749, 124264881, 106248158, 91341574, 78996155, 68748668, 60209588, 53039522, 46964086, 41783592, 37342770, 33504721, 30161981, 27245015, 24698898, 22464859, 20493495, 18755477, 17224825, 15866202, 14649224, 13559692, 12585506, 11705186, 10900447, 10166984, 9502659, 8896606, 8338833, 7828930, 7366125, 6941102, 6545972, 6182409, 5852001, 5547986, 5264023, 5001898, 4763074, 4541385, 4331367, 4135600, 3956798, 3790480, 3632260, 3484853, 3351167, 3227562, 3110350, 3002087, 2905175, 2815830, 2730463, 2651558, 2581087, 2514209, 2445637, 2376617, 2309922, 2243618, 2175609, 2108934, 2046573, 1985757, 1923058, 1860640, 1802154, 1746870, 1693116, 1643321, 1600413, 1563015]
55861A563015l4051k9277k3444k1721k5325k9747l2438l4921l6711l4842l0315
55850A230223k7903k8680k9247k8522k8688k9384k7886k5096k4576k5615k4085
55839I30541k0125j8055j8543j7885j5385j4409j5532j5376j3145j1805j2029
55828G58252j1087q576p224p385o551m877n290p650q614p781q099r827r957q189
55814F47145p524q357p765n356l982m048k819j00J190Q37J971M992O621N979N907
55799F34691P165O917M237J584l35l737q524j1440j1848j2938j5645j6657j4270
55786E59200j1077q996o589l156p42j77L84J349O68j543k008M71L342N492R389
55771E46007J6150K3132K8251L2147L3933K9638J7598J629j3484k6016l5098l8926
$$ y = [1563015, 1528964, 1499687, 1476243, 1454522, 1429197, 1399450, 1367012, 1332091, 1295380, 1260538, 1230223, 1202320, 1173640, 1144393, 1115871, 1087183, 1057799, 1029913, 1004817, 980241, 954626, 930541, 910416, 892361, 873818, 855933, 840548, 826139, 810607, 795231, 782086, 770281, 758252, 747165, 738589, 731365, 723980, 717429, 712552, 707262, 699612, 690998, 683217, 675118, 665291, 655334, 647145, 639621, 631264, 623499, 618143, 614161, 610113, 607294, 607194, 608384, 609221, 611192, 616184, 622805, 628784, 634691, 641856, 648773, 653010, 654594, 654259, 650522, 641998, 630558, 618710, 605772, 590127, 573470, 559200, 548123, 539127, 532538, 529382, 528640, 528463, 528847, 530196, 530864, 529321, 527313, 527784, 531126, 536618, 546007, 562157, 585289, 613540, 645687, 679620, 709258, 726856, 728485, 715001, 688985, 653887, 614961]
55759F14961l7728l4814l2249k8731k3594j9075j6581j4385j1320r127q932q878
55747C69547p599o663p265p752o783n805o066o193n077m224m882n602m888l689
55733B87059l173k579j317o19j231j844j608j617k345k358j234r17k314l436k684
55718B57783j315p52l21N26N61n78r15O24K189K313K359L501M061K381j45j457
55702B70815k000l024l925l788l617m565n589n203l955l095k388j229l59n25q95
55687B26658n43J2K46R11K343L254K791K085K262K708K710K898L581L619K449
55672B57984J297R67N39l62l29J138K117J274J11K33O67O4o89l70J13l99q53J32
55654B63634J540J594O77K03m6j081k354k642k311k639l691m713n633o550o740
$$ y = [614961, 577233, 542419, 510170, 481439, 457845, 438770, 422189, 407804, 396484, 387357, 378425, 369547, 361948, 355285, 348020, 340268, 333485, 327680, 321614, 315421, 310344, 306120, 301238, 295636, 290748, 287059, 283886, 281307, 279990, 279371, 278140, 276296, 274688, 273071, 270726, 268368, 267134, 266217, 263903, 260467, 257783, 256468, 255716, 255395, 255921, 256482, 255904, 254989, 255613, 257802, 260115, 262474, 265975, 270036, 272417, 272272, 270815, 268815, 265791, 261866, 258078, 254461, 249896, 244307, 239104, 235149, 232054, 229666, 228437, 228078, 227553, 226658, 226115, 226127, 226373, 227284, 229627, 232881, 235672, 237757, 240019, 242727, 245437, 248335, 251916, 255535, 257984, 259281, 260248, 260787, 260425, 260096, 261234, 263351, 264625, 264736, 264969, 265636, 265700, 265011, 264641, 264754, 264355, 263502, 263634, 265174, 266768, 267445, 267648, 267602, 266521, 264167, 261525, 259214, 256575, 252884, 248171, 242538, 235988, 229248]
55639B29248n853n005n117n329m629l732l650l668k591r51j51l37o56p77p65m69
55623A85568k05q80k340k997k220j464j757j923q97J25k76j202j083m18o92j744
55607A65595k271k002j516q35J39O72L12j31k0j40j027j553q52j55q19j880j604
55590A51913l17L87J87j44n62j343j726q36O65J534J815K144K187J423O26Q12
55574A58765J501J589J201J136J323J385J821L018M011L757K864K477K392J781
55560A89021R10M77J02r58k301l058l305l502l454l026k889l245l027j645k39
55545A59861J80M19J390K214J858J161J318J614P96n49j049r29j250j779j640
55530A63615j185j266j564j516j809k997l824l067j876j960k630k102q04o44j696
$$ y = [229248, 223395, 218390, 213273, 207944, 203315, 199583, 195933, 192265, 189674, 188723, 188572, 188235, 187579, 186802, 186037, 185568, 185363, 184483, 182143, 179146, 176926, 175462, 173705, 171782, 170885, 171010, 170734, 169532, 168449, 168031, 167339, 165595, 163324, 161322, 159806, 158971, 159110, 159782, 160094, 159963, 159943, 159803, 158776, 157223, 156371, 156216, 155397, 153517, 151913, 151596, 151983, 152170, 152026, 151464, 150121, 148395, 147559, 148224, 149758, 151573, 153717, 155904, 157327, 157953, 158765, 160266, 161855, 163056, 164192, 165515, 166900, 168721, 171739, 175750, 179507, 182371, 184848, 187240, 189021, 189931, 190408, 190510, 189552, 187251, 184193, 180888, 177386, 173932, 170906, 168017, 164772, 161745, 160100, 159861, 160041, 160460, 161850, 164064, 165922, 167083, 168401, 170015, 170811, 170262, 169213, 168284, 167034, 165255, 163615, 162430, 161164, 159600, 158084, 156275, 153278, 149454, 146387, 144511, 142551, 139921, 137819, 137015, 136371, 134675]
55515A34675k231j719j232j134p30q8k3l68k45J25j83r27j061o72n98o49n2P27
55497A23615O15n7j20L33L91L01Q87J542R93l52r80p84p48o29N81K145K156O23
55479A30512m12j1O90Q12P41N99j23j055j139n21l87p59n46J33j77j682k778k519
55461A21378j789j467j260q36m98k80J86O22L85j66q4M27L60j24J13J036J411
55444A19414Q88K94j89j143k163k036q72k3K41Q91J852J830Q30N01J375J987J449
55427A25126P51O53L73n88j202o34L77Q72R35P87J31p94r28j7P54N90J45J69L02
55408A27802%n74j122j552j442m47N49J48j368k170j590q75q66p44J32R97J164
55391A18042J131J274R84M0o16m35k12n66q46m98j63l96n58m3N09K71m56r62j174
$$ y = [134675, 132444, 130725, 129493, 128359, 127629, 127541, 127518, 127150, 126905, 127030, 126847, 125920, 124859, 124187, 123589, 122940, 122888, 123615, 124230, 124173, 124053, 124386, 124777, 125078, 125965, 127507, 128500, 128148, 127168, 126384, 125636, 125007, 125588, 127733, 129889, 130512, 130100, 130089, 130779, 131591, 132332, 132931, 132808, 131753, 130614, 130093, 129706, 128947, 128401, 128534, 128357, 126675, 123897, 121378, 119589, 118122, 116862, 116026, 115528, 115248, 115434, 116056, 116441, 116275, 116191, 116618, 116978, 116854, 116967, 118003, 119414, 120302, 120596, 120407, 119264, 117101, 115065, 114193, 114170, 114411, 115302, 117154, 118984, 119814, 120315, 121690, 123677, 125126, 125877, 126530, 126903, 126315, 125113, 124479, 124856, 125728, 126663, 127450, 127581, 126787, 125859, 125842, 126596, 127186, 127331, 127500, 127802, 127802, 127228, 126106, 124554, 123112, 122665, 123214, 123362, 121994, 119824, 118234, 117359, 116493, 115749, 115881, 116878, 118042, 119173, 120447, 121431, 121471, 120855, 120420, 120208, 119642, 118796, 118298, 118135, 117739, 117181, 117138, 117647, 117918, 117462, 116500, 115326]
55372A15326j218q36o5L98K19j8J84N17O28O20M30k37j008r69q7O53Q00Q66R58
55353A17161M88l66n22J43L70l80j023q06m92p11p30L9P74N98k3l70o64j121j054
55334A11311r0Q80J019P74P26M63l28p99k19O66P78L06Nj67n34p02k50L35M78
55315A14652N95J188J695J294K91l97n88p09q93j009j110j142p75j41J5m59o71
55298A11836j41L32L4m15j75M32O97Q17J261J599J155K87o2K95P93J001P57k4
55280A20479r65j301r64q98j549j957j204J03Q19R28J146J513J491J015M38j55
55264A18939p19q14k29M21N31L89M82N48K14j20O1L55R3m75n49l7M33N05K45k77
55244A19996q56r84m97o1k68o91m83M06J274J568J183K68o82j008o85m86q24j028
$$ y = [115326, 114108, 113272, 113207, 113605, 113824, 113806, 113990, 114507, 115135, 115755, 116185, 115948, 114940, 113971, 113884, 114537, 115337, 116203, 117161, 117649, 117283, 116761, 116904, 117274, 116894, 115871, 115065, 114573, 113862, 113132, 113171, 113945, 114543, 114520, 114150, 113486, 112365, 111311, 111221, 112101, 113120, 113894, 114620, 115083, 114755, 113956, 113737, 114403, 115181, 115487, 115492, 115325, 114791, 114089, 113839, 114174, 114652, 115247, 116435, 118130, 119424, 119715, 119318, 118730, 118021, 117128, 116119, 115009, 113867, 113092, 112951, 112966, 112507, 111836, 111695, 112027, 112061, 111646, 111471, 111903, 112600, 113417, 114678, 116277, 117432, 117719, 117657, 117952, 118745, 119746, 120503, 120479, 119514, 118213, 117249, 116351, 114802, 112845, 111641, 111744, 112563, 113491, 114637, 116150, 117641, 118656, 119094, 118939, 118220, 117406, 117177, 117598, 118129, 118518, 119000, 119548, 119762, 119642, 119703, 120058, 120151, 119676, 119127, 119090, 119523, 120028, 120273, 119996, 119140, 118156, 117659, 117598, 117330, 116639, 116156, 116562, 117836, 119404, 120587, 120855, 120173, 119165, 118480, 117994, 117170, 116142]
55226A16142m07N35O69l09j580k083j330K52J426J167j66j148j011l31J49M04
55210A12379N46M05J55L41P44L73q24j462o35P53J432J399J238R23L80J74N20
55193A18841N62k34r06m56M03L30n30q95l39L93P06O53L68L3Q8O44J007N77k05
55174A21040n52l90p7K94N89L63k74l47N62J375J016Jm83l12o3K61Q85J342J074
55155A26304N18M00N29L06j59n00r53j652j830r76o6j88p52m86L47M06n19j371
55137A19358j608j541j126k6J182J361M94k85l65j45R8N08Q14N15l1J16R48J449
55119A21716J140N85K15k08p61r97p24k84J25O55J187J240O79n2m62k98M65J427
55101A25648J800J237L48r3m2K19O75J090P82l00j026o51o8l54r47o93J29M31
$$ y = [116142, 115735, 116270, 116939, 116630, 115050, 112967, 111637, 111889, 113315, 114482, 114316, 113168, 112157, 111826, 111975, 112379, 112925, 113330, 113485, 113826, 114570, 114943, 114119, 112657, 112022, 112775, 114207, 115606, 116844, 117767, 118147, 118321, 118841, 119403, 119169, 118263, 117807, 118210, 118540, 118010, 117115, 116776, 117169, 117875, 118528, 118896, 118929, 119017, 119661, 120668, 121245, 121040, 120488, 120098, 120021, 120315, 120904, 121267, 120993, 120646, 121208, 122583, 123599, 123600, 123117, 122805, 122742, 123003, 123888, 125230, 126304, 126822, 127222, 127751, 128057, 127898, 127398, 126445, 124793, 122963, 121987, 121921, 121733, 120981, 120495, 120842, 121248, 120729, 119358, 117750, 116209, 115083, 115057, 116239, 117600, 118094, 117809, 117444, 117299, 117397, 117905, 118719, 119234, 119203, 119319, 120267, 121716, 122856, 123441, 123656, 123448, 122687, 121690, 120966, 120682, 120807, 121462, 122649, 123889, 124568, 124516, 124054, 123756, 124221, 125648, 127448, 128685, 129033, 128940, 128898, 129117, 129792, 130882, 131664, 131364, 130338, 129687, 129619, 129265, 128318, 127625, 127754, 128185]
55083A28185L46Q37J721J892J300R37R22M44l53k75P79J379P42j60k62J84M88
55066A39106N76N47J59o15j312j607j565j114j60P50Q54L01j23l67j022j876j911
55049A30621r94k62l68o42m50k19m48p59o22j74K16N51Q65Q99N90K80J32r3m56
55030A28667o49n68m73m63l62k12k12j94J40N16L97q7l27k44k05o9O19J495J535
55011A29304N64m83r63j204j517j579j112l41M88J331J877J690R65M19L33M20
54995A30192O02J002J249P92n6l79K7N32Q18J050J041M10l27j41Q30J252N52l23
54977A39123m49j24k7k19m15m48j94K62L66j63n23J62J253J411P70O66J253J300
54959A44004N33J68N38K85j120k006j051M69N63o13j360r80k06L56P74J088J139
$$ y = [128185, 128531, 129368, 131089, 132981, 134281, 135218, 136140, 136584, 136231, 135956, 136735, 138114, 138856, 138696, 138434, 138618, 139106, 139682, 140229, 140388, 139773, 138461, 136854, 135289, 134175, 134015, 134765, 135619, 135920, 135797, 135430, 134408, 132532, 130621, 129627, 129365, 128997, 128355, 127905, 127686, 127238, 126479, 125857, 125683, 125899, 126450, 127315, 128214, 128804, 129084, 129216, 129123, 128667, 128018, 127450, 126977, 126514, 126152, 125940, 125728, 125534, 125674, 126190, 126587, 126500, 126173, 125929, 125724, 125655, 126274, 127769, 129304, 129868, 129385, 128422, 127218, 125701, 124122, 123010, 122669, 123157, 124488, 126365, 128055, 129020, 129439, 129772, 130192, 130794, 131796, 133045, 133837, 133781, 133402, 133429, 133961, 134779, 135829, 136870, 137280, 136953, 136812, 137642, 138894, 139446, 139123, 138674, 138550, 138523, 138304, 137889, 137441, 137247, 137509, 137875, 137712, 137189, 137351, 138604, 140015, 140785, 141451, 142704, 144004, 144537, 144705, 145243, 145528, 144408, 142402, 141351, 141820, 142383, 141770, 140410, 139430, 139224, 139580, 140354, 141442, 142581]
54942A42581Q93L34o12j471j272J52J574J777R86L06L85J184K418L543L903L526
54926A60207L154L137L050K905L661N801Q275R739J0054R747Q776O783M024J151
54912B40464j523l860n538o504p245p949q001p028n814n402n736n919n430m431
54898A60084l260k215j505r48j34Q07J148O63J52L86J167J865K317K700L107L658
54882A69992M432N063N122N102O003P673Q689Q429P921P934P489N336J842j673
54868B49354m598o878q134q211p999q373q874q443p111n790m832l908l020k592
54854A60591k611k630k450k187j842j443j277j394j313p96l39l65m93l19j84m40
54838A40508o74n63p15j628k549k465j626q69m6J412K794K628Q80p33r31j50N48
$$ y = [142581, 143474, 143808, 143196, 141725, 140453, 140605, 142179, 143956, 144942, 145248, 145633, 146817, 149235, 152778, 156681, 160207, 163361, 166498, 169548, 172453, 176114, 181915, 190190, 199929, 209983, 219730, 228506, 235289, 239313, 240464, 238941, 235081, 229543, 223039, 215794, 207845, 199844, 192816, 187002, 181600, 175864, 169945, 164515, 160084, 156824, 154609, 153104, 152156, 152022, 152829, 153977, 154640, 154792, 155178, 156345, 158210, 160527, 163227, 166334, 169992, 174424, 179487, 184609, 189711, 195714, 203387, 212076, 220505, 228426, 236360, 243849, 249185, 251027, 249354, 244756, 237878, 229744, 221533, 213534, 205161, 196287, 187844, 180733, 174943, 170111, 166203, 163183, 160591, 157980, 155350, 152900, 150713, 148871, 147428, 146151, 144757, 143444, 142648, 142309, 141944, 141451, 141132, 140948, 140508, 139834, 139271, 138556, 136928, 134379, 131914, 130288, 129419, 129373, 130785, 133579, 136207, 137087, 136354, 135423, 135273, 135821]
54821A35821P64N92J07m63o75l80P7L80N43O54O72N91M99M61N20O58O72L54m0
54802A41807P1P39J285J231Q86N62Pq52j329q86l0L89K84L9k39m49r4R62J851
54783A46234J724R84O17P86J025J270J654J752J187P00J394L028M269M597M919
54768A76140O057P657Q792Q996Q420P612P084O773N950M163J931n1j940m188o413
54753B36983p788q301q577q584p670n939m511m116m238m013l254k331j581j144
54739A64936r67q07m92j66m5k6P3J76K26N45J418K581L612M538N561O481P032
54722A94676P435P995Q414Q089O890N073K725p0k796m887o293p203p595p548p500
54707A97405p548p094n845m581m077l896l226k318j977k107j996j689j819k307
$$ y = [135821, 136585, 137177, 137284, 136821, 136146, 135766, 135843, 136223, 136766, 137420, 138092, 138683, 139182, 139643, 140163, 140821, 141493, 141847, 141807, 141878, 142617, 143902, 145133, 146019, 146581, 146588, 145736, 144407, 143521, 143491, 143880, 144164, 144203, 143964, 143515, 143421, 144383, 146234, 147958, 148942, 149559, 150345, 151370, 152640, 154294, 156046, 157233, 157933, 159327, 162355, 166624, 171221, 176140, 182197, 189854, 198646, 207642, 216062, 223674, 230758, 237531, 243481, 247644, 249575, 249524, 247584, 243396, 236983, 229195, 220894, 212317, 203733, 196063, 190124, 185613, 181497, 177259, 173246, 169992, 167661, 166080, 164936, 163969, 163162, 162670, 162504, 162459, 162433, 162506, 162682, 162908, 163453, 164871, 167452, 171064, 175602, 181163, 187644, 194676, 202111, 210106, 218520, 226609, 233499, 238572, 241297, 241227, 238431, 233544, 227251, 220048, 212453, 204905, 197405, 189857, 182763, 176918, 172337, 168260, 164364, 161138, 158820, 156843, 154736, 152740, 151051, 149232, 146925]
54693A46925k416k056j820j797j482q43l68n0N62J245J199M19r3K30Q08Q61K72
54676A41596o62j557j857j241j90M96P26R66J220J055N07L1l88j085j776j789
54660A36052j189o61k84L84J046P75m08j246r09J40J141J891K205J718O59j05
54644A41209k17j95l56l18Q4L60K55J99M56O62N60M21L34K9l51j78N02P46J02
54625A44304p23j050j111j219j055n01k58p51j253r17p6M12N07P97J323J569J370
54608A41368J066Q37N14M5l12l42r3K02K67k8m73p06o17l96j71R1L73N88P40P25
54588A43678K34p32j413j052Q6J052J391J268O95l42j153q81J59P27M74L59R79
54571A45529J584J326M71j86l56j71K18M69J61n06q01n13k42l34l60k3L11L35
$$ y = [146925, 144509, 142453, 140633, 138836, 137354, 136511, 136143, 136093, 136655, 137900, 139099, 139518, 139425, 139655, 140463, 141324, 141596, 140934, 139377, 137520, 136279, 136089, 136585, 137311, 138277, 139497, 140552, 141059, 141090, 140702, 139617, 137841, 136052, 134863, 134202, 133918, 134302, 135348, 136123, 135715, 134469, 133560, 133700, 134841, 136732, 138937, 140655, 141314, 141209, 140992, 140797, 140441, 140123, 140207, 140567, 140822, 141021, 141477, 142139, 142699, 143120, 143454, 143483, 143132, 142954, 143456, 144202, 144304, 143581, 142531, 141420, 140201, 139146, 138645, 138387, 137636, 136383, 135466, 135390, 135802, 136309, 137106, 138429, 139998, 141368, 142434, 143271, 143785, 143830, 143518, 143176, 143083, 143285, 143552, 143524, 143051, 142345, 141728, 141332, 141161, 141252, 141625, 142213, 142953, 143678, 143912, 143180, 141767, 140715, 140801, 141853, 143244, 144512, 145207, 144865, 143712, 142831, 142990, 143717, 144191, 144550, 145529, 147113, 148439, 148910, 148724, 148368, 148197, 148415, 148884, 149045, 148539, 147738, 147225, 146983, 146649, 146289, 146266, 146577, 146912]
54553A46912K47J07l02o26l0J366K176J578L94l05n98q39n20P50J953J745L45
54536A54353p80q72m02O6M59O46L08m58j042j041o85m89p09j071r83k50M25K17
54518A47692n30n92L62J203R97K84J5J33P9k9K30N89M41j21m84m36j73K85Q60
54499A50805J004L77m09n49k73l96q89r37l43J31pk83j12L06L75n9n17l88M76
54480A48312J589K196K001J357P56M12M75J111K016K353J758R52Q75J426J707
54465A69296J295O69L92M18K89l55j396k247k341j729j041p17o30n50n47p19r47
54448A59140j161j401j446r57j38L59M46O96J111Q30m01j455j346o37l19j47O61
54431A53835J717J848R39P6j28r4j77j24J12Q6l12n73m11j28O3L46O83O24P9l35
$$ y = [146912, 147159, 147266, 146964, 146338, 146308, 147674, 149850, 151428, 151822, 151517, 150919, 150080, 149560, 150310, 152263, 154008, 154353, 153573, 152701, 152299, 152365, 152824, 153470, 153778, 153320, 152278, 151237, 150552, 150063, 149354, 148283, 147300, 147050, 147475, 147692, 147162, 146570, 146932, 148135, 149132, 149416, 149431, 149564, 149643, 149614, 149844, 150433, 150874, 150753, 150269, 149833, 149660, 149945, 150805, 151809, 152186, 151777, 151228, 150955, 150559, 149670, 148733, 148390, 148521, 148514, 148231, 148119, 148425, 148800, 148741, 148224, 147836, 148312, 149901, 152097, 154098, 155455, 156211, 156623, 157098, 158209, 160225, 162578, 164336, 165288, 166163, 167589, 169296, 170591, 171260, 171652, 172070, 172359, 172004, 170608, 168361, 166020, 164291, 163250, 162533, 161903, 161353, 160806, 160087, 159140, 157979, 156578, 155132, 154175, 154037, 154396, 154842, 155538, 156649, 157479, 157078, 155623, 154277, 153640, 153321, 153174, 153835, 155552, 157400, 158339, 158415, 158287, 158193, 158016, 157892, 158004, 158090, 157778, 157205, 156794, 156666, 156729, 157075, 157758, 158382, 158461, 158126]
54411A58126j59K47K86Kn8M19J172J657J504Q53L05L41Q10J197J283J233J134
54394A70352Q59M73L22N60Q63Q59N88L67L30K24k50j011j554j452p75M7O75R60
54376A72437P80K16j68J63R71J493J542J709K304K825K874K894L426M201M563
54361B02230M326L674K677J479N50R8m21j568k967l716l507k801k085j610j568
54346A94791k008k611k972k949k476j447k16L65m4o63o16r7J52Q6J21J37l62j199
54328A77992j639j476j155q24j66P13J124P38K0m70o46n68j95K80M02Mn11p03
54310A72920n42k48P6M36Q04J030Q66K09n69q75o96p02j231j642j190j58N80P76
54292A69844Q14P74K87o13j271j138l07P35J421J308M65m16p26o49o83p34k82
$$ y = [158126, 157967, 158214, 158500, 158502, 158444, 158863, 160035, 161692, 163196, 164049, 164354, 164695, 165505, 166702, 167985, 169218, 170352, 171211, 171684, 172006, 172566, 173429, 174288, 174876, 175243, 175573, 175797, 175547, 174536, 172982, 171530, 170755, 170802, 171477, 172437, 173217, 173433, 173265, 173428, 174399, 175892, 177434, 179143, 181447, 184272, 187146, 190040, 193466, 197667, 202230, 206556, 210230, 212907, 214386, 214936, 215034, 214613, 213045, 210078, 206362, 202855, 200054, 197969, 196359, 194791, 192783, 190172, 187200, 184251, 181775, 180328, 180112, 180477, 180433, 179770, 179154, 179057, 179209, 179295, 179416, 179553, 179191, 177992, 176353, 174877, 173722, 172898, 172732, 173445, 174569, 175307, 175327, 174857, 174211, 173643, 173448, 173728, 174130, 174134, 173623, 172920, 172378, 172130, 172206, 172642, 173446, 174476, 175342, 175551, 174982, 174107, 173411, 172709, 171478, 169836, 168646, 168488, 169068, 169844, 170658, 171432, 171719, 171106, 169835, 168697, 168390, 169125, 170546, 171854, 172319, 171903, 171177, 170528, 169845, 169111, 168829]
54275A68829O67J464J628J251O34N2j74O1L61K94M4J33O96J435K128K564K321
54258A84388J249P2k40L87J151J443J242O90j6m14k01J80Q3l88o54p39j190k008
54240A85035k512k357j824j099j17P51Q13R2n10l63K25P28J000R98O52K70L85
54223A82167R00J020M19k41k96L7J71j8l03o52j123j502j455r85m56k62m65p06
54205A76250n41m3J71k24p30p61n34o28r78j036p20m29k56K8L04K46J08M58J124
54186A71809J286P26J14o4K3K53Q00J475J710J528J589J935J652L05j130j460
54170A82551p72r0l8l79n72k66N21J301J412O70l87j031r56m31p0l18r21j168
54152A79056r31q90j270j095K92J701J488M3o26K60J460J816J545J096L42n04
$$ y = [168829, 169496, 170960, 172588, 173839, 174473, 174525, 174351, 174412, 174773, 175067, 175111, 175244, 175940, 177375, 179503, 182067, 184388, 185637, 185709, 185469, 185856, 187007, 188450, 189692, 190382, 190366, 189952, 189751, 189931, 190014, 189626, 188972, 188233, 187043, 185035, 182523, 180166, 178342, 177243, 177126, 177877, 178690, 178782, 178272, 177909, 178134, 178862, 179862, 180860, 181512, 181782, 182167, 183067, 184087, 184506, 184265, 183969, 184006, 184177, 184159, 183856, 183204, 182081, 180579, 179124, 178139, 177683, 177421, 176956, 176250, 175709, 175666, 175837, 175613, 174883, 174122, 173588, 172960, 171982, 170946, 170226, 169797, 169541, 169569, 169873, 170119, 170227, 170685, 171809, 173095, 173821, 173935, 173871, 173894, 174147, 174947, 176422, 178132, 179660, 181249, 183184, 184836, 185141, 184011, 182551, 181779, 181689, 181651, 181272, 180700, 180434, 180955, 182256, 183668, 184338, 183951, 182920, 181964, 181533, 181463, 181145, 180224, 179056, 178125, 177235, 175965, 174870, 175162, 176863, 178351, 178394, 177768, 178028, 179488, 181304, 182849, 183945, 184287, 183783]
54136A83783o49j01J00l66m80K67Q14L39l18j19M67N43M14Q49J520J577J098O96
54118A90434L48j78l59M13J682K609L251M018M434L836K796K473K851K942K499
54103B24049K066J535J77j726k852k732k474l083m150m644m165k897j237J36M43
54088A98446l33j249j436r17k12L69P35Q39Q04R30J349J881K317K531K314J551
54072B09919O08J64M81J122J474J309Q22M30M76R24J359J489J439J317R02J68
54056B24403k00M63J706K329J839R65N94Q08J134J303J495K073L201M601N675
54041B52389O107O217O489O920P229P501Q118R097R962J0325J0184R712R064Q400
54027C67714P732O863N729M709M109L594K637J417O90P36J012Q88K31q40k198
$$ y = [183783, 183134, 183033, 183133, 182767, 182287, 182554, 183368, 183707, 183389, 183270, 183737, 184280, 184694, 185543, 187063, 188640, 189738, 190434, 190782, 190604, 190245, 190658, 192340, 194949, 198200, 202218, 206652, 210488, 213284, 215757, 218608, 221550, 224049, 226115, 227650, 227827, 226101, 223249, 220517, 218043, 214960, 210810, 206166, 202001, 199104, 197867, 198003, 198446, 198113, 196864, 195428, 194511, 194299, 194668, 195403, 196242, 197046, 197976, 199325, 201206, 203523, 206054, 208368, 209919, 210527, 210691, 211172, 212294, 213768, 215077, 215899, 216329, 216805, 217729, 219088, 220577, 222016, 223333, 224235, 224403, 224203, 224666, 226372, 228701, 230540, 231505, 232099, 232907, 234041, 235344, 236839, 238912, 242113, 246714, 252389, 258496, 264713, 271202, 278122, 285351, 292852, 300970, 310067, 320029, 330354, 340538, 350250, 359314, 367714, 375446, 382309, 388038, 392747, 396856, 400450, 403087, 404504, 405194, 405930, 406942, 407830, 408061, 407221, 405023]
54012D05023l549m498n035n605o491p417p980q153q173q083p653o705n469m580
53998C15632m553n150n466m897l799k979k718k722k759k808k689k191j632j717
53984B69552k588l440l370k334r99K3N42O15M04K88Q26K371M637O743P891P916
53968B89077P094N512L069J21k423l978m787n260n232m391l085k005j274m84L83
53953B72337Q02N29L1j36J01N95J412K653M041M969M996M220L267K867L288M195
53937C10167N124N901O548O977P109P094P117P073O802O450O294O300O194N979
53923D01129N961O334P016P835Q620R140R310R410R802J0413J0819J0766J0405
53910E16960J0060R994J0214J0221R190O849L989J630j53j950l713m593m261l636
$$ y = [405023, 401474, 396976, 391941, 386336, 379845, 372428, 364448, 356295, 348122, 340039, 332386, 325681, 320212, 315632, 311079, 305929, 300463, 295566, 291767, 288788, 286070, 283348, 280589, 277781, 275092, 272901, 271269, 269552, 266964, 263524, 260154, 257820, 256821, 256844, 257386, 258001, 258405, 258693, 259519, 261890, 266527, 273270, 281161, 289077, 296171, 301683, 304752, 304873, 302450, 298472, 293685, 288425, 283193, 278802, 275717, 273712, 272438, 271954, 272337, 273139, 273668, 273699, 273563, 273664, 274259, 275671, 278324, 282365, 287334, 292330, 296550, 299817, 302684, 305972, 310167, 315291, 321192, 327740, 334717, 341826, 348920, 356037, 363110, 369912, 376362, 382656, 388956, 395150, 401129, 407090, 413424, 420440, 428275, 436895, 446035, 455345, 464755, 474557, 484970, 495789, 506555, 516960, 527020, 537014, 547228, 557449, 566639, 573488, 577477, 579107, 578954, 577004, 573291, 568698, 564437, 560801]
53896E60801l788m622n266n427n769o975q905j0866j2301j3027j3056j2598j2181
53883D46020j2313j2793j2708j1526r915q893q330p158n166l638l698m824n722
53870C39336n946n797n243m170l348l845n340o252n831n044m846m734l750k196
53856B72994j284j530k351l029l238k785j676n61l16r28j441j278j041j504k308
53841B47724k404j565o70l82k82K34Q62Q45J69m59o85q23r96p28J89J122J371
53824B43522J108J052J466J990K237K073J520Q05M29P59J554K252K682L171L965
53809B70585M868N449N463N060M785N150O116P073P549P681P815P991Q086Q158
53795C61829Q250Q133P582O757N873M840L617K660K400K462K002P73o75j823k705
$$ y = [560801, 557013, 552391, 547125, 541698, 535929, 528954, 520049, 509183, 496882, 483855, 470799, 458201, 446020, 433707, 420914, 408206, 396680, 386765, 377872, 369542, 362384, 357218, 353580, 349882, 345058, 339336, 333390, 327593, 322350, 318180, 314832, 310987, 305647, 299395, 293564, 288520, 283674, 278940, 275190, 272994, 271710, 270180, 267829, 264800, 261562, 258777, 257101, 256540, 256224, 255296, 253855, 252577, 251536, 250032, 247724, 245320, 243755, 243085, 242703, 242421, 242655, 243517, 244362, 244531, 244072, 243387, 242564, 241568, 240840, 241029, 242151, 243522, 244630, 245682, 247148, 249138, 251375, 253448, 254968, 255773, 256202, 256961, 258515, 260767, 263449, 266620, 270585, 275453, 280902, 286365, 291425, 296210, 301360, 307476, 314549, 322098, 329779, 337594, 345585, 353671, 361829, 370079, 378212, 385794, 392551, 398424, 403264, 406881, 409541, 411941, 414403, 416405, 417178, 416503, 414680, 411975]
53780D11975l563m500n545o656p579q073q239q351q366q020p382o877o727o663
53766C15434o282n399m186l139k772l036l239k962k704l147m039m477m183l708
53752B62161l426l106k595k143j847j432r09p67j136j393j012l57m1o1o1j42o33
53735B41100j273j340o85mJ20p9j24r6k94m15J74J281J808J157K04J71J017J663
53717B44385J555J137Q16M78J61K60P23Q65M71K14N41R76J168J616K549L024K290
53700B63229J326J678L180M242M159L770L810L930L662L163K626J872Q90Q3l33
53685C01287n17m73n0M41M03q2k78M5K62k1l61k87O8M05O52O86L29n7K15J028
53665C03695J338O00m34q36o88n84o02m35k3M76J086J807K314K265J660P49j39
$$ y = [411975, 408412, 403912, 398367, 391711, 384132, 376059, 367820, 359469, 351103, 343083, 335701, 328824, 322097, 315434, 309152, 303753, 299567, 296428, 293656, 290620, 287381, 284419, 281715, 278568, 274529, 270052, 265869, 262161, 258735, 255629, 253034, 250891, 249044, 247612, 246703, 245936, 244800, 243407, 242395, 242038, 241997, 241936, 241875, 241733, 241100, 239827, 238487, 237802, 237798, 237918, 237839, 237715, 237619, 237325, 236910, 237084, 238365, 240173, 241330, 241534, 241705, 242722, 244385, 245940, 247077, 247893, 248371, 248532, 248792, 249515, 250380, 250851, 251065, 251606, 252582, 253750, 255366, 257915, 260939, 263229, 264555, 266233, 269413, 273655, 277814, 281584, 285394, 289324, 292986, 296149, 298775, 300647, 301537, 301620, 301287, 300770, 300297, 300247, 300688, 301091, 301009, 300731, 300776, 301038, 301017, 300656, 300369, 300437, 300842, 301494, 302180, 302509, 302452, 302667, 303695, 305033, 305633, 305199, 304363, 303675, 303091, 302489, 302054, 302031, 302507, 303593, 305400, 307714, 309979, 311639, 312388, 312249]
53648C12249n11o0P54J016N28L9J37N72R68J409J860J830J247R56J540K287K181
53631C29002J476J288J861K262J860J228J205J725K019J739J389J627K356K761
53617C53798K315J437R72J215J825K434K891L050K983L215M070M819M357K823
53603C92204J608J506J842J879K009K811L756L803K798J451K94n37q14l79K88
53588D14519M27j74j134k100k897l259k980k274j529r07n17p00j534k264j925
53573C90752o14M59L42o71j541j616j096n92m74o19p04n76l06K2L35N17N77Q13
53555C85008J412J986J972J466J096J018O92j04p76p73l67q5J83Q85J982K897
53539C98492L181K866K386K334L023M022M508M290M092M535N327N837O002O190
$$ y = [312249, 311738, 311678, 312432, 313448, 313976, 314015, 314152, 314724, 315692, 317101, 318961, 320791, 322038, 322994, 324534, 326821, 329002, 330478, 331766, 333627, 335889, 337749, 338977, 340182, 341907, 343926, 345665, 347054, 348681, 351037, 353798, 356113, 357550, 358522, 359737, 361562, 363996, 366887, 369937, 372920, 376135, 380205, 385024, 389381, 392204, 393812, 395318, 397160, 399039, 401048, 403859, 407615, 411418, 414216, 415667, 415961, 415424, 414610, 414231, 414519, 414946, 414772, 413638, 411538, 408641, 405382, 402402, 400128, 398599, 397692, 397175, 396475, 394941, 392677, 390752, 390138, 390597, 390939, 390268, 388727, 387111, 386015, 385423, 384949, 384330, 383626, 383050, 382744, 382766, 383101, 383618, 384195, 385008, 386420, 388406, 390378, 391844, 392940, 393958, 394650, 394546, 393770, 392997, 392630, 392545, 392728, 393613, 395595, 398492, 401673, 404539, 406925, 409259, 412282, 416304, 420812, 425102, 429194, 433729, 439056, 444893, 450895, 457085]
53525D57085O585P166Q043R245J0336J0697J0218R493R374J0341J2095J3707J4498
53512E88883J4841J5632J7096J8592J9653K0478K1272K1827K2048K2207K2288
53501H04817K1846K0878K0113J9951J9772J8892J7574J6539J6028J5906J6152
53490A008468J6662J7021J6989J6847J6839J6829J6762J6849J6975J6665J6080
53479A192986J6097J6923J7556J7262J6572J6088J5327J3749J1906J0398Q623
53468A353487N835K754O55n98k195m483o762q641j0216j1196j1238j0998j1456
53455A284948j2345j2573j2151j2306j3466j4636j5038j5119j5454j5782j5676
53444A130402j5286j4933j4680j4582j4733j4773j4014j2263r954p444m874k692
$$ y = [457085, 463670, 470836, 478879, 488124, 498460, 509157, 519375, 528868, 538242, 548583, 560678, 574385, 588883, 603724, 619356, 636452, 655044, 674697, 695175, 716447, 738274, 760322, 782529, 804817, 826663, 847541, 867654, 887605, 907377, 926269, 943843, 960382, 976410, 992316, 1008468, 1025130, 1042151, 1059140, 1075987, 1092826, 1109655, 1126417, 1143266, 1160241, 1176906, 1192986, 1209083, 1226006, 1243562, 1260824, 1277396, 1293484, 1308811, 1322560, 1334466, 1344864, 1353487, 1359322, 1362076, 1362731, 1362133, 1359938, 1355455, 1348693, 1340052, 1329836, 1318640, 1307402, 1296404, 1284948, 1272603, 1260030, 1247879, 1235573, 1222107, 1207471, 1192433, 1177314, 1161860, 1146078, 1130402, 1115116, 1100183, 1085503, 1070921, 1056188, 1041415, 1027401, 1015138, 1005184, 997740, 992866, 990174]
53432I90174j470j090q72n12j59L36J362K647L452L707M136N073O118P054Q178
53417A028134R562J0893J2223J3926J5812J7244J8317J9802K1695K2988K3246
53406A213842K3271K3763K4448K5137K6487K8850L1307L2809L3565L4513L6025
53395A534017L7870L9942M2182M4185M5598M6552M7267M7577M7412M7254M7604
53384B027460M8284M8717M8516M7406M5120M1908L8717L6315L4555L2784L0576
53373B480358K7714K4008J9630J5202J1078O977K652j624n761j0338j5757k1422
53361B532717k6474l0894l5108l8851m1377m2636m3361m3940m3941m3017m1629
53350B101489m0527l9830l8982l7500l5529l3633l2248l1414l1053l1263l2045
$$ y = [990174, 988704, 987614, 986742, 986230, 986071, 986407, 987769, 990416, 993868, 997575, 1001711, 1006784, 1012902, 1019956, 1028134, 1037696, 1048589, 1060812, 1074738, 1090550, 1107794, 1126111, 1145913, 1167608, 1190596, 1213842, 1237113, 1260876, 1285324, 1310461, 1336948, 1365798, 1397105, 1429914, 1463479, 1497992, 1534017, 1571887, 1611829, 1654011, 1698196, 1743794, 1790346, 1837613, 1885190, 1932602, 1979856, 2027460, 2075744, 2124461, 2172977, 2220383, 2265503, 2307411, 2346128, 2382443, 2416998, 2449782, 2480358, 2508072, 2532080, 2551710, 2566912, 2577990, 2584967, 2587619, 2585995, 2580234, 2569896, 2554139, 2532717, 2506243, 2475349, 2440241, 2401390, 2360013, 2317377, 2274016, 2230076, 2186135, 2143118, 2101489, 2060962, 2021132, 1982150, 1944650, 1909121, 1875488, 1843240, 1811826, 1780773, 1749510, 1717465]
53339A717465l2933l3194l2501l1112k9378k7366k4986k2302j9665j7675j6801
53328A429552j6664j6028j4054j1435r703r551j0470j1897j3788j5846j7186j7209
53316A265721j6281j5154j4246j3680j3454j3225j2425j0913r066p146n154l380
53304A131597k314j774r52L93J591K283L126M729O743Q642J0569J2706J4530J5616
53290A207485J6550J8137K0057K1261K1402K1073K0746K0310J9579J8607J7468
53279A422675J6213J4963J3682J1985R592O733L792Q15k204m894o807p976q805
53266A469764r700j1053j3225j6058j8744k0627k1764k2378k2364k1849k1692
53255A270310k2587k3987k4690k4267k3333k2519k1915k1378k0842k0339k0073
$$ y = [1717465, 1684532, 1651338, 1618837, 1587725, 1558347, 1530981, 1505995, 1483693, 1464028, 1446353, 1429552, 1412888, 1396860, 1382806, 1371371, 1361668, 1352117, 1341647, 1329750, 1315962, 1300116, 1282930, 1265721, 1249440, 1234286, 1220040, 1206360, 1192906, 1179681, 1167256, 1156343, 1147277, 1140131, 1134977, 1131597, 1129283, 1127509, 1126557, 1126950, 1128541, 1130824, 1133950, 1138679, 1145422, 1154064, 1164633, 1177339, 1191869, 1207485, 1224035, 1242172, 1262229, 1283490, 1304892, 1325965, 1346711, 1367021, 1386600, 1405207, 1422675, 1438888, 1453851, 1467533, 1479518, 1489110, 1495843, 1499635, 1500450, 1498246, 1493352, 1486545, 1478569, 1469764, 1460064, 1449011, 1435786, 1419728, 1400984, 1380357, 1358593, 1336215, 1313851, 1292002, 1270310, 1247723, 1223736, 1199046, 1174779, 1151446, 1128927, 1107012, 1085634, 1064792, 1044453, 1024380]
53244A024380k0333k0967k1202k0491j9228j8238j7808j7737j7835j7836j7278
53233H15427j6063j4823j4033j3276j2026j0678r806q979p509n996n790o869p724
53220F81855p618p617q767j0469j1553j2061j2943j4470j5937j6673j6593j5801
53208E31353j4383j2627j0967r557q216o974o346o821q182r504r935r481q898
53195D09462q801r037q959q237p152o285o042o383o804o710n963n006m318m015
53181C15750m083m579n197n043l580j625p57j488k662k926k277j738j831k034
53167B75930j686r06k87mK89O65N69l94j650k156j630p58j92O9J87K0m73q86q94
53148B65813p68r68j476j895j899j341k53Q86J279O71k19n75m42l78m73l58P5
$$ y = [1024380, 1004047, 983080, 961878, 941387, 922159, 903921, 886113, 868376, 850541, 832705, 815427, 799364, 784541, 770508, 757232, 745206, 734528, 724722, 715743, 708234, 702238, 696448, 689579, 681855, 674237, 666620, 657853, 647384, 635831, 623770, 610827, 596357, 580420, 563747, 547154, 531353, 516970, 504343, 493376, 483819, 475603, 468629, 462283, 455462, 447280, 437776, 427841, 418360, 409462, 400661, 391624, 382665, 374428, 367276, 360991, 354949, 348566, 341762, 335052, 329089, 324083, 319765, 315750, 311667, 307088, 301891, 296848, 293268, 291643, 290886, 289398, 286736, 283810, 281533, 279795, 277964, 275930, 274244, 273338, 273051, 273047, 273336, 274001, 274570, 274176, 272526, 270370, 268740, 267982, 267790, 267859, 268046, 268066, 267593, 266707, 265813, 265045, 264077, 262601, 260706, 258807, 257466, 257213, 258099, 259378, 260049, 259830, 259255, 258813, 258435, 257962, 257604, 257679]
53131B57679N57R43J320J678J911K002J897J438Q35Q29J841L139L495K596J229
53116B83389K52j09m5J96M18O49J045J388J005k94j657k187k117k243k594k569
53100B74527k119j759j482q47o8N8m72p76n75o82j464k091j935j672k051k507
53084B54085k044q89j01Jl6l9l75r27r93m68j28l54m35K50J050Q70k05r84q30
53065B47448m07n16r35r42n25l23n67q33q45q44q88n11M74J408J590J321J423
53048B45528K010K363J986J213O17L27N7m54j140j567j287m03M01O38N16L87J00
53031B51292n65j169j076m27O9K27M71Q54R11O50P43J396J793J222J06o50q43
53014B55004q97r41o50J32J060J650J635J086M02J16M62J142J621J615J226P84
$$ y = [257679, 258236, 259179, 260499, 262177, 264088, 266090, 267987, 269425, 270260, 271089, 272930, 276069, 279564, 282160, 283389, 283641, 283532, 283487, 283683, 284101, 284750, 285795, 287183, 288188, 287894, 286237, 284050, 281933, 279690, 277096, 274527, 272408, 270649, 269167, 268320, 268252, 268310, 267838, 267062, 266487, 265805, 264341, 262250, 260315, 258643, 256592, 254085, 252041, 251152, 251051, 251052, 251016, 250977, 250602, 249675, 248682, 248214, 248086, 247732, 247297, 247547, 248597, 249467, 249262, 248278, 247448, 247041, 246525, 245590, 244648, 244123, 243800, 243233, 242400, 241555, 240711, 239823, 239312, 239786, 241194, 242784, 244105, 245528, 247538, 249901, 251887, 253100, 253717, 254044, 254101, 253647, 252507, 250940, 249653, 249250, 249651, 250289, 250805, 251192, 251292, 250727, 249558, 248482, 248055, 248124, 248351, 248822, 249676, 250587, 251237, 251980, 253376, 255169, 256391, 256497, 255847, 255004, 254107, 253166, 252516, 252648, 253708, 255358, 256993, 258079, 258481, 258597, 259059, 260201, 261822, 263437, 264663, 265447]
52998B65447N91O90P92N43r7q48j416j609j278m76M07R51J143J277J464J564J557
52981B70702J557J573J541J562J658J468P06j84m54j35L5k13k99J59P10Q11N79
52964B81776L87L09L54O80J124J061K29p28j095r77q56p82n88n35r86j648j861
52947B75864j538j169r91p21j91L18N07L87J19j69l25j99J87O55R84Q96J80q61
52929B73933j348p41L69Q16K65n06o70k41K49M83N10M86N55P08O78J87n84j063
52911B74086j021q61r33r14k88P38J328J024K35l65n91p15r62j306j543j393p00
52894B65819L11J087J292J162J067R54N67P1p2J72L00M8k09q5K28L23J49pJ06
52875B73283O51J641K641K953K489K074K347K833K713K174K117K626K712J685
$$ y = [265447, 266038, 266728, 267520, 268063, 267966, 267118, 265702, 264093, 262815, 262339, 262746, 263697, 264840, 266117, 267581, 269145, 270702, 272259, 273832, 275373, 276935, 278593, 280061, 280767, 280583, 280129, 279994, 280029, 279816, 279517, 279676, 280386, 281197, 281776, 282163, 282472, 282826, 283506, 284630, 285691, 285920, 285192, 284097, 283120, 282264, 281482, 280894, 280359, 279373, 277725, 275864, 274326, 273157, 272166, 271445, 271254, 271572, 272079, 272466, 272585, 272416, 272091, 271892, 272079, 272734, 273718, 274614, 274794, 273933, 272585, 271844, 272213, 273029, 273294, 272788, 272118, 271877, 272126, 272609, 273119, 273605, 274160, 274868, 275546, 275733, 275149, 274086, 273065, 272204, 271271, 270357, 270069, 270807, 272135, 273159, 273394, 273029, 272438, 271723, 270761, 269455, 267912, 266519, 265819, 266130, 267217, 268509, 269671, 270738, 271692, 272259, 272330, 272258, 272430, 272730, 272778, 272569, 272484, 272712, 273035, 273184, 273177, 273283, 273934, 275575, 278216, 281169, 283658, 285732, 288079, 290912, 293625, 295799, 297916, 300542, 303254, 304939]
52861C04939P6j189j885k354k750k904k738k465k378k559k746k520j886j488j904
52846B73249k780l105k455j442q84q99j080j152j156j141j005o49k28j83q00j668
52830B52622j886j086O4P17Q35Q37O97J45n25p64p34j058j635j681j071n58m30
52813B44489o2P76J246Q35L93Q54J703J679N65o89j291j184o30rO3p37j841k352
52795B43808k146j811j659j432r94o30n51n92n40l52nN34J075J346J346J300J239
52778B39936J028P55P21R76J171J016N82J05l34p57j111j282j244j100r45p05
52762B38812k35L89Q24R04R48J292J662J527R98Q04J233J718J737J451J128N82
52746B55774k33p10l68K94N40O10J309K498L047K396J363R63J132J116O47R5k62
$$ y = [304939, 305015, 303826, 301941, 299587, 296837, 293933, 291195, 288730, 286352, 283793, 281047, 278527, 276641, 275153, 273249, 270469, 267364, 264909, 263467, 262583, 261684, 260604, 259452, 258296, 257155, 256150, 255501, 255273, 255090, 254290, 252622, 250736, 249650, 249714, 250431, 251266, 252103, 252800, 252945, 252420, 251656, 250922, 249864, 248229, 246548, 245477, 244919, 244489, 244427, 245203, 246449, 247284, 247677, 248531, 250234, 251913, 252478, 251789, 250498, 249314, 248684, 248675, 248738, 248001, 246160, 243808, 241662, 239851, 238192, 236760, 235766, 235136, 234585, 233993, 233453, 233101, 233096, 233630, 234705, 236051, 237397, 238697, 239936, 240964, 241719, 242440, 243416, 244587, 245603, 246185, 246290, 245956, 245199, 244088, 242806, 241562, 240462, 239517, 238812, 238577, 238966, 239790, 240694, 241642, 242934, 244596, 246123, 247121, 247925, 249158, 250876, 252613, 254064, 255192, 255774, 255541, 254831, 254463, 254757, 255297, 255907, 257216, 259714, 262761, 265157, 266520, 267483, 268615, 269731, 270378, 270473, 270211]
52729B70211n80r58j108p18mM15J71m79r68r80n92p8L00L88K20l6l23p01r56o33
52709B62591K36P99L82m65o44lO08P23O95P49N39K9j64K49P21P85O97O63L19l74
52689B69135o30%P40P27L37M30Q67R32O75P46J070Q78m0j060j667j852j640j067
52671B68581n70n52o70k70M93R06Q45Q43J006Q63L44L8K66P48J278J889K218J660
52653B79916M33l61j31N20Q21P73O65L85k10q11j045j001r95j109j251j331j191
52636B74077p17j45J34J80M70J157J869K347K706K990K983K668K301J895J215
52621B96130L41l47q28j394j848j609q38m85q95j245q40j15L23O60J170J366Q09
52604B90355J89M43J264J500P85j44o44o92k78O90J722J918J149L89M48R20Q61
$$ y = [270211, 269631, 268673, 267565, 266847, 266843, 267258, 267429, 266950, 265982, 265002, 264410, 264332, 264632, 265020, 265240, 265204, 264881, 264180, 263224, 262591, 262827, 263626, 264008, 263543, 262899, 262896, 263504, 264227, 264922, 265671, 266210, 266239, 266075, 266324, 267045, 267830, 268527, 269190, 269509, 269135, 268505, 268505, 269245, 269972, 270309, 270739, 271606, 272538, 273213, 273959, 275029, 275907, 275867, 274807, 273140, 271288, 269648, 268581, 268011, 267459, 266789, 266519, 267012, 267918, 268763, 269606, 270612, 271475, 271819, 271857, 272123, 272871, 274149, 276038, 278256, 279916, 280349, 279988, 279857, 280377, 281198, 281971, 282636, 283021, 282811, 282000, 280955, 279954, 278959, 277850, 276599, 275268, 274077, 273360, 273215, 273349, 273529, 273999, 275156, 277025, 279372, 282078, 285068, 288051, 290719, 293020, 294915, 296130, 296471, 296124, 295296, 293902, 292054, 290445, 289607, 289122, 288227, 286982, 286142, 286027, 286350, 287010, 288180, 289546, 290355, 290544, 290987, 292251, 293751, 294536, 294392, 293748, 293056, 292778, 293468, 295190, 297108, 298257, 298646, 299094, 300014, 300875]
52587C00875Q7o75p53j96M74R15J225J647K126K285J890J198P25O91Q16O16j34
52570C13812j197k061k391k314k145j952j579j091p67o82n91m02l34m65m80k07
52554B95154N1Nr9Q7L61K46k29n67n73n69p35p20j88N73Q64L98l60o99l99R6K79
52533B92976J23K1K54P83J392J833J822J282N71K00K30K53Rk94m08l84l30j20
52515C00213M02J191K125L082L804M033L908L849L826L264J981O82lm98j658l432
52499C26769m869n304m920m103l048k088j744k048k302j984j513j616k140k092
52485B86998r88L96R92P84O73J051J268P71J23J92P45P86K06O9R12J793J663R74
52467B99408R76J878K696K835K810L246L910M154L762K938J831M60r87k146k764
$$ y = [300875, 300962, 300287, 299534, 299338, 299812, 300727, 301952, 303599, 305725, 308010, 309900, 311098, 311823, 312514, 313330, 313946, 313812, 312615, 310554, 308163, 305849, 303704, 301752, 300173, 299082, 298315, 297633, 297042, 296640, 296306, 295841, 295361, 295154, 295205, 295210, 295111, 295198, 295559, 295805, 295576, 295009, 294436, 293867, 293132, 292412, 292224, 292797, 293661, 294059, 293699, 293000, 292601, 292697, 292976, 293099, 293120, 293374, 294157, 295549, 297382, 299204, 300486, 301057, 301257, 301487, 301740, 301749, 301455, 301047, 300663, 300333, 300213, 300615, 301806, 303931, 307013, 310817, 314850, 318758, 322607, 326433, 329697, 331678, 332360, 332357, 331859, 330201, 326769, 321900, 316596, 311676, 307573, 304525, 302437, 300693, 298645, 296343, 294359, 292846, 291230, 289090, 286998, 286010, 286406, 287398, 288182, 288855, 289906, 291174, 291945, 292068, 292260, 293005, 293791, 293997, 294066, 294978, 296771, 298434, 299408, 300384, 302262, 304958, 307793, 310603, 313849, 317759, 321913, 325675, 328613, 330444, 330904, 329917, 327771, 325007]
52452C25007k881k783k789l016l277l290k922k242j394o05j48r6j79j23k0j54
52436B99088n10p99r25j080j343j411r84j91M72O14K81j23k69k31l07m92l41M21
52418B91870J429K034K038J731J413J247J438K083K823L147L155L548M692O149
52404C28797P333Q243R124R742R432P781M929J397k079m693o001o340o526o961
52390C54178p233o696n246l432j897q82k28K56M95L23j18k64L84J667K820L234
52374C37361L064K961L301L843M198M336M437M380L771K585J428Q33O09K13l26
52359C76994m37L3N14N77N97J046J583J529R76O89R43J217J186J300J966K756
52343C93469L012K794K686K958L491M262N260O111O443O540P058Q051Q994R779
$$ y = [325007, 322126, 319343, 316554, 313538, 310261, 306971, 304049, 301807, 300413, 299808, 299660, 299564, 299385, 299262, 299242, 299088, 298578, 297779, 296854, 295774, 294431, 293020, 292036, 291845, 292317, 292931, 293212, 293089, 292820, 292589, 292282, 291790, 291449, 291870, 293299, 295333, 297371, 299102, 300515, 301762, 303200, 305283, 308106, 311253, 314408, 317956, 322648, 328797, 336130, 344373, 353497, 363239, 372671, 380452, 385381, 386778, 384699, 380006, 374005, 367665, 361139, 354178, 346945, 340249, 335003, 331571, 329674, 328792, 328564, 328820, 329315, 329638, 329520, 329256, 329640, 331307, 334127, 337361, 340425, 343386, 346687, 350530, 354728, 359064, 363501, 367881, 371652, 374237, 375665, 376498, 377107, 377320, 376994, 376557, 376590, 377104, 377681, 378278, 379324, 380907, 382436, 383412, 384101, 385044, 386261, 387447, 388747, 390713, 393469, 396481, 399275, 401961, 404919, 408410, 412672, 417932, 424043, 430486, 437026, 444084, 452135, 461129, 470908]
52329D70908J0954J2734J4530J5834J6919J8156J9240J9676J9636J9674J9912
52318F58173K0089K0248K0723K1521K2263K2697K2884K2926K2982K3339K4089
52307I01934K4717K4670K4189K4024K4253K4063K2923K1333K0046J9036J7701
52296A148889J5765J3493J1129Q573N676K549n20l295n643p488q860r948j0898
52283A159422j1491j1235j0081q813q314q442q154o880n134l490j643R27L881
52270A080553O301P811Q750R473J0196J1296J3008J4907J6340J7251J7862J7843
52258A231591J6803J5535J5599J7317J9198J9764J9112J8142J7178J5960J4278
52247A420477J1885Q364L817p35m266o741q672j0221j1364j2500j4047j5703j6781
$$ y = [470908, 481862, 494596, 509126, 524960, 541879, 560035, 579275, 598951, 618587, 638261, 658173, 678262, 698510, 719233, 740754, 763017, 785714, 808598, 831524, 854506, 877845, 901934, 926651, 951321, 975510, 999534, 1023787, 1047850, 1070773, 1092106, 1112152, 1131188, 1148889, 1164654, 1178147, 1189276, 1197849, 1203525, 1206074, 1205554, 1202259, 1196616, 1189128, 1180268, 1170320, 1159422, 1147931, 1136696, 1126615, 1117802, 1109488, 1101046, 1092892, 1086012, 1080878, 1077388, 1075745, 1076672, 1080553, 1086854, 1094665, 1103415, 1112888, 1123084, 1134380, 1147388, 1162295, 1178635, 1195886, 1213748, 1231591, 1248394, 1263929, 1279528, 1296845, 1316043, 1335807, 1354919, 1373061, 1390239, 1406199, 1420477, 1432362, 1440726, 1444543, 1443808, 1439542, 1432801, 1424129, 1413908, 1402544, 1390044, 1375997, 1360294, 1343513]
52234A343513j7179j7360j7506j7366j6863j6298j5877j5544j5189j4669j3699
52223A165963j2200j0661r644q999q000o337m504l153k433k016j468n15P57J922
52209A098712K621K971L345L827M134M099L960M120M744N599O164O058N464N080
52195A160898N488O648Q024R014R213Q591P554O565N595M230K420O38r40k802
52181A231136n244p631r086r548r576r410q948q355q007p780p125n894m587l659
52167A126286l047k507j946j316n05M98J550K493L172L464L453L376L108K006
52153A140085j38k265k907j837k50P61J215J578J929K160K492L154L774L716K885
52138A156352J892J369J411J743K231L057M442O312Q341J0346J2474J4916J7591
$$ y = [1343513, 1326334, 1308974, 1291468, 1274102, 1257239, 1240941, 1225064, 1209520, 1194331, 1179662, 1165963, 1153763, 1143102, 1133458, 1124459, 1116459, 1110122, 1105618, 1102465, 1100032, 1098016, 1096548, 1096033, 1096790, 1098712, 1101333, 1104304, 1107649, 1111476, 1115610, 1119709, 1123669, 1127789, 1132533, 1138132, 1144296, 1150354, 1155818, 1160898, 1166386, 1173034, 1181058, 1190072, 1199285, 1207876, 1215430, 1221995, 1227590, 1231820, 1234240, 1234878, 1233938, 1231136, 1225892, 1218261, 1209175, 1199627, 1190051, 1180641, 1171693, 1163338, 1155331, 1147551, 1140426, 1134532, 1129945, 1126286, 1123239, 1120732, 1118786, 1117470, 1116965, 1117463, 1119013, 1121506, 1124678, 1128142, 1131595, 1134971, 1138079, 1140085, 1139947, 1137682, 1134775, 1132938, 1132688, 1133449, 1134664, 1136242, 1138171, 1140331, 1142823, 1145977, 1149751, 1153467, 1156352, 1158244, 1159613, 1161024, 1162767, 1164998, 1168055, 1172497, 1178809, 1187150, 1197496, 1209970, 1224886, 1242477]
52125A242477K0247K2727K4907K6520K7369K7743K8305K9424L0721L1379L0992
52114A542811L0007K9235K8856K8141K6387K3894K1627J9991J8505J6745J4937
52103A801136J3407J2064J0758R578Q336O353L357O6k729n289q424j2278j6289
52090A820046j9979k2965k4553k4335k3144k2427k2527k2412k1252j9424j7637
52079A579391j5891j3735j1086q302n761l641j877j30J941M325O815R451J2325
52066A553825J5041J6934J7924J8678J9745K0976K1920K2317K2117K1451K0704
52055A771632K0154J9432J7826J5190J2098Q941N490J526k629o541j0162j3565
52043A839392j6622j9217k1416k3215k4427k5099k5633k6255k6677k6532k5895
$$ y = [1242477, 1262724, 1285451, 1310358, 1336878, 1364247, 1391990, 1420295, 1449719, 1480440, 1511819, 1542811, 1572818, 1602053, 1630909, 1659050, 1685437, 1709331, 1730958, 1750949, 1769454, 1786199, 1801136, 1814543, 1826607, 1837365, 1846943, 1855279, 1861632, 1864989, 1865055, 1862326, 1857037, 1848613, 1836335, 1820046, 1800067, 1777102, 1752549, 1728214, 1705070, 1682643, 1660116, 1637704, 1616452, 1597028, 1579391, 1563500, 1549765, 1538679, 1530377, 1524616, 1520975, 1519098, 1518968, 1520909, 1525234, 1532049, 1541500, 1553825, 1568866, 1585800, 1603724, 1622402, 1642147, 1663123, 1685043, 1707360, 1729477, 1750928, 1771632, 1791786, 1811218, 1829044, 1844234, 1856332, 1865273, 1870763, 1872289, 1869660, 1863119, 1852957, 1839392, 1822770, 1803553, 1782137, 1758922, 1734495, 1709396, 1683763, 1657508, 1630831, 1604299, 1578404]
52032A578404k5105k4362k3690k3106k2581k2034k1473k0950k0437j9894j9421
52021A335351j9003j8330j7290j6465j6448j6767j6246j4593j2841j1987j1868
52010A163513j1780j1521j1426j1779j2657j3970j5335j6297j6857j7446j8144
51999A006301j8439j7926j6714j5009j2957j1137j0420j0913j1712j2270j3170
51988H55634j4973j6961j7937j7838j7661j8015j8472j8288j7189j5502j3928
51977F68870j3091j2936j2774j2143j1228j0183q625o320l811j710J27K017L629
51964E81822M519N054N809O379N862M316K629R54j467m674p303q082p186n637
51950E82995m006k313n57J326L638O479R352J1776J3954J6372J8957K1241K3236
$$ y = [1578404, 1553299, 1528937, 1505247, 1482141, 1459560, 1437526, 1416053, 1395103, 1374666, 1354772, 1335351, 1316348, 1298018, 1280728, 1264263, 1247815, 1231048, 1214802, 1200209, 1187368, 1175381, 1163513, 1151733, 1140212, 1128786, 1117007, 1104350, 1090380, 1075045, 1058748, 1041891, 1024445, 1006301, 987862, 969936, 953222, 938213, 925256, 914119, 903699, 892786, 881074, 868804, 855634, 840661, 823700, 805763, 787925, 770264, 752249, 733777, 715489, 698300, 682798, 668870, 655779, 642843, 630069, 617926, 606698, 596515, 587890, 581570, 577759, 576049, 576176, 578193, 581822, 586341, 591395, 597204, 603583, 609445, 613761, 616390, 617344, 615877, 611203, 603900, 595818, 588632, 582995, 578989, 576676, 576119, 577445, 581083, 587562, 596914, 608690, 622644, 639016, 657973, 679214, 702450]
51937G02450K5361K7332K7648K4817J8828J1127L244m164j0904j6578k0726k3351
51925G65084k4762k5080k4406k3331k2606k2176k1246j9535j7757j6460j5111
51914E32614j2953j0233p794n827l935k176j105p42l39N65J635K505L357M284
51900D99856M621L545J197j312l080m355o113q776j1465j2763j2197j0628r095
51887D29435p709o126m579l641l125k101j82J894L292M086M879N910O996P996
51873D37025Q756Q837P778N660L151R99l68r11r43r34j108j211q94k28L06M81
51857D66396O63J372K537L418L352K421J280L43o08j964l762n719p504q690q766
51842D44769p660o143n238n189n364n163m551l672k479j046J87Q79J182J444J685
$$ y = [702450, 727811, 755143, 782791, 807608, 826436, 837563, 840807, 836643, 825739, 809161, 788435, 765084, 740322, 715242, 690836, 667505, 644899, 622723, 601477, 581942, 564185, 547725, 532614, 519661, 509428, 501634, 495807, 491872, 489696, 488591, 487849, 487510, 488075, 489710, 492215, 495572, 499856, 504477, 508022, 509219, 507907, 504827, 500472, 494359, 485583, 474118, 461355, 449158, 438530, 429435, 421726, 415600, 411021, 407380, 404255, 402154, 401972, 403866, 407158, 411244, 416123, 422033, 429029, 437025, 445781, 454618, 462396, 468056, 471207, 472206, 471838, 470927, 469984, 469050, 467942, 466731, 465837, 465609, 465915, 466396, 467059, 468431, 470968, 474386, 477738, 480159, 481439, 481782, 481174, 479210, 475448, 469729, 462225, 453535, 444769, 437109, 430966, 425728, 420539, 415175, 410012, 405461, 401789, 399310, 398264, 398451, 399330, 400512, 401956, 403641]
51827D03641J780J843K015K010J317p1j562k654l331l688l547k757j604n68K32
51812C93056J011J756K043J592P22N0j87k84n94j086j433j336q22k16J16J64L44
51795C94896J001J853K118J296k68j706k366k230j698j067k52R47K284L002K574
51780D00384J401M38J65K82M39P67J473K368L157L880M738N648O362O789O912
51765D45203O521N505M228L136K046L29k082m384n857o692p534q505r063q807
51751D14044p989p153o538n952n169m250l460k917k393j541l64O20R08O79O99
51736C69224J432K511L340L957M718N278M653K653N38l10M0M83N03N42R09J198
51720D01669J006M79j49r39j868k572k787k637k235j465m83J10n0o06r99j084
$$ y = [403641, 405421, 407264, 409279, 411289, 412606, 412535, 410973, 408319, 404988, 401300, 397753, 394996, 393392, 392824, 393056, 394067, 395823, 397866, 399458, 400180, 400230, 400043, 399759, 399165, 398079, 396646, 395310, 394488, 394272, 394388, 394552, 394896, 395897, 397750, 399868, 401164, 400896, 399190, 396824, 394594, 392896, 391829, 391577, 392524, 394808, 397810, 400384, 401785, 402223, 402388, 402670, 403109, 403876, 405349, 407717, 410874, 414754, 419492, 425140, 431502, 438291, 445203, 451724, 457229, 461457, 464593, 466639, 466968, 464886, 460502, 454645, 447953, 440419, 431914, 422851, 414044, 406055, 398902, 392364, 386412, 381243, 376993, 373533, 370616, 368223, 366682, 366318, 366938, 367846, 368525, 369224, 370656, 373167, 376507, 380464, 385182, 390460, 395113, 397766, 398304, 397994, 398034, 398517, 399020, 399562, 400471, 401669, 402675, 403154, 403005, 402066, 400198, 397626, 394839, 392202, 389967, 388502, 388019, 388129, 388079, 387473, 386474, 385390]
51704C85390q60j28J115K287K803K760K582K273J546N19l07p00q51r17q22n23
51688C96167j89p9l64j025j828k539l165l704l734k742j028L58Q38Q85J028J027
51672C79906N57M5J1J76K7j22M40J575K420K688K949L621M389M673M094K529M21
51655D10399j122j219k17Q72J849L423N832Q136R133Q395O256L418O77j493l178
51640D51161m522n194m971m529m738n312n197m318l790m206m824m812m234l372
51626C87142k174r65o32j275j686j056l43q47k147k709k198j822k436l395l600
51611C59857k842j767j093j092j508j735j342n02K73P98J309K082L175M461N666
51596C65740O496P015P710Q856R990J0287R266O900L345r10m763p040p401o453
$$ y = [385390, 384530, 384402, 385517, 387804, 390607, 393367, 395949, 398222, 399768, 400287, 399980, 399280, 398429, 397512, 396690, 396167, 395978, 395899, 395535, 394510, 392682, 390143, 386978, 383274, 379540, 376798, 375770, 376128, 376966, 377851, 378879, 379906, 380463, 380508, 380519, 380695, 380722, 380600, 381040, 382615, 385035, 387723, 390672, 394293, 398682, 403355, 407449, 409978, 410399, 409277, 408058, 407841, 408713, 410562, 413985, 419817, 427953, 437086, 445481, 451737, 455155, 455832, 454339, 451161, 446639, 441445, 436474, 431945, 427207, 421895, 416698, 412380, 408590, 404384, 399560, 394748, 390514, 387142, 384968, 384003, 383371, 382096, 380410, 379354, 379011, 378164, 376017, 373308, 371110, 369288, 366852, 363457, 359857, 357015, 355248, 354155, 353063, 351555, 349820, 348478, 347976, 348249, 349047, 350356, 352438, 355613, 360074, 365740, 372236, 379251, 386961, 395817, 405807, 416094, 425360, 432260, 435605, 434695, 429932, 422892, 415491, 409038]
51582D09038m995l485k119r35K66J692L192M490N761P531R782J1598J2080J1444
51568D65340J0876J1355J2830J4515J5707J6223J6307J6377J6917J8329K0656
51557F35432K3414K5761K6903K6424K4386K1171J7100J2064N767j474q438j3873
51545G94637j7561k0137k1973k2749k2242k0885j9348j7864j6350j4902j3823
51534E86803j3358j3556j4217j4780j4515j3192j1448j0187r700r533r126q299
51522D44892p234o230n557n292n229n024m528l987l769l882l849l240k302j719
51508C83050j744j878j673j376j415j578j328o96j60K62J094K393L378L351K538
51493C84218J672J206J158J334J443J249Q78O78O99O49M52L39K78j38r90j775
$$ y = [409038, 404043, 400558, 398439, 397504, 397770, 399462, 402654, 407144, 412905, 420436, 430218, 441816, 453896, 465340, 476216, 487571, 500401, 514916, 530623, 546846, 563153, 579530, 596447, 614776, 635432, 658846, 684607, 711510, 737934, 762320, 783491, 800591, 812655, 818422, 816948, 808510, 794637, 777076, 756939, 734966, 712217, 689975, 669090, 649742, 631878, 615528, 600626, 586803, 573445, 559889, 545672, 530892, 516377, 503185, 491737, 481550, 471850, 462317, 453191, 444892, 437658, 431428, 425871, 420579, 415350, 410326, 405798, 401811, 398042, 394160, 390311, 387071, 384769, 383050, 381306, 379428, 377755, 376379, 374964, 373386, 372058, 371362, 371202, 371464, 372558, 374951, 378329, 381680, 384218, 385890, 387096, 388254, 389588, 391031, 392280, 393158, 393836, 394535, 395184, 395636, 395975, 396253, 396115, 395125, 393350]
51477C93350k186k608l453m429m980n021m856m656m421m156l721k835j579n43
51463C43906q4J38M64N09k16j276j627q63L94J322J648J582J515J833K677L764
51447C55686M652N170N533O115P309R298J1712J3755J4822J4796J3499J0465N729
51434D78541N72l253n010n351n306n402n687o047o322o437o554o849p136o910
51420D02849n846m184k615j826j981k516k634k053j105j12R06J774K004J465P74
51405C84900N87Q88J348K006K970L840M021L513K830K334K149K537L663N064N967
51390D28617O231O489P256Q369R476J0680J2431J5006J8219K1645K5090K8717
51378E98226L2586L6136L8587L9900M0753M1262M0257L6390K9543K0631J0532
$$ y = [393350, 391164, 388556, 385103, 380674, 375694, 370673, 365817, 361161, 356740, 352584, 348863, 346028, 344449, 343906, 343822, 343960, 344424, 344933, 344717, 343441, 341814, 340951, 341345, 342667, 344315, 345897, 347412, 349245, 351922, 355686, 360338, 365508, 371041, 377156, 384465, 393763, 405475, 419230, 434052, 448848, 462347, 472812, 478541, 479113, 475860, 470850, 465499, 460193, 454791, 449104, 443057, 436735, 430298, 423744, 416895, 409759, 402849, 397003, 392819, 390204, 388378, 386397, 383881, 381247, 379194, 378089, 377977, 378883, 380657, 382661, 384126, 384900, 385487, 386375, 387723, 389729, 392699, 396539, 400560, 404073, 406903, 409237, 411386, 413923, 417586, 422650, 428617, 434848, 441337, 448593, 456962, 466438, 477118, 489549, 504555, 522774, 544419, 569509, 598226, 630812, 666948, 705535, 745435, 786188, 827450, 867707, 904097, 933640, 954271, 964803]
51367I64803j24j0432j9376k6524l2094l6321l9248m0944m1421m0490l8170l5046
51355F04613l1782k8427k4756k1013j7726j4972j2495j0350q745p463o118m860
51343D15906m089l603k815j778j132j031r59o47m49n91q66j218j857k586k754
51328C89531k208j661j754k312k780k892k627k068j455j016n84R1O99P02K83J99
51312C70148O07R16R96J455K350K632J607N1q92j243j687k176k026j191m79m10
51296C70658o60p46p12r61j628k394k769k511j780q74N5R49J650K120K606L285
51280C66288L909M297M917O198P450P364N626L178Q83j103k469k559j570p26o47
51265D01036m99M73J623K029J955K021J771L75j737l216l521l226k856k517k452
$$ y = [964803, 964679, 954247, 934871, 908347, 876253, 839932, 800684, 759740, 718319, 677829, 639659, 604613, 572831, 544404, 519648, 498635, 480909, 465937, 453442, 443092, 434347, 426884, 420766, 415906, 411817, 408214, 405399, 403621, 402489, 401458, 400499, 399852, 399403, 398812, 397946, 396728, 394871, 392285, 389531, 387323, 385662, 383908, 381596, 378816, 375924, 373297, 371229, 369774, 368758, 368174, 368265, 368964, 369666, 369949, 370148, 370755, 371671, 372667, 374122, 376472, 379104, 380711, 380762, 379870, 378627, 376940, 374764, 372738, 371547, 371068, 370658, 369998, 369252, 368540, 367579, 365951, 363557, 360788, 358277, 356497, 355623, 355678, 356627, 358277, 360397, 363003, 366288, 370197, 374494, 379411, 385609, 393059, 400423, 406049, 409227, 410110, 409007, 406538, 403979, 402409, 401683, 401036, 400537, 401010, 402633, 404662, 406617, 408638, 410409, 410784, 409047, 405831, 402310, 399084, 396228, 393711, 391259]
51250C91259k803k940k117p76j24m26p65n62k05k1J98M04J14n35n87L03J147R85
51232C82549J70l38l14k00l01o88j430k257k412j572n08j72m11l50K30P31Q28
51215C73555Q52R71Q32L20nL99J321K157K617K737K588K391K606L326L855L478
51199D04000K582K202K431K096M84j416k182j875j767k365k838k534k001j975
51185C94842k135j589j94J298K186K396K200J848J380O10n62j654j902j320r08
51170C96496j320j861j557p00m20r67j488j448j187q45J03J757L082L049J921
51155C94615Q14L66M03N15L93q9o92q08k10M93N36l7n33n40k32Q9K61J28l58q59
51135C94255q89l76L33J010J654K103J989J285N01K15N52J274K051K565K643K445
$$ y = [391259, 388456, 385516, 383399, 382623, 382499, 382073, 381308, 380746, 380541, 380520, 380718, 381122, 381236, 380701, 380114, 380417, 381564, 382549, 382719, 382381, 382067, 381867, 381566, 380878, 379448, 377191, 374779, 373207, 372699, 372527, 372116, 371766, 371996, 372727, 373555, 374407, 375378, 376210, 376530, 376525, 376924, 378245, 380402, 383019, 385756, 388344, 390735, 393341, 396667, 400522, 404000, 406582, 408784, 411215, 413311, 413795, 412379, 410197, 408322, 406555, 404190, 401352, 398818, 396817, 394842, 392707, 391118, 390924, 392222, 394408, 396804, 399004, 400852, 402232, 402842, 402280, 400626, 398724, 397404, 396496, 395176, 393315, 391758, 391058, 390638, 389671, 388183, 386735, 385548, 384703, 384806, 386563, 389645, 392694, 394615, 395429, 395795, 396198, 396713, 397106, 397017, 396325, 395517, 395307, 395800, 396336, 396299, 395766, 395226, 394994, 395083, 395344, 395472, 395114, 394255, 393366, 392990, 393323, 394333, 395987, 398090, 400079, 401364, 401865, 402080, 402632, 403906, 405957, 408522, 411165, 413610]
51119D13610K286K162J730R65M36O48J371J921J994J868J855J891J702J141L49
51104D35929k76l39J30O37P97Q05J049J358J180N04O2L31P98P13J90P5P56J690
51086D46389K117J862J273P36M56M28M55L13Q3Q5L82N77M13K63O27J260J364P87
51068D59870M52J237K788M037M670N432O922Q716J0072J0988J2055J3513J5010
51055E55762J6079J6298J5081J2040P764L786J437R93J964L595M955N132L988
51042F48874K348J018r4j565l580n918q297j0098j0177p904m354j666j131k458
51028E94998m713p107q798q964p616n707m017k418n01J616L594N402P115Q597
51014E71481R798J0932J1930J2158J1274R885Q824Q041O907N352L942K927J941
$$ y = [413610, 415896, 418058, 419788, 420753, 421189, 421837, 423208, 425129, 427123, 428991, 430846, 432737, 434439, 435580, 435929, 435653, 435314, 435444, 436081, 436878, 437683, 438732, 440090, 441270, 441774, 441836, 442167, 442965, 443678, 443868, 443943, 444699, 446389, 448506, 450368, 451641, 452377, 452833, 453261, 453716, 454029, 454112, 454197, 454579, 455156, 455569, 455832, 456459, 457719, 459083, 459870, 460322, 461559, 464347, 468384, 473054, 478486, 485408, 494124, 504196, 515184, 527239, 540752, 555762, 571841, 588139, 603220, 615260, 623024, 626810, 628247, 629240, 631204, 634799, 639754, 644886, 648874, 651222, 652240, 652146, 650581, 647001, 641083, 632786, 622688, 612511, 604607, 600253, 598587, 597456, 594998, 590285, 583178, 574380, 565416, 557800, 552093, 548076, 545658, 545157, 546773, 550367, 555769, 562884, 571481, 581279, 592211, 604141, 616299, 627573, 637458, 646282, 654323, 661230, 666582, 670524, 673451, 675392]
51001F75392P52l10r05j207j565j976k086j602n63P17J865K778L666M727N835
50986F85518O735P522Q735J0892J3991J7413K0335K2391K3927K5437K6704K6909
50974H96509K5729K3979K2907K3286K5411K9470L5199M1473M7022N1709N6531
50963A279225O2273O8537P4304P9011Q2814Q6032Q8539Q9710Q8896Q6015Q1516
50952B166872P5716O8444N9578M9699L9750L0261K1276J2886N337j320p089j1611
50940B509799j4414j5727j6491j7330j8089j8466j8635j8856j9075j9332k0148
50929B313236k2031k4809k8024l1708l6284m1689m7146n1940n6031n9763o3168
50918A850643o5804o7113o6855o5203o2538n9138n5123n0656m6181m2295l9324
$$ y = [675392, 676144, 675834, 674929, 673722, 672157, 670181, 668095, 666493, 665930, 666647, 668512, 671290, 674956, 679683, 685518, 692253, 699775, 708510, 719402, 733393, 750806, 771141, 793532, 817459, 842896, 869600, 896509, 922238, 946217, 969124, 992410, 1017821, 1047291, 1082490, 1123963, 1170985, 1222694, 1279225, 1341498, 1410035, 1484339, 1563350, 1646164, 1732196, 1820735, 1910445, 1999341, 2085356, 2166872, 2242588, 2311032, 2370610, 2420309, 2460059, 2490320, 2511596, 2524482, 2529819, 2528499, 2521410, 2509799, 2495385, 2479658, 2463167, 2445837, 2427748, 2409282, 2390647, 2371791, 2352716, 2333384, 2313236, 2291205, 2266396, 2238372, 2206664, 2170380, 2128691, 2081545, 2029605, 1973574, 1913811, 1850643, 1784839, 1717726, 1650871, 1585668, 1523130, 1463992, 1408869, 1358213, 1312032, 1269737, 1230413]
50907A230413l7006l4617l1585k8070k4931k2878k1663k0343j8371j6161j4339
50896I60449j2873j1272r489p954o737n248l154j051K23O55Q34R95R71J021J875
50881I09245L648N467O606P431Q631J0062J1064J1550J2010J2644J3363J4421
50869A026142J6151J8079J9275J9785K0793K3005K5815K8466L1098L4033L6982
50858A299624L9781M3202M8060N4086O0607O7913P6860Q7417R8669J10136J22043
50847B108398J34266J46094J57138J67601J77413J85944J92834J98176K01630
50838C669494K02032J98275J89851J76276J56965J32365J04531P5861M7597K0105
50828D973352n855k8865m7754o2084p1793p6783p6926p2332o3632n2204l9935
$$ y = [1230413, 1193407, 1158790, 1127205, 1099135, 1074204, 1051326, 1029663, 1009320, 990949, 974788, 960449, 947576, 936304, 926815, 918861, 912124, 906876, 903722, 902671, 902894, 903549, 904383, 905378, 906349, 907370, 909245, 912893, 918360, 924966, 932397, 941028, 951090, 962154, 973704, 985714, 998358, 1011721, 1026142, 1042293, 1060372, 1079647, 1099432, 1120225, 1143230, 1169045, 1197511, 1228609, 1262642, 1299624, 1339405, 1382607, 1430667, 1484753, 1545360, 1613273, 1690133, 1777550, 1876219, 1986355, 2108398, 2242664, 2388758, 2545896, 2713497, 2890910, 3076854, 3269688, 3467864, 3669494, 3871526, 4069801, 4259652, 4435928, 4592893, 4725258, 4829789, 4905650, 4953247, 4973352, 4967497, 4938632, 4890878, 4828794, 4757001, 4680218, 4603292, 4530960, 4467328, 4415124, 4375189]
50817D375189k8643j9819j4746j4428j9134k8381m1428n7365p4745r1881j07930
50806C876689j23083j37291j49456j58350j63776j66135j65385j61288j54312
50797B497613j45406j35071j23467j11234r9289q7771p6230o4967n5252m7766
50787A551160m1665l5739k9831k4534k0043j6144j2960j0833r497q154o606n671
50775A329483o111p552q887r498r620r606r444r177r338j0414j2062j3323j3695
50762A200756j3567j3484j3431j3098j2434j1535j0302q706p127n829m294j765
50750A085184J536M500O693R056J2551J6754K0513K3547K6577L0032L3557L6931
50738A307431M0639M5076M9914N4744N9937O6114P2990P9466Q4952R0009R5358
$$ y = [4375189, 4346546, 4326727, 4311981, 4297553, 4278419, 4250038, 4208610, 4151245, 4076500, 3984619, 3876689, 3753606, 3616315, 3466859, 3308509, 3144733, 2978598, 2813213, 2651925, 2497613, 2352207, 2217136, 2093669, 1982435, 1883146, 1795375, 1719145, 1654178, 1598926, 1551160, 1509495, 1473756, 1443925, 1419391, 1399348, 1383204, 1370244, 1359411, 1349914, 1341760, 1335154, 1329483, 1323372, 1315820, 1306933, 1297435, 1287815, 1278209, 1268765, 1259588, 1250250, 1239836, 1227774, 1214451, 1200756, 1187189, 1173705, 1160274, 1147176, 1134742, 1123207, 1112905, 1104199, 1097072, 1091243, 1086949, 1085184, 1086720, 1091220, 1097913, 1106969, 1119520, 1136274, 1156787, 1180334, 1206911, 1236943, 1270500, 1307431, 1348070, 1393146, 1443060, 1497804, 1557741, 1623855, 1696845, 1776311, 1861263, 1951272, 2046630]
50727B046630J00643J04571J06204J05790J04318J02451R9974R6138R0315Q2202
50717C039236P1511N7795M0775K0834p95k2238m1330n6253o6223p1567p2850p0080
50705B828815o3198n3209m2201l1887k2562j3826o001l55J886K87m991j3599k4989
50692B554170l8246n2223o5804p8038q8061r5125r8769r8971r6074r0610q3261
50681A668988p4958o6671n8835n1237m3724l6733l0674k5027j8877j2299o406
50670A243547j756K356O573J0308J2691J3963J4904J5382J4643J2927J1593J1421
50658A368552J1792J1874J1777J2005J2520J2958J3305J3741J4146J4301J4434
50647A511405J5129J6733J9142K2047K5133K8170L1118L4109L7265M0562M3932
$$ y = [2046630, 2147273, 2251844, 2358048, 2463838, 2568156, 2670607, 2770581, 2866719, 2957034, 3039236, 3110747, 3168542, 3209317, 3230151, 3229356, 3207118, 3165788, 3109535, 3043312, 2971745, 2898895, 2828815, 2765617, 2712408, 2670207, 2638320, 2615758, 2601932, 2595931, 2595576, 2597462, 2597749, 2592758, 2579159, 2554170, 2515924, 2463701, 2397897, 2319859, 2231798, 2136673, 2037904, 1938933, 1842859, 1752249, 1668988, 1594030, 1527359, 1468524, 1417287, 1373563, 1336830, 1306156, 1281129, 1262252, 1249953, 1243547, 1241791, 1244147, 1250720, 1261028, 1273719, 1287682, 1302586, 1317968, 1332611, 1345538, 1357131, 1368552, 1380344, 1392218, 1403995, 1416000, 1428520, 1441478, 1454783, 1468524, 1482670, 1496971, 1511405, 1526534, 1543267, 1562409, 1584456, 1609589, 1637759, 1668877, 1702986, 1740251, 1780813, 1824745]
50636A824745M7180M9882N1656N2536N2767N2192N0358M7408M4252M1584L9262
50625B353822L7021L5136L3559L0701K4102J2753j634j5723k6643l3061l4985
50614B415048l3204k8896k3336j7571j2156p168k492J741M986O587O253M201P78
50601B314771m023j0540j8895k8489l8231m7241n5132o1684o6525o9428p0698
50590A843885p0910p0386o9125o7119o4392o0853n6457n1497m6466m1654l7142
50579A207884l3034k9336k5769k2087j8482j5207j1993q400m636j360J312L848
50567A042740O362Q429J0009J1653J3458J4777J5433J6357J8255K0450K1846K2399
50555A222168K2659K2594K2002K1732K3006K5479K7218K7045K5856K5112K4953
$$ y = [1824745, 1871925, 1921807, 1973463, 2025999, 2078766, 2130958, 2181316, 2228724, 2272976, 2314560, 2353822, 2390843, 2425979, 2459538, 2490239, 2514341, 2527094, 2525460, 2509737, 2483094, 2450033, 2415048, 2381844, 2352948, 2329612, 2312041, 2299885, 2292717, 2290225, 2291966, 2296952, 2303539, 2309792, 2313993, 2314771, 2310748, 2300208, 2281313, 2252824, 2214593, 2167352, 2112220, 2050536, 1984011, 1914583, 1843885, 1772975, 1702589, 1633464, 1566345, 1501953, 1441100, 1384643, 1333146, 1286680, 1245026, 1207884, 1174850, 1145514, 1119745, 1097658, 1079176, 1063969, 1051976, 1043576, 1038940, 1037580, 1038892, 1042740, 1049102, 1057531, 1067540, 1079193, 1092651, 1107428, 1122861, 1139218, 1157473, 1177923, 1199769, 1222168, 1244827, 1267421, 1289423, 1311155, 1334161, 1359640, 1386858, 1413903, 1439759, 1464871, 1489824]
50544A489824K4521K3536K2641K2435K2944K4109K6192K9461L3732L8449M3144
50533A800988M7661N2043N6285O0290O3994O7528P1340P6147Q2546R0369R8499
50522B567690J05578J11023J14999J17548J18146J16354J12365J06511R8550Q7894
50512C656658P4365N8358M0511K1539K306j6506l4675n2095o8189q1994r2724
50501C507554r9877j02950j01537r5778q6368p4105n9749m4215k8413j2866K157
50490B803853J5999K7525L5859M0762M2130L9386L1710J8809J391j8928m0081
50479B998415o0207p8058r2912j04202j11521j15047j15562j13928j10661j06084
50469A990233j00550r4310q7417q0016p2558o5466n8729n2112m5685l9824l4587
$$ y = [1489824, 1514345, 1537881, 1560522, 1582957, 1605901, 1630010, 1656202, 1685663, 1719395, 1757844, 1800988, 1848649, 1900692, 1956977, 2017267, 2081261, 2148789, 2220129, 2296276, 2378822, 2469191, 2567690, 2673268, 2784291, 2899290, 3016838, 3134984, 3251338, 3363703, 3470214, 3568764, 3656658, 3731023, 3789381, 3829892, 3851431, 3853737, 3837231, 3802556, 3750461, 3682272, 3600278, 3507554, 3407677, 3304727, 3203190, 3107412, 3021044, 2946939, 2887190, 2842975, 2814562, 2801696, 2803853, 2819852, 2847377, 2883236, 2923998, 2966128, 3005514, 3037224, 3056033, 3057424, 3038496, 2998415, 2938208, 2860150, 2767238, 2663036, 2551515, 2436468, 2320906, 2206978, 2096317, 1990233, 1889683, 1795373, 1707956, 1627940, 1555382, 1489916, 1431187, 1379075, 1333390, 1293566, 1258979]
50458A258979k9482k4112j8805j4256j0501o651j878L540Q441J1978J4369J6479
50446A208101J8934K1731K4566K7312L0218L3497L6621L8216L6962L2631K6098
50435A534887J8471J0587L297k429o045p842q526q593q248p671p102o762o731
50422A497293o739o097m237j420J520M251P313J1250J5880K0701K5546L0420L5169
50409A630850L9728M4268M8697N2435N5152N7249N8986N9633N8214N4852N0620
50398B210684M6241M1620L6465L0513K3166J3752K344j0173k2982l5700m7871
50387B288059n8663o7271p3128p5742p4895p1195o5827n9547n2347m4172l5388
50376A609884k6360j7076p606J372Q921J4493J8127K0087K0347J8338J3342N477
$$ y = [1258979, 1229497, 1205385, 1186580, 1172324, 1161823, 1155172, 1153294, 1156834, 1165275, 1177253, 1191622, 1208101, 1227035, 1248766, 1273332, 1300644, 1330862, 1364359, 1400980, 1439196, 1476158, 1508789, 1534887, 1553358, 1563945, 1567242, 1564813, 1558768, 1550926, 1542400, 1533807, 1525559, 1517888, 1510786, 1504024, 1497293, 1490554, 1484457, 1480220, 1478800, 1480320, 1484571, 1491884, 1503134, 1519014, 1539715, 1565261, 1595681, 1630850, 1670578, 1714846, 1763543, 1815978, 1871130, 1928379, 1987365, 2046998, 2105212, 2160064, 2210684, 2256925, 2298545, 2335010, 2365523, 2388689, 2402441, 2404785, 2394612, 2371630, 2335930, 2288059, 2229396, 2162125, 2088997, 2013255, 1938360, 1867165, 1801338, 1741791, 1689444, 1645272, 1609884, 1583524, 1566448, 1558842, 1560214, 1569135, 1583628, 1601755, 1621842, 1642189, 1660527, 1673869, 1679346]
50364A679346l861j2910k0791k7479l2864l6573l8568l9117l8120l5363l1648
50353A362052k8811k8209k9784l2822l6721m0499m2522m1736l8791l5149l1390
50342I75618k7146k2418j7917j4100j0658p281m252j969l48J013K339L715N278
50329H81874O944Q152Q327P676P141P432Q390R484J0535J1581J2383J2659J2735
50316A005313J3248J4065J4181J2989J1031R089P176N038L089K087K105K615L345
50303A105371M439N937P764J0023J2698J5336J7697K0493K4625K9950L5522M0506
50291A330361M3603M1951L2598J5827m028k1717l4287m1251m3299m1754l8218
50280A239786l3574k7824k1427j5857j2060r281o385l576j814j128o24K61J525
$$ y = [1679346, 1675485, 1662575, 1641784, 1614305, 1581441, 1544868, 1506300, 1467183, 1429063, 1393700, 1362052, 1333241, 1305032, 1275248, 1242426, 1205705, 1165206, 1122684, 1080948, 1042157, 1007008, 975618, 948472, 926054, 908137, 894037, 883379, 876098, 871846, 869877, 869529, 870542, 872881, 876596, 881874, 888818, 896970, 905297, 912973, 920114, 927546, 935936, 945420, 955955, 967536, 979919, 992578, 1005313, 1018561, 1032626, 1046807, 1059796, 1070827, 1079916, 1087092, 1092130, 1095219, 1097306, 1099411, 1102026, 1105371, 1109810, 1115747, 1123511, 1133534, 1146232, 1161568, 1179265, 1199758, 1224383, 1254333, 1289855, 1330361, 1373964, 1415915, 1448513, 1464340, 1460312, 1438595, 1404308, 1363057, 1319758, 1278004, 1239786, 1206212, 1178388, 1156961, 1141104, 1129044, 1119763, 1113378, 1109802, 1107988, 1106860, 1106236, 1106497, 1108022]
50267A108022L172N113O795P850Q748R947J0895J0866J0364J0509J1326J1851
50255A215458J1821J1993J2665J3104J2780J2105J1605J1169J0456R214O890K825
50243A342085k632p898j1558j3564j4562j4655j3349j0537o934l607j298j90k95
50230A241006j935n574j0896j6492k0915k3814k5471k5731k4359k2136k0421j9453
50218A023809j8254j6487j5198j5114j5289j4400j2579j1019j0276r907r446q841
50206H66999q031o907n645m539l608k864k677l266m043m204l949m269n452o563
50192H00982o673n998n449n452n710n781n544n181m960m965m914m423l527k776
50178G29629k628k963l356l616l801l913l861l715l640l563l171k389j580j135
$$ y = [1108022, 1111194, 1116307, 1123102, 1130952, 1139700, 1149647, 1160542, 1171408, 1181772, 1192281, 1203607, 1215458, 1227279, 1239272, 1251937, 1265041, 1277821, 1289926, 1301531, 1312700, 1323156, 1332370, 1339260, 1342085, 1339453, 1331555, 1319997, 1306433, 1291871, 1277216, 1263867, 1253330, 1246396, 1242789, 1241491, 1241301, 1241006, 1239071, 1233497, 1222601, 1206109, 1185194, 1161380, 1135909, 1110178, 1085819, 1063683, 1043262, 1023809, 1005555, 989068, 973870, 958756, 943467, 929067, 916488, 905469, 895193, 885286, 875840, 866999, 858968, 852061, 846416, 841877, 838269, 835405, 832728, 829462, 825419, 821215, 817266, 812997, 807545, 800982, 794309, 788311, 782862, 777410, 771700, 765919, 760375, 755194, 750234, 745269, 740355, 735932, 732405, 729629, 727001, 724038, 720682, 717066, 713265, 709352, 705491, 701776, 698136, 694573, 691402, 689013, 687433, 686298]
50164F86298r51n56K80J220J690J526J212J457K494L853M968N951P477R846J2471
50149G39236J4635J6476J8765K1701K4474K6225K7042K7639K8331K8774K8625
50138A001923K8064K7560K7385K7545K8055K9049L0444L1505L0935K7698K1778
50127A311941J3998N200m057j3014k0522k5807k9107l1210l2426l2427l0925k8161
50115A083483k4736k1258j8149j5547j3366j1601j0468j0047r928r533q731p828
50103I22291p121o696o536o449o033n195m540m724n412n548m758l770l241k779
50089H49489j710k07J005J719K336K978L285L224L492M734O663Q288Q934Q757
50075I02987Q381Q243Q333Q378Q171P680O948N999M887L788K946K477K173J604
$$ y = [686298, 685347, 684791, 685071, 686291, 687981, 689507, 690719, 692176, 694670, 698523, 703491, 709442, 716919, 726765, 739236, 753871, 770347, 789112, 810813, 835287, 861512, 888554, 916193, 944524, 973298, 1001923, 1029987, 1057547, 1084932, 1112477, 1140532, 1169581, 1200025, 1231530, 1262465, 1290163, 1311941, 1325939, 1331139, 1327082, 1314068, 1293546, 1267739, 1238632, 1207422, 1174996, 1142569, 1111644, 1083483, 1058747, 1037489, 1019340, 1003793, 990427, 978826, 968358, 958311, 948383, 938850, 930119, 922291, 915170, 908474, 901938, 895489, 889456, 884261, 879721, 874997, 869585, 864037, 859279, 855509, 852268, 849489, 847779, 847572, 848577, 850296, 852632, 855610, 858895, 862119, 865611, 870345, 877008, 885296, 894230, 902987, 911368, 919611, 927944, 936322, 944493, 952173, 959121, 965120, 970007, 973795, 976741, 979218, 981391, 982995]
50061I82995M15j353l200m510n026n043n123n622o439p172p408o911n653l892
50047I16058k163r36j36Q69K573M737O698Q140R272J0301J1185J1981J3026J4459
50033A006064J5920J6992J7696J8252J8636J8698J8612J8745J9165J9555J9546
50022A207881J8930J7611J5689J3581J1789J0490R473Q349O716M353J535j135
50010A325262l465o028r358j3246j7273k1706k6912l2050l5343l5896l4389l1775
49998A057821k8152k3592j9162j6126j4423j2786j0395p699n631m640m706n700
49986I04809p434r549j1683j3612j5213j6323j6767j6381j5155j3432j1904j1100
49974G46256j0773j0041q321o035m273l730m173m828n146n045m625l959l250k797
$$ y = [982995, 983410, 982057, 978857, 974347, 969321, 964278, 959155, 953533, 947094, 939922, 932514, 925603, 919950, 916058, 913895, 912959, 912823, 913692, 916265, 921002, 927700, 935840, 945112, 955413, 966598, 978579, 991605, 1006064, 1021984, 1038976, 1056672, 1074924, 1093560, 1112258, 1130870, 1149615, 1168780, 1188335, 1207881, 1226811, 1244422, 1260111, 1273692, 1285481, 1295971, 1305444, 1313793, 1320509, 1324862, 1326397, 1325262, 1321797, 1315769, 1306411, 1293165, 1275892, 1254186, 1227274, 1195224, 1159881, 1123985, 1089596, 1057821, 1029669, 1006077, 986915, 970789, 956366, 943580, 933185, 925486, 919855, 915215, 910509, 904809, 897375, 887826, 876143, 862531, 847318, 830995, 814228, 797847, 782692, 769260, 757356, 746256, 735483, 725442, 717121, 711086, 706813, 703083, 698910, 694082, 688936, 683891, 679266, 675307, 672057, 669260]
49960F69260k620k258j236L60J988L275M236N013N728O573P617Q465Q463P409
49946G22273N753M015K363R47Q8j79n05j576l217m511m884m692m763n527o732
49931F98853p861q640r128r375r227q567p656o854o097n037l708k602j947j404
49917F10750p27k00%L92J476K821L583L759M137M954N474N233M982N835P809R789
49901F70067J0831J1037J1029J0876R900P697N117L732M001M438L108j58l723
49888G47952o246p978r705j1293j1942j1469j0544r776r179q518p722o879o147
49875F30554n674n367m821l769k425j181j25Q23J576K106K753L769M797N419N993
$$ y = [669260, 666640, 664382, 663146, 663506, 665494, 668769, 673005, 678018, 683746, 690319, 697936, 706401, 714864, 722273, 728026, 732041, 734404, 735351, 735439, 735260, 734755, 733179, 729962, 725451, 720567, 715875, 711112, 705585, 698853, 690992, 682352, 673224, 663849, 654622, 646055, 638399, 631545, 625448, 620411, 616703, 614101, 612154, 610750, 610023, 609823, 609823, 610215, 611691, 614512, 618095, 621854, 625991, 630945, 636419, 641652, 646634, 652469, 660278, 670067, 680898, 691935, 702964, 713840, 723740, 731437, 736554, 740286, 744287, 748725, 751833, 751675, 747952, 741706, 733728, 724023, 712730, 700788, 689319, 678775, 668999, 659820, 651302, 643580, 636701, 630554, 624880, 619513, 614692, 610923, 608498, 607317, 607192, 608015, 609591, 611697, 614450, 618219, 623016, 628435, 634428]
$$ [...]
##END NTUPLES=NMR SPECTRUM
##END=
