##TITLE=AC1762_NAR_8_9683283_WP7fWIg7G1
##JCAMPDX= 6.0         $$ Bruker NMR JCAMP-DX V2.0
##DATA TYPE= NMR SPECTRUM
##DATA CLASS= NTUPLES
##ORIGIN= BRUKER
##OWNER= Administrator
$$ 1.72 TOPSPIN		Version 2.1
$$ 2016-04-16 16:58:19.220 -0700  Administrator@X
$$ Compression mode = diff/dup
##.OBSERVE FREQUENCY= 400.02188249412
##.OBSERVE NUCLEUS= ^1H
##.ACQUISITION MODE= SIMULTANEOUS (DQD)
##.ACQUISITION SCHEME= undefined
##.AVERAGES= 8
##.DIGITISER RES= 22
##SPECTROMETER/DATA SYSTEM= spect
##.PULSE SEQUENCE= zg30
##.SOLVENT NAME= COFFEE_meoh
##.SHIFT REFERENCE= INTERNAL, COFFEE_meoh, 1, 14.98509
##AUDIT TRAIL= $$ (NUMBER, WHEN, WHO, WHERE, PROCESS, VERSION, WHAT)
$$ ##TITLE= Audit trail, TOPSPIN		Version 2.1
$$ ##JCAMPDX= 5.01
$$ ##ORIGIN= Bruker BioSpin GmbH
$$ ##OWNER= Administrator
$$ $$ E:\/data/COFFEE/nmr/AC1762_NAR_8_9683283_WP7fWIg7G1/10/pdata/1/auditp.txt
$$ ##AUDIT TRAIL=  $$ (NUMBER, WHEN, WHO, WHERE, PROCESS, VERSION, WHAT)
(   1,<2016-04-16 16:58:12.048 -0700>,<Administrator>,<X>,<go>,<TOPSPIN 2.1>,
      <created by zg
	started at 2016-04-16 16:57:05.986 -0700,
	POWCHK enabled, PULCHK disabled,
       configuration hash MD5:
       21 0F 79 D6 B3 7B B4 F6 88 20 88 DB 03 48 BD 9F
       data hash MD5: 64K
       3D FD E9 43 89 23 03 5E D3 F1 B3 CF 10 45 C4 A7>)
(   2,<2016-04-16 16:58:15.204 -0700>,<Administrator>,<X>,<proc1d>,<TOPSPIN 2.1>,
      <Start of raw data processing
       efp LB = 0 FT_mod = 6 PKNL = 1 PHC0 = 0 PHC1 = 0 SI = 32K 
       data hash MD5: 32K
       EE E4 C9 FD 82 A8 3F A4 A4 45 BC 32 A6 C2 D2 20>)
(   3,<2016-04-16 16:58:15.486 -0700>,<Administrator>,<X>,<proc1d>,<TOPSPIN 2.1>,
      <pk PHC0 = 91.94458 PHC1 = 0 
       data hash MD5: 32K
       FD C4 9C 17 E6 8F DA D9 95 9F 4D 9D F6 18 E1 E4>)
(   4,<2016-04-16 16:58:15.579 -0700>,<Administrator>,<X>,<proc1d>,<TOPSPIN 2.1>,
      <abs ABSG = 1 
       data hash MD5: 32K
       78 93 BD 3B BC CA DD 9E F1 5A BB B3 21 A2 4B B5>)
(   5,<2016-04-16 16:58:15.642 -0700>,<Administrator>,<X>,<proc1d>,<TOPSPIN 2.1>,
      <abs ABSG = 2 
       data hash MD5: 32K
       DB 48 18 FE 1B 6F A0 3E 29 74 2B 4D A0 04 5F 45>)
(   6,<2016-04-16 16:58:15.704 -0700>,<Administrator>,<X>,<proc1d>,<TOPSPIN 2.1>,
      <abs ABSG = 3 
       data hash MD5: 32K
       01 6A 10 EB 26 11 B2 9C 55 86 0F D5 92 2C 08 A7>)
(   7,<2016-04-16 16:58:15.767 -0700>,<Administrator>,<X>,<proc1d>,<TOPSPIN 2.1>,
      <abs ABSG = 4 
       data hash MD5: 32K
       65 1B 5B 34 44 0F 2A 97 67 FF CD 10 97 2A 1E E8>)
(   8,<2016-04-16 16:58:15.829 -0700>,<Administrator>,<X>,<proc1d>,<TOPSPIN 2.1>,
      <abs ABSG = 5 
       data hash MD5: 32K
       96 B1 36 6F 7F 57 50 80 D4 2F 50 6B 1C 3E 73 D3>)
$$ ##END=
$$ 
$$ $$ hash MD5
$$ $$ BD 42 86 65 B5 FD 93 3F 0E E0 24 38 A0 E5 0C 3C
##$RELAX= 
##$RELAX= 
##$RELAX= 
##$RELAX= 
##$RELAX= 
##$RELAX= 
##$RELAX= 
$$ Bruker specific parameters
$$ --------------------------
##$DU= <E:\>
##$EXPNO= 10
##$NAME= <AC1762_NAR_8_9683283_WP7fWIg7G1>
##$PROCNO= 1
$$ [...]
##$TP= (0..7)
150 150 150 150 150 150 150 150
##$TP07= 0
##$TPNAME0= <>
##$TPNAME1= <>
##$TPNAME2= <>
##$TPNAME3= <>
##$TPNAME4= <>
##$TPNAME5= <>
##$TPNAME6= <>
##$TPNAME7= <>
##$TPOAL= (0..7)
0.5 0.5 0.5 0.5 0.5 0.5 0.5 0.5
##$TPOFFS= (0..7)
0 0 0 0 0 0 0 0
##$TUNHIN= 0
##$TUNHOUT= 0
##$TUNXOUT= 0
##$USERA1= <user>
##$USERA2= <user>
##$USERA3= <user>
##$USERA4= <user>
##$USERA5= <user>
##$V9= 5
##$VALIST= <valist>
##$VCLIST= <CCCCCCCCCCCCCCC>
##$VD= 0
##$VDLIST= <DDDDDDDDDDDDDDD>
##$VPLIST= <PPPPPPPPPPPPPPP>
##$VTLIST= <TTTTTTTTTTTTTTT>
##$WBST= 2048
##$WBSW= 25
##$XGAIN= (0..3)
0 0 0 0
##$XL= 0
##$YL= 0
##$YMAX_a= 570125
##$YMIN_a= -488536
##$ZGOPTNS= <>
##$ZL1= 120
##$ZL2= 120
##$ZL3= 120
##$ZL4= 120
##$ABSF1= 14.98509
##$ABSF2= -5.573092
##$ABSG= 5
##$ABSL= 3
##$ALPHA= 0
##$AQORDER= 0
##$ASSFAC= 0
##$ASSFACI= 0
##$ASSFACX= 0
##$ASSWID= 0
##$AUNMP= <proc_prof1d_extract_pilot.lims>
##$AXLEFT= 0
##$AXNAME= <>
##$AXNUC= <1H>
##$AXRIGHT= 0
##$AXTYPE= 0
##$AXUNIT= <>
##$AZFE= 0.1
##$AZFW= 0.1
##$BCFW= 0
##$BC_mod= 0
##$BYTORDP= 0
##$COROFFS= 0
##$CY= 15
##$DATMOD= 1
##$DC= 0
##$DFILT= <>
##$DTYPP= 0
##$F1P= 0
##$F2P= 0
##$FCOR= 0.5
##$FTSIZE= 32768
##$FT_mod= 6
##$GAMMA= 0
##$GB= 0
##$INTBC= 1
##$INTSCL= 1
##$ISEN= 128
##$LB= 0
##$LEV0= 0
##$LPBIN= 0
##$MAXI= 10000
##$MC2= 0
##$MEAN= 0
##$ME_mod= 0
##$MI= 0
##$NCOEF= 0
##$NC_proc= -8
##$NLEV= 6
##$NOISF1= 0
##$NOISF2= 0
##$NSP= 0
##$NTH_PI= 0
##$NZP= 0
##$OFFSET= 14.98509
##$PC= 1
##$PHC0= 91.94458
##$PHC1= 0
##$PH_mod= 1
##$PKNL= yes
##$PPARMOD= 0
##$PPDIAG= 0
##$PPIPTYP= 0
##$PPMPNUM= 2147483647
##$PPRESOL= 1
##$PSCAL= 4
##$PSIGN= 0
##$PYNMP= <proc.py>
##$REVERSE= no
##$SF= 400.02
##$SI= 32768
##$SIGF1= 0
##$SIGF2= 0
##$SINO= 400
##$SIOLD= 32768
##$SPECTYP= <>
##$SREGLST= <1H.CDCl3>
##$SSB= 0
##$STSI= 32768
##$STSR= 0
##$SW_p= 8223.68421052631
##$SYMM= 0
##$S_DEV= 0
##$TDeff= 65536
##$TDoff= 0
##$TI= <>
##$TILT= no
##$TM1= 0
##$TM2= 0
##$TOPLEV= 0
##$USERP1= <user>
##$USERP2= <user>
##$USERP3= <user>
##$USERP4= <user>
##$USERP5= <user>
##$WDW= 1
##$XDIM= 32768
##$YMAX_p= 435106965
##$YMIN_p= -747236
##$CURPLOT= <Network HP LaserJet P1505>
##$CURPRIN= <$Network HP LaserJet P1505>
##$DFORMAT= <normdp>
##$LAYOUT= <+/1D_H.xwp>
##$LFORMAT= <normlp>
##$PFORMAT= <normpl>
##$SURQMSG= 1
$$ End of Bruker specific parameters
$$ ---------------------------------
##NTUPLES= NMR SPECTRUM
##VAR_NAME=  FREQUENCY,     SPECTRUM/REAL,   SPECTRUM/IMAG
##SYMBOL=    X,             R,               I
##VAR_TYPE=  INDEPENDENT,   DEPENDENT,       DEPENDENT
##VAR_FORM=  AFFN,          ASDF,            ASDF
##VAR_DIM=   32768,         32768,           32768
##UNITS=     HZ,            ARBITRARY UNITS, ARBITRARY UNITS
##FACTOR=    0.250966925370066, 1,           1
##FIRST=     8223.43324360094, 76829,        239254
##LAST=      0,             116112,          30897
##MIN=       0,             -747236,         0
##MAX=       8223.43324360094, 435106965,    0
$$ Real data points
##PAGE= N=1
##DATA TABLE= (X++(R..R)), XYDATA
$$ [...]
23892 -51903 -173542 50385 -93433 356029 30185 -123367 171559 121006 -219534 -80332 85553
23880 185068 -177034 -50398 -133917 6523 28586 2308 -87195 46646 -152823 -344413 -276044
23869 -276044 260368 18062 -199857 173163 -130384 -170779 7438 56749 -161318 -179721 95853
23857 -61669 331953 -67566 -68444 -108514 -139685 204517 249130 161805 156318 201196 -97861 126721
23844 164815 -511262 -39259 38128 -36110 221023 -31108 -295037 88204 -127617 -51261 66955
23832 -349082 -278784 436112 -90433 -157965 -20532 -34863 -258105 -207902 -134002 -123670 -157792
23821 -157792 56884 181665 -21791 -246385 95750 77665 156905 -11766 -173937 -155508 -82285
23810 -82285 268251 -117252 -283191 291286 89275 -124163 213934 -15953 308138 323590
23800 323590 -51386 -81472 -102030 -47630 -151935 -52733 197237 98559 -65371 -70049 297942
23788 -287869 -99451 65333 180906 -125733 256631 -230013 -40742 124598 -53158 384429
23777 -61395 117018 -127033 -193205 -59058 175882 64768 188653 -149891 106869 -275481
23766 103772 -30091 86255 -102199 81732 101038 -46914 -94291 -198582 142053 -172974 556271
23754 -98234 -16673 -151387 -174716 -206705 -184722 -221483 279671 273780 29656 55260 76792
23743 76792 -69290 77044 -181096 -177833 -213716 -237227 -105127 272091 -42898 9825 196177
23732 196177 154747 256205 328535 101506 49571 -107272 7991 -224698 449470 48100 51816
23721 51816 260638 9445 -127159 35903 45119 22233 133729 158644 66224 -238773 -204668
23710 -204668 -293451 -164548 -290348 127908 55419 110453 -83114 154494 -28390 8153 -256126
23698 314101 243841 -204969 116738 -246175 -147335 181877 -23480 211280 56174 -162917
23687 136110 91060 -183972 229911 -3336 -13238 185062 -140266 -133405 168575 -137812 -84314
23676 -84314 118115 -7603 -73128 94482 73426 -142875 -298063 -213599 -45737 39257 -111032
23664 -539570 -262444 196960 221013 -25757 64321 -80352 95235 -214199 -196407 -89743 84692
23652 -266283 72368 403369 323145 -192376 -68014 155636 45643 234052 142483 197328 93190
23640 12560 102985 -16526 53041 -72774 -12216 -142864 -59074 -50569 -13164 -45755 -67677 36646
23627 -151634 -224525 74891 144002 55112 146244 -19394 -76395 175983 91801 160813 105929
23616 105929 -107700 278634 11325 -115520 -17799 51191 -61286 -174093 -179142 30149 76909
23605 76909 134009 -126105 410152 199689 -2499 200148 173434 -22758 -70024 -123796 -230079
23594 -230079 35618 137458 11601 -346875 -140291 355276 -66653 -59923 145498 -141990
23583 174784 -105953 20588 134313 93351 -116795 -86621 114030 68722 -146761 83681
23572 -170024 -297565 103274 90574 -101424 -151161 118893 123627 -35937 153124 -43795 152322
23560 -152195 136584 -112551 239722 2061 -28304 21349 41567 -158516 -11323 86518 -243306
23548 8589 186280 -14143 19683 -114321 214241 680097 7376 25971 -100925 195861 121884
23537 121884 97414 -77282 104856 -353776 -107299 -172188 -100546 108321 121054 -63181 18283
23525 -248820 665 -93253 -179593 133780 52923 -348947 -49479 180977 -178349 -130978 20970
23513 -250588 166993 -96198 -211246 -90863 36288 -267894 -200917 8481 -67654 83354 -103500
23501 4629 -6374 -117345 146421 18426 76622 -110802 -36558 -269134 134677 346585 399669
23490 399669 195957 4634 -155028 -46992 134074 -120801 -311418 -300727 323981 -102836
23479 -77430 -236544 -177643 -279513 1278 93724 -210755 -75910 -68536 -35811 -97840 -119962
23468 -119962 -204283 37755 21671 -125899 165616 330297 147105 -1734 -51815 -26578 178158
23456 -32306 -345168 204043 114578 -144585 140469 -61562 153457 -311766 140858 -62536
23445 208228 -93863 -118197 195070 -210377 -20340 -188907 -29889 2730 -193774 -66740 333728
23433 -135972 -368860 -190759 -89007 -191190 -29153 89799 -351895 -11046 174390 242275
23423 242275 -375277 -88165 -196312 182901 179015 -89913 295066 -224383 59272 -246833
23412 42455 199960 -51361 -92589 105155 -38769 -307235 -213485 108506 67200 -59261 -17814
23400 85521 -36809 348492 -315448 373069 -460677 -5529 -132620 -95227 -90784 113914 52032
23388 120497 -24055 -255274 -234755 -290155 57388 138548 59686 -144342 -81782 69536 -42197
23376 -74052 -124905 49843 -108119 -131146 -44112 -48613 -199847 382351 158186 -47365 -75088
23365 -75088 -82308 -98957 7601 51363 -92283 191423 -24227 -297721 -208757 4420 28891 -110313
23352 -165831 -96209 -71062 -131470 -162598 62958 211468 -138684 203696 37430 28520 164313
23341 164313 -68459 9660 -132665 18039 373 -26069 -53150 -93906 97940 -234962 205713
23329 -227069 -181483 112560 -228716 -36924 26466 -123661 37050 221407 297181 -107347
23318 -205825 37201 275714 -105461 -186078 -63742 -17653 -259537 74107 -319488 3730 -314710
23306 -103508 111194 212171 -52132 -12202 -130452 -43839 -129324 -117660 -183395 -33566 183237
23294 -180140 64206 -136464 109323 234840 -96220 18974 -114551 -326091 -118257 -397228
23284 -397228 188019 -374247 -140626 -206641 -37987 -131642 133585 171850 -170603 216452
23273 115200 -188 134484 -1301 -191470 -33952 -341180 -150340 232217 60672 108869 302336
23262 302336 -77687 -30094 -23619 545861 -143516 -228816 211453 86575 126731 -191375 -144648
23251 -144648 445274 -8166 34520 -86739 209372 -304225 -212837 -54886 125070 132480 21616
23239 -265931 -242803 -26047 -94899 -230949 -192852 -36735 284304 -228423 96985 -121087 -1878
23227 -158752 351246 63199 -321696 -8850 331560 -71187 -372407 -340639 -75712 -51107 -50277
23216 -50277 -73416 -162144 -72200 -217710 -62236 71846 114302 96889 -187918 -61791 -96321
23205 -96321 229197 -232951 120932 -29149 -15211 127426 14684 -255315 240337 149109
23195 149109 14184 -111754 -90147 -24513 72481 -38144 -13402 -345938 -38834 84515 -41895
23183 36563 -111242 -56288 -12291 -349791 -219804 209762 -37823 65341 96783 -124534 136883
23171 51023 69570 21119 -149764 169918 -95355 -74228 98626 138099 -477411 114155 -175974
23159 -329418 123760 -41176 -52352 -332046 51454 -159628 139290 -8369 -256978 212125
23148 -10474 -445 314923 -260437 -86516 26666 -38021 93317 174397 6523 -15283 77530 -144944
23135 -66814 -149747 331339 164454 -68398 80213 170527 -157125 -73515 164359 -55741 68440
23123 -76594 236170 -257224 196249 84593 60618 -354249 -118789 25864 -387053 -63364
23112 -189784 144401 -343716 200356 178862 135975 17923 -108321 -35783 10390 9946 -155156
23100 338846 -59237 -151025 -292017 -177029 246979 119378 374870 30647 -95185 90624
23089 -344860 -67049 80171 -245689 -98158 156889 380796 -91698 -100205 -83411 -312032 81122
23077 -85998 160463 -599383 -148893 69993 -101377 -20595 110178 97188 -395950 197330
23066 174055 -178448 138996 -142456 494637 -5796 49944 99144 -205957 26566 -148811
23055 -136197 69772 465381 -40931 -188086 5443 224194 38349 19547 -191806 41078 155899
23044 155899 150101 50984 -17819 -243134 -165742 -65706 165114 -21631 -22165 -145054 5792 66092
23032 66092 83742 76701 -24147 -234409 221665 -106975 -175630 77 56641 48120 -173969 4105
23019 -314721 -340660 83893 5251 38005 21824 232337 44988 81617 185840 -102750 14671
23007 -165363 -341714 129998 189602 121712 162366 -102931 -151531 -329043 100431 80235
22997 80235 78867 -34746 317432 -380467 431586 -107410 -173436 152338 -163235 -118490 138539
22985 -59603 186731 -26422 -14806 137303 -139302 -80829 141891 119690 -39905 -220733 -208733
22974 -208733 -161217 -123868 252 -96126 -206426 -43 16424 -230664 -12427 109411 2436 98542
22962 98542 -109084 61704 -102481 -86021 -38005 59978 277834 -163553 182431 38396 -18780
22950 -98458 -206330 -167286 -450809 -33924 133432 -59387 16029 -20848 384960 190731 85252
22938 -276678 68038 -13093 -28091 -134970 64736 93002 -233159 -36138 128410 122900 251760
22927 251760 -113335 74625 -141130 134547 172487 -98942 36207 -46209 -219980 13126 241923
22916 241923 -178466 171347 435233 16978 -6015 73545 -261641 186928 192925 -301676 -86827
22904 8585 27798 9811 -60456 -52305 -51909 189693 286031 83053 -166832 -236411 -99431 60743
22891 131744 175470 -19017 16636 -227940 100856 247800 149081 189034 -399867 126577
22880 -35239 -11062 -82171 -221352 -197300 83044 115338 -234877 245809 -139074 191520 -12101
22868 -67986 -110028 79974 138296 -51061 -242241 -128558 -20339 -401875 385474 2842 -193594
22856 190134 86038 -14154 27049 -47839 -111315 -94200 -80150 -95277 -110679 -351897 -126945
22844 -76604 -234742 28821 80321 91140 29002 -165119 -71949 172278 -71551 111642 36079
22832 108650 92817 -82571 208426 -85091 -100603 -46307 -126618 121630 243288 -6828 -65493
22821 -65493 76821 124862 -161051 -45845 -259790 107802 51203 -5613 105638 -112684 -45277
22809 -376398 -174690 79021 88559 -174993 -65172 219440 -119164 -155538 -207266 -53342 -182956
22798 -182956 192728 -5514 25832 306971 -395836 -38182 -157968 -35978 -42202 -107793 -85377
22787 -85377 -3988 153417 270223 -29681 -114929 -156259 186538 231359 34572 356591 95397
22775 232910 -267439 -196537 -157821 139748 70598 -226331 -230771 -85429 -194786 -88644 -159590
22764 -159590 -5806 156327 205324 -169672 -50270 -130960 66728 -50348 -40240 150291 32838
22752 -239296 -148954 -224463 54811 -413944 -9565 -175633 156724 -216996 -97781 61251 -231217
22740 175704 -177321 -386105 -33768 110606 -78093 -104056 -151614 -205117 -90228 -94564 -224121
22729 -224121 234585 -133047 -288111 -162683 -204414 -136730 -14756 -39212 63652 35905 337078
22718 337078 119388 -235492 -116670 -178555 -158170 -97562 -192725 -221385 -15375 -304853 134290
22706 -156575 -29226 -104694 -127153 234605 -86125 -33775 -54231 -122515 -86299 -101762 -310674
22695 -310674 -185276 -301584 -355782 -133976 108685 1242 -8336 -153022 137290 6849 -187437
22683 212373 277402 23779 -117725 20689 -307908 -22059 -33947 -53774 -239797 50112 4886
22671 -45212 -93940 -488220 -68810 242960 -90384 67300 -24174 154078 -9660 -317776 173632
22659 161020 19634 190533 50588 -118313 -6593 -308468 -314190 -1164 -118123 -81166 76285
22647 52669 -47255 -276816 97307 -16736 47137 5610 -38144 69347 95339 -183179 -200218
22636 -200218 -22524 76200 88357 -155017 -47499 -337286 183071 192269 -183581 -27780 -36923
22625 -36923 128561 12874 -118637 86287 134260 -10188 84602 102564 72101 184981 -420885
22613 -297716 52725 407724 115483 -234811 -244332 -156245 -92492 45783 -115288 -11999 117200
22601 281095 -179253 297952 25476 -99867 -142910 63980 -152282 75280 78889 154112 86034
22590 86034 158453 -132539 -426262 -278142 -69195 114400 25461 75275 143139 36372 84942
22579 84942 -120234 139632 -214702 -94536 -236390 36998 -252990 75808 -349612 -137230
22568 99215 -45865 178333 -57714 -134518 261477 -11201 253670 63208 -53396 -315932 103385
22556 82191 289571 -29984 66849 105923 90605 -24414 -217790 -119617 -21159 -80009 21784
22544 83665 162854 -151129 21348 230809 106214 298536 29089 72816 -44824 -249253 74284
22532 -6146 157191 -148442 -103585 -291256 6553 -177518 -99580 -71746 -91086 -241558 162443
22520 -154108 -10095 130286 138929 65354 -45617 12974 -113726 137914 -242339 -129649 -43260
22508 30226 120914 -12282 7212 -7741 114917 167710 100050 78250 22016 174183 159829 173502
22496 173502 18253 -115624 -161510 -235458 -181862 -66962 -125886 -149697 -67678 309243 -67034
22484 -36959 46136 14376 -124430 135612 266491 -217164 28151 -418116 -45457 224550
22473 -245392 -89109 237137 -158278 -130363 -197772 -84426 -8076 -325098 112626 159428 -380783
22461 33315 -390690 64596 132838 -115174 67099 28297 -36165 61080 93 2871 216589 -374914
22448 -122852 -190280 212748 -1392 168011 31638 124969 -216386 -60252 48624 -220864 -185849
22437 -185849 -266879 -162052 54220 1690 219354 -25232 -21218 29818 -386966 -59972 425 71215
22425 71215 170177 -34266 -215171 -10977 8885 -58720 261269 -192562 -287954 -66772 103300
22413 -39356 -10587 11037 73927 -250271 122506 -88994 -139778 -236734 -245631 -96231 -29124
22401 207546 -142815 -65859 -186767 -75325 -158127 410988 -46388 73191 285011 -173355
22390 -228227 41240 43416 29345 67664 -258120 384479 -153412 164247 -79348 40383 95260
22379 95260 -17349 -66296 -202559 -52186 -36494 -85679 -270511 66423 78916 -371011 50371
22367 -86900 65534 72920 -135125 320852 -296287 -44012 -506 58278 -43572 5149 86466 -197867
22354 -68672 -74821 -108388 -310462 28114 338988 175834 -49928 -78853 -83756 83662 -29940
22342 160071 -87483 -144222 80040 -303896 281803 32749 112446 -92608 60743 -122501 114456
22330 86967 -138413 -50833 -171106 128279 -17611 -171435 -53147 99622 47324 21807 -282169
22318 -117205 -139813 -184886 -230111 108332 34829 -62705 18946 -141922 -345990 -239452 -181066
22307 -181066 -39816 -12388 -425654 -176698 34786 137991 -86036 84993 -117294 -385162
22297 -385162 30451 -288529 157389 173737 -34499 158545 174676 -76322 -7214 -273877 78671
22285 154723 -71071 -120356 85613 21193 247100 -155811 12766 155786 -272734 -333637 -234494
22274 -234494 -370569 111890 76185 75202 -85702 -336636 -203347 -292166 -41665 -99272 -74567
22263 -74567 -44845 19714 -46259 -400655 -163618 -63863 44130 -45807 -107664 -164117 -243237
22252 -243237 49075 -89966 128311 -257210 22376 -140715 -99352 3620 116072 254041 74915
22240 138922 -88598 58299 140726 183036 -16897 -395147 -110659 49647 -67009 -348597 -122131
22228 311186 -210872 -341952 220916 -144133 66695 -12603 94840 -10438 -215719 -209281 56911
22216 -4348 27859 -76534 55779 -33622 -46826 -130106 -170999 151562 -60158 72915 -64198 310467
22203 -129359 -98197 40980 103546 -83083 -163217 103214 -280173 -56971 138128 -157152 -108667
22192 -108667 371911 24574 -186721 551158 -129971 111457 464171 -173457 -216722 -6051
22181 127878 58369 49848 209816 -14349 56847 84098 216909 50503 174042 582 -254515
22169 216785 12459 -93204 33349 45010 -41586 -165802 -2012 -79509 -296680 69326 -231 -103142
22157 -103142 -192033 -135466 -198111 182638 -206119 -84940 -239210 91524 -186880 168531
22146 106969 35088 276149 233762 294999 -67659 176613 32709 -1180 -359389 -18619 -239536
22135 -239536 -45291 92186 279325 -10572 -403268 -74046 123381 -14030 -323403 -128706
22124 -376679 -278642 -142539 99411 109419 -201894 -198802 -77055 -140450 171713 40836 175252
22113 175252 253934 -30708 46491 96865 -279858 -402651 -8808 -156712 336713 -87009 166902
22101 112309 -173478 -11933 -470212 -35644 276221 115355 -67567 143786 -125620 -140332
22091 -140332 -175208 -272095 58890 -126756 -7925 24533 18673 63721 -21897 88304 -47262 57055
22078 -28100 -29942 18724 -250913 -22945 -89591 21064 117715 -122075 -60989 -121076 215030
22066 -234115 -146139 -169152 -145834 -112074 -30795 -100498 -265850 35607 -108756 139116 18345
22054 -159777 -256260 -39209 -5522 212250 161516 -69288 131456 -122888 -144907 -281928 -114920
22042 -279205 43308 42084 -32298 43817 309473 -11143 -127510 8422 -398990 215819 184896
22031 184896 -40294 245224 -145810 -332656 -143101 180113 79238 8153 -238170 -168423
22021 -168423 -284027 64730 -55037 -26763 -172969 -44431 76519 -3375 74100 -80339 -129978
22010 -129978 112047 -377196 -202753 -117945 -127778 -29560 12648 152711 -348145 94139 94431
21999 94431 97298 -298588 53272 20982 -54401 -286761 -120448 66639 -39908 -450887 120467
21987 -92672 -61005 1609 -149890 147147 -74755 -180639 -190433 -292907 151824 -173679 217884
21975 534637 -11585 62016 117416 105837 -238824 61438 64396 173884 -139707 126484 25823
21963 6867 68077 -316190 -178825 -258958 58726 -18947 34221 338023 48243 -179897 -183147
21952 -183147 -280109 34549 -78494 -48197 79610 -221011 -58756 186482 -264543 155727 32013
21940 271287 311494 -77570 -114372 -27741 -211491 -301582 60586 -4279 -83378 -78354 -187630
21929 -187630 249594 -149269 227932 100656 -13305 -259940 -221068 178825 -26101 105394
21918 275070 -166770 -163402 -135870 -102618 -159230 -50989 -161774 150287 -102500 38048 -104815
21906 -105103 -116416 214643 -21391 -60345 -344891 -122684 227217 32881 -11845 -52382 -18625
21894 259750 -6469 -312348 204069 44659 -43586 63195 186412 82600 -14820 -85413 -259444
21883 -259444 -58706 478336 67167 65668 -271339 -201430 -350889 -281221 -103110 69206 85746
21872 85746 -256485 -311788 103538 -37105 302437 -69245 32264 115186 111007 -1305 -51722
21861 -51722 72148 -78308 67516 -138948 -118870 101398 -69275 39345 -386467 -124319 68935
21849 36242 -268235 169002 -391607 409430 -67497 -43538 -101290 -127109 44341 -376872 182656
21837 360288 -252035 -62098 219200 -234158 72211 -264961 -182200 -158967 -200098 -144220 -53469
21825 -125598 41872 50921 177215 153022 -102506 -158684 -81972 364881 -184091 -145546 -120923
21814 -120923 -106069 -100918 -108186 -135045 -57294 209508 39250 -52523 -97942 -92042 154242 180747
21802 180747 -182720 236981 -50179 40037 -21475 -223056 -293627 135471 -25925 -16366 -65793
21791 -65793 -185709 -126978 90735 136615 -57907 -91527 42344 -323008 -132601 182360 -256434
21779 -138606 62483 -112258 -251614 89892 168773 165071 40067 -133986 -321375 -141244 53312
21767 199198 -253780 10376 94922 -232471 -110761 170453 -27137 35020 95591 -25528 -18984
21756 -18984 -73058 101124 -25018 -334079 -49366 -97028 156511 -196073 -170032 -208347 -27465
21744 66491 91893 171666 121041 139998 -12339 -48873 -99491 180841 -307726 280100 -2303
21732 -198097 -216500 -322764 360535 67317 278804 22394 -135709 -307199 -133958 -5984
21721 -234347 53713 -90094 -21217 30970 -130807 49510 -38005 -54845 139657 -214342 171688
21709 -203305 137190 115006 -83837 192332 1145 122376 80056 -25289 -243109 -152808 19085
21697 -88201 35574 134162 -276529 9294 -107251 -145756 -68101 -210394 19120 -99892 -216835
21686 -216835 -32809 -5910 172111 232919 -261509 69052 6469 -207936 -200404 64496 -193610
21674 64223 -7911 -112173 -37569 -367202 -242480 159505 288595 -16322 47919 -121601 21031
21662 160248 136830 277332 72942 283777 -40218 -111926 102495 300926 -166577 -132149
21652 -132149 109827 72145 -141599 -151497 -225434 -132445 32530 -225345 19460 -334360 -128675
21640 -117326 7923 -147660 125291 -130100 152701 -236363 -192729 -317720 -215496 -101624
21629 -27487 -47223 -34124 80131 176721 -136672 100281 -113232 -239286 221857 22557 -30498
21617 171367 -302137 -50949 -69259 -535836 -56683 -12775 -124027 22875 -11304 -148888 -218415
21606 -218415 402581 -248012 -132581 149243 -131103 124715 -111237 -112036 -356959 -246212
21596 -246212 -117841 -463275 151931 -215304 -96725 -163854 97350 -77284 20009 90865 -224109
21584 -109188 27575 -233175 57425 -156118 282366 -190295 -90197 66499 373988 -280828
21573 -91649 101317 143815 124247 -17576 61771 -446125 -130215 -74734 17866 134477 -72337
21561 235884 -153066 -148583 -3546 42317 -59011 114882 -333435 -463613 153824 -160281 13529
21549 -201417 187253 112880 124893 -70676 -210079 239080 164296 -68159 335929 -279777
21538 205072 187972 116194 205342 -173201 -319814 -186888 128087 101087 265491 -334488
21527 196824 -27813 199702 -234239 -304333 15563 -101094 -7267 -246398 207849 -251271
21516 74295 5303 -121407 -312982 -18180 -193205 179781 162685 -235373 17903 109712 -490471
21504 -881 107433 121574 118693 50367 -224139 -156574 -35986 -38415 84424 -353863 90096 -122791
21491 110734 -6787 123235 -162121 161717 -2147 -17859 -240221 -42487 152384 -245770 -1131
21479 -168090 -337798 339719 -223964 -38325 -221770 235077 118181 -170127 420669 -14949
21468 331325 -50599 71109 -12818 -10247 -44104 -794 -132492 -42863 50915 -177021 -386923
21457 -386923 192335 241694 169026 -168062 -36546 -238338 138678 217271 -232854 -11373
21446 189772 54906 17296 -160285 -78937 42397 97606 161633 181171 121493 -62025 272999
21434 197563 -151754 -60239 -27158 16476 -44577 3128 108638 -6398 253806 -1721 -134870
21423 -134870 -28174 -361434 -272814 -130956 -217149 -570963 -95080 -90692 12477 173198 77866
21411 -87035 -47675 -64491 -106325 -228783 -397618 -58010 -188209 -380462 -10301 -67243 -93088
21400 -93088 14968 117945 79115 59088 -39920 -86555 -174471 195556 -118234 -187418 -27856
21388 -56191 12685 -442653 43153 -32122 -49734 121746 -229410 -183815 71948 64418 -180331
21376 44454 -12388 -218631 96772 -207991 162354 -137872 -48035 56129 17823 533 -267716
21364 -79749 106131 11649 -61978 245249 220141 -8519 294966 -43388 -44464 -111608 147508
21352 -112885 -81774 -83024 -199468 -155447 3866 -144940 -93144 127609 -110776 -330350 -72431
21340 -106601 -179594 -23985 -174620 182469 251288 -155027 -231436 -143398 237731 -190759
21329 -22192 -205637 115453 -31817 8477 95600 69123 225972 -130386 -310028 195366 -216101
21317 -112263 10316 79957 -165945 -295333 -227804 -44148 65032 32380 66603 -247961 -91370
21305 -166795 44238 18929 -143057 237727 10982 -67565 -40816 -199227 131090 -87647 53704
21293 -17331 59265 7394 -9724 -310299 35463 -32474 -67099 -63590 -254931 -18515 46914 -186567
21280 -39697 -270529 -32091 109107 -187655 -230380 -69599 92604 52939 -80268 -46263 -222665
21269 -222665 -164418 -4123 17686 -160240 -252931 -2424 -179744 187687 186606 -389199 94026
21257 129730 135457 -7749 -242594 -119082 93276 28142 -260857 -325212 176536 -40345 45831
21245 -155919 33115 172581 -416377 -6687 129677 -109047 -74635 -1285 -13770 -179797 -4911
21233 182153 -69043 -64326 -38654 -167116 -198508 170178 -16964 -191262 51095 222816 168274
21222 168274 65271 86962 -57569 335579 4167 14420 -944 -219749 -87592 -198664 -172600
21211 -172600 -227730 -53732 164450 349291 119534 -175549 -169727 -14515 77782 -87823 172676
21199 -35407 -139669 -11904 -78881 56678 80077 -14578 -226802 60980 -41790 60319 -189958
21187 -325458 -391740 -307700 -51286 62364 -330881 27379 49298 33254 -131380 -304968 64000
21175 -11414 -193341 145428 -36729 -91676 -103146 -41481 -188008 -46629 100334 35427 -2610
21163 -187368 181087 -167446 -138166 261001 34936 -21510 -203938 -153415 -74851 -156673 -97091
21152 -97091 88047 171524 -157732 104744 333783 185467 95237 7759 68795 -187574 -309986
21141 -309986 -261452 -460919 -163425 -219218 47955 -95534 85249 -293432 69573 -142916 39274
21129 183380 -297790 299321 -110433 -265293 53327 289118 163083 -117787 -163910 53140
21118 -156670 -77578 25552 49143 12100 76582 -70864 380276 -107502 -77306 -182323 -175503
21107 -175503 -54803 342040 -380822 -224901 174337 -611991 -312203 74803 -58793 -70745
21097 -70745 -140795 -1041 -263549 -91457 -32447 -1108 42932 -76910 -176371 -327378 379062
21085 -191752 -55449 -4486 -452762 6132 -128619 292692 309200 4435 156743 -23132 -19516
21074 -19516 17300 -181208 36327 186802 -31525 256145 -167982 275504 52651 -115491
21063 -248800 203439 -417543 243022 -48487 71669 142769 -38557 -107761 -47151 64993 6816
21051 165255 8541 -10962 1970 -135053 64586 -99914 103049 -18428 -198958 -23676 -12399
21040 -12399 70236 120310 -107161 100703 -167881 -91424 -614369 154440 76955 10162 39921
21029 39921 236170 12030 299246 132832 -42241 -219247 247681 109624 46974 237998
21019 237998 243993 -28639 -355457 -96089 -52340 -99382 160994 52417 -92064 145752 -194139
21007 6212 -168502 35882 -209962 -271422 -74062 -39603 -206936 -135788 -24675 65450 -310232
20995 103995 -330829 -271749 -93129 75400 -132200 -141387 -647046 -170883 -131520 -226927 11382
20983 -50215 -170988 75561 -239556 165797 -245601 -57337 49215 -258202 169174 177520 -108178
20971 -34129 -32197 -139548 -80472 36091 -156838 247591 -101085 86129 -41911 353943 -89030
20959 84801 -239601 7167 -179919 -139915 -60192 182664 120367 302853 183022 116680 -55747
20947 -223512 -21432 -49054 -80823 227072 362220 88402 -151950 -37040 57603 -49366 -137061
20936 -137061 -149210 -145048 -218575 240971 67284 -30500 -67254 -281456 -210795 -81874 -108421
20925 -108421 2365 86569 -212347 -73995 25040 -160225 280151 -77031 39567 -339287 2372
20913 -5723 -171623 144589 298687 146974 75608 -72290 36639 -15894 -173588 26218 -274057
20901 -141121 -186084 88538 -137635 -170107 20596 36950 -501288 108359 -282595 50631 122498
20890 122498 66825 -250097 42108 80910 -60379 -252657 19139 -36630 -62353 -108781 -144164
20879 -144164 64861 52452 -96112 -308744 76332 -231164 -1206 128186 302337 52086 23726
20867 167476 27838 -203721 -139863 96213 -390657 -39688 -85596 155922 -35064 -329119 40918
20855 -250958 -433822 -241776 2283 -53896 -11009 -105130 -213558 -60810 -20436 -65399 -62913
20844 -62913 -219951 333049 -238372 -63303 -160201 130557 -84249 -7236 -291734 124633 -169079
20832 63451 -16855 239220 -73629 134981 51084 -132881 220547 -165799 82764 -48133 -120482
20821 -120482 6579 -121830 -191965 -85801 -40338 2980 -10690 -273851 59505 -295405 119000
20809 -31783 -124189 -471684 -64894 -147488 -154708 -16133 -397732 80200 -48735 90901 -263573
20797 57734 7961 -67118 -21489 38988 54478 -139276 74714 -69224 190429 -120357 -14297
20785 -76236 119457 -9286 25069 -306781 -265102 -106522 146181 -7271 -122642 147425 138489
20774 138489 -66327 -8834 10414 -47722 -97368 100091 122150 -128594 -169225 -313518 30730
20762 -578195 -57026 54784 -217054 -86785 91345 56918 108198 140249 60262 -178957 -298285
20751 -298285 36255 45853 65857 -38949 137351 191313 -103482 -98258 64972 -261005 151212
20739 -239033 120233 -242717 -120693 -43373 19103 162043 -26514 150538 -162487 -58372
20728 60846 211789 34952 103589 -236378 231736 -23914 -367682 91954 -130139 30254 -330119
20716 120009 -21198 -62767 285368 -238105 -179611 121070 -214331 36733 -396657 -250342
20706 -250342 102496 -224810 -155928 -358512 -463665 28074 -160903 -95835 -20532 67934
20695 -186073 -62988 -230607 -127208 -155696 -105204 -294085 4240 -349304 -58394 172114 -174822
20683 89221 -18491 177008 235508 -395004 75546 -104837 -349730 -111196 125478 -164016
20672 -278416 85553 -156348 -248952 22225 -280797 -279454 -178483 126599 119320 -199505 -71462
20660 -34573 -214205 -115785 150687 11805 -102046 41517 132971 50523 209194 -167083 -323321
20649 -323321 -81695 105763 -100500 201113 120966 -150774 -92349 -143299 -98376 -178913 -211908
20638 -211908 88260 -240019 133970 -522501 -171417 43126 -273343 -45474 17095 -207422
20627 -160340 -41421 -233200 162895 105837 85908 -24555 78552 -40465 41212 92349 43826
20615 -15507 138346 -56337 -145816 77388 185626 98873 -261501 209289 150177 -136037 42458
20603 85095 -891 -177725 63859 -6411 327478 160349 -454424 65960 -164857 77848 -142295
20591 -416954 -111031 75507 129455 -181564 13096 -62403 -16474 -123559 409680 -160852
20580 -15828 -8529 -25612 262370 162578 -238191 -83098 -195119 -111884 -106845 -35900 78806
20568 212727 11743 -41111 -18431 -297658 75721 93187 -111757 -412795 -146920 -95799 85005
20556 -226057 -123376 -37207 -422961 -82534 -69618 -111862 146385 -99170 -19422 -412760 17649
20544 -193653 33296 -31398 -28177 105575 -59684 128327 -121149 -38737 228801 -204286 141352
20532 171785 11813 -157879 78828 72649 -20168 -163767 70985 130106 -278498 59537 15781
20520 -122071 -58087 65518 -6405 -137458 -263404 -47355 -78495 -91766 223841 167876 179577
20509 179577 -104847 2866 -158946 -143647 -47792 -60849 -278324 292044 -72328 -17193 -81715
20498 -81715 -186330 -254247 146242 228457 17456 -10764 75261 -395505 108070 -125134 -64452
20487 -64452 -482784 -41678 210258 115068 -206046 -442156 -119969 29679 74974 -16678 8044
20475 -19779 96259 249057 -20368 -62593 32875 -93449 -198284 -189037 -80010 58258 -293780
20463 -241330 -15270 54459 146037 -308108 -108182 117754 107089 347505 214760 -78844
20452 52142 -18274 181267 28930 -163884 21742 27790 55275 -113668 -84124 -202769 -155364
20441 -155364 60127 132605 -130203 10444 98504 120984 282251 -109120 -5733 88550 -90851
20429 -56694 459747 -273392 -75433 -232404 252523 -232308 -176209 4967 -182630 -27695 200133
20417 24573 -293212 2868 308421 15494 -124323 198467 -80382 -43116 -114134 -15790 118290
20405 -16827 11729 -301999 45381 -189681 -13986 155336 109742 109887 -62283 -177454 -425794
20394 -425794 3494 -116234 218932 76876 -227825 -296743 -192569 301276 112319 -99907
20383 133261 197633 -129845 -196900 4844 -5634 104955 93123 -295976 -168345 -42677 -154669
20372 -154669 -182142 236530 66235 -153741 -8073 -297535 -50034 -168464 -17006 269174 -41189
20360 -295457 76443 -172431 -110589 23378 -146382 -140300 -3937 -248549 -255999 -246353 -212091 -113778
20348 -113778 -164557 54904 -80926 211147 -82667 -84653 307151 4009 8748 -84526 105925
20336 36944 316252 227324 25625 -171946 -132148 -179248 -142669 60913 -63391 111781 19648
20324 -89141 -150111 75300 96467 -259417 -138028 89450 -55357 -174295 104924 -216037 -367779
20313 -367779 -371685 -424487 114581 -158620 325555 135482 246112 146231 -226974 -118637
20303 -118637 -107655 -69521 171065 -204907 152195 -120431 -225263 15494 68011 20804
20292 133959 -26024 -84810 -195492 -148306 43013 -110262 -234216 -97588 -105477 47365 -25878
20280 -124366 191815 -112059 261453 -274025 199883 129656 -94113 20953 9293 98542 -59825
20268 16866 -401892 239599 210557 -79933 -100998 199214 -110756 118335 95233 118045 132819
20257 132819 -5618 -20832 131167 133482 -60986 -111442 -228543 -16378 267601 -251350 -218252
20246 -218252 -238561 -67064 -63142 -61810 -389525 384417 28109 -148630 -14757 -33983 77057
20234 -124325 -132002 95897 -190091 -139667 -69039 -254410 22251 32024 331449 280471 -169423
20222 -188835 -94370 207657 73869 -338849 -30654 -89210 5226 143068 -181335 160613 83408
20211 83408 36791 -217306 320432 -198128 -78240 -124 -2207 -107059 -87125 167256 -100149
20199 -204235 70189 63935 324561 -142082 -176332 -388211 25888 -135060 -410871 81631 -105260
20187 -214966 -265887 223656 34408 -63263 -351178 -91898 -168936 152794 -60040 -18808 -50425
20176 -50425 35491 145721 17861 -351776 -214971 16577 -163850 -22173 273316 -146630
20165 -216336 -41971 108412 -196708 -29878 -304782 231280 200253 -745 -171258 -175721 133285
20153 -164055 139001 -99825 -110824 114886 -178200 -60660 61232 -96736 -48891 77801 -107908
20141 -272471 -57277 183898 -176407 9337 -110290 -38779 110262 -10154 -296631 480244
20130 239156 -375578 190085 -80888 -74634 -241424 74690 57412 -181193 -26967 -7135 50209
20118 123517 -77985 28557 -945 14132 -76986 62108 36575 -228563 -153390 -56307 -24733 -59773
20106 -59773 12414 57460 7488 -153164 -129452 -157439 26786 132365 -44066 80631 75255 179935
20094 179935 -255075 -210775 -145567 -21728 -141205 -148196 -60079 -226575 44793 -205643 -110816
20083 -110816 -407505 -35046 44224 -235832 58185 150782 3547 56127 121027 44385 -47292
20071 182368 24602 44707 87513 384576 -57925 -31897 -80075 -67280 -134983 94303 -122574
20059 78581 63078 -195606 309337 -243126 53072 -259754 -121642 -313356 1436 267796
20049 267796 -53049 -45171 -54230 207792 -148518 -91988 -124115 216511 -315133 -143865 446461
20037 -11135 -14722 -92895 245695 -164918 -301500 -152078 63219 -40729 86950 -217953 153879
20025 -256918 -256716 12854 -71823 -103386 -294260 157099 -54016 85431 36738 -375608 72648
20013 -89362 -229350 -5616 -85842 57923 80570 52369 -87678 -12673 25609 -13773 -119500
20002 -119500 254478 250844 -205180 -153208 124968 -203006 -250476 16623 -267106 46398 12151
19990 216588 168490 866 -64542 150439 -71343 -75394 312846 -248840 18325 -3204 -135900
19979 -135900 -88676 -174768 104597 -264464 197788 -57946 -9946 162013 -206840 125478
19968 195120 -149086 -51915 -56452 -51817 -41768 -218878 -96512 29341 40159 -225373 -122974
19957 -122974 7688 -73199 211427 -28760 176317 123824 146121 -87911 312714 -6880 -134849
19946 -134849 -163234 38916 -40212 -152534 -277524 60919 -218602 -149767 -153424 -75792 -28025
19934 -281124 61221 -326093 -272400 345027 -98905 9404 -106810 -134429 -249231 -224961 315835
19922 -30352 -34627 21346 -155159 21556 96916 -49187 223401 -114369 28083 -228097 -20274
19910 -216580 -132542 -257403 127021 158241 -163172 360101 57170 -45094 -142992 15260 160275
19899 160275 -282968 -64494 60789 244406 -197310 137717 -153628 8553 -52339 198075
19888 -39281 130569 -183736 -201900 72555 -256116 26327 -6164 -122574 -231752 -198993 -152003
19877 -152003 -275411 103124 -134662 -230776 -57512 -42571 -247524 20360 -81914 -77918 -97915
19866 -97915 83968 125276 -407309 291391 -247781 -62811 -38058 -95385 -119737 -112569 -56936
19855 -56936 201880 -222250 111457 17486 63924 -134632 180761 -127985 136516 -130583
19844 -277298 37777 -162265 -156400 -358080 -434400 9084 142327 -345771 -34355 -369890 250105
19832 5720 -190902 -152293 141412 205645 231285 -47178 137814 -106759 297867 -227434 -197423
19821 -197423 -308141 28840 145445 -14257 -275826 -102983 -177145 -82538 -399433 146110
19810 127027 -273616 -197046 -94074 62356 -293994 -284478 -347045 -8215 240514 -303445 106980
19798 91991 -122633 -170462 -1762 118965 -219458 44790 -21146 16884 -137138 -81500 106836
19786 116530 241866 49168 -254724 -71513 172648 117320 -118474 164209 -298080 -55179
19775 -74374 230071 -32544 26568 -223627 -30715 -120711 122683 -23006 -163073 -43404 -146558
19764 -146558 53659 74133 109180 -236824 -351634 -237138 -74669 6711 -105810 288482 -149235
19752 -188818 -22995 22099 -213505 36482 238185 -156290 77641 -79008 199523 -134588
19741 8599 304313 52278 15037 265739 -389754 35588 -36211 -349581 -45292 -139683 63129
19729 78019 -247387 59087 -9828 -11748 128397 -137298 -65173 157533 41194 208658 -397743
19717 -124338 226356 -211675 1598 -55322 -9919 1902 -107006 -552911 -354302 -16091 -122489
19706 -122489 9886 44564 149837 -71340 -65169 26698 -528156 -97378 13186 -32178 13566
19694 157567 -93736 -27276 150662 -362942 -27269 -53775 -97686 -51607 179233 97581 8524
19682 -333145 -302136 -326134 -209032 27024 46135 -66652 78287 -79761 -279759 -145686 -76685
19671 -76685 -4912 14676 322192 -19493 167770 -194779 -115215 -233705 -50605 -60852 79236
19659 -9360 254085 -58562 -204669 -97462 16206 -9930 -14645 215551 -84006 61843 -159925
19647 13682 -145734 -121640 16883 65600 12991 17553 294586 208046 83195 -99573 -333480
19636 -333480 51013 -282599 -178590 -212212 -97633 5316 -37162 96550 70096 -304043 -102340
19624 258214 -62789 316010 56751 -68487 -208843 -8760 -206101 413670 -48305 134440 -242367
19612 51647 62339 -213581 258514 -110821 78064 12891 -146139 106910 12279 -204048
19601 -46518 -17927 -203460 -292041 62607 117414 239459 -162367 -206214 12931 67002 174552
19590 174552 -8346 -139547 -261044 106009 275767 -17502 214389 144364 141859 21488 73305
19579 73305 -263523 377089 -26226 65545 -70769 -31275 -67361 -170839 -29234 169360 -34753
19567 106046 -249858 -126625 38552 -75566 21964 -19657 177800 66938 -121931 -5379 300797
19555 35442 -226529 198553 -189955 -117921 76319 -199003 -376791 -252967 127723 -153686
19544 28077 69298 -198819 -99922 -305251 10518 -80940 -220165 -262852 -39669 29222 -27145
19532 -276739 154232 -81774 -133740 -48276 -192223 179101 -106485 -45423 -205877 55791
19521 -88396 18010 183353 222516 134235 -32835 -292322 -50222 -114576 97151 98416 160919
19510 160919 -27498 113824 -376882 193959 295860 -13380 5474 -77639 -170034 -98759 212100
19498 89572 -35401 202919 -470805 -22805 -237832 -80912 -133899 -43436 -280636 22068 -45016
19486 54403 -30344 8429 -151634 -83725 57172 -311894 130076 -266402 -145642 18643 68815
19475 68815 -347834 71837 345037 -154237 -64776 40425 -53410 -124246 -137733 -71174 -342143
19464 -342143 194479 -130515 -289602 -213821 -14699 135114 -101720 -185032 -115351 -265387
19454 -265387 -354737 -247428 17115 -259716 -248557 -59697 -77175 9126 41808 132051 -256056
19442 -418294 -165496 -66758 -275411 72422 23647 -245889 -196590 -223120 172174 -3430 -149638
19431 -149638 17827 -6485 -4731 -189464 7014 -84611 20249 -391277 -152133 34328 7247 -206059
19418 -53961 -118448 159483 294248 -80628 -108254 -215178 217802 -167210 -149108 43084 65893
19407 65893 131668 -83468 26437 7320 -90663 -101187 -172056 -244465 3937 -323907 -99458 158806
19394 299694 37601 -93672 -175791 -31502 -148245 93841 -221110 316678 112359 -64569 297251
19382 -317489 196287 -187943 400699 -134830 -79878 -189782 -163129 -140883 29962 -7573 222275
19370 -324831 -85952 -284851 13568 68671 171287 -174708 -29665 -26182 -204915 -94992 50640
19358 -12667 157935 -144291 41272 -312387 -251942 -136239 -92496 -216494 -219265 -150099 251058
19346 -181919 -1638 -374514 -228351 -286869 -63982 78288 -102085 -282380 202635 -41453 172521
19334 413332 142389 -98211 -44828 -439388 -141320 124750 -277696 -186660 319915 -266985
19323 -256320 -25930 -145177 -6329 -303483 -282732 -116215 165992 51351 129703 -248726 107281
19311 -61059 -51231 189652 136076 -232910 -41944 -196129 -24976 -150209 20150 -191973 -60013
19299 27631 121578 95073 36364 -1406 235793 262314 -50998 -154430 17460 53629 -43866
19287 -144883 -5103 57517 -377195 243409 -181532 190363 24377 280277 55922 87580 -13285
19275 -140916 196648 194003 -182722 -158278 -167316 -115014 118882 -35268 112810 225756 193553
19264 193553 -34587 200361 147940 78931 -57183 -321352 -137573 262500 -39724 -215793
19254 -215793 83137 -6468 -302068 123516 250440 -102349 -224182 -29598 -400983 118499
19243 -154152 47544 162757 -211174 85304 -244124 -51115 133319 269303 -184945 -147657
19233 -147657 -165605 91308 -28247 70374 101145 82808 -134353 156991 -180416 287661 8238
19221 -180208 126618 255418 -26450 101291 -263531 -101398 -168447 5614 62587 15675 -205739
19209 -219009 -126700 68599 144218 32322 -108472 39715 -254502 -27676 99147 219392 -388567
19197 15781 -39792 93364 318474 346121 -255602 144620 -264716 -162705 -29482 -124887 -251058
19186 -251058 -95174 -126201 192768 -108996 -162146 46178 113523 -19297 41412 -193052 -132901
19175 -132901 115209 -43024 -266480 -97112 89582 26870 -93850 -176736 15410 -68233 265852
19163 -178896 123548 -174310 108858 -123840 153478 75376 -43141 -310690 -120252 -169613
19153 -169613 52762 -153398 -93222 95430 58009 62995 -39970 -239918 179125 -70923 -256006
19142 -256006 -26994 -270197 46292 -138269 88848 82723 45758 -534076 129932 -195383 -78960
19130 144515 88575 131 -186614 32784 -53960 68542 -117995 -1504 -130949 -26427 13011
19118 323579 -183513 -37617 -196711 -49475 -317087 -297389 266619 30696 3810 -139118 -35818
19106 -82071 127645 -45358 -35233 68639 -72530 38354 -54488 6709 -12366 -257135 44085
19094 -157336 -370417 -44999 -36396 -282637 115018 63373 99861 -75547 6349 54901 178337
19083 178337 -34680 -193995 -40034 -391129 -152298 53844 -220900 92394 -25852 -241943
19073 -241943 -129136 -6751 -165252 -19231 -3205 208000 -245265 -335154 -230156 161279 -550005
19061 90093 6490 -48589 -125316 281482 -145759 -366971 51140 74271 -17750 -88737 -57757
19050 -57757 -242727 103811 -23127 303274 -259599 12976 85622 -149057 223878 92491
19039 90060 -10463 -124131 -5670 3054 269379 -319366 -89876 52719 46325 56724 148518 51981
19026 261145 14173 -47794 233984 42872 350046 -306927 134876 -69465 -44220 65608 -124527
19014 -368622 85082 279528 183945 -90521 75965 -37726 -317888 -147635 -163345 -215069 -9703
19002 -82174 42437 -70139 -102940 18690 -234961 66471 -103321 -12874 142424 -124606 82964
18990 115203 67937 -174719 -15898 -181934 -97842 43308 -16757 -182269 30159 109232 -329216
18978 -36024 196533 -154663 -169197 -46623 89045 -129730 143446 90732 296515 -76468 1225
18966 -23023 119752 70462 89229 80602 216574 -177810 -136922 180791 149044 212143 -51067
18954 -4257 34956 -86672 -21437 19964 79396 -147323 140336 -242585 -188983 40654 -126699
18942 -48951 -124852 194684 -74245 -226858 -364230 -189253 -10169 -102995 -150234 46255 215834
18931 215834 -190436 158365 111229 89577 164676 137427 -201914 57709 108337 72772 -249398
18919 -206876 242410 -105065 -81443 -225653 -1860 112525 -399602 63173 183712 174094 -141145
18907 -296596 175970 153487 211182 -238635 -74409 62241 233608 39416 -203590 -48374 119589
18895 -268978 4836 163463 -48075 -273920 157654 3131 151699 -52869 -146579 -530846 67244
18883 23144 213937 -278134 -23637 135323 -10179 -71215 67508 -188786 -129895 188051 -214506
18871 -359607 -93391 -118349 -166891 -200758 14733 225089 -321110 -1081 152690 296102 -82778
18859 -298951 -95774 -102910 -68543 108332 -122693 99848 -112750 -76048 -348516 -524855 -252034
18847 -71656 54459 334906 -11416 46283 -136919 180287 -122875 -59286 113542 -192549
18836 159468 -222905 44049 7114 -5288 158444 -248674 22342 -16775 16883 -111971 95108
18824 31755 -89954 -145007 196195 178897 108575 170698 110214 178051 -155824 -5032 96773
18812 -82379 186803 493986 44001 -15867 119870 115943 -321270 -189654 -122817 -99942 -96412
18801 -96412 -317680 -175030 -66836 -55815 -76676 62368 -147560 39351 -102700 240258 -205057
18789 -175587 -2602 160719 19573 -104730 354404 1386 248006 -74938 -331010 95843 -86648
18777 -171471 166542 -23456 48916 -274198 -218741 -248956 -58609 -287439 -240165 -307858 -160664
18766 -160664 -400055 -139500 -135286 -149773 58364 -72640 -176735 -165388 224163 -165147 -126776
18755 -126776 -305640 -166794 -645430 -47567 -324495 -98712 151052 -315562 -1222 -78227
18745 -78227 505831 -115061 -78162 385543 -448484 -377140 86597 121324 -170418 148779
18734 -40240 1410 -160268 160171 54036 119963 -109178 100093 -98057 -135592 -65077 -403977
18723 -403977 -144065 -67919 125184 267400 -97571 -84579 -31061 -68177 -270930 -124469
18712 -6285 -198450 117834 -117767 -89590 -61369 194404 71251 -58842 -127237 -44653 -155298
18701 -155298 -111615 -212796 -266044 -582857 -230464 4992 -11732 219781 38370 69170 -174176
18689 -24078 291345 43561 305970 -13773 -144468 -147794 -236332 -271751 45491 -87863 -84572
18678 -84572 59267 137678 -65826 -184888 9422 -238850 -305399 406428 -78257 -331790 -158788
18666 -472258 -252490 -150262 422315 108064 -247452 38082 76201 -86332 54835 185837
18656 185837 358621 -3788 22733 277270 -232990 337315 370162 -74312 -173794 59372 -86049
18644 99824 -45424 -50070 158325 123634 -131582 -18836 -194239 -67094 -272355 -18084 -12016
18633 -12016 -121479 31449 -102746 162018 -84490 58880 19021 -123773 334860 153823
18622 77676 -29004 -346172 -136755 -2648 -219332 -67715 -67034 -61914 -148941 -394573 -183891
18610 -242003 -80685 -22513 109785 -219296 -439009 -192904 56015 -171237 -21268 106138
18599 24344 -80536 -136644 -230114 8542 -246216 107812 -134771 -269750 -183704 96537 -305395
18587 -4775 -432900 -247852 151386 140853 21760 343021 139301 -217612 108017 -107769
18576 -123733 155158 -142422 -163238 44626 -987 -119793 -48828 -79836 94032 -32169 -133382
18565 -133382 229372 -263022 350761 65974 -183009 -339020 -81224 -141426 319838 -64605
18554 -366426 -78604 -99001 -124635 236547 505233 274406 -154464 300345 -136102 27419
18543 117858 -66388 74337 174486 -246150 12222 -121498 -334352 35340 251005 124360
18532 191780 44957 29472 125914 -14302 -380127 -130519 106916 112216 -3631 -181471 -196908
18521 -196908 56654 -23405 -205154 66312 127256 46071 -59673 -300835 -60216 60227 -218548
18509 101886 -91360 -541209 -47578 -179830 -29686 -268961 -27174 68370 7065 -107356 -180360
18498 -180360 272840 -19705 -83407 201644 217782 17602 77265 19379 -550504 139706 -106466
18486 -19038 -62647 -168359 -50363 94200 -4665 191678 99647 36699 -130194 -204387 -80937
18474 17922 -22357 -45278 -81794 353 178257 -355094 -52618 -45436 -205548 -179632 85348 279215
18462 279215 -243023 -236518 8084 -1793 22214 -390491 47618 39215 -72946 -178755 -20673 211331
18449 -249178 -30362 -167561 -117285 -168149 -204927 -86268 -282907 -400658 -309449 -136472 63052
18437 -91368 120267 66761 35549 -143128 -81074 468558 106824 -194012 16567 -139779
18426 -89162 264453 147761 -90453 -181340 -161191 48391 -112032 -292990 -8259 -335853 -9196
18414 -258912 -134496 151842 -8974 -71688 106781 -163792 -180806 49325 337933 -214468
18403 -48642 -271764 -181136 78950 -13565 -349208 -113988 408139 717 -198979 -30335 153590
18391 -91923 16055 -30850 -133211 -257490 61422 23628 -129074 -299006 -257980 33366 102856
18380 102856 -137841 -139839 501646 -178910 -37587 168787 -30979 -52644 94352 -113380 -469098
18369 -469098 15324 196474 -9431 -175952 -234257 127906 -130730 -260237 -40842 -247813
18359 -247813 -225460 -29021 -154512 140485 -46763 -139799 -223309 130389 -82930 280303 -108364
18347 35437 57070 -302976 -35213 242250 -71800 38287 110563 -199826 -161974 -309609 -319337
18336 -319337 122155 -333337 -150215 267166 7900 158373 -115852 -88175 56985 -117009
18325 -200951 -269767 9348 24337 -146194 45431 -180438 -291526 -157939 70819 148212 -125563
18313 115875 -33462 -162479 -23379 36364 -185069 34189 -111100 -16795 134737 -49056 -214813
18302 -214813 -19858 -56304 41613 -74756 70203 31933 -15136 168583 6630 22441 104217
18291 104217 -32356 24236 27181 -97259 111363 -966 -66083 89441 126757 -113060 -20190 -146964
18279 -146964 22199 233952 -210452 165430 -363655 25457 -38369 74070 -179151 38800
18268 -189391 155598 85141 -222182 73187 99617 -250411 -76500 351021 58780 -157415
18257 -131424 -437143 -201425 -174772 -74217 167612 218341 264617 39133 3501 129782 -94549
18245 -108877 165402 -83834 9634 16890 -392728 -81119 -167156 289061 436650 70077 -1214
18233 -177244 -359848 67845 247973 116439 94953 76627 -105190 74656 43271 10498 69123
18222 69123 55380 -169953 368959 165029 16115 29068 -126403 164191 8349 71614 27867
18210 8066 142272 -379713 -33477 -202721 -37447 -188882 -141805 41189 51592 -106254 -20255
18198 -109957 12971 -68382 52273 -250650 -90401 -59324 15613 -167462 -265773 -131419 -39208
18186 -179424 54834 98520 -85084 -161705 -278094 352216 -253894 121974 -254062 -290290
18176 -290290 -213683 -298748 148168 -92199 6426 226736 47834 -114243 243009 76501 -436696
18164 -303170 -145148 -79368 70240 5707 1447 9919 212545 7325 -86077 -146733 168543 423194
18152 423194 75704 105878 -232162 -139465 -218289 225229 -2156 76055 -317827 -160960 -20121
18140 199977 54466 -260630 376886 106491 -30577 172385 -299541 -188110 -217162 -253992
18130 -253992 -185237 76916 -505306 -43613 -20086 -52670 -14288 -4763 -92309 -22323 -33504
18119 -33504 -56832 7417 -237736 -169021 91839 177328 56036 28625 -317650 -60339 143311
18107 -138154 -329380 -121452 -212188 -130846 34500 -145123 239846 228649 -251381 -75338
18096 -187103 273169 -27261 5901 -344974 -251969 148182 -124765 207324 85394 -287760
18085 -28438 54199 176037 -37884 222878 -134512 -91157 -72028 -175578 147141 -132987
18074 -270339 -86889 -49251 -170878 -65837 -32878 169785 -201453 187392 -66481 93782 137494
18063 137494 214058 -42081 6052 -117106 166235 -93346 -160397 -65562 299622 32302 128409
18052 128409 -79783 -37250 285001 -74211 -274712 63252 211899 -279962 105401 53176
18042 53176 -200938 48984 -153482 -308807 -7039 -13716 -286511 145055 -27769 83211 -161782
18030 -303153 -145924 70297 -143743 -141460 -295741 15617 84794 173982 53724 480149 -42503
18018 -292734 -279535 194575 4098 149279 4867 163265 117851 -215866 -62421 284036 186812
18007 186812 -16783 30670 -132722 -417231 -88945 -117678 109476 74850 58968 -225449 57965
17995 419056 -24364 162448 3014 -270065 84136 -139006 119971 441841 -291703 95213
17984 -81938 176459 -85184 -28094 -251630 233295 -26884 -211410 -23635 101778 -353064
17973 -280249 615 -27134 -10945 40791 -137065 -138780 229 225063 -21740 140483 -194691 -346932
17961 -346932 -25936 251352 -279085 -92264 -138331 61101 -322035 -118294 -115764 -272586 105837
17949 35370 -134293 49299 151795 17945 88556 -10722 -194139 283729 287598 198596 141055
17938 141055 -87896 121117 -70233 -28747 -25987 113606 -25727 42043 -53748 -166661 214096
17926 69326 27462 179453 -255455 140977 7749 81713 -15586 34389 -7203 -96344 11750
17914 286529 -60305 -84618 -20425 182052 39218 -56435 -253333 -297385 100097 59362 -127423
17902 -203996 -77279 -53263 -101516 431594 -92371 -94395 122378 -114048 48882 151381 -280390
17890 330380 49531 176213 -279942 319194 -162776 -111971 -69820 82345 15150 96237 97659
17879 97659 31864 9844 -205813 -320730 95343 188551 -149543 -402395 -101061 48541 -28273
17867 44753 -98093 -335444 8002 12428 -46416 35094 -113015 -75921 263586 58919 234027
17856 234027 -77106 197409 -327425 247907 -20417 -144512 -302439 -19619 251119 236789
17846 236789 -249408 -78852 -21835 63913 -48201 220810 -84336 83677 182825 -196380 -61938
17834 181263 -147537 -35023 -91779 77173 81546 -131784 -135151 -221460 44886 -112790 -83856
17823 -83856 -152166 -57769 79844 118022 60120 -296215 -128403 -180465 -242232 176525 -263734
17811 127436 -66235 -6776 -90143 -289625 147631 96393 250025 78912 -492970 21764 71526
17800 71526 -121310 35591 -249571 -95730 -42084 -355282 91142 110719 224975 -2597 -115756
17789 -115756 -209582 596452 -205895 223856 -34247 200226 -278189 -225839 -275394 140234
17778 89033 -28872 18180 255346 -106670 29660 33267 -97508 231706 -270873 -264502 93312
17766 -144870 -70031 159488 -285202 -21359 -199687 328956 -268273 -108240 -242033 -27481
17755 23562 -109270 100801 18555 -37705 -75070 -214837 28623 113422 -90697 114537 -70707
17743 -97320 -28997 81681 -144490 -6131 -6247 138440 -146692 -242549 426582 203156 -160782
17731 -242749 34162 193273 44616 125341 -5672 274947 29335 -80161 -116329 24474 407710
17720 407710 -66370 -126084 -118630 -85513 536982 -44483 111780 -80934 -317366 152574 -136255
17708 -190585 79186 135990 -49986 -63135 -327309 -213 -130451 155989 -56552 -38818 -4695
17696 -163776 58106 35450 -101528 320091 13445 219109 261618 -297919 -119166 131439
17685 -268548 94482 398930 -30660 -147337 81509 199399 -38071 -45101 -56769 -287906 -84370
17673 202102 -83316 -34659 -58892 -399766 -180183 329558 133182 -73513 -36124 -124178 -98827
17662 -98827 -131069 227396 175558 -115897 -68924 -217135 164525 45290 49747 46032 374594
17651 374594 -114229 103396 -222782 -337267 12273 206173 75511 254391 13888 -315051
17640 -29188 -187950 127621 -60453 132723 54059 90677 166067 -55550 97497 -81792 -351356
17629 -351356 72591 186429 96001 5363 260481 -63075 329992 124847 -57736 6085 -72307
17617 73242 78899 -108860 -1363 5092 217590 120636 -272957 -53148 4526 214849 106515
17605 99700 68750 -207679 287049 236465 -66829 132461 80308 -438483 -119900 193529
17594 -99173 42081 -70963 -3455 207730 41279 39480 56516 -101736 198135 5429 -7545 -25383
17582 -25383 -25657 -339662 72627 53930 -79048 -161970 10258 112219 35949 60459 234730
17571 234730 420442 -7919 -117111 -11119 -52373 -198992 -291470 -49683 174806 184284 274445
17560 274445 86619 -40231 -196858 100810 -9370 120141 -37417 1318 19065 3841 178367
17549 178367 27976 -113489 78842 -163897 95196 305703 319143 231806 -31420 169214 195006
17538 195006 -384172 210342 -67249 307503 -100402 143430 179031 94993 245834 -51053
17527 -4149 -153637 -81206 288864 -82467 306648 175986 28483 26937 350767 32324 142052
17516 142052 27091 -120829 -98307 -200846 336400 -86715 174213 1616 6931 259521 -22312
17504 275648 27906 108358 -152613 -247364 304564 -63530 228707 175570 -179148 89004 197101
17493 197101 26600 146888 13826 213536 -269302 -5673 86129 37318 -32261 55257 51220
17482 51220 -22411 216808 232478 -63555 102126 -116481 89522 -65330 4990 209852 59681
17470 -24159 139651 215199 236734 215683 251046 304237 60387 -208437 -1302 191351 44025
17458 84646 -42102 224611 -2030 -93588 104000 318306 138629 356561 604418 242508
17447 278312 117962 220629 202566 156217 319124 -44259 64398 235783 328654 159120
17436 122975 144765 207082 218245 206689 -55917 75731 -294917 -9975 162831 234373 69847
17424 -18294 -41408 53120 -114965 157330 111323 553671 137388 -71925 436034 17469 155228
17413 155228 347791 449320 347020 -34662 208215 -170082 -65156 134330 -63857 103709
17402 177865 280288 122058 217705 138038 184534 200415 144778 127354 -71507 -32117 216991
17390 87740 83525 323147 248618 490954 209560 213367 91687 -195238 172503 -12219 168340
17378 -253522 14503 79828 22059 126139 112712 373458 -126774 441903 304362 166979
17368 166979 64496 42688 -82967 8073 300863 235750 -122501 193491 88376 318858 325636
17357 325636 251283 -156880 205480 -191466 -33967 308254 34244 129440 399096 -25235
17346 303732 115504 193046 238551 236850 -163629 54709 353976 187678 292085 112541
17335 -163292 359089 535891 253789 8321 -154762 248391 15751 346622 185427 -14741
17324 -105220 -207723 16269 -7609 229677 -91395 -473 207147 603570 66442 63458 25596
17312 24580 -6629 93255 -110330 -5209 87715 358183 258033 225615 124385 240106 229726
17301 229726 -134152 96289 -28384 -56336 -167496 105240 469021 104202 122509 -171756
17290 -83426 315669 80766 62034 270997 -93962 184365 249878 151025 214629 147948 252178
17279 252178 86950 -27280 -200361 -108857 241955 298568 147214 -61822 281661 109238
17268 379478 257274 219921 16627 367818 15307 258932 147225 -118572 318777 172472
17258 172472 198301 194273 346931 63241 437169 59275 118231 449576 21934 -10561 -21308
17247 -21308 263580 246972 222771 176060 185493 -102778 165890 111031 200657 340684 17918
17235 53227 -120491 -55079 -54411 90275 28389 522797 241201 57368 290785 289606 215039
17224 215039 469367 110895 76041 184449 282505 314269 381743 165029 291716 95689
17213 4926 148901 253494 302164 37471 208574 250347 246358 283097 383670 279561 116812
17201 -44344 133868 43606 -94433 84785 339127 298911 113002 107694 308823 133225 333457
17190 333457 50128 34631 308118 311187 513760 256265 408175 452438 203582 171348 194792
17179 194792 208875 210046 470503 40489 264898 108057 429583 239135 225652 324112 143308
17167 362044 336411 252334 325358 229731 235867 142651 337652 107895 271165 379376 357767
17156 357767 502730 -259295 18953 306026 260147 312446 44885 53053 229279 276638 432491
17145 432491 393747 82064 413014 310387 95588 479485 302431 -158249 220903 483559
17135 483559 287069 446145 382649 190641 225240 266830 425552 272394 315409 227186
17125 227186 324547 68569 270351 406788 96691 223742 100258 210580 268042 491205
17115 491205 406610 130778 22540 287901 70780 368995 -61859 -25900 520420 246126
17104 490998 534167 507866 -56078 503506 247683 290704 181989 212155 256035 381277 593926
17093 593926 516188 396090 285849 158326 180097 416630 525611 611668 639619 299754
17082 300014 11454 154192 313624 344703 455454 473151 383302 543597 274749 133115
17071 349291 439891 495206 581152 356562 149404 545007 234338 474481 433843 478439
17061 478439 377154 293477 737411 499634 213942 260501 556015 256891 508905 356492
17051 356492 175244 627391 888790 707512 538800 314904 97435 420849 644774 234267
17040 681934 562917 495016 368516 718786 498929 581704 580081 237143 695453 969429
17030 969429 433097 400423 359135 379014 553147 738979 575399 724740 685445 701895
17020 701895 266506 511195 337954 768203 579365 661569 573153 443849 530043 363266
17010 363266 709690 549498 751180 699048 504286 711578 925486 551996 880447 619393
17000 619393 763179 393581 577428 870468 463046 608429 772178 734088 677019 542691
16990 542691 662477 905187 701537 701744 604159 622341 872099 714178 868001 585063
16980 585063 693780 333704 912485 879934 666533 649041 948857 480537 564236 848802
16970 848802 439121 764044 824301 903059 704459 850368 823400 704122 870341 556787
16960 556787 534430 899251 741009 756324 760633 1060151 836239 978450 1018197 940907 870300
16949 870300 1104080 1329406 891748 887551 1036605 1121413 843122 1065245 1016209 990206
16939 990206 704876 1133935 1065132 1344999 848929 1060509 1026695 928041 1249789 1450071
16929 1450071 1125297 1030497 991223 997454 1031406 1063472 1210357 1442168 958567 1007139 1430897
16918 1430897 1062375 1108549 1181473 1378213 1200381 1337338 1485020 1091169 1449893 1510068
16908 1510068 1625558 1077522 1272015 1605492 1433523 1509506 1293452 1430044 1569835 1653487
16898 1653487 1341049 1487715 1905704 1700144 1255269 1437752 1650404 1762324 1636300
16889 1636300 1794055 1761169 1731690 1901835 1980253 2118489 1465010 1911920 1798381 1764915
16879 1764915 2009635 1625811 1904784 2315389 2333776 1844101 2049359 2008435 2095513 2111923
16869 2111923 2067269 2203067 2639178 2446101 2226150 2165409 2680722 2427255 2267183 2730288
16859 2730288 2532047 2555611 2325978 2712938 2466144 2950143 2407891 2931948 2828992 2925259
16849 2925259 2847803 3274522 3033225 3232022 3211619 3034092 3167332 3153814 3261353 3356264
16839 3356264 3581943 3397639 3287947 3659195 3722113 3830176 3558996 3805802 3849626 3968583
16829 3968583 4029553 3765627 4070035 4505961 4480936 4227160 4817150 4664003 4776632 4738007
16819 4738007 4955716 5039863 5230589 5193432 5221067 5346526 5385254 5309492 5775076 5789751
16809 5789751 5828045 5966296 6207277 6477010 6354676 6580747 6949506 7093969 7038169 7041487
16799 7041487 7384983 7639988 7616308 7875815 8288774 8276022 8439317 9009868 8783327 9108445
16789 9108445 9575904 9877090 9520755 10203268 10572903 10961471 10700456 11417560 11461773 11527718
16779 11527718 12500606 12802236 13017392 13370057 13917363 14522368 14750862 15039689 15936581
16770 15936581 16502957 17078420 17383142 17868011 18567084 19388567 19913071 20938504 21492884
16761 21492884 22373077 23311986 24269660 25159944 26521657 27223448 28589402 29834040 31163124
16752 31163124 32375933 33909289 35542047 37102206 38702224 41283329 43083642 44864704
16744 44864704 47108407 49937355 52413885 55411871 58437428 61533601 64954776 68530107
16736 68530107 72722784 76724706 80991774 85559607 90199799 95399492 101062745 106490619
16728 106490619 112238800 118212030 123980148 130096182 135845290 141633267 146582455 151465292
16720 151465292 155690751 159309274 162305805 164242623 165174905 165176729 164265690 162252039 159687449
16711 159687449 156036758 151685800 146969493 141591351 135798295 130128390 123794437 117479921
16703 117479921 111782526 105946812 100098910 94628747 89313038 84456260 79730500 75128419
16695 75128419 70881297 67078031 63266552 59779573 56535287 53541023 50950080 47847078
16687 47847078 45695341 43383262 41519744 39351376 37109600 35576109 33785084 32604475
16679 32604475 30936751 29777522 28158457 26959915 25953035 24793806 23481380 22994236
16671 22994236 22037013 21100553 20288377 19680953 19097647 18032903 17126733 16923743 15869510
16662 15869510 15959092 15378599 14841553 14231974 13961762 13110847 12958549 12329412 11940582
16653 11940582 11659192 11422526 10831461 10705783 10396501 10262119 9556079 9423583 9092920
16644 9092920 8948874 8620805 8465756 8189852 8054263 7960039 7818509 7677348 7358856 7045200
16634 7045200 6837044 6874272 6503031 6495615 6256295 5951115 5947587 5895596 5734871 5581560
16624 5581560 5542537 5738964 5228264 5106591 5126293 5126829 4818142 4783772 4633167 4637365 4400493
16613 4400493 4591761 4170807 4133408 4237114 4083019 3799711 3918877 4199966 3599617 3648759
16603 3648759 3753238 3728412 3472834 3441227 3376580 3350045 3505597 3233326 3097221 3183249
16593 3183249 3093034 3389333 3087468 3143909 3062013 3162365 2976795 2480830 2787662 2796844
16583 2796844 2557827 2569756 2692535 2626803 2603111 2387280 2237067 2519891 2263744 2531781
16573 2531781 2038156 2011284 1943452 2145284 2161449 2158610 2049688 2060385 2144920 2165033 2034192
16562 2034192 2040154 2113443 2009617 1753194 1666121 1756754 1789665 2224896 1875663 1842795 1604965
16551 1604965 1699042 1441112 1477564 1686614 1472610 1511194 1496019 1474092 1785655 1471949
16541 1471949 1377288 1568624 1585999 1634913 1496322 1323146 1115751 1641640 1294564 1297052
16531 1297052 1117502 1445128 1293118 1018653 1149301 1331253 1498652 1248370 1072249
16522 1072249 1229742 1252861 1104367 912932 1296046 1082974 1163479 922508 1055621 1025485
16512 1025485 748832 1022837 1160587 1153134 1193611 1044558 791769 767436 949675 826210
16502 826210 1144050 866623 965679 853870 761610 807944 937948 863253 1152171 816106
16492 816106 834951 669908 624143 916782 949531 1087908 921082 905734 1070042 525027
16481 834163 1069459 559496 890478 876701 1071784 517066 870542 412886 977170 418147
16470 966986 656241 567344 531165 805845 941422 708260 909788 594051 1042661 389353
16459 734259 524767 800517 648054 599232 627024 746552 550654 823141 462556 566180
16449 566180 702412 748173 249458 285362 258037 266972 668699 594812 784512 286102 557739
16438 557739 523080 512855 433998 466180 393351 504327 591722 533319 327692 541186 532283
16427 532283 273290 836041 111441 370410 556607 279192 859194 345689 54972 455034
16417 455034 439867 562320 369826 499182 541251 -16501 419394 482313 361950 319415
16407 319415 400620 223195 255303 495965 240577 167860 374994 334345 416528 421478 346570
16396 346570 296149 432120 467057 317459 469897 401383 404259 345014 606766 452792 213954
16384 364716 89988 309250 440884 325989 371863 616441 420997 230971 414012 200298
16373 235166 280550 198501 144787 82034 226670 458617 195399 337141 474627 110178
16362 -346307 159957 482246 420882 602370 66948 179503 33112 126182 148228 190758 262196
16351 262196 291880 153376 307678 204673 170372 596246 299957 440136 452843 265859
16341 265859 509652 325124 262481 50474 410680 389270 124061 102234 135718 255087
16331 255087 202593 108474 228165 68275 55433 23418 260444 511856 483664 199911 168867
16320 168867 402680 244650 107468 134106 528534 165531 -240824 -63383 325147 161850
16309 217980 225359 110885 189247 175398 90317 -75822 137998 -33651 139050 57941 209092
16298 209092 117414 -18075 57359 -2101 -9204 393198 57308 333030 293997 180496 -3828
16286 -222147 268437 35503 -72456 349374 244644 424834 239804 471831 110942 217348
16276 217348 147529 278579 164783 159981 10757 -12496 326868 280533 221011 167616 -27131
16264 -11804 55058 3819 177356 340647 -27297 137204 124114 -47342 201094 -91554 83874
16252 -127131 377528 160510 -122358 183463 -131283 56825 203852 233360 -20539 48402
16241 40023 -89380 172400 273667 19762 65297 167048 -123748 -38507 197050 234936 281853
16230 281853 251068 -189001 -151675 -11318 61479 236715 -269924 -96748 168636 86195 -3891
16218 272903 -55361 246205 11747 306410 255955 150 385841 268228 194622 110123 171797
16207 171797 197114 111163 132431 -12513 26444 -18519 -201638 27073 72468 313481 -82709
16195 -231811 262955 349693 40779 219746 134411 12337 33482 -18382 251920 -1642 61353
16183 134924 -19026 95258 -133508 -64344 43150 68030 281458 -50967 -17001 101782 -45076
16171 -2866 301721 212378 -72843 -284886 86140 8170 164547 376 158362 298765 196235
16160 196235 37771 -26891 319408 -3229 335889 217190 -88627 -192310 -139622 137443 -89100
16148 -187154 330640 40706 337690 15462 346370 57274 47407 -170042 -162394 48354 -91559
16136 -90296 -169106 203648 141455 46022 -270029 -79035 -25518 -116099 -65599 -70937 -201979
16125 -201979 75361 -211367 49628 -22313 197639 140424 83678 -17381 197696 148896 157630
16114 157630 88087 -256877 -124680 -173802 283372 -47275 -77336 54025 -26674 263652 363235
16103 363235 203099 318149 40346 384759 211256 -83489 142080 125772 9178 10285 205145
16092 205145 -151171 15091 -94237 -112554 63961 134276 191162 -19109 293165 193566 -99164
16080 66682 192264 -6630 12069 -107812 -255875 -30441 39166 411450 -25237 -194431 -110035
16069 -110035 109781 22729 -9134 14854 -203931 -93758 29114 -32403 -389868 -19533 -18003
16058 -18003 44653 39546 -4241 65405 -65849 -137963 -158319 20585 122563 -135003 72340 251430
16046 251430 -92432 -246417 10366 -372789 6211 118732 -225517 154210 35374 460675
16036 460675 134037 243613 39511 205212 213455 154136 154771 -110122 284297 28473 -84963
16024 -2222 -34080 -182849 -58787 -112024 -209178 423177 33029 114471 -264822 -238455 41800
16012 305293 41735 -231962 174942 -326248 95451 -106400 -5009 -117135 -40112 -282734
16002 -282734 137134 -141903 -295148 -97908 -105106 18624 165862 -61579 239263 -3139 -65801
15991 -65801 -38447 47643 404965 7035 -255639 38340 361615 248946 319117 752460 144844
15979 111397 146486 -154285 99968 -88807 80801 228380 19447 108513 -131265 -43556 -158277
15968 -158277 148576 -245682 50063 -258885 195383 45659 188975 115315 -473161 -123758
15957 -61425 -109784 -53510 -60467 -5701 -105158 -27930 -26600 -206465 -331122 -109922 165350
15945 -309386 49229 107186 -233347 -260599 73320 124276 140754 -15678 -66698 -142229 196694
15933 -50861 -98592 -121905 177465 16677 -244984 195095 77173 104455 94828 -49367 106851
15921 54832 -238136 166483 284716 -51348 90666 -64474 43774 -47862 -100911 -267141 -144811
15910 -144811 83140 97591 68710 -378667 279373 28339 -191902 46405 -351461 36265 -49139
15898 186044 46258 -18868 129142 96726 -250057 -215383 -110437 -31503 -296005 95260 -36151
15886 -96469 -147348 -4481 -270234 172352 -72451 -151584 -207134 -127626 -131459 128089 -280187
15874 -329316 181814 116497 3608 122694 -77143 -384773 -347170 -6701 -225355 -71257 -989
15862 -123999 445275 -127517 -47534 -146099 -91128 -112609 -23191 -38526 61552 -44216 326383
15850 182164 -148245 103785 -3561 284690 -217419 14011 -13670 -297048 63808 -74189 199028
15838 131672 -14063 205450 -266223 66694 -195119 54478 144850 -86908 91917 -224482 -230909
15827 -230909 -387824 32955 115005 -410020 45155 -59183 -18926 280998 -30857 70898 -42053
15815 -68425 -47618 -32809 125670 240637 -95566 15357 -20137 -90113 -58162 35623 -477418
15803 -82694 -204954 99482 -112223 -44148 -84864 82410 65364 86182 -134978 32659 -102319
15791 -51333 13435 112159 -44793 -243864 -7638 42024 -89855 134121 -183801 168112 240466
15780 240466 116964 -160689 117743 -297680 162223 153213 -207044 327998 -304967 59924
15769 -441214 14090 77542 -67453 -66237 -128250 -10701 193466 124445 144012 -231147 -68625
15757 2961 421267 194367 -19862 17569 -207639 -396218 121600 -189624 32198 68251 -88835
15745 -114359 51716 -235149 21347 51299 -141492 259815 114800 6091 -24549 52871 349487
15734 349487 72666 -292577 -60393 -158856 172437 -401593 -120773 197419 5682 -136529
15723 33295 107051 -19248 97489 -136526 -15595 157465 -233084 -102955 -114921 51002 161498
15712 161498 -161697 129771 83458 -25340 295623 -162968 -211433 -64887 -387362 -67333
15701 -80372 95352 -346716 95599 379035 -209241 18198 -384842 -9908 108559 140321 23941
15689 69160 147467 -45146 -61426 18263 -97111 -9428 -31859 -103950 166440 -227958 123907
15677 280048 -55001 147697 -326336 -171444 -52669 160729 -9340 491645 -396362 301789
15666 40818 -233100 -236432 -33690 263812 -14049 37141 198004 -3807 325580 29117 -160617
15654 26366 307777 -167816 -173743 194194 -324830 -207042 219169 -262034 129465 -66695
15643 -208643 -155154 -186826 -465432 116888 284028 17735 -80884 40283 -139525 -200166 27720
15631 -105536 -70794 -346456 171235 -331255 193319 -139628 -51198 388807 23994 -55741
15620 300299 -126321 326616 116387 -12594 -55946 -245316 13020 -125757 -129250 -70699 -128772
15609 -128772 66786 46203 -567618 -248404 -218699 -183342 -25779 387774 83245 -14953 -37109
15598 -37109 53225 -18062 -170251 -112094 153255 134078 -297276 -165289 -118430 154991 222611
15587 222611 -23116 -78648 193072 -228452 -16413 227000 119972 9672 -683 13841 -147445
15575 -13509 218928 -66254 -101209 41673 -182409 -221610 293888 -238823 -72843 47999 -213124
15563 280957 30961 -128178 -210985 102371 127754 -59675 329521 56672 -209563 82773 -349945
15551 33389 -119603 -159808 59766 -43675 -3604 -79288 15544 237112 44407 -210073 -131550
15540 -131550 41555 -29878 261076 25014 -246312 -484984 55939 32202 295885 -128327
15529 379329 -116516 149762 6037 -15001 -161302 49654 -344510 140434 -74253 -164433 -365417
15518 -365417 48175 -70934 281594 141715 134612 31145 188764 -144404 257624 -437839
15507 25328 31582 -261943 371936 -58302 214012 135136 164055 -92979 -111073 -78104 -306939
15496 -306939 -286994 -200654 -274506 24873 119913 -364679 -101781 -79908 -88598 -237986 51291
15484 -225753 -16369 126056 16082 228929 -471834 62370 -130712 -285078 44651 -47903
15473 137958 41577 249709 -159267 47102 -141141 140864 381884 88613 48028 -143025
15462 -160742 285238 -16520 190532 -144469 204376 198489 88483 16854 -145443 -255195
15452 -255195 -113070 -146546 290736 126069 -65761 -405479 -69086 -191579 102372 -94683
15441 -194959 -35539 240857 -118197 -112536 207343 325065 67972 172985 2527 130413 40428
15429 -76459 -91309 54515 175942 13982 -331446 -34836 71171 318372 -118800 -60320 -180486
15418 -180486 -81916 -59178 -270237 -162935 -100320 -139487 -206727 118559 -86431 -49646 -301222
15407 -301222 203446 188495 143344 -216907 88936 253886 64873 97894 37042 -83017 -179406
15396 -179406 17546 -146973 -40772 -57405 182180 -60624 -72840 208967 -368026 133829
15385 -198816 -68830 -249760 -175089 198502 164148 -8895 191637 -154917 32805 -44201 -16045
15373 -186818 173524 -4473 99648 -145584 -112984 13006 273308 102884 -97162 429287 89343
15361 282081 -158012 186414 -243849 -191958 140464 -41625 54561 -16948 351540 -151983
15350 42248 -272936 160782 -45680 -104752 -64135 -32607 -95734 -84405 27737 -350436 -78445
15338 119316 -24841 293699 -409822 124340 6631 152826 -66403 -68189 8346 336693 -92528
15326 -83000 68969 78865 142745 46667 84529 -59673 127655 -187148 44489 -65797 -283057
15315 -283057 -129548 80176 143813 449158 -160196 105605 -190790 114283 295636 125984
15304 87634 -49481 -256375 -13631 176393 146385 -16780 133780 71930 -20740 105240 87699
15293 87699 -134603 -109862 -63468 -268661 12441 25542 -99132 -30535 -312278 188650 -114555
15281 -142751 3896 213435 109492 -57690 229841 95742 -288800 127132 -101807 -12164
15270 288397 23520 17069 58218 103490 220924 356235 53469 130986 -93673 -60615 267427
15258 -42479 -55014 -110458 19969 -85490 -26109 -136093 326792 250187 522791 194630 545013
15247 545013 1042758 691348 466632 182563 -174564 95432 -3765 76422 242515 216837
15237 216837 114379 165916 -109536 355128 67974 376275 -184661 -48103 217622 -99673
15226 132486 61555 184287 -131908 -248224 52993 -52672 -171349 -33605 75238 164562 -116198
15214 539715 -24873 35823 66641 -185742 -94001 -43495 151079 -116780 210330 -36817 -128903
15203 -128903 -59473 9060 -777 -288239 -25608 203884 109091 32758 -67338 35880 401541
15192 401541 361219 85583 77556 509939 157829 18345 213364 182657 112248 167253 138140
15181 138140 56149 -30457 185626 31564 -84972 46626 111843 78664 90898 150291 -80849
15169 -86332 129556 31731 28348 294151 109480 -95650 -157205 59644 129204 -86669 -125513
15158 -125513 -157558 409713 -66685 142999 297666 -52111 61973 -165984 25222 354358
15148 354358 126852 -183898 19818 414067 -138453 327190 137348 211243 -90531 183358
15137 3524 256134 214688 59024 343895 46368 -152070 -179613 6895 452013 70057 121250
15126 121250 -251186 311426 293785 190954 83730 -3236 -106293 -35800 120305 29492 -395611
15114 220099 171791 -7574 193513 -29525 300147 -85276 129161 199559 415484 -28265 49934
15102 295832 232326 -43244 358927 205680 -58781 162980 241176 83491 177188 277577 -246492
15090 236737 -272399 130590 116733 124131 197501 94220 -231971 -10395 -118151 303533 155779
15079 155779 157858 -49382 -99285 -184939 303200 63939 179900 415696 330191 110048 -8620
15067 156763 -47539 223769 -164555 -27501 164405 80272 -3250 117287 45527 95883 -95562
15055 409254 505054 285546 -34986 150720 44215 235652 -4219 254351 91403 8522 -235408
15043 315679 27272 -153263 244215 149390 224266 480949 255052 161375 -89340 -275303
15033 -275303 93374 70554 -146896 135974 261303 87638 19054 175626 -152379 151201
15022 95142 -86616 200360 248593 402538 327817 -35705 -89375 -44945 399123 194011 141988
15011 141988 117094 221890 283339 183084 3544 343840 332114 140827 240096 231749 -115369
14999 438875 266487 -27442 151395 16271 229911 -45499 -44472 -5852 267211 162801 173295
14988 173295 -94510 238658 144910 358319 164030 -1984 73153 -76822 202380 281348 416013
14977 416013 -160000 6044 446071 239018 681663 134300 366245 343027 191873 84839
14966 64542 135743 327425 347842 488012 404574 343099 146874 484691 209166 100066
14955 72024 54121 109285 236095 53893 326738 287070 416766 142559 22508 -110859 387613
14943 245629 115686 264357 314935 40256 126580 444079 334985 86005 344904 263775
14933 263775 273818 151441 331475 203961 23974 58919 458140 206850 177861 339327
14923 339327 256439 311214 521405 249544 527135 151546 254993 390886 236093 180708
14913 180708 596364 463559 384729 298686 308352 354735 11805 154387 269691 226201 403539
14902 403539 -27258 343020 -140150 411154 481047 192244 193848 361972 278385 240373 169902
14891 169902 29743 165319 451663 73655 158440 13936 171213 497669 477618 12598 398205
14880 398205 137210 533438 251840 79878 250486 113878 356572 670915 467719 277553
14870 277553 495099 -82158 625089 171243 459178 297365 182873 279551 210806 344387
14860 344387 344456 474700 589080 -40368 454090 397903 216504 410280 442815 150356 360846
14849 360846 137034 332717 420511 638731 262031 507949 351117 308435 300260 304137 443586
14838 443586 479868 324387 165856 440311 613861 397699 683905 503754 426638 443586
14828 443586 157417 182200 244796 616594 163083 414644 395802 328028 548928 455227
14818 455227 331990 309179 252667 11079 274803 528192 277912 237039 483242 322566
14808 322566 437693 453733 480114 462125 413050 514738 1002029 512392 484595 175618
14797 436921 501395 286275 424523 667995 531264 399235 444889 228182 687666 473381
14787 473381 810928 599552 140076 505880 422445 219163 431991 18804 423715 386785
14777 386785 416415 449867 289757 658816 739814 569615 250033 366341 488228 494829
14767 494829 623955 628512 635218 372743 551164 446096 482114 626001 753769 315740
14756 286699 504589 507798 326944 31089 773529 349835 408676 270015 491932 836748
14746 836748 657899 233728 430960 521544 402533 507657 872248 262991 623497 345186
14736 345186 632941 717823 365131 410300 991042 581335 690317 543024 744579 224779
14725 586839 928200 858248 594976 852872 569457 442991 561192 906153 769777 319737
14714 697058 427891 500189 987173 605829 898717 994137 784957 623526 515001 696068
14704 696068 886920 546205 869058 714790 625932 528330 968535 752022 432199 759832
14694 759832 921461 745482 854592 420893 744303 868341 481729 969398 700092 616706
14684 616706 800742 679430 724253 590339 799058 917313 883043 707810 574095 816417
14674 816417 752863 821637 746753 743842 895774 747800 985845 801815 735442 649359 1152579
14663 1152579 1169005 712482 997791 707617 912987 896432 643907 798270 859501 892329
14653 892329 874520 1188572 1191260 1014871 1096654 1090555 1078821 1096100 1021498 971598 912923
14642 912923 1090069 961334 930355 1191640 908082 1305468 919148 1181488 994652 1221804
14632 1221804 1272157 1161175 1246367 1175738 1230165 959701 1112095 1351188 1260062 1246249
14622 1246249 1422627 995541 1231111 1191588 1233550 1243366 1314373 1266633 1400777 1357800 1340272
14611 1340272 1214805 1375829 1197837 1027277 1273021 1303873 1622545 1467985 1580153 1269277
14601 1269277 1430649 1456450 1715854 1174127 1508527 1357173 1372219 1291093 1317814 1570121
14591 1570121 1616789 1413384 1528237 1497975 1388557 1556215 1468467 1654777 1577608 1886503
14581 1886503 1553590 1776878 1834790 1572878 1633151 1674167 1643355 1612386 1588267 1916939
14571 1916939 1843966 1918310 1857848 1993578 2194279 2012586 1818517 1908517 2153903 1974416
14561 1974416 2089316 2170667 2368650 2359284 2393294 2819820 2801177 3251243 3325341 4060973
14551 4060973 4358458 4891688 6991762 11981556 20323072 29355008 34182667 22549123
14543 22549123 10782853 5308940 2783700 1862042 1673784 1718406 1787746 1278926 1475962
14534 1475962 1127132 1542133 1597502 1500991 1879339 1813222 1852418 2014838 1642597 1998159
14524 1998159 2060281 1962285 2125418 1838908 2160510 2159024 1948316 2053885 1941227 2067263
14514 2067263 2164450 2128109 1943554 2615295 2528143 2132221 2250377 2288478 2598506 2406209
14504 2406209 2437727 2306407 2434703 2643913 2434454 2673354 2881534 2573282 2691877 2873593
14494 2873593 2817692 2910526 3022523 2808410 2577363 3266650 3275878 2877078 2791938 3395667
14484 3395667 3325541 2971621 3092121 3023516 3248761 3261226 3259708 3256057 2996538 3292255 3349259
14473 3349259 3555273 3243079 3458297 3501031 3766632 3405346 3493008 3818845 3834290 3490947
14463 3490947 3843907 3880688 3608781 4102778 4085542 3934978 4153485 4378799 4189925 4123527
14453 4123527 4455867 4553398 4452654 4795835 4470418 4569113 4684220 4754043 4767621 4678414
14443 4678414 4701827 4915743 4879380 4930715 5204263 5357077 5258520 5178968 5292520 5385620
14433 5385620 5759760 5895868 5782194 5807416 5800781 5977167 5894654 6313642 6004514 6163489
14423 6163489 6414274 6555256 6367457 6432561 6605781 6796603 6731885 7092085 7264470 6878114
14413 6878114 7164239 7339628 7506308 7495862 7381232 7660955 7592898 7851287 8396012 8185692
14403 8185692 8273969 8505801 8440209 8804000 8766906 9029719 9503232 9281791 9529926 9854083
14393 9854083 9843096 10070299 10062548 10343528 10574968 10365501 10825206 11120233 11483475 11457050
14383 11457050 11616353 11895633 11976202 12589375 12751271 13093957 13267701 13671008 13812022
14374 13812022 14091551 14155196 14642357 14836788 15192003 15586528 15633646 16392226 16482147 16729359
14364 16729359 16984322 17635172 17784299 18646624 18317137 19412490 19469076 20030672 20574546
14355 20574546 20769027 21782231 21914804 22477667 22971876 23982889 24237015 24722961 25765743
14346 25765743 26281217 26858472 27430499 28085045 28678152 29659474 30477776 31235978 32307694
14337 32307694 33122151 34063294 34862596 35974710 37270207 37936927 39596642 40571090 42130071
14328 42130071 43146764 44676681 46044670 47691889 49307586 50969797 52585801 54558352
14320 54558352 56539909 58841798 60926913 63418236 65540872 68402669 71222173 73524639
14312 73524639 76869257 80063840 83435107 86867895 90194301 94454870 98757768 103714835
14304 103714835 108542321 113348641 118522090 124413760 130316649 137107673 143847095 151064468
14296 151064468 158988897 167366485 176637245 185755268 195374830 206088075 217362803 228740892
14288 228740892 241074506 253952198 267582895 281638645 295656444 310602585 325452247
14281 325452247 340319678 355369638 370178224 383991207 397794396 410166058 421252842
14274 421252842 430421554 435106965 433284977 429908161 428201872 430280171 428917264 424172037
14266 424172037 420856050 414398681 402977700 390100959 375296787 359774097 343601965
14259 343601965 327312376 311492778 296068794 281137653 266637662 252992775 239523641
14252 239523641 226770258 214822288 203529568 192758742 182348037 173085533 164360050
14245 164360050 155944397 148655585 141340424 134185715 127318270 121494204 115939174 110913221
14237 110913221 105891330 101134148 96518378 92415091 88764771 84818023 81371823 78315083
14229 78315083 74818289 72045301 68980959 66391787 64115341 61805961 59238027 56991803
14221 56991803 55144349 53177045 51468538 49849150 47971753 46235867 44814180 43558334
14213 43558334 42307178 40956782 39784125 38664235 37305968 36076337 35443360 34516351
14205 34516351 33272012 32391826 31430753 30718559 29947870 29180002 28142049 27691637 26599751
14196 26599751 26074700 25386930 24860750 24217252 23523485 23115968 22545996 21760142 21213437
14187 21213437 20709555 20402448 19885842 19284152 19082804 18653343 18221242 17824903 17519508
14178 17519508 16927613 16682987 16429203 15897658 16038366 15685826 15262593 14915051 14360693
14169 14360693 14799093 14233146 14007321 13387391 13470246 13105307 12911211 12432828 12683338
14160 12683338 12067545 12048358 11942058 11838704 11585416 11487334 11107685 10751390 10892392 10406791
14150 10406791 10122147 10223921 10082012 9984672 9998631 9676622 9213937 9467148 9225508 9167091
14140 9167091 8878884 8828770 8869293 8688735 8442092 8240556 8206241 8074503 8112235 7813496
14130 7813496 7630243 7474386 7280900 7632753 7298754 7264571 6894446 6999258 6731574 6549929
14120 6549929 6785425 6553472 6470031 6134396 6456180 6391117 6022555 6161530 6136238 5686790
14110 5686790 6006649 5852865 5870537 5638676 5854535 5459947 5220411 5527670 5218034 5092878
14100 5092878 4911334 5035643 5045067 4651498 4818872 4780433 4700779 4757285 4573489 4705716
14090 4705716 4840901 4589412 4656107 4525938 4285727 4362561 4497218 4407299 3999558 4307417
14080 4307417 4369266 4034876 3998369 3915821 3808600 4127499 3969224 3882858 3826245 3736244
14070 3736244 3953570 3447499 3888933 3706962 3536251 3589453 3697044 3346911 3300854 3526449
14060 3526449 3696416 3633641 3695633 3580781 3539593 3288830 3167628 3306933 3253448 3135984
14050 3135984 3292829 3096051 2823413 2928756 2928279 2926727 2783706 2885638 2932937 2750474
14040 2750474 2625086 3143250 2399154 2776156 2651336 2456040 2663280 2536499 2449168 2729860
14030 2729860 2817002 2435481 2561513 2377001 2745733 2182459 2433043 2583015 2485900 2401865
14020 2401865 2374924 2289973 2606070 2067883 2129956 2272073 2092183 1989417 2427971 1690810
14010 1690810 2060506 2062323 1813059 2057408 2005739 1971622 1913596 1993152 1799559 1562654
14000 1562654 2301141 1877735 2220145 1846998 2034467 2099672 1996974 1885799 1935712 2250809
13990 2250809 2153139 3674049 7554276 14793052 23876025 32877163 26422909 14608125
13982 14608125 9119341 5723113 4238397 3563479 3287260 2877366 2613361 2468683 2166440
13973 2166440 2249620 2188145 2689776 1932479 2049405 1763694 1850856 1794666 2119095 1792884
13963 1792884 1951479 1989110 1701022 1745115 1823906 1599092 1856276 1912145 1666476 1805936
13953 1805936 1866305 1678370 1365774 1962007 1699601 1621462 1503414 1638712 1345387 1614660
13943 1614660 1404333 1741793 1424568 1496373 1390679 1536922 1359716 1818428 1556730 1462053
13933 1462053 1150744 1497609 1081148 1417109 1184050 1426006 1533685 1327288 1279520 1627461
13923 1627461 1494303 1330872 1276704 1190533 1171384 1462821 1070673 1168456 1307425 1399749
13913 1399749 1370350 1367707 1049550 918011 1249505 1175085 1287327 1033878 1256382 972654
13903 972654 1136726 1290731 1163317 1300701 1041146 1311371 1163036 1089616 961053 1159400
13893 1159400 913546 1351673 1022854 1197099 1131396 1257343 1150979 960509 1025746 1083647
13883 1083647 906577 1091306 1125635 882063 910489 653408 856045 945138 969774 844351
13873 844351 968967 1088489 1324265 811334 817052 944471 855777 1042639 1027286 1002066
13863 1002066 924459 889573 966901 899988 738453 902220 1207715 847776 985270 707644
13853 707644 759402 713520 1063605 931970 773020 937939 939943 776394 461664 968169
13843 968169 721021 648460 963660 1007671 715279 659330 731652 826262 868185 876277 656299
13832 656299 544396 908278 517016 835069 1073821 932051 741167 1130085 753979 486445
13822 486445 946930 678764 849629 753677 786367 720123 811885 603908 476082 521094
13812 521094 608920 875832 681835 696626 642269 502392 1012796 481031 571597 768341
13802 768341 544998 593006 1032861 482112 422316 852065 427822 540465 935463 655056
13792 655056 877041 693228 590693 660909 714441 723006 659756 831103 429220 529855
13782 529855 611886 715124 534896 604571 402486 323789 654649 540177 845008 612388
13772 612388 527870 667188 802338 566575 563937 833045 690167 663962 642146 294442
13761 413849 519237 545749 740146 635970 610004 883607 859105 541283 564820 679676
13751 679676 621421 657920 681348 427647 738479 557404 488261 605892 957160 362691
13740 669144 632894 948921 698751 371011 578196 553271 507365 728136 314643 545519
13730 545519 445715 513613 713847 220968 395093 154484 453507 452184 490460 307008
13720 307008 434022 134217 685378 364699 484138 85923 542072 306120 355079 312650
13710 312650 492335 670370 570044 544937 391864 677148 347631 439239 455233 558856
13700 558856 388936 743151 216474 364061 326594 227252 436522 406707 428450 501240
13690 501240 226733 215078 504269 495172 338899 543317 456679 274033 403372 212177
13680 212177 -95 538915 493286 380371 321715 657546 628619 356485 290551 615885 431752
13669 431752 42350 606500 391986 310046 224484 386838 268646 524675 592532 357875
13659 357875 453893 151979 346351 177236 339878 451796 77404 385628 21811 248060
13649 248060 465212 607423 30355 171681 413087 365935 265250 102846 206819 100517
13638 321731 401829 228956 498026 295679 114628 534986 568579 242387 438005 327097
13628 327097 65117 614117 366399 298706 517599 259502 192234 362643 394429 573511
13618 573511 167487 30927 121910 433491 507257 422293 496720 390488 237695 63786 533799
13607 533799 325371 244053 350564 198380 129150 -2293 305963 102103 458282 141345
13596 442145 272290 252013 613554 123251 384883 220762 958229 23738 218824 81442
13585 344808 441713 194677 394978 262273 235005 204618 227663 676117 154118 99674
13575 99674 417043 240095 111891 210035 540766 401103 322328 365505 438031 304750
13565 304750 264889 374223 11221 89095 275982 271437 501820 105736 222477 213083 200259
13554 200259 291785 190575 -251370 149156 210818 368668 372549 344898 203866 -53162 261593
13542 231375 117071 441153 394008 397614 601828 276318 103423 358015 405017 487773
13532 487773 -68201 114355 -27377 131819 519569 10367 512193 127540 642990 57810
13521 193556 16987 11765 125566 73264 53740 87457 324516 211379 277817 186535 272900
13510 272900 298702 262964 320930 380218 613223 118160 140704 -48951 233882 370241 129451
13498 198480 194353 178187 561551 398461 55694 -132270 255039 500480 145564 389938
13488 389938 -51528 145760 337962 168584 327288 123006 90220 303444 160012 420692
13478 420692 287515 271453 157840 278913 57357 152468 -29796 6058 332195 302297 430070
13467 430070 98165 503202 214711 -31476 176270 238942 182501 145470 111974 478557 463266
13456 463266 262515 427078 271265 354564 -133583 -48007 103967 223171 217641 134450
13446 134450 170570 -88873 315673 325120 351820 207839 41297 278844 195889 273410 9934
13434 364137 222119 217712 -26051 162667 109958 155837 251815 107831 503077 -108413 66436
13422 297841 339971 -278389 146846 222095 -36389 58049 187836 114125 -127997 -25637 201250
13410 -36638 254878 183475 184642 279891 41708 75257 228866 126529 420749 107057 302520
13399 302520 -85510 140962 216530 164090 220159 497342 288187 -13219 73663 350362 25108
13387 -15555 -248002 281785 447003 271802 357877 -120628 217182 68066 78302 207873
13377 207873 33433 -233436 189710 56968 351482 243445 243940 293427 -17276 301499 342625
13366 342625 -105657 310634 276947 -181907 292679 -50241 37229 32886 29130 195346 166817
13355 166817 282798 316295 307736 475143 -28639 -63412 45021 372395 133289 331851 207878
13344 207878 95590 -188843 -7411 65042 221448 116710 -34898 -48144 112058 111688 109772
13333 109772 236914 -51250 -17322 114771 148869 -159292 80116 13105 211486 171245 258284
13322 258284 134273 126762 263999 308083 -107403 40826 337613 52343 316650 -203120
13311 251917 -89380 302314 17878 97431 243242 73754 -11920 228361 246481 83524 123792
13300 123792 196307 12009 73042 155759 116893 40828 -91460 34937 47285 76516 427706
13289 427706 33414 247648 -111725 262419 112716 184919 178655 76508 -8762 -118122 338988
13277 405303 77154 37780 257743 178737 195938 -101996 238231 19961 20256 18875 24812 25583
13265 25583 -48271 54055 158354 45286 -230883 42884 4186 -140472 60678 -72905 456363
13253 75491 324061 148686 -62759 90765 -246544 234260 28076 347360 287841 179205
13243 179205 262124 -90502 -40492 -227586 -158607 -205607 -17262 -34089 2248 9969 81857 87099
13231 87099 -70146 20363 37851 278370 134655 211475 105065 75003 -25940 484001 -151007
13219 -48125 80402 222720 -66335 49172 108138 293352 191336 116852 390307 87841 323628
13208 323628 -104451 123376 -1155 150946 156162 -148715 189186 54018 -126812 69218 39586
13197 39586 206639 -154612 -24087 -190253 223762 460355 156733 442755 236623 56779
13186 246562 -32734 -173439 163511 236888 276737 -2031 69488 348740 472502 -229841 -89169
13174 158512 -73 176569 100598 113874 256923 -107877 17481 102666 139281 -46013 327475
13162 105202 -206908 -38536 339090 251298 153426 84865 42704 49210 99575 7603 -279359
13150 -67206 -273654 212268 -349686 53276 -8576 273539 -77376 238636 213438 7906 -10457
13138 -124590 125850 -66314 135270 -195357 206849 53059 281395 -126003 108186 147987
13128 147987 2133 -47873 64198 -170647 -47217 -136354 -143176 97188 197718 208539 -264935
13116 148083 195862 370549 -31158 145200 209885 162114 12655 17425 -79877 124418 46920
13104 -158292 106508 16808 -227250 83600 46423 -63864 -27866 -38941 -7915 13581 -69442
13092 220786 126429 195439 157243 25796 -250595 -22090 -233390 -149930 48369 -89932 -107
13080 -68655 301801 -193051 185228 -162394 41333 284962 199638 -162128 127128 -85580
13069 14010 -16535 -218804 324907 313356 -72620 -3731 124782 311103 106990 411584 61965
13057 206975 -116793 455959 -54490 -1517 -44844 -14470 -4021 -258128 175487 -63418 361775
13045 -57171 140854 -9205 180240 123903 52143 87338 95136 -98382 269391 129708 197081
13034 197081 154727 3430 -274552 329478 206634 190788 298113 74863 20730 111197 144020
13023 144020 -47752 229901 127960 1767 128382 375098 -15446 180376 55081 251127
13013 251127 -123020 -203584 -234550 261516 230921 39782 198141 -35653 236799 -86609 -110696
13002 -110696 24752 254838 94168 -19693 119753 241723 -178003 237490 73617 55746
12992 55746 -102328 293038 -70237 -171863 99852 215837 70896 -264093 180134 372010
12982 372010 -25820 -39281 34019 -265893 269231 416516 -138964 229617 -221196 8385
12971 -23362 19854 -27987 -16659 77086 145366 44291 117789 342687 132566 291639 -189252
12959 -101138 -8518 86575 158827 -95924 -133234 84668 -1432 -61174 -226357 203478 -150063
12947 -63292 -258160 -229996 187422 -111802 -20183 86245 46322 129105 -64407 45241 237344
12936 237344 116805 17929 -281642 -136258 -161556 39016 -222939 -185494 109608 -121002
12925 -33051 -366696 -139344 -101517 24936 106791 220497 -128126 -140142 3119 15699 -36964
12913 77635 -76628 -4492 5824 -151273 -225794 100158 47987 -106888 269706 126886 127615
12902 127615 -351542 -5992 56588 -2329 -24972 92997 54844 -1404 44918 217653 22374 242593
12890 242593 -150705 26338 -147177 143456 -83414 135940 44701 -245814 305976 -84714
12879 -164957 -125179 31578 363854 -190683 -203266 83087 -6222 447930 -181387 -5217 -129308
12868 -129308 -63575 166622 30388 -182800 78237 99062 274388 -35813 41012 81411 382052
12857 382052 -119260 204551 158951 -352503 164202 -40478 88301 -72379 135585 -466458
12846 -169998 66285 -347740 -176642 58316 99255 120641 66319 -137523 92620 346628 908
12834 -130744 124682 183796 -40777 -241125 -224191 150219 8866 -157407 -122567 -142381 -146610
12823 -146610 100255 105848 -121822 -109966 -29813 183399 222504 -267828 -55993 29913 249187
12812 249187 95764 219854 -71106 92867 226553 23145 92783 12875 -166460 31169 296140
12801 296140 -123974 -203630 115982 34189 151231 43445 108185 197109 -274395 -128045
12790 32646 -153944 -176073 389992 269651 -185970 -33252 -133477 68520 -69227 77350 132546
12779 132546 -252220 71662 167494 -301734 330617 64784 91900 316133 289244 -1888 76373
12767 -157994 -6566 -256024 -136122 109910 -390160 -304917 -66368 -31181 397631 -201420
12756 -44225 -156840 -88883 28463 112858 31735 159510 -166193 272025 399160 87410 -192607
12744 33281 -29359 95082 -100106 -88485 302577 286950 307599 -98921 58521 284413 292468
12733 292468 -187791 198093 -14064 45459 -72981 97272 18710 -15939 -39663 285389 -56082
12721 118535 -211024 -212934 -214126 147755 -65055 -151621 199242 -143670 -112508 131255 248055
12710 248055 60479 169595 324743 196812 655759 165518 303113 275679 -130066 301032
12699 -159688 152319 207981 48055 -127916 -205049 -126385 -15314 102800 -129520 -168974 210292
12687 15376 -338608 136509 262014 78804 251575 -22922 -9982 246480 124341 166155 36694
12675 14147 22740 186858 -81255 30180 126971 271597 -209375 255236 283319 146165 -306513
12663 79326 -30600 65470 -76714 80130 263629 109809 180505 92279 -92332 22256 -41762
12651 257661 -193485 252949 281677 10819 140185 165456 157508 -174379 334064 208376
12641 208376 -74845 26254 -132693 -195096 -58892 289502 -256813 538389 187246 117612
12631 117612 90165 396914 443488 231327 507510 180978 372757 15843 103619 42993
12620 77964 619105 -183415 361363 -349935 -53106 44977 23934 -39807 90747 -292502 181249
12608 -48362 40762 368235 -178334 269427 302398 313320 104182 275150 119730 295631
12598 295631 137420 313443 -96669 -63312 -20116 72497 111849 -201383 93663 -149240 -108646
12587 -108646 120833 303731 -122528 -217999 -73009 -144369 35816 -74912 587847 3756 26417
12576 26417 -60695 42562 -273704 -88011 61151 -258675 40661 178784 -182947 151483 191866
12565 191866 53333 411460 49396 136026 35730 95439 259585 309919 119052 40436 123454
12554 123454 20999 242952 114159 220534 -133616 -170003 -180230 -29705 -75093 162587
12543 99047 -50635 187666 118460 53584 -349076 39231 -128556 -116738 -196865 -203158 -287574
12532 -287574 54520 40777 86046 67054 12477 -32794 26465 303558 302852 297780 115493 -290165
12519 -37778 234663 246866 -57486 7579 82402 78170 -173329 213216 -262129 -140909 -5026
12507 -51581 71160 -56995 -30168 55834 -414185 -11014 143653 -301997 -184637 230641 -161139
12495 3046 8626 89237 -407848 370833 -127964 176435 -223850 -67045 -19689 -317961 61872
12483 -86866 -196515 -54114 -385288 237856 171001 -377231 10105 3570 -64584 77576 -292782
12471 -14884 -38776 22820 219573 -16911 15146 -349500 180337 -243881 -86804 -124013 71132
12459 -39010 13462 33110 -29219 6339 128323 -152402 -13739 -108617 279860 -80463 179920
12447 -343009 -339276 -168034 -45444 -120479 45120 -320115 24234 12901 -63423 -42864 241438
12435 117365 135456 21371 -156270 89938 -166413 229487 -224417 -362718 90014 153144
12425 153144 166174 -240038 -81284 42866 -156233 41897 49475 170260 18102 -136231 183368
12413 41191 -33803 -346009 -117811 30741 -38668 -3035 23661 88012 207375 -10081 -325744
12402 -325744 50824 154517 53298 -308369 144300 83933 4431 -123219 -59399 136005 -174496
12390 277298 88915 190424 -15300 -113294 -64978 -329173 -81972 -18206 -189030 61553 261515
12379 261515 -324640 -225230 137101 60797 -5468 227598 -199221 -2766 -154160 107932 -314404
12367 143245 179286 -219574 -61742 -21112 -281867 85551 89725 -145150 185510 95004 196752
12356 196752 66858 27654 194742 67122 -181312 -63956 -104482 -184411 100404 -82804 256577
12344 196154 -101420 125665 -57428 -41377 -79584 67541 255334 264687 186554 -123671 98560
12332 -123514 64099 74276 -47583 91936 47787 28092 239268 -78218 501809 -121715 199996
12320 103016 63642 302736 232750 57398 27207 -147217 -86834 16391 -53409 -23705 -89173
12309 -89173 24916 -172609 98421 461961 189219 -227298 -14800 -18695 152611 37130 69529
12298 69529 10835 -29193 -21628 -30241 181557 87463 80892 -157232 -211055 87298 138675 273416
12286 273416 -181655 75276 -32304 65705 -17661 -97431 69375 138210 61336 72995 -132107
12274 261527 428 163301 119403 234415 88153 -192626 -61386 177839 -144287 192632 -92115
12262 1430 97131 229797 5532 -5798 -105125 248560 -26787 -127681 -20047 -111728 341538
12250 130941 73764 155756 69078 -163496 114600 142641 345839 170327 229718 -67167 -112356
12239 -112356 19277 238153 -116339 45415 159252 125600 141361 288515 170355 256035
12229 256035 -13751 330077 129898 102587 294280 140453 98453 227964 -401393 166871
12218 -28215 52759 40452 126883 -31004 38252 37122 -278448 84716 -35699 30782 -107907
12206 -6558 -182019 -13531 -186421 -168422 151809 -29596 80302 175719 86701 2120 -11099
12194 -241104 281764 125720 155872 -164356 123717 330589 123168 -30479 249754 211703
12184 211703 -59378 72946 257668 -21346 46054 -175243 -25845 21602 114300 146563 202703
12173 202703 89571 6603 -42011 94174 241601 -85544 183239 102633 256446 -56023 -174844
12162 -174844 204630 42694 52666 -219619 91 150390 -371106 -245410 441037 172931 65444
12150 142701 7333 207687 206220 242125 -67058 58525 156173 333068 -45893 140148 -91112
12138 292291 -90457 -208848 -132978 -74763 -112764 -32023 -133162 -147869 130688 -59128 -2112
12126 21779 169947 -8163 -121003 69582 8951 250162 -33530 131373 112230 -112447 29214
12114 185929 319749 -103792 -278326 -35891 325541 34270 253821 -149204 260963 136319
12104 136319 -220495 -53063 -129210 -216703 -183718 154235 23971 126909 143926 283517 -36118
12092 100822 -210749 213752 185787 -310823 8803 -517358 -135052 -140172 7391 -180110 -140381
12081 -140381 -61983 -327957 -58014 339086 845339 1365644 879335 120109 152838 295858
12071 295858 39017 398012 -108843 237141 32531 -186011 289512 94286 -263681 79632
12060 175062 107600 -73330 197480 17679 -149582 -63664 -262553 -139569 -323815 105756
12049 97198 -70340 110455 -7336 -243769 -14694 205694 115537 104210 28890 -146896 -387799
12038 -387799 -127449 97187 -54423 4715 -228276 -83812 196931 24337 96018 282143 -312393
12026 27200 -37375 11210 71442 268347 -102429 -320232 -294420 -120133 1997 -27136 -82728
12015 -82728 314188 220742 316640 18349 154964 -148391 147250 75791 -155211 -145740 199950
12003 -10977 -115562 -8861 83995 -122098 -392872 -319277 184022 -46123 -67900 -208649 -182318
11992 -182318 -231358 -4227 -81762 48677 -59821 -66524 54876 -106570 173731 -208283 -116221
11981 -116221 38105 -82897 -252409 2256 -145238 375894 -123822 211068 -531074 -46274
11970 87197 106601 257928 -57906 -165540 -72523 7793 55940 -275530 193734 -227567 31925
11958 155529 57924 -109861 -158600 -132405 -112757 108791 -78738 124755 -245153 -43732 -123617
11947 -123617 17402 -133723 -155557 -264413 277779 73415 -184358 183755 88839 -216721
11936 -325183 -35849 111954 176945 212542 10597 104506 -271756 178070 -80349 -26420 -318593
11925 -318593 -96665 117712 -140071 -99808 236856 30343 34244 -6226 -154926 93158 -202712
11913 158972 -132634 236766 41422 -18586 -161900 88849 -141606 -96655 -55357 -84183 -113903
11902 -113903 135730 412714 292686 -145547 -9353 -59538 -123916 -29664 -68986 -239935 -99541
11890 132227 -269234 -442032 -351160 15782 5811 16387 -209425 -119546 -84597 9131 248982
11879 248982 -127173 -158671 -221439 24287 -171660 -219461 181782 -183871 67699 -184742
11868 -112808 -233082 -191836 -31229 109018 239969 -160481 -300196 80548 136064 -80217
11857 109168 125123 113873 154812 -128221 302634 21348 -85526 124869 -175741 -37695 171831
11845 -29567 -237306 54302 285094 71247 -58250 54032 -112097 -118592 -219116 -195725 -151402
11834 -151402 71943 -49698 -185519 -82732 23017 -159745 96123 70237 -239446 -182482 237253
11822 -158476 192250 -37163 170843 96917 18022 -8205 289989 -192516 207389 -89919 541389
11810 143784 176263 -85880 188544 392972 -231256 350977 71238 -196517 53599 206327
11800 206327 -50385 -209662 178793 -391187 -294781 -125223 240519 129473 -279538 -200250
11790 -200250 183109 -67256 58745 -99860 61356 50420 -214216 -136295 -141687 -108661 -50171
11778 -164831 -145306 -15356 70483 -200054 -60570 -71414 -62417 168976 -165380 37319 137750
11767 137750 101277 -452149 82215 -314303 121319 -65913 -326223 421319 -42669 175965
11756 -96183 -322280 199003 86720 -10882 -129232 -145891 156684 -48726 -26044 -190987 -139439
11745 -139439 -272907 10140 40112 32801 -119876 -247079 6748 276632 -467916 130747 89172
11734 89172 230022 65723 -155539 407987 26189 -53045 156764 198905 -76738 154147 294898
11723 294898 -226354 -194047 123722 393470 149453 3010 -268798 226516 306848 90577
11712 -69166 148522 98469 27709 53899 97842 -264549 -295179 105235 115802 -278723 104250
11700 90003 3911 127565 65636 -297390 -192688 86542 -131012 -151664 -189718 99379 -101235
11688 -189207 -99143 238434 117738 284982 150544 -87798 183800 64849 6981 461076
11678 461076 140873 17408 -180071 47954 104403 75831 63900 64082 -202382 127642 357113
11667 357113 -107046 -242296 214418 341332 156110 128633 -123586 -184714 -120372 5329
11656 145411 95910 120034 -198764 138356 65114 -40315 353174 -39235 321290 -125679
11645 74069 -148921 73582 -128070 79208 165923 224012 -21004 127230 8339 75313 103205
11634 103205 -173508 112936 120677 -184791 -29067 -296376 83139 -47490 -65803 225180 -11720
11622 133467 73124 -95168 9846 133939 247103 7187 -229873 -82979 206479 137758 -54451
11610 179681 248472 -26627 -86717 182023 81879 57627 -28868 -118382 116346 105949 140523
11599 140523 129797 -27448 62609 378923 -72321 168315 16437 -83618 161172 255922 67109
11587 141019 -63992 54125 228745 76426 -8163 36999 82327 292125 360185 -207028 255255
11575 234701 -49527 -349820 1212 23324 189823 -17722 -70360 126361 -93111 172821 -111603
11563 -102506 96288 -43064 118208 -47663 29188 240574 101602 76317 64613 123753 -38353
11551 66072 -70697 102160 101227 -220645 -59061 23328 275539 77680 88920 31698 293344
11540 293344 7194 72802 459141 -73439 81863 41095 -85721 94954 210436 142131 68602
11528 30686 165805 125024 7387 176784 -42706 42767 79185 40007 -223135 140374 354148
11517 354148 145763 -69438 132270 -111971 -116938 138674 16169 309357 384250 168814
11506 5563 96339 50481 109695 190440 113371 116691 282027 -34113 358263 244406 313413
11495 313413 101665 360881 93467 178030 132472 177665 423129 -233728 -73802 -112826 47968
11483 -186568 227566 185022 129106 -197366 9584 283930 133526 239183 21918 362571
11473 362571 147498 -58138 15819 27927 46175 47981 94672 2080 40934 154207 369427
11462 369427 -147334 54625 7386 -51905 350589 -6448 51333 407273 -22040 294626 -8315
11450 -93947 -217775 272538 178026 77087 17170 17670 77698 197611 -183756 -221330 -35136
11438 320046 102821 -292582 52460 73364 47300 -10435 241874 342357 59873 121940 87513
11427 87513 -142283 -85590 -173211 -203228 177610 45792 -212908 -499768 -59042 132581 -158270
11415 10498 -175856 -223145 -86361 -375847 80892 -31235 247147 5497 -66321 -224865 -147767
11404 -147767 137299 -160592 -6393 -90948 -81061 -60526 -300597 23449 151935 50088 -29190
11392 -150560 20214 -97339 88813 -212723 2664 91805 184113 -38640 -298972 -165699 191253
11380 -84532 -48170 190276 126444 -159185 -17264 15981 -356867 40609 171329 18743 239084
11369 239084 -20370 167176 152535 132478 -116035 375842 -231553 -228411 -189997 -39050 97682
11357 151367 -281177 97209 317352 -36208 194649 39853 -79103 -79202 79145 -108680 -149562
11346 -149562 -145340 -142920 130147 151557 89973 529 11535 207304 86710 -95817 212061 -15732
11333 80056 109289 82858 -158658 -105979 -48270 173772 175108 -43875 -116403 229926 257829
11322 257829 -17108 -102777 -105767 -157502 53189 193469 83489 262576 -91727 96395 -11158
11310 -35058 -85521 66995 270497 -100190 -125486 208274 198872 -179168 69510 82658 84726
11299 84726 -289708 -155289 19198 3 -58846 7512 58723 -17735 -155551 313285 8660 -255397
11286 250086 -118221 -58348 141662 -230484 -236679 -55868 26462 151191 -16076 -80817 59662
11274 14794 7114 115744 157456 -264307 89300 -349245 -75950 138541 171875 -438013 120132
11262 60769 37703 -58400 86892 -159398 -235269 242527 -235515 -75468 -57556 8334 387790
11251 387790 -329841 -67012 205064 -113757 55788 -158482 -412294 -99430 132545 52509
11240 -138647 -23003 -257029 -218792 171620 215637 -82989 49226 -95762 -68867 127727 -337627
11228 -391405 100659 -47830 -234221 131997 -101622 -205227 -20277 -12597 175615 207661
11218 207661 -208628 -465488 -333951 -7864 -88538 34939 -233117 -233945 -7495 199182 117245
11207 117245 112158 -256199 -65913 9358 46149 204509 -31464 25201 -336671 -205662 179038
11195 -243429 -123983 99682 -158843 -121132 -226176 -16801 43448 -127388 -41494 -29781 19561
11183 170952 -179305 24555 -15120 -51512 95285 161035 66106 139967 -195875 81205 90393
11172 90393 42052 -3162 -169216 73057 -269673 94402 -77670 -212215 -13388 -190823 28106
11160 54549 -134506 80942 -246680 26605 253950 102145 -595835 -97496 52941 267072
11150 267072 76711 698 -261340 1093 -103954 -69840 47436 -113091 -3282 -165855 294560
11138 -125730 226374 26413 -67329 -321005 147981 264025 -108114 -107430 -88139 -201209 57339
11126 157657 -84297 81785 -14753 126206 198000 -279122 -182132 83420 155638 45621 59739
11115 59739 287600 271848 26864 282125 242243 160780 124854 78370 15163 52992 -7149
11103 493551 113056 -225115 107897 -60400 249906 189175 -84945 306094 128890 27657
11092 177489 157584 197585 68456 271891 156829 87753 -225892 -798 292121 175892 140996
11081 140996 206215 375286 23041 191187 196274 295891 381361 -250231 229966 283647 -23062
11069 354049 571893 219929 99828 362271 478452 100756 165016 361076 414387 351075
11059 351075 739072 399089 570533 577009 477346 741826 582122 681692 799905 498996
11049 498996 233695 616131 540894 446682 614167 831717 547418 561573 282814 566449
11039 566449 817486 941641 587733 444636 356398 613676 345822 620004 220542 478759
11029 478759 453811 406897 767365 311188 725493 570663 272366 672719 607603 504282
11019 504282 603857 672341 612757 621427 968415 309654 565581 269262 268163 530619 759008
11008 759008 481414 410479 353291 541991 522457 675995 788579 585718 667882 696753
10998 696753 834970 711857 486498 542350 246883 349970 880823 704669 595589 774664
10988 774664 747310 591218 953841 759149 604932 836141 1083371 1080821 1246833 1252524
10978 1252524 1787755 1256573 1672337 1922745 1945697 2121127 2249254 2347112 2082986 2503543
10968 2503543 2284092 1886817 1922525 1532043 1290979 1700996 1737543 1605287 1540642 1870671
10958 1870671 1651111 1820597 1976465 1438007 1435200 1134609 961310 996058 712480 771319
10948 771319 397858 436002 310962 307325 456392 481627 299617 302175 -155738 -186689 218128
10936 -125182 13234 345695 181473 183569 -191529 276294 330275 27305 171382 250926 209539
10925 209539 -4511 -275437 47751 13677 141552 96445 -35255 41543 156610 265516 -53599
10913 191361 16271 -229887 164894 -371749 -53051 -21843 104592 42270 -283400 -48170
10902 -55493 100280 -66808 -56901 -270446 150672 140428 -27104 -41488 186433 9131 407064
10891 407064 234592 47954 39642 230215 167787 45865 132262 -259736 -163696 40742 35668
10880 35668 -50432 -318446 97663 18487 -122214 120539 -57074 150595 -148665 -3980 173154
10868 134655 215560 -300045 83278 49823 82023 67763 -62319 193035 70705 103969 93607
10857 93607 165409 80961 41958 -79416 179681 -142263 -42342 -94188 38226 -58589 -122270
10846 -122270 43959 27811 -70560 53330 289379 -95574 -95480 -19939 104381 -106071 -7309 26299
10833 -117815 -7735 -31742 478379 -95183 41171 -101388 125757 -19971 57446 -62550 301071
10821 -49083 -257395 -159771 -18989 54089 62654 40643 -165256 -217422 49990 276982 24633
10809 -77017 68595 40964 -13946 233062 131432 -67744 -59314 288818 87889 232531 -211046
10797 -391036 -311150 167470 145712 -144112 117012 -71765 -121415 115703 11258 17450 12715
10786 12715 91025 50752 -44376 17719 151272 -69407 -337569 48494 81307 -246038 -102928
10774 -45187 110132 -66002 -24879 -323671 230748 319359 -156078 -228782 287573 -105907
10763 -37230 10347 267315 -94859 -119437 -65603 -160034 -461568 28138 -101815 -244623 -191389
10752 -191389 75099 -56510 -74026 -98139 246019 -240064 -54653 48662 78959 -141267 -11549
10740 -155864 -94569 -109895 -154067 -389460 -63590 68843 96852 24132 -8612 -120377 -109004
10729 -109004 82132 -112587 -338773 -198930 155152 -49413 -278682 87953 200839 -91657
10718 -83978 -213210 86553 -61336 -132073 67434 -26304 -261284 220917 76337 46957 -27095
10706 81819 -289282 118378 -338363 128013 -370443 28024 -59678 -327261 -126908 113000
10695 5704 70734 -96383 -1074 -258188 -227179 -142201 84994 264848 64372 -92505 16389 -210149
10682 -362504 -189131 -82715 -154310 171647 209525 -8741 221189 114455 -286233 33365 -413006
10670 105963 -234541 143465 -353507 -301095 138508 -6087 -94659 -208406 -29109 78078 963
10658 246793 221015 34123 -174285 -90821 51262 29910 -191108 54804 -118435 -327117 -4509
10646 -355185 266767 131682 -202268 -249766 350088 -142714 -45569 -69413 97666 -228780
10635 -41051 -77441 60259 -165026 101330 64918 -291188 118479 -107675 203753 -218062
10624 -57845 -164892 382872 -117950 -354380 202682 -108775 -108769 -210853 175585 -92390 -5129
10612 -116493 -448486 60659 -171543 -125333 -347488 -174344 -256019 107097 101434 -47217 -66584
10601 -66584 183059 4498 -267881 61136 -17558 -116629 83779 -125529 -159070 -20072 -294062
10590 -294062 -435509 -92476 -246979 194615 175231 66147 -36615 -112313 6637 -175420 52524
10578 -105055 471052 146516 4633 -198361 -307464 -111089 285773 -147519 -55239 -21175
10567 54779 -176582 -139358 -325901 -3902 -268401 -46114 64797 -215503 -6839 158308 -31866
10555 23485 -196483 -247424 121716 -349709 201912 -197832 92015 -41264 -223964 -21504
10544 127779 -102068 -162136 -103475 -6702 7236 59808 -219442 -2718 -379979 170592 207392
10533 207392 -300423 -280660 -296229 -219054 -243924 197658 -42713 -94183 -73599 132155 -213992
10521 51332 225245 -209931 48439 -34793 -277943 188695 -31173 95508 -111679 -124081 -17134
10509 -65046 25281 33311 -35760 117515 -216053 13948 36929 40346 -178714 -311814 -116429
10497 17392 168749 -154397 -6445 17954 -162526 36947 103473 38869 53699 -140406 86077
10485 -185368 -111289 -112006 207705 496832 391471 443667 299123 111736 192844 257142 69287
10473 -236043 191689 -50696 30379 64040 207133 406436 223863 -33513 225076 -26569
10462 164800 220056 -46560 145911 -157063 29319 276011 152064 -203162 -102846 335330
10451 -77958 -261295 59423 226183 -239424 269575 -38927 277073 174101 -167992 118786
10440 -86632 29591 -462548 -362842 -157069 2247 76136 -98495 -283111 215272 -211098 14789
10428 16506 -64608 135407 106332 125778 -63453 128445 -361603 -183323 38233 137523 216448
10417 216448 69889 173041 20628 113778 -194598 70581 122521 -52485 -10744 -129361 -79719
10406 -79719 -76086 -120143 -181068 -72941 78550 -58798 -215018 -290688 -47002 36070 27383 15919
10394 15919 307959 34484 75953 117472 123579 183914 195130 88459 3391 111798 92360 340658
10382 340658 181792 130222 -188570 -110055 -33576 267844 186102 321030 207455 52436
10371 117162 140578 160720 -46075 324298 630466 634913 235567 95091 317531 -63669 105939
10359 -32486 23335 128074 67703 -48111 -31547 517391 425361 386959 276883 519466 502127
10348 502127 413138 510535 431851 464733 397101 443303 172748 179913 352825 216638 35780
10336 30909 -218306 120609 199685 -164979 95250 37806 136020 69799 325022 -57361 -191677
10325 -191677 42876 236406 156845 355156 149363 40898 -111135 484325 -11185 122399
10314 -8054 23004 283317 -64693 187162 -100307 -33907 -275840 -85535 244911 156172 -97410
10302 54064 -67299 -243980 195202 288621 116988 10084 237957 -253334 64153 305547
10292 305547 4468 122208 -70277 -104065 -240672 -200320 -266216 -130409 371275 -120751 -348974
10281 -348974 79036 18712 -51138 106652 27009 33102 -162651 268085 -239556 -108830 127181
10269 37943 -10918 -159629 102261 72283 169680 89840 33385 217277 311110 364118 426260
10258 426260 483617 269703 299735 487590 227567 342068 -69464 -62385 163644 131996 288754
10247 288754 -187733 -204285 -126217 -144157 155577 -10370 145219 -7182 -190131 9309 -34254
10235 146834 225452 76693 -253537 97534 -236476 -14945 -131864 -261779 -275573 -90585 88299
10223 -60385 -251639 17039 -11136 201972 -39589 -21347 -136975 -177366 73324 107883 -325573
10211 -106987 7009 25435 -145107 97134 193005 -46892 -255983 -93535 32018 -73824 -192301
10200 -192301 -339325 -251014 210061 15946 -255596 70080 113654 195728 -232503 30691 -556298
10188 -222908 -149656 -97409 -140218 100930 118390 -268777 -19299 -187922 -415948 -158324
10177 154554 164531 -65461 -21593 56968 -148378 -149499 -57771 242166 18927 121253 -442948
10165 -148578 -31114 -222610 75257 -13925 -3763 123217 -102464 -171716 -246853 -71093 -22128
10153 -203729 -101957 257461 -204827 -171249 -256498 -186083 255668 49040 -196191 3638 -43017
10141 107370 -332613 82095 278454 -48705 -88962 -151694 137568 35702 115363 -244429 -30639
10129 -390281 127724 -7168 187215 99104 120262 -288909 -234516 -210177 -340298 80817 -180441
10117 -431874 167168 -127790 -94451 -146417 -269412 49727 64938 28333 -229959 39630 -102494
10105 -264879 26277 170341 -16423 -49665 -168363 93257 -128647 48887 14880 171956 4790
10093 -79571 -178056 -195689 -48556 59516 -39942 -13144 10729 -142355 -200354 28339 24647 -214047
10080 -121769 -133107 371790 -27103 273023 225669 114371 12212 -372586 -46740 10326 -152823
10068 -54686 -25088 -129598 2865 -243486 31794 -133764 -133355 306783 58518 54070 -179292
10056 56924 -63233 -41086 108273 -145439 -235882 78351 -49624 -208999 -189009 26536 -22678
10044 -231812 -25052 -58016 6932 273595 -566552 -192548 -21278 148441 -103054 -12260 -288255
10033 -288255 -177269 35664 -194465 -151204 -51377 -105232 6964 10137 -117167 268331 -473343
10021 202263 -30854 -344196 309468 -177512 310860 6537 152239 -179068 20663 -100071
10010 72849 -308923 117060 -200053 -189652 -415350 -257000 50249 -120384 -157317 -186378
10000 -186378 -209772 145764 53517 -54547 -127340 -224237 -241364 -181977 -14851 72642 -171304
9988 -6431 -192889 5315 99412 338959 -23200 -128488 4227 -178075 -142988 -36863 114981
9976 -102178 -163205 -83411 135845 52259 -259835 223557 -3332 -118831 -163295 159729 -164809
9964 -210089 -245375 -3242 -65819 -150881 145174 18535 -67829 -150853 -1534 121383 2736 115973
9952 115973 -189597 9806 -120114 254370 -160372 213564 -103970 -193587 -58829 -89427 -59970
9941 -59970 238094 99325 9783 -165528 -29661 -32634 -56211 -568794 -45834 -98191 -1570 179224
9928 6591 73432 -98461 110912 4743 -368242 68813 -141540 -311284 -263395 15624 -20672
9916 118267 -24145 -22022 -368564 -243574 360536 -25570 -271594 134315 95172 -240623 -327867
9905 -327867 85326 -54536 67171 65720 126287 -339641 254303 -173726 192601 -149519 254007
9893 -97500 -174387 99577 -206113 131399 213432 -190745 142756 -288485 79655 -211714 -158239
9882 -158239 55349 -334854 -27757 29189 -131836 -146035 -8421 -105368 -34334 -81012 -209607
9871 -209607 -137455 10677 -136358 -101134 -282096 69827 -339598 -5747 -19180 -172095 186611
9859 171204 -293482 2379 -188890 -399704 -29060 -126903 -104393 -24290 -136823 59480 -250906
9847 -201281 263651 -362633 -256736 -66375 19031 71521 42038 -240552 -132686 1516 -105206
9835 213318 15036 -131355 823 28911 -71251 96870 124795 -23537 -303681 224623 -80262
9823 -123034 48586 -253863 265278 -170394 143099 -92994 149436 178710 -270321 241240
9812 -85763 -246389 -202445 -38449 -87348 -198353 107604 9040 -86669 -52653 -91924 -126493
9801 -126493 -212081 -177714 373414 -134871 -119380 115092 17327 -112768 -29410 -196414 -126658
9790 -126658 62168 9391 -177628 246481 -376125 -82255 -236619 85367 -10550 -305963 -200866
9779 -200866 -285505 35089 17383 -264540 -365985 152948 -7120 -55191 -73905 -59579 208482
9767 -226153 -74643 -12514 -44750 -60324 95158 5738 -87407 264763 -53746 -159143 -30148
9755 103483 -32943 -250 -119910 -220475 -195107 92793 471397 46096 -62225 -213630 -52085
9743 -27280 -82304 -338478 -145727 -136169 89032 -402726 21085 -64637 -75646 -195356 -13592
9731 -272180 147523 -141174 -79831 -122872 189167 -199290 -290298 -82251 -44822 -41589 223837
9719 169124 -376814 -26906 -2167 40502 -584 4305 -82176 -216469 -138560 -105725 51009 116913
9707 116913 119842 -330284 -200214 -64247 174499 110209 102528 122928 168021 100618 -2602 113124
9694 -57154 100636 -100354 -231927 34707 66321 -59817 125613 89127 -91425 40174 -221092
9682 185008 -84696 -49078 -84903 -160885 32630 -395468 -37690 -240789 -29703 -369005 -263966
9671 -263966 -132817 239587 19504 -278881 315865 8448 -17343 -113729 -205630 81014 -293745
9659 -256706 -425215 -13769 -69851 -183748 130223 -228336 190091 90440 -309147 -56024
9648 -235580 -45563 -41142 -35791 99720 -64020 -192268 -234559 94893 -228999 -81025 133869
9636 100991 -116202 -132259 60486 -53141 -57156 48736 30713 159406 107272 -240507 93797
9624 -42455 -31143 87491 87562 -99074 156457 -119215 -130156 115307 4436 -178494 -91787 -62073
9612 -62073 -71762 72722 -65796 -206093 -9854 -187150 82898 95923 -57359 15215 -62451 -80126
9600 -80126 -171123 -115957 -314961 -51133 -136871 -42605 -45637 -163657 106191 -256368 -255900 262613
9587 -6834 -34176 -318540 101793 -158148 111954 219290 -50160 -169259 125902 -137882
9576 -50874 -56550 -17605 -366691 268638 -138290 -127967 -42908 -132402 179096 -226843 -84721
9564 -118591 -234255 -269297 127750 -247000 -129569 -88774 205167 55247 -211345 -34059
9553 -146633 -154556 -125533 111885 45124 73669 20230 163466 156399 -167380 -288748 24314
9541 -73657 97832 -77294 -42601 85805 -262015 -5309 8234 3558 -71776 -250759 -12537 -64582
9529 -64582 56934 -198152 -102345 -250983 72795 129332 -79280 -88840 -182246 -41749 80915 23244
9516 -191447 -73458 18476 56130 -305480 -85937 8206 -451789 107995 -23173 44752 -67267
9504 154671 -15907 87466 -142625 -133377 -29559 -333463 -150510 -131418 -434576 -306279 -138328
9492 154450 33892 99039 124494 59170 79300 93010 -143016 -268699 19027 -420306 -315792
9481 -315792 177146 -171366 -88113 -62805 215448 53578 -93209 186683 -464677 -179824
9470 224968 37193 -436400 -5814 -1351 -70582 -587682 -129960 -372132 -130606 -1071 102337
9458 -306638 6325 -251886 -108434 -102604 -183687 -202258 66434 -55081 -135196 -121222 -15300 12730
9445 -299127 229887 348619 138109 -49001 -154405 17824 51810 86488 159731 -160585 -155649
9434 -155649 -75859 145319 -491630 57553 57583 -201216 -42805 -121654 33840 -106010 111044
9422 -31682 34779 50000 -98969 426982 -66345 -200747 146335 -152657 -186984 201102 105959
9411 105959 -201300 -68533 -204524 67178 -22672 -122912 103464 222070 68117 -482378
9400 -77177 39529 -203922 -52735 -125023 -59608 -327976 -136043 188512 218127 68001 -298965
9388 261466 3659 -50506 -91923 -38490 -99775 92328 337020 -185176 -228502 -109461 -325516
9377 -325516 28044 88305 -176566 -192169 -132677 237723 163086 24749 -59271 -130210 14507
9365 -24247 69010 19874 202083 -17895 27928 43662 -91480 20412 -48531 -111473 22804 -263909
9352 -77679 80583 -275993 229440 -158154 66978 -167448 -247280 -14652 -274217 -1148 47509
9340 -393627 -68852 -115986 -242610 -235199 -117757 -345955 -89393 -162636 -381877 -44580 51470
9328 -3507 99011 -66760 -136678 -138082 -41161 129129 14052 198376 7576 -79233 22782 -101756
9315 -59544 -267950 -123263 -374668 4790 5549 -101277 -104425 -15102 -100359 121581 -75285 171379
9302 -33999 -45568 -68472 -219641 39347 6996 187741 -175749 -15682 10765 -153090 -10164
9290 240561 289416 -84145 -24639 -190722 -78501 83149 -384910 71993 -198533 -54232 -110050
9279 -110050 -7715 -404239 -159744 127713 77593 -285747 109106 12667 -190599 -104504 -403839
9268 -403839 -175798 145310 43461 47663 10773 -17991 -46177 14441 -232751 -139434 -114024
9257 -114024 -183179 21134 92312 -197517 -344239 -102216 90586 -54913 107321 111519 -208236
9245 -143740 84751 -12946 -428721 -34337 96863 -154412 72319 11389 82402 -319362 -167094
9234 -167094 -59357 226003 -238278 114885 225277 -323789 -342946 172451 326997 -14434
9223 -45313 -159282 65549 76596 -189212 103251 39281 -262521 124188 -28 -286189 32985
9211 -98234 1337 -374117 -349844 21266 -462196 137294 1629 -114744 -253557 -166227 -12050
9199 42451 43597 -168143 -17730 2911 26013 -133664 -168196 -120593 110574 -93655 129082
9187 -139729 -16939 55594 -188308 -137789 -211444 -30746 -199185 -229894 91649 -89844 -80867
9176 -80867 115938 -58433 -121600 -285312 -204366 189408 120127 -98025 -93642 -51732 49801
9164 -416444 143182 90501 -204925 11746 41294 149390 -103550 -101352 -318136 268534 126276
9152 -64730 35287 -67128 -45207 -167115 -5962 108954 -169105 -270338 -71266 -46111 -294138
9141 -294138 -407933 -234637 -163742 -195610 -177297 -262850 -119037 -162866 148278 177964 -72065
9129 -41139 -157898 62015 347189 -113554 131865 36565 -259984 -58020 513447 -22961 -107400
9118 -107400 -61092 -223248 77168 7456 -155551 -236533 -131147 -63484 -34108 -144221 -168972
9107 -168972 -69281 -28203 83762 141050 -129713 -164772 -244335 -44482 -95568 -252464 -309028
9096 -309028 105704 66929 2560 -87471 -3914 -183493 -226917 -100801 -81618 80006 -158781
9084 -46643 125328 -16914 -148502 -381356 -289833 -23587 -227339 -90167 124350 52956 188696
9073 188696 221622 -174307 -136608 285166 156381 -201648 -161374 115122 -65801 42221 -210885
9061 254465 -85884 -66510 171472 -69230 83226 -166288 -113887 -10657 53720 -78475 -158335
9050 -158335 -239336 131622 -24028 122496 -221001 -30770 -87568 -215041 -139726 -78589 -49400
9039 -49400 301623 -224223 -108943 -180062 -240972 -8707 57895 81852 -216383 -199474 72013
9027 -160484 -52244 -129023 -278760 31694 -91974 14211 -104578 -294510 43318 -16665 51709
9015 87924 300697 -10425 -67784 -6449 174893 -298664 211028 183991 -211630 213598 250350
9004 250350 49427 80528 -256390 75034 -226205 -54157 97824 119307 17276 227013 -256768
8992 -74816 -73178 -14300 217741 -244481 -242704 -289343 -153948 -298253 -101299 375050 -302027
8980 -82194 -124425 -199424 206979 -236115 -78880 -12362 -75860 303324 33804 94210 6072
8968 174144 88178 -110861 -1698 -139094 -135471 -133783 3626 -47153 50850 -226945 205322 190565
8956 190565 -70173 26733 -74055 -11686 7375 -192933 -92236 -327506 -248198 98201 126756
8945 126756 162522 175816 255859 55174 163345 -93637 47438 -39433 -189591 211412 340047
8934 340047 367670 97078 -50431 194542 37329 -83152 194996 113858 256087 899667 2091749
8923 2091749 5169586 9399601 13701434 6722188 2294079 874599 382340 160920 463633
8914 463633 -162417 -179244 -195972 -217560 50569 137079 172815 125277 13056 -25349 -161243
8903 -161243 150590 -150681 -6745 64310 166608 -252434 -120643 157307 -97645 -39981 -40703
8892 -40703 41478 -521715 -181903 149722 55065 -12067 -283292 -33670 116194 -87566 68007
8880 153046 504242 49571 95450 228877 -121930 69955 -83463 -79057 -4338 37395 -26894
8868 12222 -96966 139216 174297 136550 -252350 -163544 94575 -162742 -257560 34493 162902
8857 162902 -188560 188889 -98946 99489 137262 -427012 -87129 214157 354015 23014 -70249
8845 -110103 -184822 -224037 17816 -96563 -86447 47130 174023 196123 161836 -187756 -366605
8834 -366605 161504 -237293 -35017 172858 -80111 475522 -117173 -162819 -121389 217368
8823 -128635 -290242 -158757 -203398 -96610 -50824 64096 -133657 -107134 -205300 -161663 -326867
8812 -326867 -7960 -244439 195995 -319229 6604 47578 -274940 -203339 122643 -60509 79573
8800 -125874 538118 -322051 123562 -249903 -63976 261412 -288598 -23551 -14336 -106139 120650
8788 30723 110039 44623 71983 104072 173117 -323442 -112534 -225239 -121296 34167 83725
8777 83725 286292 114383 -103900 -10521 175727 -281651 -118618 -200270 -224970 -18045 113036
8765 97565 -83003 -198833 -139027 12674 134503 -35194 -256080 -44414 -69796 34031 35130
8754 35130 -77039 -28312 -324441 -172899 157214 223335 -262282 119177 -67744 -98140 -43083
8742 -240130 -19208 40126 282636 -257992 141846 49634 161824 -138768 38616 -324614
8731 -204800 129341 -82523 -202215 -164653 -405638 -110754 146469 136773 188811 -7343 49938
8719 -159859 290601 -320005 -17453 127383 -380832 -236100 119277 154415 -281829 -76298
8708 -49526 218257 -59902 -7024 -202152 37274 81880 7733 51995 -156746 -194065 15637 312
8695 -223049 -160334 12393 176675 -118991 -238551 -78564 -231390 168425 -238605 -96082
8684 -154074 253153 17551 134811 -34735 -158135 97356 -79767 177519 -179751 -188949 38327
8672 -79429 80780 256403 108615 -224317 -114081 -358857 -26585 -23491 260725 212784 32441
8660 236230 194234 -75226 118570 354585 -291479 213045 137260 -102254 141173 -91928
8649 -66002 308488 -188567 -295969 -239786 79558 46291 140520 -199422 249462 189728 -125525
8637 196921 480994 72046 -63460 -226642 90131 -218723 164 -90991 -295733 -18954 -468108
8626 -468108 149504 -509506 10204 254396 -180346 60165 -126977 -62392 -347651 195119
8615 -218500 -94660 -234814 132288 -45028 182025 19494 -335153 -177613 -161554 -55946 -203967
8604 -203967 -79641 -68730 -253509 88596 -92305 160836 -166667 87884 -1524 -210975 -138185
8593 -138185 179511 189117 166897 -39973 -65720 178518 -29955 -15311 -43214 -214773 84334
8581 -176880 -42820 75556 -93661 -460376 25759 121906 -216883 45499 -56258 -73590 -280713
8570 -280713 -6941 115276 137345 69275 -89458 -9958 77868 -2835 -52701 -262271 95540 107918
8558 107918 -38286 -221658 -1497 97897 -279230 -187073 -255470 128026 82388 291485 310021
8547 310021 -152597 11434 -181456 25254 26333 19178 406084 -33900 112578 60836 -305653
8535 65185 68953 267879 149460 26377 13022 -153284 -113066 -258797 -20580 10282 89606
8524 89606 5662 372093 -243063 -10264 286545 -49934 -111118 -328966 -27361 24052 121748
8513 121748 116860 91668 -29224 -225061 119943 -72879 -228081 -368512 -172287 -272539 -66008
8501 125066 -53506 -316754 -26586 -32252 -333859 -159306 -316445 -37814 163814 -277277 -175651
8490 -175651 -17857 96837 423312 86797 -231955 31832 -113007 -53822 -104225 48241 -297998
8478 -227053 -216915 20047 131464 -288689 -364907 -77851 11726 124241 -101752 -90451 293108
8466 102725 20164 478088 -113077 224765 75409 -211438 -32278 -154729 -83384 14606 -139258
8454 -16486 -116216 -66826 -122908 189465 -48777 -223935 -42291 -12021 -221952 131713 -55831
8442 129010 -77007 -186727 -122857 98985 -209728 -16048 276299 39513 4072 71062 -19618
8430 -105509 242016 80256 -69975 -38682 -212755 -111753 -145700 -75745 110595 42484 -18390
8418 62444 -276431 -176685 -250051 52188 9395 -131374 -122691 124103 117929 31257 43653 77123
8406 77123 130494 -110095 118577 -90906 53025 24219 -50294 191084 -237110 -362406 -205942
8395 -205942 -263176 -42984 -356633 26578 -30663 -86089 -164517 42666 -326242 402307 -132357
8383 -96448 180353 -220511 -129534 -385411 -258098 -59623 -52288 -8444 -70186 -298640 -41746
8371 -136198 -41136 11464 -113588 -43283 26481 111959 102250 -300768 -113601 -77703 167649
8359 -115408 -257209 -112518 283362 46799 140606 145631 3998 364493 163090 -315969 -92332
8347 -154878 7487 -17300 -165784 349336 -74366 48051 -207493 -257898 -92894 27675 -89058
8335 240489 68736 45058 -53588 11990 -96211 -72183 264039 -139261 194998 -168881 48356
8323 138704 -197199 125906 34626 7740 -76783 -153800 -264373 219595 -349929 155333 120874
8312 120874 11821 -40958 48356 -195669 -3679 -144819 -7524 -230305 -243359 101516 -105615
8300 -136529 120704 152636 2521 -228271 144395 -134177 -247584 108636 168473 129607 -366576
8288 21993 -116382 -231336 158009 77149 -149145 95576 88449 282502 -111350 -156762 -139821
8277 -139821 5449 265355 77119 50123 -151714 -80921 -211915 -38398 95762 280038 -40950
8265 53475 -432058 236347 104333 -341815 -47534 -37379 -315587 113804 172754 -57049 50890
8253 -29412 320485 -321379 -25736 34068 -29979 250962 -46639 159550 119301 -4099 -6865
8242 -6865 186733 -118028 -56892 -68454 117837 -116846 22368 -299877 -147388 -174322 125359
8230 46784 -101695 -185863 94755 44662 308489 -194347 166594 -152863 -251696 -26189 -335573
8219 -335573 6320 352097 -193621 -275151 -829 -60132 -72666 172021 18264 5228 -35118 76079
8206 1903 -241030 -174959 -228534 223004 -107230 -2128 -109119 124216 -114784 -226704 76513
8194 230821 -233867 334563 -84948 -216620 -236597 168353 60311 -152182 -198478 -62864 11659
8182 -1254 -322124 -84113 -98433 360743 253408 214750 -126935 -281593 68011 37741 108010
8171 108010 -12940 -60126 -29652 65923 -78198 -158028 -79383 290933 -395693 -156418 -75225
8159 -227261 -10341 20581 -239428 -5486 -50740 -263064 937 -252372 133809 -153345 61359
8147 177450 -115738 129325 157562 -364187 -201349 -85191 -122895 42391 -132063 -190489 -231183
8136 -231183 -149405 171003 259681 235055 38271 -248109 83778 179051 257202 115784 -89615
8124 -239498 -81040 -66153 -288704 -46905 131778 129102 -152468 -99733 -52250 -45867 53522
8112 -140764 13600 104602 180683 -54802 -69793 -106022 -86313 58419 59415 -195680 -219529 -110911
8100 -110911 -266703 165888 223838 -115921 -198954 28117 -214498 154194 -225369 138012
8089 -155283 -338210 -163038 20187 -276686 -123968 198776 94446 -67530 116774 -3943 -143792
8078 -143792 -6640 100650 28327 -64479 -297890 -109508 -89814 -369221 -269267 90369 86931
8067 86931 -40413 -89260 62048 40656 45299 184925 -27664 -130899 44882 55417 -207154
8055 -85753 50054 7298 110447 -27547 -146603 -193540 13638 -562457 -74239 148285 -79850
8043 246396 -547469 269262 -100379 -42392 -313294 -195362 -42222 138719 -102730 230779
8032 144241 -67818 2829 -196294 26944 -30530 103161 -152879 -112538 224564 -10565 147870
8020 -44345 267510 -248020 33132 -99767 -307217 -150447 -101714 136528 80637 -246489 -210516
8009 -210516 123465 -216237 -225120 -215131 -219323 -117830 -95386 -262777 41197 88182 -215312
7997 -3366 3084 71738 105992 284316 210014 91871 -392325 10443 -78582 197821 -582852
7985 27919 -45080 306018 -101256 -93288 336955 -680 156922 185145 -268614 -196601 80534
7973 54885 146385 114493 -3907 181750 47751 -112592 38937 178410 18823 -87620 137624
7961 -144522 -79663 -14260 -67090 -71267 -146722 191022 -31177 -91299 -74632 211159 -28963
7949 113079 -182445 -311608 -107835 -12909 152193 -203929 -86983 -131845 -306633 -64437
7938 -62132 172286 349750 -395995 -178807 -116816 -196699 -153043 -253813 216993 -226953
7927 -75423 25092 126515 197833 192292 -53772 -292956 -144008 -181101 -180625 -100181 -141893 27618
7914 -167879 97639 15535 113698 -98099 2882 103485 113139 5216 -182202 -410652 80965 38633
7901 202759 -158398 -9961 -479885 463328 19004 -271014 -27142 18153 -3409 -185886 -287633
7890 -287633 12535 -109658 10960 242508 74435 84173 -148635 8606 112442 -352261 -197924
7879 -197924 164669 69595 6034 -70284 -184451 -310791 -313241 -119258 -3372 -56462 -339584
7868 -339584 -88786 -60627 -31761 -83677 -21783 -181268 -1394 -231558 -301619 -16012 -49918
7857 -49918 16544 -18294 -135327 48570 22329 -5718 134327 -238713 -327950 260877 -138007
7845 131329 -148688 299475 79909 -99772 37708 -56957 -280072 41677 -136462 -123885 -139406
7834 -139406 -303223 -251651 55039 21636 -173243 -92038 -143028 -77215 -71102 -7340 -17249 -48942
7822 -48942 68135 -115760 -143196 -145867 -286088 -178532 126782 69846 192933 1495 14161
7811 14161 -107568 104646 -36585 40267 -341414 -67797 -31190 58665 -587 123531 343205
7800 343205 -53845 17523 35624 -138141 -12752 -167345 40681 192997 184750 371764 270792
7789 270792 -74734 18836 69310 120360 -272371 -90524 217653 158344 -75057 249282 -148728
7777 -212310 -262254 -246936 -148345 349929 120981 135549 179114 194708 -154064 -182970 -182649
7766 -182649 217455 -72345 178003 30155 -157851 19620 116739 -86860 62054 -75411 -252578
7755 -252578 87 -113360 -109662 -17494 -24765 349344 26507 185626 -116374 172775 -165946
7743 -187924 -112444 60120 -127613 -64170 117242 -87817 -370147 155217 57805 -119496 -281229
7732 -281229 -54037 -100740 -476217 136613 -51058 -143207 195773 -306199 2561 -215840 -224925
7721 -224925 -557121 -111336 -98965 -191388 -33530 37374 -196587 -186090 -149299 161395 -153240
7709 -9715 -247462 -49469 -140122 -332296 49547 27106 -130174 97097 217108 109911 -95260
7697 82151 -144431 156578 213704 -242729 66179 8387 156494 80385 131555 23352 110708
7686 110708 -112824 -57220 158134 -203476 -129994 148333 74923 150531 177478 -270381 -38687
7674 12108 35735 285439 189911 106333 88206 62813 -180199 -94810 -124609 245675 33619
7662 -39283 -278836 68956 74667 81269 93768 -138981 -144649 -44752 -128133 -249911 7061 15778
7650 15778 -35870 -48198 -84931 83626 -186313 -478 1365 -152807 -231489 -379708 109014 -242430
7637 -20287 87068 3864 -113912 55514 -56741 296441 -116208 -109894 -26658 -186922 222891
7625 -164632 -27186 -402400 45719 -34989 174792 -87514 -40684 -213595 41282 -109434 93140
7613 -42081 -320727 159291 -188689 -8628 -32964 -31806 -8905 -140900 275842 239076 -397100
7601 -224362 209823 131440 -36868 -97647 -55020 -174751 143807 -90034 -88270 -32704 -100487
7590 -100487 116974 -162354 58803 -184155 31407 -151032 -373626 180589 -135035 -29988
7579 -146374 -163639 -36077 -378802 104189 -134297 59267 -119860 106590 -122527 10726
7568 -87537 173224 174946 69446 -261764 -316050 56498 218935 -7648 2646 107097 36117 -118474
7555 -50890 -75402 266480 -25741 -124179 -132121 34311 -35959 -134200 111484 -54183 135522
7543 -177662 -81864 -88331 -386388 182160 198283 188906 186545 -108739 116218 -242937 -97947
7531 196587 -262774 34567 -119375 25920 -206288 -226901 -202074 2995 -241770 -68029 162977
7519 -86226 -46894 147488 230009 77133 244072 -94348 -121374 -167669 -259932 -48186 -7541 -413169
7507 -413169 -357088 -28585 -183992 126196 -69876 265759 60292 -85301 -269543 305886 89293
7495 -176290 157209 -4840 -28027 -265347 72809 -7892 182501 55682 -10463 -483566 189140
7483 9077 -285156 186577 167761 -249028 -315672 -121413 202714 105729 36160 -116053 -16857
7471 -255099 -68024 -121260 -176267 -9063 -147453 1299 405632 -81926 -136997 35449 -51315 -96060
7459 -96060 89444 -95691 -399156 -96409 -182516 -108224 13756 -81902 -229544 367243 -340436
7447 114177 -286422 289223 -16568 -183213 101354 122723 -23994 33538 -171548 40138 -172834
7435 -149996 -52810 -133630 -223330 101687 -174198 2846 -448516 -166343 155325 -183439 462360
7423 -175213 113974 -135813 -60441 -54283 -159779 565641 157247 -213938 266719 -210435
7412 -300383 -27233 -54348 -222287 -393049 -127557 147901 -214211 -105761 -34140 -221611
7402 -221611 -301760 160599 -259984 114286 83611 -15409 29582 -51371 185191 202184 -213161
7390 132291 104184 -221379 130676 120600 156746 125896 -14819 -3667 -23653 118790 70434
7379 70434 88310 -10846 99396 -268645 -78643 -77947 -330752 -214176 -93914 -24083 -229519
7368 -229519 204578 -219946 -307807 -66202 -282681 -265797 226658 -355720 -146304 -45690
7357 12050 -54023 304682 -202185 -99084 -66706 238833 26922 -132406 371861 -123894 -254624
7346 -254624 23672 197246 88076 -113466 128240 15789 -90444 -34239 -145522 126301 399239
7335 399239 -37154 171834 -107486 101373 18852 -57421 131005 24918 86038 -223768 -228755
7324 -228755 -68759 -57457 34217 229602 -99323 -186193 307256 -254144 115948 -325965 -191102
7313 -191102 -252478 114197 -262053 13007 -268775 42342 -19765 -142217 -48683 205202 36523
7301 -228668 -2644 -204120 -227226 17659 198389 -92677 -159886 -136014 88085 -42213 -294611
7290 -294611 -25141 24080 26794 -262124 -156779 -38443 -184768 -95142 33979 -77087 207108
7278 -60350 -121833 -32823 -185186 308202 17396 -53311 -424884 -230041 56699 -111439 -36503
7266 -37985 2670 217814 15899 213979 -9469 56399 76584 -76525 71911 18724 -73960 -218098
7254 -218098 -10921 360370 -2568 64184 543138 -1532 208961 -165720 69024 -74577 83565
7242 -119030 29184 148612 -115609 -20650 -184693 -121067 27612 -52564 -149793 -74447 -67951
7231 -67951 -92544 283271 34189 -247696 -72618 79689 -211284 -189613 -10719 7462 7298 -48640
7218 98887 -79384 -187115 -31790 -44096 20374 -76125 -139336 -415152 140099 -144542 -224690
7207 -224690 148549 -38675 -87806 80311 150190 -139239 131910 137845 81920 -71828 -28860
7195 15427 -153507 -64713 -60107 -138009 19706 -153995 -61644 -167182 87844 -10763 -134426
7184 -134426 83600 -92054 -2397 -57750 8769 -194115 54162 14767 -75890 13395 -245195 272317
7171 -20015 -81384 79617 90099 -298126 -69003 -180786 -103838 105102 123871 148529 10323
7159 43932 297401 -422673 321243 23520 170421 -21065 -90734 18070 208921 180211 99534
7148 99534 75526 -481435 119827 -228599 -26955 -457768 -5507 157729 10638 -80659 -17645
7136 -241125 -51476 81265 -305115 -212088 315069 -95429 225645 -450634 -179048 -255838 -89009
7124 140224 -480466 100411 -151025 -347491 177465 -238965 -113599 147713 -30165 69817
7113 9989 -1234 -291433 73625 65904 -144482 14938 -192399 94327 -156996 69807 82353 304342
7101 304342 -22923 -20231 136156 -102269 211601 150654 -69202 79596 179379 -232203 62301
7089 -75666 -52630 112526 -107497 -35608 85021 12627 -437887 200689 -148593 81440 -145571
7077 -74601 4038 -81333 138737 195610 -316261 -112387 -203471 196295 16469 -46644 123783
7065 211454 217931 48392 -85179 -171560 57750 -7484 313382 -115564 33392 15905 112452 204083
7053 204083 -205351 114323 -174056 -170032 -253278 -114130 59488 -209583 54136 -40427 -224798
7042 -224798 -180254 90134 19379 -5658 -16392 190922 -287527 -71815 42741 -14774 92782
7030 -272460 -265145 153282 82714 130192 192439 -283326 201359 -78647 -100214 90186 315303
7019 315303 -58693 -52417 -105346 -75474 -50455 -28976 -27195 139521 -14856 62041 -38702 -133464
7007 -133464 -139175 -261368 -190866 188782 170860 -132064 -170414 267299 -320852 146874 184187
6996 184187 104894 -14064 25030 73417 257349 6770 52870 182601 -108530 170226 126730
6985 126730 111824 -174599 189723 -138870 -315486 -86394 304032 -92050 -255919 42011
6974 -239773 132180 -474501 39678 -309660 -130190 -169239 -271240 -62368 -159288 -37190 37293
6962 -129859 -41819 -185871 174556 -58348 -37910 -116137 37459 124429 -206641 276813 -115636
6950 -164788 31489 -56439 119956 282668 -145633 -53854 -136933 -106362 161269 178487 13332
6938 -120909 -107762 237608 38367 -61838 205866 56835 129562 75338 -125581 -14267 16897
6926 -222732 -75427 -189347 111016 31018 217471 -56515 -16213 -103193 -162403 121052 -465623
6914 392637 -5519 6617 -95310 -75560 -224618 66837 -160455 53266 17261 -80644 -8465 -139557
6902 -139557 -117503 287133 -31984 -43550 -89141 93675 -65680 -129395 -301459 342037 73281
6890 -471758 32880 -48229 -170831 224650 -23318 33488 -38137 -213788 231698 -355824 -162495
6878 -253124 -263359 -88166 -267905 158783 -22420 -20449 -128366 231520 187184 -232597 -27085
6866 -209545 -64805 123958 -221011 176073 -58437 238659 -190875 -226575 133928 -164791
6855 -188657 -48228 -97128 154017 163999 -138707 -187540 29370 -62442 36572 183745 138066
6844 138066 110548 61605 -79774 103176 -60055 -27887 -50221 309024 70158 -68442 74413
6832 186718 196592 -240788 48936 -119390 -76428 28906 -86619 218770 152545 -57471 -127588
6821 -127588 7663 -166551 -270032 65164 -144129 -61993 32509 196425 95431 102429 -3388
6809 -280399 -97151 -39826 91740 -115261 -149035 388850 287930 -113278 -134321 -91971 -78267
6798 -78267 -287367 -20399 -81380 -212891 95953 100659 -184290 225435 -290919 56150 141477
6787 141477 -205724 83952 -295828 191829 -139580 -138157 -276595 57654 144277 106595 41691
6775 72963 -120841 -69765 -58547 92622 -241317 250324 63047 -31963 239909 3528 -175983
6763 366443 52362 263157 72169 251032 -122490 -177063 116676 357918 -131702 126134
6752 -376124 -243587 -239213 -64562 -56864 -143046 240288 -38564 -94876 102727 -21729 136346
6740 247219 -292296 13705 -166676 -201726 271050 49507 -106714 -9203 -67957 72061 271922
6729 271922 339013 58104 -274726 49765 -179584 52530 120482 -53366 -170405 29604 142124
6718 142124 -312048 256377 -232363 49088 -127938 124438 -89060 -137308 234953 -78623
6707 -219161 22502 -323992 191816 -316520 -60201 -221786 271308 -129243 -233221 221761
6696 193376 93647 -119401 -84279 121896 25886 -22674 -17182 167505 -3954 -83243 -194786
6685 -194786 91044 136625 27226 102529 30848 -183992 14452 -46086 107342 -87315 39860
6673 -230521 122295 -53568 51394 -226724 -130802 87923 -370655 -12876 202529 -70904 -16926
6661 28254 228946 17851 195745 -245140 -16514 -145703 25124 -257201 130795 146248 -199318
6649 137024 -98465 -191184 18017 63797 -58873 37513 -90424 -66290 -297371 66707 -44319
6637 -28208 -305962 -89193 244006 13332 198191 -92478 -130190 182330 15537 -102563 104559
6625 32922 -158413 15527 89592 -66244 -158216 26197 -59329 -98443 -525 -31178 -54290 128808
6612 6956 -450067 124198 101864 112137 1100 129648 74190 -174846 164364 251870 143009
6601 143009 182719 9321 -129050 88720 -45133 -47060 4417 183721 8796 -44530 25518 101591
6589 101591 -77061 152642 171529 222737 38936 -224257 -208509 103589 19767 64472 148401
6578 148401 -131858 -54052 -7458 45216 384560 -72729 -224547 9307 74930 -71067 4987 126915
6566 126915 -303926 -112843 -102528 -214380 59207 -58537 -189800 -27874 90357 -283068 -277187
6555 -277187 -120846 -95099 119596 -53988 -243192 -285442 -56524 199721 23779 267921 244361
6544 244361 -151287 188004 -382947 -92508 18452 -48667 161966 -188924 -189989 112499 303702
6533 303702 63248 289790 116822 166186 78595 -266351 51771 104908 -243896 -301918 -106137
6521 192441 -136204 -149971 -60810 48776 162409 -118845 -217793 131631 -183849 -66498 11638
6509 -88797 -155943 144266 100424 -20475 -190724 -155882 -290786 -88434 -42225 52975 -27825
6497 35904 62326 -439949 78483 -238486 60708 117650 -313305 -251634 48013 -57126 43220
6485 98397 92121 -154610 355898 2692 -89543 -28899 412585 -144465 319824 138561 -172827
6473 -159878 -125832 -9354 -81870 17808 -269539 -26117 267437 57051 -22652 -209564 -233122
6462 -233122 224077 219971 222902 -260480 161240 -123782 45649 -199944 18387 16640 408501
6451 408501 -29912 240959 -43363 55982 -101127 77286 163015 123830 2274 -60901 15942
6439 5314 -120413 147581 -152216 -256473 -119916 65001 162 -78648 2824 -98545 -296919
6428 -296919 -4786 145961 146197 136531 -368225 -140325 117382 -111330 -59748 132887 86927
6417 86927 -59680 -259408 -194005 -192968 -21675 -174638 -168803 60446 -265965 -43440 -60719 -161181
6405 -161181 -309777 26195 59795 99050 -27808 80996 -147753 82645 295210 106144 -83604
6393 33009 -63623 -160767 77260 -15149 16025 16542 -206447 182138 -47899 333418 108816
6381 -262671 156828 -247171 -363408 77953 132099 -135524 51070 -353817 40625 -283931
6370 114858 -175439 37333 100257 29201 -45549 242912 42272 187967 55337 63447 244758
6359 244758 -157974 401943 -14807 -42874 -120744 -32885 -105770 260991 -78793 -360389 160268
6347 -200893 -122324 -226210 87198 284277 119793 -70327 -97725 -267018 61441 142870 141296
6336 141296 -3981 -491690 88963 -157067 60442 -187973 143523 352854 -38720 73756 -50868
6324 -58752 164051 123832 -123043 259850 49090 198019 48017 167783 41813 59195 106608
6313 106608 12469 37098 -186488 -150082 262351 -101318 -106402 -161053 -257726 156560 183900
6302 183900 136305 -118205 -89175 -20940 -122523 71855 -4903 127498 91540 26430 148762
6291 148762 3293 -81723 35101 359428 -5813 42471 66342 1770 44861 230096 -215424 -81544
6278 -326823 174607 -4686 124912 156392 129704 -81380 -79415 208445 -99149 216210 -132473
6266 -77850 -53956 -58113 -208231 -67609 111026 -14428 353213 340983 -213507 10223 -212936
6254 -90641 46465 15479 -156880 116234 -62488 -100098 -55627 67157 42550 123769 158192
6243 158192 90298 -15024 178439 -339779 -13105 -203021 -60018 52731 -535341 59122 160546
6232 160546 41127 -168248 -95654 -23646 -118829 37742 -149088 -313249 201996 -91911 -143809
6221 -143809 -241759 123080 -286171 -165860 167184 75268 -234365 -195564 81159 -76649 -220269
6210 -220269 -102775 97825 34321 -146353 30156 94725 -264936 -55221 -329166 75985 -14757
6198 42462 -63921 -65203 -32970 191288 -338493 405502 140625 187129 -228742 -245564 71747
6186 117213 40916 -122575 -201524 -128356 -71726 -25738 -10023 -185264 40364 -33848 -122618
6175 -122618 259752 40259 169259 -67452 -158310 534 262503 -65158 17985 18408 -214473 -160295
6163 -160295 17368 219920 -128604 -42311 221431 -75965 118440 -171935 108339 117876 -72574
6151 -267163 -235156 54761 214502 95176 15109 -122554 -83303 272121 9623 -75502 140923
6139 166078 -157954 -149538 -10637 -95748 -69900 91943 -110423 -85406 -179945 -133581 -91011
6128 -91011 353894 123240 14269 168321 -15315 6113 98119 -75743 -17293 -43407 -172613
6117 -172613 -65622 -156729 -165781 -44611 -179650 -95634 245751 68750 -70311 -161666 -257890
6106 -257890 240393 -294709 151141 343057 144195 163519 183321 -1407 -39856 -95520 262884
6094 -28329 -200279 114432 -205868 97521 -112366 51536 -26327 -249352 224135 216876 -38101
6082 332975 -91889 -130923 201339 -28974 169384 -159968 172688 345235 -43153 113512
6071 -168057 -123630 -143015 -11366 -130753 11517 275054 -156330 7502 -146535 -68612 807
6059 -412170 -205491 103167 -41564 5771 196238 -47686 434727 135893 190979 35679 -14873
6047 122284 94896 204365 -4211 138882 172974 101571 -135975 197104 -12076 4826 8563
6036 8563 124107 -132138 137932 -197391 -17243 -217621 -114483 181146 -23159 118887
6025 -215252 157261 -385948 -59821 -91780 37029 36690 -116596 57688 251293 154410 -58945
6013 81069 127598 -48872 174659 55933 -117552 219285 91038 -158232 -100130 -34301 -24571
6002 -24571 113432 -94641 66809 -272983 100991 222883 -95470 -175043 78543 -9227 149649
5990 204876 -117434 -129259 235779 22376 -138613 193059 144275 -4242 129982 -15259 248006
5978 40236 -106639 -3964 -48178 -38283 44744 -72388 27712 141014 146356 129588 -404483 41113
5965 -191992 -101046 -169752 -44143 -254928 203164 199539 -216764 -316841 -62630 -45437 -32546
5954 -32546 -85898 -151862 -411425 19502 3998 140101 -206905 -48557 139556 9988 97697
5943 97697 72121 -70178 -217467 -45878 80792 -50024 -234216 -114880 -211287 -180526 -5654
5931 155493 -142933 -64290 -170502 91859 -33592 377118 133107 209533 24389 -53106 -12172
5919 -118988 -172856 -83788 225560 178455 270195 -156351 -79377 259139 -196880 -155608 -65622
5907 308902 88694 304082 18037 109473 -39788 -117430 172481 157157 462966 -79664 -283281
5896 -283281 -145413 -93368 -73137 -101997 91927 207279 -427282 -10292 -65432 -209890 65710
5884 127893 -165256 -110419 -82745 295554 -40926 -243049 51253 40018 225088 -11587 -224350
5873 -224350 93579 -119627 -200 -150077 161329 124934 24450 -242058 -56203 345088 128789
5861 -129125 -257271 -180977 -303413 30051 55272 -9104 13425 -146780 214958 -64664 166823
5849 248912 77241 -154742 -64393 75396 88640 47608 41357 92311 -95818 184854 153168
5838 153168 107378 -246559 -38585 12585 51752 -90396 -10834 -99016 92345 89251 150153 5445
5825 -179900 183528 174297 52153 176122 -131508 -125482 77162 -153060 -28809 -73650 403885
5813 -50031 -292338 -153033 -226350 -39292 -96935 268131 37373 17834 -231797 -43446 210163
5801 60804 -173607 165615 -124323 -480165 236668 115037 -13697 -9364 -30043 -121800 198383
5789 130051 86810 326397 16140 -134559 403978 168828 51336 11134 43748 -179465 -80801
5777 139203 52289 19795 78694 -177544 17939 175056 -218494 -215946 -147388 -181838 -43472
5765 88385 -146344 213114 325060 44014 53145 -157867 144591 -72191 70675 -265840 55387
5753 -91610 199097 -19898 -34130 -220970 -38015 109553 -198238 12756 -163086 -193151 169916
5741 187709 255688 51258 58078 11599 167815 -64034 -96318 282444 76338 228363 -120937
5729 49095 61876 5084 -260909 30319 -340511 237320 -43977 57354 -311509 -261744 144477
5717 22087 93217 -36649 251406 -142782 -6175 -19796 -163176 129447 -154556 -157911 -13632
5705 34629 21713 267282 47149 -268134 82490 -6455 -393694 337991 -196167 29946 -2022
5693 201210 33869 83756 69707 5166 18603 88100 -40005 146252 113328 54429 -6283 -153401
5681 -153401 410253 -181343 44056 146110 -121584 69351 118804 11334 220356 -90073 -166854
5670 -166854 -260157 -231456 166047 -369501 60337 -213875 78949 -267007 42466 23645 259327
5659 259327 185760 -86809 -177104 -348249 61193 103221 -113685 -204406 -437737 355687 -114121
5647 71284 -141934 -16381 -1781 -82836 -279604 -93286 -271990 115713 -124245 277638 19055
5635 237953 -99173 -71689 222022 -211143 -191344 222819 -311567 -251674 222535 58225 98785
5624 98785 321701 204445 -65963 158772 -496596 -122944 293057 -101194 274564 -55392
5613 -131170 63773 70037 -70438 79743 285108 14806 -192700 -129196 115301 20135 89648
5602 89648 47693 -66920 79094 -30977 -431251 -6669 76492 -12450 165191 16999 -155027
5590 147868 88123 114383 -169374 178148 -109888 -165961 19552 103832 -138947 173909 -29137
5578 42468 44461 197564 97627 -196443 151928 -14493 -197407 -151676 129171 -212838 93698
5566 174890 116562 123340 238605 -345900 -83895 1153 -452068 40004 304273 -158273 -16811
5554 -28699 -25230 -68453 145058 10827 117456 1170 -186047 -28265 -3291 -60667 15059 74777
5542 74777 -10926 -19629 199096 -117642 348497 37033 184084 -77973 -236676 -40802 14302
5530 -301125 -166592 1852 -254869 139906 428196 -105 -80441 -305962 -19056 -55574 71246
5518 -143522 178849 -165582 -68692 -20460 -89758 -7276 -169565 -30879 -258456 -377583 -217481
5507 -217481 -128337 -2815 42981 245910 264747 326810 229890 -254471 -56508 -59312 53747 99878
5495 99878 22104 94569 -44585 42009 272538 263185 110898 -34043 185776 -124981 -110645
5484 -110645 358246 107652 -123847 198679 -112002 -218064 52053 -96501 -17916 114548
5473 -208463 -165067 -33758 -238801 32579 -200268 69977 -56643 -116127 51243 116120 58610
5462 58610 100320 -143913 -104682 156767 23833 -59654 37733 -24504 86499 36696 131436
5451 131436 81659 -104249 -47995 -111547 -109612 219520 -27026 69998 -27570 224620 85547
5439 322762 92526 170578 158756 -107327 -111619 75370 389271 -157596 68992 188882 235967
5428 235967 -3602 -20536 20224 119304 96432 -205735 -19835 -101720 -48963 -258666 -24935
5416 10335 65394 166033 -199539 128523 -190106 -75995 -280981 43511 -57376 45169 348962
5405 348962 -53286 285803 -42464 157954 297866 -368569 28506 -240924 107284 137580
5395 137580 -86917 31126 104253 -237501 -22221 -191432 135867 238341 -17289 -1650 -4625
5384 -4625 108287 25260 119656 67490 -163911 -166699 14775 -279127 -176040 -65173 -81187
5373 -81187 -218533 279231 -175153 75294 219306 -210405 126585 9483 -54521 120114 228147
5362 228147 -151478 139727 230882 -52641 137604 10655 -133494 -147128 61307 -319592 -86688
5350 -117409 -14303 -56780 266115 12717 -139071 297968 2874 -74214 193010 183671 349903
5339 349903 180554 -196496 143216 11799 88616 49960 36147 -13973 139308 89385 -135129
5327 113985 -7304 22542 -278420 191867 -97119 102830 -19342 -39719 2205 236185 17327
5315 -224632 200792 87180 -40290 121557 -62761 54031 -14337 -348565 171432 84930 48538
5304 48538 -215269 -195280 -181469 65301 195584 153875 98255 405678 -23936 39044 34917
5293 34917 79698 -233485 -7666 131340 148949 34858 66744 -364268 -178742 -97437 -62014
5282 -62014 -52536 -11943 188094 101928 23635 -190567 -26579 5113 20815 -86960 13214 -351237
5269 182200 282839 31230 31188 -96953 26727 16119 208897 22456 -160272 140107 97136
5258 97136 100104 123854 -397326 249261 -126777 -107694 204844 -26688 109963 -434922 149806
5246 77920 -93024 64807 151095 -146219 -145607 -323280 -229302 92225 262110 -100948 57334
5234 -55865 254255 293002 160584 261513 58132 -82794 194131 -28005 70618 24267 348666
5223 348666 115850 -159693 -349616 173458 -12536 -273146 62851 124727 -255986 45919
5212 203012 140495 -292263 337298 -26416 -38223 -134328 141879 108972 -121885 83248 120399
5201 120399 88831 -262362 -203130 -40896 150157 -75655 192487 -239957 175252 33178 -17500
5189 -164276 182427 -117369 -152119 -276367 297251 28746 -147232 -106200 24557 107994 -71915
5177 108867 -2963 235234 182543 -186502 -154835 -160833 4307 -200653 -74366 -190751 103376
5165 -167628 170490 -35200 131632 51236 -220559 85572 57615 301026 -302337 64616 -137649
5153 -265889 178849 209346 360632 -135819 -374048 362989 35387 -245622 4477 -215228
5142 7400 31154 266958 -184326 57713 120008 -90749 -12003 -263166 231167 184346 105436
5131 105436 29402 75704 -249188 18729 -10436 -53019 -214010 -370089 -601714 60967 -66668
5119 -868 -228545 -40981 -256389 -383338 -46297 -65854 -315937 -132920 -288135 285252 -102430
5107 -150734 -88776 254028 222877 -79567 20184 215469 435031 42481 155981 12084 -84714
5095 211071 178861 198273 305702 24184 96526 33525 -205568 -61571 -48561 320073 22839
5083 319017 155657 99403 44825 -228635 165271 175377 92936 -93368 21449 91549 -295717
5071 -259639 -177223 -161948 5960 -309006 216732 -7102 236429 -5641 -164488 87723 -5409 -211890
5059 -211890 -125545 181802 71078 27602 210377 -87996 -141011 101535 -8290 255101 193803
5048 193803 195665 -113591 -314609 -58263 75882 -171980 -54685 -55356 -17958 300058 17489
5036 -22707 241404 -262901 -244047 149426 -78381 -234867 -116302 -2411 93185 -64736 133760
5024 267001 84092 7530 -103136 15596 -90288 -105544 -167350 15837 75118 -152448 73894
5012 -141587 151426 32302 -21303 73253 -251033 148105 14192 130759 21928 146609 -100633
5000 204613 336191 -281320 -223933 319771 -174024 170738 212277 -85050 -317300 94304
4989 -13353 237043 -114266 102853 -1104 12659 -16230 130537 -166657 -14468 -142350 182876
4977 44705 10311 -91021 -50703 167499 -89082 3973 123650 5333 49004 215629 11524 -194131
4964 39202 223514 116358 -55048 338806 -329454 339571 -170084 44719 -5974 117524 -175963
4952 190616 -297585 -24153 -102923 -268443 -92766 -56741 -105588 -84505 -351807 -203530 137302
4940 221551 -88874 223206 69536 -61151 -83789 169934 268462 402491 78703 23175 -110845
4928 167916 168300 20378 103396 281405 -63187 -52167 -106166 -24847 -484151 -60054 -133485 35719
4915 -64779 135581 59143 -34947 17923 -336617 150020 -6986 -124526 122430 188578 302368
4904 302368 62843 -67996 -499535 -101594 65636 269316 -167496 23456 -80177 -204525 -385450
4893 -385450 -73077 -1055 -2872 219406 -40436 323661 -186019 151251 -150837 -213778 182908
4881 -132667 228967 8785 -62722 -168095 -236140 300293 1580 -113315 133415 81591 -86605
4869 66870 -11378 147269 127831 386028 -45709 208866 -50710 119849 -104743 27349 -81555
4857 -116856 -68687 169160 -70735 -49893 77316 -90768 -271814 414134 189427 -311298 194777
4845 -48813 39636 -148563 -19974 53542 -113974 -97863 135863 197066 -110969 -318539 265508
4833 337374 14649 144159 27874 28432 -41151 522 -58597 -22511 53494 -78779 -60000 -70044
4821 -70044 -396270 34841 -148292 18540 72170 -177993 350948 152563 71484 -108399 -77268
4810 -77268 121637 -179686 -58852 -4862 -132022 -37788 -37081 -83460 177814 42592 7351 -192688
4797 -22026 -58276 106792 -114034 63066 72473 147932 -188172 -118858 -38724 59660 167250
4786 167250 -9530 -88196 -258544 76042 21718 -142664 -146825 -79297 86676 -24000 235068
4774 -55146 105456 -240393 -215132 420333 -17491 29126 203672 -166066 108850 447431
4764 447431 88978 4377 92003 -138219 -143155 40581 -98451 31325 -249335 98652 -101062
4752 -103731 159935 -245117 -160826 183371 -142951 126537 -208838 -17304 -224442 44861
4741 251440 4699 -147680 -122333 42816 77222 -83323 424091 211385 30882 133420 116777
4730 116777 31395 37489 222278 -8618 17231 78062 -189027 -181802 -145878 51026 141332 -199815
4717 -84019 162982 220197 197405 -276411 17288 -196754 -183423 171822 14181 254288 -11150
4705 -191609 225814 201041 -133491 297301 204220 402314 77265 98770 71083 -14205 155273
4693 -160327 -39195 6925 75310 -139208 -91129 -227237 131852 40000 134202 88634 -75118
4681 30921 34241 48391 66234 78270 -152077 77943 10784 -64936 27729 164997 -73775 18748
4668 135504 202800 -181223 -51910 232676 -78333 230131 -109040 285227 -177263 -71440
4657 248510 -208086 121096 159579 74057 -76562 81142 -197540 129993 -52997 224988 362532
4646 362532 -234282 105694 210936 -223719 70230 -200037 215047 138575 261700 177972
4636 177972 -336917 58524 345722 -95693 -122521 -110328 31854 137732 169163 145414 348005
4625 348005 -134355 -251185 -241922 13875 318807 2588 -78632 -60960 -109664 109602 81752
4614 81752 55597 232448 -311506 -28585 83256 308096 175346 149087 -110233 -192948 23784
4602 53295 85778 105558 214743 -86633 23767 112771 166968 -221795 128680 -166928 2462
4590 -218006 69773 -118150 156340 -75671 -29003 65287 61479 -219474 164399 83113 107060
4579 107060 23700 -196609 22401 150326 2782 116226 -48921 125213 83736 38529 -165370
4567 138806 -58643 314128 51268 132401 34623 177378 -148132 126204 59447 77542 192925
4556 192925 -52120 -127306 198551 294098 -170499 -134842 -18263 -43516 100013 -20740 -170393
4545 -170393 94584 -100001 136526 -260418 243371 -69940 219184 54726 260918 -68662
4534 30701 -248940 17409 -872 182379 -159441 129140 151269 77892 -301471 -283365 -203311
4523 -203311 -163538 -163066 -383404 -58947 -10666 -78228 513968 -181792 -58049 -57124 130474 143272
4511 143272 375279 -224126 -76761 -94926 206133 -134900 -123408 35549 -42994 27477 4386
4499 123041 -87197 -47981 -192966 -56958 89109 135824 -140326 313531 256092 -51244 -162247
4488 -162247 -80589 -44422 -18236 -117413 365736 303218 434222 71784 -271596 -79794 128348
4476 58803 -161319 -243006 173155 194683 -20117 -147278 174131 265655 68086 220117 -51119
$$ [...]
##END NTUPLES=NMR SPECTRUM
##END=
