##TITLE=AC1762_NAR_8_9683283_WP7fWIg7G1
##JCAMPDX= 6.0         $$ Bruker NMR JCAMP-DX V2.0
##DATA TYPE= NMR SPECTRUM
##DATA CLASS= NTUPLES
##ORIGIN= BRUKER
##OWNER= Administrator
$$ 1.72 TOPSPIN		Version 2.1
$$ 2016-04-16 17:11:22.111 -0700  Administrator@X
$$ Compression mode = diff/dup
##.OBSERVE FREQUENCY= 400.02188249412
##.OBSERVE NUCLEUS= ^1H
##.ACQUISITION MODE= SIMULTANEOUS (DQD)
##.ACQUISITION SCHEME= undefined
##.AVERAGES= 64
##.DIGITISER RES= 22
##SPECTROMETER/DATA SYSTEM= spect
##.PULSE SEQUENCE= noesygpps1d.comp
##.SOLVENT NAME= COFFEE_meoh
##.SHIFT REFERENCE= INTERNAL, COFFEE_meoh, 1, 14.96115
##AUDIT TRAIL= $$ (NUMBER, WHEN, WHO, WHERE, PROCESS, VERSION, WHAT)
$$ ##TITLE= Audit trail, TOPSPIN		Version 2.1
$$ ##JCAMPDX= 5.01
$$ ##ORIGIN= Bruker BioSpin GmbH
$$ ##OWNER= Administrator
$$ $$ E:\/data/COFFEE/nmr/AC1762_NAR_8_9683283_WP7fWIg7G1/12/pdata/1/auditp.txt
$$ ##AUDIT TRAIL=  $$ (NUMBER, WHEN, WHO, WHERE, PROCESS, VERSION, WHAT)
(   1,<2016-04-16 17:11:16.798 -0700>,<Administrator>,<X>,<go>,<TOPSPIN 2.1>,
      <created by zg
	started at 2016-04-16 16:59:47.236 -0700,
	POWCHK enabled, PULCHK disabled,
       configuration hash MD5:
       21 0F 79 D6 B3 7B B4 F6 88 20 88 DB 03 48 BD 9F
       data hash MD5: 64K
       61 A3 3D 01 D0 A1 AA EE E8 47 FB 36 54 B9 9A F0>)
(   2,<2016-04-16 17:11:20.001 -0700>,<Administrator>,<X>,<proc1d>,<TOPSPIN 2.1>,
      <Start of raw data processing
       efp LB = 0.3 FT_mod = 6 PKNL = 1 PHC0 = 0 PHC1 = 0 SI = 128K 
       data hash MD5: 128K
       76 49 3B 82 C3 3D 02 2E 55 94 7B 3E CB CE BE 8C>)
(   3,<2016-04-16 17:11:20.861 -0700>,<Administrator>,<X>,<proc1d>,<TOPSPIN 2.1>,
      <pk PHC0 = -85.69336 PHC1 = 0 
       data hash MD5: 128K
       AB 15 BB 5A 9A 60 60 86 00 8F A8 34 AB BE D5 9A>)
(   4,<2016-04-16 17:11:21.251 -0700>,<Administrator>,<X>,<proc1d>,<TOPSPIN 2.1>,
      <abs ABSG = 1 
       data hash MD5: 128K
       2E 7D 49 B2 06 CA 11 A8 B0 D5 D5 52 2D FC A3 EE>)
(   5,<2016-04-16 17:11:21.361 -0700>,<Administrator>,<X>,<proc1d>,<TOPSPIN 2.1>,
      <abs ABSG = 2 
       data hash MD5: 128K
       7E DD 91 1A CA D9 C9 92 49 9F F9 3B 46 5F BE DB>)
(   6,<2016-04-16 17:11:21.501 -0700>,<Administrator>,<X>,<proc1d>,<TOPSPIN 2.1>,
      <abs ABSG = 3 
       data hash MD5: 128K
       B8 45 7C E8 9E 6D 38 42 32 A0 28 3D 54 47 D7 92>)
(   7,<2016-04-16 17:11:21.814 -0700>,<Administrator>,<X>,<proc1d>,<TOPSPIN 2.1>,
      <abs ABSG = 4 
       data hash MD5: 128K
       B2 68 69 31 F1 0E D2 30 7A D5 36 38 7D 13 D1 6A>)
(   8,<2016-04-16 17:11:21.876 -0700>,<Administrator>,<X>,<proc1d>,<TOPSPIN 2.1>,
      <abs ABSG = 5 
       data hash MD5: 128K
       2E 0F F0 24 53 85 F0 FB 20 85 EF CE E1 7D 2F FA>)
$$ ##END=
$$ 
$$ $$ hash MD5
$$ $$ E7 29 E4 CD 68 EC 40 16 CC DE DB AC 5D 5B 67 C4
##$RELAX= 
##$RELAX= 
##$RELAX= 
##$RELAX= 
##$RELAX= 
##$RELAX= 
##$RELAX= 
##$RELAX= 
$$ Bruker specific parameters
$$ --------------------------
##$DU= <E:\>
##$EXPNO= 12
$$ [...]
##$TP07= 0
##$TPNAME0= <>
##$TPNAME1= <>
##$TPNAME2= <>
##$TPNAME3= <>
##$TPNAME4= <>
##$TPNAME5= <>
##$TPNAME6= <>
##$TPNAME7= <>
##$TPOAL= (0..7)
0.5 0.5 0.5 0.5 0.5 0.5 0.5 0.5
##$TPOFFS= (0..7)
0 0 0 0 0 0 0 0
##$TUNHIN= 0
##$TUNHOUT= 0
##$TUNXOUT= 0
##$USERA1= <user>
##$USERA2= <user>
##$USERA3= <user>
##$USERA4= <user>
##$USERA5= <user>
##$V9= 5
##$VALIST= <valist>
##$VCLIST= <CCCCCCCCCCCCCCC>
##$VD= 0
##$VDLIST= <DDDDDDDDDDDDDDD>
##$VPLIST= <PPPPPPPPPPPPPPP>
##$VTLIST= <TTTTTTTTTTTTTTT>
##$WBST= 2048
##$WBSW= 25
##$XGAIN= (0..3)
0 0 0 0
##$XL= 0
##$YL= 0
##$YMAX_a= 5943102
##$YMIN_a= -11144769
##$ZGOPTNS= <>
##$ZL1= 120
##$ZL2= 120
##$ZL3= 120
##$ZL4= 120
##$ABSF1= 14.96115
##$ABSF2= -5.597032
##$ABSG= 5
##$ABSL= 3
##$ALPHA= 0
##$AQORDER= 0
##$ASSFAC= 0
##$ASSFACI= 0
##$ASSFACX= 0
##$ASSWID= 0
##$AUNMP= <proc_prof1d_extract.lims>
##$AXLEFT= 0
##$AXNAME= <>
##$AXNUC= <1H>
##$AXRIGHT= 0
##$AXTYPE= 0
##$AXUNIT= <>
##$AZFE= 0.1
##$AZFW= 0.1
##$BCFW= 0
##$BC_mod= 0
##$BYTORDP= 0
##$COROFFS= 0
##$CY= 15
##$DATMOD= 1
##$DC= 0
##$DFILT= <>
##$DTYPP= 0
##$F1P= 0
##$F2P= 0
##$FCOR= 0.5
##$FTSIZE= 131072
##$FT_mod= 6
##$GAMMA= 0
##$GB= 0
##$INTBC= 1
##$INTSCL= 1
##$ISEN= 128
##$LB= 0.3
##$LEV0= 0
##$LPBIN= 0
##$MAXI= 10000
##$MC2= 0
##$MEAN= 0
##$ME_mod= 0
##$MI= 0
##$NCOEF= 0
##$NC_proc= -2
##$NLEV= 6
##$NOISF1= 0
##$NOISF2= 0
##$NSP= 0
##$NTH_PI= 0
##$NZP= 0
##$OFFSET= 14.96115
##$PC= 1
##$PHC0= -85.69336
##$PHC1= 0
##$PH_mod= 1
##$PKNL= yes
##$PPARMOD= 0
##$PPDIAG= 0
##$PPIPTYP= 0
##$PPMPNUM= 2147483647
##$PPRESOL= 1
##$PSCAL= 4
##$PSIGN= 0
##$PYNMP= <proc.py>
##$REVERSE= no
##$SF= 400.020009576933
##$SI= 131072
##$SIGF1= 0
##$SIGF2= 0
##$SINO= 400
##$SIOLD= 131072
##$SPECTYP= <>
##$SREGLST= <1H.CDCl3>
##$SSB= 0
##$STSI= 131072
##$STSR= 0
##$SW_p= 8223.68421052631
##$SYMM= 0
##$S_DEV= 0
##$TDeff= 65536
##$TDoff= 0
##$TI= <>
##$TILT= no
##$TM1= 0
##$TM2= 0
##$TOPLEV= 0
##$USERP1= <user>
##$USERP2= <user>
##$USERP3= <user>
##$USERP4= <user>
##$USERP5= <user>
##$WDW= 1
##$XDIM= 131072
##$YMAX_p= 316027684
##$YMIN_p= -13234
##$CURPLOT= <Network HP LaserJet P1505>
##$CURPRIN= <$Network HP LaserJet P1505>
##$DFORMAT= <normdp>
##$LAYOUT= <+/1D_H.xwp>
##$LFORMAT= <normlp>
##$PFORMAT= <normpl>
##$SURQMSG= 1
$$ End of Bruker specific parameters
$$ ---------------------------------
##NTUPLES= NMR SPECTRUM
##VAR_NAME=  FREQUENCY,     SPECTRUM/REAL,   SPECTRUM/IMAG
##SYMBOL=    X,             R,               I
##VAR_TYPE=  INDEPENDENT,   DEPENDENT,       DEPENDENT
##VAR_FORM=  AFFN,          ASDF,            ASDF
##VAR_DIM=   131072,        131072,          131072
##UNITS=     HZ,            ARBITRARY UNITS, ARBITRARY UNITS
##FACTOR=    0.0627417313425164, 1,          1
##FIRST=     8223.62146879497, -570,         -62074
##LAST=      0,             1880,            -62120
##MIN=       0,             -13234,          0
##MAX=       8223.62146879497, 316027684,    0
$$ Real data points
##PAGE= N=1
##DATA TABLE= (X++(R..R)), XYDATA
$$ [...]
63968D93970J6910J7388J7904J8731J9757K0637K1318K2175K3547K5408K7643
$$ 493970 510880 528268 546172 564903 584660 605297 626615 648790 672337 697745 725388
63957G25388L0347L3673L7594M1980M6900N2717N9952O9027P9928R2123J04950
$$ 725388 755735 789408 827002 868982 915882 968599 1028551 1097578 1177506 1269629 1374579
63946A374579J18106J31672J45744J60215J74791J88979K02174K13952K24100
$$ 1374579 1492685 1624357 1770101 1930316 2105107 2294086 2496260 2710212 2934312
63937B934312K32115K36937K37608K34044K26652K15381J99706J79499J55314
$$ 2934312 3166427 3403364 3640972 3875016 4101668 4317049 4516755 4696254 4851568
63928D851568J27813R7517O5139L1569k633l7107p0981j02901j31908j57644j79691
$$ 4851568 4979381 5076898 5142037 5173606 5170973 5133866 5062885 4959984 4828076 4670432 4490741
63917D490741j97505k11264k21706k28675k30839k27611k20604k12204k03197
$$ 4490741 4293236 4081972 3860266 3631591 3400752 3173141 2952537 2740333 2537136
63908B537136j92687j80007j65725j50922j36332j22311j09018r6518q5019p4937
$$ 2537136 2344449 2164442 1998717 1847795 1711463 1589152 1480134 1383616 1298597 1223660
63898A223660o6374n8859n2038m6200m1589l7611l3579k9935k7760k7066k6531
$$ 1223660 1157286 1098427 1046389 1000189 958600 920989 887410 857475 829715 802649 776118
63887G76118k5109k3099k1288j9796j8252j6596j5074j3645j1871r475o819m609
$$ 776118 751009 727910 706622 686826 668574 651978 636904 623259 611388 601913 595094 590485
63875E90485l047j410J103M080O162O948P877J0372J3643J5606J5751J5753J6981
$$ 590485 587438 586028 587131 591211 597373 604321 612198 622570 636213 651819 667570 683323 700304
63862G00304J8644J9105J8027J6354J4838J3492J2158J0773R132P028M580K089
$$ 700304 718948 738053 756080 772434 787272 800764 812922 823695 832827 839855 844435 846524
63850H46524l59k788n046o997q810j0720j2652j4470j6372j8560k0705k2234k3075
$$ 846524 846165 843377 838331 831334 822524 811804 799152 784682 768310 749750 729045 706811 683736
63837F83736k3655k4158k4333k4117k3921k4065k4290k4071k3114k1394j9026
$$ 683736 660081 635923 611590 587473 563552 539487 515197 491126 468012 446618 427592
63826D27592j6447j4419j3383j2913j2178j0996j0016r774r916r634q587p100
$$ 427592 411145 396726 383343 370430 358252 347256 337240 327466 317550 307916 299329 292229
63814B92229n663m614m214m522n008m795l570k082j310j365j549j420j318j704
$$ 292229 286566 281952 277738 273216 268208 263413 259843 257761 256451 255086 253537 252117 250799 249095
63800B49095k368k663k353j889j768j918j931j747j780k267k807k841k422k142
$$ 249095 246727 244064 241711 239822 238054 236136 234205 232458 230678 228411 225604 222763 220341 218199
63786B18199k323k625k593k203j727j317j009q28p35n95m71o46j203j734j785
$$ 218199 215876 213251 210658 208455 206728 205411 204402 203574 202839 202244 201773 201127 199924 198190 196405
63771A96405j403r69o63l41J66Q55J495J675J115J32n64p13p21q60p88l12j5m27
$$ 196405 195002 194033 193370 193029 193195 194050 195545 197220 198335 198467 197903 197190 196469 195609 194821 194509 194494 194067
63753A94067j036r51k65J75J59L69J166K062K533K598K343J702R58P01R41J005
$$ 194067 193031 192080 191815 191990 192149 192518 193684 195746 198279 200877 203220 204922 205880 206581 207522 208527
63737B08527O55O08J397K376K570K027J622J854K359K538K134J333O85P97J727
$$ 208527 209182 209790 211187 213563 216133 218160 219782 221636 223995 226533 228667 230000 230685 231482 233209
63722B33209K796L249K977K451K125K164K432K584K344J871J570J432R83O4q60
$$ 233209 236005 239254 242231 244682 246807 248971 251403 253987 256331 258202 259772 261204 262187 262251 261391
63707B61391j450j958k529k599j677l72J82k24o37k18Q09J611J722J406J292J744
$$ 261391 259941 257983 255454 252855 251178 250806 250988 250764 250127 249909 250718 252329 254051 255457 256749 258493
63691B58493K535L097L147K900K649K424K180J950J671J155N18J92K26M0o83j300
$$ 258493 261028 264125 267272 270172 272821 275245 277425 279375 281046 282201 282719 282911 283137 283177 282494 281194
63675B81194j000PO71L86m24r53q09k05K76K41o1lM76O10k24j665k879l488l485
$$ 281194 280194 280201 280872 281258 280834 279881 279072 278867 279143 279384 279323 279320 279796 280406 280182 278517 275638 272150 268665
63656B68665k842j828j304j848k818l113k615k098j929j748j365j039q58o10l26
$$ 268665 265823 263995 262691 260843 258025 254912 252297 250199 248270 246522 245157 244118 243260 242650 242324
63641B42324j70J66J080K131K480K249K469L430M205M125L695L569L630L683M050
$$ 242324 242154 242320 243400 245531 248011 250260 252729 256159 260364 264489 268184 271753 275383 279066 283116
63626B83116M853N531N818O406P839R500J0556J1253J2312J3665J4738J5608J6808
$$ 283116 287969 293500 299318 305724 313563 323063 333619 344872 357184 370849 385587 401195 418003
63613D18003J8214J9144J9446J9707K0335K1181K1945K2344K1975K0675J8873
$$ 418003 436217 455361 474807 494514 514849 536030 557975 580319 602294 622969 641842
63602F41842J6945J4545J1344Q090N890M571K839K14k316l851m778n926p448r101
$$ 641842 658787 673332 684676 692766 698656 703227 706066 706280 703964 700113 695335 689409 681961 672860
63588F72860j0907j2852j4521j5648j6582j7635j8371j8187j7211j6125j5245
$$ 672860 661953 649101 634580 618932 602350 584715 566344 548157 530946 514821 499576
63577D99576j4389j3389j2220j0826r248p822o738n603l904j791J39J733L402
$$ 499576 485187 471798 459578 448752 439504 431682 424944 419341 415437 413646 413785 415518 418920
63564D18920N304O953P776P778P473P471Q139R414J0848J2052J3135J4428J5889
$$ 418920 424224 431177 438953 446731 454204 461675 469814 479228 490076 502128 515263 529691 545580
63551E45580J7149J8146J9276K0756K2285K3439K4063K3995K2910K0724J7905
$$ 545580 562729 580875 600151 620907 643192 666631 690694 714689 737599 758323 776228
63540G76228J4985J1975Q603M917J270k115n163p605r121r859j0420j1193j2043
$$ 776228 791213 803188 811791 816708 817978 815863 810700 803095 793974 784115 773695 762502 750459
63527G50459j2731j3413j4475j6134j8273k0539k2496k3871k4723k5194k5090
$$ 750459 737728 724315 709840 693706 675433 654894 632398 608527 583804 558610 533520
63516E33520k4017k2058j9932j8288j7065j5807j4387j3010j1787j0618r493q479
$$ 533520 509503 487445 467513 449225 432160 416353 401966 388956 377169 366551 357058 348579
63504C48579p514o482n526m941m681m306l538k593j836j363j057q58p54o17l39
$$ 348579 341065 334583 329057 324116 319435 315129 311591 308998 307162 305799 304742 303884 303130 302513 302174
63489C02174m5k8m64j168j636j357k93R18J520J501J674K607L720L806K469O55
$$ 302174 302129 302101 301637 300469 298833 297476 297183 298101 299621 301122 302796 305403 309123 312929 315398 316053
63473C16053l92l97q0j21n03q57j032j130j212j308j566k063k462k246j439p43
$$ 316053 315661 315264 315184 315063 314560 313703 312671 311541 310329 309021 307455 305392 302930 300684 299245 298502
63457B98502p27j128j226p61n1O31J414K429L417L960L975L880M211N135O298
$$ 298502 297775 296647 295421 294660 294609 295240 296654 299083 302500 306460 310435 314315 318526 323661 329959
63442C29959P224P896Q749J0025J1429J2634J3835J5410J7190J8526J8979J8601
$$ 329959 337183 345079 353828 363853 375282 387916 401751 417161 434351 452877 471856 490457
63430D90457J7692J6695J6214J6480J6847J6464J5513J5120J5819J6881J7521
$$ 490457 508149 524844 541058 557538 574385 590849 606362 621482 637301 654182 671703
63419F71703J8021J9116K0826K2520K3724K4238K3819K2348K0129J7441J4098
$$ 671703 689724 708840 729666 752186 775910 800148 823967 846315 866444 883885 897983
63408H97983J0041O004K824K89k510n700q356r865j0761j1914j3489j5107j6630
$$ 897983 908024 914028 916852 917141 914631 908931 900575 890710 879949 868035 854546 839439 822809
63395H22809j8316k0455k2984k5403k6988k7357k6823k5992k5079k3956k2619
$$ 822809 804493 784038 761054 735651 708663 681306 654483 628491 603412 579456 556837
63384E56837k1088j9039j6230j3269j1125r794q273o060l803k039k83J966M133
$$ 556837 535749 516710 500480 487211 476086 466292 458019 451959 448156 446117 445834 447800 451933
63371D51933N448O371Q033J0468J2471J3261J3429J4020J5376J7103J8740K0138
$$ 451933 457381 463752 471785 482253 494724 507985 521414 535434 550810 567913 586653 606791
63359F06791K1496K3128K4990K6420K6702K5863K4526K3088K1419J9336J6881
$$ 606791 628287 651415 676405 702825 729527 755390 779916 803004 824423 843759 860640
63348H60640J4001J0515O528K530j124m428p295r380j0617j1543j2742j4196j5539
$$ 860640 874641 885156 891684 894214 893090 888662 881367 871987 861370 849827 837085 822889 807350
63335H07350j6695j7950j9503k1206k2766k3949k4621k4710k4183k3005k1171
$$ 807350 790655 772705 753202 731996 709230 685281 660660 635950 611767 588762 567591
63324E67591j8835j6312j3954j2065j0837j0180r664q969q318q265q939r875j0556
$$ 567591 548756 532444 518490 506425 495588 485408 475744 466775 458457 450192 441253 431378 420822
63311D20822j0839j0698j0041q968p894p124o554o048n733n647n399m627l527
$$ 420822 409983 399285 389244 380276 372382 365258 358704 352656 346923 341276 335877 331250 327723
63298C27723k611k124k046k348k739k578j651q59j337k886m028l800k765j918
$$ 327723 325112 322988 320942 318594 315855 313277 311626 310767 309430 306544 302516 298716 295951 294033
63284B94033j414r52p62j347k450l114k804j930j177q04p38q50r32p12j97K24
$$ 294033 292619 291667 290905 289558 287108 283994 281190 279260 278083 277279 276541 275691 274759 274047 273850 274074
63268B74074K84K19L69O17N24J2l80l6J101K446L297L386L075K961L256L570L425
$$ 274074 274358 274577 274946 275563 276087 276099 275719 275683 276784 279230 282527 285913 288988 291949 295205 298775 302200
63251C02200K881K498K657L214L794M229M611N107N864O895P926Q607Q997R586
$$ 302200 305081 307579 310236 313450 317244 321473 326084 331191 337055 343950 351876 360483 369480 379066
63237C79066J0626J1758J2602J3295J4027J4419J4108J3676J4108J5259J5824
$$ 379066 389692 401450 414052 427347 441374 455793 469901 483577 497685 512944 528768
63226E28768J5226J4530J4965J6238J7170J7363J7318J7261J6925J6390J6135
$$ 528768 543994 558524 573489 589727 606897 624260 641578 658839 675764 692154 708289
63215G08289J6091J5513J4074J2389J1092R939Q239N711K583p64l960o708q990
$$ 708289 724380 739893 753967 766356 777448 787387 795626 801337 803920 803156 799196 792488 783498
63202G83498j0900j2236j2658j2344j2013j1924j1511j0279q564o879n094k785
$$ 783498 772598 760362 747704 735360 723347 711423 699912 689633 681069 674190 669096 666311
63190F66311q1K587N201Q003J0781J3006J4651J6232J8054J9947K1730K3390K4693
$$ 666311 666230 668817 674018 682021 692802 705808 720459 736691 754745 774692 796422 819812 844505
63177H44505K5235K5041K4651K4454K4323K4055K3731K3397K2746K1331J8907
$$ 844505 869740 894781 919432 943886 968209 992264 1015995 1039392 1062138 1083469 1102376
63166A102376J5480J1338P091L241l92m531r494j4802j9858k4540k8873l2468
$$ 1102376 1117856 1129194 1136285 1139526 1139134 1134603 1125109 1110307 1090449 1065909 1037036 1004568
63154A004568l4820l5960l6420l6614l6545l6044l4968l3227l0869k8181k5560
$$ 1004568 969748 933788 897368 860754 824209 788165 753197 719970 689101 660920 635360
63143F35360k3240k1229j9331j7255j4833j2325j0236q734p462o121n006m562
$$ 635360 612120 590891 571560 554305 539472 527147 516911 508177 500715 494594 489588 485026
63131D85026m592m319l266j734k98Q14J730K544L167L515L649L693L696L633L518
$$ 485026 480434 476115 472849 471115 470817 471631 473361 475905 479072 482587 486236 489929 493625 497258 500776
63116E00776L442L448L434L287L039K803K568K211J724J275R31O05K55L3j3j52
$$ 500776 504218 507666 511100 514387 517426 520229 522797 525008 526732 528007 528938 529543 529798 529831 529818 529666
63100E29666o80j457j940j729r93l20j94o20j200j536j501j161o17o3K10J58J69
$$ 529666 528986 527529 525589 523860 522867 522547 522353 521733 520533 518997 517496 516335 515718 515655 515865 516023 516192
63083E16192O02J207J414J210J236J906K870L634M204M834N502O046O519O996
$$ 516192 516794 518001 519415 520625 521861 523767 526637 530271 534475 539309 544811 550857 557376 564372
63069E64372P271P203P193P806R029J0357J1491J2551J3617J4626J5717J7241
$$ 564372 571643 578846 586039 593845 602874 613231 624722 637273 650890 665516 681233 698474
63057F98474J9275K1465K3460K5207K6816K8446L0335L2510L4453L5517L5796
$$ 698474 717749 739214 762674 787881 814697 843143 873478 905988 940441 975958 1011754
63046A011754L6168L7185L8374L8996L9119L9444M0277M1126M1336M0722L9535
$$ 1011754 1047922 1085107 1123481 1162477 1201596 1241040 1281317 1322443 1363779 1404501 1444036
63035A444036L8090L6622L5248L3885L2228K9945K6913K3115J8412J2613N946
$$ 1444036 1482126 1518748 1553996 1587881 1620109 1650054 1676967 1700082 1718494 1731107 1737053
63024A737053q08o967j2650j8426k4229k9156l2539l4706l6247l6943l6040l3395
$$ 1737053 1736245 1729278 1716628 1698202 1673973 1644817 1612278 1577572 1541325 1504382 1468342 1434947
63012A434947k9703k5671k1517j7207j2575p217r57N508J1131J5830K0567K5866
$$ 1434947 1405244 1379573 1358056 1340849 1328274 1321057 1320100 1325608 1336739 1352569 1373136 1399002
63000A399002L1038L5276L8759M2028M4897M6780M7727M8270M8490M8020M6848
$$ 1399002 1430040 1465316 1504075 1546103 1591000 1637780 1685507 1733777 1782267 1830287 1877135
62989A877135M5389M3801M1878L9620L7167L4061K9278K2385J4080N397l235j1869
$$ 1877135 1922524 1966325 2008203 2047823 2084990 2119051 2148329 2170714 2184794 2190191 2186956 2175087
62977B175087k0531k9214l7985m6687n4707o1416o6613p0307p2337p2598p1444
$$ 2175087 2154556 2125342 2087357 2040670 1985963 1924547 1857934 1787627 1715290 1642692 1571248
62966A571248o9485o7104o4422o1610n8726n5377n1075m6128m1707l8721l6843
$$ 1571248 1501763 1434659 1370237 1308627 1249901 1194524 1143449 1097321 1055614 1016893 980050
62955I80050l4910l2213k9061k6271k4358k3271k2630k2028k1241k0266j9205
$$ 980050 945140 912927 883866 857595 833237 809966 787336 765308 744067 723801 704596
62944G04596j8102j7003j6059j5429j4911j3992j2452j0843j0012j0049j0073
$$ 704596 686494 669491 653432 638003 623092 609100 596648 585805 575793 565744 555671
62933E55671r201p600o285n916o061n700m394k725j620j372j449j281r39q31r89
$$ 555671 546470 538870 532585 526669 520608 514908 510514 507789 506169 504797 503348 502067 501128 500297 499308
62918D99308r67n56j73m05j322k496l463m020m161l974l608l198k791k441k294
$$ 499308 498341 497785 497612 497207 495885 493389 489926 485906 481745 477771 474163 470965 468174 465733 463439
62903D63439k527l190m037m506m043k758j620j565k348k801k352j688j564j604
$$ 463439 460912 457722 453685 449179 445136 442378 440758 439193 436845 434044 431692 430004 428440 426836
62889D26836r77J42P20L36k10j5Q78J691J811J216M11PJ23J92k79q62p35K4M07
$$ 426836 425859 426001 426721 427057 426847 426832 427710 429401 431212 432428 432839 432846 432969 433161 432882 432020 431285 431309 431716
62870D31716q5p22p05k69q4j63j17m8l94j074j520j479j130n24L46J013Q41kn73
$$ 431716 431631 430909 430204 429935 429851 429688 429571 429523 429129 428055 426535 425056 423926 423402 423748 424761 425602 425600 425027
62851D25027l52K04N65Q55J254J316N51o25j267j033m13P3L34L36j20r91j787
$$ 425027 424675 424879 425444 426299 427553 428869 429420 428795 427528 426495 426082 426155 426489 426825 426705 425714 423927
62834D23927k040j797j442j255j247j265j043l90M66R14O33J30K31J060J883K060
$$ 423927 421887 420090 418648 417393 416146 414881 413838 413448 413914 414828 415461 415591 415822 416882 418765 420825
62818D20825J815J845K367K918L032K763K490K418K462K509K624K973L603M319
$$ 420825 422640 424485 426852 429770 432802 435565 438055 440473 442935 445444 448068 451041 454644 458963
62804D58963M831N006M992N050N255N431N400N269N441O277P665R023R861J0409
$$ 458963 463794 468800 473792 478842 484097 489528 494928 500197 505638 511915 519580 528603 538464 548873
62790E48873J1466J3515J6204J8838K1229K3710K6528K9610L2914L6508M0225
$$ 548873 560339 573854 590058 608896 630125 653835 680363 709973 742887 779395 819620
62779H19620M3563M6286M8741N1321N3768N5368N5789N5354N4393N2520M8795
$$ 819620 863183 909469 958210 1009531 1063299 1118667 1174456 1229810 1284203 1336723 1385518
62768A385518M2713L4943K6893J9388J1994L877m875j3290k0726k7429l3693l9152
$$ 1385518 1428231 1463174 1490067 1509455 1521449 1525326 1520451 1507161 1486435 1459006 1425313 1386161
62756A386161m3335m6458m9020n0920n1608n1038m9806m8403m6776m4764m2434
$$ 1386161 1342826 1296368 1247348 1196428 1144820 1093782 1043976 995573 948797 904033 861599
62745H61599l9899l7182l4408l1814k9418k6912k4106k1190j8502j6216j4329
$$ 861599 821700 784518 750110 718296 688878 661966 637860 616670 598168 581952 567623
62734E67623j2757j1263r553p587n682m208l261k674k221j759j193l58J037L075
$$ 567623 554866 543603 534050 526463 520781 516573 513312 510638 508417 506658 505465 505107 506144 509219
62720E09219N185O439O603O659P811J0157J2798J5056J6977J8786K0605K2833
$$ 509219 514404 520843 527446 534105 541916 552073 564871 579927 596904 615690 636295 659128
62708F59128K6018L0010L3911L7252M0668M5015N0265N5726O0912O5694O9971
$$ 659128 685146 715156 749067 786319 826987 872002 922267 977993 1038905 1104599 1174570
62697A174570P3726P7176Q0420Q3125Q4842Q5339Q4307Q1214P6022O9517O2300
$$ 1174570 1248296 1325472 1405892 1489017 1573859 1659198 1743505 1824719 1900741 1970258 2032558
62686B032558N3764M2917K9972J6187K239j2237k7198m1311n3114o2497p0330
$$ 2032558 2086322 2129239 2159211 2175398 2177637 2165400 2138202 2096891 2043777 1981280 1910950
62675A910950p7002q2070q5141q6449q6363q4858q1816p7662p3292o9237o5183
$$ 1910950 1833948 1751878 1666737 1580288 1493925 1409067 1327251 1249589 1176297 1107060 1041877
62664A041877o0544n5348n0281m5846m1928l8240l4775l1547k8357k5185k2446
$$ 1041877 981333 925985 875704 829858 787930 749690 714915 683368 655011 629826 607380
62653F07380k0378j8508j6253j3862j2190j1583j1550j1481j1140j0490r615q814
$$ 607380 587002 568494 552241 538379 526189 514606 503056 491575 480435 469945 460330 451516
62641D51516q305p721o489m758l362k752k487k066j672j787k444l156l367k829
$$ 451516 443211 435490 429001 424243 420881 418129 415642 413576 411904 410117 407673 404517 401150 398321
62627C98321j857j236j472k102k241j804j488j478j035K28J511J936J856K279
$$ 398321 396464 395228 393756 391654 389413 387609 386121 384643 383608 383836 385347 387283 389139 391418
62613C91418L387M340M397L680K941K985M027N330N895N778O250Q115J0524J2153
$$ 391418 394805 399145 403542 407222 410163 413148 417175 422505 428400 434178 440428 448543 459067 471220
62599D71220J2994J4076J5774J7469J8805K0150K1728K3187K4242K4985K5348
$$ 471220 484214 498290 514064 531533 550338 570488 592216 615403 639645 664630 689978
62588F89978K5033K4149K3240K2275K0400J7020J2600P975L462r60n105q763j2077
$$ 689978 715011 739160 762400 784675 805075 822095 834695 842670 846132 845172 840067 831304 819227
62575H19227j5241j8107k0466k2418k4025k4886k4561k3275k1770k0572j9667
$$ 819227 803986 785879 765413 742995 718970 694084 669523 646248 624478 603906 584239
62564E84239j8834j7866j6596j4986j3312j1984j1060j0122q668o693m849l914
$$ 584239 565405 547539 530943 515957 502645 490661 479601 469479 460811 454118 449269 445355
62552D45355m006m354m122l290k494k046j620q89kQ13J573K238K478K136J597
$$ 445355 441349 436995 432873 429583 427089 425043 423423 422534 422532 423345 424918 427156 429634 431770 433367
62537D33367J322J307J328J435J801K400L155M181N412O360O788P375R021J1596
$$ 433367 434689 435996 437324 438759 440560 442960 446115 450296 455708 462068 468856 476231 485252 496848
62523D96848J4065J5894J7631J9937K2739K5690K8804L2160L5405L8188M0805
$$ 496848 510913 526807 544438 564375 587114 612804 641608 673768 709173 747361 788166
62512G88166M3780M6865M9097M9969M9956M9609M8536M5886M1577L6544L1592
$$ 788166 831946 878811 927908 977877 1027833 1077442 1125978 1171864 1213441 1249985 1281577
62501A281577K6515K0521J3267N201k800r781j4920j7993j9632k0778k1723k1989
$$ 1281577 1308092 1328613 1341880 1347081 1344281 1334500 1319580 1301587 1281955 1261177 1239454 1217465
62489A217465k1069j8814j5105r854l652K200O814J0562J4275J7979K1013K3108
$$ 1217465 1196396 1177582 1162477 1152623 1148971 1151171 1157985 1168547 1182822 1200801 1221814 1244922
62477A244922K4526K5186K4496K2217J8845J4769R640L063m473j1861j8439k4328
$$ 1244922 1269448 1294634 1319130 1341347 1360192 1374961 1384601 1387664 1383191 1371330 1352891 1328563
62465A328563k9869l5073l9744m3724m6905m9080n0035m9807m8770m7322m5464
$$ 1328563 1298694 1263621 1223877 1180153 1133248 1084168 1034133 984326 935556 888234 842770
62454H42770m2789l9052l4615l0160k6064k2329j9016j6352j4261j2207r794p273
$$ 842770 799981 760929 726314 696154 670090 647761 628745 612393 598132 585925 576131 568858
62442E68858n197l687k312o75J135K640L429L478L206L057L048K714J697J86j341
$$ 568858 563661 559974 557662 556987 558122 560762 564191 567669 570875 573932 576980 579694 581391 581577 580236
62427E80236k703m101n696p349q809r912j0530j0567j0121r551r163q903q446
$$ 580236 577533 573432 567736 560387 551578 541666 531136 520569 510448 500897 491734 482831 474385
62414D74385p593o460n316m390l862l830m158m438m284l721l116k670k191j484
$$ 474385 466792 460332 455016 450626 446764 442934 438776 434338 430054 426333 423217 420547 418356 416872
62400D16872p62l85l00q0M46R41J067R02O74L71pq6N64J718K530K493K101K301
$$ 416872 416110 415725 415425 415345 415791 416732 417799 418701 419375 419746 419739 419653 420217 421935 424465 426958 429059 431360
62382D31360L389M629N055M566M128M785O483Q055Q505Q041P627P786Q320R079
$$ 431360 434749 439378 444433 448999 453127 457912 464395 472450 480955 488996 496623 504409 512729 521808
62368E21808J0360J2261J4217J5629J6604J7702J9224K1159K3569K6441K9356
$$ 521808 532168 544429 558646 574275 590879 608581 627805 648964 672533 698974 728330
62357G28330L1901L4322L7111L9968M1886M2389M1978M1083L9362L6506L2920
$$ 728330 760231 794553 831664 871632 913518 955907 997885 1038968 1078330 1114836 1147756
62346A147756K8930K3961J7471J0261L840j376o212j1084j5348j8532k1204k3984
$$ 1147756 1176686 1200647 1218118 1228379 1232219 1230843 1224631 1213547 1198199 1179667 1158463 1134479
62334A134479k6566k8320k9284k9772k9577k8383k6614k5041k3708k2073k0155
$$ 1134479 1107913 1079593 1050309 1020537 990960 962577 935963 910922 887214 865141 844986
62323H44986j8704j8073j7695j7023j6381j6413j7077j7691j7826j7801j8179
$$ 844986 826282 808209 790514 773491 757110 740697 723620 705929 688103 670302 652123
62312F52123j8987j9507j8932j7236j5255j3719j2451j0835q893p318o446n820
$$ 652123 633136 613629 594697 577461 562206 548487 536036 525201 516308 508990 502544 496724
62300D96724m983m111l454k649j174P51K317L122L523M011M705N572O641P763
$$ 496724 491741 487630 484176 481527 480353 481104 483421 486543 490066 494077 498782 504354 510995 518758
62286E18758Q460Q371P727P170P125P500P921Q030P597O629N500M799M811N187
$$ 518758 527218 535589 543316 550486 557611 565111 573032 581062 588659 595288 600788 605587 610398 615585
62272F15585N290M893M339M068M178M630N552P104R114J1173J3084J4982J7055
$$ 615585 620875 625768 630107 634175 638353 642983 648535 655639 664753 675926 689010 703992 721047
62259G21047J9440K2352K5961K9981L3689L6599L8850M0802M2423M3326M3188
$$ 721047 740487 762839 788800 818781 852470 889069 927919 968721 1011144 1054470 1097658
62248A097658M1899L9375L5571L0600K4665J7939J0703L433l466r924j5931k1235
$$ 1097658 1139557 1178932 1214503 1245103 1269768 1287707 1298410 1301843 1298377 1288453 1272522 1251287
62236A251287k5694k9734l3939l8141m1470m3355m3915m3326m1483l8674l5895
$$ 1251287 1225593 1195859 1161920 1123779 1082309 1038954 995039 951713 910230 871556 835661
62225H35661l3788l1738k8803k5242k2272k0290j8365j5743j3038j1371j0865
$$ 835661 801873 770135 741332 716090 693818 673528 655163 639420 626382 615011 604146
62214F04146j0612r833q485o995n776m964m203k969j418n50j034k142k492j755
$$ 604146 593534 583701 575216 568221 562445 557481 553278 550309 548891 548341 547307 545165 542673 540918
62200E40918q15l09K04J315K757L822M277M404M494M714N207N881O423O770P291
$$ 540918 540103 539794 539998 541313 544070 547892 552169 556573 561067 565781 570988 576869 583292 590062 597353
62185E97353Q131Q768Q712Q306Q252Q559Q627Q231P804P711P870Q196Q844R824
$$ 597353 605484 614252 622964 631270 639522 648081 656708 664939 672743 680454 688324 696520 705364 715188
62171G15188J0804J1585J2445J3838J5961J8672K1541K3928K5437K6419K7592
$$ 715188 725992 737577 750022 763860 779821 798493 820034 843962 869399 895818 923410
62160I23410K9064L0047K9726K7971K5037K1084J6388J1594P227L112j266n938
$$ 923410 952474 982521 1012247 1040218 1065255 1086339 1102727 1114321 1121548 1124660 1123394 1117456
62148A117456j0359j4068j7021j9330k1021k2237k3330k4551k5666k6045k5191
$$ 1117456 1107097 1093029 1076008 1056678 1035657 1013420 990090 965539 939873 913828 888637
62137H88637k3166k0541j7883j5476j3493j2152j1399j0642r296p551o172n470
$$ 888637 865471 844930 827047 811571 798078 785926 774527 763885 754589 747038 740866 735396
62125G35396n040m630m609n154n560n009l702k608k202k083j815j527j588k076
$$ 735396 730356 725726 721117 715963 710403 705394 701692 699084 696882 694799 692984 691457 689869 687793
62111F87793k825l630m287m632m763n011n545o084o138n567m840m654n131n562
$$ 687793 684968 681338 677051 672419 667656 662645 657100 651016 644878 639311 634471 629817 624686 619124
62097F19124n216m274l516l064k157m21J344K299K813L757M928N360N052N288
$$ 619124 613908 609634 606118 603054 600897 600476 601820 604119 606932 610689 615617 620977 626029 631317
62083F31317O844Q872J0048J0203J0206J0770J1876J3093J3990J4413J4673J5252
$$ 631317 638161 647033 657081 667284 677490 688260 700136 713229 727219 741632 756305 771557
62071G71557J6160J6905J7276J7691J8449J9170J9362J9162J9020J9050J9162
$$ 771557 787717 804622 821898 839589 858038 877208 896570 915732 934752 953802 972964
62060I72964J9414J9661J9178J7392J4786J2373J0337P909M524M53l825q083j2052
$$ 972964 992378 1012039 1031217 1048609 1063395 1075768 1086105 1094014 1098538 1098991 1095166 1087083 1075031
62047A075031j5319j7854k0124k2407k4538k6502k8687l1081l2822l3134l2284
$$ 1075031 1059712 1041858 1021734 999327 974789 948287 919600 888519 855697 822563 790279
62036G90279l1048k9599k7679k5545k3909k2863k1620j9609j7249j5302j3924
$$ 790279 759231 729632 701953 676408 652499 629636 608016 588407 571158 555856 541932
62025E41932j2794j1809j1144j0666r865q488p005o111n920n851n403m778m565
$$ 541932 529138 517329 506185 495519 485654 477166 470161 464050 458130 452279 446876 442098 437533
62012D37533m889n167m789l773k605j658r87n09j03M24J130J773K060K087K215
$$ 437533 432644 427477 422688 418915 416310 414652 413665 413156 413053 413477 414607 416380 418440 420527 422742
61997D22742K592L009L205L093K689K132J689J406Q00o22k511l862m231m176m308
$$ 422742 425334 428343 431548 434641 437330 439462 441151 442557 443357 442735 440224 436362 432131 427955 423647
61982D23647m457m259m013m302n090n797o071n959n463m579l680l237l203l185
$$ 423647 419190 414931 410918 406616 401526 395729 389658 383699 378236 373657 369977 366740 363537 360352
61968C60352l133l324l664l684l278k763k178j233j58K51j51m05K19J102J141
$$ 360352 357219 353895 350231 346547 343269 340506 338328 337095 336937 337188 337037 336632 336851 337953 339094
61953C39094L16l32l1J117K551L712M218M198M403N410O827P737P851P679P659
$$ 339094 339410 339078 339047 340164 342715 346427 350645 354843 359246 364656 371483 379220 387071 394750 402409
61938D02409P784Q069Q708R545R927R428Q381P496P211P493P925P803O612M619
$$ 402409 410193 418262 426970 436515 446442 455870 464251 471747 478958 486451 494376 502179 508791 513410
61924E13410K777J798J483J080Q8j352k657l240k985k348j809j326n95L21J125
$$ 513410 516187 517985 519468 520548 520636 519284 516627 513387 510402 508054 506245 504919 504324 504645 505770
61909E05770K024L566N582O978P083O643O809P534P657O444M393K419R17k29j147
$$ 505770 507794 511360 516942 523920 531003 537646 544455 551989 559646 566090 570483 572902 573819 573590 572443
61894E72443j855k379k759l003l178l433l812m120m103l786l546l778m472n197
$$ 572443 570588 568209 565450 562447 559269 555836 552024 547904 543801 540015 536469 532691 528219 523022
61880E23022n576n679n836o115o260o150o009o021n946n432m548l768l433l413
$$ 523022 517446 511767 505931 499816 493556 487406 481397 475376 469430 463998 459450 455682 452249 448836
61866D48836l284k751j838q09J26R66J796K555L189L932N113O660Q057R077J0128
$$ 448836 445552 442801 440963 440154 440280 441246 443042 445597 448786 452718 457831 464491 472548 481625 491753
61851D91753J1666J3429J4682J5044J4772J4351J4074J3934J3682J2980J1746
$$ 491753 503419 516848 531530 546574 561346 575697 589771 603705 617387 630367 642113
61840F42113J0245Q704O995M973K938J318J36q63j673k074k160k274k295j627
$$ 642113 652358 661062 668057 673030 675968 677286 677422 676559 674886 672812 670652 668378 666083 664456
61826F64456j19J507K448K728K948L426L951M123L640K410O92j016k541m274o483
$$ 664456 664337 665844 668292 671020 673968 677394 681345 685468 689108 691518 692210 691194 688653 684379 677896
61811F77896q610r749r821r735j0281j1243j1873j1863j1539j1305j1247j1203
$$ 677896 669286 659537 649716 639981 629700 618457 606584 594721 583182 571877 560630 549427
61799E49427j0923j0188q984p661o708o280o025n486m599l734l283l283l452l470
$$ 549427 538504 528316 519332 511671 504963 498683 492658 487172 482573 478839 475556 472273 468821 465351
61785D65351l271l022k890k851k771k627k573k680k708k325j538p89m27k87M1
$$ 465351 462080 459058 456168 453317 450546 447919 445346 442666 439958 437633 436095 435306 434879 434592 434633
61770D34633O01J001J014R14J034J241J242J214J681K711L640L843L468L126L148
$$ 434633 435234 436235 437249 438163 439197 440438 441680 442894 444575 447286 450926 454769 458237 461363 464511
61755D64511L467L939M398M475L878K825J816R52m4j187k073k571l093l893m600
$$ 464511 467978 471917 476315 480790 484668 487493 489309 490261 490217 489030 486957 484386 481293 477400 472800
61740D72800m831m812m972n230n195m733l935k804j527p35q53j401j599j384j136
$$ 472800 467969 463157 458185 452955 447760 443027 439092 436288 434761 434026 433173 431772 430173 428789 427653
61725D27653p31J29Q69N37n16p39L77J457J258M26K67P57R64P33O06N06j52j164
$$ 427653 426922 427051 427920 428457 427941 427202 427579 429036 430294 430720 430987 431744 432708 433441 434047 434553 434401 433237
61707D33237j626j360j161j496j977k324k848l605m050l907l575l264k649j825
$$ 433237 431611 430251 429090 427594 425617 423293 420445 416840 412790 408883 405308 402044 399395 397570
61693C97570j715k756l947m086l387l001l282l493l103k461k139k213k416k513
$$ 397570 395855 393099 389152 385066 381679 378678 375396 371903 368800 366339 364200 361987 359571 357058
61679C57058k416k181j940j642j034j45M35K34l92o68m49k68m23n59k87K46O47
$$ 357058 354642 352461 350521 348879 347845 347700 348135 348369 347977 347309 346860 346592 346169 345610 345323 345569 346216
61662C46216P25N55L54L95Q08J365J721J827J876J897J812J837K262K783K559
$$ 346216 346941 347496 347850 348245 349053 350418 352139 353966 355842 357739 359551 361388 363650 366433 368992
61647C68992J304j64q18n15J38O97J163J590J909K123K302K347K085J628J331
$$ 368992 370296 370132 369314 368799 368937 369634 370797 372387 374296 376419 378721 381068 383153 384781 386112
61632C86112J259J047L51o94j634k148k226k050j814j609j410j213j218j698k607
$$ 386112 387371 388418 388769 388075 386441 384293 382067 380017 378203 376594 375184 373971 372753 371055 368448
61617C68448l399l456k692j675j099j249j916k621k905k592j963j571j707k088
$$ 368448 365049 361593 358901 357226 356127 354878 352962 350341 347436 344844 342881 341310 339603 337515
61603C37515k278k260k339k545k571k356k271k484k528j997j331j341k094k865
$$ 337515 335237 332977 330638 328093 325522 323166 320895 318411 315883 313886 312555 311214 309120 306255
61589C06255l163l191l184k879k031r36o1M81O81L32n31j212j061m20k00n95r01
$$ 306255 303092 299901 296717 293838 291807 290871 290810 291291 291972 292304 291773 290561 289500 289080 288880 288285 287384
61572B87384o73l02j99j19L09Q57J063R21P05M61K11L46J130K002K069J332O95
$$ 287384 286711 286409 286210 286091 286400 287257 288320 289241 289946 290407 290618 290964 292094 294096 296165 297497 298192
61555B98192O95Q80P54N85Q42J370J749K025K408K490J607L9r58n82N61J283J164
$$ 298192 298887 299767 300521 301106 301948 303318 305067 307092 309500 311990 313597 313636 312678 312096 312657 313940 315104
61538C15104P11M91N64O73O02L02r6l79n05o19o67k79O30J330Q96n21j599j309
$$ 315104 315815 316306 316870 317543 318145 318447 318351 317972 317467 316848 316181 315902 316532 317862 318758 318237 316638 315329
61520C15329j64M17j78j184j527j054m49k56l58l84k63k08k72k00K08P51J065
$$ 315329 315165 315582 315404 314220 312693 311639 311190 310934 310576 310192 309929 309721 309449 309249 309457 310208 311273
61503C11273J092J153J408J555J192L87l60o81n87j83N89J672K662L047K650J764
$$ 311273 312365 313518 314926 316481 317673 318060 317700 317019 316432 316249 316838 318510 321172 324219 326869 328633
61487C28633R29P12J393K596L371L058K036J304J323J623J599J197O49N3m47m88
$$ 328633 329562 330274 331667 334263 337634 340692 342728 344032 345355 346978 348577 349774 350423 350476 350029 349541
61471C49541J8M63K08n36j004r52p98q24q68r41j337j865j735p41J18j66j202
$$ 349541 349559 350022 350230 349694 348690 347738 346940 346116 345248 344307 342970 341105 339370 338629 338747 338581 337379
61454C37379j800j559j056o72j61M89P96O39N93R21R91K76n98o00K63J066J316
$$ 337379 335579 334020 332964 332292 332131 332620 333416 334055 334648 335569 336560 336836 336238 335638 335901 336967 338283
61437C38283J439J837K216K103J524Q23K26j65k06J43O68J112J407J532J421J181
$$ 338283 339722 341559 343775 345878 347402 348225 348451 348286 348080 348223 348891 350003 351410 352942 354363 355544
61421C55544J112J290J363J094Q16R16J063N36n83j222o22N77J065M02o02r65
$$ 355544 356656 357946 359309 360403 361219 362135 363198 363734 363151 361929 361307 361884 362949 363351 362749 361784
61405C61784m93L30R51J025M87l44q57p52m28n44j156j639j459p19J18P91J267
$$ 361784 361291 361621 362572 363597 364084 363740 362883 362131 361703 361159 360003 358364 356905 356186 356304 357095 358362
61388C58362J489J384J068P97O93P69J105J774K573L128L363L581L981M286M130
$$ 358362 359851 361235 362303 363100 363793 364562 365667 367441 370014 373142 376505 380086 384067 388353 392483
61373C92483L584L080K858K758K540K200J938J984K376K801K684J767N90O1M22
$$ 392483 396067 399147 402005 404763 407303 409503 411441 413425 415801 418602 421286 423053 423643 423704 424126
61358D24126R16P64J34j98O0M45O05Q05J292J648J329O05L68Q67J284Q85J54J90
$$ 424126 425042 425806 425940 425742 425802 426247 426852 427657 428949 430597 431926 432531 432899 433766 435050 435935 436089 436279
61340D36279J149J925J612P03M06R98J470R08l06j032q54n04p31j264j255m81
$$ 436279 437428 439353 440965 441668 442074 443072 444542 445450 445144 444112 443258 442754 442023 440759 439504 439023
61324D39023M52J021J397J844K073J637Q25N55J366K888M372N407N956O219O598
$$ 439023 439475 440496 441893 443737 445810 447447 448272 448827 450193 453081 457453 462860 468816 475035 481633
61309D81633P558R079J0542J1390J1767J2187J2779J3152J2944J2139J0886R313
$$ 481633 489191 498270 508812 520202 531969 544156 556935 570087 583031 595170 606056 615369
61297F15369P510N506L304J142m81j380k128l436n087o078o000n720o310p672
$$ 615369 622879 628385 631689 632831 632350 630970 628842 625406 620319 614241 608241 602521 596211 588539
61283E88539q767q933q512q138p919p496o615n406m206l321k897k797k585j843
$$ 588539 579772 570839 562327 554189 546270 538774 532159 526753 522547 519226 516329 513532 510947 509104
61269E09104o60L07N55L82N65J338K113K314K082J845J710J706K163L138L780
$$ 509104 508444 508751 509306 509688 510253 511591 513704 516018 518100 519945 521655 523361 525524 528662 532442
61254E32442L195J848J123J365J396L96q21j084o07n06j104j691j741j383q29
$$ 532442 535637 537485 538608 539973 541369 541765 540944 539860 539253 538747 537643 535952 534211 532828 531999
61239E31999j97P7m85j603k335k126j274k81O22J293J658K062K993M238M922M669
$$ 531999 531802 531879 531394 529791 527456 525330 524056 523775 524397 525690 527348 529410 532403 536641 541563 546232
61223E46232M168M255M909N594O123O744P601Q536R261R491R116Q394P756P333
$$ 546232 550400 554655 559564 565158 571281 578025 585626 594162 603423 612914 622030 630424 638180 645513
61209F45513P008O883P136P358O769N427M458M595N157N227N120N779P106Q029
$$ 645513 652521 659404 666540 673898 680667 686094 690552 695147 700304 705531 710651 716430 723536 731565
61195G31565Q160Q310R213J0489J1246J1022R828P798N282K933J357O40K78n18
$$ 731565 739725 748035 757248 767737 778983 790005 799833 807631 812913 815846 817203 817843 818121 817603
61181H17603k290m739o767p584p682q165r212r942r878r711j0210j1119j1700
$$ 817603 815313 810574 803807 796223 788541 780376 771164 761222 751344 741633 731423 720304 708604
61168G08604j1829j1872j1852j1474j0816j0334j0218j0268j0345j0468j0351
$$ 708604 696775 684903 673051 661577 650761 640427 630209 619941 609596 599128 588777
61157E88777r492p851o063m773m008l429k889k501k274k000j512r40o59r45j674
$$ 588777 579285 571434 565371 560598 556590 553161 550272 547771 545497 543497 541985 541045 540386 539441 537767
61142E37767k369k673k661k594k460k001j250o78o23p76m82N35J917L119L936
$$ 537767 535398 532725 530064 527470 525010 523009 521759 521081 520458 519682 519200 519735 521652 524771 528707
61127E28707M590N494O937Q803J0530J1569J2053J2778J4242J5899J6815J6967
$$ 528707 533297 538791 545728 554531 565061 576630 588683 601461 615703 631602 648417 665384
61115F65384J7369J8658K0154K0766K0412J9921J9706J9310J8315J7016J5907
$$ 665384 682753 701411 721565 742331 762743 782664 802370 821680 839995 857011 872918
61104H72918J5017J4061J2791J0941Q255M986J979j79j796l467n219o767q313
$$ 872918 887935 901996 914787 925728 933983 938969 940948 940769 938973 935506 930287 923520 915207
61091I15207j0329j2631j4370j4974j4635j3766j2608j1461j0668j0090r138p604
$$ 915207 904878 892247 877877 862903 848268 834502 821894 810433 799765 789675 780537 772933
61079G72933o017m835l723k125j70J498K607L545M749O264P918R586J1193J2703
$$ 772933 766916 762081 758358 756233 756063 757561 760168 763713 768462 774726 782644 792230 803423 816126
61065H16126J4168J5682J7233J8744K0182K1586K2963K4235K5265K5950K6367
$$ 816126 830294 845976 863209 881953 902135 923721 946684 970919 996184 1022134 1048501
61054A048501K6781K7352K7868K7958K7605K7101K6497K5500K4068K2665K1626
$$ 1048501 1075282 1102634 1130502 1158460 1186065 1213166 1239663 1265163 1289231 1311896 1333522
61043A333522K0602J9053J7029J5080J3504J2081J0519Q905P679P260P532P811
$$ 1333522 1354124 1373177 1390206 1405286 1418790 1430871 1441390 1450295 1457974 1465234 1472766 1480577
61031A480577P574P316Q012R664J1099J1742J2702J5311J9209K2902K5802K8613
$$ 1480577 1488151 1495467 1503479 1513143 1524242 1535984 1548686 1563997 1583206 1606108 1631910 1660523
61019A660523L1949L5944M1213M9034O0268P5169R4449J19221J49387J83322K19959
$$ 1660523 1692472 1728416 1769629 1818663 1878931 1954100 2048549 2167770 2317157 2500479 2720438
61008B720438K60213L05805L57962M18285M89245N71497O60929P49978Q31365
$$ 2720438 2980651 3286456 3644418 4062703 4551948 5123445 5784374 6534352 7365717
60999G365717Q98342R41559R50080R19298Q56791P75879O81657N66728M24881
$$ 7365717 8264059 9205618 10155698 11074996 11931787 12707666 13389323 13956051 14380932
60990A4380932K67994J23911J4220o3705j30069k01340k81147l70907m79551o14396
$$ 14380932 14648926 14772837 14787057 14723352 14593283 14391943 14110796 13739889 13260338 12645942
60980A2645942p64048q97371r82603j006458r76349r09703q23896p32344o43748
$$ 12645942 11881894 10984523 10001920 8995462 8019113 7109410 6285514 5553170 4909422
60971D909422n62253m88858m23310l64921l12701k65997k25024j90253j61547
$$ 4909422 4347169 3858311 3435001 3070080 2757379 2491382 2266358 2076105 1914558
60962A914558j38217j19412j04014r0800p9381p0371o3953n8846n3519m7971m3320
$$ 1914558 1776341 1656929 1552915 1462115 1382734 1312363 1248410 1189564 1136045 1088074 1044754
60951A044754l9952l7107l4225l1668k9795k8137k5962k3211k0493j8384j7043
$$ 1044754 1004802 967695 933470 901802 872007 843870 817908 794697 774204 755820 738777
60940G38777j6345j6097j6058j5905j5346j4374j3305j2359j1352j0070q774p938
$$ 738777 722432 706335 690277 674372 659026 644652 631347 618988 607636 597566 588792 580854
60928E80854p520p074o572o524p044p446p073n980m586l248k478k782l790m215
$$ 580854 573334 566260 559688 553164 546120 538674 531601 525621 521035 517787 515309 512527 508737 504522
60914E04522l353k056j566j944k431k751l097l275k822j901j109n60L0M94L31
$$ 504522 501169 499113 497547 495603 493172 490421 487324 484049 481227 479326 478217 477657 477687 478181 478512
60899D78512l61r91j473k180k926k952k198j618j890k658l401m240n323o181o350
$$ 478512 478151 477160 475687 473507 470581 467629 465431 463813 461923 459265 455864 451624 446301 440120 433770
60884D33770o100n955n896n570n016m603m425m279m089l964l881l617l023k222
$$ 433770 427670 421715 415819 410249 405233 400630 396205 391926 387837 383873 379992 376375 373352 371130
60870C71130j466r24m79J43J004J818K381K874L428L650L168K465K432L089L545
$$ 371130 369664 368740 368261 368404 369408 371226 373607 376481 379909 383559 386727 389192 391624 394713 398258
60855C98258L351L136L493M039M050L478K738K015J340R97J192J509J294M72m52
$$ 398258 401609 404745 408238 412277 416327 419805 422543 424558 425898 426895 428087 429596 430890 431362 430910
60840D30910j092j443j589j583j668k225l385m823n924o150n355l958k687k075
$$ 430910 429818 428375 426786 425203 423535 421310 417925 413102 407178 401028 395673 391715 389028 386953
60826C86953k226k956l884m440m240l609l283l453l538l129k626k620l033l319
$$ 386953 384727 381771 377887 373447 369207 365598 362315 358862 355324 352195 349569 346949 343916 340597
60812C40597l200k802k296j838j635j720j873k010k334k813k911k277j382r70
$$ 340597 337397 334595 332299 330461 328826 327106 325233 323223 320889 318076 315165 312888 311506 310536
60798C10536j127j372j398j207p18J79J180J751J727J438J283J468K009K620K796
$$ 310536 309409 308037 306639 305432 304714 304893 306073 307824 309551 310989 312272 313740 315749 318369 321165
60783C21165K405K059K385L064L082J958L26o80l90R34K168K119O69r78j614j327
$$ 321165 323570 325629 328014 331078 334160 336118 336444 335764 335374 336308 338476 340595 341264 340286 338672 337345
60767C37345j056j168j254j118j033j026p56l47m34j101j514j088l61j30l11k79
$$ 337345 336289 335121 333867 332749 331716 330690 329934 329587 329153 328052 326538 325450 325089 324959 324648 324369
60751C24369O3K18l1l02k30N0J36j40n02n37k06K9k37p44r71j026j577k742l624
$$ 324369 324432 324650 324619 324317 324087 324137 324273 324133 323631 323094 322888 322917 322680 321936 320965 319939 318362 315620 311996
60732C11996l406k449j711j463j158m80K03N07O25Q90J150R29J58n68o16m1M92
$$ 311996 308590 306141 304430 302967 301809 301329 301532 302039 302664 303554 304704 305633 305791 305223 304607 304566 305058
60715C05058N38L92O00J156J498J265P81O44J140K055K839K923K235J415J205
$$ 305058 305596 305988 306588 307744 309242 310507 311288 311932 313072 315127 317966 320889 323124 324539 325744
60700C25744J545J618R65M7m57m64k61P5N22P00K01q21j791k348k423j927q76
$$ 325744 327289 328907 329872 329919 329462 328998 328737 328812 329334 330034 330235 329414 327623 325275 322852 320925 320049
60683C20049K17O39K74k81m04P1J031K234L150L149K154Q59P6jK29L13J15j21
$$ 320049 320266 320905 321179 320898 320494 320565 321596 323830 326980 330129 332283 333142 333218 333217 333446 333759 333874 333753
60665C33753j02R1r4r50j846j801p87R2l0p42j104q98n73k86K30R44J426J587
$$ 333753 333651 333742 333648 332698 330852 329051 328264 328356 328326 327584 326480 325582 325009 324723 324953 325897 327323 328910
60647C28910J917K653L164K629J123l12p14r6O06L90r51k630l524l126j938r35
$$ 328910 330827 333480 336644 339273 340396 340084 339370 339274 339880 340270 339319 336689 333165 330039 328101 327166
60631C27166p29j129j415j022o0P74Q58K22n42q27m63K44O99M78j64m10J61Q54
$$ 327166 326437 325308 323893 322871 322811 323585 324443 324665 324123 323296 322833 323077 323776 324254 324090 323680 323841 324695
60613C24695O42m60j342j242n51L9M47Q00P64M7p81p22L68J645K286K156J496
$$ 324695 325337 324877 323535 322293 321742 321781 322228 323028 323792 323839 323058 322336 322704 324349 326635 328791 330287
60596C30287O29O5K80J175K102K584K644K398J803R84L51J72L15N35P21Q31Q85
$$ 330287 330916 330981 331261 332436 334538 337122 339766 342164 343967 344951 345302 345474 345789 346324 347045 347876 348761
60579C48761J051J349J357P71J36L89J623L021M085N031N786N690M729M052M455
$$ 348761 349812 351161 352518 353289 353425 353814 355437 358458 362543 367574 373360 379050 383779 387831 392286
60564C92286N208N238M730M474M279L331J774O27K27p8o59j126j226j240j250
$$ 392286 397494 402732 407462 411936 416215 419546 421320 421947 422174 422096 421437 420311 419085 417845 416595
60549D16595r52m01k8K95J203K578L461L628M189N839P542P939P352P280Q314
$$ 416595 415643 415242 415214 415509 416712 419290 422751 426379 430568 436407 443949 451888 459240 466520 474834
60534D74834R610J0258J0170R617Q752P753O807N749M155J981k81k180l606m464
$$ 474834 484444 494702 504872 514489 523241 530994 537801 543550 547705 549686 549405 547225 543619 539155
60520E39155m509l782k927k696l189l794l852l277k451j672q99r7M97P34R79J835
$$ 539155 534646 530864 527937 525241 522052 518258 514406 511129 508678 507006 506107 506010 506507 507241 508220 510055
60504E10055L439N464P692J0098J2349J3887J4764J5813J7602J9708K1398K2471
$$ 510055 513494 518958 526650 536748 549097 562984 577748 593561 611163 630871 652269 674740
60492F74740K2992K2798K1879K0783J9834J8321J5374J1451P999N583L255Rm005
$$ 674740 697732 720530 742409 763192 783026 801347 816721 828172 836171 841754 845009 845018 841013
60479H41013q094j2008j5734j8897k1163k2970k5064k7331k8622k8042k6016k3784
$$ 841013 832919 820911 805177 786280 765117 742147 717083 689752 661130 633088 607072 583288
60467E83288k2040k0431j8475j6517j5301j4718j3698j1667r466q150p361n917
$$ 583288 561248 540817 522342 505825 490524 475806 462108 450441 440975 432825 425464 419547
60455D19547l874k758l368m412m180k817j890k157k851l131l062k923k538j843
$$ 419547 415673 412915 409547 405135 400955 398138 396248 394091 391240 388109 385047 382124 379586 377743
60441C77743j424j749k329k317j665j058q83q80q20q70j097j188r27m95r8L33
$$ 377743 376319 374570 372241 369924 368259 367201 366318 365438 364618 363748 362651 361463 360536 360041 359943 360276
60425C60276P83R42O64L11K08J40j62k84L65J481J981J377L66j58r4J73N40J108
$$ 360276 361059 362001 362665 362976 363184 363324 363162 362878 363243 364724 366705 368082 368448 368290 368196 368369 368909 370017
60407C70017J702K027K139K296K437K272J855J598J607J510J055N63M59O75Q41
$$ 370017 371719 373746 375885 378181 380618 382890 384745 386343 387950 389460 390515 391078 391537 392212 393053
60392C93053R05J144J551J689J344J008J305K099K688K898L331M227M686L725
$$ 393053 393958 395102 396653 398342 399686 400694 401999 404098 406786 409684 413015 417242 421928 425653
60378D25653J832O29Q81J671J774J179O82N91N51M70P37J464K111K174J870J845
$$ 425653 427485 428114 428995 430666 432440 433619 434301 434892 435443 435913 436650 438114 440225 442399 444269 446114
60362D46114K323K886L043K767K429K273K202K109K188K687L453L998M050L732
$$ 446114 448437 451323 454366 457133 459562 461835 464037 466146 468334 471021 474474 478472 482522 486254
60348D86254L258K768K472K500K469J707J33j522k663l491m372n042n055m571
$$ 486254 489512 492280 494752 497252 499721 501428 501561 500039 497376 493885 489513 484471 479416 474845
60334D74845m066l546k774j993j650j593j365j244j979l349m034l336k137j519
$$ 474845 470779 467233 464459 462466 460816 459223 457858 456614 454635 451286 447252 443916 441779 440260
60320D40260j251m74O87J234Q66N06J054K316L403L853M026M647O050P710Q555
$$ 440260 439009 438535 439222 440456 441322 441828 442882 445198 448601 452454 456480 461127 467177 474887 483442
60305D83442P946O425N213M862M766M063K759J597J034O93n4j303k617l633m398
$$ 483442 491388 497813 503026 507888 512654 516717 519476 521073 522107 522800 522746 521443 518826 515193 510795
60290E10795n111n728o024n878n354m604l815l240l043l105l050k641k030j688
$$ 510795 505684 499956 493932 488054 482700 478096 474281 471041 467998 464893 461843 459202 457172 455484
60276D55484k037l062m179m634m168l273k600k262j938j541j346j423j391j005
$$ 455484 453447 450385 446206 441572 437404 434131 431531 429269 427331 425790 424444 423021 421630 420625
60262D20625o22p79j399j877j898j845k176k667k566j531j26Q04J113J369J884
$$ 420625 420003 419224 417825 415948 414050 412205 410029 407362 404796 403265 403139 403943 405056 406425 408309
60247D08309K203J815R97M67L69K20j59k74J75O70N45k1k33K94J136J634J511
$$ 408309 410512 412327 413324 413791 414160 414380 414221 413947 414122 414792 415337 415316 415083 415377 416513 418147 419658
60230D19658R55M10L70J030K103L106L820M310M566M502M258M174M356M556M643
$$ 419658 420613 421023 421393 422423 424526 427632 431452 435762 440328 444830 449088 453262 457618 462174 466817
60215D66817M910N686O779P610P802P485P099P041P412P915Q006P414O494N906
$$ 466817 471727 477413 484192 491802 499604 507089 514188 521229 528641 536556 544562 551976 558470 564376
60201E64376N894O042N831N230M620M218L858L301K613K050J601Q63m70k041l017
$$ 564376 570270 576312 582143 587373 591993 596211 600069 603370 605983 608033 609634 610497 610027 607986 604969
60186F04969l036k754l137m293n400n838n895o066o160n617m539l749l760m167
$$ 604969 601933 599179 596042 591749 586349 580511 574616 568550 562390 556773 552234 548485 544725 540558
60172E40558m263l898l449l192l058k882k697k727l033l230k706j446l89n14j608
$$ 540558 536295 532397 528948 525756 522698 519816 517119 514392 511359 508129 505423 503977 503588 503074 501466
60157E01466k517k609k327k102j551l30R43J370J052P94Q38P85O49R71J779K360
$$ 501466 498949 496340 494013 491911 490360 490030 490973 492343 493395 494189 495027 495812 496461 497432 499211 501571
60141E01571K393K503L190L979M212M097M192M342L983L334L315M160M891M632
$$ 501571 503964 506467 509657 513636 517848 521945 526137 530479 534462 537796 541111 545271 550162 554794
60127E54794L798L424L709L877L485L118L527M515N157M881L910K720J649J073
$$ 554794 558592 562016 565725 569602 573087 576205 579732 584247 589404 594285 598195 600915 602564 603637
60113F03637J334K176K719K411J658J108O98N2n57m88O3J0j195k803l787m010
$$ 603637 604971 607147 609866 612277 613935 615043 615741 615793 615236 614748 614811 614821 613626 610823 607036 603026
60097F03026l929l690l145k458k043j994k000j784j281n31K54N87J46p24j311
$$ 603026 599097 595407 592262 589804 587761 585767 583767 581983 580702 580171 580425 581012 581158 580434 579123
60082E79123j408j505k019k728l159l227l197l223l301l602m463n831o971p094
$$ 579123 577715 576210 574191 571463 568304 565077 561880 558657 555356 551754 547291 541460 534489 527395
60068E27395o243n232m708m570m468m396m478m455l992l324l058l234l228k653
$$ 527395 521152 515920 511212 506642 502174 497778 493300 488845 484853 481529 478471 475237 472009 469356
60054D69356j878j345q97k15N29R64J213J748K668L595M267M749N035M835M036
$$ 469356 467478 466133 465236 465021 465550 466514 467727 469475 472143 475738 480005 484754 489789 494624 498660
60039D98660L095K704L082L709L852L330K627K157J587K75j614k955k929k090
$$ 498660 501755 504459 507541 511250 515102 518432 521059 523216 524803 525078 523464 520509 517580 515490
60025E15490j755k562m012n270n923o033n888n868o144o449o399o064n870n853
$$ 515490 513735 511173 507161 501891 495968 489935 484047 478179 472035 465586 459187 453123 447253 441400
60011D41400n466m392l159k589k825l227l188k671j935j114l35N9j88p04o45L97
$$ 441400 435934 431542 428383 425794 422969 419742 416554 413883 411948 410834 410499 410558 410370 409666 409021 409418
59995D09418J781K426J947J018N97J019J898K650L014L136L276L400L143K290
$$ 409418 411199 413625 415572 416590 417187 418206 420104 422754 425768 428904 432180 435580 438723 441013
59981D41013J226O24O59Q28N94m7p94j432j866k054k197k666l450l913l523k590
$$ 441013 442239 442863 443522 444350 444944 444897 444103 442671 440805 438751 436554 433888 430438 426525 423002 420412
59965D20412j851j516j203p98o88r89j041j70J338K495K763K548K498K663K611
$$ 420412 418561 417045 415842 415044 414356 413367 412326 412156 413494 415989 418752 421300 423798 426461 429072
59950D29072K099J298M17m33r30n48P51K074K353J471K34o92j235j372q65J28
$$ 429072 431171 432469 432886 432453 431523 430975 431726 433800 436153 437624 437858 437166 435931 434559 433694 433822
59934D33822P83N86J83O36J985L139L288K866K889L690M601M779M104L155K484
$$ 433822 434605 435191 435374 436010 437995 441134 444422 447288 450177 453867 458468 463247 467351 470506 472990
59919D72990K115J806J482J146N41n14j528j623n94P98J754K115J943J178J27
$$ 472990 475105 476911 478393 479539 480080 479566 478038 476415 475821 476619 478373 480488 482431 483609 483736
59904D83736l62R7P56P81N12Q26J596J837J254O30N59P36P98R88J517K010K127
$$ 483736 483374 483471 484227 485008 485520 486346 487942 489779 491033 491663 492222 492958 493756 494744 496261 498271 500398
59887E00398K208K691L328L556L458L654M339M923M798M158L818M295N207N641
$$ 500398 502606 505297 508625 512181 515639 519293 523632 528555 533353 537511 541329 545624 550831 556472
59873E56472N115L955K798J962J487J395J502J209O4j472k340k052j163n07m54
$$ 556472 561587 565542 568340 570302 571789 573184 574686 575895 575959 574487 572147 570095 568932 568425 567971
59858E67971r17j618k103j879q38O45K062L016L234K719J967J560J476J206O00
$$ 567971 567054 565436 563333 561454 560616 561261 563323 566339 569573 572292 574259 575819 577295 578501 579101
59843E79101J01L5J56J05j92p46j599k499k917k668k096j532j076j068j941l318
$$ 579101 579202 579237 579393 579498 579306 578560 576961 574462 571545 568877 566781 565249 564173 563105 561164 557846
59827E57846l954l172j716o42MO41J034O42k18o47m73m27r70j741k287k597k743
$$ 557846 553892 550720 549004 548362 548366 549007 550041 550683 550465 549818 549345 548918 547948 546207 543920 541323 538580
59810E38580k615k263j965j795j533j163j012j245j615j892k122k364k551k726
$$ 538580 535965 533702 531737 529942 528409 527246 526234 524989 523374 521482 519360 516996 514445 511719
59796E11719l059l435l408k800k042j701j848k121k221k176k185k264k088j346
$$ 511719 508660 505225 501817 499017 496975 495274 493426 491305 489084 486908 484723 482459 480371 479025
59782D79025l52N3m79j174j037j47N96Q81J282K073K619K351J675J321J377J549
$$ 479025 478673 478726 478247 477073 476036 475889 476485 477366 478648 480721 483340 485691 487366 488687 490064 491613
59766D91613J900K647L480L799L572L401L700M275M757N014N128N272N655O300
$$ 491613 493513 496160 499640 503439 507011 510412 514112 518387 523144 528158 533286 538558 544213 550513
59752E50513O862O956O620O224N921N601N221M851M335L456K448J866J756J511
$$ 550513 557375 564331 570951 577175 583096 588697 593918 598769 603104 606560 609008 610874 612630 614141
59738F14141R19P35J621K816K751J005j064j953j623j091r32q53n59k07Q8N29
$$ 614141 615060 615795 617416 620232 622983 623988 622924 620971 619348 618257 617325 616472 615913 615706 615794 616323
59722F16323J090J229O42q8j58L65O55K85l54p26o84k08O83J523J564P75J21L52
$$ 616323 617413 618642 619284 619196 619038 619403 620058 620343 619989 619263 618579 618371 619054 620577 622141 622916 623037 623389
59704F23389R31Q87L35K99J182K257K794K879K903K864K631K333K108J808J317
$$ 623389 624320 625207 625542 625841 627023 629280 632074 634953 637856 640720 643351 645684 647792 649600 650917
59689F50917Q19M47Nn41p41l07J98j03j277k484l008k947k869l212l983m786n094
$$ 650917 651736 652183 652188 651647 650906 650599 650797 650694 649417 646933 643925 640978 638109 634897 630914 626128 621034
59672F21034m782m358m373m751m965m754m240l463k369j239n31k24K33J119K125
$$ 621034 616252 611894 607521 602770 597805 593051 588811 585348 582979 581740 581209 580985 581218 582337 584462
59657E84462L023L994M972N300M598L552L173L460L506K836K010J686J605R24
$$ 584462 587485 591479 596451 601751 606349 609901 613074 616534 620040 622876 624886 626572 628177 629101
59643F29101o66k561l952m684n228n915o503o633o423o317o445o510o256n694
$$ 629101 628435 625874 621922 617238 612010 606095 599592 592959 586536 580219 573774 567264 561008 555314
59629E55314m894l995l398l424l762l776l553l925n190o477o863o464n881n140
$$ 555314 550420 546425 543027 539603 535841 532065 528512 524587 519397 512920 506057 499593 493712 488572
59615D88572m016k901k469k636k678k250j604r50l92l10r33j599j385m83K3j07
$$ 488572 484556 481655 479186 476550 473872 471622 470018 469068 468676 468366 467433 465834 464449 463966 463989 463882
59599D63882O3R30J489R30O9J73J030J340P19R1J50M11J78l98o98o00n26p44j076
$$ 463882 463945 464875 466364 467294 467363 467536 468566 469906 470625 470716 470866 471277 471455 471057 470359 469759 469233 468489 467413
59580D67413j251j336j585k036k412k409k021j489j068r20j072j379j554j477
$$ 467413 466162 464826 463241 461205 458793 456384 454363 452874 451806 450886 449814 448435 446881 445404
59566D45404j315j191r04l18K14K31j12k79k40m73j020j218p09l0K79N41J316
$$ 445404 444089 442898 441994 441676 441890 442121 442009 441730 441490 441017 439997 438779 438070 438040 438319 438860 440176
59549D40176K380L005L063L122L516L979M339M994O413Q415J0235J1203J1249
$$ 440176 442556 445561 448624 451746 455262 459241 463580 468574 474987 483402 493637 504840 516089
59536E16089J0786J0216R577Q724P677O534N074K873Pk612l997l987l238k467
$$ 516089 526875 537091 546668 555392 563069 569603 574677 577550 577557 574945 570948 566961 563723 561256
59522E61256j922j433p65l1J62p95k715m572n516n624n465n271m976m761m915
$$ 561256 559334 557901 557136 557105 557267 556472 553757 549185 543669 538045 532580 527309 522333 517572 512657
59507E12657n248n184m586m029m051m425m463l880l127k800k890k847k370j808
$$ 512657 507409 502225 497639 493610 489559 485134 480671 476791 473664 470864 467974 465127 462757 460949
59493D60949j529j214l70O90J124Q74Q95J651K320K135J810K622M491N955O002
$$ 460949 459420 458206 457836 458526 459650 460524 461419 463070 465390 467525 469335 471957 476448 482403 488405
59478D88405M981L756K776K257K379K938L312L141K678K273J956J687J592J631
$$ 488405 493386 497142 499918 502175 504554 507492 510804 513945 516623 518896 520852 522539 524131 525762
59464E25762J487J072P84R63J417J823K214K747L222L355L325L611M283M871M993
$$ 525762 527249 528321 529105 530068 531485 533308 535522 538269 541491 544846 548171 551782 556065 560936 565929
59449E65929M795M578M313L723K739J586M30p41j867k693l134l541m205m738m414
$$ 565929 570724 575302 579615 583338 586077 587663 588093 587352 585485 582792 579658 576117 571912 567174 562760
59434E62760l233k126j807j870j469m93M25R30J343K037K991M093N453P101Q743
$$ 562760 559527 557401 555594 553724 552255 551762 552187 553117 554460 556497 559488 563581 569034 576135 584878
59419E84878J0044J1048J2070J3305J4607J5649J6182J6199J5916J5491J4796
$$ 584878 594922 605970 618040 631345 645952 661601 677783 693982 709898 725389 740185
59408G40185J3484J1299Q342N066J992n98k660l951l870k133L92K131K292J475
$$ 740185 753669 764968 773310 778376 780368 779770 777110 773159 769289 767156 767548 769679 771971 773446
59394G73446N61n04k355n113q191j0912j2773j3416j2914j1896j0867r590p788
$$ 773446 774007 773503 771148 766035 757844 746932 734159 720743 707829 695933 685066 675476 667688
59381F67688o102n560o106o518n862m397k883j743j074q18o38j82K69L5q62j424
$$ 667688 661586 656026 649920 643402 637540 633143 630260 628517 627443 626625 625987 625805 626074 626109 625247 623823
59365F23823r04K51J119J451J668K069K665L469M521N656O663P522Q316R113J0056
$$ 623823 622919 623170 624289 625740 627408 629477 632142 635611 640132 645788 652451 659973 668289 677402 687458
59350F87458J1313J2657J3466J3389J2836J2444J2327J2101J1446J0391R242Q390
$$ 687458 698771 711428 724894 738283 751119 763563 775890 787991 799437 809828 819070 827460
59338H27460P956P397N879L280M86j682l416n390p618r467j0628j1405j2070j2538
$$ 827460 835416 842813 848692 851972 852458 850776 847360 841970 834352 824885 814257 802852 790782 778244
59324G78244j2768j2981j3219j3150j2560j1771j1248j0976j0541r702q640p659
$$ 778244 765476 752495 739276 726126 713566 701795 690547 679571 669030 659328 650688 643029
59312F43029o864o201n595m949m135l141k194j556j164p10q8L52K14l75q62r42
$$ 643029 636165 629964 624369 619420 615285 612144 609950 608394 607230 606520 606432 606784 606998 606623 605761 604819
59296F04819j018j881l899o491q465q993q287p188o164n066l784k621j719o60
$$ 604819 603801 601920 598021 591530 583065 574072 565785 558597 552433 547367 543583 540962 539243 538583
59282E38583Q78K492L568M174M860N787O674P471Q401R362R960J0154J0265J0347
$$ 538583 539461 541953 545521 549695 554555 560342 567016 574487 582888 592250 602210 612364 622629 632976
59268F32976J0171R845R730R691R224Q388P775P313O062L717J379J87j41o43j578
$$ 632976 643147 652992 662722 672413 681637 690025 697800 705113 711175 714892 716271 716458 716317 715674 714096
59253G14096k415k921l329l594l350k635j981j658j356p29J82J148J984K549K735
$$ 714096 711681 708760 705431 701837 698487 695852 693871 692213 690857 690128 690310 691458 693442 695991 698726
59238F98726K541K036J339P41N49N71L6j505l466m824n251n243n263n388n760
$$ 698726 701267 703303 704642 705383 705932 706503 706539 705034 701568 696744 691493 686250 680987 675599 669839
59223F69839o698q102r234r495r107q709q430p823o740n773n539n717n368m170
$$ 669839 663141 655039 645805 636310 627203 618494 610064 602241 595501 589728 584189 578472 573104 568934
59209E68934k888k324k194j618m43O20J118J439K000K487K341J649J148J464K592
$$ 568934 566046 563722 561528 559910 559467 560087 561205 562644 564644 567131 569472 571121 572269 573733 576325
59194E76325L911M636M464L905L802M368M991N009M302L175K087J569J879K506
$$ 576325 580236 584872 589336 593241 597043 601411 606402 611411 615713 618888 620975 622544 624423 626929
59180F26929K574J882J083O29K71j62k15L61R17O74k27j079j611k024k345k409
$$ 626929 629503 631385 632468 633097 633368 633206 632991 633352 634269 634943 634716 633637 632026 630002 627657 625248
59164F25248k278k152k020j877j977k461k987l254l541m224n080n588n689n655
$$ 625248 622970 620818 618798 616921 614944 612483 609496 606242 602701 598477 593397 587809 582120 576465
59150E76465n499n068m549m361m703n508o487o933o099m331l163l486m294m142
$$ 576465 570966 565898 561349 556988 552285 546777 540290 533357 527258 522927 519764 516278 511984 507842
59136E07842l226k801l012k776j728p48l73l8O19R48M81l9L73J667L105M348N518
$$ 507842 504616 501815 498803 496027 494299 493551 493178 493140 493759 494707 495188 495149 495522 497189 500294 504642 510160
59119E10160O682P794Q904R925J0456J0227R416Q347P231O393O226O535O487N620
$$ 510160 516842 524636 533540 543465 553921 564148 573564 581911 589142 595535 601761 608296 614783 620403
59105F20403M506L918L755L318K399J453Q71N31J43m34j211k168l171m002m466
$$ 620403 624909 628827 632582 635900 638299 639752 640623 641154 641297 640863 639652 637484 634313 630311 625845
59090F25845m438l869k898j906j328j354j811k308k545k575k715l089l387l286
$$ 625845 621407 617538 614640 612734 611406 610052 608241 605933 603388 600813 598098 595009 591622 588336
59076E88336l031l242m125n129n576n359m874m437m004l447k884k566k437k152
$$ 588336 585305 582063 577938 572809 567233 561874 557000 552563 548559 545112 542228 539662 537225 535073
59062E35073j622j296j572k186k644l045l765m393l912k257p63n54j211j687j749
$$ 535073 533451 532155 530583 528397 525753 522708 518943 514550 510638 508381 507618 507064 505853 504166 502417
59047E02417j750j660j275q88p82n58J54P55N36O7L77J149J097J18m50R7R30J229
$$ 502417 500667 499007 497732 496844 496062 495504 495658 496413 496949 497016 497393 498542 499639 499757 499307 499404 500334 501563
59029E01563J317J695K163K574L418M853O058O299N979N969O437O999P347P268
$$ 501563 502880 504575 506738 509312 512730 517583 523641 529940 535919 541888 548325 555324 562671 569939
59015E69939O582N501M503L522K010J95p21k02P19Q81M65J55k02r60j428n93J208
$$ 569939 576521 582022 586525 590047 592057 592252 591531 591329 592048 592929 593394 593549 593347 592387 590959 590366 591574
58998E91574K536K662K124J592J228J158J628K420K858K622K005J294N16r9m0
$$ 591574 594110 596772 598896 600488 601716 602874 604502 606922 609780 612402 614407 615701 616217 616118 616078
58983F16078P95J755K074J607Q71O08J350L070N178O972Q185R002R680J0324J0953
$$ 616078 616873 618628 620702 622309 623180 623788 625138 628208 633386 640358 648543 657545 667225 677549 688502
58968F88502J1524J1965J2313J2624J2684J2076J0764R365Q462P866O868N151
$$ 688502 700026 711991 724304 736928 749612 761688 772452 781817 790279 798145 805013 810164
58956H10164L168J621P24p1j652m310p251r342j0325j0952j1795j2538j2621j2112
$$ 810164 813332 814953 815677 815606 813954 809644 802393 793051 782726 771774 759979 747441 734820 722708
58942G22708j1471j0925j0415r877r197q245p242o733o811o828o189n054l884
$$ 722708 711237 700312 689897 680020 670823 662578 655336 648603 641792 634964 628775 623721 619837
58929F19837k799j821j250j201j150n34M35J096J244J145R45N87J56j60l29l10
$$ 619837 617038 615217 613967 612766 611616 611082 611517 612613 613857 615002 615947 616534 616690 616530 616201 615891
58913F15891J04Q56J403J391J286J798K939M096M831N142N246N532O377P598Q523
$$ 615891 615995 616851 618254 619645 620931 622729 625668 629764 634595 639737 644983 650515 656892 664490 673013
58898F73013Q953R536J0578J1212J0652R653R633J0728J1881J2636J3501J4554
$$ 673013 681966 691502 702080 713292 723944 733597 743230 753958 765839 778475 791976 806530
58886H06530J4991J4470J3764J3500J3179J2087J0468R096Q067O768M829K597
$$ 806530 821521 835991 849755 863255 876434 888521 898989 908085 916152 922920 927749 930346
58874I30346O35r43k501m325o062p000o997o809p130p648p598o929o325o172o268
$$ 930346 930981 930038 927537 923212 917150 910150 903153 896344 889214 881566 873968 867039 860714 854542 848274
58859H48274o499p033p799q452r030r912j0944j1295j0574r512r084r397r825
$$ 848274 841775 834742 826943 818491 809461 799549 788605 777310 766736 757224 748140 738743 728918
58846G28918r880r552r018q437p924p540p287p190p228p261p207p233p515p858
$$ 728918 719038 709486 700468 692031 684107 676567 669280 662090 654862 647601 640394 633161 625646 617788
58832F17788p869p443o712n671m286k952k309k451k741k528j662l02J368L068
$$ 617788 609919 602476 595764 590093 585807 582855 580546 578095 575354 572826 571164 570862 572230 575298
58818E75298M457N409N984O127N759N147M750M594M193L318K411K021K028J716
$$ 575298 579755 585164 591148 597275 603034 608181 612931 617525 621718 625036 627447 629468 631496 633212
58804F33212N29j252k606k709j947j657k572l888m371m018l878m423n026n083
$$ 633212 633741 632489 629883 627174 625227 623570 620998 617110 612739 608721 604843 600420 595394 590311
58790E90311m839m731m685m380l734k780j560m08J79K77O50J712K845L204K814
$$ 590311 585472 580741 576056 571676 567942 565162 563602 563194 563373 563650 564300 566012 568857 572061 574875
58775E74875K419K417K458K015J019j30j051j844k970m604o131o672o054n016
$$ 574875 577294 579711 582169 584184 585203 585073 584022 582178 579208 574604 568473 561801 555747 550731
58761E50731m330m099l969l667l204k753k479k334k014j310n27j48k27l64l36
$$ 550731 546401 542302 538333 534666 531462 528709 526230 523896 521882 520572 520045 519897 519670 519306 518970
58746E18970k81k69n5N50J438K424L439M419N250N884O282O332O051N751N647
$$ 518970 518689 518420 518365 518915 520353 522777 526216 530635 535885 541769 548051 554383 560434 566185 571832
58731E71832N489M981M408M242M331M103L504L028K842K557K010J551J442J652
$$ 571832 577321 582302 586710 590952 595283 599386 602890 605918 608760 611317 613327 614878 616320 617972
58717F17972K369L892N750O758O387N463M966M803M243L073J654J94j445l344
$$ 617972 620341 624233 629983 636741 643128 648591 653557 658360 662603 665676 667330 667524 666079 662735
58703F62735n346p202q690r815j0930j2291j3430j3508j2553j1676j1715j2185
$$ 662735 657389 650187 641497 631682 620752 608461 595031 581523 568970 557294 545579 533394
58691E33394j2018j0923r488q248p208o125m892l755l245l637m363m448l740l190
$$ 533394 521376 510453 500965 492717 485509 479384 474492 470737 467492 463855 459492 455044 451304 448114
58677D48114l511m154m128l316k329j345L8J835L268L621L158K854L301M097M413
$$ 448114 444603 440449 436321 433005 430676 429331 429369 431204 434472 438093 441251 444105 447406 451503 455916
58662D55916M121L985M601N438N456M396K894J386l00k157l671m615n471o506
$$ 455916 460037 464022 468623 474061 479517 483913 486807 488193 487893 485736 482065 477450 471979 465473
58648D65473p091o531n136l813k888j994r71k50k20o43q40l60N27J053P93K22
$$ 465473 458382 451851 446715 442902 440014 438020 437049 436799 436579 435936 435096 434736 435263 436316 437109 437331
58632D37331J39O87J279J492J451J282P93k7p37r33p05l28K7K17K15M60J516L153
$$ 437331 437470 438157 439436 440928 442379 443661 444454 444427 443690 442757 442052 441724 441751 441968 442183 442643 444159 447312
58614D47312M316M323L563K764K216J957K109K557K842K790K729K753K408J496
$$ 447312 451628 455951 459514 462278 464494 466451 468560 471117 473959 476749 479478 482231 484639 486135
58600D86135N64J22%k8K78J038J751K009K140K511K864L027L563M882O219O498
$$ 486135 486699 486821 486821 486793 487071 488109 489860 491869 494009 496520 499384 502411 505974 510856 517075 523573
58584E23573N870N509O100P279Q364Q924Q819Q354Q159Q442Q640Q386Q288R000
$$ 523573 529443 534952 541052 548331 556695 565619 574438 582792 590951 599393 608033 616419 624707 633707
58570F33707J0084J0702J1059J2032J3631J5003J5923J7145J9032K0897K2049
$$ 633707 643791 654493 665552 677584 691215 706218 722141 739286 758318 779215 801264
58559H01264K2653K3062K2901K1440J8567J4966J1466Q390N521K602j83k381l938
$$ 801264 823917 846979 869880 891320 909887 924853 936319 944709 950230 952832 952649 950268 946330
58546I46330n266o571p524p958q341r139j0208j1287j2651j4592j6678j8175j8940
$$ 946330 941064 934493 926969 919011 910670 901531 891323 880036 867385 852793 836115 817940 799000
58533G99000j9282j9247j8701j7795j6725j5343j3678j2367j1828j1386j0080
$$ 799000 779718 760471 741770 723975 707250 691907 678229 665862 654034 642648 632568
58522F32568q128o593n868n437m976m666m429l949l448l452l670l134j748o53
$$ 632568 624440 617847 611979 606542 601566 596900 592471 588522 585074 581622 577952 574818 573070 572417
58508E72417o69j201j263q32o21r87j581j784j224j21P35P51L03L21J090K036
$$ 572417 571748 570547 569284 568452 567831 566844 565263 563479 562255 562134 562869 563620 563923 564244 565334 567370
58492E67370K710L235L659L694L479L798M965O151O537O650P729R955J2183J3408
$$ 567370 570080 573315 576974 580668 584147 587945 592910 599061 605598 612248 619977 629932 642115 655523
58478F55523J3833J4102J4202J3663J2546J1450J0541R191O986M454K268J66k541
$$ 655523 669356 683458 697660 711323 723869 735319 745860 755051 762037 766491 768759 768925 766384
58465G66384n520p456p639o713n612m548l370k118p22J205L715O210Q221R807
$$ 766384 760864 753408 745769 739056 733444 728896 725526 723408 722686 723891 727606 733816 742037 751844
58451G51844J0877J0882R737Q235O791M685J385k209m856o630q348r971j0796
$$ 751844 762721 773603 783340 791575 798366 803051 804436 802227 797371 790741 782393 772422 761626
58438G61626j0846j0745j0421r167o983m738k943j361J63J361K084K417K439K445
$$ 761626 750780 740035 729614 720447 713464 708726 705783 704422 704585 705946 708030 710447 712886 715331
58424G15331L189M901O463O544N313M043L195K084K74j835l815n481o394o199
$$ 715331 718520 723421 729884 736428 741741 745784 748979 751063 751337 749502 745687 740206 733812 727613
58410G27613n534n520o222o643o299n711n281m776m077l414k722j693o10r8K6
$$ 727613 722079 716559 710337 703694 697395 691684 686403 681627 677550 674136 671414 669721 669111 669013 669039
58395F69039N85J623K294K247K032J969J809J762K533L944M736M326L679L849
$$ 669039 669624 671247 673541 675788 677820 679789 681598 683360 685893 689837 694573 698899 702578 706427
58381G06427M589N060N019M724M339M057M199M765N342N731O139O602O881P035
$$ 706427 711016 716076 721095 725819 730158 734215 738414 743179 748521 754252 760391 766993 773874 780909
58367G80909P438Q113Q723R223R826J0314J0294J0040J0271J1041J1688J1803
$$ 780909 788347 796460 805183 814406 824232 834546 844840 854880 865151 876192 887880 899683
58355H99683J1335J0027P788N539M405M201L837L122K737K635K055J232J446L013
$$ 899683 911018 921045 928833 934372 938777 942978 946815 949937 952674 955309 957364 958596 960042 963055
58341I63055M813O168P661R577J1139J1911J2619J3848J5096J5716J5672J4983
$$ 963055 967868 974036 981697 991274 1002413 1014324 1026943 1040791 1055887 1071603 1087275 1102258
58329A102258J3595J2162J1675J1926J1708J0788J0209J0266R899Q659P563P266
$$ 1102258 1115853 1128015 1139690 1151616 1163324 1174112 1184321 1194587 1204486 1213145 1220708 1227974
58317A227974O950N892M654L886L379L040L380M278M703M450M611N664O648O991
$$ 1227974 1234924 1240816 1245470 1249356 1252735 1255775 1259155 1263433 1268136 1272586 1277197 1282861 1289509 1296500
58303A296500P429Q256Q460P721P446Q489R468Q938P761P782R271J1150J2778
$$ 1296500 1303929 1312185 1320645 1328366 1335812 1344301 1353769 1362707 1370468 1378250 1387521 1398671 1411449
58290A411449J4171J5366J6679J8744K1437K3654K4969K6356K8628L1478L4711
$$ 1411449 1425620 1440986 1457665 1476409 1497846 1521500 1546469 1572825 1601453 1632931 1667642
58279A667642L8872M3716M7823N0760N4153N9294O5167O9894P2833P4186P4071
$$ 1667642 1706514 1750230 1798053 1848813 1902966 1962260 2027427 2097321 2170154 2244340 2318411
58268B318411P3020P1956P0713O8118O4366O1549O0930O1564O2539O4489O7717
$$ 2318411 2391431 2463387 2534100 2602218 2666584 2728133 2789063 2850627 2913166 2977655 3045372
58257C045372P1077P3983P7374Q1216Q3443Q2959Q1490Q0843Q0454P9375P8332
$$ 3045372 3116449 3190432 3267806 3349022 3432465 3515424 3596914 3677757 3758211 3837586 3915918
58246C915918P8015P7634P7047P7999Q1244Q4754Q6954Q9652R5841J06825J23256
$$ 3915918 3993933 4071567 4148614 4226613 4307857 4392611 4479565 4569217 4665058 4771883 4895139
58235D895139J46268J75040K05630K34435K60774K84508L04240L19978L34368
$$ 4895139 5041407 5216447 5422077 5656512 5917286 6201794 6506034 6826012 7160380
58226G160380L48568L59959L66586L70944L77078L87513M05754M37666M86554
$$ 7160380 7508948 7868907 8235493 8606437 8983515 9371028 9776782 10214448 10701002
58217A0701002N49714O22915P05000P95508Q91942R92203J095065J195111J283331
$$ 10701002 11250716 11873631 12578631 13374139 14266081 15258284 16353349 17548460 18831791
58208A8831791J358346J434091J533938J682993J908909K242119K708809L327924
$$ 18831791 20190137 21624228 23158166 24841159 26750068 28992187 31700996 35028920
58200C5028920M115753N081563O212347P473849Q837857J0304745J1899128J3655443
$$ 35028920 39144673 44226236 50438583 57912432 66750289 77055034 88954162 102609605
58192A02609605J5598836J7695290J9789652K1614944K2890682K3394661K2931358
$$ 102609605 118208441 135903731 155693383 177308327 200199009 223593670 246525028
58185B46525028K1312607J8477696J4620305J0073705N018343n94900o724626
$$ 246525028 267837635 286315331 300935636 311009341 316027684 315432784 308708158
58178C08708158j2882231j8210064k1957665k3870880k4176211k3314207k1727391
$$ 308708158 295825927 277615863 255658198 231787318 207611107 184296900 162569509
58171A62569509j9786662j7763541j5807853j3967350j2244574j0638063r151601
$$ 162569509 142782847 125019306 109211453 95244103 82999529 72361466 63209865
58164F3209865p796191o590671n548762m664328l917407l292063k780336k373077
$$ 63209865 55413674 48823003 43274241 38609913 34692506 31400443 28620107 26247030
58156B6247030k057042j818889j643533j510236j398182j295668j199252j106796
$$ 26247030 24189988 22371099 20727566 19217330 17819148 16523480 15324228 14217432
58148A4217432j016953r32169q55202p83850p14094o46614n85467n32400m87124
$$ 14217432 13200479 12268310 11413108 10629258 9915164 9268550 8683083 8150683 7663559
58139G663559m50700m23540m01641l79541l55631l30739l03622k72403k38935
$$ 7663559 7212859 6789319 6387678 6008137 5652506 5321767 5018145 4745742 4506807
58130D506807k07427j80016j57379j41798j35061j34351j34312j32539j29641
$$ 4506807 4299380 4119364 3961985 3820187 3685126 3550775 3416463 3283924 3154283
58121C154283j25207j17672j07520r6956q6838p6780o7566o0351n4366m8427m3944
$$ 3154283 3029076 2911404 2803884 2706928 2620090 2543310 2475744 2415393 2361027 2312600 2268656
58110B268656m3291m5788m8369m9730n0948n2468n3442n3903n4915n6545n7919
$$ 2268656 2225365 2179577 2131208 2081478 2030530 1978062 1924620 1870717 1815802 1759257 1701338
58099A701338n9075o0601o1777o1088n8316n4271m8998m2228l5006k8878k3973
$$ 1701338 1642263 1581662 1519885 1458797 1400481 1346210 1297212 1254984 1219978 1191100 1167127
58088A167127j9610j6162j4452j4030j3877j3925j4187j3450j0955q348p758q783
$$ 1167127 1147517 1131355 1116903 1102873 1088996 1075071 1060884 1047434 1036479 1028131 1020373 1011590
58076A011590r655j0394j2286j4991j6832j7599j8526j9716j9947j8997j7924
$$ 1011590 1001935 991541 979255 964264 947432 929833 911307 891591 871644 852647 834723
58065H34723j7101j5936j4436j3190j2014j0481r356r577j0268r898q920q994
$$ 834723 817622 801686 787250 774060 762046 751565 742209 732632 722364 712466 703546 694552
58053F94552j0004j0230r358q767q863q556p625p243p649p558o429n389n278n569
$$ 694552 684548 674318 664960 656193 647330 638774 631149 623906 616257 608699 602270 596881 591603 586034
58039E86034n749o065o490o556o606p540r046r712r183q538q287p790o978o738
$$ 586034 580285 574220 567730 561174 554568 547028 537982 528270 519087 510549 502262 494472 487494 480756
58025D80756p063o718n407m494m851n632n944o072o263n881m766l976m134m334
$$ 480756 473693 466975 461568 457074 452223 446591 440647 434575 428312 422431 417665 413689 409555 405221
58011D05221l687k782k509k607k420k251k785l816m453m170l026j368J17O88K82
$$ 405221 401534 398752 396243 393636 391216 388965 386180 382364 377911 373741 370715 369347 369464 370152 370434
57996C70434m46j115j910k719k886k262j675j836k487k969l059k854k527k381
$$ 370434 369988 368873 366963 364244 361358 359096 357421 355585 353098 350129 347070 344216 341689 339308
57982C39308k595k728k219j394j160j633j993j774j380j110p48l39l45p36r08
$$ 339308 336713 333985 331766 330372 329212 327579 325586 323812 322432 321322 320574 320235 319890 319154 318246
57967C18246p94j016j616j727r77j59m7m23q08j183j555j631j439j495j885k065
$$ 318246 317452 316436 314820 313093 312116 311957 311910 311487 310679 309496 307941 306310 304871 303376 301491 299426
57951B99426j876j833j997j616m92L52J21n60o22j7N80R00J189J646K248K817
$$ 299426 297550 295717 293720 292104 291612 291964 292085 291525 290903 290886 291466 292366 293555 295201 297449 300266
57935C00266K977K559K152K532L431L841L639L683M002L306J075j244k122k061
$$ 300266 303243 305802 307954 310486 313917 317758 321397 325080 329082 332388 333463 332219 330097 328036
57921C28036k619m108n398n602m899m014l588l832m277m197l604l306l653m121
$$ 328036 325417 321309 315911 310309 305410 301396 297808 293976 289699 285502 281898 278592 274939 270818
57907B70818m424n013n814n635l845j678p23q86r46m69Q2N70J175J541J133L63
$$ 270818 266394 261381 255567 249932 246087 244409 243686 242800 241854 241385 241467 242037 243212 244753 245886 246249
57891B46249J52O06J120J614K581L889M733M856M837M946M593L279J450L3m25
$$ 246249 246401 247007 248127 249741 252322 256211 260944 265800 270637 275583 280176 283455 284905 284938 284513
57876B84513p5M48N00N1l03k14j05l77n73j45M14J28q89j524j304r63j119j347
$$ 284513 284438 284886 285386 285437 285134 284920 284815 284438 283865 283720 284134 284262 283373 281849 280545 279582 278463 277116
57858B77116j009j80O22J154J429J495J564J935K460K499J839J159J246J965K506
$$ 277116 276107 275927 276549 277703 279132 280627 282191 284126 286586 289085 290924 292083 293329 295294 297800
57843B97800K377J776J157Q47R90J430J639J142J75l97m6P56J128Q53N05N43P46
$$ 297800 300177 301953 303110 303957 304947 306377 308016 309158 309333 308936 308890 309646 310774 311627 312132 312675 313421
57826C13421P52O63P46Q27N24n9m17l99l77o62j233k064l208m379n101n355n625
$$ 313421 314173 314836 315582 316409 316933 316874 316457 316058 315681 315019 313786 311722 308514 304135 299034 293679 288054
57809B88054o043o140n713n325n497n889n821n204m480l959l705l744l902l700
$$ 288054 282011 275871 270158 264833 259336 253447 247626 242422 237942 233983 230278 226534 222632 218932
57795B18932k832j623o13%K10p7o24o74J85J198J238L58k42K40J336K172K542
$$ 218932 216100 214477 213864 213864 214074 213997 213373 212699 212884 214082 215320 215678 215436 215676 217012 219184 221726
57778B21726K817L247L804M440N052N280M755L646K730K567K784K513J603Q44
$$ 221726 224543 227790 231594 236034 241086 246366 251121 254767 257497 260064 262848 265361 266964 267808
57764B67808P22O04k60j381j616r13m01o50r33n61J74Q30J623K649L296L206L114
$$ 267808 268530 269134 268874 267493 265877 264964 264563 263913 262980 262419 262593 263423 265046 267695 270991 274197 277311
57747B77311L712M424M316L600L103K732J765M55n6N19J117Q26j26j108j824k029
$$ 277311 281023 285447 289763 293363 296466 299198 300963 301418 301362 301881 302998 303824 303698 302590 300766 298737
57731B98737j436l81J40l43j111j241p17j63Q5J54K01K53L10L61M08N23P10O84
$$ 298737 297301 296920 297060 296717 295606 294365 293648 293485 293570 293724 293925 294178 294488 294849 295257 295780 296490 297174
57713B97174J76m93o10k0N82N07p0m11j42M28P10M18j92n49l59J19M19L57m5q60
$$ 297174 297350 296857 296247 296227 296809 297316 297246 296835 296693 297121 297831 298249 298057 297508 297149 297268 297687 298044 297999 297139
57693B97139k002k888k958k567k660l440l951l380k183j463j496j456m94J307
$$ 297139 295137 292249 289291 286724 284064 280624 276673 273293 271110 269647 268151 266695 266201 267508
57679B67508L183M663O160Q507J1944J5740J9022K1839K5131K9565L4730L9425
$$ 267508 270691 275354 281514 290021 301965 317705 336727 358566 383697 413262 447992 487417
57667D87417M2506M3368M1952L8513L3262K6231J7461P242l976j5593k6546l5273
$$ 487417 529923 573291 615243 653756 687018 713249 730710 737952 733976 718383 691837 656564
57655F56564m0575m2507m2026l9874l6353l2013k7791k4147k0745j7321j4330
$$ 656564 615989 573482 531456 491582 455229 423216 395425 371278 350533 333212 318882
57644C18882j2225j0591q639o301m328l275k873k478j764q23P4O08M69l52j316
$$ 318882 306657 296066 287427 281126 276798 273523 270650 268172 266408 265585 265659 266267 266736 266384 265068
57629B65068j689j314q42r08j297j346j114j437k597l619l446k357j548j584k049
$$ 265068 263379 262065 261223 260315 259018 257672 256558 255121 252524 248905 245459 243102 241554 239970 237921
57614B37921k534l093l583l393k273q82j60l65j012j450j378j016r40j454k146
$$ 237921 235387 232294 228711 225318 223045 222163 222003 221638 220626 219176 217798 216782 215842 214388 212242
57599B12242k327j964j683j812k013j975k008k520l338l961m109l756k901j745
$$ 212242 209915 207951 206268 204456 202443 200468 198460 195940 192602 188641 184532 180776 177875 176130
57585A76130q23n78q63j233j553k050k771l301l114k121q73k06n37j471k259k594
$$ 176130 175307 174729 173866 172633 171080 169030 166259 162958 159844 157723 156850 156644 156107 154636 152377 149783
57569A49783k802l226l790m117l891l000j711o72l90n78m27L13R89R45L77m3m
$$ 149783 146981 143755 139965 135848 131957 128957 127246 126574 126184 125606 125179 125492 126481 127426 127803 127760 127756
57552A27756L46Q55J391J621J229M22j13J84J184K112K108R95m12r62k99Q53J562
$$ 127756 128102 128957 130348 131969 133198 133620 133507 133691 134875 136987 139095 140090 139678 138716 138417 139270 140832
57535A40832J536J071N29J53O1J15l5m67q54r65r70r16l71R00K222K643K196J850
$$ 140832 142368 143439 143968 144121 144182 144297 144262 143795 142941 141976 141006 140090 139719 140619 142841 145484 147680 149530
57517A49530K168K665K705K397K194K062J649J034P42R30J097P82K21j01k83r21
$$ 149530 151698 154363 157068 159465 161659 163721 165370 166404 167146 168076 169173 169955 170176 170075 169792 168871
57501A68871k167l357l745l353k771k412k261k158j954j523r29m96l51j33L79
$$ 168871 166704 163347 159602 156249 153478 151066 148805 146647 144693 143170 142241 141745 141394 141261 141640
57486A41640N95k24j630k227j451l79k84j077j747j844j691j549j321j081j173
$$ 141640 142235 142011 140381 138154 136703 136324 136040 134963 133216 131372 129681 128132 126811 125730 124557
57471A24557j627k033k130k112k152k007j339k50O98R26L23o32j252j228q28m43
$$ 124557 122930 120897 118767 116655 114503 112496 111157 110907 111605 112531 112854 112222 110970 109742 108914 108471
57455A08471p9M55J048J263Q66J29m01l30L25J091J377J064P10Q99J454J676J331
$$ 108471 108392 108847 109895 111158 112024 112153 111752 111422 111747 112838 114215 115279 115989 116888 118342 120018 121349
57438A21349R30Q78Q34L17m00n53oN79P19P91J284J850J715Q79K29L18O34M37
$$ 121349 122279 123157 123991 124308 123908 123355 123349 123928 124647 125438 126722 128572 130287 131166 131395 131713 132347 132784
57420A32784j87n53l55R1M28N96O57O78P59Q49O89L13L09J042J776J356j49j295
$$ 132784 132597 132044 131689 131780 132208 132804 133461 134139 134898 135747 136436 136749 137058 138100 139876 141232 141083 139788
57402A39788j054l7M90K43o3N7K70M2o21j172j079l57M22P49P53R21J335J675
$$ 139788 138734 138697 139187 139430 139367 139424 139694 139736 139115 137943 136864 136507 136929 137678 138431 139352 140687 142362
57384A42362J931K474L262L596L053K084J346R48P58R00J337J531J149P27Q91
$$ 142362 144293 146767 150029 153625 156678 158762 160108 161056 161814 162714 164051 165582 166731 167458 168349
57369A68349J296J092K07o61j168j560j780j258J16J521K119J904J405R87Q23
$$ 168349 169645 170737 170944 170283 169115 167555 165775 164517 164633 166154 168273 170177 171582 172569 173392
57354A73392J094J764K420K684K678K813L184L470L403L079K755K449J939J249
$$ 173392 174486 176250 178670 181354 184032 186845 190029 193499 196902 199981 202736 205185 207124 208373
57340B08373R34J510K589K997K095O00k22L2P15J074R27N17K05L23R14J579J898
$$ 208373 209307 210817 213406 216403 218498 219098 218876 218908 219623 220697 221624 222141 222346 222669 223583 225162 227060
57323B27060J925J919J757J178N00M94J334K252K498K191J969K149K545K866K976
$$ 227060 228985 230904 232661 233839 234339 234833 236167 238419 240917 243108 245077 247226 249771 252637 255613
57308B55613K929K946L233L709M051M156M294M654M984M898M413L929L738L777
$$ 255613 258542 261488 264721 268430 272481 276637 280931 285585 290569 295467 299880 303809 307547 311324
57294C11324L859M006M385M953N345N278N012N117N675O081N825N239N104N651
$$ 311324 315183 319189 323574 328527 333872 339150 344162 349279 354954 361035 366860 372099 377203 382854
57280C82854O331O492O046N460N270N545N744N296M484M315N254O480O966O857
$$ 382854 389185 395677 401723 407183 412453 417998 423742 429038 433522 437837 443091 449571 456537 463394
57266D63394P055P747Q171P849P248P036P393Q192R188R807R525Q697Q455R361
$$ 463394 470449 478196 486367 494216 501464 508500 515893 524085 533273 543080 552605 561302 569757 579118
57252E79118J0727J1606J1876J1984J2149J2355J2666J3039J3148J2873J2599
$$ 579118 589845 601451 613327 625311 637460 649815 662481 675520 688668 701541 714140
57241G14140J2706J3108J3681J4637J5958J7043J7482J7800J8627J9552J9660
$$ 714140 726846 739954 753635 768272 784230 801273 818755 836555 855182 874734 894394
57230H94394J9019J8697J9256K0109K0561K0633K0633K0627K0771K1442K2610
$$ 894394 913413 932110 951366 971475 992036 1012669 1033302 1053929 1074700 1096142 1118752
57219A118752K3561K3874K4140K5104K6397K6944K6550K6251K6891K7998K8516
$$ 1118752 1142313 1166187 1190327 1215431 1241828 1268772 1295322 1321573 1348464 1376462 1404978
57208A404978K8236K7968K8447K9538L0562L1068L1181L1396L2178L3537L4914
$$ 1404978 1433214 1461182 1489629 1519167 1549729 1580797 1611978 1643374 1675552 1709089 1744003
57197A744003L5636L5612L5386L5393L5502L5424L5288L5418L5728L5960L6391
$$ 1744003 1779639 1815251 1850637 1886030 1921532 1956956 1992244 2027662 2063390 2099350 2135741
57186B135741L7737M0108M2688M4718M6479M8810N1976N5460N8691O1443O3566
$$ 2135741 2173478 2213586 2256274 2300992 2347471 2396281 2448257 2503717 2562408 2623851 2687417
57175B687417O4786O4985O4364O3236O1861O0535N9530N8725N7490N5271N2301
$$ 2687417 2752203 2817188 2881552 2944788 3006649 3067184 3126714 3185439 3242929 3298200 3350501
57164C350501M9540M7800M7048M6612M6082M5827M6605M8673N1480N4228N6585
$$ 3350501 3400041 3447841 3494889 3541501 3587583 3633410 3680015 3728688 3780168 3834396 3890981
57153C890981N8693O0599O1983O2487O2059O0744N8272N4195M8431M1519L4166
$$ 3890981 3949674 4010273 4072256 4134743 4196802 4257546 4315818 4370013 4418444 4459963 4494129
57142D494129K6788J9717J3723R874Q791J0283J3897J9683K8188L9872N4625P1566
$$ 4494129 4520917 4540634 4554357 4564231 4573022 4583305 4597202 4616885 4645073 4684945 4739570 4811136
57130D811136Q8933J04272J15294J20861J21195J17282J10358J01895R3456Q6071
$$ 4811136 4900069 5004341 5119635 5240496 5361691 5478973 5589331 5691226 5784682 5870753
57120E870753P9913P4937P1898P2277P7071Q5662R5883J04839J09536J07126R5212
$$ 5870753 5950666 6025603 6097501 6169778 6246849 6332511 6428394 6533233 6642769 6749895 6845107
57109F845107P2185L6956j1623p4388j50095k33729l16774l89144m41199m64829
$$ 6845107 6917292 6954248 6942625 6868237 6718142 6484413 6167639 5778495 5337296 4872467
57099D872467m54095m05764l19523j98071m7439J23008L01778M77338O40184P84804
$$ 4872467 4418372 4012608 3693085 3495014 3447575 3570583 3872361 4349699 4989883 5774687
57089E774687R11329J025356J136173J257692J413360J634408J937659K290191
$$ 5774687 6686016 7711372 8847545 10105237 11518597 13153005 15090664 17380855
57081A7380855K595225K728221K608020K249025J751935J242117Q04334M56486
$$ 17380855 19976080 22704301 25312321 27561346 29313281 30555398 31359732 31816218
57073C1816218J67970j02266l77286o56252r24757j166983j371201j530062j640509
$$ 31816218 31984188 31881922 31504636 30848384 29923627 28756644 27385443 25855381 24214872
57064B4214872j704104j725799j711058j663726j586137j480758j351759j205433
$$ 24214872 22510768 20784969 19073911 17410185 15824048 14343290 12991531 11786098
57056A1786098j049094q89498p32630n84993m54200l47188k67551k14586j84415
$$ 11786098 10737004 9847506 9114876 8529883 8075683 7728495 7460944 7246358 7061943
57047G061943j71702j71074j78136j89844k04005k18758k32646k44543k52934
$$ 7061943 6890241 6719167 6541031 6351187 6147182 5928424 5695778 5451235 5198301
57038E198301k55731k51658k41676k28511k14788k01965j90533j80165j69525
$$ 5198301 4942570 4690912 4449236 4220725 4005937 3803972 3613439 3433274 3263749
57029C263749j56847j41240j23187j03823q4303o6112n1311m1626l7136l5965
$$ 3263749 3106902 2965662 2842475 2738652 2654349 2588237 2536926 2495300 2458164 2422199
57019B422199l5433l3730l0803k7833k5857k5028k4938k5158k5217k4557k3154
$$ 2422199 2386766 2353036 2322233 2294400 2268543 2243515 2218577 2193419 2168202 2143645 2120491
57008B120491k2021k2541k5257k9623l4801m0260m5648n0424n3773n4811n3150
$$ 2120491 2098470 2075929 2050672 2021049 1986248 1945988 1900340 1849916 1796143 1741332 1688182
56997A688182m9467m5246m1513l8169l4835l1921l0058k8878k7294k5037k2949
$$ 1688182 1638715 1593469 1551956 1513787 1478952 1447031 1416973 1388095 1360801 1335764 1312815
56986A312815k1597k0461j8922j7348j6569j6773j7513j8604k0410k3165k6316
$$ 1312815 1291218 1270757 1251835 1234487 1217918 1201145 1183632 1165028 1144618 1121453 1095137
56975A095137k8725k9642k9483k9418k9974l0312k9289k6970k4460k2374k0254
$$ 1095137 1066412 1036770 1007287 977869 947895 917583 888294 861324 836864 814490 794236
56964G94236j7574j4557j1649q882o144l552j200R97K759L378K650J406M74m95
$$ 794236 776662 762105 750456 741574 735430 731878 730678 731675 734434 737812 740462 741868 742342 741847
56950G41847k466n611r010j1688j3267j3780j3420j2510j1259r562p384n175l373
$$ 741847 739381 733770 724760 713072 699805 686025 672605 660095 648836 639274 631890 626715 623342
56937F23342j651O54L519O181Q118R376R839R104P289N209L314J066k068n683
$$ 623342 621691 622345 625864 632045 640163 649539 659378 668482 675771 680980 684294 685360 683292 677609
56923F77609r128j2473j5980j8979k0297j9776j8518j7485j6594j5345j3663j1824
$$ 677609 668481 656008 640028 621049 600752 580976 562458 544973 528379 513034 499371 487547
56911D87547j0094q707p788p117o346n635n479n760n657m832m023l896l946l265
$$ 487547 477453 468746 460958 453841 447495 441860 436381 430621 424964 420132 416109 412213 408267 405002
56897D05002j982j045q51p82j22J282L136M881N805N648N126N268O201P060P065
$$ 405002 403020 401975 401124 400342 400220 401502 404638 409519 415324 420972 426098 431366 437567 444627 451692
56882D51692O095M328K038k16j895l158m547n911o340n347l416j228R35K856M307
$$ 451692 457787 462115 464153 463937 462042 458884 454337 448426 442086 436739 433323 432095 433030 435886 440193
56867D40193N642P627J0303J2764J4519J6217J8383K0282K0796J9821J8036J5795
$$ 440193 445835 453462 463765 476529 491048 507265 525648 545930 566726 586547 604583 620378
56855F20378J2994R590N525N82m961r963j3348j5047j5424j4365j1721q093m294
$$ 620378 633372 642962 648487 649069 644108 634145 620797 605750 590326 575961 564240 556147 551853
56842E51853l79L870Q020J1613J5292K0035K5346K9467L1463L1970L1681L0104
$$ 551853 551474 555344 563364 574977 590269 610304 635650 665117 696580 728550 760231 790335
56830G90335K6412K0631J3544N804k414j1089j9791k7307l2178l3945l3514l1805
$$ 790335 816747 837378 850922 856726 854312 843223 823432 796125 763947 730002 696488 664683
56818F64683k8676k3877j8417j3693r671n207J7N109R460J3210J6203J7856J8303
$$ 664683 636007 612130 593713 580020 570349 565142 565159 570268 579728 592938 609141 626997 645300
56805F45300J8223J7254J4108Q710K688l005r283j6704k3550k7545k8547k8038
$$ 645300 663523 680777 694885 703595 706283 703278 693995 677291 653741 626196 597649 569611
56793E69611k6737k4290k0819j7282j4246j1393q335n074j701J589M271N988P173
$$ 569611 542874 518584 497765 480483 466237 454844 446509 441435 439734 441323 445594 451582 458755
56780D58755Q437R551R619Q231N749K546j385n928j0553j4576j7466j8973j9251
$$ 458755 467192 476743 486362 494593 500342 502888 501503 495575 485022 470446 452980 434007 414756
56767D14756j8787j7975j6944j5844j4912j4004j2624j0764r132q144p308o151
$$ 414756 395969 377994 361050 345206 330294 316290 303666 292902 283770 275626 268318 262167
56755B62167n030m419l996l331k843l046l391l008k256k214k774k618j278P8L44
$$ 262167 257137 252718 248722 245391 242548 239502 236111 233103 230847 228633 225859 223241 221963 222041 222385
56740B22385j20m10m42o74j016r11k30N27Q33N82L0m79o98o31m97n18p54j043
$$ 222385 222265 221855 221413 220739 219723 218812 218582 219109 219942 220524 220554 220075 219377 218746 218249 217731 216977 215934
56722B15934j014m09M36P27J71m98m30J85M59J50p9L28J153J869K159J859J043
$$ 215934 214920 214511 214947 215674 215845 215347 214917 215102 215561 215711 215632 215960 217113 218982 221141 223000 224043
56705B24043L10L96J218J830J674J276J371J776J708R17l4n26n07l25k44k67k66
$$ 224043 224353 224749 225967 227797 229471 230747 232118 233894 235602 236519 236485 235959 235452 235127 234883 234616 234350
56688B34350k37l15m99m81O2R81J740J954J708J290Q31L28j83n46n49q9N88R38
$$ 234350 234113 233798 233299 232818 232880 233861 235601 237555 239263 240553 241384 241712 241529 240983 240434 240345 240933 241871
56670B41871O00j76p78q68o30m27n01q59j220j125l75N92J052O88k44j297k071
$$ 241871 242471 242295 241517 240649 240019 239592 239091 238232 237012 235887 235512 236104 237156 237844 237600 236303 234232
56653B34232k197j524l91N77J058J135R02L08n22j119j055l25O65J381J428Q81
$$ 234232 232035 230511 230120 230697 231755 232890 233792 234100 233578 232459 231404 231079 231744 233125 234553 235434
56637B35434L04K37N58N99n9j076j697j498p48j78k92r01j385j464j468j736k104
$$ 235434 235738 235975 236533 237132 237073 235997 234300 232802 232054 231876 231584 230683 229298 227834 226366 224630 222526
56620B22526k167j805j151m23lk99j065j338n64N85J144J077R05N32m63j599j795
$$ 222526 220359 218554 217403 216980 216977 216678 215613 214275 213711 214296 215440 216517 217422 217954 217491 215892 214097
56603B14097r24qL78P71J489J795J103Q8k18J81N33N02K51j62p31j083q62k96
$$ 214097 213173 213165 213543 214314 215803 217598 218701 218789 218571 218752 219285 219787 220038 219876 219145 218062 217200 216904
56585B16904J58M61P56Q03L81k9K32R60J312J050P73Q81J101J214J450J816J737
$$ 216904 217062 217523 218279 219082 219463 219434 219666 220626 221938 222988 223761 224642 225743 226957 228407 230223 231960
56568B31960R46K18O31K313M398O045P021P408P315P026O999P433P992Q118P507
$$ 231960 232906 233124 233755 236068 240466 246511 253532 260940 268255 275281 282280 289713 297705 305823 313330
56553C13330O245M607K830J088m74j688k378k523k428k580l110l537l217k132
$$ 313330 319575 324182 327012 328100 327626 325938 323560 321037 318609 316029 312919 309382 306165 304033
56539C04033j049q21j566k594l095k800k129j719j863k314k740l123l580l839
$$ 304033 302984 302163 300597 298003 294908 292108 289979 288260 286397 284083 281343 278220 274640 270801
56525B70801l364k102p93k06k76l08L1L30M1q30j776k383k687k927l127l066k625
$$ 270801 267437 265335 264542 264336 264060 263752 263783 264113 264154 263324 261548 259165 256478 253551 250424 247358 244733
56508B44733j961j260n54j5n3p25j221p28L06N42m18j409j377p84o41q37n00M45
$$ 244733 242772 241512 240958 240943 240890 240165 238944 238216 238522 239064 238646 237237 235860 235076 234435 233598 233098 233543
56490B33543J100R60M60J25%M3L42P37Q82Q11R14J104Q16k5o59n22l5P1k82o46
$$ 233543 234643 235603 236063 236188 236188 236231 236573 237310 238192 239003 239917 241021 241837 241812 241153 240631 240596 240667 240385 239739
56470B39739p02m00K21Q99J130O53j63p46r00p32l34J40L45R5k64j78M79J318
$$ 239739 239037 238637 238858 239757 240887 241540 241377 240631 239731 238999 238665 238805 239150 239245 238981 238803 239282 240600
56452B40600J866J862J307N14j7pL02M53L08J38K35N85R75J189J091N86l35j397
$$ 240600 242466 244328 245635 246149 246132 246125 246427 246880 247188 247326 247561 248146 249121 250310 251401 251987 251652 250255
56434B50255j957j455j05J050J120L07m16m63j03J53J70R6M1P5K78O36R67J107
$$ 250255 248298 246843 246738 247788 248908 249215 248799 248336 248233 248386 248556 248652 248693 248768 249046 249682 250649 251756
56416B51756J032P95N18L60L45K40j04m43m16j13P2N2J37M45O69O07N11O45Q35
$$ 251756 252788 253583 254101 254461 254806 255046 254942 254499 254083 253970 254042 254094 254231 254676 255345 255952 256463 257108 257943
56397B57943P15L21J69P28J826K626K366J233K36M8L09L47K00L02N41L79j04j21
$$ 257943 258658 258979 259148 259876 261702 264328 266694 267927 268163 268211 268520 268867 269067 269369 269910 270289 270185 270064
56379B70064P10J804K399K365J987J490J076J022J364J667J415N39m74r42n76
$$ 270064 270774 272578 274977 277342 279329 280819 281895 282917 284281 285948 287363 287902 287428 286486 285910
56364B85910Q5L9j001k036j845m48J001J672J758J805J982K154K156J902J561
$$ 285910 285995 286034 285033 282997 281152 280704 281705 283377 285135 286940 288922 291076 293232 295134 296695
56349B96695J481J618J341M04l46m3P85R14L57K97J195K160K478K504K628K524
$$ 296695 298176 299794 301135 301539 301193 301150 301935 302849 303206 303503 304698 306858 309336 311840 314468 316992
56333C16992J954J408J370J755K391L192L650L206K422K587L740M370L640K547
$$ 316992 318946 320354 321724 323479 325870 329062 332712 335918 338340 340927 344667 349037 352677 355224
56319C55224K124J925J332R99J632K436K271J435R69Q86O65P76K039L816M500
$$ 355224 357348 359273 360605 361604 363236 365672 367943 369378 370347 371233 371898 372674 374713 378529 383029
56304C83029L724K676K247K210K366L017M015M471L949L066K572K525K713L190
$$ 383029 386753 389429 391676 393886 396252 399269 403284 407755 411704 414770 417342 419867 422580 425770
56290D25770M029M994N724O021N959O009O750Q068R030R094Q937R369R927R635
$$ 425770 429799 434793 440517 446538 452497 458506 465256 473324 482354 491448 500385 509754 519681 529316
56276E29316Q864R133J0927J2982J4059J4408J4866J5504J5892J6160J6905J8252
$$ 529316 538180 547313 558240 571222 585281 599689 614555 630059 645951 662111 679016 697268
56264F97268J9671K0883K2462K5214K9097L3108L6404L9392M3255M8581N4871
$$ 697268 716939 737822 760284 785498 814595 847703 884107 923499 966754 1015335 1070206
56253A070206O1467O8357P5871Q4154R3202J02842J12448J21189J28893J36036
$$ 1070206 1131673 1200030 1275901 1360055 1453257 1556099 1668547 1789736 1918629 2054665
56243B054665J42577J47548J50283J51206J50740J48246J42718J33890J21841
$$ 2054665 2197242 2344790 2495073 2646279 2797019 2945265 3087983 3221873 3343714
56234C343714J06301Q7354O6255M4466K2289o48k3882m6160o6683q5318j01777
$$ 3343714 3450015 3537369 3603624 3648090 3670379 3669731 3645849 3599689 3533006 3447688 3345911
56223C345911j15535j26418j34517j39679j41796j41412j39325j35855j31078
$$ 3345911 3230376 3103958 2969441 2829762 2687966 2546554 2407229 2271374 2140296
56214B140296j25284j18634j10913j02429r4472q7897q1952p5528o8933o3185
$$ 2140296 2015012 1896378 1785465 1683036 1588564 1500667 1418715 1343187 1274254 1211069
56204A211069n8181n3041m7815m3340l9640l5975l2414k9753k7887k5686k2740
$$ 1211069 1152888 1099847 1052032 1008692 969052 933077 900663 870910 843023 817337 794597
56193G94597j9843j7585j5693j4023j2945j2392j1595j0215q767p712o912o173
$$ 794597 774754 757169 741476 727453 714508 702116 690521 680306 671539 663827 656915 650742
56181F50742n518m794l849l054k843k873k505j889j548j229m07M12K99l36j20
$$ 650742 645224 640430 636581 633527 630684 627811 625306 623417 621869 620640 620233 620645 620944 620608 620488
56166F20488J137K285K892L800N274O279O236O070O756Q045R210J0089J0786J1365
$$ 620488 621625 623910 626802 630602 635876 642155 648391 654461 661217 669262 678472 688561 699347 710712
56152G10712J2226J3852J5891J7557J9054K1485K5074K8838L2267L5969M0309
$$ 710712 722938 736790 752681 770238 789292 810777 835851 864689 896956 932925 973234
56141I73234M4809M9291N4169N9078O2656O4345O5015O5153O3893O0643N6301
$$ 973234 1018043 1067334 1121503 1180581 1243237 1307582 1372597 1437750 1501643 1562286 1618587
56130A618587N1855M7075M1627L6308L1975K8173K3894J8942J3625P852J438n282
$$ 1618587 1670442 1717517 1759144 1795452 1827427 1855600 1879494 1898436 1912061 1919913 1921351 1916069
56118A916069j1868j8305k4593l0460l5942m1449m6827n1213n4299n6812n9206
$$ 1916069 1904201 1885896 1861303 1830843 1794901 1753452 1706625 1655412 1601113 1544301 1485095
56107A485095o0740o0441n8164n4324m9376m3965l8708l3493k7838k2130j7381
$$ 1485095 1424355 1363914 1305750 1251426 1202050 1158085 1119377 1085884 1058046 1035916 1018535
56096A018535j3647j0008o368l824k787k232j372o83n56l80L76J338K291L734
$$ 1018535 1004888 994880 988512 984688 981901 979669 978297 977614 977058 976678 977054 978392 980683 984417
56082I84417N727P453Q568R654J0772J0999J0149R425R615J0074J0271J0746J1627
$$ 984417 990144 997597 1006165 1015819 1026591 1037590 1047739 1057164 1066779 1076853 1087124 1097870 1109497
56069A109497J1901J1172J0676J1305J2182J2261J1939J1895J1773J1164J0556
$$ 1109497 1121398 1132570 1143246 1154551 1166733 1178994 1190933 1202828 1214601 1225765 1236321
56058A236321J0154R127P199N629N456O072O681P706R584J1560J2939J4232J5916
$$ 1236321 1246475 1255602 1262801 1268430 1273886 1279958 1286639 1294345 1303929 1315489 1328428 1342660 1358576
56045A358576J7429J8471J9860K2141K4790K7795L2185L7896M3072M6767N0418
$$ 1358576 1376005 1394476 1414336 1436477 1461267 1489062 1521247 1559143 1602215 1648982 1699400
56034A699400N5188N9881O3032O4949O6027O5116O1629N7425N4487N2398N0013
$$ 1699400 1754588 1814469 1877501 1942450 2008477 2073593 2135222 2192647 2247134 2299532 2349545
56023B349545M7928M7217M7368M7579M8631N1504N5580N9949O4809O9943P3692
$$ 2349545 2397473 2444690 2492058 2539637 2588268 2639772 2695352 2755301 2820110 2890053 2963745
56012B963745P5325P6533P8639Q0472Q0875Q1080Q2430Q4053Q5047Q6646Q9777
$$ 2963745 3039070 3115603 3194242 3274714 3355589 3436669 3519099 3603152 3688199 3774845 3864622
56001C864622R2802R4225R5403R8325J03481J12271J28251J52574J81112K09310
$$ 3864622 3957424 4051649 4147052 4245377 4348858 4461129 4589380 4741954 4923066 5132376
55991E132376K36943K64703K89627L08311L21796L32835L40899L44313L44840
$$ 5132376 5369319 5634022 5923649 6231960 6553756 6886591 7227490 7571803 7916643
55982G916643L45671L47732L52792L67556L99178M48397N11555N87137O75758
$$ 7916643 8262314 8610046 8962838 9330394 9729572 10177969 10689524 11276661 11952419
55973A1952419P76418Q87527J008557J135789J260274J376685J492597J625046
$$ 11952419 12728837 13616364 14624921 15760710 17020984 18397669 19890266 21515312
55965B1515312J792399K014881K317803K726782L262518L943177M782343N775753
$$ 21515312 23307711 25322592 27640395 30367177 33629695 37572872 42355215 48130968
55957D8130968O898397Q126639R460412J0920429J2534247J4323609J6268528
$$ 48130968 55029365 63156004 72616416 83536845 96071092 110394701 126663229
55950A26663229J8249943K0042708K1394780K2099283K1968315K0796474J8458602
$$ 126663229 144913172 164955880 186350660 208449943 230418258 251214732 269673334
55943B69673334J5059174J0882199O130365P98195n081934j1087744j6416793
$$ 269673334 284732508 295614707 301745072 302543267 297461333 286373589 269956796
55936B69956796k0307715k2445191k2995805k2366997k0986276j9216179j7326979
$$ 269956796 249649081 227203890 204208085 181841088 160854812 141638633 124311654
55929A24311654j5475409j3719191j2069283j0530080r107334p809172o650306
$$ 124311654 108836245 95117054 83047771 72517691 63410357 55601185 48950879
55922D8950879n644222m788052m063598l452868k944400k526846k187253j916342
$$ 48950879 43306657 38518605 34455007 31002139 28057739 25530893 23343640 21427298
55914B1427298j706791j545473j414217j298845j192366j090793r92141q98781
$$ 21427298 19720507 18175034 16760817 15461972 14269606 13178813 12186672 11287891
55906A1287891q14431p38394o67113o00353n41214m91128m49547m17157l94383
$$ 11287891 10473460 9735066 9067953 8467600 7926386 7435258 6985711 6568554 6174171
55897F174171l77418l60421l41234l20954k99022k73210k43829k13698j84609
$$ 6174171 5796753 5436332 5095098 4774144 4475122 4201912 3958083 3744385 3559776
55888C559776j57809j36959j25933j23595j24580j25148j24783j22766j17564
$$ 3559776 3401967 3265008 3139075 3015480 2890900 2765752 2640969 2518203 2400639
55879B400639j09805j02013r4742q6234p6257o6990n9624n3144m7101m2668m0232
$$ 2400639 2290834 2188821 2094079 2007845 1931588 1864598 1804974 1751830 1704729 1662061 1621829
55868A621829l8462l6571l5308l5049l5044l5060l5963l8100m0785m3611m6723
$$ 1621829 1583367 1546796 1511488 1476439 1441395 1406335 1370372 1332272 1291487 1247876 1201153
55857A201153m9589n1098n0886m9156m5399l8989l1018k3797j8444j4432j1382
$$ 1201153 1151564 1100466 1049580 1000424 955025 916036 885018 861221 842777 828345 816963
55846H16963r727r492r825r854r032o939l853j163p6l42j270l112o047q831j0128
$$ 816963 807236 797744 787919 778065 769033 762094 758241 757078 757002 756660 755390 752278 746231 737400 727272
55831G27272j0528j1460j2736j2974j2011j1016j0628j0587j0826j1284j1132
$$ 727272 716744 705284 692548 679574 667563 656547 645919 635332 624506 613222 602090
55820F02090r854q604q768r746r995r624r871j0474r911q084o581o056n453m025
$$ 602090 592236 583632 574864 565118 555123 545499 535628 525154 515243 507159 500578 494522 489069 485044
55806D85044k303p57P27J873K163K125K872M244M968M737M384M038K868R10p28
$$ 485044 482741 481984 482711 484584 486747 488872 491744 495988 500956 505693 510077 514115 516983 517893 517165
55791E17165j754l092m990o444o945p172p482p281o413n687n501n287m837m741
$$ 517165 515411 512319 507329 500885 493940 486768 479286 472005 465592 459905 454404 449117 444280 439539
55777D39539n029m811l770k671j879o95J216L014L887L961L454K153J62j966m281
$$ 439539 434510 429699 425929 423258 421379 420684 421900 424914 428801 432762 436216 438369 438531 436565 432284
55762D32284p373j0808j2950j2980j1938j1135j0707j0345j0189j0276j0066r304
$$ 432284 424911 414103 401153 388173 376235 365100 354393 344048 333859 323583 313517 304213
55750C04213q481p867p086o122n704o015o137n489m834m986n453n285m452l577
$$ 304213 295732 287865 280779 274657 268953 262938 256801 251312 246478 241492 236039 230754 226302 222725
55736B22725k941k544k557k920l005k363j431r83j191j676k008j933j545j396
$$ 222725 219784 217240 214683 211763 208758 206395 204964 203981 202790 201114 199106 197173 195628 194232
55722A94232j907k574k544j931j645j859j814j316j131j374r95M20J580J349N07
$$ 194232 192325 189751 187207 185276 183631 181772 179958 178642 177511 176137 175142 175562 177142 178491 178998
55707A78998N40J459K130K099J869J639R82k31j491k299k602k604k578k722k900
$$ 178998 179538 180997 183127 185226 187095 188734 189716 189485 187994 185695 183093 180489 177911 175189 172289
55692A72289k740k256j900j788j441o71p2q0j84K61R79J232R73Q10J120J766K528
$$ 172289 169549 167293 165393 163605 162164 161493 161421 161341 161157 161418 162397 163629 164602 165412 166532 168298 170826
55675A70826L168L299K711J800J208J130J191R18O5j226k404k904k778k603k627
$$ 170826 173994 177293 180004 181804 183012 184142 185333 186251 186316 185090 182686 179782 177004 174401 171774
55660A71774k400j500k05Q83J424J389R13M09M11J001J680K015J979J615Q80k2
$$ 171774 169374 167874 167669 168552 169976 171365 172278 172687 173098 174099 175779 177794 179773 181388 182268 182246
55644A82246p18j245j995k927l566l909m490n246n216l922k242j338j379j853
$$ 182246 181528 180283 178288 175361 171795 167886 163396 158150 152934 149012 146770 145432 144053 142200
55630A42200k372k591k142j327j167j987k673k206j161p03p59m21K87M05k86q65
$$ 142200 139828 137237 135095 133768 132601 130614 127941 125735 124574 123871 123112 122691 122978 123383 123097 122232
55614A22232o96k69k97p58j196j330j150q43q11j312j994k185j713j046n81k29
$$ 122232 121536 121267 120970 120212 119016 117686 116536 115693 114882 113570 111576 109391 107678 106632 106051 105822
55598A05822K16O48Q25O34J44m58q87q92m65R8L73J12n02q44m71K85O26L08p3
$$ 105822 106038 106686 107511 108145 108289 107831 106944 106052 105587 105685 106058 106170 105668 104824 104353 104638 105264 105572 105499
55579A05499J20R26K056L295M367M940N065N136N168M677L588K675K541K800K739
$$ 105499 105619 106545 108601 111896 116263 121203 126268 131404 136572 141249 144837 147512 150053 152853 155592
55564A55592K307J813J197K70p06j402j998k740l309l347l299l830m696n038m682
$$ 155592 157899 159712 160909 161179 160473 159071 157073 154333 151024 147677 144378 140548 135852 130814 126132
55549A26132m313m286m116l341k251j534j489j810j863j230j34Q34J503K238L052
$$ 126132 121819 117533 113417 110076 107825 106291 104802 102992 101129 99899 99765 100599 102102 104340 107392
55534A07392L238K332R04k29r75j459j227j33O10l84k530l739l150k052j777j949
$$ 107392 110630 112962 113866 113637 112662 111203 109976 109843 110453 110069 107539 103800 100650 98598 96821 94872
55518I4872j560p08k74n31r24j008r04r17j161j472j482r76k80J0k54o71r67j251
$$ 94872 93312 92604 92330 91799 90875 89867 88963 88046 86885 85413 83931 82955 82675 82685 82431 81760 80793 79542
55500G9542j436j063l3R56J174O98J27k19m07m38k34Q0K25R7j38k57j23K52O55
$$ 79542 78106 77043 77010 77966 79140 79838 79965 79746 79339 78901 78667 78747 78972 79069 78931 78674 78551 78803 79458
55481G9458P83N55J93m1n7J04L10L22j5m68n61j41M28P26O56K82l36j003j350
$$ 79458 80241 80796 80989 80948 80891 80995 81305 81627 81612 81144 80583 80442 80870 81596 82252 82534 82198 81195 79845
55462G9845j230r64r11r60p24j52L54M15Q8k88n28p05q44p22j83M86P47M70R2
$$ 79845 78615 77651 76740 75780 75056 74904 75258 75673 75761 75473 74945 74240 73396 72674 72491 72977 73724 74194 74286
55443G4286MJ54L85P03Q99M07q37j773j258L62J498J231K91r5L36R58J234J095
$$ 74286 74290 74444 74829 75532 76431 76838 76001 74228 72970 73332 74830 76061 76352 76257 76593 77551 78785 79880
55425G9880O79J20l87o72p29o63n64m53k66P5M68O99Q13J150J708J777Q23m93
$$ 79880 80559 80679 80292 79620 78891 78228 77664 77211 76945 77020 77488 78187 79000 80150 81858 83635 84458 83965
55407H3965r34k67N37P26M82M6q54k104k762k216j196p34p14l98J28J38k65j32
$$ 83965 83031 82764 83301 84027 84509 84555 83701 81597 78835 76619 75423 74689 73975 73577 73705 73843 73578 73446
55389G3446P63J395R84J33j22K15L07k50r55j108n01N13J250J054j13j424j782
$$ 73446 74209 75604 76588 76721 76599 76814 77121 76871 75916 74808 74307 74820 76070 77124 77011 75587 73805
55372G3805r51J76N55J28k36J09P72Q69K21l76k03M64Q09N55J77P3O3j38m53o72
$$ 73805 72854 73030 73585 73713 73477 73586 74358 75227 75448 75072 74869 75333 76142 76697 76874 76947 77010 76872 76419 75747
55352G5747q21r79r65o25j83M3J88N88J086J130O11R0M7K68L34K42K22K74K84
$$ 75747 74926 73947 72982 72357 72174 72217 72405 72993 74079 75209 75820 75910 75957 76225 76559 76801 77023 77297 77581
55333G7581L11L64J59m38r36p38j3M90M53J90n9m18q32r23o13l05j60J96Q51J176
$$ 77581 77892 78256 78415 77977 77041 76303 76290 76780 77233 77423 77364 76946 76114 75191 74578 74273 74113 74309 75160 76336
55313G6336P04q1m38m26n78q74q51n51n57r92j228p53J97J048J492J468J017M23
$$ 76336 77040 76959 76521 76095 75517 74643 73792 73241 72684 71692 70464 69711 69908 70956 72448 73916 74933 75356
55295G5356J44L15N08K66k77n08p4O98J141R78N55K96O8n45j419j823j368n61
$$ 75356 75500 75815 76323 76589 76312 75804 75730 76428 77569 78547 79102 79398 79466 78921 77502 75679 74311 73750
55277G3750r3M%j63o05q39k29R87J788J553O17l41q79p95j56N20O90M88M92P62
$$ 73750 73657 73661 73661 73498 72893 72054 71825 72812 74600 76153 76770 76429 75550 74755 74599 75119 75809 76297 76789 77551
55257G7551P36J93l34m26l37l41j41N63J339J480Q77N3n46q59r93j066j234j573
$$ 77551 78287 78480 78146 77720 77383 77042 76901 77464 78803 80283 81160 81213 80667 79808 78815 77749 76515 74942
55239G4942j958k132j875j101OR39J293J268J357J542J304N53o6j27o8m48r54
$$ 74942 72984 70852 68977 67876 67882 68821 70114 71382 72739 74281 75585 76138 76072 75945 75877 75429 74475
55222G4475q35J9R21J243R28K83l36o34n43l19k48l44m59n69o97o94l54K73Q81
$$ 74475 73640 73659 74580 75823 76751 77034 76698 76064 75521 75202 74954 74610 74151 73582 72885 72191 71837 72110 72991
55203G2991J170J074P89O35O87O22K21p8L17J067J045j27j365j464n84K48N54
$$ 72991 74161 75235 76024 76659 77346 77968 78189 78111 78428 79495 80540 80413 79048 77584 77000 77248 77802
55186G7802N65L59k29r03j009m57J85N74R62J465J711J491J192J139J002L01p11
$$ 77802 78367 78726 78497 77594 76585 76128 76313 76887 77849 79314 81025 82516 83708 84847 85849 86150 85439
55169H5439j235q58LO43O96K60l69r12j176j057n88L7N82Q49P50L43o5o1L75O48
$$ 85439 84204 83346 83349 83992 84688 84948 84579 83667 82491 81434 80846 80883 81465 82314 83064 83407 83342 83281 83656 84304
55149H4304K15n45o81K7P47Q44Q06J237J621R78n03j511j395q83p78p88k81N13
$$ 84304 84519 83974 83293 83320 84067 84911 85717 86954 88575 89553 89050 87539 86144 85261 84483 83695 83414 83927
55131H3927P80L38j89k88j07K2J00K24J97l07j134j617j203j03R02J259J061P26
$$ 83927 84707 85045 84856 84568 84461 84483 84583 84807 85004 84697 83563 81946 80743 80640 81542 82801 83862 84588
55113H4588M66K58J25J58L27M96N89N95N08L91M40P37J036J026P87O88Q57R86
$$ 84588 85054 85312 85437 85595 85922 86418 87007 87602 88110 88501 88941 89678 90714 91740 92527 93215 94072 95058
55095I5058P51J56n42j062j158p32j4N25N89L39J94L77O61N95M3n42n65m1L96
$$ 95058 95809 95965 95423 94361 93203 92471 92457 92982 93571 93910 94104 94481 95142 95737 95780 95238 94673 94632 95028
55076I5028L68K69N52Q73N23m04r27m38M77P53N9r68j477j132k56N39Q59P47M12
$$ 95028 95396 95665 96217 97090 97613 97209 96282 95844 96321 97074 97133 96165 94688 93556 93300 93839 94698 95445 95857
55057I5857k4l81k83L28P62K86p15r74o6Q56N43o56j349r74k81mM5K79M88J91
$$ 95857 95833 95452 95169 95497 96259 96545 95830 94856 94790 95646 96189 95533 94184 93210 92929 92925 92970 93249 93737 93928
55037I3928m91r23p87m10k49l89o45p89o43j44M87Q11O37K89J93L15L08R5lJ70
$$ 93928 93437 92514 91727 91317 91068 90679 90034 89245 88602 88458 88945 89756 90393 90682 90875 91190 91498 91593 91590 91760
55017I1760L24K03N5K84Q28J180R78L17m49r81j004m20M94J144J020J76p07q18
$$ 91760 92084 92287 92342 92626 93454 94634 95612 95929 95480 94499 93495 93075 93569 94713 95733 95909 95202 94384
54999I4384mR06Q56k20j262j321o22o9rj7K23M44K98j63n46m52L08J401J962J329
$$ 94384 94380 95286 96142 95922 94660 93339 92717 92648 92639 92622 92845 93289 93587 93424 92878 92426 92734 94135 96097 97426
54979I7426j01j166j231p04k25P5K88K79k0k57p2L53O38P88J045J358J465J379
$$ 97426 97325 96159 94928 94224 93999 94074 94362 94641 94621 94364 94292 94645 95283 96071 97116 98474 99939 101318
54961A01318J310J195P83J56k73l65m21o51q30o94l51k8K73O06Q08O76L40J34
$$ 101318 102628 103823 104606 104762 104489 104124 103703 103052 102222 101528 101177 101149 101422 102028 102836 103512 103852 103986
54943A03986J14Ol34o88q06o89m26L6O52J004P19J33P1P95J596J705J274J065
$$ 103986 104100 104106 103772 103084 102278 101589 101163 101199 101851 102855 103574 103707 103778 104573 106169 107874 109148 110213
54925A10213J457K221L086L940M535M593M312M252M548M728M512M265M271M041
$$ 110213 111670 113891 116977 120917 125452 130045 134357 138609 143157 147885 152397 156662 160933 164974
54911A64974K874Q72j135k515l287l674l747l603l505l658l955m069l741k960
$$ 164974 167848 168720 167585 165070 161783 158109 154362 150759 147254 143596 139641 135572 131831 128871
54897A28871k032j421j385j738k031j913j307l84M30O35J29m77l84N74J775K529
$$ 128871 126839 125418 124033 122295 120264 118351 117044 116660 117090 117725 117854 117377 116993 117567 119342 121871
54881A21871K786L037L670M565N222N214M583L843L540L759M046L883L175K259
$$ 121871 124657 127694 131364 135929 141151 146365 150948 154791 158331 162090 166136 170019 173194 175453
54867A75453J450O66l96j775l093l987m519m959n312n328m973m505m056l433k549
$$ 175453 176903 177569 177173 175398 172305 168318 163799 158840 153528 148200 143227 138722 134666 131233 128684
54852A28684j746j449j683k115k426k495k377k324k614l092l115k247q99P5L61
$$ 128684 126938 125489 123806 121691 119265 116770 114393 112069 109455 106363 103248 101001 100102 100177 100538
54837A00538L98O52J106J444J411Q39k73j525k219j956j008L4P90J140J024M96
$$ 100538 100936 101588 102694 104138 105549 106388 106115 104590 102371 100415 99407 99441 100231 101371 102395 102891
54821A02891q4k36J64P54J029P21j13j169j982k134j516l88Q24J696J880J316
$$ 102891 102807 102571 102735 103489 104518 105239 105126 103957 101975 99841 98325 97937 98761 100457 102337 103653
54805A03653M62M0K81N69K39m51o03P3Q40R93Q01R10J281J315Q65M01K07K3l74
$$ 103653 104115 104155 104436 105005 105244 104793 104190 104263 105103 106096 106897 107807 109088 110403 111268 111669 111876 111899 111525
54786A11525p12o21j18N15J003J095O57j1l56j85J99O32J382K580L807M542M708
$$ 111525 110813 110192 110074 110589 111592 112687 113344 113333 112977 112792 112991 113623 115005 117585 121392 125934 130642
54769A30642M423L729K972K924L874M991N215M672M386M693M781L904K334Q12
$$ 130642 135065 138794 141766 144690 148564 153555 158770 163442 167828 172521 177302 181206 183540 184352
54755A84352l95j483k550l435l976m193m256m398m673m820m529l870l203k675
$$ 184352 183957 182474 179924 176489 172513 168320 164064 159666 154993 150173 145644 141774 138571 135896
54741A35896k106j456j061j230j755k042j670p75P9M68N26O70R24Q94O37R44K290
$$ 135896 133790 132334 131273 130043 128288 126246 124576 123801 123880 124348 124874 125544 126468 127362 127999 128943 131233
54724A31233L845M377L862L382L502L690L542L488L791L719K514O02r12j660k178
$$ 131233 135078 139455 143317 146699 150201 153891 157433 160921 164712 168431 170945 171547 170635 168975 166797
54709A66797k897l669m214m451m328l870l390l219l175k740j827j043r82j538
$$ 166797 163900 160231 156017 151566 147238 143368 139978 136759 133584 130844 129017 127974 126992 125454
54695A25454k057k020j510j130j427k271k881k573j473k76M85P09M64j04o06n86
$$ 125454 123397 121377 119867 118737 117310 115039 112158 109585 108112 107836 108321 109030 109494 109390 108784 108198
54679A08198PP18J093J052P55L52oj93k49l66o38r97j416j934k333k142j224j61
$$ 108198 108205 108923 110016 111068 111823 112175 112169 111976 111727 111361 110723 109726 108310 106376 104043 101901 100677 100516
54661A00516L23K14J66N32R13Q06L54M6l6j79l55j48M78Q77N81M0rM02O67O32
$$ 100516 100839 101053 101219 101751 102664 103470 103824 103870 103834 103655 103300 103152 103630 104507 105088 105128 105119 105521 106188 106820
54641A06820P18J037J059M47m49j201j793k166j841o03Q71J640J531J006L36n02
$$ 106820 107538 108575 109634 110081 109632 108431 106638 104472 102631 102028 102899 104539 106070 107076 107412 106910
54625A06910j299j657j568j341r88k69O56J191J128R98J334J972K302J868O66
$$ 106910 105611 103954 102386 101045 100057 99788 100444 101635 102763 103761 105095 107067 109369 111237 111903
54610A11903q29j817j720q15j6J19r9j17J45L39K67R4J66O15J086R39N6p24n28
$$ 111903 111074 109257 107537 106722 106706 106825 106726 106609 106754 107093 107360 107454 107620 108235 109321 110260 110316 109592 109064
54591A09064L09N82p2o74l99K73M95L53M46P03N73R6j90k10l07l51J24Q18P28
$$ 109064 109373 109955 109883 109209 108810 109083 109578 109931 110377 111080 111653 111749 111559 111349 111042 110691 110815 111633 112361
54572A12361l57j321j238o16m75p79n94M74J717K213J689O27j54m6Q32J632J629
$$ 112361 112004 110683 109445 108829 108354 107575 106981 107455 109172 111385 113074 113701 113547 113501 114333 115965 117594
54555A17594R56K72j65n86j044j207q85l05L30J068J777J946J314M24R1L58M75
$$ 117594 118550 118822 118657 118071 117027 115820 114935 114630 114960 116028 117805 119751 121065 121489 121580 121938 122413
54538A22413m4p48q11n7Q38J113O55m5m90n81n10m47l86k75j20l0k01q03j703
$$ 122413 122369 121621 120810 120753 121591 122704 123359 123314 122824 122243 121733 121286 120900 120625 120505 120475 120274 119471 117768
54519A17768k352k137j063J25O34M10kk49n09r55j256r59j14P63J365J734J799
$$ 117768 115416 113279 112216 112341 112975 113385 113383 113134 112625 111670 110414 109455 109341 110104 111469 113203 115002
54502A15002J216O0q16o19K73O41j9q55q22m1M88K21m12p61o26j10O37J281J335
$$ 115002 116218 116278 115462 114843 115116 115757 115738 114883 114061 114020 114508 114729 114317 113556 112930 112820 113457 114738 116073
54483A16073P25R5J29P27J179J086P25N62O67Q20Q53P80P07P63R97J343J678J978
$$ 116073 116798 116893 117022 117749 118928 120014 120739 121301 121968 122788 123641 124421 125128 125891 126888 128231 129909 131887
54465A31887K155J924J051j63r90j012n35n5L29P15Q87M62m84j382j811j830j583
$$ 131887 134042 135966 137017 136854 135864 134852 134317 134262 134591 135306 136193 136655 136171 134789 132978 131148 129565
54448A29565r85m5Q04J061O91J12l01m10k45J6M2l55q70r69o04k66k60k77P8N42
$$ 129565 128580 128535 129339 130400 131091 131203 130902 130492 130247 130263 130305 129950 129080 128111 127507 127241 126981 126704 126782 127324
54428A27324M87j90q70r97o94m41l71r9P60K008K819K345O20j211j837j128k11
$$ 127324 127811 127621 126751 125754 125060 124619 124248 124149 124909 126917 129736 132081 132701 131490 129653 128525 128314
54411A28314r1n12n47QM14R0o21j034r64p18n24l68k04M6N94J505K347K495J879
$$ 128314 128223 127711 127164 127172 127586 127676 127055 126021 125057 124339 123815 123447 123243 123289 123883 125388 127735 130230 132109
54392A32109J149Q96R91R02N30L42O78J200J253O52j33n38m92l57m22o24o73l62
$$ 132109 133258 134154 135145 136047 136577 136919 137597 138797 140050 140702 140569 140031 139539 139182 138760 138136 137463 137101
54374A37101L27J199J888K038J608R79O75Q95J369J664J671J713K127K720K848
$$ 137101 137428 138627 140515 142553 144161 145140 145815 146710 148079 149743 151414 153127 155254 157974 160822
54359A60822K191J287R89J383J643J086M8o94j058j641k600l164k659j562j021
$$ 160822 163013 164300 165289 166672 168315 169401 169449 168755 167697 166056 163456 160292 157633 156071 155050
54344A55050j441k111k240j913j704j777j797j572j277j038p57m61m11o02n69
$$ 155050 153609 151498 149258 147345 145641 143864 142067 140495 139218 138180 137423 136962 136551 135949 135380
54329A35380l9N23M63j48o70q03p88p24l89J24K75p7k70K13Q78Q57P7p96j319
$$ 135380 135341 135864 136327 136179 135509 134706 133918 133194 132805 132929 133204 133127 132857 133070 133948 134805 134882 134086 132767
54310A32767j539j459r55k13L19N01N33L94j54q93j091m34N09J016J044J040J325
$$ 132767 131228 129769 128814 128601 128920 129421 129954 130348 130194 129301 128210 127776 128285 129301 130345 131385 132710
54293A32710J902K471K404J186p72k240k492k100j914j744q43O25J519J225L93
$$ 132710 134612 137083 139487 140673 139901 137661 135169 133069 131155 129411 128568 129193 130712 131937 132330
54278A32330k4J28L62L38J04j58k73j44J60M95Q93J440J873J640O36m58q99o56
$$ 132330 132306 132434 132796 133134 133238 133080 132807 132663 132823 133318 134211 135651 137524 139164 139800 139342 138443 137787
54260A37787j83L49J141K129K759K559J715Q45L86L02L37K72pm96r71j109q32
$$ 137787 137604 137953 139094 141223 143982 146541 148256 149101 149487 149789 150126 150398 150391 149895 148924 147815 146983
54243A46983n21o22j066j323j052m78K9L94O28M89j63r05j123q49o75q33q52l74
$$ 146983 146462 145840 144774 143451 142399 141921 141950 142344 142972 143461 143298 142393 141270 140421 139746 138913 138061 137687
54225A37687K52N36N81Q52J392J775J669J114L44l50o29l79O0K55K16K55L91L14
$$ 137687 137939 138475 139056 139908 141300 143075 144744 145858 146202 145852 145223 144844 144904 145159 145375 145630 146021 146335
54207A46335n9l60k94q2j42n54j043j318j252q41k04L90O16L35k43o09l20N02
$$ 146335 146276 145916 145622 145540 145398 144844 143801 142483 141231 140390 140186 140576 141192 141527 141284 140675 140355 140857
54189A40857J154J056M21n4j04j10l89o67n36l1N65J125J546J496P66j99o49m20
$$ 140857 142011 143067 143488 143434 143330 143220 142831 142164 141628 141597 142162 143287 144833 146329 147095 146896 146247 145827
54171A45827p5r1l64o31r61j517k072k112j413l61L38K50l55p53n34q1l5l70m31
$$ 145827 145752 145661 145297 144666 143705 142188 140116 138004 136591 136230 136568 136818 136463 135710 135176 135095 135060 134690 134259
54152A34259L8M72L24p3M5P58J341J183M34l17o49n68l30j89j44M2N17J090J420
$$ 134259 134297 134769 135093 135020 135065 135823 137164 138347 138781 138464 137815 137247 136917 136728 136584 136626 137143 138233 139653
54133A39653J351R03J36p22j228j177r05p80o00nO59O42K1j48P44J947K381K005
$$ 139653 141004 141907 142043 141321 140093 138916 138011 137231 136631 136626 137285 137927 137948 137800 138544 140491 142872 144877
54115A44877J591J486J371J022O80O05P88J183J781K330K372J727P44j9k17J74
$$ 144877 146468 147954 149325 150347 151027 151632 152420 153603 155384 157714 160086 161813 162557 162538 162321 162495
54099A62495R33J752K410K844K925K377J113m31j582j988j726j037k03M20O03
$$ 162495 163428 165180 167590 170434 173359 175736 176849 176418 174836 172848 171122 170085 169882 170302 170905
54084A70905M63K90K11K71N97J170J603J534J112P00L23j33m12j85J93J4o88j077
$$ 170905 171368 171658 171869 172140 172737 173907 175510 177044 178156 178856 179179 179046 178634 178449 178642 178656 177968 176891
54066A76891o97k3M13O61Q57Q02N15N11J022J468J309R29J018J557K056K422K876
$$ 176891 176194 176171 176584 177245 178102 178904 179419 179930 180952 182420 183729 184658 185676 187233 189289 191711 194587
54049A94587L281L273K984K913L165L433L669M148M904N617O161O717P306P713
$$ 194587 197868 201141 204125 207038 210203 213636 217305 221453 226357 231974 238135 244852 252158 259871
54035B59871P940Q180Q317P953P079O228N800N615N263M620L835L169K853K831
$$ 259871 267811 275991 284308 292261 299340 305568 311368 316983 322246 326866 330701 333870 336723 339554
54021C39554K595J660K88p61j225j646k511l517m023l942l916m629o021p187p211
$$ 339554 342149 343809 344097 343336 342111 340465 337954 334437 330414 326472 322556 317927 311906 304719 297508
54006B97508o322n803o412p233o882n485m512m603m785m130l120k731k977l187
$$ 297508 291186 285383 278971 271738 264856 259371 254859 250256 245471 241341 238221 235490 232513 229326
53992B29326l089k820k357j707j280j311j310q10k91m95j130j214o04j82m34q24
$$ 229326 226237 223417 221060 219353 218073 216762 215452 214642 214351 213856 212726 211512 210908 210726 210292 209468
53976B09468p88n16l09P9R47J988K673K928L098L470M142N041N798N907N274M328
$$ 209468 208680 208164 207855 207934 208881 210869 213542 216470 219568 223038 227180 232221 238019 243926 249200 253528
53960B53528L378K179N07j230k345k677k597k366j923j255n79o8K94N75Q48J303
$$ 253528 256906 259085 259592 258362 256017 253340 250743 248377 246454 245199 244620 244552 244846 245421 246269 247572
53944B47572K085K973L487L485L408L746M428M967N158N282N652O187O625O973
$$ 247572 249657 252630 256117 259602 263010 266756 271184 276151 281309 286591 292243 298430 305055 312028
53930C12028P401P755P556O665N709N570O441P709Q678R153R249Q980Q367P747
$$ 312028 319429 327184 334740 341405 347114 352684 359125 366834 375512 384665 393914 402894 411261 419008
53916D19008P668Q328R293R846R578Q675P681O992O518N780M410K610J016O7n07
$$ 419008 426676 435004 444297 454143 463721 472396 480077 487069 493587 499367 503777 506387 507403 507470 506963
53901E06963j342k680m058m915n283n685o447p412q264q886r270r394r339r373
$$ 506963 505621 502941 498883 493968 488685 483000 476553 469141 460877 451991 442721 433327 423988 414615
53887D14615r683j0171j0590j0750j0466r591q367p492p408p629p194n880m558
$$ 414615 404932 394761 384171 373421 362955 353364 344997 337505 330097 322468 315274 309394 304836
53874C04836m172m707n422n856o244o890p489p361o233m575l103k137j633j624
$$ 304836 300664 295957 290535 284679 278435 271545 264056 256695 250462 245887 242784 240647 239014 237390
53860B37390k212l074l483l064k305j964k178k408k149j338l12L67K16o27j278
$$ 237390 235178 232104 228621 225557 223252 221288 219110 216702 214553 213215 212903 213270 213486 212859 211581
53845B11581j035k76M8k04k39K99O72J49q18j239j033r80j364j421m38J163K274
$$ 211581 210546 210270 210318 210114 209875 210174 210846 210995 210177 208938 207905 206925 205561 204140 203702 204865 207139
53828B07139K303J602P91J45k87l27J75R35J337J120P08O69J037J478J942K666
$$ 207139 209442 211044 211835 211980 211693 211366 211541 212476 213813 214933 215641 216310 217347 218825 220767 223433
53812B23433L635M409M682M618M522M498M596M952N514N951O075O147O497P035
$$ 223433 227068 231477 236159 240777 245299 249797 254393 259345 264859 270810 276885 283032 289529 296564
53798B96564P389P254O468N094L722L304M073M940M610L100J537N73j47r02j245
$$ 296564 303953 311207 317675 322769 326491 329795 333868 338808 343418 346518 348055 348628 348481 347579 346334
53783C46334r37p07j438k950m340n242n996o784p294p356p221p018o498n590m764
$$ 346334 345397 344690 343252 340302 335962 330720 324724 317940 310646 303290 296069 289051 282553 276963 272199
53768B72199m490m708n093n481n687n283m105k775k123k182k287k145k169k568
$$ 272199 267709 263001 257908 252427 246740 241457 237352 234577 232454 230272 227985 225840 223671 221103
53754B21103k800k302j373p34n55m59l55o31j462k357k667k272j547r37o98q77
$$ 221103 218303 216001 214628 213894 213339 212880 212525 211894 210432 208075 205408 203136 201589 200652 199954 199077
53738A99077j247j341q19J33Q66Q69K83j99j4P41J464J719J582J351J135R07P36
$$ 199077 197830 196489 195670 195803 196669 197538 197821 197622 197608 198349 199813 201532 203114 204465 205600 206507 207243
53721B07243O89O60M88K45J10Q2P8K68R10J818K376K266J871J757J960K061J801
$$ 207243 207932 208592 209080 209325 209435 209517 209595 209863 210773 212591 214967 217233 219104 220861 222821 224882 226683
53704B26683J367J075J023J032R50Q77J076J609K124K256K136K243K648K756K039
$$ 226683 228050 229125 230148 231180 232130 233007 234083 235692 237816 240072 242208 244451 247099 249855 251894
53689B51894Q48J79O23J728K432K039P70n38j249j373j312j235r82m40J66M82
$$ 251894 252742 252921 253544 255272 257704 259743 260513 259975 258726 257353 256041 254806 253824 253384 253550 254032
53673B54032M05P8k68m62m41k21P8K94K75Pk74k50P7L08J44k22m52n28n39k87
$$ 254032 254437 254515 254247 253785 253344 253123 253201 253495 253770 253777 253503 253253 253330 253638 253782 253560 253108 252580 252041 251754
53653B51754L81R61O66m68j390j180L6J405K160K014J241N80O22J077J153P86
$$ 251754 252135 253096 253762 253294 251904 250724 250760 252165 254325 256339 257580 258160 258782 259859 261012 261798
53637B61798Q22J639K356K054J156Q69J578K577L190L397L417L294L019K627K126
$$ 261798 262620 264259 266615 268669 269825 270694 272272 274849 278039 281436 284853 288147 291166 293793 295919
53622B95919J645J518J866K248K158J736J547J763K049K159K234K508L066L769
$$ 295919 297564 299082 300948 303196 305354 307090 308637 310400 312449 314608 316842 319350 322416 326185
53608C26185M126L603K412J676K125L011L015K027J171J189J702K142K449K568
$$ 326185 330311 333914 336326 338002 340127 343138 346153 348180 349351 350540 352242 354384 356833 359401
53594C59401K135J156L76M42J067J396R58M1o13n11m2l03j732l212l380k537k168
$$ 359401 361536 362692 363068 363510 364577 365973 366931 366972 366359 365848 365806 365503 363771 360559 357179 354642 352474
53577C52474k565k425j208l39j048k305k314j178n05q74j309j155r43j072j003
$$ 352474 349909 347484 346276 345937 344889 342584 340270 339092 338587 337713 336404 335249 334306 333234 332231
53562C32231k91N28P06K31m96j247j734j418k05J043J375Q88M72N68P59O04L09
$$ 332231 331940 332468 333174 333405 332909 331662 329928 328510 328305 329348 330723 331611 332083 332651 333410 334014 334323
53545C34323L64Q35J336J554J574J640J849K180K706L533M491N187N486N720O207
$$ 334323 334687 335522 336858 338412 339986 341626 343475 345655 348361 351894 356385 361572 367058 372778 378985
53530C78985O679O584N908N377N683O773Q057R111R933J0553J0794J0596J0388
$$ 378985 385664 392248 398156 403533 409216 415989 424046 433157 443090 453643 464437 475033 485421
53517D85421J0790J1884J3022J3609J3853J4452J5686J7140J8324J9115J9465
$$ 485421 496211 508095 521117 534726 548579 563031 578717 595857 614181 633296 652761
53506F52761J9144J8140J7095J6927J7913J9351K0119J9659J8522J7913J8383
$$ 652761 671905 690045 707140 724067 741980 761331 781450 801109 819631 837544 855927
53495H55927J9047J8502J6611J4808J4379J5015J5465J5192J4661J4400J4451
$$ 855927 874974 893476 910087 924895 939274 954289 969754 984946 999607 1014007 1028458
53484A028458J4752J5269J5651J5328J4177J2751J1702J1223J1119J1015J0470
$$ 1028458 1043210 1058479 1074130 1089458 1103635 1116386 1128088 1139311 1150430 1161445 1171915
53473A171915R255P622N988M346K356J3k239m145n887p444q318q267p974q453
$$ 1171915 1181170 1188792 1194780 1199126 1201482 1201495 1199256 1195111 1189224 1181780 1173462 1165195 1157221 1148768
53459A148768r917j1656j2893j3421j3438j3250j3168j3436j4031j4661j5058
$$ 1148768 1138851 1127195 1114302 1100881 1087443 1074193 1061025 1047589 1033558 1018897 1003839
53448A003839j5189j5173j5055j4746j4172j3410j2629j1896j1145j0346r554
$$ 1003839 988650 973477 958422 943676 929504 916094 903465 891569 880424 870078 860524
53437H60524q728p645o251m934m070l410k283o01Q37J299J078J112J876L089M404
$$ 860524 851796 844151 837900 832966 828896 825486 823203 822602 823439 824738 825816 826928 828804 831893 836297
53422H36297N839P419Q801R649J0193J1102J2742J4807J6713J8197J9424K0660
$$ 836297 842136 849555 858356 868005 878198 889300 902042 916849 933562 951759 971183 991843
53410I91843K1946K3114K4002K4674K5481K6808K8683L0652L2196L3229L4074
$$ 991843 1013789 1036903 1060905 1085579 1111060 1137868 1166551 1197203 1229399 1262628 1296702
53399A296702L4978L5913L6858L8002L9537M1327M2969M4066M4412M4090M3492
$$ 1296702 1331680 1367593 1404451 1442453 1481990 1523317 1566286 1610352 1654764 1698854 1742346
53388A742346M3011M2635M2087M1375M0896M0686M0048L8267L5508L2575K9941
$$ 1742346 1785357 1827992 1870079 1911454 1952350 1993036 2033084 2071351 2106859 2139434 2169375
53377B169375K7407K4560K1139J7077J2702Q824O067M023J456k482p524j2702
$$ 2169375 2196782 2221342 2242481 2259558 2272260 2281084 2287151 2291174 2292630 2290148 2282624 2269922
53365B269922j7158k0577k3353k6396l0233l4176l6846l7701l7584l7574l7924
$$ 2269922 2252764 2232187 2208834 2182438 2152205 2118029 2081183 2043482 2005898 1968324 1930400
53354A930400l8342l8661l8718l8111l6796l5526l5092l5262l5095l4151l2812
$$ 1930400 1892058 1853397 1814679 1776568 1739772 1704246 1669154 1633892 1598797 1564646 1531834
53343A531834l1555l0542k9934k9898l0082k9621k8083k6032k4423k3556k2952
$$ 1531834 1500279 1469737 1439803 1409905 1379823 1350202 1322119 1296087 1271664 1248108 1225156
53332A225156k2062k0822j9529j8365j7217j5973j4827j4128j3854j3541j2915
$$ 1225156 1203094 1182272 1162743 1144378 1127161 1111188 1096361 1082233 1068379 1054838 1041923
53321A041923j2312j2121j2030j1353j0034q809q193p813p021n772m493l319j935
$$ 1041923 1029611 1017490 1005460 994107 984073 975264 967071 959258 952237 946465 941972 938653 936718
53308I36718k07J485K629L206L703M664O213Q022R644J0819J1570J2101J2756
$$ 936718 936511 937996 940625 943831 947534 952198 958411 966433 976077 986896 998466 1010567 1023323
53295A023323J3844J5318J6671J7413J7686J8083J8823J9458J9514J9106J8563
$$ 1023323 1037167 1052485 1069156 1086569 1104255 1122338 1141161 1160619 1180133 1199239 1217802
53284A217802J7837J6706J5347J4159J3040J1450R286P181N583M011J678j411
$$ 1217802 1235639 1252345 1267692 1281851 1294891 1306341 1315627 1322808 1328391 1332402 1334080 1332669
53272A332669m410o578p943r142j0810j3068j5308j6635j6846j6759j7254j8211
$$ 1332669 1328259 1321681 1313738 1304596 1293786 1280718 1265410 1248775 1231929 1215170 1197916 1179705
53260A179705j8889j9181j9726k0788k1773k2159k2200k2241k1980k1096k0114
$$ 1179705 1160816 1141635 1121909 1101121 1079348 1057189 1034989 1012748 990768 969672 949558
53249I49558j9892k0444k0961k0940k0621k0332k0015j9604j9247j8942j8363
$$ 949558 929666 909222 888261 867321 846700 826368 806353 786749 767502 748560 730197
53238G30197j7382j6414j5968j5961j5801j5026j3761j2571j1840j1370j0631
$$ 730197 712815 696401 680433 664472 648671 633645 619884 607313 595473 584103 573472
53227E73472r541q722q699r119r225q907q770r137r596r690r512r382r372r432
$$ 573472 563931 555209 546510 537391 528166 519259 510489 501352 491756 482066 472554 463172 453800 444368
53213D44368r593r776r721r342q902q583q185p487o610n832n301n115n372n862
$$ 444368 434775 424999 415278 405936 397034 388451 380266 372779 366169 360337 355036 349921 344549 338687
53199C38687o105n928n677n635n556n177m761m719n001n234n203m828l990k916
$$ 338687 332582 326654 320977 315342 309786 304609 299848 295129 290128 284894 279691 274863 270873 267957
53185B67957k377k864l770l970l166k096j489j421j665k002k083j597q03m58q57
$$ 267957 265580 262716 258946 254976 251810 249714 248225 246804 245139 243137 241054 239457 238654 238196 237339
53170B37339j411j394q55m41n79j094j544j680j591j542j698j945j947j379j88
$$ 237339 235928 234534 233679 233238 232659 231565 230021 228341 226750 225208 223510 221565 219618 218239 218051
53155B18051J159J778J098l45j229q87q0K6o20j087q23k74q3k88m80l40J59P67
$$ 218051 219210 220988 222086 221741 220512 219625 219545 219571 218951 217864 217041 216767 216684 216396 215916 215576 215735 216502
53137B16502J085R09N17L07K77J25j44j68K30Q45J394J597J149J33o23k84Q22
$$ 216502 217587 218496 219013 219320 219597 219722 219578 219410 219640 220485 221879 223476 224625 224758 224135 223851 224673
53120B24673J456J066L29K4J16L30P82J423J609R47J25M3M94M64l58j153j106
$$ 224673 226129 227195 227524 227548 227664 227994 228776 230199 231808 232755 232880 232923 233417 233881 233523 232370 231264
53103B31264l75K20J09n81j215j224o49p7J9l08p11r07o73J1O16L50p58j553j119
$$ 231264 230889 231109 231218 230637 229422 228198 227549 227472 227491 227183 226472 225565 224892 224903 225519 225869 225111 223558 222439
53084B22439k9M22r7q05j089j128j188j145r62r77j354j675j433o87L2L31L30
$$ 222439 222410 222832 222735 221930 220841 219713 218525 217380 216418 215441 214087 212412 210979 210292 210324 210655 210985
53067B10985M77R83J362Q25o70k064k325j610q03k07N09J283J505J084P73J038
$$ 210985 211462 212445 213807 214632 213962 211898 209573 207963 207160 206953 207462 208745 210250 211334 212107 213145
53051B13145J351J074M12j1p3p2j13q6o5k01l83l96l50n34r60j290j241q44m01
$$ 213145 214496 215570 215982 215971 215898 215826 215713 215627 215562 215361 214978 214582 214232 213698 212738 211448 210207 209363 208962
53032B08962k44m25n70k66L82Q77J056J209J400J206M56l13n30k89K2L35O82Q05
$$ 208962 208718 208293 207723 207457 207839 208716 209772 210981 212381 213587 214043 213730 213200 212911 212933 213268 213950 214755
53014B14755O22O37J150J462P09o98j441j077m86l62k63M07J300J630J281P02
$$ 214755 215377 216014 217164 218626 219335 218637 217196 216119 215633 215271 215008 215415 216715 218345 219626 220328
52998B20328J15m98q93p32k46j21m98o23K02J610K497K321J662J320J247Q35J01
$$ 220328 220443 219945 219052 218320 218074 217953 217455 216832 217034 218644 221141 223462 225124 226444 227691 228526 228627
52981B28627j76L27Q21N32k9K19J293K138K233K156K334K200J221l6o42n45l79
$$ 228627 228451 228778 229599 230131 230102 230321 231614 233752 235985 238141 240475 242675 243896 243860 243218 242673 242294
52964B42294m10m30m60p30j014p74m2M55K42l60p77q33p25p21j033j636k070j817
$$ 242294 241884 241454 240994 240264 239250 238476 238434 238889 239131 238771 237994 237161 236436 235715 234682 233046 230976 229159
52946B29159j039n77r27j560j551p25J90M25o3o98r61q31o21n02l36l4J51p2n59
$$ 229159 228120 227543 226616 225056 223505 222780 222970 223395 223332 222634 221673 220842 220221 219719 219383 219349 219500 219428 218869
52927B18869q60p81n52m56n56p62q39l71Q27K169K682K105J172N89K39k57o71
$$ 218869 218009 217228 216676 216220 215664 214902 214063 213692 214519 216688 219370 221475 222647 223236 223475 223218 222547
52910B22547n64j57j33n86q59n81k16k79n13l34K28N67L87J06J86M70M72J67J4
$$ 222547 221983 221826 221693 221107 220248 219667 219451 219172 218659 218325 218553 219120 219507 219613 219799 220269 220741 220908 220922
52891B20922K30M00J44j65J49J029J572J182L14j51N6N16P89O76J25o26r25k75
$$ 220922 221152 221552 221696 221531 221680 222709 224281 225463 225777 225626 225682 226198 226987 227663 227788 227162 226237 225962
52873B25962Q92J554J304Q10Q55J412J861J774J216N51K37N59J252J591J188N15
$$ 225962 226854 228408 229712 230522 231377 232789 234650 236424 237640 238191 238428 238987 240239 241830 243018 243533
52857B43533K80M67M01l23j396k298k784k844k534k124k035k394k825k897k623
$$ 243533 243813 244280 244681 244358 242962 240664 237880 235036 232502 230378 228343 225949 223124 220227 217604
52842B17604k290j971j517r29m95m07m95m05l7L29L02j71p01q21m66J9L23M63
$$ 217604 215314 213343 211826 210897 210402 209995 209500 209095 209058 209387 209689 209518 208817 207996 207530 207549 207872 208335
52824B08335N62N45K56k10n39n91n69p20j008j152r28l68K95Q69J321J650J650
$$ 208335 208897 209442 209698 209488 208949 208358 207789 207069 206061 204909 203981 203613 203908 204777 206098 207748 209398
52807B09398J083O9q92j450j695j682j153j19O70N12j24j86L03J76r79j902j356
$$ 209398 210481 210550 209658 208208 206513 204831 203678 203559 204229 204741 204617 204431 204734 204910 203931 202029 200673
52790B00673M1P30L53j06q2j07n48p69m6J345K468K717K192J424R45Q52O59p9
$$ 200673 200714 201444 201797 201691 201609 201502 200954 200185 200139 201484 203952 206669 208861 210285 211230 212082 212741 212662
52772B12662r89j294r29o13o91o97l86k56o34r68p59m23n53r01r06o54m76l6J051
$$ 212662 211673 210379 209450 208837 208146 207449 207063 206807 206173 205205 204446 204023 203470 202569 201663 201009 200533 200497 201548
52753B01548K129K155J366J032J558J971J576J038J238K035K672K769K355J522
$$ 201548 203677 205832 207198 208230 209788 211759 213335 214373 215611 217646 220318 223087 225442 226964
52739B26964N98R5N6p5m75n23J24P35N35l1j2M43K91p19j574j463p97m20m83n92
$$ 226964 227562 227657 227713 227638 227163 226640 226764 227499 228034 228003 227991 228434 228725 228006 226432 224969 224172 223752 223269 222677
52719B22677o38q34j163j282r72m19N8L57N85P89P68L31l28p02n32j29L4p0r8
$$ 222677 222039 221205 220042 218760 217788 217369 217427 217784 218369 219158 219926 220257 219929 219227 218695 218566 218600 218530 218432
52700B18432J39M74O97P43O12L43R6k0j15k82k52L33J225J649J191K39o72j437
$$ 218432 218571 219045 219742 220485 221097 221440 221536 221516 221401 221119 220867 221200 222425 224074 225265 225504 224832 223395
52682B23395j962j785p08M37N39l35r74o78j09j24m66k98M59J061J083Q12N81
$$ 223395 221433 219648 218940 219377 219916 219581 218607 217929 217820 217696 217230 216932 217391 218452 219535 220347 220928
52665B20928L90K83M33O42M55L0K39J421K644K830K114J428J124Q28M66M29O95
$$ 220928 221318 221601 222034 222676 223131 223161 223400 224821 227465 230295 232409 233837 234961 235789 236255 236684 237379
52648B37379O29o5q49j158j122j103j038o56J9P31J312J601J400Q70O44J135J962
$$ 237379 238008 237943 237094 235936 234814 233711 232673 232017 232036 232767 234079 235680 237080 237950 238594 239729 241691
52631B41691K513K805L294L967M190L565K576K122K583L396L490K170k51k684
$$ 241691 244204 247009 250303 254270 258460 262025 264601 266723 269306 272702 276192 278362 278111 275427
52617B75427m151m443l947l118k293j775j748k069k360k311j895j319q53o25n27
$$ 275427 271276 266833 262886 259768 257475 255700 253952 251883 249523 247212 245317 243998 243145 242520 241993
52602B41993m34m55p11r28o46L7L85nn47l32O79J610J619O89m46q67k16Q94J334
$$ 241993 241559 241104 240393 239465 238819 238856 239241 239236 238689 238357 239036 240646 242265 242954 242508 241641 241425 242319 243653
52583B43653O92j99k71M83J163J228J027J047J203J121P52M06L04K71l5o26j031
$$ 243653 244345 244146 243875 244358 245521 246749 247776 248823 250026 251147 251899 252305 252609 252880 252845 252219 251188
52566B51188q17k34j2m12r24j077j024r92p02NN13J42p25j070o71k55k11n1O29
$$ 251188 250371 250137 250125 249713 248789 247712 246688 245696 244994 244999 245512 245654 244929 243859 243188 242933 242722 242671 243300
52547B43300J425J788J698J367Q11J25l36m48n63q80r90n32J42M49M12N14Q82
$$ 243300 244725 246513 248211 249578 250389 250514 250178 249730 249167 248287 247297 246765 246907 247356 247768 248282 249164
52530B49164J128R05K60n16j023q86j33O05O52O1m23k44L64P56O74M87O74J166
$$ 249164 250292 251197 251457 250941 249918 249032 248899 249504 250156 250217 249794 249550 249914 250670 251344 251831 252505 253671
52512B53671J417J125P46R78J879K797L186L076K693K015R41l59j538k323k537
$$ 253671 255088 256213 256959 257937 259816 262613 265799 268875 271568 273583 274524 274165 272627 270304 267767
52497B67767k136j418r63j125j690k150k199j881j520j536j935k037j075O45J794
$$ 267767 265631 264213 263250 262125 260435 258285 256086 254205 252685 251149 249214 247177 246102 246747 248541
52482B48541J507L91l93n58o27q04p32k65J94K88J81K69P57J555K297K490K045
$$ 248541 250048 250439 250046 249488 248861 248057 247325 247060 247254 247542 247723 247992 248749 250304 252601 255091 257136
52465B57136J616J959K935L553L182K232J494J171R53O12J67l67r77j438j503
$$ 257136 258752 260711 263646 267199 270381 272613 274107 275278 276231 276843 277010 276643 275666 274228 272725
52450B72725j316j369j896k488k482j683o13k9k09p27q97n17j30m49j463k256
$$ 272725 271409 270040 268144 265656 263174 261491 260878 260849 260640 259913 259016 258499 258369 257920 256457 254201
52434B54201j946p09L97O73M67M71P16O80J68m15o41m39L3N57Q38Q29R71J647
$$ 254201 252255 251546 251943 252616 253083 253554 254270 254950 255118 254703 254062 253623 253656 254213 255051 255880 256851 258498
52416B58498K344K089R13J65Q93K506L637L853L833M165M709N103N141M696L763
$$ 258498 260842 262931 263844 264009 264902 267408 271045 274898 278731 282896 287605 292708 297849 302545 306308
52401C06308K694J929J386N53p28k001k774l045l077l022k853k454j714p65j66
$$ 306308 309002 310931 312317 312870 312142 310141 307367 304322 301245 298223 295370 292916 291202 290437 290271
52386B90271m56j428k179k062j326o86m13j38N52J539K267K365K224K654L941
$$ 290271 289815 288387 286208 284146 282820 282134 281721 281583 282135 283674 285941 288306 290530 293184 297125
52371B97125N304N679M927L955L559L548L161K172J195R19J246J376P07m91j418
$$ 297125 302429 308108 313035 316990 320549 324097 327258 329430 330625 331544 332790 334166 334873 334382 332964
52356C32964j587j176o48l43m20p16o61K42J639K563K635K569L060L752L820L166
$$ 332964 331377 330201 329553 329210 328790 328074 327413 327655 329294 331857 334492 337061 340121 343873 347693 350859
52340C50859K425K106K401L518N413P359Q523Q934R275R838J0384J0919J1782
$$ 350859 353284 355390 357791 361309 366722 374081 382604 391538 400813 410651 421035 431954 443736
52327D43736J2970J4093J5085J6143J6987J7066J6611J6540J7109J7556J7436
$$ 443736 456706 470799 485884 502027 519014 536080 552691 569231 586340 603896 621332
52316F21332J7247J7322J7098J6127J4891J3878J2774J1390J0569J1017J1904
$$ 621332 638579 655901 672999 689126 704017 717895 730669 742059 752628 763645 775549
52305G75549J1798J0654R670R359R001Q050O943O181N530M574L419K432J614N76
$$ 775549 787347 798001 807671 817030 826031 834081 841024 847205 852735 857309 860728 863160 864774 865350
52291H65350j030l165n273o612o978o879o707o110m754l246k441k098j197M17
$$ 865350 864320 861155 855882 849270 842292 835413 828706 822596 817842 814596 812155 810057 808860 809277
52277H09277J808K528L373N120P357R179J0368J1230J1808J1879J1457J0836J0345
$$ 809277 811085 813613 816986 822106 829463 838642 849010 860240 872048 883927 895384 906220 916565
52264I16565J0320J0925J1767J2074J1600J0824J0059R080P976P596Q341R163
$$ 916565 926885 937810 949577 961651 973251 984075 994134 1003214 1011190 1018786 1027127 1036290
52252A036290Q698P024N407M550M069L462K641J425m51k642m293n115n614o058
$$ 1036290 1044988 1052012 1057419 1061969 1066038 1069500 1072141 1073566 1073115 1070473 1066180 1061065 1055451 1049393
52238A049393o036n447n044n397n909n599m418l192k461k077j711j249p28k76
$$ 1049393 1043357 1037910 1032866 1027469 1021560 1015961 1011543 1008351 1005890 1003813 1002102 1000853 1000125 999849
52224I99849n2Q4N99J668K773L334L590M244N405O424O817O777O723O789O947
$$ 999849 999797 999881 1000480 1002148 1004921 1008255 1011845 1016089 1021494 1027918 1034735 1041512 1048235 1055024 1061971
52209A061971P184P335P152O639O158O008O177O517O867O967O586N903N383N217
$$ 1061971 1069155 1076490 1083642 1090281 1096439 1102447 1108624 1115141 1122008 1128975 1135561 1141464 1146847 1152064
52195A152064N200N200N379N769O040N927N521M937M042K746J276m5j035j608
$$ 1152064 1157264 1162464 1167843 1173612 1179652 1185579 1191100 1196037 1200079 1202825 1204101 1204056 1203021 1201413
52181A201413j869k428l970o238q023q593q521q571q474p629o456n938o057n748
$$ 1201413 1199544 1197116 1193146 1186908 1178885 1170292 1161771 1153200 1144726 1137097 1130641 1124703 1118646 1112898
52167A112898m498k963j872j246j015j382k055j956m79J429K251J676P91O08R57
$$ 1112898 1108400 1105437 1103565 1102319 1101304 1099922 1097867 1095911 1095432 1096861 1099112 1100788 1101579 1102187 1103144
52152A103144R48M6j428k668l087k694j884j057n66p13j321j582q84J76L68m48
$$ 1103144 1104092 1104138 1102710 1100042 1096955 1094261 1092377 1091320 1090754 1090041 1088720 1087138 1086254 1086430 1086798 1086350
52136A086350r07J33K155L823M706N412O452P727R099J0640J2319J3900J5332
$$ 1086350 1085443 1085576 1087731 1091554 1096260 1101672 1108124 1115851 1124950 1135590 1147909 1161809 1177141
52123A177141J6819J8401J9830K0854K1435K1672K1735K1806K1808K1341K0088
$$ 1177141 1193960 1212361 1232191 1253045 1274480 1296152 1317887 1339693 1361501 1382842 1402930
52112A402930J8296J6474J4801J3109J1333R584P850O094M533L481K849K194J266
$$ 1402930 1421226 1437700 1452501 1465610 1476943 1486527 1494377 1500471 1505004 1508485 1511334 1513528 1514794
52099A514794J20j279l082n070o633p462p939q607r533j0393j0962j1231j1268
$$ 1514794 1514914 1513635 1510553 1505483 1498850 1491388 1483449 1474842 1465309 1454916 1443954 1432723 1421455
52086A421455j1143j0933j0551r746q395o714m993l298j548K10J858L501N434
$$ 1421455 1410312 1399379 1388828 1379082 1370687 1363973 1358980 1355682 1354134 1354344 1356202 1359703 1365137
52073A365137P690R765J1037J1447J1594J2033J2665J3024J2983J2836J2698J2264
$$ 1365137 1372827 1382592 1393629 1405076 1416670 1428703 1441368 1454392 1467375 1480211 1492909 1505173
52061A505173J1332J0190R183Q137O610M565K439N80j063k716m443o090p519q831
$$ 1505173 1516505 1526695 1535878 1544015 1550625 1555190 1557629 1558209 1557146 1554430 1549987 1543897 1536378 1527547
52047A527547j0336j2180j4053j5633j7214j9349k1771k3266k3077k1839k0589
$$ 1527547 1517211 1505031 1490978 1475345 1458131 1438782 1417011 1393745 1370668 1348829 1328240
52036A328240j9403j7717j5564j3618j2195j1091j0258r834r505q768p863p547
$$ 1328240 1308837 1291120 1275556 1261938 1249743 1238652 1228394 1218560 1209055 1200287 1192424 1184877
52024A184877p807p710o897o252o656p826q986r903j0602j0715r995r147r264
$$ 1184877 1177070 1169360 1162463 1156211 1149555 1141729 1132743 1122840 1112238 1101523 1091528 1082381 1073117
$$ [...]
##END NTUPLES=NMR SPECTRUM
##END=
