##TITLE=AC1763_NAR_15_9683463_AxI8vZsGHg
##JCAMPDX= 6.0         $$ Bruker NMR JCAMP-DX V2.0
##DATA TYPE= NMR SPECTRUM
##DATA CLASS= NTUPLES
##ORIGIN= BRUKER
##OWNER= Administrator
$$ 1.72 TOPSPIN		Version 2.1
$$ 2016-04-16 17:36:07.611 -0700  Administrator@X
$$ Compression mode = diff/dup
##.OBSERVE FREQUENCY= 400.02188249412
##.OBSERVE NUCLEUS= ^1H
##.ACQUISITION MODE= SIMULTANEOUS (DQD)
##.ACQUISITION SCHEME= undefined
##.AVERAGES= 8
##.DIGITISER RES= 22
##SPECTROMETER/DATA SYSTEM= spect
##.PULSE SEQUENCE= zg30
##.SOLVENT NAME= COFFEE_meoh
##.SHIFT REFERENCE= INTERNAL, COFFEE_meoh, 1, 14.98509
##AUDIT TRAIL= $$ (NUMBER, WHEN, WHO, WHERE, PROCESS, VERSION, WHAT)
$$ ##TITLE= Audit trail, TOPSPIN		Version 2.1
$$ ##JCAMPDX= 5.01
$$ ##ORIGIN= Bruker BioSpin GmbH
$$ ##OWNER= Administrator
$$ $$ E:\/data/COFFEE/nmr/AC1763_NAR_15_9683463_AxI8vZsGHg/10/pdata/1/auditp.txt
$$ ##AUDIT TRAIL=  $$ (NUMBER, WHEN, WHO, WHERE, PROCESS, VERSION, WHAT)
(   1,<2016-04-16 17:36:00.533 -0700>,<Administrator>,<X>,<go>,<TOPSPIN 2.1>,
      <created by zg
	started at 2016-04-16 17:34:54.673 -0700,
	POWCHK enabled, PULCHK disabled,
       configuration hash MD5:
       21 0F 79 D6 B3 7B B4 F6 88 20 88 DB 03 48 BD 9F
       data hash MD5: 64K
       77 3B B5 95 E1 6D 54 50 D4 CD 4C C0 C7 8D 2B 7F>)
(   2,<2016-04-16 17:36:03.626 -0700>,<Administrator>,<X>,<proc1d>,<TOPSPIN 2.1>,
      <Start of raw data processing
       efp LB = 0 FT_mod = 6 PKNL = 1 PHC0 = 0 PHC1 = 0 SI = 32K 
       data hash MD5: 32K
       C4 CC 63 09 74 8B 3D B1 3B A2 2C 89 3A 74 38 C9>)
(   3,<2016-04-16 17:36:03.908 -0700>,<Administrator>,<X>,<proc1d>,<TOPSPIN 2.1>,
      <pk PHC0 = 91.13159 PHC1 = 0 
       data hash MD5: 32K
       30 64 78 59 78 26 6C 8B B1 1A 9C 63 04 D1 17 33>)
(   4,<2016-04-16 17:36:04.033 -0700>,<Administrator>,<X>,<proc1d>,<TOPSPIN 2.1>,
      <abs ABSG = 1 
       data hash MD5: 32K
       4B FC EC DE 68 F5 9D CC 21 9C 12 AD B9 AA C0 7D>)
(   5,<2016-04-16 17:36:04.079 -0700>,<Administrator>,<X>,<proc1d>,<TOPSPIN 2.1>,
      <abs ABSG = 2 
       data hash MD5: 32K
       D1 C5 CD CF FB 70 67 1D E3 0F 1D BD 1E A1 13 5C>)
(   6,<2016-04-16 17:36:04.142 -0700>,<Administrator>,<X>,<proc1d>,<TOPSPIN 2.1>,
      <abs ABSG = 3 
       data hash MD5: 32K
       D1 43 C3 B7 F7 27 53 FA 93 49 5B 10 D1 BF BC A9>)
(   7,<2016-04-16 17:36:04.204 -0700>,<Administrator>,<X>,<proc1d>,<TOPSPIN 2.1>,
      <abs ABSG = 4 
       data hash MD5: 32K
       8F 6A 2B F9 32 56 C6 49 41 3C 58 19 40 4D B9 4C>)
(   8,<2016-04-16 17:36:04.267 -0700>,<Administrator>,<X>,<proc1d>,<TOPSPIN 2.1>,
      <abs ABSG = 5 
       data hash MD5: 32K
       9C 77 26 DB 6B B2 F0 B3 3D AA D3 32 59 5D 78 67>)
$$ ##END=
$$ 
$$ $$ hash MD5
$$ $$ 21 EE 4B 35 26 D1 35 3A CD B4 A2 23 2E 97 5A AB
##$RELAX= 
##$RELAX= 
##$RELAX= 
##$RELAX= 
##$RELAX= 
##$RELAX= 
##$RELAX= 
$$ Bruker specific parameters
$$ --------------------------
##$DU= <E:\>
##$EXPNO= 10
##$NAME= <AC1763_NAR_15_9683463_AxI8vZsGHg>
##$PROCNO= 1
$$ [...]
150 150 150 150 150 150 150 150
##$TP07= 0
##$TPNAME0= <>
##$TPNAME1= <>
##$TPNAME2= <>
##$TPNAME3= <>
##$TPNAME4= <>
##$TPNAME5= <>
##$TPNAME6= <>
##$TPNAME7= <>
##$TPOAL= (0..7)
0.5 0.5 0.5 0.5 0.5 0.5 0.5 0.5
##$TPOFFS= (0..7)
0 0 0 0 0 0 0 0
##$TUNHIN= 0
##$TUNHOUT= 0
##$TUNXOUT= 0
##$USERA1= <user>
##$USERA2= <user>
##$USERA3= <user>
##$USERA4= <user>
##$USERA5= <user>
##$V9= 5
##$VALIST= <valist>
##$VCLIST= <CCCCCCCCCCCCCCC>
##$VD= 0
##$VDLIST= <DDDDDDDDDDDDDDD>
##$VPLIST= <PPPPPPPPPPPPPPP>
##$VTLIST= <TTTTTTTTTTTTTTT>
##$WBST= 2048
##$WBSW= 25
##$XGAIN= (0..3)
0 0 0 0
##$XL= 0
##$YL= 0
##$YMAX_a= 559057
##$YMIN_a= -482313
##$ZGOPTNS= <>
##$ZL1= 120
##$ZL2= 120
##$ZL3= 120
##$ZL4= 120
##$ABSF1= 14.98509
##$ABSF2= -5.573092
##$ABSG= 5
##$ABSL= 3
##$ALPHA= 0
##$AQORDER= 0
##$ASSFAC= 0
##$ASSFACI= 0
##$ASSFACX= 0
##$ASSWID= 0
##$AUNMP= <proc_prof1d_extract_pilot.lims>
##$AXLEFT= 0
##$AXNAME= <>
##$AXNUC= <1H>
##$AXRIGHT= 0
##$AXTYPE= 0
##$AXUNIT= <>
##$AZFE= 0.1
##$AZFW= 0.1
##$BCFW= 0
##$BC_mod= 0
##$BYTORDP= 0
##$COROFFS= 0
##$CY= 15
##$DATMOD= 1
##$DC= 0
##$DFILT= <>
##$DTYPP= 0
##$F1P= 0
##$F2P= 0
##$FCOR= 0.5
##$FTSIZE= 32768
##$FT_mod= 6
##$GAMMA= 0
##$GB= 0
##$INTBC= 1
##$INTSCL= 1
##$ISEN= 128
##$LB= 0
##$LEV0= 0
##$LPBIN= 0
##$MAXI= 10000
##$MC2= 0
##$MEAN= 0
##$ME_mod= 0
##$MI= 0
##$NCOEF= 0
##$NC_proc= -9
##$NLEV= 6
##$NOISF1= 0
##$NOISF2= 0
##$NSP= 0
##$NTH_PI= 0
##$NZP= 0
##$OFFSET= 14.98509
##$PC= 1
##$PHC0= 91.13159
##$PHC1= 0
##$PH_mod= 1
##$PKNL= yes
##$PPARMOD= 0
##$PPDIAG= 0
##$PPIPTYP= 0
##$PPMPNUM= 2147483647
##$PPRESOL= 1
##$PSCAL= 4
##$PSIGN= 0
##$PYNMP= <proc.py>
##$REVERSE= no
##$SF= 400.02
##$SI= 32768
##$SIGF1= 0
##$SIGF2= 0
##$SINO= 400
##$SIOLD= 32768
##$SPECTYP= <>
##$SREGLST= <1H.CDCl3>
##$SSB= 0
##$STSI= 32768
##$STSR= 0
##$SW_p= 8223.68421052631
##$SYMM= 0
##$S_DEV= 0
##$TDeff= 65536
##$TDoff= 0
##$TI= <>
##$TILT= no
##$TM1= 0
##$TM2= 0
##$TOPLEV= 0
##$USERP1= <user>
##$USERP2= <user>
##$USERP3= <user>
##$USERP4= <user>
##$USERP5= <user>
##$WDW= 1
##$XDIM= 32768
##$YMAX_p= 528840485
##$YMIN_p= -1656287
##$CURPLOT= <Network HP LaserJet P1505>
##$CURPRIN= <$Network HP LaserJet P1505>
##$DFORMAT= <normdp>
##$LAYOUT= <+/1D_H.xwp>
##$LFORMAT= <normlp>
##$PFORMAT= <normpl>
##$SURQMSG= 1
$$ End of Bruker specific parameters
$$ ---------------------------------
##NTUPLES= NMR SPECTRUM
##VAR_NAME=  FREQUENCY,     SPECTRUM/REAL,   SPECTRUM/IMAG
##SYMBOL=    X,             R,               I
##VAR_TYPE=  INDEPENDENT,   DEPENDENT,       DEPENDENT
##VAR_FORM=  AFFN,          ASDF,            ASDF
##VAR_DIM=   32768,         32768,           32768
##UNITS=     HZ,            ARBITRARY UNITS, ARBITRARY UNITS
##FACTOR=    0.250966925370066, 1,           1
##FIRST=     8223.43324360094, -187891,      -206612
##LAST=      0,             -226590,         -123559
##MIN=       0,             -1656287,        0
##MAX=       8223.43324360094, 528840485,    0
$$ Real data points
##PAGE= N=1
##DATA TABLE= (X++(R..R)), XYDATA
$$ [...]
23514 -102588 616224 203799 51778 85818 492793 -76945 18631 -243188 374594 -56138
23503 -193929 121951 -159491 84512 -120111 509605 -154509 170255 -462746 541965 546725
23493 546725 -184162 -42155 -526436 350360 -124110 -341767 -157778 695616 278003 -160223
23482 -470850 -545644 -384980 -182195 8571 33287 89884 -767140 321875 183709 71080 86803
23471 86803 176182 -132755 -434611 547966 -465630 -151413 266471 111005 -332757 283204
23460 58922 -473874 90988 -378536 -43934 56130 -333653 -140306 -472889 -10267 30492 7220
23448 130393 512138 -248740 -79695 388672 151445 521411 476421 -100505 -292569 150247
23437 -168392 -555609 -414593 192473 54003 -406092 506087 246974 -187851 235245 -492517
23426 661812 -8739 329152 237609 -224796 453131 -111115 -285310 246472 211715 -492727
23415 20790 581199 -387400 583938 423408 234432 -372248 42255 -172320 -620240 -328342
23405 -328342 221493 117860 237299 -73171 22930 -86769 134316 -330522 -654670 -51574
23394 163807 -622226 298150 -531674 108939 -41199 125125 -1030913 -122198 -212059 43742
23383 -453394 -313820 -26259 275581 -82147 582885 68673 -118602 143739 -56385 -358333
23373 -358333 456415 -628765 -103451 -256416 -228150 -576848 11564 385365 -81979 223094
23362 217550 127204 -183336 412500 -173512 1474 260110 9711 -9608 181885 -423054 -53103
23350 25375 -281143 213757 202901 -213129 -7732 -91016 139965 429077 -252194 -422 -703696
23339 -703696 -245594 621378 139207 33035 371749 446923 233637 198869 -544314 -81380
23328 195640 385109 -203059 -212022 -173014 347427 133902 -233693 -322456 -549218 -382512
23318 -382512 -17800 302795 113868 245208 637801 -431349 172519 -129922 542051 -219645
23307 -105911 287490 -115923 -281849 -70487 235927 -340587 190598 -20444 -266397 263867
23296 473610 124132 -381729 -318257 132025 -323367 94151 501845 86143 588236 310512
23286 310512 -538242 -196655 139926 -166752 142824 90823 268953 43653 -534712 -454378
23276 -454378 -84963 -85857 66702 -104242 -373821 -197247 -701931 -315350 345627 -120051
23265 -111727 -26178 -394403 173324 490490 503082 780110 -90203 -332743 -443447 299329
23254 501655 94953 -323099 -349975 41994 -394520 213761 16038 -684884 464259 -353161
23243 239782 -884933 349114 -299751 91835 -281202 -55422 -9734 125893 141280 -104346
23232 -10329 129473 -176075 -42268 489423 -183092 190858 405103 -113466 -94133 135434
23221 -184522 223636 -253085 -119577 -31069 284059 385718 20815 374602 -314855 562401
23210 213775 -225690 -336324 104686 -141296 -385387 -316632 694441 -124933 -236072 -75858
23199 -89547 81890 -536794 -452862 -603307 -68644 146512 355296 -152763 -363371 -375543
23189 -375543 18574 82845 -200925 59621 129156 185697 845230 -123026 505873 -316714
23178 -356841 -310428 -64285 2423 -3360 -83460 -198465 -198324 188143 -574788 -350981 -272546
23167 -272546 175279 479779 -292782 -254357 -30500 247006 -229257 82750 216486 -357686
23156 -182298 -317438 667364 309225 -51082 110181 244665 -87071 68326 629 -4844 60227
23144 -151307 40315 224945 -328769 112125 -238162 83329 303874 -269360 459366 551482
23134 551482 -122323 -39340 -813048 -469246 10099 230095 -146778 54055 81323 153954
23124 153954 102446 -427496 460461 214780 121209 603796 -66035 -185038 140019 216990
23114 216990 97656 -36636 324563 398077 -514825 -1036809 -325849 168421 -826574 88807
23103 182445 184117 499715 41484 65866 -219067 -243832 37411 -179803 346862 23914 -23574
23091 -228683 52425 -439376 -228144 190834 -1001916 -5945 367970 732535 468428 273609
23081 273609 247137 -120801 475503 -413272 70481 -82688 238635 161662 317344 184881
23071 184881 93339 -284520 -210597 -12140 417697 307183 -132433 -8968 -212256 527342
23060 -230361 -189282 677528 -226453 33220 -70424 145198 -471601 228016 -86616 25854
23049 -762751 -107046 -297561 -395906 -349358 -176003 -56807 505549 260130 84309 -367673
23038 -52638 -309915 117615 158162 -325700 449568 -529897 -57577 -243455 -334797 200375
23027 902163 541741 -134863 -408137 -356383 332962 -572120 234513 -96106 172282 -12171
23016 -832333 137146 89759 -375951 -581061 229278 -39846 636609 178424 -148670 -48838
23005 14308 -33146 352031 58783 -53202 -212723 -231771 134034 210477 307132 276360 -313548
22993 -709949 -457446 225620 -37068 16874 -184711 195722 -255865 -133931 -393384 353860
22982 -654797 -192967 558875 -438549 -99522 261173 344459 -110028 -135450 163248 -586775
22971 703108 413953 -284438 -32999 64499 -373924 174833 -688947 -191198 -133460 5175
22960 -207649 -364002 74121 -248000 -1108683 36874 -96119 -19097 -187307 697897 -86210
22949 -459707 80675 -201686 -479559 -46672 -691362 -167300 143620 -421009 -173077 -118186
22939 -118186 -62729 192906 929 190355 257810 204675 -238075 -29187 7846 -157368 -456283
22928 -456283 -497769 320151 -258629 -279367 -25258 -43198 -315125 -259766 -141054 -230551 381
22916 -280519 283992 342830 181173 196011 -26305 -384241 -786517 300959 -416996 496508
22905 -256395 -316076 -327367 257216 -244519 264958 -271135 -583212 543703 933566 -74327
22894 368278 -148583 28528 98091 -903671 -126016 -320141 173974 -212191 -750103 -11407
22883 -620399 84447 -302494 -355840 275492 74168 225016 -71383 -168885 163200 -251010
22872 -262877 722037 176741 279315 -6605 92901 -122228 -540119 186104 -153987 169845
22861 -209452 191714 168285 -294455 73182 -63941 -577967 -114719 -38239 -1189282 36050
22850 -309324 112833 416070 583266 -298290 166140 290850 -109486 -456537 -4368 29591
22839 128586 -43358 -234674 150231 209209 -178622 1255329 -500780 613730 267182 -251115
22828 373023 -519723 -126109 -20383 71325 80281 79457 283147 -130836 302004 -255734 198729
22816 633603 99736 -41867 271944 -126855 171239 2746 -28406 166021 -690039 257508
22805 -370693 -487686 -327733 -109437 -271367 -383967 -229519 185536 -113801 464113 164517
22794 -317288 322029 -109374 44960 -65568 -325341 -63019 58515 -100800 -204640 60871
22783 -136853 -401964 90742 94331 92146 3313 -150139 -51708 19737 -30861 123095 429685
22772 429685 -448756 96434 -463566 -445103 134575 -132277 198929 -59261 355815 -552647
22761 -116615 20639 125323 -4138 65132 -452042 -38830 -170183 -29508 50339 23532 -285664
22749 -154753 -117655 -8254 330109 -53764 -598385 11047 58105 -116887 305974 372757 -96286
22737 477186 366134 -587505 -722452 -455035 -60921 -496395 -165626 -301817 533745 362024
22727 362024 -646016 984631 -53194 -334456 -84048 199206 -383092 1535 -129574 177336
22716 317529 173874 24927 393021 -199195 -510438 -711214 -280406 703510 -118494 76249
22705 -458328 -510522 -129761 -282882 109558 -637799 417982 -222601 -361362 69681 239894
22695 239894 276229 -340924 -38012 473831 -228812 -93894 -126721 -62254 140271 793776
22685 793776 12426 63939 582776 -338690 304450 480862 -662131 -90448 70776 -216789
22674 68407 208619 272472 -169039 -402717 515544 -217166 -53678 273491 232821 -435428
22663 296072 -153526 -256411 -5412 -218340 107964 -140667 -158584 91412 165509 -739494
22652 -508676 -185933 73965 -58616 -372731 241462 -19695 357196 146607 -99899 -682277
22642 -682277 73511 -261714 98036 -295471 -258025 712556 -58777 -514671 -224227 -356110
22632 -356110 1484 -96768 -48532 91752 825200 173804 399235 -1656287 -783460 -148448
22621 56004 -495316 724609 -426346 -115438 99182 406023 186067 -315508 440833 -86282
22610 1341 -171596 505286 -498344 393342 -221241 234878 -426402 -286796 153993 19342
22599 388787 167128 -449935 -390838 300428 388748 48649 -271941 -69793 -214423 241204
22588 -137084 -471359 688154 -153143 404425 373980 13456 -425660 245520 -47784 -133873
22578 -133873 475305 -280226 -280303 121551 -358922 -185434 510364 -49656 -326198 172555
22567 -77097 200443 234964 -705606 -23617 -165831 -229089 -412557 -258196 771 93888 -764865
22555 -107271 -209604 -418244 -478690 -313020 -43824 -437360 -363873 -39343 -225919 394534
22544 167410 -64542 -161970 -554871 -39124 -120254 326925 -298837 -344285 -264192 170325 125776
22533 125776 125566 -146096 22420 -425443 83078 404753 -201173 -120648 87248 -335158 93653
22521 67269 -58707 340012 251778 -74530 -857269 -284828 117962 175908 -65838 -310093 645642
22509 31611 -78410 -363092 -393255 -638026 -63078 176132 384734 -47701 223648 -91657 96425
22497 -307512 -132221 -95335 -447061 201164 -117274 -7228 -415947 -480440 -20363 575555
22486 -101171 198296 128463 3235 -431236 292181 -165717 -82580 132819 -291004 170819
22475 -631742 -617514 100446 -245201 164046 208451 399351 -61975 -448209 -16874 604136
22464 -34644 137615 813358 -198967 149216 493597 -136178 252696 192494 -373142 -316462
22454 -316462 518010 -543793 42600 -394598 -121241 -409773 112636 -46330 -499011 4714
22443 41065 -371644 22441 -533181 -76492 23922 131997 343435 206075 296655 227836 -290783
22431 -432253 -213148 345898 -228976 -328592 6169 113152 197319 -31520 244061 -253009
22420 -314838 -837255 -134148 -18473 47784 -105613 -151844 38481 -174064 198376 -145243
22409 67023 -1058699 -287454 -260463 1180266 -332147 -419166 -567591 352686 225489 -720500
22398 5135 587040 -200037 -346466 -93382 -782267 -538905 -625943 295389 -4535 -672307 370638
22386 408115 -302305 161146 -110779 -491582 -333629 -5449 -377037 -420246 15906 -525806
22375 114498 -428907 -143979 468022 -614660 -670231 -521301 -297509 -47095 328722 53694
22364 -271022 -769414 -291584 52943 -140975 135931 -128095 662251 -382973 299522 -107751
22353 126345 9758 124563 306771 -178740 375381 161983 -964684 495531 159380 -359213
22342 373943 3371 -950735 378343 -525951 505080 73592 16338 -642008 -208259 488839
22331 -177239 366829 -206158 119079 262359 -402691 -239795 621094 -282931 200022 -322723
22320 -293646 -20872 -572826 334033 -340235 515672 -774636 -113146 419725 297623 -223358
22309 457856 -502451 -447067 -109421 569670 492962 -336094 333761 -71116 -220017 -368974
22299 -368974 -306498 -417024 -383793 102983 -244447 -381036 -6583 308277 315236 -124341 -664999
22288 -664999 122629 -204511 -468552 -176748 -276938 -282997 -171261 192273 416777 187633
22277 667 -331201 -244851 -106083 87501 117621 9294 42008 467119 -36819 -263115 -176881
22266 -176881 381990 -592280 209379 -26014 -75077 51821 648548 64733 -20878 558311
22255 238763 -468822 28889 103488 22093 -298419 81240 143984 -377133 335246 -465741
22244 782770 -180569 240150 195674 -314151 -311740 94215 -98974 -477712 59831 -53394 -142397
22233 -142397 375684 401620 -353591 156161 -309011 -88162 377978 -80095 -2692 456898
22222 161261 -261584 105339 -298439 -342264 228031 312264 -807340 -388502 -545184 58240
22211 -358669 -575069 -422330 -83643 -377084 -230792 -255380 -641858 -495763 -261531 33952
22200 337050 -617353 191066 -36337 -252708 -92883 -498392 -97955 760379 62911 613099
22190 613099 -198786 -236330 -70714 187275 41753 -184818 -436632 -225734 9400 -409031
22179 466217 -416717 -178614 -618574 -145391 -233387 1241 -74861 122638 207167 252975 621037
22168 621037 -309020 -805520 -439718 247756 -270153 196751 237264 432522 83060 506895
22158 506895 49323 -80272 181741 -320905 -365494 -708760 403338 250279 -56611 155000
22147 54910 -981013 560270 -121932 -73268 -844584 -379232 -227962 451601 -620289 -608323
22137 -608323 41100 -162543 55505 -540634 142737 -429286 -28298 -218270 -302732 59217
22126 47637 314337 -431322 133448 -22209 -736407 -225715 -167543 -102609 -63945 -124677 -667956
22115 -667956 38503 251310 115625 -312120 -252764 123434 -223180 -410436 156950 15885
22104 163453 -406580 -359674 -6893 -193447 -30607 -72749 -545188 -163447 -595548 285559
22093 507311 -580630 -749787 -295623 -442525 186950 346786 128504 301857 -106531 206210
22082 -313720 135491 -318452 -234759 126882 -440246 -59761 -156313 125973 -289214 -484931
22072 -484931 722115 -374689 216133 -443261 58134 -319204 -8775 -155886 414730 -231428
22061 -402038 211481 -71913 -351614 631105 -519308 -280803 -91480 -117206 -249989 -115554
22050 458586 77511 10938 -55047 262800 -33071 -32787 90177 18375 -403907 -431567 -770405
22039 -770405 -148699 -14351 -309846 9434 -301853 380514 -71885 86117 255613 209151 -163472
22027 -30406 -516291 -114085 -541294 -52653 185486 -602343 91432 -74105 -377106 -243603
22017 -243603 -388826 -300255 -656757 -479039 -321101 218165 -118490 -248758 -285680 231560
22006 -45444 142644 -38100 448547 228988 48118 -12809 497314 -312176 425426 -86705
21995 220345 89364 505981 -399113 184276 -276683 348983 77257 -98297 -444381 -59315
21984 357639 -387946 -72651 396270 137569 287593 -115504 -281552 -252529 -208171 117878
21973 53771 -538349 104571 251041 356713 -527442 -484321 636660 171992 -608106 -430980
21963 -430980 -344191 137770 202662 112123 -357699 -292802 324269 -193125 46155 -180268
21952 253172 -56975 -207818 -88988 -411621 -406711 -175880 51318 379874 -477370 -34154 303682
21940 -288821 -20011 -494173 34400 -423154 -286223 -604402 -248292 -109692 -315459 100936
21929 -439583 140886 -33457 -152528 540691 -303853 -148723 -169151 548026 -179718 -133746
21919 -133746 -316962 -242057 -113343 -49366 -554890 -6330 -14107 274801 -243622 -467159 315226
21907 -3618 -204173 -117407 -398490 134610 -542602 952142 192432 163851 -520038 -309994
21897 -309994 -617633 -117262 -165548 167954 -680814 -452528 96413 -123127 -385687 -165403
21886 266058 281181 -58518 306071 313433 362475 -222270 124824 -397177 202314 -445691
21875 -88998 370208 420755 -504124 -186795 -118238 -547371 -7273 -260280 -37954 158308 104716
21864 104716 -791850 -109330 -410668 175560 85249 -253000 122524 -64146 -376053 524115
21853 557653 -176747 -414292 840981 790586 -440649 -372615 -581723 -576788 621960 384981
21843 384981 -42432 1954 36400 749164 58318 -174360 279201 -186972 219905 -142027
21832 -156075 326975 405853 -318236 -209914 -395189 -163100 -209717 -279497 -130218 -465657
21822 -465657 427447 126231 280420 29109 40730 -276315 -138089 394242 -510343 -73371
21811 84490 -48783 -317326 498739 70449 -202877 -328719 -411150 -302497 343402 277179
21801 277179 -106761 -188550 -294696 -1204550 342140 889831 -310284 -159371 -641956 339541
21790 329869 -283197 158731 -290506 4358 -182488 98647 -342156 -537657 19076 -338086
21779 502649 -19874 -435211 -134574 -369258 377009 110270 -128253 -378001 5465 -377053
21768 -25076 -592207 147620 -729235 -271806 -232437 -411731 204193 395044 43954 -62658
21757 -431511 -32373 359447 -159553 -265460 59588 168759 -292 624561 344440 -324005
21746 -86101 471983 196927 62539 -352988 -488707 582418 -83759 -14217 -533694 135385
21735 556230 -136480 284551 264165 379664 397212 -429855 195590 -213233 -447503 -349902
21725 -349902 -76244 -220822 151141 -61661 -169245 -365297 131414 -145669 -174532 -960395
21715 -960395 192871 74350 -590472 46983 -93869 59143 39912 147929 -210872 -319594
21705 -319594 -257665 -262621 -112954 -420849 45670 -295364 -77 -22668 -199575 -538191 -327364
21694 -327364 355809 331247 -345170 -251282 -217975 -62013 171993 -74934 -496492 -148135
21683 -93213 -25897 81640 22421 -347610 5162 180055 -66884 133592 101160 -322702 -58754
21671 40128 42162 111052 299514 9349 82429 -136456 -642639 121408 -266003 313862 83655
21659 -272094 -256430 -434692 123274 -708194 -675061 -278656 -287647 -49912 45926 -222553 259882
21647 -10741 584448 -378839 233949 -190218 -180503 127653 -124480 -422192 220177 -262142
21636 -225490 226329 -369768 -181544 -292093 553860 -238187 236428 76638 -969 -588821
21626 -588821 264761 -409700 -146489 474536 -100147 39140 -411765 -123111 -155407 -105423
21616 -105423 187924 -280510 -41620 473877 -14111 -217850 -78967 124678 56722 -748097
21605 475967 -70753 377420 -887812 -365454 122770 -587115 -428499 70975 -208470 -112761
21595 -112761 -114665 -449674 367867 -455811 119488 -192922 -280716 162005 -84219 -137789
21585 -137789 -68253 -132404 -21214 -569827 58786 308096 -178369 300968 -679411 -717670
21575 -717670 -216411 -224072 217335 -71518 -456679 107591 331149 152864 -656028 -275562
21564 -508681 -27930 -71774 -488593 113818 321972 55606 375098 -335638 -318142 -32340
21553 545284 -59794 -28796 -206781 3822 -226392 -233754 349290 641796 -408637 -8616 231323
21541 -349856 353809 527441 -93547 -302193 65002 326794 -373333 -415353 172888 -191856
21530 147085 -124539 -54218 382164 354161 70711 104868 442004 -791 301494 -423365 587187
21518 152541 251193 -532305 637683 157151 90539 628966 -273214 -361879 -276796 -295035
21508 -295035 -444123 -323055 -270407 27228 -159063 15503 -64720 418364 404342 488805 -272883
21496 349985 -304155 -88735 -669800 -209794 174391 -55227 -256296 384882 343602 216161
21486 216161 -53303 574985 370889 28815 -756163 129939 -97067 481689 -290671 -118643
21475 -343984 -49455 43461 -388391 -460252 11870 -424613 14999 -141401 73957 -283942 112864
21463 -325934 65357 108571 -729692 91966 -89453 98082 -183566 -440438 -389438 -58953 -215056
21452 -215056 60770 75512 -249315 -218274 -405465 -63000 122365 140264 149894 451560 485012
21441 485012 -298536 139901 56422 -722541 358879 56940 80242 64394 281482 118925
21430 -315301 396931 -183202 -62496 -648923 224540 -3062 -106652 106999 314047 251468
21420 251468 314552 146182 -426712 -246156 -124647 147898 534478 -86353 102963 -865630
21409 -443439 -487270 -148647 -197413 202444 80040 -358663 -9876 -251850 -58608 179638 -75403
21397 172266 -55329 -163888 -662964 -293664 -47812 -506668 91499 -1063268 14322 -56332
21386 -880695 -125818 -162908 -397331 -201761 225901 -481062 60264 -179079 85685 -267614
21375 -292424 -169662 -138319 -298337 -34601 -521575 -281996 -255863 12275 363146 -149003
21364 -6580 266969 -466030 272178 -498123 18685 -172415 -338321 -164134 229448 -25669
21353 137336 328062 -430243 361651 -455754 -413026 96394 -144047 -84997 361476 169234
21342 389301 -87981 471356 -180402 46980 -140092 -18665 -171715 -452351 -6282 -242249
21332 -242249 254680 61471 -215264 66520 -475087 474475 -189097 184040 371736 711518
21322 711518 243634 -483728 -27551 -7054 75810 -313956 116434 184787 -279101 220091
21311 -248899 -372601 339089 -263028 -419170 145440 -143800 -107563 172568 -92501 -475896
21301 -475896 -351593 47947 -3078 -349768 -3557 -335191 -290539 -36770 -700300 -92487 -227903
21290 -227903 512501 377909 -587315 -144218 -115479 392642 -301298 87175 183987 -357746
21279 -277036 -262838 191967 -450337 -192592 355543 748318 -430453 157971 83981 278287
21269 278287 -307366 177239 -290618 5338 123647 -106105 289703 287641 -460461 -524792
21259 -524792 -415827 325294 -406780 -24764 224820 379304 362027 -355970 -96081 -140685
21249 -140685 -32524 -664203 2571 -759184 -653746 -426191 -171539 81705 -302183 -413894
21239 -413894 -96270 -106512 264809 -157853 59334 21982 176947 63766 79869 -280894 -859223
21228 -859223 -162549 319883 -220866 138930 -348797 17399 -365187 106633 -483308 196036
21217 -686151 -145439 178920 8916 -150841 -392125 -132453 -40052 270665 -555877 317883
21206 -314681 354892 -321105 -228924 -95774 223865 578145 74908 123261 -51809 136083
21195 -285839 -165104 -257730 49724 -411788 -343453 60655 -29445 -275182 624433 -52888 194848
21183 -271184 878 91764 182158 -413863 445849 539372 292347 1237522 83024 -341749 -243721
21172 -243721 -167126 275589 -337757 -261395 -981008 311946 -730733 -206505 -337402 -252902
21162 -252902 -350649 119786 52987 -658692 -437826 155388 108345 157996 175475 134415 -311234
21150 -224095 -54137 -749248 184112 -397702 -154666 -566949 98267 -473907 -22263 475435
21139 138096 -846685 157947 129399 -195233 351020 -280052 -341371 39790 93214 3662 -1317
21127 430681 -443164 -182176 -357919 110820 -28159 -280375 -170553 -403430 382449 -403311
21116 -602120 246652 669993 -181815 199668 -304202 -573012 316961 -224750 128456 -155612
21105 -325363 -683409 104455 -858408 124370 -352330 -546967 -324213 224827 633349 222353
21094 25011 30391 308487 106726 -598031 89621 129295 -785461 47217 -308574 254345 -82081
21082 60485 -86155 -711412 -428273 205324 498675 -96441 184388 251886 -7029 -352808 -127929
21070 34003 302904 24344 155896 283142 318816 -85608 -149957 -290242 240904 485685
21060 485685 663742 215390 229134 -272091 -471991 129360 377008 63656 -455959 -384428
21050 -384428 965463 40079 -164467 -245977 -213426 -34973 -293819 -114184 305970 5316 -350934
21038 164523 179814 -51771 -149738 -550684 -597432 -24968 481599 372402 115997 81364 194927
21027 194927 -215867 -474635 -407056 203994 -348134 -672684 354978 346182 -526881 -440497
21017 -440497 -345244 -320881 -52845 -452890 287960 33553 277564 -135054 201204 104283
21007 104283 -3168 1728 11305 474495 -262180 -523272 -332782 -58350 -148001 -295178 -219537
20996 -219537 -11725 344576 -413527 -681883 -48493 -544554 146047 85029 -366769 -57888
20985 -237851 -481659 -500209 -611373 -291807 -29187 -270070 46536 -190741 -252582 -113124
20974 -94253 -167611 381496 48629 79419 122663 -501809 88810 -394947 50035 -438065 -192820
20962 -84778 51705 -380137 175533 -10377 81057 176733 272901 -26230 146908 -223171 322207
20950 327099 335722 -151885 346734 258203 -677983 -253596 -471468 -186090 -286165 166206
20939 546053 -573123 -213542 180627 615189 -643018 153969 216301 61220 80639 -418629
20928 188710 -384439 -243147 -1479 -484261 -122654 186341 141416 17267 40978 582862
20918 582862 -179499 61386 -638880 214408 -190559 -61080 -342211 -493807 -149266 -203485
20908 -203485 157541 -404837 -621047 122145 694775 527795 245748 153757 -158223 -815263
20898 -815263 137167 -123221 -379299 360016 256698 -134907 342378 -182483 261407 -483144
20887 -348719 -110204 -271495 -156027 -48718 -130374 295670 -668067 82585 -394313 -390836
20877 -390836 -480655 -201687 -582428 -186516 666208 -394406 -463604 48620 -172467 20588
20866 692254 -339784 51890 -271665 -290892 -293870 555181 40263 38837 -275363 241122 -266288
20854 -131722 -43084 -372540 59149 -97386 -68802 567499 -796024 745519 32923 31606 51282
20843 51282 235503 -328328 358144 306271 278653 -233464 -51392 117523 234564 456311
20833 456311 -137106 475748 -890397 486518 383833 -735883 -321071 -113294 -258624 -271946
20823 -271946 -572328 95291 -69849 -749862 152558 115168 181930 80567 -286100 -86246 -76511
20812 -76511 -410873 44950 -508851 257060 170509 274784 283291 -256174 112474 -201044
20801 396686 221707 -165718 155966 -260500 -476152 -233711 620665 -21413 2190 277848
20791 277848 382878 206475 203529 -362231 -112705 -275788 -40174 258086 279970 -83608
20780 -167687 246504 -189099 -255143 208729 -295975 -8278 -28135 -567658 -371050 562363
20769 -329931 -185629 -337208 11816 420507 -40565 -95666 -626959 231649 -111522 -151832
20759 -151832 16074 -300265 -397021 -155023 -35962 -256431 44814 8926 407941 -844599 60972
20747 -170508 -423664 535232 -253923 -106851 -29171 -525313 387473 -705194 45095 918877
20737 918877 135282 -367583 367451 23339 -255768 -85692 220769 -195446 128682 243629
20727 243629 -750828 -303878 23021 -547133 -229384 -301319 343338 61909 -835734 -561444
20717 -561444 -24521 -418450 -149041 -24254 87780 213800 207164 357627 48870 -97913 -50396
20706 -50396 -194014 -260952 -121692 224142 188022 299505 -481531 -525747 -103579 -454120
20696 -454120 -46989 -512162 20607 -648491 -588996 284731 -714138 -76153 94769 758031
20686 758031 142343 -710737 448861 -365483 177931 -327937 -428091 220581 179141 24998
20675 380546 -56609 -189063 -211120 67796 -581222 -719080 -419681 18854 128653 -196153
20664 94300 -7185 164579 165702 -482569 -140939 -99752 297424 -231775 -1190358 174016 353653
20653 353653 -253727 -186207 -47688 26304 29812 -278106 112854 -202753 158382 332670
20643 332670 -144165 -242366 94435 -234323 275099 -572610 329213 275114 30317 -297981
20632 -458104 -48033 -676733 -283931 -1103592 -442776 -81849 -179356 149607 -557740 402859
20621 457393 -400892 -243313 103754 105009 -82789 -113442 -745293 83402 -66161 -681743 -92864
20609 114127 258790 277574 601165 239566 -94624 52248 -301069 124876 -544217 330844
20598 -404 49514 614519 364797 891626 -506227 127484 -263961 127578 -42040 -114775 342153
20586 537116 -545456 -442738 -49085 -1270 -462595 246238 301125 291707 182516 -891834 463527
20574 -264820 -309742 632904 467954 269475 -520594 202120 237200 -72598 -78245 123169
20563 -139689 -173971 -793598 -229411 -141364 120 213711 -357840 34423 240852 -223388 -345213
20552 -345213 -371474 -277541 -134594 174715 417127 147987 -66471 -80218 -12260 -373161
20542 -373161 -254112 54526 -192958 -135589 15313 -183764 -424281 -397086 248832 336781
20532 336781 204112 -192248 -321451 -118645 475092 -150602 135628 -423781 370829 -546574
20521 85861 418935 116720 -262216 -235369 -275940 -51524 -126677 -25562 -311828 399562 -139828
20509 435014 249291 304787 -754925 -639147 -374917 -196250 -78848 565216 3305 -280104
20498 -159266 78810 -539931 -163654 -300651 -316116 -10316 43070 48588 -630946 -57074 -305214
20487 -305214 -155826 -447780 653931 336287 255820 -187478 -91754 -311898 351155 -388714
20476 -164364 21428 4615 -289454 190077 -132948 6095 -22753 417322 125299 -155482 291981
20464 -251981 165483 375518 515198 -79391 -126646 -383619 -263755 222843 -157476 -459202
20454 -459202 48881 -180663 -229598 -380513 -78520 174525 147143 -217658 -760263 -96163
20443 -180501 -458385 -219489 -194929 -494127 -105208 480395 84139 -104398 136047 -75389
20432 -167780 -341419 -401821 -203556 258847 44945 -665343 157251 -146821 363419 198933
20422 198933 -125921 -78596 133419 432229 -396816 -159183 -554200 -161549 -51103 657781
20411 -466706 -236197 -218406 -305070 492149 67540 -464030 -315855 -558688 59694 140428
20401 140428 206499 -800720 -3691 -42960 357555 476877 -669205 45456 -45978 87472 251030
20390 251030 38906 233758 -28811 -78728 -70830 -354466 6074 -289060 -339731 -630847 -497391
20379 -497391 -502039 -166510 186364 -671001 -433509 -43481 45597 -254923 -249214 174295 -32507
20367 -80280 -227183 -874398 -677608 -91952 1098564 -253263 180375 120562 -365720 -38517
20356 101121 -157470 -253094 565596 233019 -66283 -557751 -619939 39173 -470672 339285
20345 336041 -695656 -584396 -278587 -517737 -673864 58445 122651 -226062 501769 -439453
20334 -244727 -153769 -180490 -313258 -449927 -650894 -348433 -385352 160904 -219699 -354452
20324 -354452 -500256 77813 -545317 272373 -526653 -60723 -552243 219849 -107582 -692403
20314 -692403 572155 -57494 547906 -69709 -276886 111361 34505 338621 132652 180558
20304 180558 -764284 -641108 -179764 4734 -215239 41855 -191767 420497 -337155 -316763
20294 -316763 -301397 123929 -478454 -824816 371715 -139223 1064 -611119 794437 -302620
20283 -78368 -624108 -384873 -155071 -37131 267751 -320920 13615 -579730 230655 41540
20272 -394082 470157 -653064 -141295 -707220 -3353 -419280 -352349 -410183 -576148 -708341
20262 -708341 130438 -84681 -421269 -78466 -211376 40927 -310090 354783 -485839 21119
20251 199169 25590 246919 53245 -205055 -217103 -102344 -688837 -156062 179634 -112495
20240 -412575 260215 -36428 138179 325477 -255317 -26305 -1178403 -210596 487302 165364
20229 -713321 -200923 -212900 550044 -220930 -118268 -163350 -601205 -174798 -95235 111167
20218 -508330 -312978 -39806 -135826 -102569 -92674 -43839 -606602 323365 489955 30386 -41817
20206 -15265 -776054 258321 357465 -220715 -288511 158622 191454 -122715 -567582 -219629
20195 186129 116540 -273551 419886 -512206 304855 749133 -640823 -444902 -9411 -421593
20185 -421593 -41295 597546 275459 -484743 53258 349838 -153932 -79735 -131623 35666
20174 -318821 521010 385358 -102214 -426263 -253832 -536822 236709 -17774 108546 -808472
20163 -150705 -319773 94952 -151204 159390 -190734 -456174 246514 25292 582871 25109
20152 -263737 43082 561305 -51469 224221 159875 243804 107472 460314 -12969 60632 -298536
20140 154135 -478356 -715793 52805 95581 -88232 169170 -325560 163144 -596665 56634
20129 -318421 143679 66969 -268747 -676791 312111 -59834 260974 -492708 -266841 373131
20118 168139 165338 -519770 -158474 -309036 285870 -189219 -180313 -426024 112351 370522
20108 370522 -408156 -47880 670997 76557 -520653 -64257 -385499 -117056 -230911 76202
20097 166399 -694450 492759 -32049 -596367 30775 231719 437760 -99035 -223078 323912
20086 -189707 173870 98442 -90798 73868 614265 -838891 -424904 -232691 -240253 -121602
20076 -121602 -131929 121328 -424342 219642 -59872 457326 -154271 -352051 -29166 -247798
20066 -247798 -94421 324636 -77935 164386 -420462 -941166 114899 85173 243798 25906
20055 -383664 176327 503977 -126792 -348173 -747849 -447733 -365733 152844 -550271 154039
20044 218009 384973 -6791 98602 27849 -377717 -78559 -466855 -497265 -449534 78034 370424
20033 370424 -246119 -30142 243521 294211 -173554 225932 -182649 -158768 -375954 322837
20022 -369608 -422174 -310955 146715 358918 -340407 -38008 337656 -147503 -299337 -286551
20012 -286551 -881830 409814 -438868 -765987 -342453 760415 -78861 120856 233899 -51722
20001 -401907 322047 345535 -473996 141929 363753 -462179 26964 -325884 -99489 -510806
19991 -510806 -567562 511291 421784 398869 368252 -195154 -610457 53987 -135973 -136503 254268
19979 -238779 294624 -200521 -477507 260941 668 -111938 -473354 5963 152522 -38709 147285
19967 -183644 49926 -257019 -130282 -440774 362823 -762741 -116300 -483922 -10072 -7899
19957 -7899 -351503 -121616 -458422 -1585 -10035 -415249 11890 -496916 62346 -38609 -256011
19946 -256011 79800 317927 227523 -346242 -208781 60272 -297703 -285560 -123285 -282600
19936 -282600 -83523 -4341 -302098 -391354 -279324 -214890 -315112 -314101 -103001 -490736 254054
19924 -15600 -412924 -351865 -376710 51689 118374 -268360 -398452 -224089 -95853 -72197 -275798
19913 -275798 174234 -51371 -859606 95913 46138 -111655 -195730 301693 183263 112226
19903 112226 -320884 -65497 -345499 605690 88273 160386 -90331 -368616 165636 -357640
19892 -201753 73879 -612383 -660502 -725676 678408 128527 -134008 -456841 -331240 -143510
19881 -55687 170508 -193552 -345770 -503862 76375 48389 -148781 -319365 590011 -678319
19870 585873 425721 -53802 -282809 -227128 -363789 -50754 352780 -118777 -474004 -701374
19860 -701374 -553467 -344041 -595243 -130987 -389480 189684 604687 -56554 -341229 -229189
19850 -229189 121644 -369194 -167406 -123365 740708 406668 -569587 -332448 -214544 -480857
19840 -480857 -1049070 -766934 23490 -10429 593227 240632 79622 -232796 -690906 -335838
19829 365003 -280610 -42954 14323 -440809 -59462 363723 218906 -645727 -339119 -398089
19819 -398089 25071 -415850 -217949 292946 496772 -677543 62827 226087 103524 221138
19809 221138 118511 -15024 406862 -259460 -294775 247672 -163975 -166297 -11805 283672
19798 393160 -103668 74473 -474508 364282 433052 297018 -611300 -25163 -274846 -385808
19788 -385808 -530504 -125711 -364383 934105 -280120 -103062 -523162 -10981 -257285 63394
19777 -564450 -983038 -351397 -210459 -393610 -217138 -491010 -16355 490 -691681 -172762
19766 37350 -80670 -389847 -294865 23640 473731 -1052361 -75891 -42407 -259811 -246723 542036
19754 -86809 -621950 -1011147 -329161 109707 535372 -52123 -126977 -123507 -340745 261551
19743 1976 -449132 75187 99150 -808488 148986 -182664 442081 -58612 508622 26612 2254
19731 347476 -17602 953 143423 -228781 386658 -407164 -242593 790992 -142344 129175
19720 -502800 -513465 -58682 -193970 -82319 177795 -295923 -225993 177201 -307774 -140601
19709 -233952 -588708 -1249754 -201647 405633 -397144 122229 132281 -239951 189895 97917
19699 97917 -129885 -119363 -814552 -218183 356816 -285771 -468636 49578 -63721 -604042
19689 -604042 212236 556501 338393 240421 344533 412548 -214111 -104145 -202973 -76485
19678 296461 -915923 119816 -167005 -138814 -512272 132150 441499 92916 213348 -64905
19667 129330 117792 196346 358685 270886 27355 384620 68114 -7912 -633780 -338811 -682499
19656 -682499 -210035 -204821 129648 -222269 -35505 318088 -234825 10471 -424800 -485589
19646 -485589 -359223 -362579 -229254 -110853 -232123 19399 275342 -664277 51227 -200146
19635 -105206 345781 -343177 163644 27270 -324181 -433433 -479539 -301359 202630 248024
19625 248024 728730 -204274 -21858 -48910 545762 -481576 -444155 -317949 -113098 153340
19614 192298 -426906 648117 -170264 -206240 -405017 206663 -996733 -140770 -109654 366600
19603 -35576 -525833 -530987 -500088 -184655 -535380 -163907 186041 306899 -207308 492148
19592 610399 41639 -451084 354712 -77110 -71221 -64112 -135671 87212 -409329 371530 -244089
19580 -259075 -485169 -377619 -338044 -79294 -113503 -226739 -656554 6658 -245976 -239107 -296437
19569 -296437 -71102 -475856 190017 -163773 -10776 -77245 73661 -34469 256001 65099 -185047
19557 84933 -245789 -58216 114129 570521 -258023 -390164 -254070 -71979 170142 -672167
19546 -123936 275917 -768811 -114272 -178059 153936 -455981 -220487 -67005 56212 -102847
19535 -734757 446116 354690 -126592 45702 269226 -86191 -564535 154175 461768 278144
19525 278144 -472558 -191260 270062 -467221 -729947 -275816 165897 156904 -333995 -168504
19515 -168504 -171885 13268 -68641 -270884 -584600 -70217 -334542 -238209 -553437 209620 27456
19503 -227160 58788 -99521 -251515 -338213 -874872 -708747 -413708 -82362 400328 -172473
19492 -116164 93483 -656097 181495 94473 240282 44605 89115 25332 -869285 -671062
19482 -671062 366519 351548 -191542 -155718 215959 -442962 32227 -117412 -627388 240451
19471 -452185 -290996 442314 481725 -71346 93909 29662 159297 -296601 -544950 -263698
19460 385113 293460 -174605 -67789 -345554 923949 -18672 268476 -609193 -148362 17586
19449 370260 -88112 -364584 -329518 -266931 -278031 -266229 -800556 -11807 -489980 472764 -135252
19437 -74835 -415588 4502 -221187 109822 222793 28586 -75954 122303 -379378 57871 -246422
19425 -429061 -294895 -526757 8529 -273134 -163768 -69913 300972 131183 -348597 -364885
19415 -364885 16899 170782 -309528 -523965 -162180 299228 -45251 -303195 -141792 -539588
19405 -539588 -170041 -285548 -369881 265975 -185299 310045 -474394 33394 -110113 38696
19394 -11340 539418 76863 -582631 -319387 241151 -9016 -356337 -78661 131943 646279
19384 646279 54580 -11862 -89778 -481000 206354 100455 -59117 -458307 -610136 337054
19373 -250930 -475498 42558 -658611 -364549 -53931 -256867 -119782 2310 -118120 -536160
19363 -536160 -2617 -717024 -156820 -153964 25004 -14450 -1023067 -251622 -397498 30718 45691
19352 45691 -11690 -40320 108951 -124198 215256 -74844 -514605 -371509 -944517 -434480
19341 -412169 -152759 340199 -638089 -3152 601650 672349 -241812 274135 -738712 -480236
19331 -480236 -218794 -458146 70546 -289602 -579524 54474 -427081 -384155 -67334 -643611
19321 -643611 26665 240177 -81052 232693 -27261 -473040 330269 239918 49117 -2673 404444
19309 198983 295103 -697924 -162294 -366141 -370296 -675647 104134 -385913 -347531 -80908
19298 273673 -623080 273000 498780 -704427 -151432 -1051258 -631698 -309194 -130336 47482
19287 -290424 -391336 -452006 233158 690050 -383322 113620 152298 -379977 -112403 -466717
19277 -466717 -1230047 -84763 -168677 357501 190749 -138832 -192401 -215405 -267593 -137432
19267 -137432 186495 -269841 -31693 -333527 -566019 -126831 -351143 -14916 -97651 177316
19256 32144 -598658 136383 -78011 6494 -343935 499075 -140861 -127006 34636 -119453 106208
19244 287328 454002 -34674 -12001 5198 98494 175426 -497479 -158279 449690 -122057 46614
19232 137136 -50476 -705473 -240662 -191729 -396024 492019 -398153 99474 -469444 255146
19221 274445 -45233 -170562 556568 209306 -448312 184571 -14825 -332028 -252585 -144501
19211 -144501 117559 -971822 -248008 283977 206131 -270228 433790 -49432 6805 742531
19201 742531 -115072 -329178 -340906 -374862 382434 -29749 -178310 -562961 -233639 -398116
19191 -398116 -696178 -181877 -193606 83609 107506 -286387 -349544 95089 -28692 -193462 -296206
19180 -296206 -542349 -433900 -298338 -70660 -19465 123478 -149830 -41766 234113 -129812
19169 -390723 254049 -152873 -91750 -263030 512152 91310 -259615 142850 44963 -147900
19158 -517552 178574 -71518 -99333 -387025 -41690 206474 -232854 -75653 -364646 -38528
19147 -266923 79938 -266141 1054589 325945 -179173 -299773 595736 -32909 181915 -110097
19136 -227506 420576 -134473 727565 -385584 88958 -178379 -688084 -658901 -454709 -446334
19126 -446334 128928 -127832 262680 -851274 -35373 -531398 602618 -139910 -251618 -110196
19115 -614403 -377506 -653943 65622 200147 462468 257196 -366456 -270277 -111955 -947295
19105 -947295 7827 -459726 507501 -205411 20456 -64376 -171302 -436651 39603 -483018
19094 74059 71242 -291080 -8644 -95922 -211898 -739545 -299204 -318883 -625940 176949 -166327
19082 -36875 -303455 121059 86866 -104521 -369526 -43516 -519102 -109484 -193561 458752
19071 56262 -176303 -619959 591663 -401774 159424 -125495 -130701 17215 194481 -52441
19060 -116520 140568 182396 537811 -356627 216642 1409 -79907 -195356 -184577 -440146
19050 -440146 -195714 11680 654358 -30379 124250 -223892 197505 234470 155516 -463877
19039 -413615 407584 428800 -98081 1546 -21573 469413 -467856 360950 -292625 -84284 -253653
19028 -253653 -69810 392499 698999 61685 -98687 122184 -37308 18805 280692 -174304
19017 2197 -250793 -250139 518335 295890 233377 -333175 356583 -495843 -455299 -354962 -39798
19005 -134146 647552 117847 -314508 -187281 164790 -72689 488420 -126961 124931 -155193
18994 375362 -245523 197145 55870 -195450 -99895 15149 40667 358183 31659 -441155
18983 350600 177327 -671621 -615406 -473556 174081 -308685 148855 330134 -348677 -628018
18973 -628018 164481 374750 206670 619022 -428533 -284537 47545 154351 -143846 -332834
18963 -332834 675943 -137831 134062 7310 -418215 -100723 -139526 -456719 174102 -217890
18952 257906 -251909 -857600 -684297 359314 250369 -253591 263542 -539852 -893776 85050
18941 -335703 185948 -362045 -49894 -422787 -114543 177047 -625160 -374336 105221 -266154
18930 -140079 673718 140508 -341491 -332150 -727643 -140607 261677 -481202 -41699 -124112
18920 -124112 -721930 150723 479240 -268511 367274 -848888 -149106 -123986 -8431 -358876
18910 -358876 -339775 56599 -561867 148874 -579493 -308058 -202806 77274 -274540 -109242
18899 -27480 -282834 -30373 287236 -63157 -361517 130532 -358821 -552582 -783155 -502335
18889 -502335 -367979 251365 216133 278623 95558 -285480 -382075 -124047 -530548 146094
18878 -273753 -268247 19649 384564 242809 542835 -413376 50801 -186224 -703664 -748787
18868 -748787 -337949 -16670 -20907 93077 169523 -230369 310423 194597 -164242 -464073
18858 -464073 31656 428525 674249 -213836 -338036 -82834 -435852 -55465 551463 81061
18847 -87410 268571 127477 261749 -176788 -507476 -679582 -457992 -299238 -397525 -441532
18837 -441532 -295745 456737 -220351 -57618 3797 -577919 -464452 399658 127540 219413
18827 219413 613240 -73211 1016329 -325184 360243 -644937 376935 -123205 -39464 55551
18816 -542398 -35035 -169759 82181 36633 -223550 177779 327927 -190506 174764 105900
18806 105900 -89617 -13133 326259 346457 315087 59321 -113529 168571 242538 -650893 27081
18794 183868 -599938 -118882 -208888 450137 -68499 184175 179568 89605 -361017 -500562
18784 -500562 -417389 -556385 461532 -436908 -171953 71212 -792647 810179 348320 -390731
18773 366632 -346905 -126713 128278 -788104 -42978 172800 976389 -271189 -355201 -98175
18762 106222 -352141 11882 749699 -661959 -349358 -254605 22104 -211357 -99048 642708
18751 125910 -216764 -283270 -150041 21351 295534 178974 -365228 115323 -3967 -388275
18741 -388275 -7416 -168978 -731568 -123007 -709873 -321826 -290261 179464 -417889 194401
18730 -322192 96504 -115743 -151237 -237377 17221 -306615 -414143 -326541 -276139 -294134 158178
18718 -310571 204514 153003 7404 144543 -249671 -139634 -810154 -244893 269309 203552
18708 203552 -572651 193971 -289210 220077 -192715 253006 -387408 -378706 353439 -240456
18697 -6121 -219323 608560 -150854 561829 -28495 -397016 -351901 -127206 75144 -31544 -317270
18686 -317270 224368 5022 299739 -807625 -219199 -399511 -447060 308363 -281031 25429
18675 229084 -134107 -165965 138399 -731211 90326 -473906 -74806 192805 409171 184455
18664 497108 -74753 -28947 -495180 781924 520309 -262479 -322379 133480 506377 -59848
18653 128240 684010 -591627 192418 298212 -591126 -293218 47589 -491746 505916 -181390
18642 -250585 -549238 -29709 -408639 -419584 -423576 -199483 76187 261772 -676850 378081
18631 -39394 -327647 -202471 67758 -532548 52837 -27912 96899 545244 162908 330207
18621 330207 -284925 -402302 -425621 336929 -80852 -478255 46580 240986 103842 -409702
18610 -365890 -300888 175798 -418567 284682 -40091 -307554 135269 -318657 340383 -466319
18599 -26173 -181626 -30283 277493 -749333 -308121 102387 -125144 -78411 305136 -355525
18588 49279 43376 -347523 -259030 -298127 268417 -164597 199101 40899 -76745 79099 -113230
18576 31082 22041 -235685 64142 -542810 -161047 -88997 -902342 -31348 -381604 47550 -514584
18564 -124739 -91964 278940 246825 -200245 -185631 344882 -423286 -4975 -632779 -778882
18554 -778882 -539666 -77192 -148781 -1059700 166209 -168921 355526 -37826 -442468 -24564
18543 225439 -63799 312139 -171455 -162841 113176 -400871 -228748 -339719 -331985 4228 33643
18532 33643 490407 -234366 -544134 309258 -231330 226849 -191174 -475737 -398572 56328
18521 -917005 -136994 540322 592773 -533101 662621 48197 427431 -31998 4799 -412956
18510 -393502 -251607 -681404 -372038 -298558 -123836 -367934 -797528 -620143 -124468 194967
18499 -454736 -486574 45199 -715466 345568 101341 -140340 203537 95412 208765 -256671
18488 -232655 255746 -747528 388492 -481987 -145958 -313964 114970 -173591 302750 -806913
18477 -598577 -215152 -127997 237430 360466 140424 -314362 -310036 228497 -279968 150771
18466 300875 24641 -140109 20369 -469990 -864674 -149879 -516760 -92917 -884656 436307
18455 199450 -156542 116078 404726 -86029 -607193 493507 159728 254587 515407 -160501
18444 -474296 297185 244581 -260610 207520 -353152 21152 -346549 -70063 -150274 -464054
18434 -464054 -308312 -150095 -484713 39054 -322597 242909 -770041 26001 255500 -1435453
18423 -77738 44068 -81177 258286 106415 903208 266308 -24226 -104294 -482082 -730058
18413 -730058 528813 -144881 -283104 37639 428391 581850 111570 386648 -373096 -244893
18403 -244893 364491 148453 263343 477181 -466958 169551 -494232 -16646 -402266 -735115
18393 -735115 -173083 433765 -130424 47856 -467930 -381917 -565648 -172131 308149 -150833
18382 -196591 -486018 -31434 -235554 -150766 200946 -464606 -535856 402252 548941 168124
18371 171104 -78969 148148 -295610 -459286 114631 -370006 755184 -131711 -303174 342901
18360 106672 -43978 -119833 -100505 -18270 -83022 23614 -184377 -161776 -394977 -166765 698468
18348 395126 -90177 -21714 -155262 554719 -874135 -30058 -731383 6110 -352529 -360875 373956
18336 224867 405808 -334477 417375 -400693 -14971 -371594 306937 -294585 -241040 -33150
18325 15756 -261291 291106 -584574 -816186 -383464 -595430 -21606 -286631 -66832 322644
18314 10223 -449846 -114768 -77048 262979 -492538 161529 -338937 -153139 -327371 -595282
18304 -595282 -792136 -424050 -53724 619582 -290601 516 14715 -268770 -564345 -445117
18294 -445117 -989278 154432 -98951 384323 204077 261117 -97129 -39519 133879 129047 137538
18283 137538 -344388 -805547 -325083 -565245 -484021 358520 319034 65115 -532591 -320279
18273 -320279 -22625 -141674 90113 -87377 233560 -560055 293838 -523728 183273 117127
18263 117127 -161516 -260709 104380 117213 -432595 -212411 104449 541990 -102442 -138182
18253 -138182 -111431 262433 -68258 -310609 382555 -897228 -543514 -156857 -218193 714715
18242 106892 -81446 168180 -473968 -833193 229882 173738 -490947 -139526 113302 -71051
18231 562898 -312173 6128 83378 266964 381784 222997 30096 87822 376028 -105138
18220 -101216 -9347 555366 -180735 347214 12485 -390819 -148497 182520 -453964 -315139
18210 -315139 100486 115619 -544833 -101702 18949 406819 -55421 -3355 -239163 511975
18199 -465740 -179945 705703 -262619 -271768 -690083 -205288 177111 -55124 276204 -238741
18188 562059 -416986 -841893 -345913 -149653 -226168 -46494 -291482 -203390 317056 -95542
18177 -79739 268938 32071 -907562 -154701 -332066 -69347 253695 -94557 -391224 -75398
18166 133213 379654 -85753 -11422 -105458 -604646 143183 207101 442921 -698789 -277249
18155 485635 -406929 -391276 -202877 -946373 -476536 -91067 -225873 -65814 582056 -729598
18144 -50844 297672 -355579 -129480 1493 -144565 -265688 -191247 -261628 -461045 119944
18133 327185 -507099 -89280 14271 59880 -633410 101790 -123869 -139626 -330005 118501
18122 -225958 -20410 -820339 -268451 -123274 -650688 172501 437844 12634 68553 -34653
18111 115094 -222671 21676 12535 -454161 29838 -158192 -569449 367536 387015 -135470
18100 436945 -298976 140244 146395 -115642 -191698 98908 -179460 -71869 56618 422397 -489965
18088 396686 297029 -767976 -330598 766179 -66332 189416 -209530 -153633 -660972 -17206
18077 -454664 269669 353325 290085 -127625 121488 136655 -72317 -438330 -226335 219624
18066 -58640 -73902 -257252 -294733 175261 146245 -202876 -52460 273898 -360860 44145 -642974
18054 95452 668269 -38437 366046 -5624 144662 -258293 -112771 544579 -622639 94605
18043 -407797 987147 -29269 157132 -860240 -197045 -540197 -432559 -525619 111186 111406
18033 111406 462136 -117796 179503 -259528 -209403 -277455 -385037 381045 210045 18044
18022 105024 -35762 187710 -204999 -143344 -417617 -444194 103197 378537 -224208 -562947
18012 -562947 114020 242919 340731 523118 247292 42918 190553 -145603 -512949 36125
18001 -162229 125587 -813040 -170188 -56436 92038 -250303 524458 -324641 862026 -123717
17990 492011 186115 -209224 -514629 179990 -619305 153446 67345 445521 296030 90367
17979 167456 -118446 195988 185520 -369786 -105885 457704 -211833 -121190 2389 248056
17969 248056 -66633 -244236 332661 103211 -493594 -96576 -42904 126664 -196540 -472167
17959 -472167 -134490 -326550 -322086 -378815 46901 -451604 535379 -71314 -359876 -514226
17949 -514226 -86765 -447360 -99455 -509005 17028 138621 21106 -321041 278205 -165505
17938 -23449 21721 -431044 114921 544204 -308163 491476 -59817 -236123 -401653 -332142
17928 -332142 -386669 182609 506202 735890 371481 -737213 83395 -428173 -807651 -283044
17917 97193 16746 164985 419402 -165460 29224 -445135 -774720 87873 -295630 450062
17906 637632 -15417 553692 278158 538129 -601644 -164834 -435811 -296488 -568230 -767408
17896 -767408 41742 344747 -36217 128160 321982 640984 -18955 -53105 93576 -530530
17885 249541 -262779 -601187 136432 -428666 200537 -279695 227233 -517432 -276524 -437096
17875 -437096 122775 428844 277615 -359087 216713 -326437 -210534 -260630 -311259 -512532
17865 -512532 -93031 110690 -182628 -442652 -148265 118434 397991 -39519 209674 187966
17855 187966 -409402 510754 134139 -43667 -317222 -89363 -72463 -374986 8851 -370713
17844 -251071 -68775 58189 130928 257204 -509153 -84065 996467 -295054 -48748 -335091
17834 -335091 -231571 -280585 288946 -132885 109542 131212 -117909 765914 -268355 -756537
17824 -756537 62498 -283472 144945 331583 -113004 -338165 -303060 -122276 268999 -413204
17813 -566680 -173932 204871 -375035 4938 -161436 -175979 -162118 -205358 255914 -702313
17802 210320 -254660 224695 -367839 -257335 -81166 -495296 75525 399220 409892 -141794
17791 203343 447270 -87447 -209728 -546769 31432 -111906 171111 20655 410169 2881
17780 382783 -528416 480329 -360306 -86620 -290617 -548303 521562 -67944 -37400 -35233
17770 -35233 59734 -368612 463098 361941 445788 -130667 376864 -213206 172972 -214866
17759 53967 -959458 301910 33031 158535 -86680 -257353 -15639 179509 -312002 -326013
17749 -326013 -343448 190360 -148998 -418467 455719 -40968 240504 335594 184196 -763373
17738 -358304 -236240 501878 -302474 39352 557305 -709248 -461701 288076 424365 42851
17727 -33513 198736 -573745 -31566 51652 -113133 -128562 130601 -317539 45315 372472
17717 372472 -286598 -222334 782418 -363336 55830 -167696 -7241 -146241 60589 548210
17707 548210 -529341 374146 -267839 373740 334035 168378 -200231 74686 -459347 393337
17696 478189 19766 163269 -192394 -282443 265798 -202359 -263783 365497 -392095 162720
17685 -300957 -29631 64061 488398 -57483 -355063 -151208 -56084 94600 -124644 -351697
17675 -351697 -244337 197564 502430 415945 434342 -22635 175378 34383 -592947 -122659
17664 -737283 -296263 462046 85299 -395545 208884 -227904 30082 -249827 277451 -74982
17653 -423367 -84087 154237 -362260 -280639 52746 197400 -385017 648673 390533 390553 143732
17641 -67936 -111778 -559323 -557460 84738 122385 223637 707204 -597426 -722093 -87725 1016598
17629 342753 -16342 -40229 -56018 682903 25732 384265 585536 93211 464963 46352 112497
17618 112497 -184795 -241985 421450 -98701 115727 -194928 -196919 -35325 -10466 -352088 -209419
17607 -209419 -267898 -144444 4024 -620402 240422 -311325 -242369 395317 438248 202522
17596 -12784 -134547 -193177 220764 182205 363097 -452342 28275 -136015 -151063 -251427
17586 -251427 88006 -34454 173345 -218545 103896 493278 104589 -34965 142523 -409959
17575 298035 -49706 -279915 -616376 514545 213734 -574623 -452579 54589 -134962 -605583
17565 -605583 -282649 295083 169328 -105687 -512325 643118 249392 10656 177724 144070
17555 144070 36987 -246676 504957 -178085 585024 -93329 88258 -23084 -166203 126114
17544 4142 -526490 296973 153108 2245 671100 -134259 7383 -98638 -156853 426903 495350
17533 495350 -109105 -845467 -204017 -63407 253779 597421 149763 537329 98433 284457
17523 284457 488403 280605 450922 201578 347536 493082 -395700 177951 132014 -122447
17512 405006 315115 412428 498622 -315822 137404 42228 553545 -415667 784720 -183695
17501 -823417 68347 -139728 29990 -431443 763696 343469 360164 78305 513354 267083
17491 267083 397371 -701200 577011 417417 109166 585022 480587 179144 -77887 180501
17480 766068 321079 523377 -546320 -172524 421604 181795 -169650 -103888 404664 -162072
17469 -211678 317548 267196 39766 194277 -329423 81586 425125 449424 269175 695368
17459 695368 632564 667726 226645 344945 -112989 -378648 663444 -166659 179435 634183
17449 634183 -357618 -47162 327041 418142 469564 -31639 930132 29059 120508 458566 559590
17438 559590 110855 380556 200626 293832 206136 342202 197962 815892 368954 -65506
17427 59083 -116040 396455 95179 40793 -179516 -29375 581846 367499 325249 715499
17417 715499 -386028 279976 164571 710732 68215 -427643 316311 201196 -77045 -307111
17407 -307111 380298 821599 118676 381413 517921 22317 53119 162782 91351 339774
17397 339774 -17472 76697 123035 228983 212396 643843 -409825 141003 -13132 370095
17386 137960 -74259 338309 625966 379680 -435164 443674 201477 -213383 121436 523523
17376 523523 520127 192405 844413 -222742 120286 -616730 83557 511034 -5940 -397744
17366 -397744 650093 57226 -12969 -60621 657494 -377867 214154 476437 -333054 -293000
17356 -293000 368531 298517 351256 294278 464686 466679 -494673 -303459 423904 58513 -392594
17344 614419 147666 469719 365440 -197642 -147635 278718 -428622 633634 -258203 735711
17333 801151 326558 1085347 -65964 149011 -326940 136396 41223 336244 -70518 314708
17322 678736 382777 462967 363917 455365 -197865 555242 402419 277650 -102150 85653
17311 165685 350938 228259 324968 523213 476942 -43691 520098 238686 488979 592119
17301 592119 -237881 517963 464894 503442 192665 -115896 350778 425 101830 -135147
17290 188884 6148 -428542 39707 15942 650326 -165652 27829 330333 488490 527678 159137
17278 351590 -40021 -397275 -82026 440898 439773 -61036 816681 310191 418571 468597 -189176
17266 -495714 731014 530193 171016 162715 827707 427017 473876 104111 -496314 195115
17255 191777 393077 367113 535409 327978 101878 -60760 67064 11960 -82854 437869
17244 386263 465268 211760 253304 462073 445278 384212 397726 -36527 503586 38594 315812
17233 315812 308015 -119070 354706 394672 -245871 -88909 619341 256578 523981 506755
17223 506755 357620 166274 180734 484893 335937 591303 405586 200886 378565 117313
17212 834747 953604 480663 540323 98733 750603 871278 771553 745773 822776 437056
17202 437056 226147 654455 51217 448728 347633 493609 41714 545771 301906 -388
17191 300692 79766 325771 276665 292281 184870 612628 264785 377516 -117775 329527
17180 278166 192688 506505 204125 14413 320627 860424 186821 141065 166108 177915
17170 177915 190599 990495 241619 -89713 911337 242815 434618 318002 493555 78178
17159 469579 172786 614397 582589 529759 794237 -77894 393979 784033 636756 373604
17149 373604 539161 839584 604711 113766 681464 176198 1468727 154739 906278
17140 906278 357366 594576 283747 383831 991962 903359 189238 602624 853410 1063342
17130 1063342 171608 875438 1360024 224243 357641 586905 828341 183426 5768 852739
17120 852739 577243 845792 1022028 847334 134581 478825 842500 327791 547062 506987
17110 506987 251428 674033 883881 622179 587326 579368 395168 262356 286341 625967
17100 625967 735701 870154 796135 844485 849619 988207 142704 1098006 1031692 432136
17089 888449 957672 675664 222898 583733 674398 1390181 582768 621055 673275 1207659
17079 1207659 927738 459877 554179 771983 827291 597135 847713 483912 842391 455186
17069 455186 749728 815768 1007078 635090 848828 161804 1041576 1199711 586868 1262914
17059 1262914 466662 1338818 985963 935202 661553 919319 365707 1344463 921922 658598
17049 658598 1117240 1155058 1243029 1186365 888147 1271392 806184 650779 1338006 737207
17039 737207 949326 874618 308872 499183 950067 852869 1188197 1133928 1062170 574031
17029 574031 434982 929923 1371713 1184361 717086 1032888 675925 1288907 998806 1064832
17019 1064832 1269511 471175 850160 1829333 1019583 1033256 1187130 1012426 1367576 807045
17009 807045 1226510 1242396 655126 1792022 665668 1078438 1224159 1764956 1516368 1135690
16999 1135690 980613 651230 1319344 927966 1182377 1709540 1254350 1264545 1123647 1511349
16989 1511349 1219294 595144 1563109 1312022 731269 1043177 577704 1107721 1382317
16980 1382317 938807 936700 856387 1194587 1342221 1777461 1438097 1826842 1383890 1541534
16970 1541534 1408419 1055710 1088796 1032091 1506434 1966534 1096067 1431225 1282583 1305640
16960 1305640 1857481 1748018 1413404 1599099 832395 2027490 904871 1223460 1633449
16951 1633449 1475743 1844528 2145397 1596640 1489664 2049301 1940146 1596529 1573056 1614162
16941 1614162 1978997 1512741 2607819 1464699 1625873 2080114 1574601 1823048 2135572
16932 2135572 2021201 2185694 1604479 1754742 1834305 2016523 2459759 2120875 1924918 2064879
16922 2064879 2134300 2113862 2374189 2620359 2312725 1814808 2204273 2124459 2482071 2252933
16912 2252933 2746653 2113674 2398492 2050237 2069065 2293935 2742940 2006963 2076134 2661025
16902 2661025 2462987 2782434 2774107 3640009 2556460 2685044 2809754 2198479 2420118 2261894
16892 2261894 2475136 3073123 2964608 3067476 3082835 3083110 2692227 3075495 3669164 2847000
16882 2847000 2762020 3303686 3347716 3189604 3379985 3986043 3702421 4006530 3998261 4224592
16872 4224592 4037351 3962278 3885916 4297262 4028835 4191822 4329720 3869599 4217406 4126191
16862 4126191 4284520 4611239 4431958 3765313 4277292 4312233 4866104 4934382 4722801 5126168
16852 5126168 4229677 5148479 4882043 5122417 5304532 4984388 5093271 5123455 5430028 5560738
16842 5560738 5956327 6438250 5890079 5723191 5620607 6136360 6064301 6326132 6128730 6688597
16832 6688597 6282233 6822886 6936102 6596431 7318973 7182403 7075384 7809468 7712163 7544796
16822 7544796 7636334 8321644 8545521 8704302 8968434 8873087 8994351 8892729 9543838 9637593
16812 9637593 9239886 9558628 10362856 10054751 10691875 11133282 11789741 12011203 11956025 11806892
16802 11806892 12014599 12454115 12743715 12899495 13574533 14109518 13570222 14635984 14813376
16793 14813376 14771112 15945957 16226515 16418111 16935809 17637973 17212679 18343267 18783259
16784 18783259 19388128 20288528 20662438 21409823 22180447 23158636 23656186 24391758 25430200
16775 25430200 25643276 27095997 27599251 29167496 30395344 31330581 31932577 34062563 34975561
16766 34975561 36337530 38287484 39613623 41023211 42240316 44382472 46390462 48359198
16758 48359198 50001206 52934050 55078685 57538948 59902146 62750014 65116311 68620646
16750 68620646 71865931 75415952 79490330 82604586 87044590 90885676 95551311 100299647
16742 100299647 105081610 109946147 115162672 119637378 126002195 130957237 135816759 141123423
16734 141123423 147569821 151688794 157548451 162225211 166739067 171684190 176356708 180094831
16726 180094831 184660132 188444431 192301800 195239908 197903570 201356087 203975644 206617440
16718 206617440 208032430 210097536 212393372 212617294 213864389 214533254 214344590 214301427 213778166
16709 213778166 212519938 212787610 210775232 209665868 206996896 205855862 202933304 201471504
16701 201471504 197987255 195744733 193274322 189813513 187387974 183458626 180747452 177353258
16693 177353258 173613197 170684329 166374048 163784958 158752196 155492346 151792924 147057616
16685 147057616 142926462 139393734 135219674 130540658 126871924 123254260 119178943 115186106
16677 115186106 111410249 107115917 103781136 100220097 96455902 92607879 88800090 85882046
16669 85882046 82441358 79654439 76320898 72511950 69174833 66961343 63423987 60375908
16661 60375908 58278066 54970719 52724462 50579149 47813643 45860429 43381458 41596506
16653 41596506 39612107 37607992 36429966 34355930 33449380 31498395 30647851 28922292
16645 28922292 28222306 27041112 26155660 25421548 24642268 23781162 22413146 21886409 20910364
16636 20910364 19735164 19551172 18599485 18092074 17577796 16875759 16896845 16078684 15809012
16627 15809012 14910291 14622585 15046460 14445733 13887514 13276102 13573639 12578852 12738436
16618 12738436 11844459 11479692 11537019 11602417 11306857 11298105 11049522 10140105 10018859 9722259
16608 9722259 9494340 9164012 8885658 8791274 8432891 9209389 8259733 8329916 7702419 7371479
16598 7371479 7568632 7678463 7334961 7301711 7126607 6671613 7235026 6125747 6672111
16589 6672111 6623159 7069914 6895822 6242251 6001785 6128627 6183559 5657195 4919406 5976651
16579 5976651 5017269 5125776 5152329 5117017 5061272 5476112 5306016 4667904 4450238 4906446
16569 4906446 4030160 4311148 4293942 3772717 4081226 3025065 3757290 4308376 4244849 3440290
16559 3440290 4368327 4000025 3801639 3370288 3484752 4049084 3261632 3868940 3563014
16550 3563014 3609548 3098875 3083004 2703615 3257994 3593050 2998666 3005066 3590986 2926695
16540 2926695 2926920 2793666 2726136 2278504 3214470 1950038 2593106 2858706 2367549 2440134
16530 2440134 2842456 2719901 2354878 2481817 2922638 2662803 2387112 2112839 2891594
16521 2891594 2617302 2347348 2442684 2732118 1994653 2376531 2116104 2702725 2105887 2449563
16511 2449563 1736025 2341687 2361613 2449359 2493840 2272562 2090145 2127100 2176918 2566189
16501 2566189 2144068 1967293 1860861 1660039 2289192 1377763 1075455 1678226 2065116
16492 2065116 1861935 2007257 2190175 1606093 1752434 738507 1247932 1428007 1339053 1580669
16482 1580669 1305172 1536968 1052937 1824623 1657212 1902496 1481389 1684146 1668441 1415099
16472 1415099 1008380 1697130 1437469 1357002 1173308 1057961 1308685 1206720 381852 1234736
16462 1234736 1226290 1183222 1320187 1138121 1391005 688574 1070177 853145 1346916 1180388
16452 1180388 1014743 1118397 1177736 949645 975249 919573 592262 637631 1237375 659036
16442 659036 1383726 1252028 1204762 890368 480406 1219216 123030 1109029 1000507 1197790
16432 1197790 102951 1195514 995434 447931 906006 990197 1267208 970655 1123874
16423 1123874 593886 1006711 757969 801201 872448 158374 600911 835554 489195 569352
16413 569352 580102 846957 976327 -197800 684841 808663 1147704 219167 713583 72267
16402 92659 273115 872745 780698 368072 534423 359425 1169614 -35752 1121000 770175
16392 770175 482902 963846 350543 345981 473402 358188 568032 243899 737453 643885
16382 643885 933386 867851 270395 518377 235582 345973 767519 301999 414217 448576
16372 448576 352397 723393 144591 673211 220888 120161 222105 401635 252424 99302
16361 562926 649750 276772 151494 811232 695738 -92734 356521 697670 -44987 924459
16350 150935 43671 -84402 10873 376466 498242 778685 3746 -185112 226027 530018
16340 530018 488336 177402 -527876 -81675 455202 1063346 233797 -49272 44712 557892
16330 557892 584237 233757 -24156 582680 232072 457556 312114 144445 689148 993429
16320 993429 900871 418919 611078 160094 602204 375329 -773611 200068 128455 462420
16310 462420 -35793 989414 -185001 -135407 -129406 100889 239942 -21383 -105806 337927 -171104
16298 499869 -119436 44745 806413 264510 532654 391797 -48530 212506 661816 -97954
16287 646721 267301 399896 -368740 381924 390104 -72467 370813 636586 505005 -35216
16276 658889 667159 528581 1017531 261552 905260 -165235 104100 366916 182691 826851
16266 826851 73755 287972 1049735 277193 -259019 359046 205018 670682 -16970 412008
16255 -129361 179339 738877 -51970 165655 366053 -95783 199849 454233 23801 233396
16245 233396 191530 213159 -504008 -21529 248912 48132 190339 648933 -64052 -260533
16235 -260533 -435644 -271092 87473 -70376 -428891 52363 376828 -105660 188389 162920
16225 162920 -664569 38982 -479989 -167432 797505 -153621 443224 556159 118463 415804
16215 415804 -547646 -629059 608472 -20030 -298491 -104215 63322 -99936 -217085 -403639
16205 -403639 336428 235597 236753 830656 93635 -596788 131329 196217 33215 -191519
16194 407000 472547 -311717 -513626 -489838 290076 258749 35287 -492845 77899 508437
16184 508437 -362265 -477332 -752793 77939 -326289 245818 242361 402946 143377 142414 -140879
16172 -273621 -785097 -378226 -215264 83469 222951 436940 113313 -27248 -443127 -10463
16161 370260 -248688 -747208 -246920 -7168 109270 -413088 -167812 163037 644431 -54506
16150 98015 -131971 -50560 -217009 4721 287003 -76616 300116 68358 -134001 -474731 309208
16138 -548283 523186 156168 -905031 443335 -168075 269580 -204656 392169 -170676 -316759
16128 -316759 -63693 365459 -450578 242872 109409 -512247 -335858 -313811 77986 -371213
16117 -31548 -160598 255542 565105 -480281 191986 274680 -290529 670774 -223181 567641
16106 224410 -94870 -420789 -33059 -203643 -201605 319150 -187664 314835 99858 88652 -754271
16094 -312145 666767 -338986 -305828 191529 -13191 73107 113221 568277 444989 628759
16084 628759 595527 -757812 -146952 138958 401474 105385 -314376 940712 -312089 482278
16073 -186471 276533 -85657 -289665 -496609 -264110 -495091 659061 110394 24405 77460
16063 77460 462582 -343527 367896 622979 12221 196959 3714 -249315 -169035 -483102
16053 -483102 -443535 31215 501598 16231 -466737 -259452 -184770 -89767 -203906 -236196 301026
16041 47514 -627763 -117997 664460 132240 830539 -663488 -257654 298520 -95572 97711
16030 92416 -39182 27297 9882 52450 166051 208636 370486 -555282 22729 -752890 116132
16018 63885 269699 330915 -221332 -100657 -306242 324435 187638 358675 360019 -436698
16007 -45031 176728 -105241 -213738 364929 184334 31263 55961 140332 -283107 -269778
15997 -269778 -62858 325918 -54486 -118325 452696 6151 36756 -230958 -379766 631459 -132991
15985 -207509 -43666 279623 201487 109198 740161 40845 107963 96722 348888 -464653 -420864
15974 -420864 -282655 -97436 -40739 -335784 186869 314932 -237663 146040 -457573 -263621
15964 -263621 491312 -198849 -448368 -105039 -550820 -259808 224152 282082 -238356 110536
15953 115280 127282 -276828 -21719 -45306 179558 -7724 124100 -409798 248257 -61091 498524
15941 267003 -49015 212871 494895 93641 -71253 -134414 299823 -611988 158706 -398521
15930 33674 -368862 560931 -55042 -265063 567212 205803 -16505 135048 4514 203102
15920 203102 -525076 123791 -383993 -210421 -342267 -336223 483583 -381841 146992 -722110
15909 -73043 -64912 -144036 -84257 -142888 -373843 -349049 -28045 -333290 -316533 -168272 -407718
15898 -407718 662675 -322658 -248943 698501 -284474 245560 107525 -406754 -406731 123993
15887 -319518 -310871 55845 332881 -91661 -136472 -755728 -472511 -629094 -29535 -429536 -32583
15875 179513 -49105 -127294 188028 -448967 464373 -213024 -941163 364550 -146697 -804196
15865 -804196 -34035 181206 -158076 -452402 -613282 134502 -599607 607339 -280060 -609603
15855 -609603 -441437 -220579 -322224 529990 489381 -478036 -502119 21359 -347899 77055
15844 -421202 -594653 269440 111118 -155764 -116457 68356 -171758 172077 -202324 -52697
15833 23933 -265906 140410 -337445 -302616 -52657 -180340 -484999 -47621 -557979 315864
15822 -220441 -166627 86829 121697 -289280 197945 -414691 67765 31010 -43745 -35557 88465
15810 -210333 -292555 -757068 -128194 381450 -1096893 -338188 29828 203658 -286822 165288
15799 -202575 -362883 508883 17624 -291388 -265205 -81312 -188605 171343 360298 -407376
15788 299786 74814 -531320 -399372 -215588 100869 -152148 373787 61479 246055 14622
15777 -192149 27907 -911 -315197 172385 -287004 313641 -295161 463306 -12198 -291395
15767 -291395 239477 -199241 -228453 87435 -274702 -332080 317509 -111912 305905 -312076
15756 2686 -82790 -334298 -109767 41934 -282796 -483974 -257151 -90269 -186348 -358310 -337839
15745 -337839 -271370 221349 359691 208548 276194 73191 -389225 -282623 -16885 -191709
15735 -191709 -352416 296876 -64815 -53170 -796021 -404670 189141 -404528 -389231 -42717
15724 -504981 -195046 47689 -583614 201268 -140265 -335740 -160431 313236 245939 246298
15714 246298 -224093 -349295 -315869 133471 165489 -453507 -562682 -58770 -13920 55784
15703 -147812 287169 352733 -263190 -147404 -304199 57413 -180561 288286 238216 -596309
15692 -442613 -103544 -279049 77056 762133 318406 645604 572401 -395728 522714 -102447
15681 -856047 8501 2580 -150834 217875 -431932 -72943 723116 -213020 -182618 -4640 301195
15669 236741 164367 -824785 -159989 -459226 234982 -34187 -509832 335959 -207107 -195261
15659 -195261 419197 -356584 136579 -167639 -45036 202695 -354565 -689391 -702603 -236899
15648 -824381 -329133 700093 -128545 -155096 343798 -517127 59487 330088 117697 1941
15637 -700325 214533 553980 -500496 526 -446397 246842 -103316 -597447 606541 313979
15627 313979 201123 -38721 -310747 52425 -914299 -536131 -305151 161604 329998 572466
15617 572466 -522376 -269888 658367 219841 -97825 -593094 88859 318099 -540421 473958
15606 -139193 22158 182235 -173039 -64207 431741 -126337 325472 -185183 -404566 -341832
15596 -341832 -413098 -57251 528654 -374659 -179322 54794 592047 -86876 -324224 294004
15585 -52843 -768342 609354 95905 -256508 -561358 -130930 -139507 -386732 149242 -253744
15574 -375189 -401479 6191 188881 76267 -317460 241121 76364 -290395 91106 504055 397619
15563 397619 -301762 -81464 -268973 -240855 -479519 303099 -654832 252529 411448 255660
15553 255660 -66725 838929 92113 762710 -724565 -533460 -65131 30444 -301730 222247
15542 -280316 -381743 -154949 288166 176445 96282 -330080 159518 -352527 -819388 -315373
15531 263550 -183836 371356 451443 60277 -543932 -48701 -253045 -198633 -282696 779868
15520 283015 -349410 688052 -237561 525745 -567981 600553 143899 -226162 146099 3539
15509 -141704 -371648 -154429 227100 -428454 61998 -328653 -452087 -134115 335078 -238574
15498 595729 -487062 -324841 -618132 217069 592583 302548 -432121 -195489 -214473 -453228
15488 -453228 -150985 -271240 555961 340271 -23544 31205 -700032 -39320 -446961 112114
15477 216502 -160930 -284035 -196482 -362028 421390 -297650 351173 -414506 -24519 -162423
15467 -162423 -187172 230043 -453815 -126561 529569 151142 -111124 -458998 347019 3819
15456 63736 175325 -336827 571508 -405266 -113525 -66260 -529705 -33018 -170608 -190458
15446 -190458 960531 -370940 114185 -2509 377403 -284910 446781 81109 34698 -76597
15435 -149290 -113688 56969 -483539 -270876 -261758 -282162 -152055 -44328 188310 46063 -30703
15423 -11813 -116290 -556666 -319355 344167 190813 -23610 -675682 139760 -289532 -282721
15413 -282721 28998 64024 -491683 -210956 -24898 119532 -320287 322114 393757 -4027 155846
15401 -217081 421750 502702 530164 -118292 153537 29981 -193047 299196 -107650 306 -267601
15389 -32953 -711907 535690 249874 -528509 -98749 -357680 92128 68029 -118322 -406309
15379 -406309 106813 -42775 -198333 -271057 -212200 -926280 -126634 -467041 442501 364912
15369 364912 760833 490429 190252 -400036 39123 -163465 149405 -300182 -417686 53547
15358 22304 426888 -143980 -140350 47511 349183 -110867 -150235 -295007 458546 -441602
15347 152418 197005 -887878 14822 51869 144376 -257654 679523 151183 -428037 71193
15336 443548 546192 18143 -91292 202369 -741165 265908 -485707 474411 449079 -817788
15325 -98223 159758 2719 98381 -83413 -154099 174499 580802 -188033 194955 215492 48307
15313 471288 -408205 -231264 85844 -509517 -174237 -212574 136615 -216068 342704 -600150
15302 397060 -454711 -382671 -34937 -586123 45113 -294664 387658 -255358 -104408 -33361
15291 460304 396697 157395 -195010 294079 -19260 366180 315782 354314 -52463 510853
15280 394678 -139351 148984 70572 8008 -448986 223529 57647 -614453 -350145 118851
15269 502995 -111010 418730 9217 336456 232047 -182273 853129 492508 -33982 98776
15258 458306 -350553 32400 -258238 547341 -204821 208105 551443 614727 -299022 549470
15247 349802 468000 357145 748229 119006 437835 976535 489222 513363 -188689 489370
15236 299913 139833 553706 571549 -251328 307614 776019 108024 766352 -330720 248990
15225 -25574 -401102 649618 572631 529363 258303 -341615 885090 -48416 53838 158535
15215 158535 28705 -12839 355048 516772 -179535 86141 14549 196212 -213741 -376616
15205 -376616 86169 155960 -340800 -375049 -93604 200172 -142580 -820354 419248 -136407
15194 421070 -223692 191647 -29308 395008 790362 -63182 -304867 -383652 -258033 -147884
15184 -147884 -216636 295518 84780 -13782 -45826 226840 345141 371408 -13853 -376320 205122
15172 197043 226216 165750 -90940 3398 266347 184791 -290766 152013 -19933 -187436 106032
15160 -495326 -46456 219304 253249 -88706 194941 -565885 307369 289659 552631 395421
15150 395421 -216774 317686 -531499 544343 467077 283721 250696 138740 -380628 518522
15139 405600 -133283 603896 420238 -981 307746 -98334 22534 226318 337948 139225
15128 267943 91069 217591 -176536 409144 -190442 -184561 55147 281377 113877 101000
15118 101000 256006 391168 -340962 -322195 312419 137267 -68397 338202 -65492 391666
15107 397088 -47094 174236 393890 20224 -12895 -276214 61861 245437 753875 416652
15097 416652 -223041 448810 -568365 784212 660888 111276 -221125 428457 138489 -13473
15086 817150 -121683 177103 78934 283438 -265012 -196175 133322 4505 -220338 604527
15075 606317 41415 387187 -140467 291891 585292 443338 257834 -773479 199994 632034
15065 632034 459540 646743 84144 316750 492503 -168032 -221106 210913 254619 -80720
15054 629658 378606 551510 188623 -509893 -127908 605624 364918 66732 304972 -9360
15043 314900 103745 309114 -165296 341716 570462 985725 261648 219102 8749 -9476
15032 508344 369587 868563 477485 607021 -373997 122640 77340 381416 31970 233536
15022 233536 -200289 282643 596531 438068 424987 410998 -52715 -5535 650510 758490
15012 758490 193836 611796 680571 754579 1000845 95429 -80810 -186047 64065 -95540 -321555
15001 -321555 192824 545519 -14361 256864 271159 41638 339143 509700 2437 773517
14991 773517 -225543 -287170 -320090 474745 -485704 310768 351521 -83828 219380 -87204
14980 -38602 170721 183092 436107 472824 7716 79862 83458 586627 -35408 479428 628518
14969 628518 579556 157419 -281476 535342 437798 -216075 958323 3284 357578 114695
14958 703286 -306014 663492 452437 526809 -231415 -36063 280531 354895 -586776 1042065
14947 -93158 80438 87472 340722 812207 537756 802489 201467 563679 559723 203776 117511
14936 117511 -204717 648842 276249 486305 819512 -28173 169379 375723 1370517 911139
14926 911139 490966 515122 544087 718429 244472 422321 557888 822805 372313 427099
14916 427099 1270260 53709 417431 409226 1048781 -46035 -193563 853909 315325 274998
14906 274998 -156757 9741 -408052 138971 553551 -275231 242271 415191 -635282 559116
14895 486636 193653 309901 73505 349141 678512 484326 468216 -20421 801272 993212
14885 993212 20069 946288 577701 141273 254585 277183 1563420 324311 837769 2594
14874 -58737 653538 332960 454064 785446 534868 58300 617271 714103 620429 1078729
14864 1078729 32677 218941 803994 699581 99488 885041 70719 1295379 1080727 387459
14853 567042 868329 981442 690466 1099282 1316575 940578 1111296 658354 954887 543461
14843 543461 455599 15081 909014 851632 571317 673749 43288 624204 623521 470891 443302
14832 443302 1342603 811847 811650 429975 623424 1034943 598536 713350 894130 680755
14822 680755 456858 437018 578942 321781 288581 989906 1094847 652632 505811 1115071
14812 1115071 863780 560092 948468 556925 372789 636149 1262828 587002 920280
14803 920280 1331846 1262337 604842 1277248 1262787 1017616 1389231 665771 1218186 1003479
14793 1003479 1740235 879144 1224420 1185610 609821 1854637 552073 251462 1088317
14784 1088317 891029 765366 1050706 683204 622931 1135199 628579 475255 1152154 616612
14774 616612 964611 1377807 620520 1342905 1506748 1543689 1238053 900606 1178417 1212926
14764 1212926 1465836 72232 1128357 664788 1030219 826726 844474 1461025 844600 657219
14754 657219 683864 858808 1031453 1372203 1075815 1636247 992681 999940 726656 1090760
14744 1090760 911728 1375209 823301 1455488 1477348 1109239 272983 1695121 769314
14734 1352228 1256163 1226221 1692588 719744 693910 990388 1515013 1227480 1464327 1035883
14724 1035883 923966 1023864 1253541 1168197 1265793 1269739 1395607 1524995 1318280 883814
14714 883814 1443133 868385 1164400 2085139 1041069 1078961 1339145 1730173 957428 1334749
14704 1334749 940195 1241869 980911 1407671 1287167 1217726 1215194 1364181 1872267 1395381
14694 1395381 1352943 1341474 2188652 1578327 1138122 1513967 1568009 1824778 1979659 1112044
14684 1112044 1165200 1867566 1489360 1031657 1220928 1440975 1619387 1535549 1547821 1259960
14674 1259960 1822485 1781028 2080321 1509628 2040043 1642268 1836767 1583029 1131393 1417141
14664 1417141 2356743 2103747 1844481 1605751 1573122 1811838 1827302 1775494 1876304 1693423
14654 1693423 1727078 2093481 1877428 2405808 2067048 2357147 1958212 2463360 1734089 2484997
14644 2484997 2543178 1914110 1788227 2067295 2774683 2040327 1923338 2757241 2887778 1930186
14634 1930186 2586029 2440297 2251439 2173168 2188114 2246852 2413103 2380129 2198905 2308890
14624 2308890 1834429 2632427 2695454 2076990 2289301 1650580 2088193 2482177 2029391 2746585
14614 2746585 2144470 2633787 2547946 2930146 2921485 2406355 2780845 3348767 2491755 3081961
14604 3081961 3155577 2980909 2714571 2925538 2389519 2769269 3036668 3199949 3120698 3356494
14594 3356494 3078695 2886602 2809573 3000501 2607325 3573674 3916938 3309807 3506252 3119302
14584 3119302 3403690 4209464 3087830 3158222 3555520 3829195 4039882 3023870 4054390
14575 4054390 3742084 3835416 3594162 4094983 4770008 4127567 4757716 5695384 5851114 5479276
14565 5479276 5954969 5928695 6094980 6463190 7031990 6934001 7150724 7629149 7456811 7697972
14555 7697972 8528699 7722461 8293645 9434620 9017634 9363857 9708561 9402700 9748169
14546 9748169 9572774 9424720 10100900 9866746 10133503 10401056 9961664 9688004 9609480 9343084
14536 9343084 9497668 9054299 8822757 8242518 8223527 8262042 8064480 8187206 8832414 7383764
14526 7383764 8155263 7736818 7249014 7451332 7180097 7374316 6780720 7050836 6623523
14517 6623523 6248697 5989520 6484845 5739041 5476334 5190806 5639693 5746728 4918056
14508 4918056 5436959 5617349 5200718 5054141 5874763 5889417 4992454 4889710 4794186 5347176
14498 5347176 4491634 5179438 5296587 4704516 4754524 4933582 4690756 4634842 4904589 4801424
14488 4801424 5106817 4849158 5245032 5611894 4972939 5303310 5171735 5260935 5537371 5475805
14478 5475805 5163958 5851411 5347233 5654422 5348211 6089078 5259485 5299402 6087503 5799976
14468 5799976 6388814 6652769 6307094 6417386 6503920 6479020 6583906 6476479 7171021 6996725
14458 6996725 6850992 7028500 7159230 8100662 7416098 7925569 7875952 7784055 7830853 7682601
14448 7682601 8704356 8089183 8113541 8291140 8165199 8217152 8614817 9496636 8973345 9099952
14438 9099952 9006404 9122776 9194641 9897375 9622918 10041773 10349318 9852148 10837441 10704568
14428 10704568 10304368 11086259 10923509 10934460 11319712 11629181 11719413 11401261 11810087 12103407
14418 12103407 11889166 12481528 12692672 12705265 12698970 13323344 13171416 14022339 13788148 14184646
14408 14184646 14006205 14293092 14729971 14359375 14884873 14340022 15214159 14917865 16139234
14399 16139234 16287995 16598313 16700788 16986936 16548025 17373751 16955331 18179533 18281364
14390 18281364 18751375 19007668 19188111 19732457 20144004 20152296 21053135 21279380 21177526 22007512
14380 22007512 22551786 22486898 23267623 23669488 23640380 24854749 24531202 25311427 26090687
14371 26090687 26902014 27197679 27527827 27638987 28906579 29680066 30641544 30314767 31142223
14362 31142223 31426436 32480169 33680402 34469786 35358295 36503565 36816761 37923725 38838622
14353 38838622 39807609 40210407 41698237 42901655 44008056 44989361 46398063 47195023 49018679
14344 49018679 50726716 51688860 53018087 54862529 56964551 58382863 60123296 62195015
14336 62195015 64672445 66749427 68958159 71206911 74464123 76276903 78952230 82145125
14328 82145125 85405303 89370603 92069717 96044789 99288424 103985995 108201106 112486024
14320 112486024 116862231 121801260 127798670 133308229 139354935 145516367 151318750 158286218
14312 158286218 166260666 173279204 181549062 189192880 198074660 207304317 216582738 227057775
14304 227057775 238326344 250477993 262882416 276468751 291194225 307563299 324395127
14297 324395127 343124455 363226873 383796756 405786513 426254593 440769069 449775667
14290 449775667 458291779 466239099 470074008 471199661 475218737 481691017 487699925 493622400
14282 493622400 498569651 502961445 506348997 509817565 513050854 515037883 514754219 515805524
14274 515805524 518868874 522338503 524634281 526581322 528025736 528840485 527004290 524439233
14266 524439233 523268576 520746214 517611697 512248304 506995907 501778089 496789704 492020900
14258 492020900 486031254 480831688 476358846 471632340 468512394 466245438 463031270 460149464
14250 460149464 455255733 450989538 447192861 441644367 437033077 432513538 427719595 422711753
14242 422711753 415479035 409038073 400558323 392427117 384191506 376454026 368382703 359541068
14234 359541068 350915965 342073222 333107247 325246666 317168111 309717793 302334269 294012900
14226 294012900 286228686 277847522 269205250 260801996 252363166 242949611 233533415 223989259
14218 223989259 214742543 205691578 196831262 187163461 179539792 171601395 163572612 155628529
14210 155628529 144929027 133262680 124980923 117709696 111149494 106246232 101109463 96653643
14202 96653643 92837818 89093346 85626242 83274712 79230064 76656626 73888625 71277605
14194 71277605 69765241 66784512 65005084 62962726 61193126 59895172 57807591 56257106
14186 56257106 54040747 53195965 51022155 49519127 48545524 46961579 45918774 44805740
14178 44805740 44365368 42311804 42023137 40441704 39662696 38921647 38364719 37200374 36556150
14169 36556150 34983965 34547453 34132741 33442981 32630814 31665510 31067975 30222166 29623600
14160 29623600 28988085 28156290 28076887 27844720 27419384 26498316 26346254 25391046 25333754 24631281
14150 24631281 23788005 23811470 23860255 23421648 21915488 22205793 21562424 21574698 21153955 20869967
14140 20869967 19765436 19682827 19146778 19455493 19228890 18461944 18404241 18003876 17587304
14131 17587304 16949187 17160101 17134404 16726878 16779310 16040957 15797608 15538031 15420635 14711994
14121 14711994 14981728 14600377 14595789 14408861 13671257 13909030 13740695 13195918 13558444 12682405
14111 12682405 13418282 12653140 13329047 11970618 12333810 11844196 11933668 11942584 11232850 11482521
14101 11482521 11464230 11466458 11198049 10709250 10974497 10975000 10181090 10961159 10019139 10601696
14091 10601696 10176474 10322056 10145596 9530655 9964815 9693119 9978656 9738471 9666603
14082 9666603 9374308 9232864 9101581 8807005 8875025 9176400 8364957 8898108 8177931 8274412
14072 8274412 8619797 7947671 8354443 8620810 8668055 8244497 7765353 8096942 7581509 8074030
14062 8074030 7967834 8405880 7379484 6924350 7606197 7188631 7703783 7421153 6539767
14053 6539767 6849629 7057152 6680185 7096667 7155281 6808757 6335524 6546506 6895677 6360312
14043 6360312 6378844 6232395 5915205 5638532 6231627 6397732 6009979 6027036 5857651 5724001
14033 5724001 6079740 6377903 6160906 5835674 5800213 5244044 5883371 5422688 5656125 4921075
14023 4921075 5126551 5327926 5544462 5370282 5519565 5138449 5697238 4346491 5155519
14014 5155519 5068307 5186238 5526631 4850247 5329727 5092864 5957952 5874240 6155938 6516527
14004 6516527 6305376 6517764 7148356 7010611 7215441 7586429 7666668 7280707 8168841 8610489
13994 8610489 7951228 8842372 8181913 8470042 9539080 9439993 9212224 9784116 9824692 9539565
13984 9539565 9954841 9794152 9971923 9877734 9730948 9968601 8942943 8995024 8846680 9274044
13974 9274044 8575271 9065965 8840232 8807722 8028619 8034918 7723773 7544994 7206485 7100885
13964 7100885 7281983 6960933 7221666 6315045 6920222 6174639 6243712 5534446 5637568 5893021
13954 5893021 5481474 5678926 5258970 4762273 4367738 4453256 4441904 4867507 4372835 4271631
13944 4271631 4239568 3848940 4507653 4159457 3781654 3890967 3570822 3257147 4033880 3277479
13934 3277479 3079996 3228145 3027096 2796997 3221401 3320998 2445867 2659196 3119176 3355881
13924 3355881 2401034 2219954 2593880 3082968 2101038 2007445 2396568 1715156 2322827 2148995
13914 2148995 2397319 1792305 2301364 2091316 2192401 2232229 2208518 2656638 2563606 2143335
13904 2143335 1903431 1754050 2122517 2240769 1541731 1665016 2289669 1823732 2028200
13895 2028200 1622135 2014608 1826268 2175090 1803909 1393368 2315034 2344286 1685098 2057133
13885 2057133 1776984 2396955 2350732 2293101 1927293 1547239 1884837 2290991 1961990 2039419
13875 2039419 1484345 2511189 2339616 2215224 1240858 1927832 1831773 1652265 1597917 2280539
13865 2280539 1117248 1416498 1770058 2234224 2182324 1622513 2290123 1548292 2039981
13856 2039981 1719707 1965458 1378489 1992267 1133948 1707820 1334194 1576223 1293484
13847 1293484 1821951 1175073 1756957 1133462 2222588 1521494 1395747 1432446 1869514
13838 1869514 1014084 1696622 1450511 1834306 1746776 1014386 1418665 1866661 2082897 1505182
13828 1505182 1477641 1644562 1705926 1810426 866544 1334476 1383468 1579338 1907878 1290946
13818 1290946 1698673 874829 968729 1779745 1289548 1868170 1874197 940038 1294729 687913
13808 687913 1640634 1885137 1549133 1237324 1159276 2028932 1122539 1353490 1618400 997579
13798 997579 1282136 1808681 1842853 1071525 756115 1711737 1738682 1440829 1146293 541075
13787 1275800 1181482 1401754 1745358 826560 855565 1075163 1295574 1072409 1362649 1267031
13777 1267031 1570921 910395 1155165 479669 735960 1374665 1525714 805285 872821 1338458
13767 1338458 1394468 906022 1133501 1235194 1331555 1114004 1485973 1008634 1244334 728331
13757 728331 1339266 1136329 1894498 911299 1267110 1281791 940946 1385474 602485 949398
13747 949398 1638319 823050 825835 723890 1085738 867461 1600536 727925 1412689 838268
13737 838268 494715 1308517 644271 1310084 1275936 1018071 1404884 765360 298032 561639
13727 561639 584388 532806 838746 322628 1062284 1334346 796697 984332 1256243 885059
13717 885059 1063259 1080988 921355 840465 745004 1158327 506961 420616 719797 1236892
13707 1236892 1057021 830191 533365 553471 907519 151138 1026166 1412336 863028 1163685
13697 1163685 353882 667842 243289 1002161 820801 688092 718317 885857 587119 1152390
13687 1152390 499933 482298 464727 925767 706338 893944 195511 454168 1211254 1154650
13677 1154650 583182 553863 610023 751362 969840 1025639 736121 882930 664846 884469
13667 884469 1548068 230746 1008558 618904 596767 562557 778040 825919 758382 728739
13657 728739 945101 342481 1084401 1056674 278922 489679 1158988 841765 1320508 766973
13647 766973 1260158 1140752 695161 912441 1315038 -78042 827511 457904 1211410 1290779
13637 1290779 563819 866291 581260 319647 961293 394272 174479 1150736 1156475 1159617
13627 1159617 98961 642748 849413 958994 1074516 943123 514211 1377029 1058841 1211298
13617 1211298 295634 942350 1012983 1014249 577998 699305 378919 678664 1057254 807267
13607 807267 596919 311708 409346 548106 294648 1007457 972773 962186 601917 1091698
13597 1091698 476344 622981 680700 759828 563527 1093462 523118 179451 781012 1092076
13587 1092076 546662 1125734 382643 1001333 365905 625583 838071 19269 736190 107689
13576 904181 539850 1112627 607626 720468 704407 351626 597425 936745 850614 878697
13566 878697 1078921 3206 608590 1254867 770367 316216 697006 332130 284207 722757
13556 722757 342755 499628 215754 840738 -120652 835187 786827 891762 390531 816462
13546 816462 1419073 523844 501334 138792 817861 54161 684975 638323 510935 167584
13535 442432 783004 543575 220006 672506 581062 97544 -288451 369084 440938 200740
13524 326557 650758 560216 544616 1186554 693350 800220 281201 694936 676670 940171
13514 940171 511579 368298 123716 370808 388861 662314 544543 532858 280412 213481
13504 213481 -102068 635324 -43603 545673 143218 358361 353639 325578 744658 174754
13493 182828 389664 402250 135354 209585 176187 963174 -157772 602668 347064 555288
13483 555288 218842 761333 404230 1121967 46753 1372461 365001 374403 599502 356979
13473 356979 1004625 55400 32540 473526 344034 1045396 114292 483500 797555 375939
13462 849821 427453 567376 85133 492365 -326565 311702 -385955 -217040 79079 672408
13452 672408 -305073 328905 601475 147704 76477 796989 822668 846547 591524 601545
13442 601545 -346278 -190216 422601 -124121 199569 312338 475241 266535 324785 455374
13432 455374 733776 565256 788226 580521 2914 668529 333387 387773 511883 41235
13421 420847 356378 256296 -233433 456655 392628 475853 5577 276255 73748 442044 263591
13410 263591 -423107 -41965 760955 513973 630287 471147 70167 175632 750204 23717
13399 -340045 334647 362023 493834 546864 507821 136420 -398013 389530 -94204 268694
13388 4982 612023 671836 -134559 14140 163276 427009 693190 173340 436584 463309
13378 463309 60431 885781 -123304 186940 458440 289964 910981 194535 551378 239315
13367 119196 -177682 434545 434393 490716 1014080 -377373 823567 453299 475915 799713
13357 799713 139248 570433 553517 234418 292639 489818 299592 242099 219506 -117885
13346 -1039 650172 52609 578251 544094 554967 526770 317943 749144 791948 150145 388570
13335 388570 210709 655355 104093 205066 160177 595784 -838983 289391 1687 268104
13325 268104 764150 1114944 639177 664986 202514 203812 517793 -102427 -184338 -24633
13314 543476 302874 1037241 449263 -361466 561501 221586 1097213 352857 850030 896357
13304 896357 380081 758766 103243 113707 -196873 326011 262700 444158 296413 -152888
13293 333357 180619 -24007 853757 352603 3679 -1936 130628 667308 146668 329307
13283 329307 187850 1043956 55346 685963 -492361 -556728 107483 387243 -358135 813280
13272 -27406 163234 -201639 -161147 -103527 566634 63787 -317172 318437 998 565713 476792
13261 476792 611311 -33781 126629 324397 -334612 301891 -11358 231270 610983 382888
13251 382888 1132996 -82770 341056 211998 -397085 599616 -296621 233498 -176118 156518
13240 75076 599146 555253 -168626 459354 629805 98800 166822 420620 -34114 396506
13229 -256042 631294 -25114 -110011 1096939 389255 -16496 516664 413962 85740 168939
13219 168939 -84758 -22144 454521 593863 268691 595186 -160696 144967 273125 472170
13209 472170 354245 444820 -491075 -208691 200080 163831 378625 548187 35744 402372
13199 402372 -290338 404139 134183 -81110 171180 -167857 432942 -70247 -72314 -24105
13188 -105418 -386320 -521765 50661 -114549 -32280 530593 185150 -373042 424441 162676
13177 -76088 41077 269773 134068 526370 165852 384943 299219 116309 139047 -34045
13166 377575 546564 -175296 222370 215804 -147154 92860 436458 205422 473253 -328846
13155 348485 607222 5193 353077 -195611 158487 206208 -291798 199821 215497 235757
13145 235757 314896 265332 255238 75144 607744 241257 -547824 140451 37590 66991 50558
13134 50558 -308707 286741 91363 -80271 596620 -243436 186370 508728 -227944 274906
13123 -596678 -477 116250 131074 202740 52957 -367280 421591 -135853 112083 359468 444734
13112 444734 -80771 727235 -61212 545391 -16602 129048 -46787 -249530 259720 472892
13102 472892 -11693 507975 153085 785105 357846 277539 -253049 301171 173368 433036
13092 433036 469425 125434 -297019 464839 402556 887737 226802 -335742 -168056 34785
13081 139098 478301 687994 -259336 417581 388029 415075 147583 290933 204346 -274027
13070 433536 -939893 -197632 -240793 613327 -236404 595 405627 502571 214368 292866 731291
13059 731291 437840 182677 257912 -1953 202707 110741 229631 -312626 458521 206141
13048 -1843 -465123 -321776 293523 462190 302865 -184796 -82877 -591216 -289637 -110139
13037 -125703 500480 349883 612088 -242658 172061 388104 205945 -62997 672954 102244
13026 -397030 79131 -111603 -50814 600428 -138134 -19590 12597 146071 496064 488024 254479
13015 254479 -97140 -389205 -84170 26226 827151 82986 92294 732060 -34867 66076 511965
13004 511965 669110 261424 -362299 304250 -63963 1259976 29858 728305 391925 482821
12994 482821 51551 62231 579400 181175 -53271 425847 -306503 396104 -301417 -597347
12984 -597347 -71885 282290 439999 -43787 -320593 -604373 170782 -8219 119680 36115
12973 269570 551350 -151930 328211 434316 469415 103411 -304806 243027 -410495 -601235
12963 -601235 539669 -179506 194464 -432237 431688 -19369 -106574 -455785 656945 -357978
12952 185440 109901 318099 413641 500762 -117978 685223 235660 174869 125731 20387 55155
12941 55155 -612740 -273715 758559 244195 518666 589474 97689 418139 -466808 569837
12930 -787064 -486133 -31403 603246 594210 412493 -41470 -214631 348762 -253755 490550
12919 200671 -292712 -263551 539209 141408 312443 -260972 -150401 359577 -164475 48782
12908 -43681 275269 -349449 126133 323909 309099 59829 -412469 549431 212 163421 16793
12896 -191310 -278517 -72166 187267 -267485 -113634 -497229 25510 304789 -347171 62722
12885 147247 227632 -384794 234421 70358 141338 267574 264083 292422 -78429 -218349 277116
12873 260834 -914045 858043 368300 13822 -81404 10698 -245121 -7865 180454 68896 417468
12862 417468 -88459 381023 78680 -155005 408445 247424 -148138 -182406 192297 -131566
12851 242018 257961 268530 -322014 -785231 9690 736527 -451670 -570742 -9820 -126551 -158467
12840 -158467 64270 415940 -717378 878209 -516000 29606 1236 58896 -137931 358103
12829 -182079 -158523 -191027 -92348 315198 147888 156726 298626 150302 -115069 -53091 492260
12817 108750 616235 -137337 248114 -458807 373624 -454925 459403 -436108 238769 51696
12806 -190711 -155647 -440339 11453 -271110 296777 8915 7796 -425620 250901 70387 -339465
12794 153916 -260062 98198 -495583 214980 -652504 390152 494667 790477 485567 399750
12784 399750 -298514 -229195 304399 -252934 7672 -635913 76263 -648301 -452974 -121161
12773 -701895 -422415 488329 -7404 -58268 542216 77648 -256223 -77675 -356166 121587
12762 453462 148639 -558453 -242934 76352 492832 -611689 -161828 -122563 164350 15213
12751 94040 224537 454941 -206847 344 -159278 452835 218297 111817 163069 455725
12741 455725 -103385 -445699 206535 -188142 573889 466625 1102 491005 110459 368062
12731 368062 423814 75982 51913 92533 -278622 -536668 -535897 -345140 -2651 262715 158499
12720 158499 495295 -50412 461211 -279929 55896 13865 -136894 326766 310093 -212902
12709 411238 272703 800657 32071 585967 -122286 30145 193381 194635 7880 963601 317381
12697 592919 127741 449137 92881 99867 9877 -242590 -223022 251519 245718 -257167 117452
12685 429539 -617939 -310958 272464 207846 -122814 279452 5976 1050752 -460394 -437695
12675 -437695 -7146 386910 412113 54732 632525 588903 635618 -33937 -135005 -403562 -528290
12664 -528290 336418 560458 -217486 237297 491177 1013800 5364 -186565 349869 -191693
12653 337431 501729 53733 6234 630606 -766520 387760 187701 -49968 437055 -84594
12642 109282 282705 484550 -412257 343499 -234442 431784 -57189 74376 -199410 563063
12631 -40270 364375 212966 574286 -26777 367980 354503 -809629 430082 356986 387453
12621 387453 -252206 -373518 517043 324846 -171626 685481 226635 302594 -250961 -181840
12611 -181840 182690 64640 -277541 305122 -210993 316240 60219 399605 846974 614999
12601 614999 416446 -56109 509329 263992 466093 370094 -1362 -212014 -224861 -88894 298565
12589 432947 300329 131507 -236646 -334022 145479 -762133 -168335 -134076 246419 233429
12579 233429 -334403 139593 -325557 243729 1177619 53930 140246 350362 3318 167717
12569 167717 -158965 -250052 90075 -368108 26573 -562662 570272 59472 -107798 -56622
12559 -56622 111789 443731 57681 452195 573468 -74509 411485 290649 -674440 -15859
12548 482928 299559 130860 170821 232644 124781 -88940 -26434 -339737 374295 -351189
12537 27619 -399289 -309292 578720 143042 -164954 -57240 -34305 61197 -585788 14990 -14772
12525 316880 547449 -119194 -546867 293379 356067 160483 -714029 237691 141441 -393181
12514 -22377 356082 -254234 -54689 643389 -268141 157436 298409 158999 120200 -41529
12503 260533 -553877 312233 -202120 -305783 -300022 -117682 135707 69288 -364824 -473725
12493 -473725 298677 214015 -52760 34115 326669 -616657 -524038 665730 596247 -355351
12482 -13724 -373371 530607 325605 -193597 -146480 -138360 -366757 -177999 -324233 -925748
12472 -925748 280182 178061 71948 386125 -51906 689649 -723455 -417205 59194 403710
12462 403710 -472900 518297 304855 -365468 486194 -82770 -201463 175648 429623 -327021
12451 -133937 479916 386975 -253743 -359224 52857 -37621 261105 -184165 29666 267041
12441 267041 -657411 -29049 202085 -255797 -524995 420199 -111602 172980 305709 260209
12431 260209 -251817 275385 330604 126251 -113806 299319 -16908 431186 720652 315238
12420 133477 -252525 -137489 288124 -170703 407681 334591 99172 625032 -41444 53146
12409 109914 -408417 -87675 -171538 -189313 -140221 -218109 -173174 77268 560750 700163 158462
12397 607806 -978037 -678560 503893 33283 -83599 -265753 76104 584553 -8154 178840
12386 347147 -326672 156439 396447 -112672 -364045 357679 -353279 -13431 191320 -96731
12375 -14445 386134 231995 -417573 142600 -280223 512190 -305437 -321643 -51309 594621
12364 -322049 132219 338520 129481 426494 -4150 -144521 385941 443583 223016 -527744
12353 161148 118624 229979 -611258 491539 -94736 -905932 11186 -13637 96373 -251608
12342 325317 205257 -30742 -165675 -39064 426826 573055 1758 106317 545494 -21845
12331 42788 -253687 318254 -390234 -126835 103444 727373 -251151 82117 237324 -29765
12320 -24169 -463657 457682 65596 -106207 23575 -366231 438440 -100765 162109 496968
12310 496968 53190 -561333 -396091 419064 -109810 264048 396896 -222267 -218150 283167
12299 -137195 329489 533199 -402630 -113857 25806 272779 34913 184341 251327 559928
12289 559928 403362 460777 570407 95396 -25172 110223 -256281 16831 214743 -554071
12278 311942 261142 -355410 -61724 -191185 84827 354200 153055 169006 10564 -183461
12267 54177 -108767 452608 699740 -309683 96835 989038 175917 -4751 222908 57086
12256 124493 216870 232993 -350255 384281 151657 13862 401549 585622 50372 -460998
12245 271230 493809 -149928 763837 -64862 -574 633156 251338 275285 192610 -37961 485953
12233 144703 -14257 440719 780978 180192 94848 540781 -460748 126237 195896 -415634
12222 479611 327270 404958 84150 12636 112516 565380 11261 976383 -228504 113095
12211 -338956 551725 288183 97545 -42913 145017 -105375 442725 -235318 267906 38736
12200 -260669 -426000 -66059 345162 -245535 16360 214936 356434 100668 730526 117039
12189 -459067 104312 467409 163550 214447 -468680 430206 146135 -330682 1002986 -248213
12178 248168 446146 531168 -78361 469394 34114 -207825 -104904 -205295 743681 564446
12168 564446 409322 405218 86826 308728 -417700 -59715 23935 49421 182579 1065091 721594
12157 721594 107093 -27432 51325 374371 318416 -159536 424606 -247119 293559 777718
12147 777718 557703 59274 524900 186104 -515038 -37851 -84428 114155 422641 -144351
12136 -147345 122998 335005 693457 392588 351530 811061 -3773 -601450 556736 -203111
12125 117894 104964 68429 -74447 -111845 -139356 150481 22402 542973 418870 310677 -99524
12113 71570 -81827 145645 -397792 502770 -161104 441904 -295397 -48817 -277969 669015
12102 162884 -48223 114197 323577 122567 -461972 -94385 498023 -366851 275686 222963
12092 222963 142199 -844974 437491 36771 3808 -1011473 622976 427421 -120676 23498
12081 855785 18091 303381 -51843 351381 85169 -44444 993922 122971 856522 435175
12071 435175 776515 178357 304070 611357 4809 285503 175992 208337 -116023 -16285
12060 565277 637017 369748 18329 -682698 324036 232622 -216387 -623768 -64037 -305846
12050 -305846 361149 -370782 221673 -276566 -596648 93353 -11037 43277 633875 -740910
12039 466866 -254010 -282084 -47469 -12504 -300444 60437 -54188 395407 563259 -220092
12028 588361 -402727 593191 113785 389342 37690 -284253 560860 76037 368307 -245437
12017 556017 611299 76997 -490090 88050 -162022 447648 -692863 80437 -40574 32485 487544
12006 487544 335952 -677265 313240 109389 136999 559582 -252145 1632 -752327 318619
11995 -624361 -412223 144835 -255754 -676300 50187 148123 272394 -80918 -712256 -231538
11984 168561 52227 -25453 292152 339652 77890 -134723 196448 -167197 -213505 548358
11973 -22851 -191096 -111623 524900 62083 -12852 904962 254595 -438556 -239231 259141
11962 342976 -620938 -295723 -624828 81895 -61203 157342 587411 174249 119419 301743
11952 301743 230344 -265823 310878 141324 -144487 466494 -626281 -187633 635024 -570068
11941 -491760 258467 100132 1383 129611 235780 -513445 -119799 225068 -522567 45744
11930 -343880 305247 -556122 321276 95682 890190 383141 -459015 121642 89720 -97178
11919 88386 -712643 117628 -283625 238907 679173 -81584 -396260 -51831 -202716 -286107
11909 -286107 -114074 -469907 -381385 190261 542289 -306553 224575 -392737 45354 444962
11899 444962 11123 22843 -120853 -803341 -194878 -13779 -204552 74660 -432028 458239
11888 -375113 72505 -207245 -410781 54524 522225 336728 109989 -18342 14756 -283632
11877 -116601 -13759 483707 590366 -497104 758769 138887 40343 -172484 -161895 -96690
11867 -96690 -133794 -332581 466925 -115541 -103797 119108 185922 540958 -9783 -64483 -545028
11856 -545028 -49856 485357 243814 -391073 -390712 -273066 -217503 547589 -868916 497744
11845 -109903 8866 -327709 399678 7545 -102676 -201760 370700 148663 313375 306867 -214739
11833 -788846 -311132 276757 -175000 -321576 -174960 -315849 165476 -659996 -386247 211877
11822 63888 -531194 349961 -304823 -749735 500020 158299 -216741 30467 109662 -596018
11811 -254377 37265 -340280 -168684 20337 92251 -577624 187079 469989 94172 -75349
11800 -64637 163878 181069 40185 -361121 -420176 446402 -3062 -567705 -347548 -255978 -614279
11789 -614279 -601048 294586 -308908 -32447 386450 -533000 -271669 196293 166840 188651
11779 188651 204786 -310447 455712 -687747 1525 216339 403047 -25500 276531 -674462
11768 14381 290924 -129119 -112193 -56197 -382351 36597 199844 -1564 28906 -591768 -498748
11757 -498748 156234 364536 -393776 -228524 80247 179664 -328520 -199264 367117 -166299
11746 48183 -34700 44628 -463098 -92664 467389 274651 82762 -398158 -645021 233767
11735 -88895 225597 355065 60072 457402 -622645 -260087 -520349 202331 -166558 -28447
11724 85767 -36629 270101 -272816 205900 304911 346587 470877 211598 259785 503007
11714 503007 390384 613843 256108 371779 -200468 283458 330853 423826 -28367 695097
11703 91679 33225 -17560 -394025 -267345 -544608 551103 221322 497343 -231463 4071
11692 89997 69444 -74677 259586 519749 13758 5082 -187821 519201 -327274 -375192 64308
11680 -126109 -205256 140675 33871 -148894 231649 -354010 508284 -136622 292438 398222
11670 398222 -305218 182571 208810 449196 571053 -213860 -507930 627049 -25723 368166
11659 446746 -373798 263578 -385132 -73098 290923 194598 -141816 201761 189476 16981
11648 -390901 -449850 -67041 -203100 -27869 89588 -448938 241050 -42781 57300 -99556 -375842
11637 -375842 -252310 114225 289987 -347381 121523 62408 75380 -333537 -2543 12463
11626 -358782 22560 770458 -32308 527961 569877 310052 31553 -142326 236180 -299672
11615 -355841 -87124 55244 227330 304729 -47476 -490917 296239 639219 -40596 98107 87673
11604 87673 -69309 246287 448044 -29827 -117687 1281002 -195979 252911 -31141 178894
11593 -127511 57232 -127927 -251076 229327 -259903 459467 -361431 -371708 -330481 99356
11582 -48091 271544 -139468 -160536 -42581 706438 586112 4968 255572 -159408 148851
11571 162506 -337559 436770 35297 243142 -117279 51147 266159 -22935 13001 140443
11561 140443 1050373 -127780 504069 186211 -342179 -311868 105681 355782 246040 -219684
11550 501720 166800 -163712 -70817 215270 -3590 714639 589423 -106220 331013 411647
11540 411647 396090 387563 -52716 427440 128634 -361677 -149276 182617 184546 -12633 369919
11528 490048 209974 338879 488743 295241 -234943 488167 793992 -402295 583375 -1824
11517 119350 -330928 153755 68003 164074 188329 2324 418780 -36175 -61184 -34411 666366
11505 14749 17253 -22054 96242 802671 -307335 109710 365110 -174242 -297630 -208316 188343
11493 389640 13263 277516 266527 442481 -118501 464171 388579 279959 563920 150154
11482 -112086 83229 102855 356009 350039 -2386 -27333 -473157 218806 682722 60745 269193
11471 269193 189296 -119454 743395 489389 264669 149792 272183 103444 -337034 239554
11460 -85518 -98206 -436060 -449616 178454 -748826 -390619 -127157 -82290 -72808 452084 65714
11448 89766 786583 569689 87655 -44183 -20715 -63608 -320156 98238 -8373 620265 210454
11436 408314 -97491 -352712 383354 15648 -165431 241392 699813 -31914 -272955 -425594
11426 -425594 180804 487174 -393535 485506 -147126 255935 -120640 163732 -545327 -61664
11415 567540 164459 677128 -123281 607356 523444 379791 187160 -313883 -239497 296194
11404 531183 -91981 -114288 -344347 -574149 -345511 -207435 244867 958447 15941 159051
11394 159051 112757 -11169 10582 344016 458986 155345 366002 -230481 -88341 -461951
11384 -461951 -161343 -145114 -175608 482345 477477 60854 -79824 801311 221359 262339 -150527
11372 262231 -535946 136582 -446028 -501358 -550473 -40843 -176323 95038 488524 -333782
11361 146430 688722 146783 -120175 410765 261408 -70205 -817457 101981 -76639 273206
11350 231313 -518846 -165362 -207575 -104361 -408669 98189 798560 356408 -287769 19312
11339 601693 134111 7403 142228 59618 -56764 -89649 -233147 -346257 224660 -99049 -324706
11328 -324706 231930 353188 -491606 103040 -706175 -360751 402327 -182607 -194655 -362677
11318 -362677 -44233 -554534 -350057 -509919 56977 29371 -95081 -372190 482888 365083
11308 365083 -206237 -578335 -586447 -191146 -298744 488663 -557712 -584087 -696584 -98097
11297 75959 -269478 97867 -444765 31974 -183953 -330448 306255 -537205 -22329 -77895
11287 -77895 157368 -672760 -93350 -478127 -144370 -331132 -190083 36889 129324 227854
11277 227854 32146 -49249 110671 -335038 16642 225435 -479877 -272572 295481 -61028
11266 675618 482028 -1263751 -463813 -62683 -215083 -123525 -311520 -356779 -115440 140701
11255 -387808 -400881 -1409686 -75331 300773 -91029 -225447 59188 -402200 312247 -387545
11244 -307405 413604 470606 520048 -491285 -304981 167172 5900 -277300 -276161 393294 -260597
11232 -148023 -499185 494458 66064 90719 -103752 -355883 287332 -71865 -519438 663741
11221 20341 82134 -336795 -38974 -366216 -50565 67923 78884 237408 -762205 368650 -558169
11209 769668 -269526 -207908 183915 108138 182097 -77668 -491247 93625 -349907 -297353 -531122
11198 -531122 -353580 -41437 -55368 -172869 -13547 -364800 175112 198934 -272041 121417
11187 23933 -435214 -182649 -49427 316543 -110797 254989 439470 -24790 -246465 -370426
11177 -370426 -161151 -230482 -401217 -151161 121194 -327464 -123753 -493838 317086 384863
11167 384863 -341981 -420749 -305050 -305754 -217863 -284816 494900 -100764 328158 -266168 -417651
11156 -417651 -166288 -254024 -234399 407975 -84509 169275 -430091 482793 88725 435906
11146 435906 -148682 -215731 87389 51832 -196937 -45329 41826 -290740 202571 -352845
11135 -310182 -216143 158617 420521 351046 -593916 155059 -224647 118383 620043 -131148
11124 -48249 -311609 -275677 96294 143967 327676 368621 133144 458255 -72114 -431451 114467
11112 1485206 -12496 23887 368947 24438 46654 552124 -457727 21054 -111782 325154
11101 1072239 350828 -135240 -754425 -131534 -621553 39133 -449031 -153026 54708 192137
11091 192137 -122148 -189132 46477 439500 -293315 -397971 304727 552876 799816 389858
11080 235304 85522 631001 127176 690275 220963 505939 669548 1061885 1280966 714048
11070 714048 29468 1321323 329034 486994 1199066 316396 674832 855821 759774 384433
11060 384433 149453 1044403 930350 1075238 901547 658682 846204 831781 1442727 823048
11050 823048 1009304 614496 941754 636560 769669 581143 1671990 1039015 1245754
11041 1245754 753264 1350935 981534 746192 823393 1080657 733229 1033111 751725 1361716
11031 1361716 1125423 931488 1630815 1251908 938713 1042937 679071 859553 1072040
11022 1072040 1201723 1453410 644141 1297310 314047 1356876 987294 888644 602309
11013 602309 664232 699684 1095903 956572 1402268 1733313 1039288 1685455 1060340 877401
11003 877401 1415936 1631851 1948033 1323738 1442020 1141706 1230172 1270912 1191777 1123465
10993 1123465 1834420 801360 1343953 1406993 1952332 1250029 1299852 2041520 1851642 2279914
10983 2279914 1798479 2101388 2000791 1999713 2020260 1666713 2412724 2577665 2072879 2461352
10973 2461352 2383566 2586041 2272587 2227662 1331427 2281670 2757458 2172087 2762613 2799119
10963 2799119 2197185 2698462 3030936 2620191 2521455 2146832 1631896 2773614 2827923 2390381
10953 2390381 2581833 2469953 1407108 1606477 2829026 2076706 2204868 2332914 1895242
10944 1895242 1362671 2568259 1134839 1245659 1435491 1998053 740655 1230087 1325113
10935 1325113 1400188 741120 834990 1158618 851574 1096305 943776 303174 491768 736616
10925 736616 412358 549648 415323 1233525 289168 450038 654852 1082005 768106 521900
10915 521900 431753 -57109 264551 70386 -278472 217582 -135356 26873 610782 135816
10904 256328 -151669 372258 109969 78003 264848 548588 378188 134125 286282 -432779
10893 477817 217216 326878 -42060 286230 -28699 234421 -258914 -760622 -159003 -298412
10883 -298412 408325 205464 126860 -180381 144894 256776 -185617 -338144 -210478 -155493
10873 -155493 -60902 130970 -28258 18854 541048 -265321 277645 -12479 63543 199203
10863 199203 -387292 -138734 130969 784813 -41601 -204740 -354758 -48482 205531 289846
10853 289846 234520 -17518 157185 -335287 -250008 -410287 -49843 -176137 617134 51839
10842 458529 -417403 284213 -375234 -148662 81664 -344533 -199546 172537 171804 -336077
10831 -177378 15004 -509788 -220785 519444 12204 444791 -47633 -455934 -1023428 -330469
10820 1031036 87572 -127976 206052 10273 180081 -70482 292357 149630 -549610 -428999
10810 -428999 -144687 -284362 373799 -613687 -98963 38702 -437719 -124773 436417 -1908
10799 -308354 -437685 -291148 605392 -375704 311910 -244828 -291015 255804 101446 -429340
10788 -326073 152565 -254450 441474 -320886 -315374 -89919 -138463 -212781 110540 -7495 743301
10776 -52669 -7681 103485 -376319 -453003 287881 -512680 216067 -535317 185304 -254667
10765 -334768 222777 60681 92595 -19650 375305 381748 -320679 -104076 -600042 -77693 -642836
10754 -642836 221881 143970 -494653 24605 -172804 -122750 -432419 -589641 88706 44208
10743 718821 221393 157318 272103 351946 -297989 114650 13168 -346285 -474914 511616
10732 -539614 -334186 -486929 -641519 -476363 138273 117260 -194499 -355266 -142448 -225715
10722 -225715 180863 284655 -287911 -337819 61320 -141740 488131 -450792 401804 141705
10711 8472 -87474 679851 -222182 -6582 487627 -339161 70600 275502 -420704 185727 -89162
10699 -523980 319165 352417 -800368 -55805 -604181 -455329 139770 363074 -278569 -248383
10689 -248383 11493 -331996 -100663 223932 187687 -825696 -357652 -176843 -209225 -511485
10679 -511485 417962 -174844 -508772 -324469 -208174 -181848 -89306 -486690 -386066 -58233
10668 48565 -80479 -182575 437776 -505227 -278161 -299759 -221805 108102 -433116 -41111
10657 133321 107506 610189 -6566 -522994 -20150 -61646 -453033 83682 -189439 552171 -242642
10645 -317763 -212695 63613 -153129 -358806 249103 -377544 -265962 -374025 -116874 -112836
10635 -112836 -132828 111428 -374569 -347116 -395618 -80892 -243586 319915 94732 -333121
10624 302169 -461846 127313 -10474 149365 -226357 -148384 447412 -115191 -331005 -340852
10614 -340852 -374574 33572 242024 -431074 -165257 34315 53527 138026 -256623 1254 -70486
10602 -497498 -447499 -343669 8847 -201381 -687799 572807 -32399 516862 360743 -353142
10591 -297154 -366247 341117 -168899 -132431 12077 -278356 116118 153259 -646841 79236
10580 -165671 149617 -173884 -252627 -23272 -184842 -196587 -232752 -134569 -156125 -301180 32425
10568 118565 -634572 -490323 124959 -205638 -339980 -129697 -344573 259923 238758 -480822
10557 166163 -145919 -19476 368370 -61417 -79060 41655 448394 17039 -42880 351368 -562359
10545 -200673 412719 -108578 -516312 592644 -396999 -396850 -50035 -29754 -255278 -148355
10535 -148355 -175470 -185189 -155041 -172129 -208930 51583 454447 -386850 -751674 102198 -445478
10523 272774 -592812 79277 142857 -6834 -57578 -34675 -504994 395180 474176 594425 -127580
10511 -176794 -283010 309884 -265947 44963 15172 713487 -338081 107673 -86676 205244
10500 -218450 392647 -56555 499924 -474344 -132092 235551 574356 275594 211827 167952
10490 167952 -204510 -111047 683878 -183165 -78247 400319 -324549 -123293 -86667 205158
10479 313663 -9132 596863 473781 2065 109481 -178956 220715 436889 152306 148586 3160
10467 226715 461942 -215534 10403 209454 173954 304365 -372319 74317 327124 201100
10457 201100 228067 617952 -458988 335056 199426 -290812 -401458 327944 85130 511652
10447 511652 -82215 -46889 708447 -386646 -408076 130536 -45887 -124886 -632270 -402210
10437 -402210 174057 76888 425323 -71295 814355 91894 -262123 -389167 -39119 -500501
10427 -500501 -236151 -363381 -379838 -64191 -271254 -303847 -101659 289447 101479 -493937
10416 267898 271997 484552 -425465 117720 -80615 -245659 -790 367820 355616 -64979 199157
10404 -336306 84895 -572925 -681047 83784 627554 692070 263918 -140848 435685 -420192
10393 68183 309338 297936 45949 -275429 -77984 -423864 -875554 -479579 491762 -196058
10382 -41872 -9416 202375 545609 -319764 40958 -56064 -104945 -379354 200286 -120361 705399
10370 720700 779615 748956 651408 477711 505033 366345 649003 301628 328637 -102739
10359 -74389 1316298 138445 370547 -336019 507257 -57912 627290 416184 502648 230742
10348 1125084 525511 177619 306887 590364 521419 400675 216552 295745 191599 372421
10338 372421 331130 685701 915509 620455 462107 568831 908925 412554 296289 -370561
10327 172408 335464 634868 82270 119531 53246 675602 821469 159163 -15864 30341
10316 317098 606434 366837 360639 626134 -87597 26450 171577 42249 269904 -400283
10305 -560774 532656 128870 872902 88557 -154562 -167070 199477 -80811 453990 -18026
10294 -682741 -349092 571149 49789 105227 547297 275481 -192252 83342 497657 -4161
10283 -69500 182460 628859 -69450 -280790 300077 397261 -224798 329313 -295206 49959
10272 814467 485637 226606 15534 205529 -95095 52508 -100646 -248823 -21783 361438
10261 12133 -158920 252080 410179 659001 100871 235575 -47550 176549 113661 64038
10251 64038 -449521 -180781 6723 185995 318045 -204178 -535217 -588890 58851 8231 -164178
10239 -27763 -293037 166551 34919 87119 -33600 -219005 -188846 -491782 70045 -91903 -787471
10228 -787471 106421 -203865 165324 -344310 -280897 173607 -95944 342338 86829 328235
10218 328235 9867 -83988 348884 -326843 -345957 842387 16608 -447786 -107673 -384696
10208 -384696 -505949 115752 12400 89222 -2001 61717 335303 -401566 70588 -1004460
10197 424500 -148875 -480697 -58548 91166 32198 -175827 -501153 -388079 572444 -146030
10186 289603 -370181 -203356 179041 95324 270536 -595561 -325603 -329275 207499 104868
10176 104868 -539053 -156278 -556039 -77451 -256621 -47573 -736949 -471581 -836609 36583
10165 -57553 63715 -606657 164908 -107450 155888 346199 -312769 -456632 -141088 247324
10154 512697 237510 -684919 254460 393373 -221165 -263400 -437460 -339652 87717 -96742
10143 -305093 326371 -197888 610577 -348861 -468675 -170404 -63374 -497019 128278 76078
10133 76078 -171806 -898274 -328584 -917778 49952 140467 -99163 301651 -19209 -752070
10123 -752070 43435 -356499 -410000 21409 -80106 -634849 -349888 -166177 417449 -181101
10112 -270127 -259140 55532 -182924 35912 169035 -201089 -749581 -158203 45041 -6914 380500
10100 92470 -224018 -68297 -186598 -43670 -174131 -294734 -506715 366474 463365 -365562
10089 239479 -793781 -111675 -67768 -417122 -803484 -164488 175384 -569197 75723 -605194
10078 -185376 992774 543213 524794 -447966 -366900 -392876 -193760 -711103 -47545 180933
10067 -27789 250159 352542 176012 126558 373958 -182825 -77232 -625725 -91730 -272996
10057 -272996 -41662 18975 242159 -360211 345127 302436 138206 -206947 73714 -191486
10046 248405 385816 -396852 140080 -235204 291291 -330197 -15087 -36102 330526 456979
10036 456979 195762 -71069 163758 188378 310981 49301 96580 -269762 -296152 7736 -376904
10024 18201 95173 -470200 -626056 290701 -276803 -578325 -273044 -205565 179115 154375
10014 154375 -242047 -52771 264984 -68840 -1588405 10214 -158094 -55970 446653 126047
10003 175862 -193856 618252 49463 293123 -469828 -21421 -193247 -72678 -251854 -331268
9993 -331268 -453603 -364529 -73038 -426841 -474344 85489 261053 -325935 139256 -11049 -23509
9982 -23509 108973 -112906 -8101 3718 218207 -102932 150723 119430 23962 -79461 383364
9970 236128 -335896 375902 -237856 -85652 182974 -441657 301005 430421 -205437 178964
9959 -7849 94490 -187436 605606 -349626 -294320 -440282 -61050 -563686 81233 83475 75023
9948 75023 277628 -334158 -349998 -98151 -393977 -457535 220596 -633949 422482 -525540
9937 83550 -330867 277178 -416218 -166903 145401 -329798 -736525 -345421 -821559 182287
9926 98578 267096 -50864 -196049 -325816 258946 -695273 -6086 -260775 -101132 204503
9915 -280660 220615 241813 -849728 -173320 144970 -695248 -528168 145911 -157337 -292461
9905 -292461 -47851 210637 135585 -518517 279783 -403798 18902 -477078 -833473 372653
9894 -517059 -406590 -284108 -366797 -191782 -414288 -67073 -366572 565791 190419 69426
9883 297870 -45363 173000 91509 -217012 156438 -528599 -547410 -537142 -153204 -363773
9873 -363773 118448 60430 133517 -278733 -223587 -325338 228666 -143368 -156996 -710703
9863 -710703 -339944 224446 -254211 -189066 674123 191174 -611861 -89777 -88962 -66049 658664
9851 -403273 -417839 -173414 -231136 -561511 -30056 75927 -205675 -147334 32339 -245530 -389090
9840 -389090 545466 -522562 340988 -297513 349173 -693242 -668099 535218 -529353 -456441
9830 -456441 -396699 -446815 -354797 -639064 479339 129611 -467211 -312170 51664 -710336
9819 -533783 -63355 -45367 -622785 -75998 -394849 -207065 -464987 223313 -143325 -474217
9809 -474217 -195785 -181626 183316 6450 55311 11082 -94727 537157 -129641 -659103 -43805
9797 -3203 132702 -130926 301263 -177931 -687707 98440 209541 -242005 309740 -154610
9786 33630 -622661 -623854 -33770 -65094 -275964 -525289 415648 215339 -172054 124288 -195272
9774 -280455 7920 -355814 -202213 -395314 -297144 89427 122948 280391 -651301 289597 -719682
9762 -560033 -266328 -139917 -574643 -12343 -450611 -90025 -429293 -276309 -641936 -177740
9751 112231 -422650 -158893 -178170 -537099 388796 -458849 -550412 102018 81965 -48549
9740 -80216 -150601 420959 220415 84672 -625725 -454794 -175999 -568751 596954 -64215
9729 -2498 -161423 -274518 -168658 119289 193394 -25920 119478 370098 -530082 142864
9718 98026 137750 -43491 -372177 447428 -294422 48119 371538 358413 136839 -395958 71673
9706 565794 253198 -429111 -337610 -51112 -8421 205888 -182665 -54060 -570443 -76131 401910
9694 500835 164546 185076 -160053 131001 -353948 -342426 -175951 -556355 205483 -534319
9683 -291376 252915 -911383 346479 -560836 270406 347757 -458027 249052 12365 -357406
9672 -818433 61043 148068 -477586 -269176 240530 -238829 297511 -385042 -723654 460786
9661 105287 36420 95592 -316180 -185785 -137144 -622614 -150967 -84377 -219304 57833 -555692
9649 -360994 37166 514122 227793 -478876 177747 13865 37270 -295576 -55050 51449 379991
9638 379991 19631 -9648 39278 37258 -290515 -61951 -234523 -32937 -235278 -94551 360582
9626 -167389 -249005 -207666 167881 -132985 -236279 39287 -302082 5526 -599673 66440 82065
9615 82065 -139899 -181033 -403316 -262431 132694 -101034 -50999 -307180 -7074 -436298 -295048
9604 -295048 -832553 530091 79607 -87498 -494469 -448418 22204 -734150 -65438 -589275 -209788
9592 -187845 -246629 -225188 513211 -118944 -49548 -71159 -248294 -286626 -139162 -409698 -275611
9581 -275611 -58688 157846 65962 404329 2215 406637 -59990 -482584 -304411 -127927 -370655
9570 -370655 -128294 -1189867 -80075 187279 -527435 -602280 -272251 79478 -575292 515783
9559 -183446 -255840 208414 -461018 -576432 -701213 288448 60301 307533 -242127 42165
9548 72122 128618 -138979 -469715 51090 197355 129238 -87346 287455 -870054 58686 -477454
9536 795349 -60414 714614 348926 -238774 -71781 -37289 200835 -370932 -183717 208885
9525 170013 -152976 -319893 -326261 -289777 -129047 -181502 494636 174416 -175507 432850
9514 282671 -71683 417520 -868264 -372683 -268299 -289716 82357 -309030 -97472 -157879 66029
9502 68154 149459 232968 221882 -86302 106439 -277152 -31413 593941 -403935 -218782 140672
9490 -19854 403361 -208590 -358399 242673 -73148 -382729 -354344 -294162 -242572 -442237 -273640
9479 -273640 -40055 12608 -8250 -600450 87196 146065 -264591 -155036 -385961 -81505 -206028
9468 -206028 80595 112859 -295860 284120 -628558 577609 -153978 -708820 634502 -368306
9457 -346500 -358724 -488123 166539 -582189 -313243 128715 -461614 88427 -101572 28797
9446 463295 540417 -412912 434000 -351758 -300737 -61627 -455608 718468 659699 -29657 -741227
9435 -741227 381637 -235209 237982 -661372 -489313 -551333 -157958 -175587 -67322 470142
9424 -338873 -189622 617538 -74119 -381909 604227 -250211 -797263 -200612 99856 -337334
9413 80305 162139 132214 -293134 25072 149782 234004 -331430 295138 232685 -484791 -522317
9402 -522317 487903 7371 142153 12526 74611 -80450 305618 -557808 -30917 19475 -127039
9390 -187369 35459 49970 -246894 -789747 -223262 -186381 -183144 386840 -202525 -33232 -136807
9379 -136807 20492 156278 -458872 87498 109697 -69487 -311112 707853 -158661 -228151 -88792
9367 -180158 -444680 -80611 -79932 -901613 673837 401862 -42662 16930 387011 -206544 332474
9355 -141623 -845629 -273934 391527 -54263 -44649 -565481 74301 -567162 -149865 -353365
9345 -353365 -264498 -360975 -908395 -293512 -240571 124327 -382073 214528 -483138 -385223
9335 -385223 72824 525819 -338844 413434 114383 -575714 -218776 -312098 -263262 -597419
9325 -597419 -407720 -76843 -398488 195468 -6824 349845 217133 774522 -197913 -539300
9315 -539300 -68608 -238548 114223 -303864 -401799 245706 -198661 161476 313491 43469
9304 -392522 -452576 -92021 334411 -183165 704665 -4972 -627431 -643594 -681811 -513558 267515
9292 -525058 194674 -904524 67062 -425858 216353 -16593 377681 -129739 -183525 -128840
9282 -128840 -255546 -52635 602700 -563696 458032 -176923 249165 -611851 431416 -1012
9271 193349 -154283 50076 -577086 -85359 -749652 -136725 110124 2816 216883 378373
9261 378373 -231420 -326406 71391 -543840 251950 415043 515783 267632 142534 439338
9251 439338 -52935 445995 -432438 409979 -186443 149136 -627790 149815 -357461 -65045
9240 -305455 -97593 -626891 -253949 950707 4707 162949 -856098 456419 -70652 -283433
9230 -283433 -740788 99474 -205698 47112 -200568 389417 -21126 -430080 16364 155388
9220 155388 -403921 -471270 -1571 -40888 82198 109837 -96666 -365330 -252124 -46072 144309
9208 -468081 49432 496645 -1039981 169424 -49666 317 -127912 -704012 -241699 173014
9197 -458168 195006 -338643 -384607 231509 -249745 -595290 -1092419 -664754 99415 237672
9187 237672 -213028 -213115 -202777 -41631 138036 -290224 407745 -440311 -33873 701481 -315788
9175 -32145 310647 366765 163071 141777 88865 -424168 244477 -365035 -202752 -122336 -177560
9164 -177560 -129242 78651 -280413 203295 123572 -351726 184687 165258 186302 -124071 54040
9152 -7800 -62811 -53551 217957 130199 159678 459724 142053 -653563 -231008 -309137 246352
9140 -424111 166995 11169 45302 -3066 -106652 -312661 -210322 -477919 264528 465028
9130 465028 -1072118 -350334 -11185 -566662 -367661 24798 -242922 -257829 -262528 145719
9119 -42469 47107 -161752 -311620 530201 -429563 -323493 170874 -280864 -549287 6774
9108 92574 -233451 366075 -30986 282677 -273784 -372165 -17500 318227 -862483 307199
9097 -263296 -88716 -63673 -468733 -273294 493265 -222343 -220675 119668 -192057 -353090
9087 -353090 -7400 -221214 -329953 221737 -380968 -33989 -361386 -918975 421765 229167
9077 229167 -447096 -161079 194404 13636 752589 -267854 -587274 405657 143016 123074
9067 123074 -1275799 -232220 -73198 280675 -185247 -262598 151980 -212519 219897 300120
9057 300120 -145610 428451 -32483 67634 -248826 -23893 -11571 661508 114109 -285661
9046 36896 -155881 86083 407930 254847 -177901 -363024 -405233 324716 421880 88531 252016
9035 252016 -278366 -84309 -602918 -714073 -94182 -629417 434977 409482 -11651 73697 796339
9024 796339 -487181 -229158 22837 -161652 -259991 -105454 -435181 82955 20375 -97023 -265494
9013 -265494 -268378 -597043 -658719 -53077 -615575 1718 298611 -200434 -126764 -471555 -316069
9002 -316069 -758582 -412038 -189687 -276638 -207603 28029 399558 -158562 224114 -61595
8991 -235279 218642 -246451 -138504 -476836 60757 -464628 -277249 380192 46883 -267199
8980 407827 -418930 -687228 -236925 -321669 242773 -39292 -482509 627704 -96894 292053
8969 -635523 -232434 655526 314137 666778 339695 304302 19223 242132 994705 -124252
8958 489584 -351637 -229043 -315732 -121405 -281773 361456 381339 -301168 -892 251886 324462
8947 324462 210679 -83028 -99110 553988 1269017 500453 246239 1027020 842509 1028849
8937 1028849 900943 1327078 1208008 716782 1129951 2020841 1216035 884116 1796947 1281268
8927 1281268 1501065 2114933 1516818 1909557 2156388 1740197 2452919 1919004 1993829 1662796
8917 1662796 2258562 2496498 2500055 1898515 1813887 2203528 1794628 2168971 1712834 1446353
8907 1446353 1766440 1278158 1502425 1132348 1514848 1080748 850824 1002981 1611218 889065
8897 889065 1536183 1281082 1146513 729946 219124 709772 177507 1111342 647046 1632226
8887 1632226 779605 288152 429968 677360 24056 302593 -81289 626700 386440 -73459
8876 38903 44726 -424976 188768 -694480 -240218 -438605 -243312 777526 294720 78753
8865 250502 171819 -267596 333171 414554 -451586 -38764 137714 16040 378516 605131
8855 605131 330875 -502605 -559919 313182 272755 264613 -279580 230689 -208087 3575 -784
8843 545344 332273 338974 210237 -110637 -307181 -393816 156060 -112059 -174851 407627
8832 -35783 -325507 -84065 -60997 -115704 363974 -219129 -41251 -244007 -219192 -91692 -60955
8821 -60955 -4357 -30729 32544 8986 48001 -597131 182880 284679 -603698 -274956 -163751
8810 -163751 35865 -22602 -408068 507721 -873484 -329007 -480054 277235 756988 -251960
8799 83033 257115 400655 -126440 389377 -250887 144144 -154470 -228673 -313477 -375777
8789 -375777 381926 743028 -58934 599867 -388847 542288 -68897 -463354 273885 354128
8779 354128 62013 -279663 227229 100122 -552169 -153861 366643 47288 329772 -553349
8768 150398 -674406 -356756 -111935 -116191 -229209 -664446 274956 -211419 -229268 -1749 446561
8756 -619209 -343403 177732 -300357 -12068 -16020 370455 -86186 -213219 -137642 40111 -285719
8744 -335115 33130 324479 -294062 -331031 -167658 5253 208707 -545228 189793 -111632
8733 -132510 -309127 435940 59350 -51897 328072 -626990 -383092 -46956 436295 -8141 -60886
8722 -60886 -338404 -121551 -440486 59773 -154046 -24241 -350351 -600960 10299 94690 341754
8711 341754 -474387 -228224 -677671 -434877 -201581 687774 -573055 1098860 -76694 183867
8700 122864 -573235 -255694 395742 -799750 -231819 -596818 -27934 -95987 -283694 -87956
8689 -533572 -249256 -603477 -418337 -62299 -327061 -237047 -59353 -453142 -319739 156582
8678 -88699 -226640 -245998 205049 869777 -360430 -244492 -382482 608780 165302 -135893
8667 185597 15253 -3603 -34820 40561 -338899 -680415 -83848 -45428 67486 375127 127566
8655 -591950 352997 598522 164110 -186017 -77366 81936 145403 162639 635077 -177209
8644 190550 -84716 -30960 145710 -62141 -612912 221970 144481 158180 36649 -350164 101978
8632 -232613 -641 798805 -48186 35409 -51741 -119548 -15526 20757 -170970 429348 -407055
8620 -655267 201745 -604826 -266716 802569 324434 52587 -285066 -601107 -276713 -679375
8610 -679375 -702391 -173502 -187398 -290577 88366 -122553 48081 -235789 -107925 -334648
8600 -334648 596277 -901801 -56161 131064 108203 -404137 306153 -203303 109550 -91092
8589 -535695 -614795 -712045 -95602 361577 250050 123927 -366659 255808 302128 -227998
8578 -627376 -499648 449957 -167510 -117837 -1124613 -125271 67150 -319186 -117162 -347441
8568 -347441 240259 -51152 277424 539740 -324959 27668 -148275 -491846 329875 -406570
8557 -196406 136779 -303838 -206919 -374174 172594 -414676 179650 -164424 109535 -391482
8546 -672332 75187 284637 326011 -324337 -145998 381507 -198840 -263473 -121352 -566350
8536 -566350 131514 315522 -252778 -292893 -298560 256453 -225006 -187010 -621149 92248 -462955
8524 -441721 -272108 -630180 -208745 -407168 203245 20397 -105017 -424944 29799 231731
8514 231731 -934089 226604 -281093 -535892 -169912 -560070 -271331 -178391 100626 -569310
8503 -301856 199985 -333131 257209 1138 279435 -349146 -350361 155011 33718 -556494 90090
8491 122710 -433052 -251021 -560270 75820 -176458 92358 515472 241076 -307962 -32820
8480 17850 -117521 -137756 -56204 -251153 1025257 -142258 -216017 -860869 -214039 115588
8469 4374 238835 121214 -195375 510903 -509020 -276796 -560632 -83225 -377691 -339237
8459 -339237 8517 -149570 -179743 -96755 360125 -443142 -199905 -5673 188652 119063 -271367
8447 813373 -215682 323415 -41921 -107471 -220658 102808 -198860 -83646 27197 56078 -510175
8435 100909 200727 -6094 231641 281551 278382 -79465 296062 -513601 -89581 -82591 405073
8423 189457 228761 179987 -175228 443883 -255938 -222539 209549 230511 -528785 44712 -239144
8411 645252 -66114 -67664 379266 -1085524 95761 -450253 123242 -360795 130987 -499700
8400 -620290 -211604 -133969 -95818 375648 -687451 225858 230077 198014 -316049 403354 186137
8388 139175 89109 -336115 -516495 36358 -84879 -220913 85311 -12602 130561 595310 153752
8376 -419003 -338022 -192418 -465453 -126527 510291 -204786 126064 -144936 65524 -48414
8365 144590 -135080 -373047 -411331 -125610 346783 -493054 -48464 -283409 -356184 -303439
8355 -303439 -48023 -440452 -256462 -399535 -95614 331013 -534443 352787 -687924 5492
8344 10352 -225788 -452996 -323730 263541 -882652 231249 -576794 -473554 519115 -582017
8333 -513396 -817775 -265606 104616 -282031 -191121 55397 -104599 -375881 -388625 196665
8322 44446 -256566 61935 -178926 584774 -409708 -691744 101784 -332288 664690 251664
8311 540636 403998 -420658 -277495 139583 -497699 187780 -311834 109215 375971 -164940
8300 -350931 -233331 -171723 -782028 -175488 28498 219132 -13823 49919 -673586 -274278
8289 -203344 287731 301837 -145264 491641 -49498 414832 -48544 -267438 13255 -22499 -230352
8278 -230352 -165526 64537 352131 459012 -545343 363618 -84421 211629 -26182 214103
8267 217623 283881 -427515 401683 -156924 46825 -309551 -281015 108480 -581273 383147
8256 -273043 -289011 -242700 -11796 -5592 287841 -423421 -281176 -116776 282485 -135121 375483
8244 -113511 -251934 -793312 -96655 -116154 191898 -760675 344960 -19988 -93928 -429418
8234 -429418 -198703 -71259 19545 -230538 208958 109521 -359935 -1223 -287311 -183673 -199776
8223 -199776 170128 -523615 -210750 130688 45723 53074 -362414 -654262 194097 -199511
8212 319939 -510299 22839 587119 204489 -670665 115577 7919 -166195 -96541 -11870 -22652
8201 -22652 190154 -251657 -182807 124183 -252301 -75284 128719 -115946 -272631 -613330
8191 -613330 -23407 -677562 -365584 -98717 -477071 -174705 366027 -124630 431080 -292834
8180 -528574 354571 165739 277832 -409334 228211 420014 -276357 -436219 -362372 -460879
8170 -460879 328638 60984 343165 -57419 -311221 -56140 335948 95639 159271 -215033 70378
8158 -304056 266133 -180244 656131 -204584 84257 540790 -16969 -421989 -257971 49422
8147 266280 -76217 40176 -34818 24733 -481705 -390741 108053 -232266 -125392 108141 174717
8136 174717 -62855 -113719 -499431 -188947 518079 267791 -454930 408272 -409033 -453798
8126 -453798 253084 -115711 265664 212011 25564 -309575 -106459 409251 428710 70440
8115 -19366 53519 380722 -408027 -96392 -15267 -374152 -317065 -458438 -347198 -92414 -325256
8104 -325256 545552 48478 137411 -162838 -229306 205743 -659070 448462 -436361 -152864
8093 251940 -180855 98091 174451 -851290 131456 120125 -197037 -758011 -129981 -415043
8083 -415043 -157430 268672 154348 -117932 181704 -339802 -967954 -226554 -258882 -500608
8073 -500608 -210773 301294 -378780 -151599 -82500 -130437 -730169 -65375 -111378 140771
8062 280816 -5672 -333212 -181594 -308716 822704 -201841 -303006 180346 20332 -106178
8051 -594739 128130 -168054 22735 -448462 -283656 -459836 62084 394010 -230256 -523450
8041 -523450 52795 -101929 208809 -482617 154801 196 -236807 -273188 51468 -137854 -358842
8030 -358842 389055 -217698 285543 400697 -60910 222213 421802 34781 -412563 -856795
8020 -856795 -776253 -314026 -151342 -377648 28739 -186489 610602 -51283 100182 -336206
8009 -209071 37429 -204859 132182 -380584 -24050 -94211 -623 -131710 -238397 125246 -62563
7997 -374776 -399347 112607 -416410 -313206 648477 -92768 -560895 -395487 -25977 742250
7986 11669 -125706 -703022 295602 -434240 192348 100199 437971 -549539 935231 -177133
7975 105426 69793 -230918 -310649 -163531 -170699 -272565 600255 -473145 211074 -381959
7964 112572 -313111 501957 -972103 -333530 -312629 -802074 -136704 -98094 400080 -239222
7953 222735 308295 -169359 -34120 36967 -727046 489688 497941 -361302 -354764 -167475 455961
7941 -8585 343295 85583 4138 125545 -521013 171535 -387813 3478 450549 41463 -161286
7929 457670 281429 -14630 254933 -134362 -371071 170620 -661059 -538720 175800 -599126
7918 -64127 18427 123452 -679930 344869 109432 -952587 618088 -574523 -336278 -329686
7908 -329686 470278 511765 186860 69916 109979 -119718 233497 -88014 -741802 -223739
7897 -1036424 363741 -205674 270501 -250794 218554 -285534 -190385 90062 -157498 -35962
7886 203294 -615032 -24287 -887269 7165 -25079 119311 600469 -162887 339122 446069
7876 446069 149094 -625607 -195480 886889 -253147 273552 -78428 -212277 8984 -89841
7865 -365895 -509337 -607043 -545840 -149739 -90413 -837975 43533 -50757 393040 -423298 121408
7853 -60197 -18728 500482 -233352 -359128 98636 -108170 -327328 -153501 -280006 493420
7842 -823529 -39864 188963 -158068 -27262 -726853 523572 84427 31941 90306 215916 -196046
7830 466763 -39371 -177173 619556 -279817 120387 177604 82390 58844 -465023 -140838
7819 304292 186474 -266571 -362419 179745 -351630 429919 4734 226095 823789 -321811
7808 -113467 -500948 520977 -87639 157303 -286844 39594 -44192 101980 -465826 -357225
7798 -357225 126709 36633 165530 144492 -131141 174281 -1040313 -200004 -87624 102555
7787 -224703 -316550 -277609 -167658 309538 -460273 -797666 -65352 257226 -77704 -519333
7777 -519333 164303 -240363 194337 89738 103035 -629500 -413867 -375803 -231220 330472
7766 682005 181968 -67715 101351 -549271 -172984 -377605 -117979 -455859 -310511 -517184
7756 -517184 -245572 677982 372734 -294874 -179255 378419 138078 -230071 14741 -215672
7745 60158 -468737 232390 585155 374302 90693 -682114 546205 228246 -30245 -539890
7735 -539890 -40451 317792 -246033 122226 -75203 -395005 105061 222297 -49824 -197853
7725 -197853 13923 278615 -173408 -249644 56612 579072 75433 -33673 -167995 140402 -161899
7713 -512783 -429329 -379553 -229148 -465879 -112046 290921 -212609 -328138 -11676 -402484
7703 -402484 -298369 -2005 59417 135125 13440 -168655 328463 654234 -46549 -8864 15961
7691 240058 -236975 -786532 -152048 -63227 -440934 146126 156680 -658285 177098 -239448
7680 190720 270708 -322578 130820 -257094 254082 290503 223090 -954998 -509986 -99156
7669 -36709 334106 -158903 -291493 -232406 184305 -513371 388819 -77400 -355099 -29749
7658 16235 280422 20795 -6551 75810 -576535 227452 -266445 104465 31238 -245930 271031
7646 -730098 -233003 -220144 1085300 -163998 207835 -169372 -298724 95778 -89784 -278674
7636 -278674 -392724 240141 116544 215371 -180667 1694 -630418 -285396 129191 695749
7626 695749 -550649 -206853 -67957 -867 129599 185434 -341969 -369204 -326502 567217 -168222
7614 548356 93479 610420 -560369 272333 740702 -220046 -308621 -92519 424537 -431972
7603 67716 -223407 -80513 -120501 171923 101142 76603 111299 -31560 -644085 87742 -278230
7591 -397124 -29988 28213 -441243 140896 109023 -383180 199193 -318172 -376798 -68929 129042
7579 325956 -813991 123024 -215077 53057 -360234 191124 192960 -78899 165626 484247
7569 484247 -599518 -328498 161487 -173926 129657 -160282 -291809 -96343 -44350 161964
7558 -319649 6256 -822325 -47697 -119463 -372650 -495305 -46854 121439 -24178 42789 -156369
7546 -689014 -241345 -466270 -11311 74617 -376670 -935854 -298355 -611971 276838 -237683
7535 -82099 -174445 150983 64698 546575 201124 480988 -877718 126630 198782 487479
7525 487479 -75258 303162 -67843 -181863 -572310 -350683 -105360 -256919 -69796 74345
7514 200734 -643006 -90091 -214922 -414496 87493 303117 -695250 -674742 -634753 281959
7503 -179342 154903 -788470 236754 -554472 38025 150082 -344218 -107483 378784 -484832
7492 -402927 25697 -521536 2906 -209145 -129214 486784 228933 -510128 76066 -500062 163099
7480 -867652 438641 -478078 -431816 289986 -131801 480673 -171940 -151944 251244 -64744
7469 -199888 605993 -119246 333083 111696 185375 -149803 43679 416307 256339 -466370
7458 -70138 157457 308003 -121077 -197237 52104 25264 -208751 -824719 112522 270545
7448 270545 213373 -207160 -304878 -395630 -488047 -312922 -670429 -173370 256920 -632216
7437 484774 497844 -422533 204740 -221764 -469326 -185025 54388 370562 -429024 622102
7426 740015 63801 -134569 802340 -101860 -275826 152432 -592330 109799 -18650 -136999
7416 -136999 62575 241128 -771813 268509 -419557 227620 387008 -218004 530594 238727
7405 -129301 -180019 -244502 160047 209751 -245039 -481609 6933 -223883 182529 124684 -63091
7393 13179 577707 -59206 116408 -438721 23167 -54875 125714 813532 145373 -416777
7382 -82255 -86094 -115454 -426154 559918 98430 55830 -202270 -398630 86521 -444169 -218445
7370 -29419 222184 -102325 169508 399768 -262820 472437 -392232 1021372 -17151 -731228
7360 -731228 -10031 -272590 -332154 -7432 -165683 -39063 -518737 -135655 -340312 -340126 -273503
7349 -273503 167112 -488138 94728 44339 83341 246782 92996 -210502 105527 -33391 31670
7337 -408323 13509 214361 688309 59462 -260462 246145 -216833 300814 -172324 -636011
7327 -636011 -708349 -26391 92211 -98706 -393148 84859 -133365 17684 666567 87325 -126897
7315 -86266 -501840 90783 -416180 -350431 -123047 135082 99941 384712 -555806 28542 -104833
7303 -149943 -616735 -293568 21362 91490 329667 -454488 -319552 349846 -272833 -551000
7293 -551000 721578 -546760 441694 158624 -157353 -221181 -423815 38085 -361481 160091
7282 -552152 -135162 -319937 448144 362203 -280773 37353 -207286 194521 -281655 -88729
7271 -397026 194813 108881 -320446 -663512 28146 45116 -793255 103345 -207123 81874
7260 271374 -849009 113215 -556860 -194321 -479326 -242403 -150215 -65497 -534427 -715400
7250 -715400 352957 -148754 197783 -679118 4092 61439 -378455 155176 -131858 -119983
7240 -119983 219221 182874 -493428 -80592 -151758 526452 287664 -322054 407749 -167294
7229 361634 -19427 -736848 557497 -238461 407035 -758276 -365454 -293209 90077 -115536
7218 -396488 172675 65808 -289583 -160164 550021 80895 100497 -98419 -201575 -662458
7208 -662458 117600 4128 62240 -507818 -317892 230231 -207295 -246772 11177 17906 -555937
7196 299356 -9523 -99213 122495 344624 49643 985303 484552 184800 112066 -521915 -195582
7184 -3135 -390793 -555497 215711 75396 -193652 78674 178471 -319647 -311095 -52140 137082
7172 -203904 -307540 308656 245554 120462 53543 -545223 245871 172330 138755 411700
7162 411700 -370752 -638 138966 -143105 -63258 -803353 3348 -518584 617330 -203295 -176032
7151 -176032 -186675 292909 4059 -721544 361782 -557313 -291874 -640594 -303558 -130320
7140 138220 -250577 -727105 311085 263279 200959 -53232 13298 -163040 -247224 422687 229650
7129 229650 90461 -86424 -214300 -619081 325568 -144694 -424739 -182390 173504 -78311
7118 -338765 -365989 507705 -335465 -171911 250731 -362739 17945 217328 -192226 23601
7107 144920 411722 -170163 573959 -275793 271537 -398276 -995996 641272 -315764 -189074
7097 -189074 -358639 48388 173024 -171980 327743 -232776 -312212 -389990 -71424 3702 108848
7086 108848 -176313 -498538 357894 -735467 -469032 10812 561945 146532 -170474 266933
7075 -36225 -96504 187612 -186217 -248118 -203512 -228088 94596 938832 -40572 48441 -241251
7063 434835 -141611 -283144 1170 -386706 -5464 478656 -370262 353969 1127099 -8868 -108742
7052 -108742 -578596 580286 -353484 99613 105645 -310064 -413202 -234011 -123103 -55570
7041 511716 -189752 148380 -303686 -666506 -411133 223286 -117336 -621555 74913 13419
7030 514803 -617158 473973 45186 -43427 -378589 -383404 434087 177426 -118077 61913 366829
7019 366829 -400294 -19238 -215192 -471601 -476865 686575 -124009 -21795 -333165 518842
7008 -110210 281755 147292 160336 209120 -219707 -247935 89516 646778 105017 -611589
6997 192431 165335 337338 301696 -87170 -61348 246396 -111313 -516184 -378094 -56068 -12368
6985 -60674 47260 229689 196495 -219257 -340405 202427 -445036 -248857 121447 804178
6975 804178 -289087 342364 -638231 236544 -604720 226114 250179 75461 217910 -268929
6964 -306653 373588 -76695 106796 222956 -48410 437769 270242 435624 181748 -195502
6953 -332377 274335 -227289 116188 159569 -141636 -293753 -411019 328810 366412 43339
6942 200040 225874 -135969 -317353 511367 -361891 -29622 567632 -508027 -166687 -271862
6932 -271862 -20837 -444526 196990 99204 112610 -1028657 -61004 287754 78340 374428
6922 374428 -670558 148542 -236794 -112630 -442141 95876 -84168 -523191 267668 166747
6912 166747 -442000 336365 -76661 120583 -58359 60101 -377175 -248664 246428 -38952
6901 -151570 -434400 554086 324630 -349992 -429738 99304 -541905 312722 -102775 -165751
6891 -165751 281634 -296737 -201173 335956 -487042 -375882 -405326 90645 216654 -245580
6880 -258270 -266769 87596 233287 -643080 157148 -278280 -102575 204529 -353654 215313
6869 -39881 -93349 191737 -183783 -53873 -253505 175750 -170697 27737 -126475 257247
6858 -524204 -565081 554750 29204 -207677 3856 181542 229408 401154 -257674 40612 -390760
6846 -160588 -37902 -277370 -274874 141398 -110512 190296 -123284 691 -338116 -73084 189684
6834 398323 -238817 -253000 25423 62171 49461 -67894 76684 -326715 -434206 140380 -191157
6822 412189 772952 -365050 -498030 6962 -497413 199884 -56638 5861 135418 340702 -556927
6810 -148143 326374 278296 -170488 284884 -181145 108170 -719125 44744 -165797 684329
6799 115981 -231630 -567226 -615834 362978 -186968 -102629 450339 168019 6995 651088
6789 651088 -141203 327518 173662 -369938 187481 86522 584 -149455 -22243 -32147 198919
6777 209898 -4594 -170407 462482 329770 442812 384509 -217591 -249008 -189454 42899 -187205
6765 -125477 45890 -100679 -4467 930796 28833 -369049 610239 391898 -62539 -38072 33909
6753 51556 17813 -285260 100397 -96088 -297238 -349462 211994 -225345 -174517 -126878 -248541
6742 -248541 -423361 318044 235511 276733 1336 253488 -257493 -223260 -185146 -371368 -201452
6731 -201452 -433931 -85644 649 98863 440159 -278965 416606 -5859 -160048 -344081 260350
6719 64514 -692961 75407 -215521 -177896 -404810 314247 189451 -213590 -33317 -348313
6709 -348313 -408396 -460193 -195226 45059 -610702 -391242 -255351 114212 211707 76156 120050
6698 120050 116489 120435 247430 -253601 -651155 -60299 -21537 -164964 76333 -462062 -1881
6686 134459 246392 -260589 194225 -576203 42734 -81281 246690 -311563 7619 272553
6676 272553 -151159 -236753 -559109 -44421 609891 -261899 392215 -109305 -469865 -326089
6666 -326089 -70623 -384442 -144747 476955 -349112 -438253 -444417 -254035 -144145 4521 -157158
6654 81722 -15019 -211975 16914 -28025 -225189 235607 93210 -211137 32613 -198113 591421
6642 -131007 -142047 175642 -10792 -101530 -333183 266610 201541 -935985 -644913 -326389
6632 -326389 162976 107907 -118260 -130132 258452 -102093 -400073 249132 311447 -226361
6621 -44907 12433 457291 -38806 146379 124004 249064 -127058 -125095 -269813 -205987 -368381
6610 -368381 67659 398684 -328095 -205557 183164 -280432 -416899 91840 35955 150885
6600 150885 553643 446751 -35613 -35629 -126161 13806 311117 -40803 -304876 210044 271250
6589 271250 -124554 6957 -70469 -62218 67486 595610 483908 -141148 -326425 -164362 51892
6577 -221805 23811 -98316 383740 -532272 -403068 189403 775195 -400463 -524774 -48818
6566 1033060 489 276470 -325326 158335 218250 -254189 -363625 -385401 -56773 370194 -603304
6554 59763 473007 -394128 253277 56912 -17690 -238674 93381 -524696 -165545 197092
6543 15073 456230 177002 293276 -398885 -337775 -295775 -71585 238830 -40442 -107898 83771
6531 -143154 98431 -43698 -510937 259811 -385276 -224834 -84459 -616220 66711 -206908
6520 446820 446025 164503 753602 -81404 -195358 183633 381187 -110785 109359 -350715
6509 -150449 -7811 33205 189057 70400 -393853 229535 -156097 -376595 -158554 -447790
6499 -447790 11170 -422915 290728 -415570 -130169 460745 -284495 375068 56414 74654
6489 74654 -250551 -385348 -449516 263544 -17755 21037 282943 52706 -63631 -119309 -148166
6478 -148166 -611410 -25836 99594 -225177 -98841 425105 -403922 1075 -300524 -707872 -558913
6467 -558913 273680 225506 111395 485452 -541069 823562 -39634 157114 456551 -65532
6456 138864 234806 297835 -311059 -54055 -228935 36629 -75406 -317306 -207522 -358240 -152196
6444 -420542 -816969 200469 -179410 95953 404683 200648 -253861 -72688 -252352 -41764
6433 144679 62340 -395354 -259492 -608880 -20028 -445316 38889 321815 23566 -288963
6422 178756 -618782 -280689 -404836 -192550 -263238 -263016 -231688 -65414 -559949 -249150 -470474
6411 -470474 320496 186862 -154345 -125297 224059 -294078 -246159 -202940 -936569 262328
6400 298974 -143016 345348 173283 64460 -53703 -468623 -318804 470634 332034 -189074
6389 -544750 -52867 6786 675808 -128565 110944 204541 498116 157673 -276794 -26350 37002
6377 -417929 -89328 -394150 214874 -184407 -325261 -50739 -757803 288434 -291343 -249456
6367 -249456 76827 118237 123598 -493034 127144 -33095 -400050 66641 533663 -276004 -527907
6356 -527907 472536 165487 -58774 -31074 782734 -415073 -109944 193930 31892 -98164
6345 -15049 -301947 -364321 31192 -75718 352282 645563 -245504 69508 -70017 -380562 310249
6333 -164544 -417907 -429351 -12442 201379 -88909 -35736 -115741 375358 -416461 -271818 -255449
6322 -255449 337257 -865583 -156847 214969 -47500 -318179 -460816 -308627 428224 -17508
6311 324485 587592 -75884 605163 524600 -119170 240676 -419790 151580 -214528 74043
6300 348199 469924 404585 -144739 -12645 -410338 -543455 -237911 -67667 39399 149969
6290 149969 459844 153423 400488 -100286 451861 85184 357472 436975 -600734 481105
6279 -31904 84007 -175432 -1199303 -177114 150441 -353663 366320 -486120 236168 104689
6268 502884 38280 214748 -897900 -299400 -129516 74230 484503 6496 498636 -189095
6257 -287491 -459515 -586098 493951 -336860 321526 237173 -355233 603170 -313418 -594665
6247 -594665 -168987 -357431 -322137 252466 539432 103461 93979 -10310 -48894 -178088 76360
6235 -583604 496394 568256 41677 -59500 820735 -229235 -316770 200932 450249 -108628
6224 426352 77238 -140207 -2833 -126252 464169 175766 -81535 356745 233213 694387
6214 694387 27828 -148161 -194029 214217 457909 58559 130311 565174 -213257 -3523 629007
6202 94930 -102749 546939 247810 -1147843 120348 235253 -384162 185732 -365943 -437414
6192 -437414 -253099 -92006 -631718 138295 -71128 172556 -185852 319457 254162 -77932
6181 259456 -102476 136589 65615 173487 -99534 223274 -43187 -316300 -236397 -140958 -16636
6169 -254481 21460 -53778 -419916 563274 141888 299291 -124055 184272 -276046 266002
6158 -193712 -311862 -401008 268504 -33562 244521 -304430 145374 273467 585709 -161713
6147 -453036 -474333 180801 -38998 40039 -363065 323848 -504019 -446215 -548334 -178021
6136 222510 50502 -206605 -745538 650753 -100905 -10210 54348 326841 224175 171783
6126 171783 -552054 -8833 93647 246997 -454351 428151 205084 247577 -47783 52002 -107674
6114 -341553 -186144 581229 18429 217900 -247815 -71438 33390 -931376 410136 -52057
6103 72244 -207613 -140046 574349 -425606 -136306 452967 63259 229748 -612105 -62511
6092 -429362 -3008 628 -46464 380196 -32711 -12696 -347191 377698 -96199 -215072 485252
6080 400966 371803 -168224 108959 -71446 50834 -55519 538485 114920 -128620 175114
6069 9982 -13753 65694 253783 26338 -62429 -93697 -29093 264309 -145693 -288134 -30712
6057 317725 20104 -450711 225272 -144658 66398 -240821 441129 44847 22739 -60996 -387974
6046 -387974 35880 -366865 392816 288322 47221 249372 421494 -50072 408345 172028
6035 -453442 516103 32084 -36143 -255956 -788792 -396103 124997 -78478 142469 -158024
6024 269608 257468 -145154 -664753 -635049 396735 52597 65103 -433117 37719 -302932 -129064
6012 -145217 -883023 -526973 5856 -411195 440003 -246157 -361735 174545 309737 -228634
6001 -330691 -488143 369317 -367315 -220369 -171996 -80442 349007 168650 106981 -371651
5990 178364 40679 81478 -218495 177529 159161 569571 1024514 -347093 430606 -316150
5979 -52288 -347541 364646 154948 -36244 319516 564148 127056 300872 -353874 328904
5968 -530217 3781 243094 295214 -77742 33790 234039 539140 -208749 -466220 -245922 152259
5956 -222754 355717 -144545 -78024 -359340 -16526 191452 -278011 -562219 -211449 382342
5945 212183 -167464 21709 -82313 -322779 -184415 -43481 697407 516545 300021 293133 137906
5933 -365727 -359364 -510727 59405 515479 -504011 94357 -296713 -374160 97794 243168 -611594
5921 545909 -803033 -246514 449731 -149742 -22324 -99735 187471 96722 -334194 -101649
5910 -32174 57645 -86098 383950 136087 24809 -127186 135389 -35491 -142974 108601 -339716
5898 -296784 75119 -330516 -196189 -128257 270494 -317960 552967 122636 -78893 173824
5887 -490514 621914 -746897 513185 -325421 -178395 -392427 -97041 -462445 -138003 666080
5876 -169383 -49212 305468 -487729 -52513 -96139 -159668 617928 440913 46945 212258 368315
5865 368315 -91934 39997 9948 -315052 573245 -336972 -104375 -194120 -439739 -167490 -83433
5853 -144165 -399199 1041863 -325783 -520553 289221 157798 207623 -138640 166958 -529786
5842 -399531 -240835 -404363 -88084 724366 -249651 -133437 -2263 -700547 -105426 -30770
5831 -324965 205992 227723 -40063 72226 797514 522565 667734 -234404 775335 144992
5820 79458 111533 22155 -119120 -103051 -19114 58622 -352253 -43090 464125 241055 -164770
5808 -182963 -736371 443556 -127242 -291338 63138 59220 -85418 773901 142831 393524
5798 393524 -510532 -122810 551707 25691 -83307 -209369 157315 139551 -199916 131513
5787 152225 38568 185261 -424810 44311 87763 -505438 48136 -83166 553399 185351 182265
5776 182265 -372407 -18367 -81071 386068 -269374 -200057 -27141 61509 674848 261384 254808
5765 254808 -165185 -76477 188375 254352 142195 -224092 -947975 217816 417623 -67817
5754 500190 233408 557173 340108 -262302 193712 84247 497511 102899 -325071 -187309
5744 -187309 -385075 24886 139823 -35023 -370205 -413864 82298 -480773 64913 -26304 -267748
5733 -267748 -240425 70650 -175228 -35202 -18323 -88923 -102504 619817 -898647 54318 -245040
5721 384586 -158077 199271 536111 803255 -430173 422603 252381 628806 67532 427060
5711 427060 347712 -48502 329391 356413 -402499 -177103 485490 -63003 -292878 534340
5700 -382457 -97577 -564529 -130678 -270182 -450765 -1001338 -116724 529547 -69408 -179424
5690 -179424 122257 -124875 -126675 159250 545713 -399391 -586629 502618 181784 75155
5679 78474 -736746 -461954 -4095 85076 218482 362282 -297792 218196 -389651 -516218
5669 -516218 -33174 -517984 27322 -88596 -94079 -123866 -13617 213562 67311 -224118 -422588
5658 -422588 -25989 -384109 -208237 -342459 26664 -14983 5259 304655 -782155 466747 -382078
5646 -518836 -163412 -49246 200665 360377 700486 -40700 161786 -288593 507754 -301299
5635 -485429 496976 -243606 11719 -302761 336778 332927 -214392 401951 376598 4507 98365
5624 98365 -114955 -138050 -212887 2397 178100 -323122 -695554 68934 657198 171560 652920
5613 652920 377678 -152582 35683 -80712 -294188 128341 -389294 -77776 341571 -15519
5602 431931 396532 -321253 -115619 138358 253678 -658961 29806 -346197 -112544 336142
5591 -96485 -956478 451959 -434303 -168203 -169621 496596 133894 1453 424700 -299649 -198933
5580 -198933 -305647 211030 -95134 -39860 656928 334016 -70817 -144833 -299490 150639
5569 172781 -480092 176767 278883 381009 21905 -185982 107253 379653 212130 110584
5559 110584 -696444 34590 -247215 406196 123295 192226 -580119 128024 -179970 237269
5548 -322807 -316694 -220709 -791479 -222954 -56070 383496 62581 -422397 -376506 23498 542913
5537 542913 -14759 669157 -394289 18898 -650177 38080 114431 742438 121421 -42485 486353
5525 33042 41880 -389540 104681 1563 154653 -185339 57095 46105 187632 766354 12952
5513 21579 -124918 -332068 -37019 316125 49327 23266 -255332 293939 -236177 68096 -258335
5501 3958 -219582 259391 -245575 384338 -381483 -488905 192914 -280845 -53194 38048
5490 709861 37498 -68338 -937559 136825 -160531 -252482 262954 131649 13486 -531454
5479 -96421 -29388 -98961 22294 73066 206433 -105520 -301554 56156 -46406 156537 -680917
5467 -209348 -193149 -529584 -1152920 274939 284745 -106211 505235 381529 -16118 332704
5456 -191770 -189078 168925 478087 427453 -216537 41023 347445 59401 -116315 -212059 -83946
5444 -122113 -194824 499349 -46288 182762 -387834 127759 38380 154192 -139563 -249057
5434 -249057 267841 -239545 -260092 156009 170922 643402 401254 -299780 54581 359903
5424 359903 -27063 175215 -136227 1075 -346708 70077 77942 -691462 -112975 79817 -87792
5412 211465 332324 408235 -401180 -369 108161 114173 12728 323652 -150369 -446625 8875
5400 85729 35066 -710187 411793 -229824 -87156 -277040 -130142 -47934 132242 -373721
5389 -191459 -183757 541183 22615 688926 211249 -156061 282553 -429648 -263538 -2922 93316
5377 -370285 -262813 -292817 -528483 27745 -26790 -405094 -305843 189405 -270949 380470
5366 432141 -210097 4966 -179154 304766 581577 -344273 -79472 -1095023 -340178 229132
5355 -8090 -88681 88382 48819 -294045 -240774 -213325 -362942 -398206 18795 123599 50598
5343 152373 228501 -140527 472081 205338 428979 393667 -250731 572009 147800 349797
5333 349797 98915 -227452 539718 78938 7326 -85111 -330765 245346 115688 -1365 -818509
5322 -818509 -361909 -300290 -35062 26160 -366235 -165940 -157295 -608817 211148 239990 63715
5310 -17524 237810 -768547 255558 510257 -502897 227186 -193000 -294070 -91406 874503
5299 -328509 354717 363014 -419209 -97579 -459218 117728 87269 -281966 282654 -451574
5288 118288 557006 -388791 387548 664971 -254718 -249776 -320790 769086 705315 -46384 -264434
5277 -264434 33658 -161800 -10366 -594269 -231451 51333 465333 -287376 112873 -3842 -185759
5266 -185759 386196 -1046535 33470 263809 269257 377003 -237492 106409 98103 -75897 147978
5254 -527398 -95419 405032 544652 332436 -690780 72251 -165105 -524198 -391142 -206530
5244 -206530 -87545 351109 85095 -71905 338762 259391 -239116 147256 36844 121034 9645
5232 -117559 85411 -45484 -282745 -263405 530758 -60502 363600 354141 -268453 -1052669 -305557
5220 -291291 881317 775251 -21787 443675 -207517 315505 -157005 -137218 128756 381287
5210 381287 -91475 171387 -71798 254191 -43553 193349 -240208 305010 5877 582889 -295776
5198 -85255 -149228 550935 -1249127 107665 657886 -233533 599984 -233840 -260804 33543
5187 -321365 395036 113755 -180889 181030 97266 -355165 237364 -470216 443996 617085
5177 617085 -243626 -4285 -363719 284923 -186046 -321480 387850 116654 -210226 100610
5166 -437030 -143396 -204916 199527 -659987 -254233 -145890 335776 -139302 860207 -303188
5155 286682 -114820 456131 -218632 532634 -71444 306323 -467976 -252297 -344070 -320074
5145 -320074 -405887 -59922 400575 352011 148053 95691 -306134 469694 -248121 -782605
5135 -782605 -359335 -462678 166735 -110815 475111 -411488 -253115 -55877 436715 -30478
5124 362703 -68635 -30262 225071 -68478 -196403 -520500 -715637 346665 284170 -194642
5113 441964 -217172 -19866 -323622 26625 997838 -45347 -557969 808834 33313 -48406 17228
5101 -323510 21060 146790 204314 -320695 332945 292304 4586 -357379 -84620 70753 -117535
5089 599063 -674465 -214716 277697 244157 211825 -674171 -427180 -961974 154057 -252469
5078 66964 -67347 320254 384029 57518 632628 261596 -294805 -303274 126150 210946 440785
5067 440785 -32829 170389 423097 -506986 548221 -584704 -371572 -311179 -510927 22119
5056 171001 -122445 -10767 219891 459212 310432 -351004 -623501 -20517 -455949 -41785
5045 -363935 -240794 127920 457612 -279379 -362369 509705 -165245 -235248 -219254 271019
5034 -495187 402933 -297973 278805 -648548 544316 373168 -480893 329657 319040 -398247
5023 -549461 89844 142592 224647 -191932 -206623 -232377 -311338 -244291 -26893 176885 -317213
5011 -223147 -473264 -160805 -211982 329958 -391620 -78160 -102816 658147 -204456 369649
5000 735478 -67270 -899152 -89715 56896 29894 -434845 -249264 844051 -104998 -83902 -51959
4989 -51959 -199497 26821 -21989 -35388 280815 528801 164371 291566 78412 476139 266983
4978 266983 -27262 -522426 17619 581910 -780791 228761 -21251 -98505 34592 -325174 393773
4966 65515 -196326 -25087 -423257 -468477 377972 -336517 -68676 672915 -50255 45998 -273062
4954 464806 474778 280231 23736 91122 -450045 402937 729326 217621 9390 -89578 -137099
4943 -137099 -69672 597559 258057 -323086 -276774 316958 497503 465170 57590 -206905
4932 -117833 -251526 180090 -416887 244047 377805 769154 516380 48981 117301 807544
4922 807544 167847 36844 -509244 361271 -167854 670074 -309128 221073 -179241 -685810
4912 -685810 -274396 150621 262334 -565960 428019 15896 -409163 -630215 105265 313414
4902 313414 283896 -240449 154890 -191043 109801 389742 -4195 192947 -162604 -10419
4891 -24277 114948 178740 -167904 -643983 582400 651735 -58080 -709004 -66271 280860 317772
4880 317772 480917 42553 -543235 389846 -149047 424534 -9132 -374189 285291 -192512
4869 -139747 -91954 -176130 223980 225636 -295549 -172381 334714 -29160 -35105 402814 159043
4857 -114456 -344332 -704228 282037 601738 177440 117228 -44547 -22921 -204970 306686
4846 -653116 -381989 200166 650249 51999 108508 -2051 -416317 -176883 508573 186914
4835 -508521 -513999 -461066 -44845 85205 730474 -76989 57715 -126320 -40717 98279 14169
$$ [...]
##END NTUPLES=NMR SPECTRUM
##END=
