##TITLE=AC1763_NAR_15_9683463_AxI8vZsGHg
##JCAMPDX= 6.0         $$ Bruker NMR JCAMP-DX V2.0
##DATA TYPE= NMR SPECTRUM
##DATA CLASS= NTUPLES
##ORIGIN= BRUKER
##OWNER= Administrator
$$ 1.72 TOPSPIN		Version 2.1
$$ 2016-05-01 17:51:39.099 -0700  Administrator@X
$$ Compression mode = diff/dup
##.OBSERVE FREQUENCY= 400.02188249412
##.OBSERVE NUCLEUS= ^1H
##.ACQUISITION MODE= SIMULTANEOUS (DQD)
##.ACQUISITION SCHEME= undefined
##.AVERAGES= 8
##.DIGITISER RES= 22
##SPECTROMETER/DATA SYSTEM= spect
##.PULSE SEQUENCE= zg30
##.SOLVENT NAME= COFFEE_meoh
##.SHIFT REFERENCE= INTERNAL, COFFEE_meoh, 1, 14.98509
##AUDIT TRAIL= $$ (NUMBER, WHEN, WHO, WHERE, PROCESS, VERSION, WHAT)
$$ ##TITLE= Audit trail, TOPSPIN		Version 2.1
$$ ##JCAMPDX= 5.01
$$ ##ORIGIN= Bruker BioSpin GmbH
$$ ##OWNER= Administrator
$$ $$ E:\/data/COFFEE/nmr/AC1763_NAR_15_9683463_AxI8vZsGHg/20/pdata/1/auditp.txt
$$ ##AUDIT TRAIL=  $$ (NUMBER, WHEN, WHO, WHERE, PROCESS, VERSION, WHAT)
(   1,<2016-05-01 17:51:32.146 -0700>,<Administrator>,<X>,<go>,<TOPSPIN 2.1>,
      <created by zg
	started at 2016-05-01 17:50:25.911 -0700,
	POWCHK enabled, PULCHK disabled,
       configuration hash MD5:
       21 0F 79 D6 B3 7B B4 F6 88 20 88 DB 03 48 BD 9F
       data hash MD5: 64K
       BD AC 69 56 9A 04 82 5B 2E EC 9C 4C 42 FC B6 1D>)
(   2,<2016-05-01 17:51:35.224 -0700>,<Administrator>,<X>,<proc1d>,<TOPSPIN 2.1>,
      <Start of raw data processing
       efp LB = 0 FT_mod = 6 PKNL = 1 PHC0 = 0 PHC1 = 0 SI = 32K 
       data hash MD5: 32K
       16 A4 C6 D7 DD 2A B3 92 6A 4B 1E FF F2 CB 71 DE>)
(   3,<2016-05-01 17:51:35.505 -0700>,<Administrator>,<X>,<proc1d>,<TOPSPIN 2.1>,
      <pk PHC0 = 96.70715 PHC1 = 0 
       data hash MD5: 32K
       D8 02 C8 B2 1E 79 45 7B 19 54 CF 0D FF 8F C6 72>)
(   4,<2016-05-01 17:51:35.599 -0700>,<Administrator>,<X>,<proc1d>,<TOPSPIN 2.1>,
      <abs ABSG = 1 
       data hash MD5: 32K
       2D 03 D1 13 FA 83 02 00 78 ED 53 40 B8 5F A9 3B>)
(   5,<2016-05-01 17:51:35.661 -0700>,<Administrator>,<X>,<proc1d>,<TOPSPIN 2.1>,
      <abs ABSG = 2 
       data hash MD5: 32K
       C6 49 70 B5 09 EC 38 BF CD 4D B8 DD E6 93 B7 92>)
(   6,<2016-05-01 17:51:35.724 -0700>,<Administrator>,<X>,<proc1d>,<TOPSPIN 2.1>,
      <abs ABSG = 3 
       data hash MD5: 32K
       50 89 F5 67 3E 65 A4 38 54 F4 65 68 4A 84 78 A7>)
(   7,<2016-05-01 17:51:35.771 -0700>,<Administrator>,<X>,<proc1d>,<TOPSPIN 2.1>,
      <abs ABSG = 4 
       data hash MD5: 32K
       91 D4 9C 0B C8 DC 4B 03 14 B2 C3 1D D9 04 C1 61>)
(   8,<2016-05-01 17:51:35.833 -0700>,<Administrator>,<X>,<proc1d>,<TOPSPIN 2.1>,
      <abs ABSG = 5 
       data hash MD5: 32K
       E1 2E 0F BC DC FC D7 CE 53 01 BE A0 3A A8 43 6D>)
$$ ##END=
$$ 
$$ $$ hash MD5
$$ $$ 7B 9D A4 87 E4 A3 E0 07 80 7B 24 77 C8 21 D9 22
##$RELAX= 
##$RELAX= 
##$RELAX= 
##$RELAX= 
##$RELAX= 
##$RELAX= 
##$RELAX= 
$$ Bruker specific parameters
$$ --------------------------
##$DU= <E:\>
##$EXPNO= 20
##$NAME= <AC1763_NAR_15_9683463_AxI8vZsGHg>
##$PROCNO= 1
$$ [...]
150 150 150 150 150 150 150 150
##$TP07= 0
##$TPNAME0= <>
##$TPNAME1= <>
##$TPNAME2= <>
##$TPNAME3= <>
##$TPNAME4= <>
##$TPNAME5= <>
##$TPNAME6= <>
##$TPNAME7= <>
##$TPOAL= (0..7)
0.5 0.5 0.5 0.5 0.5 0.5 0.5 0.5
##$TPOFFS= (0..7)
0 0 0 0 0 0 0 0
##$TUNHIN= 0
##$TUNHOUT= 0
##$TUNXOUT= 0
##$USERA1= <user>
##$USERA2= <user>
##$USERA3= <user>
##$USERA4= <user>
##$USERA5= <user>
##$V9= 5
##$VALIST= <valist>
##$VCLIST= <CCCCCCCCCCCCCCC>
##$VD= 0
##$VDLIST= <DDDDDDDDDDDDDDD>
##$VPLIST= <PPPPPPPPPPPPPPP>
##$VTLIST= <TTTTTTTTTTTTTTT>
##$WBST= 2048
##$WBSW= 25
##$XGAIN= (0..3)
0 0 0 0
##$XL= 0
##$YL= 0
##$YMAX_a= 613317
##$YMIN_a= -521585
##$ZGOPTNS= <>
##$ZL1= 120
##$ZL2= 120
##$ZL3= 120
##$ZL4= 120
##$ABSF1= 14.98509
##$ABSF2= -5.573092
##$ABSG= 5
##$ABSL= 3
##$ALPHA= 0
##$AQORDER= 0
##$ASSFAC= 0
##$ASSFACI= 0
##$ASSFACX= 0
##$ASSWID= 0
##$AUNMP= <proc_prof1d_extract_pilot.lims>
##$AXLEFT= 0
##$AXNAME= <>
##$AXNUC= <1H>
##$AXRIGHT= 0
##$AXTYPE= 0
##$AXUNIT= <>
##$AZFE= 0.1
##$AZFW= 0.1
##$BCFW= 0
##$BC_mod= 0
##$BYTORDP= 0
##$COROFFS= 0
##$CY= 15
##$DATMOD= 1
##$DC= 0
##$DFILT= <>
##$DTYPP= 0
##$F1P= 0
##$F2P= 0
##$FCOR= 0.5
##$FTSIZE= 32768
##$FT_mod= 6
##$GAMMA= 0
##$GB= 0
##$INTBC= 1
##$INTSCL= 1
##$ISEN= 128
##$LB= 0
##$LEV0= 0
##$LPBIN= 0
##$MAXI= 10000
##$MC2= 0
##$MEAN= 0
##$ME_mod= 0
##$MI= 0
##$NCOEF= 0
##$NC_proc= -8
##$NLEV= 6
##$NOISF1= 0
##$NOISF2= 0
##$NSP= 0
##$NTH_PI= 0
##$NZP= 0
##$OFFSET= 14.98509
##$PC= 1
##$PHC0= 96.70715
##$PHC1= 0
##$PH_mod= 1
##$PKNL= yes
##$PPARMOD= 0
##$PPDIAG= 0
##$PPIPTYP= 0
##$PPMPNUM= 2147483647
##$PPRESOL= 1
##$PSCAL= 4
##$PSIGN= 0
##$PYNMP= <proc.py>
##$REVERSE= no
##$SF= 400.02
##$SI= 32768
##$SIGF1= 0
##$SIGF2= 0
##$SINO= 400
##$SIOLD= 32768
##$SPECTYP= <>
##$SREGLST= <1H.CDCl3>
##$SSB= 0
##$STSI= 32768
##$STSR= 0
##$SW_p= 8223.68421052631
##$SYMM= 0
##$S_DEV= 0
##$TDeff= 65536
##$TDoff= 0
##$TI= <>
##$TILT= no
##$TM1= 0
##$TM2= 0
##$TOPLEV= 0
##$USERP1= <user>
##$USERP2= <user>
##$USERP3= <user>
##$USERP4= <user>
##$USERP5= <user>
##$WDW= 1
##$XDIM= 32768
##$YMAX_p= 431432161
##$YMIN_p= -733952
##$CURPLOT= <Network HP LaserJet P1505>
##$CURPRIN= <$Network HP LaserJet P1505>
##$DFORMAT= <normdp>
##$LAYOUT= <+/1D_H.xwp>
##$LFORMAT= <normlp>
##$PFORMAT= <normpl>
##$SURQMSG= 1
$$ End of Bruker specific parameters
$$ ---------------------------------
##NTUPLES= NMR SPECTRUM
##VAR_NAME=  FREQUENCY,     SPECTRUM/REAL,   SPECTRUM/IMAG
##SYMBOL=    X,             R,               I
##VAR_TYPE=  INDEPENDENT,   DEPENDENT,       DEPENDENT
##VAR_FORM=  AFFN,          ASDF,            ASDF
##VAR_DIM=   32768,         32768,           32768
##UNITS=     HZ,            ARBITRARY UNITS, ARBITRARY UNITS
##FACTOR=    0.250966925370066, 1,           1
##FIRST=     8223.43324360094, 44322,        -138245
##LAST=      0,             -107893,         22744
##MIN=       0,             -733952,         0
##MAX=       8223.43324360094, 431432161,    0
$$ Real data points
##PAGE= N=1
##DATA TABLE= (X++(R..R)), XYDATA
$$ [...]
19573a26310c6080k4220b9793D9607J54693a19837l1844A06971b8982r2907B2383
19561b6683n0247B00955G2901c27818J26288G8383a00840d5479A0291b9703r4756
19550a24459A7187b36299A02632l4239l0178b900A10961b5369A59717b00128g7442
19538I8595m3557g1223j38242A07651a38920d0600J7145j20258j39580A65181
19527b13854k1792B00833b72852d5408A49846b27751K339q205r9251J09782A9585
19515B55962b2655A73413D9923b57587A49235a24746A09199h7027a4620A50277
19504G4621a78839A70842g6173I3491c7792j00909k695d8139I584a28374A14195
19492g8580j01708K1976M4319A08956B4382J06777M387b70420a31094M8322n8173
$$ plain form
19573 -126310 -36080 -60300 -29793 49607 204300 -119837 -151681 106971 -28982 -121889 22383
19561 -26683 -76930 200955 72901 -327818 -201530 78383 -100840 -45479 10291 -29703 -124459
19550 -124459 17187 -236299 102632 68393 38215 -2900 110961 -25369 159717 -200128 -77442
19538 98595 55038 -71223 -209465 107651 -138920 -40600 -23455 -143713 -283293 165181
19527 -213854 -235646 200833 -272852 -45408 149846 -227751 -225412 -233617 -332868 -223086 19585
19515 255962 -22655 173413 49923 -257587 149235 -124746 109199 -87027 -14620 150277
19504 74621 -178839 170842 -76173 93491 -37792 -138701 -141396 -48139 9584 -128374 114195
19492 -78580 -180288 -158312 -113993 108956 24382 131159 135546 -270420 -131094 -82772 -140945
19481a40945d3921p8730C28286A40173a41644C69554B3777a21753A76563G6555
19470c48411N5039A81314f2636b4689n1301p2260K1763C95786d5847j35825j01182
19459b82854J6005R0002j8114A80977G5667a76729a2349j26062l6494j46035N6532
19448b64408e8199a9039m52080a84857j09400A71699g7954j37643f0820C01317
19437D25187a25046n3129O8344H74i0018k51289A10515K36381h0533b0456C8631
19425a37577b5707j04588A88663F5634g229C4437c10811a18821j47137e9293K1871
19414c7422G1726a2729j03012a105o5230r9069m491o4172B31622a76572A99565
19402a72217P4288g764D2305a01160j46171k2293a22437C3833a60343P9001K2253
$$ plain form
19481 -140945 -43921 -122651 328286 140173 -141644 369554 23777 -121753 176563 76555
19470 -348411 -293372 181314 -62636 -24689 -75990 -148250 -126487 395786 -45847 -181672 -282854
19459 -282854 -266849 -176847 -194961 180977 75667 -176729 -12349 -138411 -174905 -320940 -264408
19448 -264408 -58199 -19039 -471119 -184857 -294257 171699 -77954 -215597 -60820 301317
19437 425187 -125046 -178175 -109831 874 -90018 -341307 110515 346896 -80533 -20456 38631
19425 -137577 -25707 -130295 188663 65634 -7229 34437 -310811 -118821 -265958 -59293 -37422
19414 -37422 71726 -12729 -115741 -1105 -66335 -165404 -169895 -234067 231622 -176572 199565
19402 -172217 -97929 -7764 42305 -101160 -247331 -269624 -122437 33833 -160343 -81342 -59089
19391e9089j49822M3019B40758a99631C7710H916J14522k0311b98640f5240j37100
19380b02340B66382a20738c7476p3661n0262q0014B47085k206j06655a45921I9929
19368c3887j71069A54676B9786d95319B48874B3680f1941E3973d5741k87364E8877
19356b30151e6625q72j30406B2860g526B42990A00287J9310g0985A20280J8453
19345A38733b62554J26400K2169K4906p5716F718J16006c1510m728r9099A63660
19333h2704A57631a22275l9559B61993j15415A3066K7799a54930I7345A9858J14823
19322A34681a94843L1208b9061C01713i8011P876G7069B1716R6987n1858e0617
19310b0633A46652b07074l8551E7317a80215C0904J91121e2566p4356J5981j53407
$$ plain form
19391 -59089 -208911 -165892 240758 -199631 37710 8916 123438 103127 -298640 -65240 -202340
19380 -202340 266382 -120738 -37476 -111137 -161399 -241413 247085 244879 138224 -145921 99929
19368 -33887 -204956 154676 29786 -495319 248874 23680 -61941 53973 -45741 -333105 58877
19356 -230151 -56625 -57497 -187903 22860 -7526 242990 100287 119597 -70985 120280 138733
19345 138733 -262554 -136154 -113985 -89079 -164795 6718 122724 -31510 -36238 -135337 163660
19333 -82704 157631 -122275 -161834 261993 146578 13066 40865 -154930 97345 19858 134681
19322 134681 -194843 -163635 -29061 301713 -98011 -90135 77069 21716 118703 66845 -50617
19310 -20633 146652 -207074 -245625 57317 -180215 30904 222025 -52566 -126922 -110941 -264348
19299b64348A59893J71951g7296j73286J03380o9028O9622F159K1668K66963d7585
19287a08375F7198a85517k33j69016Q8454e7878k31041D3465k0464c26024a38047
19275F8821K31303d4456j30863E2585P4810h3994j02003a7452j58556N668k031
19264a72371E3897b01854b8449e446m95A44486a74835n3601A95682k9832O3262
19253B29112b01510n7416e563j12851D6962c07894c1599j30346m860P7448B04169
19241A84671h5820j24743i5927A26491b2204n2505B82378i1624A61495b00362
19230c67314J68734O1713A23319g6924B77527a89608D8219J11350c1358A48382
19219i6718f356k37155A14255L9202b38373g8125B26976a10598r33j50128J21571
$$ plain form
19299 -264348 159893 331844 -77296 -250582 -147202 -216230 -146608 6159 27827 294790 -47585
19287 -108375 67198 -185517 -185750 -354766 -266312 -57878 -288919 43465 23001 -326024 -138047
19275 68821 300124 -44456 -175319 52585 127395 -83994 -185997 -17452 -176008 -170340 -172371
19264 -172371 53897 -201854 -28449 -5446 -5941 144486 -174835 -228436 195682 165850 229112
19253 229112 -201510 -258926 -5563 -118414 46962 -307894 -31599 -161945 -166805 -89357 204169
19241 184671 -85820 -210563 -95927 126491 -22204 -74709 282378 -91624 161495 -200362
19230 -367314 -198580 -136867 123319 -76924 277527 -189608 48219 159569 -31358 148382
19219 -96718 -6356 -243511 114255 153457 -238373 -78125 226976 -110598 -111531 -261659 -140088
19208a40088c8879m9762k14246e2405k51153Q2659c1060m122O007q3541K162j6305
19196a26859H2852N3901l3167i92j44321a4295B45207a57634c865j65157P8610
19185i0412n6371O9147E30578a73663m77440g5863j20197A32926h8379a7181k5427
19174d2608C67241h3910D9533d0833A0934J61771l6990i4080m6111C0246R5051
19163A25297a07808A69712o1298b4117A57266b0003B870a78956h1240j93190F1607
19151h1886j67761i1408j01300A00949b0045B15753a26988A8613b04378E651a03891
19139f9081B06457b67858d6990R413q989D6065a25143k77145J17051B8263O8513
19128I6776B7967O2497b86520D7588c22922a8510j68087R778k1791H8721J7908
$$ plain form
19208 -140088 -38879 -88641 -302887 -52405 -303558 -220899 -31060 -35182 -29175 -112716 -110554 -126859
19196 -126859 82852 136753 103586 -992 -145313 -14295 245207 -157634 -3865 -169022 -90412
19185 -90412 -146783 -77636 530578 -173663 -651103 -75863 -196060 132926 -88379 -17181 -42608
19174 -42608 367241 -83910 49533 -40833 10934 172705 135715 -94080 -140191 30246 125297
19163 125297 -107808 169712 108414 -24117 157266 -20003 2870 -178956 -81240 -274430 61607
19151 -81886 -249647 -91408 -192708 100949 -20045 215753 -126988 18613 -204378 5651 -103891
19139 -69081 206457 -267858 -46990 -37577 -46566 46065 -125143 -402288 -285237 28263 96776
19128 96776 27967 90464 -286520 47588 -322922 -18510 -186597 -176819 -198610 88721 106629
19117A06629A232a72939d8396j08165M3562C8358b41385K9460A75192d492B23756
19105B30672a84623A09166c05628d2297J280j3130J062D8258K7910a75385A64020
19093a72675b2873H2619f2377A37062d9067k9526l1785k4041E6183N3635f1815
19081a53322C1004A5117c96591J84962E6466a31850B1500R4009c05849J43310
19071a62539M5277e5247n6890E1662a57170k8165K3993D4419c5056p1063j7161
19060a23280G0835K1952c33416d6725j19246n4838B37026d20103f8746A42004
19049F419J9262J0742e385l14003A22846m2573C717b8540E7981i1068M853C08597
19036c26373A82881l338q1631a00695A90577n107H6190L24003r8368j14017a58254
$$ plain form
19117 106629 1232 -172939 -48396 -156561 -112999 38358 -241385 -211925 175192 -4492 223756
19105 230672 -184623 109166 -305628 -42297 -41017 -54147 -53085 48258 76168 -175385 164020
19093 -172675 -22873 82619 -62377 137062 -49067 -78593 -110378 -134419 56183 109818 -61815
19081 -153322 31004 15117 -396591 -211629 56466 -131850 21500 115509 -305849 -162539
19071 -162539 -117262 -55247 -112137 51662 -157170 -185335 -161342 44419 -35056 -106119 -123280
19060 -123280 70835 92787 -333416 -46725 -165971 -220809 237026 -420103 -68746 142004
19049 6419 25681 36423 -5385 -319388 122846 80273 3717 -28540 57981 -91068 -86215 308597
19036 -326373 182881 179543 97912 -100695 190577 185470 86190 410193 311825 197808 -158254
19024f293I4598M16749g7673A58946F0906d5764A26646R5317a94900B51587a56879
19012C229O5635c70336G4819c09915C2972g8885D3229L3493f4670J2237F0920
19000c11848J47342H5255d9885j759A40352c3602J39E3227A1688a94509d9678
18988B3474J67119a8937k25548I7045j0856L8239i5409P484B1281b29839J07921
18977a21918a6272k51008a17887O237A44355e4519B05966l4484E5085c97055a69975
18965c00852A08984m8545a89653A40527d46145b08552j3613i215B5918E111a19433
18953h5531j40414k3429J05629g1769E1541O0277J2527l4386G739e9861A37646
18941c1202l02686h8090D553b019k5508D86000k09716a45451M288j27752a8456
$$ plain form
19024 -6293 94598 511347 -77673 158946 60906 -45764 126646 221963 -194900 251587 -156879
19012 3229 68864 -370336 74819 -309915 32972 -78885 43229 76722 -64670 -52433 60920
19000 -311848 -164506 85255 -49885 -51644 140352 -33602 -33463 53227 11688 -194509 -49678
18988 23474 190593 -18937 -244485 97045 86189 124428 -95409 -87925 21281 -229839 -121918
18977 -121918 -16272 -267280 -117887 -111650 144355 -54519 205966 171482 55085 -397055 -169975
18965 -300852 108984 60439 -189653 140527 -446145 -208552 -222165 -9215 25918 5111 -119433
18953 -85531 -225945 -249374 -143745 -71769 51541 111818 124345 89959 7739 -59861 137646
18941 -31202 -333888 -88090 4553 -2019 -27527 486000 276284 -145451 -141163 -268915 -18456
18929g3235K7960B25780C1453L31548a81603h8749l24265a98131O847B44934D2010
18917H880e32878a71135f8607B76003c657k85057p2794F6983a61012l68498K30219
18906b99291k1506b5595j66978A39485C724i0080q7834j8092F2913K3571a47328
18894D5953j7912e4416l67294J50070A88044i9569G3292L1293d2166l31593a05914
18882d5711P640C6475L53788b17932k6260h0159j36207D3496O5426f069B72624
18870b89203a07675j73835l5311k47459K10707b502j73906c7257b142j18282B72859
18858b06194C01656I0172b00675g4782J3381E5979O2080K8611j9364b17601M9163
18847a68438A46919F405c3364k15153e0770j75457a12593D16978A76982G2990
$$ plain form
18929 -73235 -45275 225780 31453 363001 -181603 -88749 -413014 -198131 -191284 244934 42010
18917 8880 -532878 -171135 -68607 276003 -3657 -288714 -361508 66983 -161012 -529510 -299291
18906 -299291 -320797 -25595 -192573 139485 3724 -90080 -177914 -196006 62913 86484 -147328
18894 45953 28041 -54416 -421710 -271640 188044 -99569 73292 104585 -42166 -373759 -105914
18882 -45711 -38071 36475 390263 -217932 -244192 -80159 -216366 43496 108922 -6069 272624
18870 -289203 -107675 -281510 -316821 -564280 -353573 -2502 -176408 -37257 -2142 -120424 272859
18858 -206194 301656 90172 -200675 -74782 -61401 55979 118059 146670 127306 -217601 -168438
18847 -168438 146919 6405 -33364 -248517 -50770 -226227 -112593 416978 176982 72990
18836a63300A0354a66128N1549N164A13893f5939m566j84591l3255A29977a5227
18824a99628d4685k2405l0128D9869A0519J65930d4037k2690o1050B2429O4643
18813H7072L27229A63816K37146A40352A5800h4349o0258c4903q0248B18535h1617
18801B06879g8179k2093q0461B85491b53766O1714b3872d919j05788d273j13405
18790a17678j31238F339c6802I7555c4150o603q3758c1910A97214D0805a46791
18778b78025a35985r9735N3459H4984b98830A50455a74252I9433J0742c4966l8032
18767g2998B3385b89790B12779A4501b0146j05202a8818k75481J40268M881A05994
18755b06251A05914a00852q5377A64930g7708j22266i8407a1589A87898B284b49207
$$ plain form
18836 -163300 10354 -166128 -114579 -109415 113893 -65939 -70505 -255096 -288351 129977 -15227
18824 -199628 -44685 -67090 -97218 49869 10519 176449 -44037 -66727 -127777 22429 87072
18813 87072 414301 163816 400962 140352 15800 -84349 -144607 -34903 -115151 218535 -81617
18801 206879 -78179 -100272 -180733 285491 -253766 -192052 -23872 -4919 -110707 -4273 -117678
18790 -117678 -248916 6339 -36802 97555 -34150 -40753 -124511 -31910 197214 40805 -146791
18778 -278025 -135985 -235720 -182261 84984 -298830 150455 -174252 99433 110175 -34966 -72998
18767 -72998 23385 -289790 212779 14501 -20146 -125348 -18818 -294299 -154031 -149150 105994
18755 -206251 105914 -100852 -186229 164930 -77708 -199974 -98407 -11589 187898 2284 -249207
18743b36531G8084e0182j17345P5403d4234k49428k820H1586P2989a37415C0215
18731b2694n137A80204L0847i3888D6548a3050o8059j40588g3731j64981I9334
18719a44522A10645h9078K797G4082a19656j5209A02598m373h2264A56816b6899
18707b02725A62414i6323B93340d9650c872q7563j73460Q6044m135G2109M2293
18696A14402d0927p7738p1474n5345G8208J9126a26678G6075g5595A24837e4199
18684c81584B580d44827A84076h262A70876b32978A02581J3134b16924K3692j72494
18673c65726A6089g0354j68981d239j28387L99j66945g0637I9104c11172B1629
18661A33954a75977P4231l8397F7608f9476j70621j95561a51049j52500K0197
$$ plain form
18743 -236531 78084 -50182 -167527 -92124 -44234 -293662 -296482 81586 154575 -137415 30215
18731 -22694 -27831 180204 211051 -93888 46548 -13050 -81109 -221697 -73731 -238712 99334
18719 -144522 110645 -89078 -86281 74082 -119656 -134865 102598 98225 -82264 156816 -26899
18707 -202725 162414 -96323 293340 -49650 -3872 -91435 -264895 -178851 -182986 72109 114402
18696 114402 -40927 -118665 -190139 -245484 78208 97334 -126678 76075 -75595 124837 -54199
18684 -381584 2580 -444827 184076 -8262 170876 -232978 102581 115715 -216924 -193232 -365726
18673 -365726 16089 -70354 -239335 -4239 -132626 -132227 -299172 -70637 99104 -311172 21629
18661 133954 -175977 -101746 -140143 67608 -69476 -240097 -435658 -151049 -303549 -283352
18651b83352A12697c48196B05658b40983a09306Q441k43158A22804a07804C34381
18640B41326a90695F116h2030A58855b41189F9785b15814A74360d0080a2656m3553
18629e6209j70963i0616k18975B42332J889I7192d37035a05314F411R2198d1748
18617h5987m6386j11622l8341h3349a1849A47721D587J1044e8743J6269N321l4635
18605g1788F6718f855k32067A45625a56751A12621g0631A884b18614d9736j14512
18594a64248C32693A42653k4580i8848J7748c080A51191a20741N5543G35b88550
18582A41a9826p5954d2107C6767a34633N2622n7309C9591a90288C3228c97638
18570B28416a11805N3050l959j54040A38300D6213e8095k11094d8088H4982C4306
$$ plain form
18651 -283352 112697 -348196 205658 -240983 -109306 -100865 -344023 122804 -107804 334381
18640 241326 -190695 6116 -82030 158855 -241189 69785 -215814 174360 -40080 -12656 -56209
18629 -56209 -227172 -90616 -309591 242332 244221 97192 -437035 -105314 6411 98609 -41748
18617 -85987 -132373 -243995 -282336 -83349 -11849 147721 4587 15631 -58743 -42474 -37153 -71788
18605 -71788 66718 -6855 -238922 145625 -156751 112621 -70631 1884 -218614 -49736 -164248
18594 -164248 332693 142653 118073 -98848 -81100 -3080 151191 -120741 -65198 735 -288550
18582 141 -19826 -95780 -42107 36767 -134633 -82011 -139320 39591 -190288 33228 -397638
18570 228416 -111805 -58755 -62714 -216754 138300 46213 -58095 -269189 -48088 84982 34306
18558A06330c18906B86155A27914b9913l0908C14348h5448A40587J6458A5743
18547b31442d8147p8099N9741I3705K07677a62049A13494f6315m6585j20620b5361
18535b70664B50629C1420L8130K5809D1781J42780M9176a13408A54729l5018E4638
18523a26066j84584C77499F0571o051b08778e2011j56745A6131i5928q5344A71751
18511i313n9706p2062M8818n5547p565C07864b14668a7579n9571q4813F8593J53449
18499B22042a36148B3016a2119B5650a63274j4602d7297A32759b35655J04973
18489a30682j14593C00546c2729A49180g3990p6741A2067h8273B79107E0338J84373
18478B34711b35475G7427K2376j4523a78506c5506Q637H6995b96970d7840j48439
$$ plain form
18558 106330 -318906 286155 127914 -29913 -60821 314348 -85448 140587 157045 15743
18547 -231442 -48147 -126246 -66505 93705 301382 -162049 113494 -66315 -112900 -233520 -25361
18535 -270664 250629 31420 69550 95359 41781 184561 233737 -113408 154729 119711 54638
18523 -126066 -310650 377499 60571 54520 -208778 -52011 -208756 16131 -95928 -181272 171751
18511 -9313 -69019 -141081 -92263 -147810 -155375 307864 -214668 -17579 -77150 -161963 68593 222042
18499 222042 -136148 23016 -12119 25650 -163274 -177876 -47297 132759 -235655 -130682
18489 -130682 -245275 300546 -32729 149180 -73990 -150731 12067 -88273 279107 50338 234711
18478 234711 -235475 77427 99803 85280 -178506 -35506 -26869 86995 -296970 -47840 -196279
18467a96279d4751E8310b04532o5470G4051J40097c93845D9701a25225A18807
18456h6637A22760c14364e7883o3594n9820l0069I447i9910D9442f297C2711d31441
18443A65822e9286j34777P6354A143e5966A89443f1258A82495A9639a19985j83189
18432c03174N4853b9727B06222M9737i1096c9351B40929e0503j80570l2197j02422
18421c65692a31544n2289o8918F3399a8092j02061F3786a7789m9020A7258c58372
18409a5591j05408k32388J12666A66965c5960p0351c4702C30341a0587m4636p235
18398f2458B3687b1546D4569a74375j13638a13216A90516B7189b13944A5031b99159
18386G6841a57647A81960a36406k25042C2573a45682a592j25753d4743j414B54875
$$ plain form
18467 -196279 -44751 58310 -204532 -270002 74051 214148 -393845 49701 -125225 118807
18456 -86637 122760 -314364 -57883 -121477 -181297 -211366 9447 -99910 49442 -6297 32711 -431441
18443 165822 -59286 -194063 -117709 1143 -55966 189443 -61258 182495 19639 -119985 -303174
18432 -303174 -248321 -29727 206222 255959 -91096 -39351 240929 -50503 -231073 -263270 -365692
18421 -365692 -131544 -183833 -252751 63399 -18092 -120153 63786 -17789 -66809 17258 -358372
18409 -15591 -120999 -353387 -240721 166965 -35960 -106311 -34702 330341 -10587 -55223 -62458
18398 -62458 23687 -21546 44569 -174375 -288013 -113216 190516 27189 -213944 15031 -299159
18386 76841 -157647 181960 -136406 -361448 32573 -145682 -1592 -127345 -44743 -46157 254875
18374A88024K0877I4831a76984N304c0521m0851I0784g2772B69827a42780I6325
18362D34218a3501A6252J3018M78066B31839C3640J63005L6972b15670f4268o0638
18351a24906p9840q3892A68439h0135R153k48875J45715b1000B0922J61371l4907
18340A47386m135k3996a53620K1198B05542c43451A15274d71397i1999B39140
18329C33236A0386a07152H877J42833I727K95698A39566R3538a97435N4980B40598
18317F4150h1754C27762G2256B1808K01361a18792j0539G4842j2219b24570q7653
18306c12223J42840m8143Q8238q1608i5492D546J896N1834a7146k56109D4685
18294a63887K4621j78698A82094a95957B13850b34496i9963D69486F5846a77643
$$ plain form
18374 188024 208901 94831 -176984 -171680 -30521 -71372 90784 -72772 269827 -142780 96325
18362 434218 -13501 16252 29270 507336 231839 33640 196645 233617 -215670 -64268 -124906
18351 -124906 -204746 -288638 168439 -80135 -70982 -319857 -174142 -21000 20922 182293 147386
18340 147386 143251 119255 -153620 -132422 205542 -343451 115274 -471397 -91999 239140
18329 333236 10386 -107152 8877 151710 9727 305425 139566 233104 -197435 -142455 240598
18317 64150 -81754 327762 72256 21808 223169 -118792 -129331 74842 62623 -224570 -312223
18306 -312223 -169383 -217526 -129288 -210896 -95492 4546 6442 58276 -17146 -273255 44685
18294 -163887 -139266 -317964 182094 -195957 213850 -234496 -99963 469486 65846 -177643
18283A9652a48661k96805J56305J403J5457f4378n7638L6591A33631b84448H9640
18271A76960K088N915a01482j75368H1609c921j42529l19322B9249N7743b3916
18259H3420b39289l6810N7615C9673c7670B24173j4905e9217J3429C41998i708
18247A6963h4705j41479f4077A65887e0465B13647b16659A36212b90975h3139
18236g1122r2998A71732M6204A3998J08443J27143e5535j44374k2144h4877j74475
18225b59352O5177A27266k5070R8970a13632d3692A26500c5851G7537b71179J25552
18214a45627B28801b24684A07196b85049A40931a12024o9520m4993H3892Q3134
18204A67026C9567g1873B12896c9003k49516B8678K76263b97094R3322C5926d0764
$$ plain form
18283 19652 -148661 -445466 -289161 -287758 -272301 -64378 -122016 -85425 133631 -284448 89640
18271 176960 179048 184963 -101482 -276850 81609 -3921 -146450 -465772 29249 86992 -23916
18259 83420 -239289 -276099 -218484 39673 -37670 224173 209268 -59217 -45788 341998 -9708
18247 16963 -84705 -226184 -64077 165887 -50465 213647 -216659 136212 -290975 -83139
18236 -71122 -164120 171732 217936 13998 122441 249584 -55535 -199909 -222053 -84877 -259352
18225 -259352 -194175 127266 102196 201166 -113632 -43692 126500 -35851 77537 -271179 -145627
18214 -145627 228801 -224684 107196 -285049 140931 -112024 -181544 -226537 83892 167026
18204 167026 39567 -71873 212896 -39003 -288519 28678 304941 -297094 -203772 35926 -40764
18192A77159G1636a85746i003j42703K35J485P556A30348j4204c61373a3443r9710
18180a13153j48859a30711R513M463K2999K4467A1637N6449h1754k8138H8156
18168c3187o2156B08588j8260b02801D7004O9988g348D6961o162c44467J11018
18157b33449J14623N7584E0486b8073q2917A91228g1447B5716K50260r6682e5367
18145h349r7691j76746B09362b21427A26578D5964g5588q039o6531r4904B19304
18133b14366A52293J45482b96341H1662a25568j3619O7483A60309D9009a10071
18122A61492e2993q5901A5316K60717D4616c7776C7593a05909j15017N7476A61302
18110c3516m3964A63902g1709C3541b32399A50191c47480A1904b43078c5254H4765
$$ plain form
18192 177159 71636 -185746 -9003 -151706 -151471 -149986 -142430 130348 116144 -361373 -13443 -113153
18180 -113153 -262012 -130711 -121198 -116735 -93736 -69269 11637 68086 -81754 -109892 88156
18168 -33187 -95343 208588 190328 -202801 47004 116992 -7348 46961 40799 -344467 -233449
18157 -233449 -118826 -61242 50486 -28073 -110990 191228 -71447 25716 275976 179294 -55367
18145 -8349 -106040 -282786 209362 -221427 126578 45964 -75588 -83627 -150158 -245062 219304
18133 -214366 152293 297775 -296341 81662 -125568 -139187 -71704 160309 49009 -110071
18122 161492 -52993 -138894 15316 276033 44616 -37776 37593 -105909 -220926 -163450 161302
18110 -33516 -77480 163902 -71709 33541 -232399 150191 -347480 11904 -243078 -35254 84765
18098A37898d5688B44213c49525h3778p5679H1466f5970j43894j23064G3486J78975
18087B52461a12318r0058A73819K69064A25869i7741q2732A13781a05923B75451
18076A31622c4649j37332H8752a64759A61432n4078a84227A809b22764A69519
18065c08796D6187J09908B5000f1924A32173c01164h5367A16385a78030C4631
18054a62727F1344J34639a47912l720j73095J53791D2993d8368A13553L5953b45684
18042A00151f001A3644b6334B18880e1322k20435A9458a66888m5878d7790G7259
18030a85687C7366j4728a40375A03723O949a90278B79368e8486A42585D3728a22709
18018G5621a3721k31896J22489H0775a89796M8677K5132A11086l9006c28512h0258
$$ plain form
18098 137898 -45688 244213 -349525 -83778 -159457 81466 -65970 -209864 -332928 73486 252461
18087 252461 -112318 -202376 173819 442883 125869 -97741 -180473 113781 -105923 275451
18076 131622 -34649 -171981 88752 -164759 161432 107354 -184227 1809 -222764 169519
18065 -308796 46187 156095 25000 -61924 132173 -301164 -85367 116385 -178030 34631
18054 -162727 61344 195983 -147912 -151632 -324727 -170936 42993 -48368 113553 149506 -245684
18042 100151 -6001 13644 -26334 218880 -51322 -271757 19458 -166888 -212766 -47790 77259
18030 -185687 37366 22638 -140375 103723 110672 -190278 279368 -58486 142585 43728 -122709
18018 75621 -13721 -245617 -123128 80775 -189796 -141119 -115987 111086 72080 -328512 -80258
18006D856a48427j0561A6982L223g0402I3172b85673a04233J4994L9149j1034
17995f1124p2321F9069N6720g7897j24055j00956J05288A35441b69789J22513
17985a47276j43983k409d2302E1349O367h6043M1329D3887a13225j57306b1718
17973A55893a94974A63J20239K37557i8238l79916A0556K7577d61153a22636A55378
17961a69821d4538a4159I391a07328A27696K252a71517e2863r8115A09850b14698
17949a38926A53936b22825f280j1668C58374m7657C8955b22288i5395m1838F5903
17937C9870a17604A11638n3365J9804K8390l2018d0848j222j1063B9886e4346
17925b31934A3355e9970B59625f8433r9791A09043d7080J4511k07954C29399D5422
$$ plain form
18006 4856 -148427 -158988 16982 20205 -70402 93172 -285673 -104233 -89239 -50090 -61124
17995 -61124 -133445 69069 125789 -77897 -201952 -302908 -197620 135441 -269789 -147276
17985 -147276 -291259 -293668 -42302 51349 57716 -86043 -44714 43887 -113225 -270531 -21718
17973 155893 -194974 163 120402 357959 -98238 -478154 10556 38133 -461153 -122636 155378
17961 -169821 -44538 -14159 9391 -107328 127696 129948 -171517 -52863 -150978 109850 -214698
17949 -138926 153936 -222825 -6280 -17948 358374 310717 38955 -222288 -95395 -137233 65903
17937 39870 -117604 111638 58273 78077 106467 74449 -40848 -42070 -53133 29886 -54346
17925 -231934 13355 -59970 259625 -68433 -168224 109043 -47080 -32569 -240523 329399 45422
17913a30555N4894A69261M0240f3680j40131C5344j4247d0978l05343d1668l1143
17902g2811F0f1377A97438i8833F5037a33489N8748A58572J18391A6870Q4136
17891A01006l8240a43094j21240J13639d1848B46249c07268e4310p5230B45447
17880A2938a01586m9070A74022a36064I2398D4341K32744a36867A45803a59973
17869d6337A60071l1936D6879b28595c1953E1384P330j4769R6717b86185a22809
17857A83160a73592i896j69365A30462J34462b43714b8302C25545j13750a09444
17846A52752f8297F7003b15775A81380c24200a05531j7321K2392B16353b14318
17835b49097A18618j021g6226B40716I7135d289G2464b29412A44686B9296e7533
$$ plain form
17913 -130555 -75661 169261 209501 -63680 -203811 35344 21097 -40978 -346321 -41668 -72811
17902 -72811 60 -61377 197438 -98833 65037 -133489 -74741 158572 276963 16870 101006
17891 101006 62766 -143094 -264334 -150695 -41848 246249 -307268 -54310 -129540 245447
17880 12938 -101586 -150656 174022 -136064 92398 44341 277085 -136867 145803 -159973
17869 -46337 160071 128135 46879 -228595 -31953 51384 58714 43945 140662 -286185 -122809
17857 183160 -173592 -9896 -179261 130462 264924 -243714 -28302 325545 211795 -109444
17846 152752 -68297 67003 -215775 181380 -324200 -105531 -122852 -100460 216353 -214318
17835 -249097 118618 117597 -76226 240716 97135 -4289 72464 -229412 144686 29296 -57533
17823a53325H6543J8133K1287d4584m7017m7512G8536e9488j5150A87081c23247
17811A2325J60628f3279j43153A0112L808O2991b5624n5716I0289J47286i3284
17799A37713i1258D1628R7230J58916A0121R657K31155a97412B10761a94540O0953
17788a33587A37051c6348q2415A05960b16936o3503C94856i2429A77306E4751
17777E5900M5456o520k8867b3142A41305a75369Q0166r7842M2665p5014B2738
17765C37005C40K41344b51247n7893J53218j1669A21206a03995E1785K89216D9460
17753D5188g9199B90882a62897I6211c88544n3525A6902J07840j3151c03375i1340
17741D5893R7297b24414h8705C48611H2035C0550b7104n8267G3978A0588b56246
$$ plain form
17823 -153325 86543 104676 125963 -44584 -91601 -139113 78536 -59488 -74638 187081 -323247
17811 12325 172953 -63279 -206432 10112 13920 76911 -25624 -81340 90289 237575 -93284
17799 137713 -91258 41628 138858 297774 10121 19778 250933 -197412 210761 -194540 -133587
17788 -133587 137051 -36348 -118763 105960 -216936 -280439 394856 -92429 177306 54751
17777 55900 101356 94836 65969 -23142 141305 -175369 -95203 -193045 -150380 -225394 22738
17765 337005 340 241684 -251247 -309140 -155922 -167591 121206 -103995 51785 341001 49460
17753 45188 -79199 290882 -162897 96211 -388544 -442069 16902 124742 111591 -303375 -91340
17741 45893 143190 -224414 -88705 348611 82035 30550 -27104 -85371 73978 10588 -256246
17729A05143h1259L1298A29889b6724b611k34058B02756F2912b397A23339a09893
17717A3436K8883a50133B85316E7085a71919N5963D2805b81983J40377d2337B09783
17705A32043a28714F0697K62824J33498d1014j54676C53410j21143i9080b4843
17694B97834e7006A0916J3183L3374a24854C136a8530D0340M1518i3872F3048
17682b12038M1986B95339J45169G3268a27481A47323o1557j2784a57844D18420
17671D7875N1054c82294J80712R3664A0481a89945I0668K55461a57259A11378
17660i5938L8615B43210o1294j9014n9698f8041H5913a1450l6599B357b69201
17648B66180j24878E0800b20614C53266I1483K66627E3517a97389P9007B33919
$$ plain form
17729 105143 -81259 -49961 129889 -26724 -2611 -236669 202756 62912 -2397 123339 -109893
17717 13436 42319 -150133 285316 57085 -171919 -115956 42805 -281983 -141606 -42337 209783
17705 132043 -128714 60697 323521 457019 -41014 -195690 353410 232267 -99080 -24843
17694 297834 -57006 10916 24099 57473 -124854 3136 -18530 40340 81858 -93872 63048
17682 -212038 -170052 295339 440508 73268 -127481 147323 85766 72982 -157844 418420
17671 47875 98929 -382294 -201582 -107918 10481 -189945 90668 346129 -157259 111378
17660 -95938 -57323 243210 181916 162902 103204 -68041 85913 -11450 -48049 2357 -269201
17648 266180 141302 50800 -220614 353266 91483 358110 53517 -197389 -118382 233919
17637a28589A8925b5487k6705B37500a93774A17526b41993K7542L5964A29768
17626a73356b9178a2044A87691r2614N9347g2057E9356f8556B1680J95633K2528
17615B39841A8986b78315a26039p2285m6475G0492e5645d663p2844j70834A4622
17603A00158J9704c67160A44188j277j969a01424M5619G6544O0751k5951L4629
17592A45973Q97k0671A48a71438k3190B31914a0851A47120b91C45018b4724A77337
17579A92919q3045J5592a57907a337k06381F8444e6919F7302a70160M9796A78445
17567b13051b8557l9188k02836A38227D6406J34F179a43793P0733A99605d4081
17555E71955A33770J99232b8180C17391n5678F3241Q8559m2974J29864N7808a61501
$$ plain form
17637 -128589 18925 -25487 -52192 237500 -193774 117526 -241993 -214451 -178487 129768
17626 -173356 -29178 -12044 187691 95077 154424 -72057 59356 -68556 21680 217313 239841
17615 239841 18986 -278315 -126039 -198324 -244799 70492 -55645 -4663 -77507 -248341 14622
17603 100158 119862 -367160 144188 142911 140942 -101424 -55805 76544 137295 111344 145973
17592 145973 146870 126199 148 -171438 -194628 231914 -10851 147120 -291 345018 -24724 177337
17579 192919 109874 125466 -157907 -1337 -207718 68444 -56919 67302 -170160 -120364 178445
17567 -213051 -28557 -67745 -270581 138227 46406 46540 6179 -143793 -73060 199605 -44081
17555 571955 133770 333002 -28180 317391 261713 63241 151800 108826 238690 296498 -161501
17543A81121J92012j73157a1132A6931J59755L4326I5782C0273L6755K00251e6397
17531H9438a88443f3099D9394Q9245L8557f1476C27754A33902c8037F945a02213
17519B4139a13744b5670A60492G7591a56457A13340c40778G6303d6781B0432M61675
17508D82107a85929j20072a45723e7406d598q2250A92694g9734K5178C42198E7282
17496B28483r8085h7325C90714G1516L12631d987j3320p3673C55026G067O9750
17485G6817L62395c37312H297d8043C8508N1675o527L74381H1200K23161A36216
17473E75899A85684J09298F7077K14216j22281D4875R8892a74137a1261A45424
17462c48645J20246j42593C23159j35315g4475A25877j6526N5498K33707J10462
$$ plain form
17543 181121 373133 199976 -11132 16931 176686 211012 95782 30273 67028 267279 -56397
17531 89438 -188443 -63099 49394 138639 177196 -61476 327754 133902 -38037 6945 -102213
17519 24139 -113744 -25670 160492 77591 -156457 113340 -340778 76303 -46781 20432 482107
17508 482107 -185929 -306001 -145723 -57406 -4598 -86848 192694 -79734 -54556 342198 57282
17496 228483 130398 -87325 390714 71516 384147 -4987 -18307 -91980 355026 7067 76817
17485 76817 439212 -337312 8297 -48043 38508 90183 83656 458037 81200 304361 136216
17473 575899 185684 294982 67077 281293 159012 44875 143767 -174137 -11261 145424
17462 -348645 -228399 -370992 323159 187844 -74475 125877 109351 164849 398556 509018
17452E09018k46526B5231J28745p3563a73016D88113B35080c5262H2293L32505
17442D14798j61118f7813A15495k1509Q9523Q9895j2763K5851H9141D2027K43877
17431B85904O5025j32624O8955I0070J28541K16133i1460D88301a39715A28148
17420B43625P7684m1930n6536o5544M65265B57188m1545J02462d2043B26217b6954
17408C01775A11787n3531K30590e2393B90490D4568j5519P2957J50129c782E11874
17396B62569K34241E4239J32601O6102b6205D7246K49525I2672J29529p8441J31016
17385B74776b65712m5343C08341n759b389l9017G0003k8970P7794G142J73964
17374A81106E0044K08854M570e3186A58522Q2120A3130J94733j143J12402d3303
$$ plain form
17452 509018 262492 25231 153976 80413 -173016 488113 235080 -35262 82293 414798
17442 414798 253680 -67813 115495 93986 183509 273404 260641 286492 89141 42027 285904
17431 285904 350929 218305 287260 90070 218611 434744 -91460 488301 -139715 128148
17420 243625 321309 279379 222843 157299 622564 257188 215643 318105 -42043 226217 -26954
17408 301775 111787 58256 288846 -52393 290490 44568 29049 102006 252135 -3782 511874
17396 262569 496810 54239 186840 252942 -26205 47246 296771 92672 222201 143760 274776
17385 274776 -265712 -311055 308341 302582 -2389 -41406 70003 41033 118827 7142 181106
17374 181106 50044 258898 263468 -53186 158522 240642 13130 207863 206720 319122 -43303
17362B99760c1316l2924B90638a48489E7007Q8793N865K48458C6852J37898H1445
17350B87035c88633A23164J49639a22204E3999Q3086d3950A43534k1729b73878
17339I9748n399J63623o5573r5666d5240B40462F3333J94005K1978B6169M6112
17328G2281k5766L0726M701d7223A05102J24833q1816o9163J11577N3059i892
17316C00714j45231k758P5040a00562E3089O7854a99376A92638K01639f8745A22099
17304a24516B35513e3885H032K50497A03034J05699l1368A9569K30150c3971K859
17293c1112C61258H6606i7937H7653K16791j27559c5868A80144J9235J27040H5957
17281A43608a76557F7073K6591R2233A8114L12678A14825L88688k09133j35603
$$ plain form
17362 299760 -31316 -64240 290638 -148489 57007 145800 151665 400123 36852 174750 81445
17350 287035 -388633 123164 272803 -122204 53999 137085 -43950 143534 121805 -273878
17339 99748 94349 257972 192399 96733 -45240 240462 63333 257338 279316 26169 72281
17328 72281 46515 77241 81942 -47223 105102 229935 148119 78956 190533 243592 -9892
17316 300714 155483 152725 227765 -100562 53089 120943 -199376 192638 394277 -68745 122099
17304 -124516 235513 -53885 8032 258529 103034 208733 177365 19569 249719 -33971 -31112
17293 -31112 361258 86606 -97937 87653 304444 176885 -35868 180144 199379 326419 85957
17281 143608 -176557 67073 93664 185897 18114 330792 114825 503513 294380 158777
17271A58777k0089K06058j66781M8203c946D11746M9014A54111J6899J39967j2756
17260B98221h0902A6230J24836K3368p1500K07703A35712M122R8416e1809E3957
17248C81300I1191k9018J05946o2352b2516C86049H9575a5181A56771L0838l3403
17237A54206A2125J09668a21339A6058J23801N7584e7619G2180k5526h3228B52179
17225C69477A64701l951Q9207n1205m6847K34923j64825K10561j0535j63556o5025
17214A93448L6103J05316N7280K6297j97550o1658n5416M5785K3862H3309M22260
17203E05569O4164E6379L695r427J48864J47417g0509C20047M9435o7189c7056
17191E01838a47619A42570O7593K56351j66630J14091H1815d8683C05760j40335
$$ plain form
17271 158777 138688 344746 177965 226168 -3946 411746 460760 154111 171010 310977 298221
17260 298221 -80902 16230 141066 164434 92934 300637 135712 139834 238250 -51809 53957
17248 381300 91191 62173 168119 105767 -22516 386049 89575 -15181 156771 187609 154206
17237 154206 12125 121793 -121339 16058 139859 197443 -57619 72180 46654 -83228 252179
17225 369477 164701 160750 249957 198752 151905 386828 222003 432564 422029 258473 193448
17214 193448 229551 334867 392147 418444 220894 159236 103820 149605 173467 83309 505569
17203 505569 569733 56379 60074 50647 199511 346928 -70509 320047 369482 302293 -37056
17191 501838 -147619 142570 210163 466514 299884 413975 81815 -48683 305760 165425
17181A65425j4103B422M88573B14733j04456b75680E01461j43549a03060B07731
17170H6462K17776q076m804r9110O2173r5749F2401L30762c3994D63216j96917
17159B66299m1941K7521K61526k33851O333j2772q4973A8547J70914J06142m8736
17148B46867r4534J76613M7117m1861A54940L36099A983M20625H7540J11497N1366
17137B50403k817J40382H0434K32432J8056J8533Q9114j39709J16897A72454M88770
17126F61224A56558J36933R3268A34782K31223k4416p9078K18280j28495I0313
17115A40831k6739L02021A71362J33862D2626M18097r0519B0956M26337r3998
17105C53295H6620N07458d425C45894J83509n1330j24597K29798n502k57652K5551
$$ plain form
17181 165425 151322 2422 490995 214733 110277 -275680 501461 357912 -103060 207731
17170 86462 304238 296162 291358 192248 254421 158672 62401 393163 -33994 463216 266299
17159 266299 224358 251879 513405 279554 285887 273115 188142 18547 189461 295603 246867
17148 246867 152333 328946 376063 334202 154940 491039 1983 422608 87540 199037 250403
17137 250403 247586 387968 80434 312866 330922 349455 438569 298860 415757 172454 661224
17126 661224 156558 293491 386759 134782 366005 341589 262511 480791 352296 90313
17115 140831 114092 416113 171362 305224 42626 460723 370204 20956 447293 353295
17105 353295 86620 594078 -4425 345894 529403 478073 353476 583274 577772 320120 345671
17094C45671Q5355o2339o7659m9170K28448J65923B32510b6791B61465K14891
17084D76356l4813A90763J9666J89506j39276L68835A50172J87086j25531M30263
17074F41990B80215q4964Q812N03879k79960L16473j11030n699k03594j29858
17064B94274m374L90375J04987l59225J37088K8909J11035k95139r7761J24539
17054D34708j1046K66374k38052K34099j05153k07057J12214O854j97233N49177
17044H44885m20374n9735J79913o0597l9797m5230M34202C41134J05081J13136
17034E59351K64112B13050M26783j28795N1061B79498J99011j35400L56470J49646
17024H49225l46882m7227R7060L58267D16307M93610C70006M29799j61887j55240
$$ plain form
17094 345671 431026 368687 301028 251858 480306 646229 232510 -26791 261465 476356
17084 476356 441543 190763 210429 399935 260659 629494 150172 337258 211727 641990
17074 641990 280215 195251 204063 707942 427982 744455 633425 627726 424132 294274
17064 294274 289900 680275 785262 426037 563125 592034 703069 407930 310169 434708
17054 434708 423662 690036 451984 686083 580930 373873 486087 492941 295708 844885
17044 844885 424511 364776 544689 484092 444295 399065 833267 341134 446215 559351
17034 559351 823463 213050 639833 511038 562099 279498 478509 343109 699579 849225
17024 849225 502343 455116 552176 910443 416307 909917 370006 799805 637918 482678
17014D82678K46879j87026J79355O7316j00243C41294K75106j43508M32345L2302
17004I37539l48061J14317O7664o3368q1841j54091J00252L68588j54940K18284
16994A004343l79934M89165j88221j04113k47413M00184m76762L00443K11000
16985A008692k85921K93283k99928M9648J13121Q419j65109q2165q6995M42326
16975I95371J1396l2878K7516j59264j87726K46156k03066J90928k77126J64013
16965G75320j59567J20453J77706n2576j01239K20415L8352k3055m6722J03730
16955A052817q1362M2870L3150K257L06416j94236j46484N2532J5737n6753l7335
16944I89609K95463l37854J42863j27138K65415l62818J36526m2647K39415O7785
$$ plain form
17014 482678 729557 542531 721886 789202 688959 341294 616400 472892 905237 937539
17004 937539 589478 703795 771459 708091 626250 472159 572411 940999 786059 1004343
16994 1004343 624409 1113574 925353 821240 573827 974011 497249 797692 1008692
16985 1008692 722771 1016054 716126 765774 878895 887314 722205 640040 553045 995371
16975 995371 1006767 973889 1001405 842141 654415 900571 697505 888433 611307 775320
16965 775320 615753 736206 913912 861336 760097 980512 1018864 995809 949087 1052817
16955 1052817 971455 1014325 1047475 1049732 1356148 1161912 1015428 1067960 1083697 1026944 989609
16944 989609 1285072 947218 1090081 962943 1228358 865540 1002066 959419 1198834 1266619
16934A266619l46748K18999L00608l20976J54257k5301J35871n21533M94142k97673
16924A058265M08598j31109M9358l9800l0282K11444k21472N39627l46408q9561
16914A408660j10422J73539L03126o31887K05886J21931j65240K03365J13741
16905A622699l1743j302q1563L87J71571j30812M904J91198q1766j09878J5461
16894A569156p189O0299L99746p7095k65373L37930j81665N8141R8622j11163
16884A881409J03189N3852l9435j00553K36784p0445l0443N9644J41609K6954
16874B262565M21P1075j75689M22164k30931k9059L9180j27764K53626J37936
16864B623524k10929J27238L70889k59474P1661n5016j15149o9238K01829J95688
$$ plain form
16934 1266619 919871 1138870 1439478 1118502 1272759 1247458 1383329 861796 1355938 1058265
16924 1058265 1466863 1335754 1385112 1345312 1315030 1526474 1305002 1844629 1498221 1408660
16914 1408660 1298238 1471777 1774903 1143016 1348902 1470833 1305593 1508958 1622699
16905 1622699 1590956 1589654 1508091 1508478 1680049 1549237 1554141 1745339 1663573 1553695 1569156
16894 1569156 1561967 1622266 2022012 1944917 1679544 2017474 1835809 1893950 1992572 1881409
16884 1881409 1984598 2038450 1999015 1898462 2135246 2064801 2034358 2094002 2235611 2262565
16874 2262565 2262986 2334061 2158372 2580536 2349605 2320546 2359726 2231962 2485588 2623524
16864 2623524 2412595 2539833 2910722 2651248 2722909 2667893 2552744 2483506 2685335 2881023
16854B881023N779k05639K22476M26614j99285j7827j6209K03504n28K37967l63868
16843C174007M32676j41284M30164m10609Q7203M573L12643J2855j07815K71115
16833D065528r7490K07167l4808K20017k5330K73097K34328k32995J31366K90944
16823E031824l52336J55422L81864j03629K36614l9231j1270K09181N24140o2964
16813E969615k69179L46970K10159j14635L25131J1910L39163L74909L75836m95104
16803G074775K77922J59263J30717K59415K63688N33398m10712O61600j09457
16794H840609J86480M17050r6501O24970o0043L82732j7943L61933K04690P92676
16784A1636653P2285K31641L97182M12386K46595O36201M86878K99142K16501
$$ plain form
16854 2881023 2886802 2681163 2903639 3330253 3130968 3113141 3096932 3300436 3299908 3537875 3174007
16843 3174007 3606683 3465399 3895563 3484954 3572157 3576730 3889373 3902228 3794413 4065528
16833 4065528 3968038 4175205 4140397 4360414 4335084 4608181 4842509 4609514 4740880 5031824
16823 5031824 4679488 4834910 5216774 5113145 5349759 5310528 5299258 5508439 6032579 5969615
16813 5969615 5700436 6047406 6257565 6142930 6468061 6479971 6819134 7194043 7569879 7074775
16803 7074775 7352697 7511960 7642677 7902092 8165780 8699178 8288466 8950066 8840609
16794 8840609 9027089 9444139 9347638 9972608 9912565 10295297 10277354 10639287 10843977 11636653
16784 11636653 11708938 11940579 12337761 12750147 12996742 13632943 14119821 14418963 14635464
16775A4635464O12441K34505N68213O79409L82135N60135R81223N59177P11799
16766A9924501O17731N53587P79376J153064P33547J076734P68350R67528R84776
16757B7559194J202615J209670J092980J702573J292024J489638J880681J262699
16749C8692074K030302J863722K004380K400429K377213K526959K758958K559045
16741E7213082L172183L399567L537216L405482M139601M508934M127483N005149
16733H8508697M894287N127511N750813N668162O320090O229734O332435O070815
16725A34902544O601246N798414O120078N353764M950393M157204L533100K069845
16717A73486588J887268K97210o32365j701232k371917l791274m402935n040673
$$ plain form
16775 14635464 15247905 15482410 16050623 16730032 17112167 17672302 18653525 19212702 19924501
16766 19924501 20542232 21095819 21875195 23028259 23761806 24838540 25606890 26574418 27559194
16757 27559194 28761809 29971479 31064459 32767032 34059056 35548694 37429375 38692074
16749 38692074 40722376 42586098 44590478 46990907 49368120 51895079 54654037 57213082
16741 57213082 60385265 63784832 67322048 70727530 74867131 79376065 83503548 88508697
16733 88508697 93402984 98530495 104281308 109949470 116269560 122499294 128831729 134902544
16725 134902544 141503790 147302204 153422282 158776046 163726439 167883643 171416743 173486588
16717 173486588 175373856 175671066 175038701 173337469 170965552 167174278 162771343 157730670
16709A57730670n465216o203371o098154o570685o403094o655872o193922o328020
16701A07812336n784138n865688n487204m999235m699828m363511m721805m046085
16693F7844842l532214l333263l557389k968638k856699k728144k405380k542584
16685D3920531j935138j976066k155425j785597j579779j527910j304833j316938
16677C0338845j600797r73575j423458j095422r71486q73290j191347o47706q31152
16668B0730612o26371r91358n22416q34541l77695o20920n37308o16125m76677
16659A5127201m23636n88753l78640n50569m50169j59740k72764o14111m93050
16650A1195769j56n60169j91588k64719n89775K4227j54654m31796k25411m09664
$$ plain form
16709 157730670 152265454 146062083 139963929 133393244 126990150 120334278 114140356 107812336
16701 107812336 102028198 96162510 90675306 85676071 80976243 76612732 71890927 67844842
16693 67844842 64312628 60979365 57421976 54453338 51596639 48868495 46463115 43920531
16685 43920531 41985393 40009327 37853902 36068305 34488526 32960616 31655783 30338845
16677 30338845 28738048 27764473 26341015 25245593 24274107 23400817 22209470 21561764 20730612
16668 20730612 20104241 19112883 18590467 17755926 17378231 16757311 16220003 15603878 15127201
16659 15127201 14703565 14114812 13736172 13185603 12735434 12575694 12302930 11688819 11195769
16650 11195769 11195613 10635444 10443856 10179137 9589362 9613589 9458935 9027139 8801728 8392064
16640H392064k90973j82130k94390J20930k61261q6442l80272j83582j32347k69928
16630F431669k32627q5550R3809J5n80638Q6610K0665j00443n15977K83751k58936
16619E142348l06863j898Q9658l08967m9396p7226R9778o6895j19442R554O6332
16608D476983m65147J58997l71135J53081J34491m20152M4008J06004j4906K17711
16598D019935o75168J03812J26595l12035n292j2688j91300j12355Q2926q6034
16588B938396l7973j71683J89772K3990j73317l6382O75K0493M5854k88487k22832
16577B288506R1630R2988o0031J31436K7824K44948l72971l3030j61337L3169
16567B283132k62492K6315K56669k89196m1415p7704r1495N6246j53453R8162
$$ plain form
16640 8392064 8101091 7918961 7624571 7745501 7484240 7397798 7017526 6833944 6701597 6431669
16630 6431669 6199042 6113492 6207301 6207316 5626678 5713288 5733953 5633510 5117533 5401284 5142348
16619 5142348 4835485 4833587 4923245 4614278 4564882 4487656 4587434 4520539 4401097 4410651 4476983
16608 4476983 4011836 4170833 3799698 3952779 4087270 3667118 3711126 3817130 3802224 4019935
16598 4019935 3344767 3448579 3575174 3263139 3257847 3245159 3053859 2941504 3024430 2938396
16588 2938396 2900423 2728740 2918512 2942502 2769185 2732803 2733478 2753971 2799825 2511338 2288506
16577 2288506 2380136 2473124 2413093 2544529 2572353 2817301 2444330 2411300 2249963 2283132
16567 2283132 2020640 2046955 2303624 2014428 1973013 1895309 1803814 1860060 1706607 1804769
16557A804769m8762K0924J22141l27765L32883l18496J34366l31051J71686R6394
16547A657089p9659Q5218q8531k32547J09412k94008L81310K16207j73083l48581
16537A232827L54206k85562j3916l3281K75382m295o6679k51505R8766m9566k59044
16526I97333M2585K94140k84174K15767O966J09064m87911K67566j34702m0951
16516I85683K66464m6500j01304j92998K37218j45539r7506J85457M3483n6323
16506A078135k81686l3372J16094l7619j59069L22874m05344M52583M469K1806
16496A078871K9200m0408l59008J53901k4675p0508K06498R4146k48479l6432
16486G83106J67359k52746J69085k34903L08648j35669M4437j68999J7226J27045
$$ plain form
16557 1804769 1756007 1776931 1899072 1571307 1904190 1585694 1720060 1389009 1560695 1657089
16547 1657089 1577430 1662648 1574117 1341570 1450982 1156974 1538284 1754491 1581408 1232827
16537 1232827 1587033 1301471 1287555 1254274 1529656 1525361 1458682 1207177 1305943 1256377 997333
16526 997333 1039918 1334058 1049884 1265651 1272617 1381681 893770 1161336 1026634 985683
16516 985683 1252147 1205647 1104343 911345 1148563 1003024 905518 1090975 1134458 1078135
16506 1078135 796449 763077 879171 841552 682483 1005357 600013 1052596 1057065 1078871
16496 1078871 1108071 1067663 708655 862556 837881 767373 973871 1068017 819538 783106
16486 783106 950465 697719 866804 631901 940549 804880 849317 680318 697544 824589
16476H24589p6908k7931J53053r5747j81031Q5075j25945M7336j20675Q0036p3819
16465D88033M2385K33950j27277B39857L022M89312j99222K03916j91386J69638
16455G15137B77930L18271N0769J0380j97349q8693P4276K50706C12321K92583
16445F04904J72031k35636q4818L25837l59346L60743k93568P6450L4332B67410
16434E29198K31942B04889M14771K86635l76811M3932j41475A81710J67954K70825
16424F20489B98810N61945j92228k20111q4837c200C39324A19700L04256O3471
16414D87427m3920Q4880L1968B47433J0263q7490P52893H3323M82752A99321K8587
16403B27908J21730k5506Q470K1357A76209n5504J96472O6306J27315A76837K42204
$$ plain form
16476 824589 747681 719750 872803 777056 596025 681100 555155 602491 481816 561852 488033
16465 488033 530418 764368 637091 239857 242879 732191 532969 736885 545499 715137
16455 715137 277930 596201 646970 657350 460001 371308 445584 696290 312321 604904
16445 604904 776935 541299 456481 782318 422972 783715 490147 566597 600929 267410
16434 529198 761140 204889 619660 906295 529484 573416 431941 181710 349664 620489
16424 620489 298810 860755 668527 448416 363579 -3200 339324 119700 423956 487427
16414 487427 443507 528387 560355 247433 257696 170206 923099 83323 566075 199321 227908
16403 227908 349638 324132 332602 353959 176209 120705 317177 383483 510798 176837 419041
16392D19041M3875n8795O7938J29572k09304A79346J04899L34671k48903o5287
16382C04726G2096L93974j55294r2063R2850J9611b13046C12413k748J15815D2788
16370C52820A56411J51899F5330L32018r7589D4781L12500j41855q1245L03628
16360D37809A27293m3626J66679J16100j43117q5234K5693J51871q8668J31239
16350C58230l3322b0933C72809L14278E5145J27847E3883J28495H145L36119k1763
16339C22501e3936A21755K31143J40887B03441Q4484F4575Q600K48654L040j25368
16328A99501B0859N4237K09464q6393r7829d5330B23714j09956J82183f3826A82868
16316A03998K11099A6669K99982J22655e212q9032A10799J53809h2077h957B32867
$$ plain form
16392 419041 462916 404121 472059 601631 392327 179346 284245 618916 370013 304726
16382 304726 72096 466070 310776 218713 311563 331174 -213046 312413 309665 425480 42788
16370 352820 156411 308310 65330 397348 299759 44781 357281 215426 134181 437809
16360 437809 127293 83667 250346 366446 223329 138095 163788 315659 226991 358230
16350 358230 324908 -20933 372809 687087 55145 182992 53883 182378 8145 344264 322501
16339 322501 -53936 121755 352898 493785 203441 287925 64575 73175 321829 324869 199501
16328 199501 20859 75096 284560 198167 100338 -45330 223714 113758 295941 -63826 182868
16316 103998 315097 16669 316651 439306 -5212 -94244 110799 264608 -82077 -8957 232867
16304a88357R2995C14227l1423o7071J55517e191A33487a75875A30354J02811
16294B33165m7939J51789A00019Q4936C6925J53791a02779B56966A7382L86733
16284D04115M19j70723g5849D78205C7419A2053P3248J90122a4659C3033J15256
16273A48289m807J7789g1789B17457Q9238j40846k7571a31695j34921A52499J21197
16262B73696n5891g932D94175i0837A04189J6540J05285o2465h4317B752O5124
16251F7876R6654g4260B19675d6037A38811o3203l2170g1770C81168A4746L63663
16240C78409a2367B59098d5769B64382F1836a46856C55361A01621m0536N4605
16230A15690j293J64389A01857J22765R1881j45950n1683c7787B84725a49969
$$ plain form
16304 -188357 -95362 314227 282804 215733 371250 -5191 133487 -175875 130354 233165
16294 233165 185226 337015 100019 184955 36925 190716 -102779 256966 17382 404115
16284 404115 404534 233811 -75849 478205 37419 12053 85301 275423 -14659 33033 148289
16273 148289 143482 161271 -71789 217457 306695 165849 138278 -131695 -266616 152499 273696
16262 273696 217805 -7932 494175 -90837 104189 120729 226014 163549 -84317 2752 67876
16251 67876 164530 -74260 219675 -46037 138811 75608 43438 -71770 381168 14746 378409
16240 378409 -12367 259098 -45769 264382 61836 -146856 355361 101621 61085 115690
16230 115690 114397 278786 101857 224622 316503 170553 118870 -37787 284725 -149969
16219A68969J4844p1803k789L3602G1074K20983c1220j04229H8265C1836k929
16208B8907d9269b4623B98084a34324I8072C5987c14394C24395e2516B50454e2689
16196B40631j00925K58912q3981K309A11317l541b25623H9729c3845B8890g2913
16184a92814K0639N9898C73603b77005B00898m4092a22678A33036n8565e4856
16173c8631j63619M9518b3039p5601A24253a20192q7961A75047J24603c97808
16162a59023A24526b06754A90976a7452A3511K8247e7034e653A62156g764C21793
16150B89378A31243e5766A01253i6879J9838F9817a8902G3839b02069A15746K0386
16139A36132N9119J68518b880C28594d0234C21176C6102P7286a36727B44383N6484
$$ plain form
16219 168969 183813 112010 109221 142823 71074 292057 -31220 -135449 88265 31836 28907
16208 28907 -49269 -24623 298084 -134324 98072 35987 -314394 324395 -52516 250454 -52689
16196 240631 139706 398618 314637 316946 111317 107776 -225623 89729 -33845 28890 -72913
16184 -192814 -172175 -112277 373603 -277005 200898 156806 -122678 133036 74471 -54856
16173 -38631 -202250 -152732 -23039 -98640 124253 -120192 -208153 175047 299650 -397808
16162 -159023 124526 -206754 190976 -17452 13511 41758 -57034 -5653 162156 -7764 321793
16150 289378 131243 -55766 101253 -96879 -77041 69817 -18902 73839 -202069 115746 136132
16139 136132 195251 363769 -2880 328594 -40234 321176 36102 113388 -136727 244383 300867
16128C00867j06174o6697J2315a52391A99254Q095g1907J5294A52397i6682k29868
16117c26550B35661e4064j46345c1077A71235D6067o952K4568c23080A74785H328
16105a0670m40078F9721A8221J76727F4536K02505H1490a69828A34253b6456a395
16093C0212p666J42998b20679C05146l6715A19043M6764C8722a86091g8259B61648
16081e780j89C1397M9711C2561d5054B60779A06680a61074d1886A41997r139M0121
16069A72979b03514J01679A67482B3222J85482j03223b37492B6897J19377N203
16059A51477D9842b83905A16980C8344d9809A60572b1127c061E8001b27157h0860
16047b87617J02775E890b21047Q3841A17715p055a95721Q9084E7117e5418I4135
$$ plain form
16128 300867 194693 127996 140311 -152391 199254 207349 -71907 -56613 152397 -96682 -326550
16117 -326550 235661 -54064 -200409 -31077 171235 46067 39115 63683 -323080 174785 8328
16105 -10670 -450748 69721 18221 194948 64536 267041 81490 -169828 134253 -26456 -1395
16093 30212 22546 165544 -220679 305146 268431 119043 165807 38722 -186091 -78259 261648
16081 -5780 -5969 31397 81108 32561 -45054 260779 106680 -161074 -41886 141997 132858 172979
16069 172979 -203514 -101835 167482 23222 208704 105481 -237492 26897 146274 151477
16059 151477 49842 -283905 116980 38344 -49809 160572 -21127 -3061 58001 -227157 -80860
16047 -287617 -184842 5890 -221047 -137206 117715 110660 -195721 -106637 57117 -55418 94135
16035B39107a93443e225j22575N4248A74111c4119q2876k14017a58726o5218F7030
16023A552K47843o877o286H9874c83252J79060n4912f940l03064h1860l06244
16012c88104G1692j3944B3371P5294a38850A46287c78615D1500J66093D3477b24643
16000b3994l7589j01682A85380b08019C1683J1671e3484A60466a62438B51127
15989A13831b41797C37731a29557A80475N3560M5709J61596J60034k28585M00
15979C73189a23050r7483K8269B85977j17269F5684P9590c4489p9118J3598B17550
15967b88579C24841j47510c0952F270L4090f6641A14060F160J56794i9931j56494
15956b56425K9862I8273L2335a64125A48336a8482D5672a91916k6185I7453b58003
$$ plain form
16035 239107 -193443 -5225 -127800 -73552 174111 -34119 -116995 -331012 -158726 -223944 67030
16023 1552 249395 242518 236232 89874 -383252 -204192 -259104 -6940 -310004 -81860 -388104
16012 -388104 71692 57748 23371 98665 -138850 146287 -378615 41500 207593 43477 -224643
16000 -23994 -61583 -163265 185380 -208019 31683 43354 -53484 160466 -162438 251127
15989 113831 -241797 337731 -129557 180475 234035 279744 441340 601374 372789 373189
15979 373189 -123050 -220533 -192264 285977 168708 65684 145274 -34489 -113607 -100009 217550
15967 -288579 324841 177331 -30952 6270 40360 -66641 114060 6160 162954 -99931 -256425
15956 -256425 -226563 98273 130608 -164125 148336 -18482 45672 -191916 -218101 97453 -258003
15944H4360c2803l354k54876B3020a20817d8715l1651A80935h8034A79503c20415
15932E755c97072a78072j35980a20493e0703D897J03240P8813L03509a35713K8840
15921a06873k4351j51093K1260A66620g4871k9737F6671b74679i8547j19819B4171
15909i8794c3724B33301i0848A59580b36760j6919B00637a48597d7939l94714
15899d42653I7186b13043a2779B89758a54863K1104d5757l44196b1486p4342k7275
15888a23103A42514B147J69437j8387d9484B29346h4662C0567e8496r2609M9118
15877a01987J3124j8385j21541p9525c4656A52377g982B33039P1704F4822r777
15866E5045a72174N4433j2757N0383r1205B36082m9417N4392q1195e9523j01977
$$ plain form
15944 84360 -32803 -36157 -291033 23020 -120817 -48715 -80366 180935 -88034 179503 -320415
15932 5755 -397072 -178072 -314052 -120493 -50703 4897 108137 186950 490459 -135713 -106873
15921 -106873 -131224 -282317 -261057 166620 -74871 -104608 66671 -274679 -98547 -218366 24171
15909 -98794 -33724 233301 -90848 159580 -236760 -253679 200637 -148597 -47939 -442653
15899 -442653 97186 -213043 -12779 289758 -154863 -133759 -45757 -389953 -21486 -95828 -123103
15888 -123103 142514 2147 171584 153197 -49484 229346 -84662 30567 -58496 -151105 -101987
15877 -101987 -88863 -107248 -228789 -308314 -34656 152377 -7982 233039 304743 64822 55045
15866 55045 -172174 -117741 -130498 -80115 -171320 236082 186665 241057 159862 -59523 -161500
15855a61500B0487b60011J08491c7848D2833K9222J50676E4666j1191N0800b3661
15843h5855l21313a28726I05Q0695Q284g2290a9234A2648R7458c65393H2245a45803
15830B0166g6362r7107e5376k57435O1098J13565b6898F5770B2J1223a82838j11502
15818b94340A1569b42117E300K6242a4572k4535G7124e0666j89394A97991p8981
15807A19010d7205A82163F6319O8641e8243C00626b2269q5665A11999d3850o518
15796e0368C2171b5088j53845B9710O7281b61467e0636A49503a16790d382j69522
15785a73904B3926J53370j714a0346j26072C9460a07566o5500M3586b0720l29162
15774c49882F4008J96170b4586O948q0584k3664A45451d5770j49335O6160B27115
$$ plain form
15855 -161500 20487 -260011 -151520 -37848 42833 72055 222731 54666 43475 94275 -23661
15843 -85855 -407168 -128726 905 81600 89884 -72290 -19234 12648 110106 -365393 82245 -145803
15830 20166 -76362 -173469 -55376 -312811 -251713 -138148 -26898 65770 22 11245 -182838 -294340
15818 -294340 11569 -242117 5300 31542 -14572 -39107 77124 -50666 -240060 197991 119010
15807 119010 -47205 182163 66319 134960 -58243 300626 -22269 -107934 111999 -43850 -50368
15796 -50368 32171 -25088 -178933 29710 96991 -261467 -50636 149503 -116790 -4382 -173904
15785 -173904 23926 177296 175582 -10346 -136418 39460 -107566 -173066 -129480 -20720 -349882
15774 -349882 64008 260178 -24586 -17638 -98222 -121886 145451 -45770 -195105 -128945 227115
15762H7380M9965d7854A23213n4596C368L34766I2595J25350f4879B33473g9563
15750a00629A6503K16007h2729A12161a83767L2990A91125q4814i1685K8760A34467
15738i6443j01847d6802A36707n5726a10275A49018e7724b533m9299l2412L1059
15727e3185j24355k2380p8671J16217c2688k70058A11545Q1476c4239k28479k04353
15716d67071a87509N2596A51723p3194A7227a84163G1385d9449j10294o8073h2566
15704a19451M6770k64415A22732K37845f874G3646a65389q5560h2743D8906e1957
15692B32584J6819D4440b05194r757D6619e7020I4568c73984J14807I4352k8718
15681F5634a68239A61921F2346a90731a2737j43963B44924i7032B5263b95183
$$ plain form
15762 87380 137345 -47854 123213 68617 3368 338134 92595 217945 -64879 233473 -79563
15750 -100629 16503 232510 -82729 112161 -183767 -150777 191125 106311 -91685 -62925 134467
15738 -96443 -198290 -46802 136707 80981 -110275 149018 -57724 -2533 -51832 -84244 -53185
15727 -53185 -177540 -199920 -278591 -162374 -32688 -302746 111545 193021 -34239 -262718 -467071
15716 -467071 -187509 -134913 151723 78529 17227 -184163 71385 -49449 -159743 -227816 -82566
15704 -119451 -72681 -337096 122732 360577 -6874 73646 -165389 -250949 -82743 48906 -51957
15692 232584 249403 44440 -205194 -214951 46619 -57020 94568 -373984 -259177 94352 65634
15681 65634 -168239 161921 62346 -190731 -12737 -156700 244924 -97032 25263 -295183
15670f3978C0224K75893f6751A00035f1329A00956D2855c755G8655J22356b53046
15658h498A19431Q0991J43113A2633D149K51628m7513c28372g160C4533b72431
15646h6055B94578b33977A32573k2346a72023k60379D57832d0583D1066J2522
15636E3588N0494h1168G2037A9506q152g5799B2294L7204d2479j75918b892C1314
15623c34891a27585M7476k13839C07657p9616h1844m1646H0497a2315k702B72759
15611A27373a13053e6248q5422f3130A08141a47381B09822b60423E0769f1953
15600g6355B56029e7440k99829A05843e13706C5692i9909A1064N1495L0849r585
15589H3823a4873j30974B68579g2324k64108a43271A20190A0769J49643j7171
$$ plain form
15670 -63978 30224 306117 -66751 100035 -61329 100956 42855 -3755 78655 201011 -253046
15658 -8498 119431 200422 343535 12633 4149 255777 208264 -328372 -7160 34533 -272431
15646 -86055 294578 -233977 132573 110227 -172023 -432402 457832 -40583 41066 53588
15636 53588 104082 -81168 72037 19506 11354 -75799 22294 59498 -42479 -218397 -2892 31314
15623 -334891 -127585 -80109 -293948 307657 228041 -81844 -123490 80497 -12315 -15017 272759
15611 127373 -113053 -56248 -141670 -63130 108141 -147381 209822 -260423 50769 -61953
15600 -76355 256029 -57440 -357269 105843 -513706 35692 -99909 11064 62559 93408 83823
15589 83823 -14873 -145847 268579 -72324 -336432 -143271 120190 10769 160412 143241
15579A43241b8100O182B6175d13566a78094g3949B11243l2525d9652C39606a85023
15567c55791B67914e42333B81494b24353A21054i0318E465J51532e2693l5671
15557h8364A01004i3981l6724J9207B7614l469a30522E5435b04810B37986b27420
15545e178p2897B5714a02294B17422o1696K06365b99119F4119N5387n3299M9544
15534A15751a08624j40369A4961a27093j17249i9629E6602K11735H0198e1005
15523a46454F9962b90765A30227b2800e169F9886a6575j52412F8465K43626F4734
15511A6921K75474A26208i5346E5809k6813J451R3051K141b03022O9892p211c3234
15498I1368a26608j25791a8803k58082I9965c7887C6688a1572I6039a1335A48986
$$ plain form
15579 143241 -28100 -21918 26175 -413566 -178094 -73949 211243 178718 -49652 339606 -185023
15567 -355791 267914 -542333 281494 -224353 121054 -90318 5465 156997 -52693 -88364
15557 -88364 101004 -93981 -130705 -111498 27614 24145 -130522 55435 -204810 237986 -227420
15545 -5178 -78075 25714 -102294 217422 155726 362091 -299119 64119 119506 66207 115751
15534 115751 -108624 -248993 14961 -127093 -244342 -99629 56602 268337 80198 -51005
15523 -146454 69962 -290765 130227 -22800 -5169 69886 -16575 -168987 68465 312091 64734
15511 16921 292395 126208 -95346 55809 28996 30447 123498 125639 -203022 -133130 -140341 -33234
15498 91368 -126608 -252399 -18803 -276885 99965 -37887 36688 -11572 96039 -11335 148986
15486i1846l0009A48116c6250I3078a36542M0846A43117a6160k26986R6926F8727
15474A36798n0430Q4866c47580A64172c55051B35107i9800j5517j16573J09082
15464a22808j58642O8625A04480a0814L879j9955B08534E3109a63261E418a57436
15452c0091H8847Q8848E3881C522J45066a75461l5155E7365a46492b3304C68685
15440I1341J42904h5968A4018c83169a01722A48180f5555B1843d1598C241c32089
15428A06118j3158k0540O2968L2301b43956M3275B10330b16525c2788D5898A1838
15416C43774a55072j35353a25952F5958r369J93072L1248F0209M1119e0068J1544
15405c8524A40158a73786B06953J39754b04916M0177J4612D2939d5224k19015
$$ plain form
15486 -91846 -121855 148116 -36250 93078 -136542 -95696 143117 -16160 -243146 -146220 68727
15474 136798 86368 171234 -347580 164172 -355051 235107 -99800 -115317 -231890 -122808
15464 -122808 -281450 -212825 104480 -10814 -6935 -26890 208534 53109 -163261 5418 -157436
15452 -30091 88847 177695 53881 3522 148588 -175461 -210616 57365 -146492 -23304 368685
15440 91341 234245 -85968 14018 -383169 -101722 148180 -65555 21843 -41598 3241 -332089
15428 106118 92960 72420 135388 167689 -243956 -200681 210330 -216525 -32788 45898 11838
15416 343774 -155072 -290425 -125952 65958 56589 249661 280909 60209 101328 -50068 -38524
15405 -38524 140158 -173786 206953 346707 -204916 -164739 -150127 42939 -45224 -264239
15395b64239g0484b3003k53636f5068j15841j32431J55996B81353h4922i554A31885
15383C01400h3826k3619G600c88268h2145j49179H1172b63799B14400B4516J34346
15372A58862D5687K20647H3942A7944J88627a11779k15622B1750b67253h2692
15361b6770B65448b43878J08525r692l26910d6590a363j33431j7190d5439G0329
15349h0391r160F5664B4126J58814O733o2693n2837i4198l7466j34054A90032
15337d0671A3209a68677F1538k2835M8142J813J5073a00895a842p020F5745f4099
15324d6503a1586l94564h1098c9510n5807B71624A09535b19198a02524I2701c00282
15312A49537H889L7251f0485Q359A4759b80170F6381N3729J32468D34b98007c8529
$$ plain form
15395 -264239 -70484 -23003 -276639 -65068 -180909 -313340 -157344 281353 -84922 -9554 131885
15383 301400 -83826 -107445 7600 -388268 -82145 -231324 81172 -263799 214400 24516 158862
15372 158862 45687 266334 83942 17944 206571 -111779 -327401 21750 -267253 -82692
15361 -26770 265448 -243878 -135353 -145045 -471955 -46590 -1363 -134794 -151984 -45439 70329
15349 -80391 -89551 65664 24126 182940 189673 126980 74143 -94198 -131664 -265718 190032
15337 -40671 13209 -168677 61538 38703 86845 88658 103731 -100895 -1842 -8862 65745 -64099
15324 -46503 -11586 -406150 -81098 -39510 -95317 271624 109535 -219198 -102524 92701 -300282
15312 149537 8889 46140 -60485 -52126 14759 -280170 66381 120110 252578 434 -298007 -38529
15299C4722R4123o2294J76644g2088E0600a71410F1720K13203A1219K16829e2149
15287A55059f8526a400D63144e9804J8970j9973B4342a6641A87287m3005l3025
15276A11257c241A96768F4558J51526q3984h6823r2139P1973A55995J12021O0944
15265C28960A40343g174A94939a7878K998B46425k5719C2504J1605i269j22536
15254a31805E9426b82716B51283p3670k3674L42710L35943j9654R0734l10976
15244E92696a7539A89982K601e5794r1320B46636A17366R4106F5261k1161K91541
15233C35641g1234n5250A40118e6920A5487e2747C10719b66496A75638J1794Q1067
15222B68499F5134a14412A64912c28381g3769B03763i3957F5684k4119L8493C7002
$$ plain form
15299 34722 128845 66551 243195 -72088 50600 -171410 61720 274923 11219 228048 -52149
15287 155059 -68526 -1400 463144 -59804 -40834 -60807 24342 -16641 187287 144282 111257
15276 111257 -3241 196768 64558 216084 132100 -86823 -178962 -106989 155995 268016 328960
15265 328960 140343 -7174 194939 -17878 -14880 246425 220706 32504 44109 -9269 -131805
15254 -131805 59426 -282716 251283 177613 153939 496649 832592 812938 903672 592696
15244 592696 -17539 189982 192583 -55794 -147114 246636 117366 211472 65261 44100 335641
15233 335641 -71234 -126484 140118 -56920 15487 -52747 310719 -266496 175638 187432 268499
15222 268499 65134 -114412 164912 -328381 -73769 203763 -93957 65684 41565 80058 37002
15210A76215h6179A04030d0718p3495B06384I3885b46974A67271i9318D01229
15199A39737j4706i3393C40330b59062C7379K5174e4192J3591a4432B09215a27727
15187e9910B83424B96L91934C6176P3722g448k35381C01138b7865C26102b16629
15175A57382f6522A06387m7085b21223j85726A92176k892a45997C08019O6881
15165C74900G5517L7856b87592A05111a15623i443F3909J45927b21721A43635
15154B49521p0633H5851a53579H9321i5997c2252B05752R9831l1982A03429a3002
15142A64215J43149I8067f422A73881D0862a01719p6960E6262a24477e3251C29549
15130a06869C01990a69899a8170G6064L55790B06032D4717M1658j0601H848J66164
$$ plain form
15210 176215 -86179 104030 -40718 -114213 206384 93885 -246974 167271 -99318 401229
15199 139737 125031 -93393 340330 -259062 37379 62553 -54192 -40601 -14432 209215 -127727
15187 -59910 283424 296 392230 36176 109898 -7448 -242829 301138 -27865 326102 -216629
15175 157382 -66522 106387 59302 -221223 -406949 192176 189284 -145997 308019 374900
15165 374900 75517 113373 -287592 105111 -115623 -9443 63909 209836 -221721 143635
15154 249521 178888 85851 -153579 89321 -95997 -32252 205752 305583 273601 103429 -13002
15142 164215 307364 98067 -6422 173881 40862 -101719 -178679 56262 -124477 -53251 329549
15130 -106869 301990 -169899 -18170 76064 431854 206032 44717 86375 75774 8848 175012
15119A75012p6158a3247k92843C47330A8382a36231J0676B93413a86663E4394
15108C5003b79393A62159a65511B32072F9067L8194N1393K26251B3950P0545e9359
15096A39180J25964a3793C66277A32412F1991R0071K68311h723j60943c6538j7980
15085e4518j1736p402B08927G2259K8898d9738j66559D1309J23608L05030B3024
15073A10554e9736O555c449A97702b4662r883I5524n664e2680A47610J44884A34705
15060B42303o6211D3992K34896d0174C57514j60621E3284J62810B2320R7917J33857
15049B54094Q4599B4599P6476a00049I7735Q9396n3856K88684A03775J06655m1620
15038A68810g2979B59078n2109k1161h7576B56687A05681J4907r639A7371R6592
$$ plain form
15119 175012 98854 -13247 -306090 347330 18382 -136231 -125555 293413 -186663 54394
15108 35003 -279393 162159 -165511 232072 69067 107261 158654 384905 23950 94495 -59359
15096 139180 265144 -13793 366277 132412 61991 152062 420373 -8723 -169666 -36538 -54518
15085 -54518 -66254 -73656 208927 72259 101157 -49738 -216297 41309 164917 469947 23024
15073 110554 -59736 -53181 -3449 197702 -24662 -34545 95524 89860 -52680 147610 292494 134705
15060 242303 176092 43992 278888 -40174 357514 196893 53284 216094 22320 120237 254094
15049 254094 338693 24599 101075 -100049 97735 187131 133275 421959 103775 210430 168810
15038 168810 -72979 259078 206969 185808 -87576 256687 105681 120588 110949 17371 113963
15027A13963b7309G2607K39721l1067A4612L34284p9458J94448B9973M5627O6130
15016A41730J03165l8604K30407A41048L91262H8641J57202J71044d1140C03149
15005C25768q0957J06759e8809B52201l4976J63927C0101d0135B54081J30462
14995C84543r9736b50545A57702J38763B1441J78387m3247k1465O4093F5743M02483
14984D68226B00010M1612J33032K53624A52617J21598k7367q0691b158C69754
14973A58822j2056o835J43608q5188Q6206A36741J1477K75278O6149A87155E5710
14961C01567j41363J3171j3502l8770K37655e9130A25034J33757J07819j53915
14951B12695K35717j26171A16663R9924J30220A4198K60732m4578F9071L22227
$$ plain form
15027 113963 -27309 72607 312328 281261 14612 348896 269438 463886 29973 75600 141730
15016 141730 244895 206291 436698 141048 532310 88641 245843 416887 -41140 303149
15005 325768 244811 351570 -58809 252201 217225 381152 30101 -40135 254081 384543
14995 384543 284807 -250545 157702 296465 21441 199828 156581 135116 199209 65743 468226
14984 468226 200010 241622 374654 628278 152617 274215 246848 166157 -2158 369754
14973 158822 146766 139931 283539 198351 284557 136741 148218 423496 489645 187155 55710
14961 301567 160204 173375 159873 121103 358758 -59130 125034 258791 366610 212695
14951 212695 448412 322241 116663 216587 346807 14198 274930 230352 69071 391298
14941C91298E1617e7839C93741K50043B67599f0772C44895A42576P0075P5104
14931B87755K65356B72480Q2031A00260J12289o6527K98428j98844J10008O6419
14921D22033j74675p6318J90690K8133G3429L25512A93929J03072j37011K06920
14911C66910j00013J42453q9948j09585K15170J26912H9726J72910J29172j33361
14901B58447j14445H021L08440H8511C9853M6842L80440I4717J46025P91J20969
14890C62502J91474K12325C25755n5939j7268o2706J85176J12647A13940M48987
14880E62927j88708f9407D84994j41214j50671k3576L26532k05516J88818j78513
14870C00854p3489K02823J01432k47238q7055E1862N4500L32137m2638L37214
$$ plain form
14941 391298 51617 -57839 393741 643784 267599 -60772 344895 142576 212651 287755
14931 287755 553111 272480 354511 100260 212549 146022 444450 245606 355614 422033
14921 422033 247358 171040 361730 389863 73429 398941 193929 297001 159990 366910
14911 366910 266897 409350 319402 209817 424987 551899 89726 262636 391808 258447
14901 258447 144002 8021 316461 88511 39853 86695 467135 94717 240742 241533 362502
14890 362502 553976 766301 325755 269816 252548 189842 375018 487665 113940 562927
14880 562927 374219 -69407 484994 343780 193109 169533 496065 290549 479367 300854
14870 300854 227365 430188 531620 284382 197327 51862 106362 438499 395861 733075
14860G33075j66722A60402K27375J85706p4146A82322M71315l23683N3591j34562
14850B48983R6358L5050P7618k1550j97449J85562D8001K80852K4559R647Q1030
14839D44089J09980k41909j24760L77443J92776l50195k4956A86745P6360K94306
14829E57411j00357j1926B12812J92733A79820J51863J51852K26494k52558p2305
14819C85166N1104k12701J21969m3104J21250B08658L4041J66290O6594m9462
14809D26121J01261J89226l10157p2081K01369R7925k41394K04146j37424j64673
14799B94319J21281j24281K09245k13295J65634Q6122J55041j48158o7252j62703
14789C15953Q5555K46862J5857j54632q1257J22228j00091j47537M5009K31333
$$ plain form
14860 733075 566353 160402 387777 573483 499337 182322 653637 329954 383545 248983
14850 248983 345341 380391 458009 436459 239010 424572 48001 328853 353412 363059 444089
14839 444089 554069 312160 187400 564843 757619 407424 382468 186745 263105 557411
14829 557411 457054 445128 212812 405545 179820 331683 483535 710029 457471 385166
14819 385166 436270 223569 345538 302434 423684 208658 242699 408989 475583 426121
14809 426121 527382 716608 406451 334370 535739 633664 392270 596416 458992 294319
14799 294319 415600 291319 500564 287269 452903 539025 694066 545908 478656 315953
14789 315953 401508 648370 664227 509595 428338 550566 450475 302938 347947 579280
14779E79280N9521j7380m0575k74969K68339k71883M05319n5405l06133K39206
14769E85320j0216j5178j12313J9220r5506J32238J64603j37772n0289l0648Q681
14758D58140K82088l33634Q4987j54856K57694J95392j89916K3150m3256K08628
14748G88417n9029j66490J59773j73963K81994C86155M66960k15936P5610l0684
14738F82105j81519L57545m2767C46812M09023M73382n72697j20188J39952L36610
14728A012894j33279j12265j1187P4291j96364j15252M96412J19554o3650j86661
14718H84493j66684j2244l01082K97943J74100k43227K03273j11088K45470D82159
14707F50333J75740C83690L96832k96427L81176l16396L84216r8893L44957m06867
$$ plain form
14779 579280 638801 621421 580846 305877 574216 302333 707652 652247 346114 585320
14769 585320 575104 559926 447613 466833 371327 503565 668168 530396 480107 449459 458140
14758 458140 740228 406594 491581 336725 594419 789811 599895 623045 579789 788417
14748 788417 729388 562898 722671 548708 830702 386155 853115 637179 712789 682105
14738 682105 500586 858131 815364 346812 755835 1229217 656520 536332 676284 1012894
14728 1012894 879615 767350 756163 830454 634090 518838 1015250 1134804 1071154 884493
14718 884493 717809 705565 404483 702426 876526 633299 836572 725484 970954 482159
14707 650333 826073 383690 780522 484095 865271 548875 933091 834198 1179155 772288
14697G72288J71160B81321O76782j8768j51044R9358K17029l44130o6216q907
14687F85425O7961L6972l1112j3793M1143m6743O2078Q5620n8181J08857q1963
14676H56264K9012M9078j43678M63639k22291J32949j67232l03492J61307K8942
14666H84498r788n2971N0183O1899K25549k54149P858O0266m0092n9239k09626
14655F64388p7199L03763P902K47600L7739j26458r3368K26151j53461J37157
14645A174214J42974k74090J45414p4090K19141k52778M7425K17370n8672j82643
14635A104265K83273l04783J10293K34350k00460L2072R301L10546l20084k25390
14625A033383K15504r0232L04109l05270K728N21134k58799j64308m5720K10649
$$ plain form
14697 772288 943448 281321 958103 939335 788291 887649 1104678 760548 694332 685425
14687 685425 753386 790358 759246 745453 786596 739853 801931 887551 829370 938227 856264
14676 856264 885276 934354 790676 1254315 1032024 1164973 997741 694249 855556 884498
14666 884498 874710 821739 871922 933821 1159370 905221 913079 973345 933253 874014 664388
14655 664388 587189 890952 898854 1146454 1184193 1057735 964367 1190518 1037057 1174214
14645 1174214 1317188 1043098 1188512 1114422 1333563 1080785 1128210 1345580 1286908 1104265
14635 1104265 1387538 1082755 1193048 1427398 1226938 1259010 1268311 1578857 1258773 1033383
14625 1033383 1248887 1158655 1462764 1157494 1160222 1681356 1422557 1258249 1212529 1423178
14615A423178J4115q5736K898K656J07679o473J3877K56195k4559l80950L73764
14604A696644k06684Q9292J2614p0870j45738M9023K71758L7146r7680O2734j68643
14593A529596J87582r9167N2605n9997J66295Q435j1562J13551o1733j95125j0962
14582A619518K42470Q1400k3152k89137L21558k04517L76678O8013l10958L84771
14572B266644p0255j58037L35777k58875K78965r6994r3219K8236J25100K32828
14562B590170k79144J44368K8371Q2375J72216L34726j04703N23789l1192K88310
14552C749286M45318R15847J445555L182830N005655R943300J0056771o470343
14544B8274219j0437724q341839m581470j909084m99194l99490l38086J3814K23886
$$ plain form
14615 1423178 1437293 1351557 1354455 1357111 1464790 1458317 1472194 1728389 1703830 1322880 1696644
14604 1696644 1489960 1579252 1591866 1520996 1375258 1424281 1696039 1733185 1635505 1698239 1529596
14593 1529596 1717178 1618011 1670616 1610619 1776914 1785349 1773787 1887338 1825605 1630480 1619518
14582 1619518 1861988 1943388 1920236 1631099 1952657 1748140 2124818 2192831 1881873 2266644
14572 2266644 2196389 2038352 2374129 2115254 2394219 2297225 2204006 2232242 2357342 2590170
14562 2590170 2311026 2455394 2483765 2566140 2738356 3073082 2968379 3492168 3460976 3749286
14552 3749286 4194604 5110451 6556006 9738836 14744491 24687791 34744562 28274219
14544 28274219 17836495 9494656 4913186 3004102 2504908 2105418 1767332 1781146 2005032
14535B005032j04878k84727L85912K90142k09903K22862m01195L56914j69036
14526B091123K1296k902O0723m2825L68468O5819K6217j70618J7864P0908j62259
14515B343814r1838K80525J21116r2298M8975J79964J43575j22376M36750l52241
14505B895966J9445q6908m9258l3915m9220N89272m31412o9747N81853l51055
14495C015021L5937j43018K99615k92582M00196K67817k18701L8861O1398P9812
14485C544356j76128J44674l75727M64810M0111K2065l07391M69945J04315l09242
14475C621788J75541k62934N49896l37137L09442k07260J88878L7599J30459k9989
14465D176283J72994l3865p5481K81831j26586J36306m14354O10152J38141m08398
$$ plain form
14535 2005032 1900154 1615427 2001339 2291481 2081578 2304440 1903245 2260159 2091123
14526 2091123 2112419 2109517 2170240 2127415 2495883 2561702 2587919 2417301 2435165 2506073 2343814
14515 2343814 2251976 2532501 2653617 2561319 2610294 2790258 2933833 2811457 3248207 2895966
14505 2895966 2915411 2828503 2779245 2745330 2696110 3285382 2853970 2784223 3366076 3015021
14495 3015021 3050958 2907940 3207555 2914973 3315169 3582986 3364285 3403146 3464544 3544356
14485 3544356 3368228 3512902 3137175 3601985 3642096 3664161 3356770 3826715 3931030 3621788
14475 3621788 3797329 3534395 4084291 3747154 4056596 3849336 4038214 4075813 4206272 4176283
14465 4176283 4349277 4315412 4239931 4521762 4395176 4531482 4117128 4727280 4865421 4457023
14455D457023L73284l47395L77854j17274J89769J05587M8973J54852n0624J46111
14445E338160j46378J35309K16391k6696J942K98327q5495Q5872j0387J53781
14435E960826P801l428M00478o4219O4888p7508J00313L31039j47767J69258L32578
14424G074259j7407J83527L9332R727K1394K31065J9250K97407k92377L93783
14414G959960K13341J03777j92014K53936J88031N1905J72673k8953K34359K00172
14404I157187O57726l32226k5314M75024J10002J69390K83977p0766M05940M4833
14394A0875773K44283q933N04472q9977M43068k37995K86771J88136O63481r7135
14384A2771944M55587O421M74534J21172K52379N83466M3381N61040j49836N82694
$$ plain form
14455 4457023 4830307 4482912 4860766 4743492 4933261 5038848 5087821 5242673 5192049 5338160
14445 5338160 5191782 5327091 5543482 5516786 5518728 5817055 5731560 5817432 5807045 5960826
14435 5960826 5968627 5965199 6365677 6301458 6366346 6288838 6389151 6720190 6572423 6741681 7074259
14424 7074259 7056852 7240379 7279711 7289438 7310832 7541897 7561147 7858554 7566177 7959960
14414 7959960 8173301 8277078 8085064 8339000 8527031 8578936 8751609 8722656 8957015 9157187
14404 9157187 9814913 9482687 9457373 9932397 10042399 10211789 10495766 10425000 10830940 10875773
14394 10875773 11120056 11111123 11615595 11525618 11968686 11730691 12017462 12205598 12869079 12771944
14384 12771944 13227531 13233952 13708486 13829658 14082037 14665503 14708884 15269924 15120088 15702782
14374A5702782J80709M33720L07170L16725J79435O06083L62399O4625O46686
14365A8800334L38014l5665Q51934K13221O62992L9412R83545L70807M46572L90672
14355B3061838N30704O13537N73934L98802P90446O69118L88717Q16006O79053
14346B8522155Q54039N08027O45537J071962P57877J050833P77330P37154J195614
14337C6120528J225211Q16503J178365J212482J358609Q08721J567829J389430
14329D5677678J534725J372668J377322J513332J691491J927558K017785J677095
14321E8789654K190220J899745K690514K282394K314189K608524K902689K688751
14313G8366680L101804L261691L160266L598794M056108L714967M244710M383432
$$ plain form
14374 15702782 15883491 16317211 16624381 16941106 17120541 17726624 18089023 18153648 18800334
14365 18800334 19138348 19102683 19954617 20167838 20830830 20870242 21853787 22224594 22671166 23061838
14355 23061838 23592542 24206079 24780013 25178815 25969261 26638379 27027096 27843102 28522155
14346 28522155 29376194 29884221 30529758 31601720 32359597 33410430 34187760 34924914 36120528
14337 36120528 37345739 38162242 39340607 40553089 41911698 42720419 44288248 45677678
14329 45677678 47212403 48585071 49962393 51475725 53167216 55094774 57112559 58789654
14321 58789654 60979874 62879619 65570133 67852527 70166716 72775240 75677929 78366680
14313 78366680 81468484 84730175 87890441 91489235 95545343 99260310 103505020 107888452
14305A07888452M423697N024083N141986N897156N769426O107794O525840O808596
14297A53587030P463291P506397Q548342Q334990R285381R262542J0525712J0418142
14289B24931827J1476870J1484943J2073364J2824904J3120672J3676318J3580242
14282C13169140J3942254J4238883J4041415J4076767J3162292J2999946J2031200
14275D07661897J0665699Q319572L254528O99064N59924K71477l402902m47152
14267D27582107j397991j789023o554783r376233j1233353j2022886j4069592
14260C71138246j4501964j4529282j5297219j4844627j4205253j3953395j3688315
14253B70118191j3141328j2777335j2507242j1316147j1017612j0401176r767477
$$ plain form
14305 107888452 112312149 117336232 122478218 128375374 134144800 140252594 146778434 153587030
14297 153587030 161050321 168556718 177105060 185440050 194725431 203987973 214513685 224931827
14289 224931827 236408697 247893640 259967004 272791908 285912580 299588898 313169140
14282 313169140 327111394 341350277 355391692 369468459 382630751 395630697 407661897
14275 407661897 418327596 426647168 429901696 430600760 431160684 431432161 428029259 427582107
14267 427582107 426184116 424395093 417840310 408464077 397230724 385207838 371138246
14260 371138246 356636282 342107000 326809781 311965154 297759901 283806506 270118191
14253 270118191 256976863 244199528 231692286 220376139 209358527 198957351 189189874
14246A89189874r347108q607082q002739p977232p375282o659982o089023o815384
14238A28316042n143896n370706n202230n024366m555676m310351l620160l861412
14230I1227245l666585l657982l206922l397038k772762k773232k825975k386267
14222F6540482k376876j967393j934817k145617k359158j602783j708765j540423
14214E0904650j643173j456008j500418j389931j288241j350802j324376n60152
14206D0391549j416646j217168q73383j096751j142051k30516j344811r62078
14198C2108145o48039j439923m90037o45147n17216p64164n96717j011411o49437
14189B5346054n42383m89732n02151o46632m42574p42242j11611q53935l92011
$$ plain form
14246 189189874 179842766 171235684 163232945 155255713 147880431 141220449 135131426 128316042
14238 128316042 123172146 117801440 112599210 107574844 103019168 98708817 95088657 91227245
14230 91227245 87560660 83902678 80695756 77298718 74525956 71752724 68926749 66540482
14222 66540482 64163606 62196213 60261396 58115779 55756621 54153838 52445073 50904650
14214 50904650 49261477 47805469 46305051 44915120 43626879 42276077 40951701 40391549
14206 40391549 38974903 37757735 36884352 35787601 34645550 34415034 33070223 32108145
14198 32108145 31460106 30020183 29530146 28884999 28367783 27603619 27006902 25995491 25346054
14189 25346054 24803671 24313939 23811788 23165156 22722582 21980340 21868729 21014794 20622783
14180B0622783m9506p69526m91260J40981q79608m22215l40757k43950j53427
14171A7413515q91089K44827m56707m08852J24568o40020n34898P1808n42160
14162A4380992j39434l42335m6176m38313p1763l62393r8798k19948m3611l31797
14152A2286424k20753J1890m40624k01738K68826n34107j69307j30941m39769
14143A0429901L16227m28579r6130l71509J2213p9252J21604m32181j78849j72523
14133I120922j25509j22530j79310l46511M39191l28669j23552O3472m23778J1463
14123G985189o773k95960L82357m83310J40073k10150K7259n98096j00799K65047
14113G104837M8316n02770J35517K15340l63265p0790r5309m6184k1601O3246
$$ plain form
14180 20622783 20573277 19803751 19312491 19453472 18573864 18151649 17810892 17566942 17413515
14171 17413515 16522426 16767253 16310546 15901694 16026262 15386242 14851344 14923152 14380992
14162 14380992 14241558 13899223 13853047 13414734 13342971 12980578 12881780 12661832 12618221 12286424
14152 12286424 12065671 12077561 11636937 11435199 11704025 11169918 11000611 10869670 10429901
14143 10429901 10746128 10317549 10221419 9849910 9862123 9782871 9904475 9472294 9293445 9120922
14133 9120922 8995413 8872883 8693573 8347062 8786253 8457584 8334032 8397504 7973726 7985189
14123 7985189 7978416 7682456 8064813 7581503 7721576 7511426 7538685 6940589 6839790 7104837
14113 7104837 7153153 6650383 6785900 7001240 6637975 6567185 6471876 6425692 6404091 6467337
14103F467337n48168L97938o18410K64934j053j01009j21310J5725n41852J08115
14093E322247P2758J77097k27157J31929k96641P7270j02602l82869r599L30335
14083E092768k12184O4118J11603l07240J30704m33429L8147k1566j8230L1981
14073D476672O3532l20674L4242p6909J15374J97510l70181J44251n11173K45202
14063C997846o0541j17914J46972k51640J33256L9274J33411N6542k92187m17157
14053C367862Q8191J88188p9913J50432j07124k02299l56487L90495k02169q8541
14043C148635O8593r795J8575K77194l28005k57168K40988q4074l2404J70721
14033C213260J22695j48357n53752P15441l95261K0917l60005J28423K96566p47687
$$ plain form
14103 6467337 5919169 6317107 5698697 5963631 5962578 5861569 5740259 5755984 5214132 5322247
14093 5322247 5395005 5572102 5344945 5476874 5180233 5257503 5154901 4772032 4762433 5092768
14083 5092768 4880584 4944702 5056305 4749065 4879769 4446340 4484487 4462921 4444691 4476672
14073 4476672 4540204 4219530 4253772 4176863 4292237 4489747 4119566 4263817 3752644 3997846
14063 3997846 3937305 3819391 3966363 3714723 3847979 3887253 4020664 4077206 3785019 3367862
14053 3367862 3456053 3644241 3564328 3714760 3607636 3405337 3048850 3439345 3237176 3148635
14043 3148635 3217228 3207433 3226008 3503202 3175197 2918029 3159017 3074943 3042539 3213260
14033 3213260 3335955 3187598 2633846 3349287 2954026 2974943 2614938 2743361 3039927 2292240
14023B292240N09903p7876j42508K7856o7124J13735p512l3609l38422L96517
14013B673200m78330K90630J206K8573j23432j98110K4863j56036J76585N7118
14003B296267j97753Q6796J05601k46126K54106j98124J20245K47876k91010J70130
13993B348008J5854J62764L50792O10880K026290M110412R211042J3250956j986799
13984C0100199q703624p819980n089114k722394j076638j127389j20454o50375
13976B790231O0750O1613m1020m02254J20679l2881n9443k3988J36078n71913
13966B037852k3337K02855P6647n53448M66703j06294P1867r7968j25408j04018
13956A845451o1110K58990J26264n19611L01851j86746K66621J22452n04013L75940
$$ plain form
14023 2292240 2802143 2724267 2581759 2609615 2542491 2656226 2648714 2615105 2276683 2673200
14013 2673200 2194870 2485500 2486706 2515279 2391847 2193737 2218600 2062564 2239149 2296267
14003 2296267 2098514 2185310 2290911 2044785 2298891 2100767 2221012 2468888 2177878 2348008
13993 2348008 2363862 2526626 2877418 3488298 5514588 9625000 18836042 32086998 30100199
13984 30100199 21396575 13576595 8487481 5765087 4688449 3561060 3440606 2790231
13976 2790231 2850981 2912594 2871574 2469320 2589999 2557118 2497675 2473687 2609765 2037852
13966 2037852 2014515 2217370 2294017 1740569 2207272 2100978 2172845 2074877 1949469 1845451
13956 1845451 1784341 2043331 2169595 1649984 1951835 1765089 2031710 2154162 1650149 2026089
13946B026089m07136J08422l2590J99415P5644n02950M19927m84305L31466k21193
13936A512789k2472L5685M04073o0709l60439J72587L2760j27386o3237P5884
13926A599535l73681J97982J21850J1169k13896J28094J52873O9255j78806k74930
13916A239445N16530p0894j55896o6076j38743K31190j42291m8167o2622J58658
13906A461134j66764j84456N9174K08204j27819j69223K24162L05369j88431m54679
13896I66671j7483M36366K69201l24087o11802Q73402K989k35520l6542o9784
13886A253411j37388o0117R938Q3231O2732Q3538k622k16807j67324N00428k8292
13875A380728j3186l54610O0139j26395J51696j13310R7075K54333n61493K32085
$$ plain form
13946 2026089 1618953 1727375 1694785 1894200 1969844 1466894 1886821 1402516 1733982 1512789
13936 1512789 1490317 1526002 1930075 1869366 1508927 1681514 1714274 1586888 1523651 1599535
13926 1599535 1225854 1423836 1545686 1556855 1342959 1471053 1623926 1693181 1514375 1239445
13916 1239445 1755975 1685081 1529185 1463109 1324366 1555556 1413265 1365098 1302476 1461134
13906 1461134 1294370 1109914 1169088 1377292 1249473 1080250 1304412 1609781 1421350 966671
13896 966671 949188 1385554 1654755 1330668 718866 1592268 1595257 1359737 1323195 1253411
13886 1253411 1116023 1055906 1065844 1149075 1211807 1295345 1292723 1075916 908592 1409020 1380728
13875 1380728 1367542 1012932 1073071 946676 1098372 985062 1082137 1336470 774977 1007062
13865A007062M2755j532l0385O4735m9416j23587k51910O47288l17407j14792
13855H72811K3487K4538k02688O89108m80324K91800j96996l8539J57161j78445
13845I61913r1474K37995j86662J1644k63208M27892j91379j95479K42933k28573
13835G25602Q2638L65970m07973P4909J10689O5454C72804L67133n143J96372
13825I31166j35094J7331K72600j84595k28985R3846K44735k90568J48557j38853
13815G30140m2992K52016Q9662m8609k9490l45921L20517O3265D67139L98437
13805H65576K39898m63341K41125j98845J59392j39987J54110M9770k16093J00787
13795G92392r5648J07232N5547k25263k0641L12236C07039N00839o3485K21592
$$ plain form
13865 1007062 1049817 1048285 1017900 1082635 1033219 909632 657722 1305010 987603 872811
13855 872811 896298 920836 718148 1407256 926932 1218732 1021736 983197 1140358 961913
13845 961913 870439 1108434 921772 933416 670208 1098100 906721 711242 954175 725602
13835 725602 808240 1174210 766237 841146 951835 1017289 372804 739937 734794 931166
13825 931166 796072 813403 1086003 901408 672423 766269 1011004 720436 868993 730140
13815 730140 687148 939164 1028826 980217 950727 604806 925323 988588 467139 865576
13805 865576 1105474 642133 883258 684413 843805 703818 857928 907698 691605 792392
13795 792392 696744 803976 859523 634260 613619 925855 307039 807878 744393 965985
13785I65985l79250k6731K00137R5536Q080O847l13359K33337l09044P5206J48527
13774G05271M6271J66746k99752o4248L5381K96934n8702j82917J70827k34282
13764E81529K08109l16032J91497j37276q936N46952E01194R9370J30416j50015
13754E80965K919J55898k28993l2973R0918K0229K93350q7383J93452D84139N2538
13743E36677L01222k20193J8122k32890M0600M02116B98275L38482m1135M3915
13733F39537r6903K21965j15476k11616L09900j40597j22524j43264J68780J0086
13723E19888j91107N03530l68931r7673M93677k50373k02735L38561R6700m00793
13713D40744J67106O3535C17663J72124j05889N4358L39742k59507M4381K3200
$$ plain form
13785 965985 586735 560004 760141 855677 863757 870604 557245 790582 481538 556744 705271
13774 705271 751542 918288 618536 554288 589669 886603 827901 644984 815811 581529
13764 581529 789638 473606 665103 527827 518891 1065843 501194 600564 730980 580965
13754 580965 583884 739782 510789 477816 568734 588963 882313 794930 988382 484139 536677
13743 536677 837899 617706 635828 402938 443538 845654 298275 636757 595622 639537
13733 639537 542634 764599 649123 437507 747407 606810 484286 341022 509802 519888
13723 519888 328781 832311 463380 365707 859384 609011 406276 744837 841537 440744
13713 440744 607850 671385 317663 489787 383898 438256 777998 518491 562872 586072
13703E86072k85985K15502B50283M01520B76789J59788L239K01548B82008K13926
13693D95934K12467C53774p4596P7230J75394n7140j99614K02423L268K18644
13683F99383k4348J06604l02323L55203k94044l6809J26880B27814J16467J67725
13673E12006m1097j65971L01902H6236M38195l7007J10775o2247j90850R6954
13663D42056P0380r1493J02765n0313K49144L7490k57654r4128n6107M46725C63087
13651D47554j47405K45970j90121J02519k6158K1302B07809L48298B27340J90106
13641D17446A86465l2346K95879j76557L07978p4293j6937A44339J36577j9459
13631B61457J07456q7955M07887r1876O0512j58304K66801C61351K76021q5238
$$ plain form
13703 586072 300087 515589 250283 651803 276789 436577 439816 641364 282008 495934
13693 495934 708401 353774 279178 356408 531802 474662 275048 477471 480739 699383
13683 699383 675035 781639 479316 834519 540475 503666 630546 227814 344281 512006
13673 512006 470909 304938 606840 86236 524431 487424 598199 535952 345102 442056
13663 442056 512436 420943 523708 473395 722539 760029 502375 408247 352140 798865 363087
13651 447554 300149 546119 355998 458517 432359 453661 207809 556107 227340 417446
13641 417446 186465 154119 449998 273441 581419 507126 490189 144339 280916 261457
13631 261457 368913 280958 688845 596969 657481 499177 765978 361351 637372 552134
13621E52134j59397A79073K24133l2390k703G6773M37457A40842R930K36381L50545
13610G37698A20700J4793J41212K20156L9561j78971I5215J65342k0027o4019
13600A76511P9647P2856A43071R3241d6645D88671j22980J00347k2172j57512
13590B86354l3042J8853J64661J60449j24350J65488B96014j7511L75373k63525
13580C90351k0626j12248J53104n5421C5421M28127j0391q3645J74231j44788
13570C98955j9574p634A75738K40748N1479G3736J67990K5859K83700p8208A41050
13558E7086J93008O24938B37505H2536M66320j62559m9714J01607j43242J86306
13548D81254A81165R8765A08131J55431A10368J35076R0311j46304p7108L4978
$$ plain form
13621 552134 392737 179073 403206 370816 368113 76773 514230 140842 150772 387153 737698
13610 737698 120700 135493 276705 496861 536422 357451 95215 260557 240530 176511
13600 176511 256158 329014 143071 236312 -46645 488671 365691 466038 443866 286354
13590 286354 253312 272165 436826 597275 472925 638413 296014 278503 653876 390351
13580 390351 369725 257477 410581 355160 35421 463548 453157 369512 543743 398955
13570 398955 379381 371747 175738 416486 467965 73736 241726 267585 551285 473077 141050
13558 57086 250094 875032 237505 82536 548856 386297 336583 438190 294948 481254
13548 481254 181165 279930 108131 263562 110368 245444 335755 189451 112343 147321
13538A47321M76004k58422q9707a38922B70721j03297K30069p0851J44637j41687
13528C29592n1268J68321j25252K1335n8177l7439L15523B46155q9878G1992d331
13516A773K23631N3638L0939r8526L3826N0493l3658N4907c0284E19384N6080
13505E75464B17108O6550J07102H5097K43337a18188A99148D7962K64882j55847
13495A56997R4234j0793q2252C5012O0154J47540r8065J97501l4314p0086J94368
13484D32110I1434J64774H9885B8247K46286D3020J81858E2084a2891A70490E4701
13472C62644k8568A06860J74131G3483L08357r4441l4671b90531A48682J18055
13462B66737j20340K23088A52146b2978A65873M6189J87119k3276Q5395k09938
$$ plain form
13538 147321 623325 364903 275196 -138922 270721 167424 397493 326642 471279 329592
13528 329592 278324 446645 321393 342728 284551 247112 562635 246155 156277 71992 -4331
13516 1773 225404 279042 309981 211455 245281 295774 262116 317023 -30284 519384 575464
13505 575464 217108 283658 390760 85097 328434 -118188 199148 47962 312844 156997
13495 156997 251231 240438 158186 35012 95166 242706 144641 342142 307828 237742 432110
13484 432110 91434 256208 89885 28247 274533 43020 224878 52084 -12891 170490 54701
13472 362644 334076 106860 280991 73483 381840 287399 252728 -290531 148682 266737
13462 266737 146397 369485 152146 -22978 165873 212062 399181 375905 461300 251362
13452B51362M3475A32914k9131A7590K43152G9213K92744B7810e8079D02019A42665
13440C15461K56643A94110j9035J06501J63148A63082L11108A93896K5277r1634
13430A27539J15837O4824N8391A64250d644D05853A57266J57008o3597m3548N2630
13419B59759o1913n7806J501M00322B18743J27789a0188A15895O1791J46825j44407
13408A80104Q5256a6968D9039N2542Q0895J47967r662R1873A73358J04670l9215
13397B38813a7322n1177A88636f0800B16311q8819L9731B6254J20168K5416N7384
13386B29222K74492A33015K20037n0693e7129A09928K06204A06376N0123b7729
13375G629L88178J1351A72483J53450J69607A82741j7734A8212J39745m2835J64359
$$ plain form
13452 251362 294837 132914 103783 17590 260742 79213 371957 27810 -58079 402019 142665
13440 315461 572104 194110 175075 281576 444724 163082 474190 193896 219173 127539
13430 127539 243376 308200 366591 164250 -4644 405853 157266 314274 250677 207129 259759
13419 259759 197846 140040 141541 541863 218743 346532 -10188 115895 177686 324511 180104
13408 180104 265360 -16968 49039 101581 182476 330443 320781 412654 173358 278028 238813
13397 238813 -17322 -68499 188636 -60800 216311 127492 167223 26254 146422 171838 229222
13386 229222 503714 133015 353052 302359 -57129 109928 316132 106376 156499 -27729
13375 7629 395807 407158 172483 325933 495540 182741 165007 18212 157957 115122 279481
13364B79481J37154p7332m9296a97498C86647A72670M50222A69080m5512K12859
13354C36427J91714A5262M69981E1338j1024Q7049O5951o5583c2796j76231C53478
13342F59649B75799A12590B068M74490K234a2003m8168A03780Q2635n0566L63261
13331D99110A31291N0450M5058K26061j43324J55145j06708A10584P6201m250
13321A82535J00671n026j5905o2383J04658n2484O1249j42594D5818J62675I2169
13309I303K13785q0780o501L3248k2091A544L11612A27965c1505H1276L85115
13298D66391D0650d0596A15116a075B16471J36625i024A5113L71540a12101A60886
13286A46855j8645A9662J76554f5930A22035c0262C59928c29247A38740C4770
$$ plain form
13364 279481 416635 339303 290007 -197498 386647 172670 622892 169080 123568 336427
13354 336427 528141 15262 485243 51338 40314 127363 193314 127731 -32796 -209027 353478
13342 659649 275799 112590 2068 476558 478792 -12003 -60171 103780 186415 135849 499110
13331 499110 131291 181741 226799 452860 309536 464681 357973 110584 186785 182535
13321 182535 283206 278180 262275 199892 304550 252066 313315 170721 45818 208493 92169
13309 9303 223088 142308 135807 169055 146964 1544 313156 127965 -31505 81276 466391
13298 466391 40650 -40596 115116 -1075 216471 353096 -9024 15113 386653 -112101 160886
13286 146855 128210 19662 196216 -65930 122035 -30262 359928 -329247 138740 34770
13275B59446H6100m2466A0591M5381K7702K52034B7656J21859b04522E12841A38691
13263A23524n0735f726n0249B88806R75r3983J02771H5726f480A14837e5024B26844
13250C44896A33932i9574B13681d6909A37574J34656a4426G2957N6371L31849
13240D61177j83332a0894C54798f4741A99582j6045p1141l3100a43554A55937
13229D6028J32711J79058j04548b0548B5009L65495j28839a65110D6445L48255
13219C94700A37914D0093L02101j22958a56121n4305f5576A52935E115M03436
13209D08551A38357K1655e9936J8486d254H7385P4134M8293p6864J58805a75782
13197A5367M24263A03512J31956A00551a44063D65595A3024K05307e8971k28718
$$ plain form
13275 259446 86100 43634 10591 55972 83674 335708 27656 149515 -204522 512841 138691
13263 123524 72789 -6726 -56975 288806 289781 195798 298569 85726 -6480 114837 -55024 226844
13250 344896 133932 -99574 213681 -46909 137574 272230 -14426 72957 129328 461177
13240 461177 277845 -10894 354798 -64741 199582 183537 112396 79296 -143554 155937
13229 46028 178739 357797 253249 -20548 25009 390504 261665 -165110 46445 394700
13219 394700 137914 40093 342194 219236 -156121 -210426 -65576 152935 5115 408551
13209 408551 138357 160012 -59936 -41450 -4254 87385 161519 209812 132948 291753 -175782
13197 15367 439630 103512 235468 100551 -144063 465595 13024 218331 -58971 -287689
13187b87689A29683J20710C8833M2566R0612k4216J11169i8583m4180B37412r2145
13176A45267J8493P1368a17605C19557c0912A49125J70678a7912D45654A63842
13165B10828p8654P2145O1115l591l3124l7349C1677J48289a79539B9464a93099
13153A17913K0030g1000B95508G8839c8117H6151C9328b36053E01121E4837L45135
13142C99972g4454I1403a08861A47922d9160r0886I7640l6807d7593a8143A85746
13130A26461Q1145m1747L3506g7245B81066j24382a47612A34676a09028D6008
13119c1214k04983g3392D8810K40637o9569k8224a17294A07068A446L7223P9630
13108A18299B1151K15754I0708a25656B61901H4289b51260B49547e079I8975j7938
$$ plain form
13187 -287689 129683 250393 38833 81399 172011 147795 258964 -98583 -142763 237412 145267
13176 145267 163760 235128 -117605 319557 -30912 149125 319803 -17912 445654 163842
13165 210828 132174 204319 265434 261843 228719 191370 31677 179966 -179539 29464 -193099
13153 117913 137943 -71000 295508 78839 -38117 86151 39328 -236053 501121 54837 399972
13142 399972 -74454 91403 -108861 147922 -49160 -140046 97640 60833 -47593 -18143 185746
13130 126461 207606 165859 199365 -77245 281066 156684 -147612 134676 -109028 46008
13119 -31214 -236197 -73392 48810 289447 219878 191654 -117294 107068 1446 38669 118299
13108 118299 21151 236905 90708 -125656 261901 84289 -251260 249547 -5079 98975 81037
13097H1037a75217C53767A38395k4200r012f324A38031C4361K35652H3530R2588
13086A76118o451j2149p0168K09175a46011C72874E8196K26241a66981B44478
13075B7036h9408H2726a9559j77397A85221L2040i3986B27722N7727A32916J21185
13064B54101F6253E376O8748M56650I6669a28662A70633L6565a17226J2371A03965
13052B56843J45417j66063c15988I5326g4239A73334G3123i0533I6701b41330
13041I1070J95939k1772A15523E1085P4880E4296I731L4831K28740N4841j55654
13030A72489J74858A09504J85004j07629q5308f2323A49767n6977k5762c14499
13019A59351a28207A50406E5413Q76N6684Q8726o5141g1897G0232O8265a0759
$$ plain form
13097 81037 -175217 353767 138395 114195 105183 -6324 138031 34361 270013 83530 176118
13086 176118 169667 157518 87350 296525 -146011 372874 58196 284437 -166981 244478
13075 27036 -89408 82726 -19559 -196956 185221 217261 -93986 227722 285449 132916 254101
13064 254101 66253 5376 74124 530774 96669 -128662 170633 207198 -117226 -104855 103965
13052 256843 402260 236197 -315988 95326 -74239 173334 73123 -90533 96701 -241330
13041 91070 287009 265237 115523 51085 125965 54296 9731 44562 273302 328143 172489
13030 172489 347347 109504 294508 186879 101571 -62323 149767 92790 67028 -314499
13019 159351 -128207 150406 55413 56289 112973 201699 136558 -71897 70232 138497 -10759
13007B40456A19836J41072C2709A4340R4641a38582A96983b5451C3437J49157
12997A82594J0639F0839e3223B78574j08662m8706Q8851p0531K74405A64424e1551
12985H7571K41564A13856d7134B09982H8828J88952a13411A64134J76753o5193
12975B75694A3786R8078E2054L2361L71183b82010H8670a11646b4484l0477I978
12963A40796a41702A81739d44517A6381J16731a93648b6678N33E5670b4670E3472
12951A10069b27753A34699l331a51711G3923h8731h784q3369a3490q484A29165
12939a88887B00458l1463e0442A43473a21438B60408m6711a9785A61336L8J86631
12928C48005N3600A99610G0631g5874B52107D6888a77737j1889h106C5421K10911
$$ plain form
13007 240456 119836 260908 32709 14340 108981 -138582 196983 -25451 33437 182594
12997 182594 193233 60839 -53223 278574 169912 121206 210057 139526 413931 164424 -51551
12985 87571 329135 113856 -47134 209982 88828 277780 -113411 164134 340887 275694
12975 275694 13786 111864 52054 84415 455598 -282010 88670 -111646 -24484 -54961 9978
12963 140796 -141702 181739 -444517 16381 133112 -193648 -26678 -26145 55670 -24670 53472
12951 110069 -227753 134699 131368 -151711 73923 -88731 -8784 -92153 -13490 -21974 129165
12939 -188887 200458 168995 -50442 143473 -121438 260408 213697 -19785 161336 161374 348005
12928 348005 401605 199610 70631 -75874 252107 46888 -177737 -189626 -8106 35421 246332
12917B46332a29815H5663a76803B5683K48455H2857a7375A51290g6617p5969B40295
12905G3973M3249E3726M1310K75384o4620B5077L6578P7746a05491B21775A2916
12893C88732A30241G691J06799a3972k84100A45155E1386P0491a50861p2723O9074
12882a54510m0496A83968o4075Q8093i1938G2198a92245C16188j42183e5717B03468
12870E2987i6517A16644k3869a13846H7813B481J53669a9293H7306a16543E4463
12858B84281K0396A06584K16787b8188B90300I2046i003F2339M6210B2528d6574
12846d28322A14179a7645h068n458A20049K0549N5881K0186a69914E5143J01601
12835A56744k3699R0176C5401K42811E0892c6783m47171a10829a2266j57310C3796
$$ plain form
12917 246332 -129815 85663 -176803 25683 274138 82857 -17375 151290 -76617 -152586 240295
12905 73973 117222 53726 95036 370420 305800 25077 61655 139401 -105491 221775 12916
12893 388732 130241 7691 114490 -13972 -298072 145155 51386 121877 -150861 -223584 -154510
12882 -154510 -195006 183968 119893 207986 -91938 72198 -192245 316188 174005 -55717 203468
12870 52987 -96517 116644 92775 -113846 87813 2481 156150 -19293 87306 -116543 54463
12858 284281 304677 106584 323371 -28188 290300 92046 -9003 62339 108549 22528 -46574
12846 -428322 114179 -17645 -8068 -13526 120049 140598 196479 216665 -169914 55143 156744
12835 156744 133045 223221 35401 278212 50892 -36783 -483954 -110829 -12266 -169576 33796
12823A13400J50978b88392f114j21253a7537o1326A91133a81302f09k3526j7218
12812d1353J766B12349H9105P7812k26c35250a46043c7411B67478e2351C90521
12800A28545D9094j196a57822b7366G8558k8138O5519E1482b5648F5500I827e1510
12787D8095c16362A21411e8735B63420a00324G3140a28431A66459o6976D9506
12776B30304d152C82512a42812A49119M0389d1202I8951b0937C7795N7306b75175
12764A91865C4103L45614e654j836B74135j30768b1742A72575a05705r2644J1596
12753a86753b6989F1931L020P5278h3654R192j58973B72763h7893d3681o0071
12742a03752p2510D94174A19068L87049A92193G0336J77142E3536L20641j34060
$$ plain form
12823 113400 264378 -288392 -6114 -127367 -17537 -78863 191133 -181302 -609 -24135 -41353
12812 -41353 -39587 212349 89105 166917 166691 -335250 -146043 -37411 267478 -52351 390521
12800 128545 49094 47898 -157822 -27366 78558 50420 115939 51482 -25648 65500 9827 -51510
12787 48095 -316362 121411 -58735 263420 -100324 73140 -128431 166459 99483 49506
12776 230304 -4152 382512 -142812 149119 189508 -41202 98951 -20937 37795 95101 -275175
12764 191865 34103 379717 -5654 -7490 274135 143367 -21742 172575 -105705 -198349 -186753
12753 -186753 -26989 61931 64951 140229 -83654 -74462 -233435 272763 -87893 -43681 -103752
12742 -103752 -176262 494174 119068 506117 192193 70336 247478 53536 374177 240117
12732B40117a42643a0138j58167b2146P975o1968C3849a2141A72807b07975A67337
12720B74974a08277A92424G5417b39942M4226F3678J02741a89939A17081c35170
12709B42140K1801j2011N192L5834D5064K2244c507B08750p4542a79526b9373
12697G0297h2242B83787j8395g032o1969b6695a0962j59757d632C68318a5267
12685b37955A93695g7615A7391J45862j1130j6056J0886j4421J75407J13679a2777
12673a29063q7892f3025m532j28347A08020b0951j71651A82577H1071A1311J66212
12662A77523a02841B10294J25825E0482b04885A37289C1089E472i9989B58094
12651A84201H4014a4110C30798A20927N4314k9408J00693A8498L12010H3223d741
$$ plain form
12732 240117 -142643 -10138 -168305 -22146 -14171 -76139 33849 -12141 172807 -207975 167337
12720 274974 -108277 192424 75417 -239942 -195716 63678 166419 -189939 117081 -335170
12709 242140 263941 251930 257122 292956 45064 67308 -3507 208750 134208 -179526 -29373
12697 70297 -82242 283787 265392 -7032 -69001 -26695 -10962 -170719 -4632 368318 -15267
12685 -237955 193695 -77615 17391 163253 152123 136067 146953 132532 307939 421618 -12777
12673 -129063 -216955 -63025 -67557 -195904 108020 -20951 -192602 182577 81071 11311 177523
12662 177523 -102841 210294 336119 50482 -204885 137289 31089 5472 -99989 258094
12651 184201 84014 -14110 330798 120927 175241 145833 246526 18498 330508 83223 -4741
12639C47424D074b63500D9847J68458M0534H802R225g8204B19081I6263h9840
12627B31997J00705d9133A57477J01503A10696K12824E5992K9881a380A78022
12616C21990A24786b13702A19909i7848E1580J52189G312O8288A3850Q6266b26280
12604I7237M3538b25657b0448F0043P6552o2101K17727F805R7059C2502R5411
12593A27913i4420A83852a15962D1562a73994N6843L0963A58971e3725I0148k8251
12582F1897a01403B92919c25536F4480a07087F2137E891M5133L0574f4003p776
12571g1779R062A54158D8059R5604f4067D38481b2009l76363b1610B57483d9060
12559c6578G2873B5112K34713j16430A2890J64041N2992n5157l6535b16028A45121
$$ plain form
12639 347424 4074 -263500 49847 218305 258839 8802 18027 -78204 219081 96263 -89840
12627 231997 332702 -49133 157477 258980 110696 323520 55992 85873 -1380 178022
12616 321990 124786 -213702 119909 -97848 51580 203769 7312 75600 13850 100116 -226280
12604 97237 140775 -225657 -20448 60043 136595 74494 292221 6805 103864 32502 127913
12593 127913 -94420 183852 -115962 41562 -173994 -117151 -86188 158971 -53725 90148 61897
12582 61897 -101403 292919 -325536 64480 -107087 62137 5891 51024 81598 -64003 -71779
12571 -71779 -62717 154158 48059 143663 -64067 438481 -22009 -398372 -21610 257483 -49060
12559 -36578 72873 25112 259825 143395 12890 176931 229923 174766 138231 -216028 145121
12547A89150m276a26333n8369j10175C7071f7261A47382b58659J23433B91658
12536B82290j19432F2169K5454J03423M5248a36010A73853q5942g6019k52627
12526c28646A20177e2944o4626D41236A53430g104B60686a28031A49e4499R550
12515d4949D21186i3878A5277b47910D5780g1484g932q9783A08914K96383F8242
12503C80519I3986j8696a96174d1959q3867C20485A13725M4797k3992c9916A94389
12491D9873K03956a11619A36759J58551a3518C56533a26341e9354C1710a42989
12480e7371m9352E9728a58337q190B50270j23381a76868j21549M572J37068B71194
12468B26415B2040K99522D5274A8755J15466E396f9764K2298j98672A29987C382
$$ plain form
12547 189150 184874 -126333 -184702 -294877 37071 -67261 147382 -258659 -135226 291658
12536 282290 162858 62169 87623 191046 236294 -136010 173853 87911 -76019 -328646
12526 -328646 120177 -52944 -117570 441236 153430 -7104 260686 -128031 149 -54499 -44949
12515 -44949 421186 -93878 15277 -247910 45780 -71484 -7932 -97715 108914 405297 68242
12503 380519 93986 75290 -196174 -41959 -125826 320485 113725 158522 134530 -39916 194389
12491 49873 253829 -111619 136759 295310 -13518 356533 -126341 -59354 31710 -142989
12480 -57371 -106723 59728 -158337 -166527 250270 126889 -176868 -298417 -293845 -156777 271194
12468 226415 22040 321562 45274 18755 134221 5396 -69764 -47466 -246138 129987 3382
12456b42504A54497c1410l9299j64088B00451o3886o922b36471i3990J4314j28166
12445b07842P6328l7321N5020B43981A06669e3792G3781L644e5418A2937g6639
12433b42650c5340G9084d5307A57952c4855k96728a36891C6334d9312l8637p4608
12422a62557f0366q6064f2754A5310i689j1716q8869j41367B8394L7423g5214
12410A24909n17K09458c6468B0663b15978B24938j2782K1177b55808d5573a0740
12398a19146B68694a96363Q2328A04251a58289D720c9369D2331B464L09306A4037
12386g0057j87300O3593A0550J16616a51775a430m61368i1137m7691l1323E4928
12374A22237c6814H0326b67664a3894l7335m1072B7802N0977e0168A9742c42294
$$ plain form
12456 -242504 154497 -31410 -70709 -234797 200451 136565 129643 -236471 -93990 -79676 -207842
12445 -207842 -131514 -168835 -113815 243981 106669 -53792 73781 77425 -55418 12937 -76639
12433 -242650 -35340 79084 -45307 157952 -34855 -331583 -136891 36334 -49312 -87949 -162557
12422 -162557 -60366 -146430 -62754 15310 -9689 -21405 -110274 -251641 28394 65817 -75214
12410 124909 124392 333850 -36468 20663 -215978 224938 212156 233333 -255808 -45573 -10740
12398 -119146 268694 -196363 -114035 104251 -158289 4720 -39369 42331 2464 311770 14037
12386 -70057 -257357 -193764 10550 127166 -151775 -1430 -462798 -91137 -138828 -170151 54928
12374 122237 -36814 80326 -267664 -13894 -51229 -92301 27802 78779 -50168 19742 -342294
12362B0436O7555b69151A41095K3254p4311b45487A82190b1360k19301E0028j0711
12351C9317J2715J59631o3574c687o5199C13966a85972Q4127d1678B32122k1937
12340B10185e7253o5549j6838f2268J2064p5367L6630B43355i107A51136A4332
12328g1910o483k77532H0336k1373e5919B37441j1185a89538A43335a0240I3069
12316C1487L94609b14567f3059J9240j79730A21505b809m6062A68b96223a31812
12304D3335a0317j65313D3486L10871c19986R3291A66345q0238N4176k876N2243
12293A89650r1201c01021A48852D0709L1601a88299h0633C39658A41625a11194
12282G6036j1644K07963c2810R163B75891A09125D223P9M34861j83066o2694J3670
$$ plain form
12362 20436 87991 -269151 141095 164349 90038 -245487 182190 -21360 -240661 50028 39317
12351 39317 52032 211663 148089 -3687 -68886 313966 -185972 -101845 -41678 232122 210185
12340 210185 -57253 -122802 -139640 -62268 -50204 -125571 -88941 243355 -9107 151136 14332
12328 -71910 -78393 -355925 80336 58963 -55919 237441 226256 -189538 143335 -10240 93069
12316 31487 426096 -214567 -63059 -43819 -223549 121505 -2809 -48871 168 -296223 -131812
12304 43335 -10317 -175630 43486 354357 -319986 -226695 166345 86107 140283 137407 189650
12293 189650 98449 -301021 148852 40709 72310 -188299 -80633 339658 141625 -111194
12282 76036 64392 272355 -32810 -23647 275891 109125 4223 4302 439163 256097 193403 207073
12270B07073n4770K810L153c6709C5591b5375A22879J28614a83782H1497b32644
12258D05090a82324Q0065j0177b1528C81784I334E08J52658Q2065p1474e0071
12246A49421L2863L21729B42466n8795m687K60106A55283i800g39A02936m4551
12235E8385K26520j42298A4630F068J12374b08497A85302N3293M9862E0037M71796
12224E21833k43494J18556a03621C83732a4679B29459O2659O8084A08424L8527
12214A46951E296O110I82J04134K47811C7246J42035e1489C8072J29045c6282
12202F21459a68421C66474e3755I2857K57574r1091q8262j1826K43978A41242
12191C53970A35950d0605D9383a60536A60523b09429c0663h372j13699A75249
$$ plain form
12270 207073 152303 155113 158266 -36709 35591 -25375 122879 251493 -183782 81497 -232644
12258 405090 -182324 -102259 -112436 -21528 381784 9334 508 153166 235231 163757 -50071
12246 149421 182284 504013 242466 183671 178984 439090 155283 -9800 -739 102936 58385
12235 58385 284905 142607 14630 6068 118442 -208497 185302 238595 288457 50037 521833
12224 521833 278339 396895 -103621 383732 -14679 229459 292118 360202 108424 146951
12214 146951 5296 11406 982 105116 352927 37246 179281 -51489 38072 167117 -36282
12202 621459 -168421 366474 -53755 92857 350431 259340 171078 159252 403230 141242
12191 353970 135950 -40605 49383 -160536 160523 -209429 -30663 -8372 -122071 175249
12180a37339A15841i8686F7470J28871R5193p8825G0835a60528B44042C3127E108
12168A69492a40145A53385J61513M4549A06226J04361q3320M1141M3992a16282
12157c04786J06189e0057A79603b1320j15129B12516N776D7695K185d70400C4799
12145A18421K88796A01131c8225A95213b7204B42951f7714c3387B80311q2656
12135A97655J61013A14216b538A03554Q9311e1563A43052f1215A02149N314j9940
12124H7523P6510J25976j04085K7530l3754b58218B04142N4850F339d7904k8570
12113g6474l7472A21892d7170p6985p9582a6224A75680q0291K3079J05432b23368
12101b65864e0328j39718A72522E2950i5503K2408a5288r1525A64346b70177A17088
$$ plain form
12180 -137339 115841 -98686 67470 196341 291534 212709 70835 -160528 244042 33127 5108
12168 169492 -140145 153385 314898 359447 106226 210587 127267 168408 212400 -116282
12157 -304786 -198597 -50057 179603 -21320 -136449 212516 218292 47695 49880 -470400 34799
12145 118421 407217 101131 -38225 195213 -27204 242951 -67714 -33387 280311 197655
12135 197655 358668 114216 -2538 103554 192865 -51563 143052 -61215 102149 107463 87523
12124 87523 164033 290009 185924 213454 179700 -258218 204142 258992 6339 -47904 -76474
12113 -76474 -113946 121892 -47170 -124155 -203737 -16224 175680 95389 118468 223900 -223368
12101 -265864 -50328 -190046 172522 52950 -95503 -73095 -15288 -106813 164346 -270177 117088
12089b05143R2461A88496h8568m0437l70705D7697P9857a31566A97699O9642M48000
12078G15341L58705l01977k32054j71005l8785c91431F9225g9753E6179Q0141
12068A36320j0024a23759o9816f4815C69667b96594c2237C07507g9151l96c3874
12056E0149h7218j0604a2548K604E6747b87939a11283B56291A8083b52158a4337
12044i4932B21920I7867f0084r5093K2176A69344n5274k0633a6149A52810a38727
12032b9878B06892a81932e7275d178o9226F1950c60687J68468E4856a4463H2212
12020C67726b33411B07889E1453R2091F2813N6778a55529N8809C4872K82677a39869
12008D39972A8257O4479B7456j1275d0760j07851B12044h7727q0406B51831a5349
$$ plain form
12089 -205143 -112682 188496 -88568 -129005 -499710 47697 127554 -131566 197699 267341 715341
12078 715341 1074046 772069 540015 369010 330225 -391431 69225 -79753 56179 136320
12068 136320 126296 -123759 -193575 -64815 369667 -296594 -32237 307507 -79151 -79547 -33874
12056 50149 -87218 -97822 -12548 -9944 56747 -287939 -111283 256291 18083 -252158 -14337
12044 -94932 221920 97867 -60084 -155177 -133001 169344 114070 93437 -16149 152810 -138727
12032 -29878 206892 -181932 -57275 -4178 -73404 61950 -360687 -192219 54856 -14463 82212
12020 367726 -233411 207889 51453 143544 62813 119591 -155529 -96720 34872 317549 -139869
12008 439972 18257 82736 27456 16181 -40760 -148611 212044 -87727 -168133 251831 -15349
11996F3141g6692A29958b63158N057B3775K53784a44289L6840A08963O6120B0589
11984b9707n187C903b63685A6953M66365B0092d5370G9768J12561C1467a98883
11972c05504A95455a39711A8891J84192b61526A46189K7047Q9559n2684B7457
11961a11376N4314r2272q852E1034J98776F371a27836C15483a41352p5189M2950
11950a73591B49183a85378P538e2890j24230m1850j6030f2121K7923l24311a3765
11938B98069Q6919a90810c6754o0223O58j33301C3085h3883c177k1034C04127
11926d17239A24R7759h3440E4823J07588E687a27911A05898M1548b07408E2422
11914F4615c06208a53069a9969O512B7654a23623B56133J85058a47202e6900D658
$$ plain form
11996 63141 -76692 129958 -263158 -258101 23775 277559 -144289 -107449 108963 175083 20589
11984 -29707 -34894 3903 -263685 16953 483318 20092 -45370 79768 192329 31467 -198883
11972 -305504 195455 -139711 18891 203083 -261526 146189 173236 262795 210111 27457
11961 -111376 -57062 -149334 -158186 51034 249810 6371 -127836 315483 -141352 -216541 -173591
11950 -173591 249183 -185378 -177840 -52890 -177120 -218970 -235000 -62121 -34198 -358509 -13765
11938 298069 384988 -190810 -36754 -96977 -96319 -229620 33085 -83883 -3177 -24211 304127
11926 -417239 124 97883 -83440 54823 162411 5687 -127911 105898 147446 -207408 52422
11914 64615 -306208 -153069 -19969 -13457 27654 -123623 256133 441191 -147202 -56900 4658
11902d9674p6023H5781G233a62116A63876a15597A32611b50852C0970a08455C72572
11890e2132G1752J43061e1159C0939a78196q8537f7518B04219a55219p5733H6800
11878A83830b9470D1853b75573i9487r8059g4113C9045f260j01829B6450b19865
11866A37482J33668a73488K7375j63707a0768k43096A27660a39661L5974p2304
11856a75991k8786B52953b76146G9575c93432A67625g9335A92585c2173B5735
11845I9718b00651h6038A36399J18361C1899J1015a8515p7830A49180J9065D4280
11833a50403j08147A96952E4404R4164a6495A91537A1827J08562g4005n216m3274
11822a22495A3054a12290B454g2869H2205C6051Q7185J80493j31455c68348b1369
$$ plain form
11902 -49674 -125697 85781 7233 -162116 163876 -115597 132611 -250852 30970 -108455 372572
11890 -52132 71752 214813 -51159 30939 -178196 -266733 -67518 204219 -155219 -230952 86800
11878 183830 -29470 41853 -275573 -99487 -197546 -74113 39045 -6260 -108089 26450 -219865
11866 137482 271150 -173488 -146113 -309820 -10768 -253864 127660 -139661 -103687 -175991
11856 -175991 -204777 252953 -276146 79575 -393432 167625 -79335 192585 -32173 25735
11845 99718 -200651 -86038 136399 254760 31899 42914 -18515 -96345 149180 168245 44280
11833 -150403 -258550 196952 54404 148568 -16495 191537 11827 120389 -74005 -79221 -122495
11822 -122495 13054 -112290 2454 -72869 82205 36051 123236 303729 172274 -368348 -21369
11810A68105b32734E754h0855A14993a74741d2783F2792M6085j7898J8997L05126
11799D15102A4796b24320g5502A86446h7079A59981m8016b559l6245p3985a1461
11787b1605F4425a66047d9355F9694b66577d1934c342A72112J05367b31160i987
11775A07533j370b4131J83l9846r4965P3188k6781B8610R4781A258b19517E4645
11762G7574J86184a39772d7676j66644M8737m3079A39810A312K69545a96331A14702
11750A7420b48599J07884K5051B04535K16888d44900g4678j67254I9845h1878
11739A14386m2405d9398j30948d5499B30280p4422A3301g2798j84407B35606b2554
11727B55589J42056a24106C48310b64032K2269f4261j73515Q3098C62313j47228
$$ plain form
11810 168105 -232734 5754 -80855 114993 -174741 -42783 62792 108877 90979 109976 415102
11799 415102 14796 -224320 -75502 186446 -87079 159981 111965 -2559 -38804 -112789 -11461
11787 -21605 64425 -166047 -49355 69694 -266577 -41934 -3342 172112 277479 -231160 -9987
11775 107533 106163 -24131 -23948 -63794 -158759 -85571 -112352 28610 123391 1258 -219517 54645
11762 77574 263758 -139772 -47676 -214320 -165583 -208662 139810 1312 270857 -196331 114702
11750 17420 -248599 -140715 -115664 204535 421423 -444900 -74678 -241932 99845 -81878
11739 114386 71981 -49398 -180346 -45499 230280 155858 13301 -72798 -257205 235606 -22554
11727 255589 397645 -124106 348310 -264032 -241763 -64261 -237776 -154678 362313 215085
11717B15085K7593B4399J39383f8467A90689p3675C8323a1926A98110I0839a34016
11705e4727F0897d0608j47470H1082P7150l6211c1576A30198f9583D8667i4165
11693B97111B5585J81546C3900a35026H9545O2540C1778M5682B8983J82396J07921
11682C19300b07152f5662I7234e1878D9696A7664O8312Q9173d5524j62398j19447
11671c27369H6803B5531M3557f5126B33779a31021A62454G1972J52445a38661
11660a72649L7888F5456J74125c2952j16815E5960A3231D221J53933C1851a27800
11648d9723k19594B48333h4001O640k13735B21028B0168j910P9391e1169j46114
11637a97283A4509d1639A21546E7743A348J07046J06341c25131G0274h1227I2098
$$ plain form
11717 215085 242678 24399 163782 -68467 190689 117014 38323 -11926 198110 90839 -134016
11705 -54727 60897 -40608 -188078 81082 158232 122021 -31576 130198 -69583 48667 -94165
11693 297111 25585 207131 33900 -135026 89545 152085 31778 77460 28983 211379 319300
11682 319300 -207152 -65662 97234 -51878 49696 17664 85976 175149 -45524 -207922 -327369
11671 -327369 86803 25531 69088 -65126 233779 -131021 162454 71972 224417 -138661
11660 -172649 -134761 65456 239581 -32952 -149767 55960 13231 4221 158154 31851 -127800
11648 -49723 -269317 248333 -84001 -77361 -291096 221028 20168 18258 97649 -51169 -197283
11637 -197283 14509 -41639 121546 57743 1348 108394 214735 -325131 70274 -81227 92098
11625A98966b44478a15189A94192c77789i8965c5891B32451C129d77928A36502
11614A3037a08871C1153c47957B86485a0822I273N5782L42268a09230B68145J43817
11603D11962G57J0368J23453c3584F161J49937G1691J13045i3881A89880K5658
11592B15538G6502J51734O8879a3417B38372a66988I556J32685l8697b33735f4352
11580A38090K5905J50500H6237A2046J25901n7219k7468K3586d02364J16275A99409
11568e9373p0136j260C41194O2648a47543B34182O7253a09945C10654C7504g7620
11556E950J99480h2371C55308j31509G4217K0124f0335B97402E6129c3994B60831
11544B15528J12908A05756m7421f8634A7255o017K1279L47648A51856R6110F9863
$$ plain form
11625 198966 -244478 -115189 194192 -377789 -98965 -35891 232451 3129 -477928 136502
11614 13037 -108871 31153 -347957 286485 -10822 9273 65055 407323 -109230 268145 411962
11603 411962 757 11125 134578 -33584 6161 156098 71691 184736 -93881 189880 215538
11592 215538 76502 228236 297115 -13417 238372 -166988 9556 142241 103544 -233735 -64352
11580 138090 163995 314495 86237 12046 137947 80728 53260 76846 -402364 -286089 199409
11568 -59373 -129509 -130769 341194 403842 -147543 234182 301435 -109945 310654 37504 -77620
11556 5950 205430 -82371 355308 223799 74217 94341 -60335 297402 56129 -33994 260831
11544 215528 328436 105756 58335 -68634 17255 11238 32517 380165 151856 247966 69863
11532I6582P2580D7823K00855K42838k39912o1370k0576L76390I3438i5330B7750
11520B36415a7237B87257A32149C1150a4953j54746B23881j2312c3421B02747
11509H6157J36156E0095a50438A99793r505C0997J14264L80910a40646C56312
11498a55335B40757f5143A90312H1865Q1057j5068B2997a6888E2024a427A63248
11486B68998j8138a12497B01731L6613n6328H1528J41377j02485K32288p9389
11476B73319d0377G4889J17211E3420K92825H4086J2206J76269A28938a00878
11465a70420E2077R5318c7955k07641c7061n8728B06233l8735q3052J04326a36724
11453A95450A90e8858B12695b9563k26846G5507a10070B97070F69a85391F7601
$$ plain form
11532 96582 169162 47823 248678 491516 251604 190234 169658 546048 93438 -95330 27750
11520 236415 -17237 287257 132149 31150 -14953 -169699 223881 211569 -33421 202747
11509 86157 222313 50095 -150438 199793 190288 30997 145261 526171 -140646 356312
11498 -155335 240757 -65143 190312 81865 162922 147854 22997 -16888 52024 -1427 163248
11486 268998 250860 -112497 201731 238344 182016 81528 222905 120420 352708 273319
11476 273319 -40377 74889 192100 53420 346245 84086 96292 272561 128938 -100878
11465 -170420 52077 147395 -37955 -245596 -37061 -95789 206233 167498 84446 188772 -136724
11453 195450 190 -58858 212695 -29563 -256409 75507 -110070 297070 669 -185391 67601
11441I3403K1002K25803E4649R1917J06252r9217K4013c01672D3792a41670d6471
11429A90816G3813h0222k20194J536a33207e9038C44269r6318g9866B49127o3122
11418A86005h6984G4283a42406B20372D0610i1554k0131A12501F540J19650d0129
11406i0367m32843c0054k3259l1874B46428J1699j07852a17417B07871g7829B09275
11394a47994B5633f818A06923K3335i086A54820b28446J04713j0461l195D89166
11382A84020F8432K10836j10117m1994I148P50J99948e4038B61209a36720K2776
11371a13944A52330A1336a22240j2878J632B92297b4795o7447j04253n4506B15574
11359a1456E6205a53524j29060E123c9971d81A0418K7744a78784j46408a1733
$$ plain form
11441 93403 114405 340208 54649 146566 252818 153601 177614 -301672 43792 -141670 -46471
11429 190816 73813 -80222 -300416 -298880 -133207 -59038 344269 247951 -79866 249127 186005
11418 186005 -86984 74283 -142406 220372 40610 -91554 -111685 112501 6540 126190 -40129
11406 -90367 -523210 -30054 -53313 -85187 246428 258127 150275 -117417 207871 -77829 209275
11394 -147994 25633 -6818 106923 130258 -9086 154820 -228446 -123733 -134194 -137389 489166
11382 184020 68432 279268 169151 127157 9148 9898 209846 -54038 261209 -136720 -113944
11371 -113944 152330 11336 -122240 -135118 -133486 292297 -24795 -92242 -196495 -251001 215574
11359 -11456 56205 -153524 -282584 5123 -39971 -481 10418 38162 -178784 -325192 -11733
11347a84350B07727J1760a21866M4161j29943E1986b17846A2146N137b39427a07921
11335A54429G249L72913j21504A06134c41330H8287i9171A42311M9293R7547a23200
11323a93821p844e4746C23091A45994c42997B40066i5522C367b32023A9577J17206
11312A36783q386b86646R1958i6658j01331J0206g3119m7986a5422B27396j11935
11301A15461f4815r8160I528b15382B15885g6445j16036J5389n0357f5320E5059
11289a27378p6664n0907d2794B13893a40736q7991i2647k12658f2391a294j72306
11278a73600r4360Q2141E2756O1624j7572M2926b21618A9770L193K84572c68592
11266a22698A53689a63185B04721c9882Q771p9287j96543D9549b79474e6447n8343
$$ plain form
11347 -184350 207727 219487 -121866 -77705 -207648 51986 -217846 12146 17283 -239427 -107921
11335 154429 7249 380162 258658 106134 -341330 88287 -99171 142311 191604 289151 -123200
11323 -193821 -201665 -54746 323091 145994 -342997 240066 -95522 3367 -232023 19577 136783
11312 136783 128397 -286646 -194688 -96658 -197989 -187783 -73119 -121105 -15422 227396 115461
11301 115461 -64815 -162975 9528 -215382 215885 -76445 -192481 -177092 -227449 -65320 55059
11289 -127378 -204042 -254949 -42794 213893 -140736 -228727 -92647 -305305 -62391 -1294 -173600
11278 -173600 -267960 -185819 52756 114380 96808 139734 -221618 19770 22963 307535 -368592
11266 -122698 153689 -163185 204721 -39882 -31111 -110398 -306941 49549 -279474 -56447 -114790
11255a14790k0795c2496m6772L9431q2928j9958N3892B31507c23932A10364J1550
11244A21914c48828A64135K371J79287a89435f6537k36414A65624b79200l0050
11234c09250J13807o8164B21139j07389i4583k9817D1255R1129f0223b2787k28743
11223b51530J19281E2405b83676k49550B3952L3496a82570l1690B6920L9027b5928
11211b80356i9507M7371l0118j52203a14548d5547j5174j62656A41151l4529a2949
11199A85479E794J77539n0629c16203I8055i087A06087b07809A93193G1194N4390
11188A25584b64223L5308h5626C8196a62685b8281B20250e07285K19070a23078
11177A2349J11912B5308g0604a6560B35829i9800k1170j90811E646b47286h1315
$$ plain form
11255 -114790 -135585 -32496 -79268 -39837 -122765 -142723 -88831 231507 -323932 110364 121914
11244 121914 -348828 164135 166506 345793 -189435 -66537 -302951 165624 -279200 -309250
11234 -309250 -195443 -263607 221139 113750 -94583 -124400 41255 132384 -60223 -22787 -251530
11223 -251530 -132249 52405 -283676 -533226 23952 57448 -182570 -214260 26920 65947 -25928
11211 -280356 -99507 -52136 -82254 -234457 -114548 -45547 -60721 -223377 141151 106622 -12949
11199 185479 5794 183333 132704 -316203 98055 -9087 106087 -207809 193193 71194 125584
11188 125584 -264223 -228915 -85626 38196 -162685 -28281 220250 -507285 -288215 -123078
11177 12349 124261 25308 -70604 -16560 235829 -99800 -120970 -311781 5646 -247286 -81315
11165f3280A15849Q0904a58048e2040j014B2471M42101g2104J9328l2380c9066
11153c9168k40343c0894O837j11958C3663J1573K19069a32726p7649e437m2736
11142d8173B01076J62746h824l8750a685A18818B2434Q9690B1603K7392R2845
11131A41840a61084D3219J39287b14388C2362k991a41820D9416b0197j4760B20014
11119I6812b2641E8882K69361j10247H9159a2263m4064j1083A60291D5182L0700
11108G5882I974N7589M2680b33524B56773A2118K94126a22861N3053A42038k2713
11097A19325j9446L04145H789J94012j4136J52033A61390M0055R1694c68019a258
11085G1100J87874q2038n1566J8019J4029J1595P9001K3091J23508P6316j58573
$$ plain form
11165 -63280 115849 196753 -158048 -52040 -53054 22471 464572 -72104 -52776 -85156 -39066
11153 -39168 -279511 -30894 -24057 -136015 33663 45236 264305 -132726 -210375 -5437 -48173
11142 -48173 201076 363822 -8824 -47574 -1685 118818 22434 112124 21603 48995 141840
11131 141840 -161084 43219 182506 -214388 32362 29371 -141820 49416 -20197 -34957 220014
11119 96812 -22641 58882 328243 217996 89159 -12263 -56327 -67410 160291 45182 75882
11108 75882 9974 67563 110243 -233524 256773 12118 306244 -122861 -69808 142038 119325
11097 119325 99879 404024 8789 202801 188665 340698 161390 201445 293139 -368019 -1258
11085 71100 258974 176936 125370 143389 157418 169013 248014 271105 394613 470929 312356
11074C12356q5039A2233L24019H1187K79800L774G6387l3555R6220L00487o0068
11063C79471A13611N7024K23035L4530l5500N34717l95180k4642j12815P6138
11053D70918P9222J83194B90810N92461l09381j52213R3915l2090K94111j81512
11043E96101K5558Q5363j13690J54101J32063j20417k37652J02443J5950A04409
11032D80985K53731j24984J03835C24138L94360j26766J26670K27961j05187k55490
11022E85686j11263j38603M3473L0937J08147n1992J85860J56510j99239J02583
11012G12099k01461J46750k5101o210k30574P3962J46430k9855J12894l3013k59256
11001D06665L63949N7880o0979K1700C51996J96858K29429J05706j50020j45562
$$ plain form
11074 312356 227317 12233 336252 81187 360987 364761 76387 42832 139052 439539 379471
11063 379471 113611 170635 393670 428200 392700 927417 532237 507595 394780 470918
11053 470918 550140 733334 290810 883271 573890 421677 515592 483502 777613 596101
11043 596101 621659 707022 593332 747433 879496 759079 521427 623870 639820 104409
11032 480985 734716 609732 713567 324138 718498 591732 718402 946363 841176 585686
11022 585686 474423 335820 379293 410230 518377 466385 652245 808755 609516 712099
11012 712099 510638 657388 632287 626077 395503 469465 615895 586040 698934 665921 406665
11001 406665 770614 828494 767515 789215 351996 548854 778283 883989 733969 588407
10991E88407J99196j57799J94573P2029j62539J14717m1328L15956m8669l40011
10981G34532J40356J98899p2873M17524N6967M63310J86274j38456N98751j91717
10971B393567j33674l68517L74043k33232m15854N3723L9043K5924j80827n0871
10961A503325K98318P0928k00781K09191J30964m0824j34968J2424q128j34824
10951A705625o30455j88532J15547l81068L08513m24648m9723j80699m2478J29698
10941C61780J58921B58953J07126E0899j8741L6464M47421A20200J15819a61739
10930C66004a22576n4052b7890D3041N0006K24730h1968L36b0800A68148b84518
10918B82200A2445L9269J86924D6367J60650c64704a60849B84536a26139D4663
$$ plain form
10991 588407 787603 629804 824377 896406 733867 848584 807256 1123212 1074543 734532
10981 734532 874888 1073787 1000914 1418438 1475405 1938715 2124989 1986533 2585284 2393567
10971 2393567 2259893 1891376 2265419 2032187 1616333 1670056 1709099 1735023 1554196 1503325
10961 1503325 1801643 1872571 1671790 1880981 2011945 1971121 1836153 1848577 1840449 1705625
10951 1705625 1075170 886638 1002185 621117 929630 504982 455259 274560 232082 361780
10941 361780 520701 258953 366079 50899 32158 68622 516043 120200 236019 -161739
10930 366004 -122576 -176628 -27890 43041 93047 317777 -81968 -81632 -20800 168148 -284518
10918 282200 12445 51714 238638 46367 207017 -364704 -160849 284536 -126139 44663
10907b34669E3007b93288e4411J5789A46497a6189k63682a36004i128c811j31177
10896a34988K2411A01628K17944f3867p5012D42804g4087p3621p4860F0476f4500
10884b78841c7024J4704q4766B9277K35782C0574a92349c1942j25581C11022e3552
10872A16091B5214a53382A7506f6961j80596A22904b09200B52625F3144B614e8685
10860d0323j557p3403J373A26976a52906A54831d5281H9209J70321D8761c8507
10848a78213A26965C8369b98152D3243K504B1631b8384j45014A99054a45384B02838
10836A26687i7775E0943K35641b009n589B93469a03332A37771D3894c32047g6755
10824a60795k4494P3246B282a07810E2539a15775m7751b6605n8427A00026M0549
$$ plain form
10907 -234669 53007 -293288 -54411 -38622 146497 -16189 -279871 -136004 -9128 -3811 -134988
10896 -134988 -112577 101628 319572 -63867 -138879 442804 -74087 -147708 -222568 60476 -64500
10884 -278841 -37024 -22320 -107086 29277 265059 30574 -192349 -31942 -157523 311022 -53552
10872 116091 25214 -153382 17506 -66961 -247557 122904 -209200 252625 63144 2614 -58685
10860 -40323 -41880 -115283 -113910 126976 -152906 154831 -45281 89209 259530 48761 -38507
10848 -178213 126965 38369 -298152 43243 45747 21631 -28384 -173398 199054 -145384 202838
10836 126687 -97775 50943 286584 -2009 -7598 293469 -103332 137771 43894 -332047 -76755
10824 -160795 -185289 -112043 2282 -107810 52539 -115775 -163526 -26605 -85032 100026 140575
10813A40575b5101A68579e0755J0945I2470O9325C4159c02144C6683N2834b11427
10801D5654L35371c24384J61912L4912D2461g79j58159A48004a84009L8172k764
10790a48601P4243B7705b19001h4763d1440N459j06345B058e589A17969d25899
10778b10651q0732E54d28753g105o6247k47957L2255p9425C20703a46672b5379
10766c12159d519r4645n5175J6561e8165m2100j18703L7803e1824r740j07014
10755a68578i568C5877e7794f230A698a07008k4172j4767K5183D0171J67249d2118
10742A23216b43881e8298k37287A12989J8140a86769F2878a16218A61730J51655
10732C13385k8506g8287A57005p2180J38876a08814c0183l23450A98268b8628
$$ plain form
10813 140575 -25101 168579 -50755 -39810 92470 161795 34159 -302144 36683 89517 -211427
10801 45654 381025 -324384 -162472 -127560 42461 -779 -158938 148004 -184009 -145837 -148601
10790 -148601 -74358 27705 -219001 -84763 -41440 -35981 -142326 2058 -5589 117969 -425899
10778 -210651 -291383 554 -428753 -7105 -73352 -321309 -289054 -368479 320703 -146672 -25379
10766 -312159 -4519 -99164 -154339 -137778 -58165 -100265 -218968 -181165 -51824 -61564 -168578
10755 -168578 -9568 35877 -57794 -6230 1698 -107008 -131180 -145947 -120764 40171 207420 -42118
10742 123216 -243881 -58298 -295585 112989 131129 -186769 62878 -116218 161730 313385
10732 313385 284879 -78287 157005 84825 223701 -108814 -30183 -353633 198268 -28628
10721a64571A84158a38839K1924K6494B37981b04963a7643A35498b39418a07329
10710E2970f3883o7802j39293d1297J2703m3870p7807A72101f5281B4351h0253
10698B6217K7883a21403q9659e7552o9925A38372b15144j37248g9835F4410a08849
10686a99123e0416A23983a32392Q377A80486a48161G1777b31684C5223h7611k2834
10675a10445B67682b15730A2604i8460p7813B54109q0599A9969a7946m11252A01904
10663a08959B75616a48402K3507j56220J27650g6669l5925A11990L8924c5821
10652i8848o7816K1196j09948a27442C62531a28947J8360b7455E2785h8474D2090
10640c76260a6396A72885P3428a25512C09799a74910L9783j4904C2545F9P630
$$ plain form
10721 -164571 184158 -138839 -116915 -90421 237981 -204963 -17643 135498 -239418 -107329
10710 52970 -63883 -131685 -270978 -41297 -28594 -72464 -150271 172101 -65281 24351 -80253
10698 26217 54100 -121403 -211062 -57552 -127477 138372 -215144 -352392 -79835 64410 -108849
10686 -199123 -50416 123983 -132392 -124015 180486 -148161 71777 -231684 35223 -87611 -110445
10675 -110445 267682 -215730 12604 -98460 -176273 254109 173510 19969 -17946 -429198 101904
10663 -108959 275616 -148402 -124895 -281115 -153465 -76669 -112594 111990 150914 -35821
10652 -98848 -166664 -145468 -255416 -127442 362531 -128947 -110587 -27455 52785 -88474 42090
10640 -376260 -16396 172885 246313 -125512 309799 -174910 -135127 -150031 32545 69 7699
10629G699d89724J81475b3521n038Q347k52435B311a79967d8763j32478j46435
10618c27676F5956K90090g1785J2654C4874c26163A03861a74388o2163c701k03712
10607b07413M4150A06717R8360a15180l58500F7445a01604n9202l063l1337E4698
10595c0146A07941a3018j22358B44739b53445h0924h490j40740B75113b73354
10584c01599i4908A4941M4196b00364k0699A53694h3566j51792g446k2423A72403
10572c06933A42085a48939r7076d7154A5938a31073q4298H1168a68880G3321K1240
10561I4561f5320k86999i9058j37785f062B31559a07874B2534O1637i5504e581
10549b28043d221n173m0921A97474E3426a60703i321A70526a47296B45210G9888
$$ plain form
10629 7699 -489724 -308249 -23521 -28559 -20212 -272647 2311 -179967 -48763 -181241 -327676
10618 -327676 65956 356046 -71785 -59131 34874 -326163 103861 -174388 -236551 -3701 -207413
10607 -207413 -163263 106717 205077 -115180 -473680 67445 -101604 -160806 -163869 -195206 54698
10595 -30146 107941 -13018 -135376 244739 -253445 -80924 -8490 -149230 275113 -273354
10584 -301599 -94908 14941 59137 -200364 -221063 153694 -83566 -235358 -7446 -29869 172403
10572 -306933 142085 -148939 -246015 -47154 15938 -131073 -215371 81168 -168880 73321 94561
10561 94561 -65320 -352319 -99058 -236843 -6062 231559 -107874 22534 84171 -95504 -5581
10549 -228043 -4221 -9394 -50315 197474 53426 -160703 -9321 170526 -147296 245210 79888
10537E9811f5718p3076H3063i7594A97392a14116b2172q9376N161A7675a64029
10525A27276a31745j56822a17540r2399B4433b07082A16998a77167o5383a8901
10514e8185B14564a4550O099A85456A2337J02646b58534m068A01392l804L00196
10503C97784A21443C7718b43922B16078h8133A36369J71383b13375K9631b7166
10492c8730p258D475a31396C16997A33936a04895C19324E4274J95182P4190L19104
10481F42750C03032K38813m6634j61134J0940J02207A84199f5509l8630B80943
10470b18234B62531g2623A67906A836a45352H5515k5632N2659a61277F5336J70894
10459B36230a57843A10203e1110B02006o3287a85832B16792O9976b95095a11037
$$ plain form
10537 59811 -65718 -138794 83063 -97594 197392 -114116 -22172 -111548 -106387 17675 -164029
10525 127276 -131745 -288567 -117540 -209939 24433 -207082 116998 -177167 -242550 -18901
10514 -58185 214564 -14550 -8451 185456 12337 114983 -258534 -262602 101392 97588 397784
10503 397784 121443 37718 -243922 216078 -88133 136369 307752 -213375 -183744 -27166
10492 -38730 -45988 4475 -131396 316997 133936 -104895 319324 54274 249456 323646 642750
10481 642750 303032 541845 495211 334077 345017 447224 184199 -65509 -104139 280943
10470 -218234 262531 -72623 167906 1836 -145352 85515 59883 112542 -161277 65336 236230
10459 236230 -157843 110203 -51110 202006 138719 -185832 216792 286768 -295095 -111037
10448f1274J2993H0557N0454N9546g5078C4919J55237a49758p3332K3045A00200
10436f6859k42324A28537b04353R0227e5307j47114L956i2773K2032A29436a2581
10424c83334D8212a3179B09497a65926B9602K36716C0091b81058A50261i01m4105
10413d5006G8174a77941j58208A24361b61680B20487b6809k62369B00208a55502
10402B23575m9879B192b23362h8105k24816A17097a13657r4181A05162a76215
10391H7982L6553i6162G9557l6928j3661a62413b6694B38916c4736F0020a58505
10379A25797e9525B28523k6829K21696j88550L40705d3504D17033j84795C9778
10368C68319M5065J88329p4075l3484B46590k3231B2109Q1468P3700P4978D8762
$$ plain form
10448 -61274 -48281 80557 131011 190557 -75078 34919 190156 -149758 -223090 -200045 100200
10436 -66859 -309183 128537 -204353 -114126 -55307 -202421 -198465 -92773 -70741 129436 -12581
10424 -383334 48212 -13179 209497 -165926 29602 266318 30091 -281058 150261 -901 -45006
10413 -45006 78174 -177941 -336149 124361 -261680 220487 -26809 -289178 200208 -155502
10402 223575 173696 2192 -223362 -88105 -312921 117097 -113657 -207838 105162 -176215
10391 87982 124535 -96162 79557 42629 28968 -162413 -26694 238916 -34736 60020 -158505
10379 125797 -59525 228523 201694 423390 234840 575545 -43504 417033 232238 39778
10368 368319 413384 601713 527638 494154 246590 223359 22109 103577 177277 252255 48762
10356C06407j1870I4179K65172A10356J78591P0846r0791K9448F1187J55235H8907
10344C3443M20883J95609B88457N0825I4976K14483A06763J26372Q5401r1675
10334B26861J87938a72777A21816c683A50140l2371a66901h3394B41602j08107
10324A33495J22819f6642j9280C28079G8716M3786D741J49540p1074d0404A46206
10312F7301k0720J45191d0637p3494d387D9490b09325f7201K2877k2177p4479
10301a40980A532O1766e0319k54558j13054D76205a19588J7390I6461g2944l71176
10290d44120C7177g5147b7706F1509a12050p4932B82634a95532k1432J00044L679
10279a13241N1681m3837k0456b089j16513M9214j03176C80597j79364D1552F78
$$ plain form
10356 306407 294537 94179 359351 110356 288947 359793 269002 298450 61187 216422 88907
10344 33443 454326 649935 288457 339282 94976 309459 106763 233135 318536 226861
10334 226861 414799 -172777 121816 -3683 150140 117769 -166901 -83394 241602 133495
10324 133495 256314 -66642 -85922 328079 78716 122502 4741 154281 83207 -40404 146206
10312 67301 46581 191772 -40637 -114131 -4387 49490 -209325 -67201 -44324 -66501 -140980
10301 -140980 1532 63298 -50319 -304877 -417931 476205 -119588 -102198 96461 -72944 -444120
10290 -444120 37177 -75147 -27706 61509 -112050 -186982 282634 -195532 -216964 -116920 -113241
10279 -113241 -61560 -105397 -125853 -2089 -118602 -69388 -172564 380597 201233 41552 678
10267A06732a0826A08033g309r5861a9675H1617J94241m2998b0424D19684G0844
10255C15954b51524B44484J82776b20625B16446O1069j21154M8106d26851Q7943
10245c38908D87480A94028a53583B11967E5913f5853B4344K8566C12J49220a08138
10233a31598E0614j4675b51489O2610h8410n2872n3838c3094B55215j13931g6929
10221b08021A77673b55954i3452c2767F1334a32045j68190B7517b20907c9866
10210a39887A52021l4219l547D3474b27059B18200c93407L6354A08811M241A4394
10198a29475A11384b2925A28106a83j00520o969A28755a76522f2949r0341r2854
10187b46144A45267a10589c0910A8594b08530A65798A6986b42167C4099b04923
$$ plain form
10267 106732 -10826 108033 -7309 -103170 -19675 81617 275858 232860 -20424 419684 70844
10255 315954 -251524 244484 427260 -220625 216446 277515 156361 204467 -426851 -338908
10245 -338908 487480 194028 -153583 211967 55913 -65853 24344 52910 312 149532 -108138
10233 -131598 50614 35939 -251489 -188879 -88410 -141282 -195120 -33094 255215 141284 -76929
10221 -208021 177673 -255954 -93452 -32767 61334 -132045 -300235 27517 -220907 -39866
10210 -139887 152021 117802 114255 43474 -227059 218200 -393407 -357053 108811 113052 14394
10198 -129475 111384 -22925 128106 -183 -100703 -107672 128755 -176522 -62949 -153290 -246144
10187 -246144 145267 -110589 -30910 18594 -208530 165798 16986 -242167 34099 -204923
10176A347c06117h0743F2624A8312a07261q138H3633K57393h6240o5381m46422
10165e98043a92982C25680a76234a1135k9247o0812k31622B38016b10290H4219
10154g104j74238J675H7786b49623A3585K34552g6456k52889a20406B13996E5483
10142B72746f2595B37030q1786N1968b79034C4242a78662c6747n4792b3055A14703
10130a51336j53348M1448J05147c8332A58869d4194p128j821j48710j00847a4810
10118H086e6202N495j27297c0057k27942a13712q095j37093a15135B2326J21011
10107A43337L5320a57647p7670A4777g2504q2443E1502a21562f738k84555J17905
10096a73388H0037a87363I1068a20274B5174h1034C1388a47113E7422j5656b73350
$$ plain form
10176 1347 -306117 -80743 62624 18312 -107261 -115399 83633 341026 -86240 -151621 -598043
10165 -598043 -192982 325680 -176234 -11135 -40382 -101194 -332816 238016 -210290 84219
10154 -7104 -181342 -179667 87786 -249623 13585 248137 -76456 -329345 -120406 213996 55483
10142 272746 -62595 237030 155244 207212 -279034 34242 -178662 -36747 -91539 -23055 114703
10130 -151336 -304684 -263236 -158089 -38332 158869 -44194 -51322 -53143 -201853 -302700 -14810
10118 8086 -56202 -50707 -178004 -30057 -257999 -113712 -121807 -258900 -115135 22326 143337
10107 143337 178657 -157647 -235317 14777 -72504 -154947 51502 -121562 -6738 -291293 -173388
10096 -173388 80037 -187363 91068 -120274 25174 -81034 31388 -147113 57422 41766 -273350
10084I3950h4537L2533j84653m0205L0771A86925g6482i415H3149b3151C2750
10072I4273A7357c52568A53976g9361K648A29428J64870a55058N1910A32620b44675
10060B24613a69652B02306q9271D2642L650b25912G4638J23944c10787A08431
10049h5443m0416j43359H4956l0779d35464B80448a11519F0035a02347j9888j79560
10038c01795J38385E5990J37494a1988l46959g2401m1568j07666R5784e2725A83582
10026f1748G9580j3128b400j77677j42420J61205a2098I5971C1817O9470a02223
10014b29074g6824G8042a06288L4692D7221o725d3680A17959a67378f8806A74861
10002C49022A34375b16294B6682b09510P4494j4007K3731A52748a00333a3450
$$ plain form
10084 93950 -84537 -52004 -236657 -276862 -246091 186925 -76482 -9415 83149 -23151 32750
10072 94273 17357 -352568 153976 -79361 -76713 129428 294298 -155058 -103148 132620 -244675
10060 224613 -169652 202306 113035 42642 46292 -225912 74638 198582 -310787 108431
10049 -85443 -125859 -269218 84956 54177 -435464 280448 -111519 60035 -102347 -122235 -301795
10038 -301795 -163410 55990 193484 -11988 -358947 -72401 -113969 -221635 -125851 -52725 183582
10026 -61748 79580 66452 -2400 -180077 -322497 -161292 -12098 95971 31817 101287 -102223
10014 -229074 -76824 78042 -106288 -71596 47221 40496 -43680 117959 -167378 -68806 174861
10002 349022 134375 -216294 26682 -209510 -135016 -149023 -125292 152748 -100333 -13450
9991A08675a69870k48259e227j00748k466C7758a86780g0364A7961L52390a63216
9979b63829a01115l53331a97125G2706e37695f6504m8981M5047A43319J25584
9969B68903i2116A96430O4097G0723A9733M7443a26077c4020k23320k2726g5373
9957I3458J18513C5841J54796a39552m4350m1617g5180A09292A6790J22367b45151
9945b52123K3675d4587A52827a14458J6669l3254j81039n3780C00367A38123j7547
9934A20576a73813p474a2336m45523a70463J4433B6214h5658j79907B93g9352
9922b23285A56702L5191h5662B88516d42308a1570A06939a27048e8967p216a2707
9910b82324E9667B7536a17127a9283j31102P1161j65019B08851a52813G018i6637
$$ plain form
9991 108675 -169870 -418129 -5227 -105975 -108441 37758 -186780 -70364 17961 370351 -163216
9979 -263829 -101115 -454446 -197125 72706 -537695 -66504 -115485 -70438 143319 268903
9969 268903 -92116 196430 260527 70723 19733 67176 -126077 -34020 -257340 -280066 -75373
9957 93458 211971 35841 190637 -139552 -183902 -225519 -75180 109292 16790 139157 -245151
9945 -252123 -228448 -44587 152827 -114458 -97789 -131043 -312082 -365862 300367 138123 120576
9934 120576 -173813 -181287 -12336 -457859 -170463 -156030 26214 -85658 -265565 293 -79352
9922 -223285 156702 191893 -85662 288516 -442308 -11570 106939 -127048 -58967 -66183 -12707
9910 -282324 59667 27536 -117127 -19283 -150385 -79224 -244243 208851 -152813 7018 -96637
9898a60682A5877c8496A09925a41337N2951A23030b21821h2614A48436b2548j80620
9887b03168A94090d749j50751k0420A17723J16638j10102e3798A53252c2371l14172
9876c46543B4156M6383b64163A60317E5416e01618A00494a87353a844j28221C7372
9864i0646B28925B9674O7235d65468a36653A69789c3769P248j73055A6846J06189
9853A23035k1979a68436A42829a03926n1364M341B73412I3233d26795C8098A7567
9841A02517b47980B9583j2931b20160E4242k5797J08083i3120C802g5648B5570
9829B2186a34823J8058A105a03750A04065b16914P4433b1451n1731o8633m2180
9818a83995C87a3221o1473B6623c32043D2320H292c80660a38238M9462j9571H8973
$$ plain form
9898 -160682 15877 -38496 109925 -141337 -88386 123030 -221821 -82614 148436 -22548 -203168
9887 -203168 194090 -4749 -155500 -175920 117723 234361 124259 -53798 153252 -32371 -346543
9876 -346543 24156 70539 -264163 160317 55416 -501618 100494 -187353 -1844 -130065 37372
9864 -90646 228925 29674 96909 -465468 -136653 169789 -33769 -26521 -199576 16846 123035
9853 123035 101056 -168436 142829 -103926 -155290 -150949 273412 93233 -426795 38098 17567
9841 102517 -247980 29583 16652 -220160 54242 28445 136528 -93120 3802 -75648 25570
9829 22186 -134823 -116765 1105 -103750 104065 -216914 -142481 -21451 -73182 -141815 -183995
9818 -183995 387 -13221 -74694 26623 -332043 42320 8292 -380660 -138238 -88776 -108347 88973
9805g1640j64405B60078a30136H3576b94594D0589b62198B00374p5387a87235
9794B0152i119k80461A66018L8666Q4002a47103A70766i5217k1432A0421c24639
9782c43768c8510j26623F0550M2304c09090J8711C2104J72051b35111p5336O6206
9771b44241A518c14065c5368k78932J33465b2424G929N6010r208a63730O1154
9760a02576m9194G0134a03097K4093F1458r493a45122A57619c2187j51155P7333
9749a06009C5504J36813h8296m4367l7883L9300c4308A04405a52694p137g4134
9737B45629h3793q0025O3134F1404J38937a40793B55094D3537a44129m8827P8911
9726a14045D232M2998J64891a38168H0236a43842N2158D9364c36131e243p6335
$$ plain form
9805 -71640 -236045 260078 -130136 83576 -294594 40589 -262198 200374 124987 -187235
9794 20152 -9119 -289580 166018 204684 288686 -147103 170766 -95217 -116649 10421 -324639
9782 -343768 -38510 -165133 60550 102854 -309090 -290379 32104 204155 -235111 -310447 -244241
9771 -244241 1518 -314065 -35368 -314300 -180835 -22424 7929 63939 54731 -163730 -102576
9760 -102576 -151770 70134 -103097 -79004 61458 51965 -145122 157619 -32187 -183342 -106009
9749 -106009 35504 172317 -88296 -132663 -170546 -131246 -34308 104405 -152694 -159831 -74134
9737 245629 -83793 -163818 -100684 61404 200341 -140793 255094 43537 -144129 -192956 -114045
9726 -114045 4232 47230 212121 -138168 80236 -143842 -91684 49364 -336131 -5243 -81578
9715h1578H9508a45395I4622f8901I0306a09398B88589c1333A5394P3798c81F8900
9702a21290o4464a2971k16976P7281k5973a5836A6511b63574j17152B3146d5667
9690a83067j85163A95096c9524j49297l4881A71280d24101a77605A81240c4288
9679a99046j78557J40325k696i0277D33421i4224K4195o7969A50608a05850c623
9667f1829n2959B9787K9800c4042l59252A00885M7966a17776l1095l3844e5046
9655d3280p3942q8445d2618l439B01552d5120j62174D8856g9406k3004k61203
9644c63613A88984b33343i7547C36895b71319R5181A03153b10220b6555C4583
9633h0131A45873b03600M106Q4233r1053F624J0187e2389O052l3898B624a18506
$$ plain form
9715 -81578 89508 -145395 94622 -68901 90306 -109398 288589 -31333 15394 89192 -381 68900
9702 -121290 -185754 -12971 -229947 -152666 -178639 -15836 16511 -263574 -380726 23146 -45667
9690 -183067 -368230 195096 -39524 -188821 -223702 171280 -424101 -177605 181240 -34288
9679 -199046 -377603 -237278 -239974 -90277 433421 -94224 -70029 -137998 150608 -105850 -3623
9667 -61829 -114788 29787 59587 -34042 -393294 100885 148851 -117776 -148871 -182715 -55046
9655 -43280 -117222 -205667 -42618 -46057 201552 -45120 -207294 48856 -79406 -102410 -363613
9644 -363613 188984 -233343 -97547 336895 -271319 -176138 103153 -210220 -26555 34583
9633 -80131 145873 -203600 -199494 -115261 -206314 6624 16811 -52389 -46337 -80235 2624 -118506
9620A73858Q2069c28695a53532f5477M82l39243J26836J12994A5134a33582F4431
9608B3676K10727e4325k27005i2256D3799h2785k08223A73548b09295k2681i5648
9596G3151R6592a23095k01739C48380a55743l0701O6474j82244A96716D1819e8581
9584a68036o1928k9080J7049J9745N9519j17449e4111n7810C38106b7374B38289
9572a40734C0086b49398n7837a635k17865A11647g3286B08446D1021i7006C70771
9560a69320A90130e7406B249J08851n5368c4227C8273b9765B88621f4270j3485
9549g7755n8629c5042B57966b18198o0034a63j06113E6560b48886A7942c0596
9537A61306b05543L6265F8924J26268k8857A5773e1307J4996B1546b75428e7518
$$ plain form
9620 173858 255927 -328695 -153532 -65477 -64995 -404238 -277402 -164408 15134 -133582 64431
9608 23676 234403 -54325 -281330 -92256 43799 -82785 -291008 173548 -209295 -231976 -95648
9596 73151 169743 -123095 -324834 348380 -155743 -186444 -119970 -302214 196716 41819 -58581
9584 -168036 -229964 -259044 -241995 -222250 -162731 -280180 -54111 -111921 338106 -27374 238289
9572 -140734 30086 -249398 -307235 -1635 -219500 111647 -73286 208446 41021 -97006 370771
9560 -169320 190130 -57406 2249 111100 55732 -34227 38273 -29765 288621 -64270 -77755
9549 -77755 -136384 -35042 257966 -218198 -278232 -163 -106276 56560 -248886 17942 -30596
9537 161306 -205543 -169278 68924 195192 166335 15773 -51307 -36311 21546 -275428 -57518
9525A98256H8231J9281J43977f7339b6999m7194A10297D2266a97209P5721e9054
9513B20856b4036A61508B0096c52554A68641n3586c16949a38081A21460b03610
9502A0408a39002A28113b4229F5102b61905E9402d00534H2055a45934d5534j45640
9491a91174A04273l6793J30721b72593a11857a226n9566b8271k0116j07105b6436
9479a45633E3715d03537d2131H6992C8489K20561C1346a4021k08563B51555c4043
9467d25091B05827b7629l02536a53751C8776a2041C09379e6917j6399A7014J84037
9456B01051e34522K23657a29890I9231a29081P370A04583J5774F337a15562A2523
9444i0059k61041A34025a4832r0618L4748A4785K13763m5627c0484l06953i3927
$$ plain form
9525 198256 88231 107512 251489 -67339 -26999 -74193 110297 42266 -197209 -121488 -59054
9513 220856 -24036 161508 20096 -352554 168641 115055 -316949 -138081 121460 -203610
9502 10408 -139002 128113 -24229 65102 -261905 59402 -400534 82055 -145934 -45534 -191174
9491 -191174 104273 67480 198201 -272593 -111857 -1226 -60792 -28271 -48387 -155492 -26436
9479 -145633 53715 -403537 -42131 86992 38489 259050 31346 -14021 -222584 251555 -34043
9467 -425091 205827 -27629 -330165 -153751 38776 -12041 309379 -56917 -73316 17014 201051
9456 201051 -534522 -310865 -129890 99231 -129081 -121711 104583 120357 6337 -115562 12523
9444 -90059 -351100 134025 -14832 -105450 -70702 14785 228548 182921 -30484 -337437 -93927
9432B2950K9135c13356G973i8505A78059o0540b01598A0972J3309g1653k34906
9421c06559J38303F1237a61923C5941i05k82327h3258F4623d7141D9124A3285
9409f3739q3979r268j37917C2086a35193J4506D7820a83924n4924a5874m60137
9398d76011C0792f5970D8495J17047d43871E1735a57027A55457c2111k26270b1241
9386g3425j7918j41636g3918n0096e6757n196j15530l9482J07864B11654A9605
9374A43788a22888K0515l7257A29829a30418I8740c21113A10123b28568C184M4925
9363D8109a5865j53961O8928n5888b8086p8816A18488L8838l460B7637P8029R6251
9351B01917b9276F7796e7814J4110A15212b65702l9218k00299B733J95631i0079
$$ plain form
9432 22950 52085 -313356 7973 -98505 178059 117519 -201598 10972 24281 -71653 -306559
9421 -306559 -168256 61237 -161923 35941 -905 -283232 -83258 64623 -47141 49124 13285
9409 -63739 -147718 -156986 -294903 32086 -135193 -120687 47820 -183924 -238848 -15874 -476011
9398 -476011 30792 -65970 48495 165542 -443871 51735 -157027 155457 -32111 -258381 -21241
9386 -73425 -91343 -232979 -73918 -124014 -56757 -61953 -177483 -216965 -109101 211654 19605
9374 143788 -122888 -102373 -139630 129829 -130418 98740 -321113 110123 -228568 3184 48109
9363 48109 -15865 -169826 -100898 -156786 -28086 -106902 118488 157326 153866 27637 105666 201917
9351 201917 -29276 67796 -57814 -43704 115212 -265702 -304920 -505219 2733 198364 -90079
9339E8633a93707a7478E7872C919a3520j10946j32409E7278c12314h5419o3612
9328a49031k8911D8714c35523c5943C6465A4943c5494n7372k70436i9924k09711
9317c09635J54229E1759b21176A57641f6659j24352B02052a59213m1408A0322
9306c44322B06005c69036A32918Q990E3335e8343B06926E7760a11925F0282e9388
9294e8327j9591m37475e5590k21375F9308b96649J0653C21853c65704b6846n8681
9283h5527K6752j1370B25278j83c10154B43294a98038h0437e634B0454f6623j40950
9271b07573j00847A25791b10584k03875J90239A86558c57200A13419h3691D9490
9260a71576j1722B20546h194k41292h5291j15996A61105o0394m7596f9920j7476
$$ plain form
9339 58633 -193707 -17478 57872 3919 -13520 -124466 -256875 57278 -312314 -85419 -149031
9328 -149031 -177942 48714 -335523 -35943 36465 14943 -35494 -92866 -363302 -99924 -309635
9317 -309635 -155406 51759 -221176 157641 -66659 -191011 202052 -159213 -200621 10322
9306 -344322 206005 -369036 132918 141908 53335 -58343 206926 57760 -111925 60282 -59388
9294 -58327 -77918 -515393 -55590 -276965 69308 -296649 -285996 321853 -365704 -26846 -85527
9283 -85527 -58775 -70145 225278 225095 -310154 243294 -198038 -80437 -5634 20454 -66623 -207573
9271 -207573 -308420 125791 -210584 -414459 -224220 186558 -357200 113419 -83691 49490
9260 -171576 -183298 220546 -8194 -249486 -85291 -201287 161105 100711 53115 -69920 -87396
9249h7396j29823P2622H800R2028b00242A23027a17031j14919F3626b18515R491
9238b09024e4479k71526i0055G4713d81607b8200F4769O39Q5097D2346L7839a74898
9225F4382L3865c69596F8047g7250A35338o3172K8042a20208p5209E0529d8064
9213G7368b35892L8031P3691l2881A41121i505j68210A4543a38075I2493D3539
9201b30747g7426J0535H1191a9671D9808L2024b97653e7754j22895i280r0316
9190i9596n5519B20280b6148p3441q6296A01480c94527A07653c2740m4182H1578
9178A11810D7926e5393r0740l3052G1472A6523K21329D0458a52009O8616b7323
9166b19590G816R0456j534a58116k31279J81537A19656O246n0133a01993I5881
$$ plain form
9249 -87396 -217219 -144597 8800 100828 -200242 123027 -117031 -231950 63626 -218515 -209024
9238 -209024 -54479 -326005 -90055 74713 -481607 -28200 64769 65408 150505 42346 80185 -174898
9225 64382 98247 -369596 68047 -77250 135338 72166 100208 -120208 -195417 50529 -48064
9213 77368 -235892 -197861 -124170 -157051 141121 -9505 -177715 14543 -138075 92493 43539
9201 -230747 -77426 -66891 81191 -19671 49808 81832 -297653 -57754 -180649 -9280 -99596
9190 -99596 -155115 220280 -26148 -99589 -185885 101480 -394527 107653 -32740 -76922 81578
9178 111810 47926 -55393 -146133 -179185 71472 16523 237852 40458 -152009 -83393 -27323
9166 -219590 7816 98272 96738 -158116 -389395 -207858 119656 125902 75769 -101993 95881
9154a0010B56014a02740i649j39154A05201a83753B85332f167k08834d8013o2093
9143a10106G5541a2566E4030a26228M6379b9410p9781B49897d369E7895a08291
9131A03789d7646l09007Q2805G3921a0414m4519l96487J77644l2309c6289C03135
9119A55682b675j59687j44871b9045k38983I1709L0873i9658A63226a81609h5532
9107b6355r0349j01100f1130a772j6211p3702B70504b34854f977m22666B53447
9095e07609H5752b5000j98852i3260k6799o7147e0312n4522k226A12251D3930
9083E822a21471j92077i4130k64341J45151f6281b9843l9848j85090A70809d0138
9071c63118C5615b70713a32788G293P4515a77809A17619J19226j12276e7859j93885
$$ plain form
9154 -10010 256014 -102740 -9649 -148803 105201 -183753 285332 -6167 -215001 -48013 -110106
9143 -110106 75541 -12566 54030 -126228 -79849 -29410 -109191 249897 -4369 57895 -108291
9131 103789 -47646 -356653 -273848 73921 -10414 -54933 -451420 -273776 -306085 -36289 303135
9119 155682 -2675 -162362 -307233 -29045 -268028 91709 122582 -99658 163226 -181609 -85532
9107 -26355 -116704 -217804 -61130 -1772 -17983 -91685 270504 -234854 -6977 -429643 253447
9095 -507609 85752 -25000 -223852 -93260 -120059 -187206 -50312 -104834 -107060 112251 43930
9083 5822 -121471 -313548 -94130 -358471 -213320 -66281 -29843 -69691 -254781 170809 -40138
9071 -363118 35615 -270713 -132788 7293 81808 -177809 117619 236845 124569 -57859 -251744
9060b51744g4242A34819b15485c0259B03499R5371b02874k9790m0016b1179B71245
9048b6977k61278B32894b51417c5536j7537C477b25986B12640c19073A10891C0003
9036A11696k9933K44067b97255A23051a30841B3607L37342a13172k5170r846j90778
9025c38966M2653a35067J8286j48474A43155Q1052g2685a8578l12678I7876b53542
9013b5502l45035D782J79903h136j37912c6308k184G7873a01562j9739k82938
9002d04239A16468D9062j3834a53774L5241r9318J08364E2150j7570J38753g7510
8990A51048M6722b72548r0307J79478A8485a7997o8831o9592d7998j12847b4002
8978b05427r0813a18360j8214k0407k84650a9009p6619E4024O0629i4839A64791
$$ plain form
9060 -251744 -74242 134819 -215485 -30259 203499 298870 -202874 -232664 -272680 -21179 271245
9048 -26977 -288255 232894 -251417 -35536 -53073 3477 -225986 212640 -319073 110891 30003
9036 111696 81763 325830 -297255 123051 -130841 23607 360949 -113172 -138342 -148188 -338966
9025 -338966 -296313 -135067 -116781 -265255 143155 224207 -72685 -18578 -331256 97876 -253542
9013 -25502 -370537 4782 184685 -8136 -146048 -36308 -38492 77873 -101562 -121301 -404239
9002 -404239 116468 49062 35228 -153774 -118533 -217851 -109487 52150 34580 173333 -77510
8990 151048 197770 -272548 -362855 -183377 18485 -17997 -86828 -156420 -47998 -160845 -24002
8978 -205427 -296240 -118360 -136574 -156981 -441631 -19009 -95628 54024 114653 -94839 164791
8966C282O7892J41041r9223c5475l17092g0971j09598A22745e9006J0187E7755
8954f5297k87727A26342m3010j1460e8813C19149j41456c12900A78407a30686
8943A06000d87p7326j20555P6917j03241j8183B05520F0845Q6064O5830b4216
8931A0910f7850B06793a0846A99335K7500j0145J061884P50940L170323N198732
8921A0398569l547407l146764A625149G68056C24310A38083a2942B58623A24086
8911E4605J34069E0780R3662L16519g1314A12260p428I967b74882A46574A7445
8899a00892j23999A57635D2003a23007p1245a0724q7533G0476a74732j41794e8975
8887A29284b22163R3431r2353d2144q7003r8087C00214q8949a7824A7427d51031
$$ plain form
8966 3282 71174 212215 112992 -35475 -352567 -70971 -180569 122745 -59006 -48819 57755
8954 -65297 -353024 126342 83332 71872 -58813 319149 177693 -312900 178407 -130686
8943 106000 -487 -77813 -198368 -121451 -224692 -242875 205520 60845 146909 212739 -24216
8931 10910 -67850 206793 -10846 199335 226835 216690 1278574 2029514 5199837 10398569
8921 10398569 6851162 3704398 1625149 768056 324310 138083 -12942 258623 124086
8911 54605 188674 50780 144442 460961 -71314 112260 104832 9967 -274882 146574 17445
8899 -100892 -224891 157635 42003 -123007 -194252 -10724 -98257 70476 -174732 -316526 -58975
8887 129284 -222163 -128732 -221085 -42144 -129147 -227234 300214 211265 -17824 17427 -451031
8875D2841G355a54007j9489f1492q0072I8317b51246H5519d3732j25470P392l7519
8863a99329E5235f3608l8434a9390j1749k00972f8270N03A09692g8991G2520M3457
8851A15977b15833L0775j8223e6266D2064b1585A02350h4555j2564B86595g8018
$$ plain form
8875 42841 7355 -154007 -173496 -61492 -141564 98317 -251246 85519 -43732 -169202 -161810 -199329
8863 -199329 55235 -63608 -102042 -19390 -31139 -232111 -68270 -67767 109692 -78991 72520 115977
8851 115977 -215833 -185058 -203281 -56266 42064 -21585 102350 -84555 -97119 286595 -78018
$$ [...]
##END NTUPLES=NMR SPECTRUM
##END=
