##TITLE=AC1763_NAR_15_9683463_AxI8vZsGHg
##JCAMPDX= 6.0         $$ Bruker NMR JCAMP-DX V2.0
##DATA TYPE= NMR SPECTRUM
##DATA CLASS= NTUPLES
##ORIGIN= BRUKER
##OWNER= Administrator
$$ 1.72 TOPSPIN		Version 2.1
$$ 2016-05-01 18:04:42.396 -0700  Administrator@X
$$ Compression mode = diff/dup
##.OBSERVE FREQUENCY= 400.02188249412
##.OBSERVE NUCLEUS= ^1H
##.ACQUISITION MODE= SIMULTANEOUS (DQD)
##.ACQUISITION SCHEME= undefined
##.AVERAGES= 64
##.DIGITISER RES= 22
##SPECTROMETER/DATA SYSTEM= spect
##.PULSE SEQUENCE= noesygpps1d.comp
##.SOLVENT NAME= COFFEE_meoh
##.SHIFT REFERENCE= INTERNAL, COFFEE_meoh, 1, 14.96061
##AUDIT TRAIL= $$ (NUMBER, WHEN, WHO, WHERE, PROCESS, VERSION, WHAT)
$$ ##TITLE= Audit trail, TOPSPIN		Version 2.1
$$ ##JCAMPDX= 5.01
$$ ##ORIGIN= Bruker BioSpin GmbH
$$ ##OWNER= Administrator
$$ $$ E:\/data/COFFEE/nmr/AC1763_NAR_15_9683463_AxI8vZsGHg/22/pdata/1/auditp.txt
$$ ##AUDIT TRAIL=  $$ (NUMBER, WHEN, WHO, WHERE, PROCESS, VERSION, WHAT)
(   1,<2016-05-01 18:04:37.130 -0700>,<Administrator>,<X>,<go>,<TOPSPIN 2.1>,
      <created by zg
	started at 2016-05-01 17:53:07.646 -0700,
	POWCHK enabled, PULCHK disabled,
       configuration hash MD5:
       21 0F 79 D6 B3 7B B4 F6 88 20 88 DB 03 48 BD 9F
       data hash MD5: 64K
       B3 08 FC 07 58 B7 76 C0 7A 74 E0 AD FA 92 43 E5>)
(   2,<2016-05-01 18:04:40.396 -0700>,<Administrator>,<X>,<proc1d>,<TOPSPIN 2.1>,
      <Start of raw data processing
       efp LB = 0.3 FT_mod = 6 PKNL = 1 PHC0 = 0 PHC1 = 0 SI = 128K 
       data hash MD5: 128K
       58 3F 97 80 60 EA 4B 7E 8F 2C 6D F9 AC 87 65 0D>)
(   3,<2016-05-01 18:04:41.255 -0700>,<Administrator>,<X>,<proc1d>,<TOPSPIN 2.1>,
      <pk PHC0 = -81.09558 PHC1 = 0 
       data hash MD5: 128K
       00 88 70 E8 10 80 EF B3 B0 B5 33 C4 84 88 32 39>)
(   4,<2016-05-01 18:04:41.630 -0700>,<Administrator>,<X>,<proc1d>,<TOPSPIN 2.1>,
      <abs ABSG = 1 
       data hash MD5: 128K
       49 F0 02 04 7D 8A E2 4A 65 84 ED DE DC 7C 8C 54>)
(   5,<2016-05-01 18:04:41.724 -0700>,<Administrator>,<X>,<proc1d>,<TOPSPIN 2.1>,
      <abs ABSG = 2 
       data hash MD5: 128K
       F8 78 CF B7 D2 B1 83 8B 1B 06 AB C8 5F AB 31 E0>)
(   6,<2016-05-01 18:04:41.802 -0700>,<Administrator>,<X>,<proc1d>,<TOPSPIN 2.1>,
      <abs ABSG = 3 
       data hash MD5: 128K
       FA 14 9E 32 A3 43 72 03 19 11 79 49 7B 25 CB 62>)
(   7,<2016-05-01 18:04:41.896 -0700>,<Administrator>,<X>,<proc1d>,<TOPSPIN 2.1>,
      <abs ABSG = 4 
       data hash MD5: 128K
       54 BF AE D4 FD 6E 34 A5 7F 2E 71 CD 46 93 18 B9>)
(   8,<2016-05-01 18:04:41.974 -0700>,<Administrator>,<X>,<proc1d>,<TOPSPIN 2.1>,
      <abs ABSG = 5 
       data hash MD5: 128K
       B1 2F F4 7A DC FF AF E2 E4 F7 6A 53 69 64 DE 2C>)
$$ ##END=
$$ 
$$ $$ hash MD5
$$ $$ D7 DB F8 42 07 17 78 24 AB EB D8 4E CA 3D 62 70
##$RELAX= 
##$RELAX= 
##$RELAX= 
##$RELAX= 
##$RELAX= 
##$RELAX= 
##$RELAX= 
##$RELAX= 
$$ Bruker specific parameters
$$ --------------------------
##$DU= <E:\>
##$EXPNO= 22
$$ [...]
##$TP07= 0
##$TPNAME0= <>
##$TPNAME1= <>
##$TPNAME2= <>
##$TPNAME3= <>
##$TPNAME4= <>
##$TPNAME5= <>
##$TPNAME6= <>
##$TPNAME7= <>
##$TPOAL= (0..7)
0.5 0.5 0.5 0.5 0.5 0.5 0.5 0.5
##$TPOFFS= (0..7)
0 0 0 0 0 0 0 0
##$TUNHIN= 0
##$TUNHOUT= 0
##$TUNXOUT= 0
##$USERA1= <user>
##$USERA2= <user>
##$USERA3= <user>
##$USERA4= <user>
##$USERA5= <user>
##$V9= 5
##$VALIST= <valist>
##$VCLIST= <CCCCCCCCCCCCCCC>
##$VD= 0
##$VDLIST= <DDDDDDDDDDDDDDD>
##$VPLIST= <PPPPPPPPPPPPPPP>
##$VTLIST= <TTTTTTTTTTTTTTT>
##$WBST= 2048
##$WBSW= 25
##$XGAIN= (0..3)
0 0 0 0
##$XL= 0
##$YL= 0
##$YMAX_a= 7116104
##$YMIN_a= -8818453
##$ZGOPTNS= <>
##$ZL1= 120
##$ZL2= 120
##$ZL3= 120
##$ZL4= 120
##$ABSF1= 14.96061
##$ABSF2= -5.597571
##$ABSG= 5
##$ABSL= 3
##$ALPHA= 0
##$AQORDER= 0
##$ASSFAC= 0
##$ASSFACI= 0
##$ASSFACX= 0
##$ASSWID= 0
##$AUNMP= <proc_prof1d_extract.lims>
##$AXLEFT= 0
##$AXNAME= <>
##$AXNUC= <1H>
##$AXRIGHT= 0
##$AXTYPE= 0
##$AXUNIT= <>
##$AZFE= 0.1
##$AZFW= 0.1
##$BCFW= 0
##$BC_mod= 0
##$BYTORDP= 0
##$COROFFS= 0
##$CY= 15
##$DATMOD= 1
##$DC= 0
##$DFILT= <>
##$DTYPP= 0
##$F1P= 0
##$F2P= 0
##$FCOR= 0.5
##$FTSIZE= 131072
##$FT_mod= 6
##$GAMMA= 0
##$GB= 0
##$INTBC= 1
##$INTSCL= 1
##$ISEN= 128
##$LB= 0.3
##$LEV0= 0
##$LPBIN= 0
##$MAXI= 10000
##$MC2= 0
##$MEAN= 0
##$ME_mod= 0
##$MI= 0
##$NCOEF= 0
##$NC_proc= -3
##$NLEV= 6
##$NOISF1= 0
##$NOISF2= 0
##$NSP= 0
##$NTH_PI= 0
##$NZP= 0
##$OFFSET= 14.96061
##$PC= 1
##$PHC0= -81.09558
##$PHC1= 0
##$PH_mod= 1
##$PKNL= yes
##$PPARMOD= 0
##$PPDIAG= 0
##$PPIPTYP= 0
##$PPMPNUM= 2147483647
##$PPRESOL= 1
##$PSCAL= 4
##$PSIGN= 0
##$PYNMP= <proc.py>
##$REVERSE= no
##$SF= 400.020009793098
##$SI= 131072
##$SIGF1= 0
##$SIGF2= 0
##$SINO= 400
##$SIOLD= 131072
##$SPECTYP= <>
##$SREGLST= <1H.CDCl3>
##$SSB= 0
##$STSI= 131072
##$STSR= 0
##$SW_p= 8223.68421052631
##$SYMM= 0
##$S_DEV= 0
##$TDeff= 65536
##$TDoff= 0
##$TI= <>
##$TILT= no
##$TM1= 0
##$TM2= 0
##$TOPLEV= 0
##$USERP1= <user>
##$USERP2= <user>
##$USERP3= <user>
##$USERP4= <user>
##$USERP5= <user>
##$WDW= 1
##$XDIM= 131072
##$YMAX_p= 483481031
##$YMIN_p= -448157481
##$CURPLOT= <Network HP LaserJet P1505>
##$CURPRIN= <$Network HP LaserJet P1505>
##$DFORMAT= <normdp>
##$LAYOUT= <+/1D_H.xwp>
##$LFORMAT= <normlp>
##$PFORMAT= <normpl>
##$SURQMSG= 1
$$ End of Bruker specific parameters
$$ ---------------------------------
##NTUPLES= NMR SPECTRUM
##VAR_NAME=  FREQUENCY,     SPECTRUM/REAL,   SPECTRUM/IMAG
##SYMBOL=    X,             R,               I
##VAR_TYPE=  INDEPENDENT,   DEPENDENT,       DEPENDENT
##VAR_FORM=  AFFN,          ASDF,            ASDF
##VAR_DIM=   131072,        131072,          131072
##UNITS=     HZ,            ARBITRARY UNITS, ARBITRARY UNITS
##FACTOR=    0.0627417313425164, 1,          1
##FIRST=     8223.62146879497, 2954,         -101403
##LAST=      0,             5523,            -103369
##MIN=       0,             -448157481,      0
##MAX=       8223.62146879497, 483481031,    0
$$ Real data points
##PAGE= N=1
##DATA TABLE= (X++(R..R)), XYDATA
$$ [...]
63595A434093p952r845j0557j2779j7451k2706k6516k8985l1175l2995l3730l3802
$$ 1434093 1426141 1416296 1405739 1392960 1375509 1352803 1326287 1297302 1266127 1233132 1199402 1165600
63583A165600l4325l5219l5313l4273l2879l1251k8392k3981j9163j4918j0956
$$ 1165600 1131275 1096056 1060743 1026470 993591 962340 933948 909967 890804 875886 864930
63572H64930p093m279l056k058M58M192P293Q894R762J0664J1535J2447J4051
$$ 864930 857837 853558 850502 848444 848902 853094 860387 869281 879043 889707 901242 913689 927740
63559I27740J6603J9487K2173K4852K7705L0327L2380L4286L6699L9744M3144
$$ 927740 944343 963830 986003 1010855 1038560 1068887 1101267 1135553 1172252 1211996 1255140
63548A255140M6533M9166M9816M7728M3526L8514L3231K7313K0716J4211Q383
$$ 1255140 1301673 1350839 1400655 1448383 1491909 1530423 1563654 1590967 1611683 1625894 1634277
63537A634277K806l104q776j2899j5220j7202k0378k4527k8139l0426l2158l4509
$$ 1634277 1637083 1633979 1625203 1612304 1597084 1579882 1559504 1534977 1506838 1476412 1444254 1409745
63525A409745l7803m1600m5271m8065m9254m8881m7889m6883m5201m2025l8134
$$ 1409745 1371942 1330342 1285071 1237006 1187752 1138871 1090982 1044099 998898 956873 918739
63514I18739l5365l4141l2655k9172k4410k0696j9033j7978j5635j2060r120q152
$$ 918739 883374 849233 816578 787406 762996 742300 723267 705289 689654 677594 668474 660322
63502F60322q447q267o905n159l920l060k062j190j250k293l149k547m35J929
$$ 660322 651875 643608 636703 631544 627624 624564 622502 621312 620062 617769 614620 612073 611638 613567
63488F13567L072K543J246N32R06J736K212K275K320K428K325J882J168J90r00
$$ 613567 616639 619182 620428 620960 621866 623602 625814 628089 630409 632837 635162 637044 638212 638402 637502
63473F37502j550j323o38m12j025k003k728k965k841k744l091l707l679k470q68
$$ 637502 635952 634629 633991 633579 632554 630551 627823 624858 622017 619273 616182 612475 608796 606326 605458
63458F05458J8M02J393L130M591N332O030O983P534P588Q317J0339J2471J3451
$$ 605458 605476 605878 607271 610401 614992 620324 626354 633337 640871 648459 656776 667115 679586 693037
63444F93037J3920J5380J7954K0602K2931K5326K7563K8844K9209K9654L0645
$$ 693037 706957 722337 740291 760893 783824 809150 836713 865557 894766 924420 955065
63433I55065L1603L2070L2414L3092L3976L4714L5102L4980L4322L3530L3168
$$ 955065 986668 1018738 1051152 1084244 1118220 1152934 1188036 1223016 1257338 1290868 1324036
63422A324036L3531L4902L7779M2082M6445M9188M9760M8388M4902L9291L2909
$$ 1324036 1357567 1392469 1430248 1472330 1518775 1567963 1617723 1666111 1711013 1750304 1783213
63411A783213K7363K2190J5597P761J269k577n752j0412j5651j9312k1667k4953
$$ 1783213 1810576 1832766 1848363 1856124 1857393 1854816 1849064 1838652 1823001 1803689 1782022 1757069
63399A757069k9780l4402l7590m0269m3663m7387n0229n1784n2460n2463n1486
$$ 1757069 1727289 1692887 1655297 1615028 1571365 1523978 1473749 1421965 1369505 1317042 1265556
63388A265556m9158m5512m1219l7324l4304l1402k7380k1950j5936j0184n031
$$ 1265556 1216398 1170886 1129667 1092343 1058039 1026637 999257 977307 961371 951187 946156
63377I46156p31K563N485R115J3486J7250J9376K0535K2090K4397K6846K9168
$$ 946156 945425 947988 953473 962588 976074 993324 1012700 1033235 1055325 1079722 1106568 1135736
63365A135736L1599L3995L5769L6899L8139L9884M1509M2334M2777M3874M5774
$$ 1135736 1167335 1201330 1237099 1273998 1312137 1352021 1393530 1435864 1478641 1522515 1568289
63354A568289M7145M6135M1816L4878K7185K0406J4666Q716J741n192j0186j2931
$$ 1568289 1615434 1661569 1703385 1738263 1765448 1785854 1800520 1809236 1810977 1805785 1795599 1782668
63342A782668j5204j8634k2840k6472k9335l2369l5920l9317m2315m5577m9186
$$ 1782668 1767464 1748830 1725990 1699518 1670183 1637814 1601894 1562577 1520262 1474685 1425499
63331A425499n1652n1376m8501m4519m0424l6095l1352k6724k3041k0739j9672
$$ 1425499 1373847 1322471 1273970 1229451 1189027 1152932 1121580 1094856 1071815 1051076 1031404
63320A031404j9258j8793j7985j7094j6441j6041j6010j6830j8576k0231k0584
$$ 1031404 1012146 993353 975368 958274 941833 925792 909782 892952 874376 854145 833561
63309H33561j9619j8126j6115j2828q536n076l793l868l567k476j476r83n24p4
$$ 833561 813942 795816 779701 766873 758337 753261 749468 745600 742033 739557 738081 737098 736574 736500
63295G36500o27k860n924q171q768q244p672p701q180q453q035p119o357o042
$$ 736500 735873 733013 727089 718918 710150 701906 694234 686533 678353 669900 661865 654746 648389 642347
63281F42347n788n142m238l537l082k508j749j236j164r27K24K047L288L030J839
$$ 642347 636559 631417 627179 623642 620560 618052 616303 615067 613903 612976 613200 615247 618535 621565 623404
63266F23404J277K306M338N926O182N457M849N231O635Q298R360R738J0293J1846
$$ 623404 624681 626987 631325 637251 643433 648890 653739 658970 665605 673903 683263 693001 703294 715140
63252G15140J4072J5804J6549J7116J8446K0375K2213K4059K6598K9796L2813
$$ 715140 729212 745016 761565 778681 797127 817502 839715 863774 890372 920168 952981
63241I52981L5411L8330M1906M5345M7970N0202N2470N4158N4794N5504N7707
$$ 952981 988392 1026722 1068628 1113973 1161943 1212145 1264615 1318773 1373567 1429071 1486778
63230A486778O0778O2598O2512O2150O2976O4468O5354O5262O4432O2977O1327
$$ 1486778 1547556 1610154 1672666 1734816 1797792 1862260 1927614 1992876 2057308 2120285 2181612
63219B181612O0302N9715N7946N3929M8605M3076L6396K6905J5170L615o681j6888
$$ 2181612 2241914 2301629 2359575 2413504 2462109 2505185 2541581 2568486 2583656 2587271 2580590 2563702
63207B563702k7892l8737m8145n5989o2277o6173o7240o6655o5935o5061o3007
$$ 2563702 2535810 2497073 2448928 2392939 2330662 2264489 2197249 2130594 2064659 1999598 1936591
63196A936591n9528n5284n0541m5012l8908l2997k7555k2130j6529j1254o718
$$ 1936591 1877063 1821779 1771238 1726226 1687318 1654321 1626766 1604636 1588107 1576853 1570135
63185A570135k712J073M623P954J1322J4720J7605J9490K0504K1040K1164K0740
$$ 1570135 1567423 1568496 1573119 1581073 1592395 1607115 1624720 1644210 1664714 1685754 1706918 1727658
63173A727658J9869J8794J7466J5584J3118J0520Q287O260L438j334q152j5649
$$ 1727658 1747527 1766321 1783787 1799371 1812489 1823009 1831296 1837556 1840994 1839660 1831508 1815859
63161A815859k2203k7601l2863l8299m2512m4101m3704m3276m3495m3084m1006
$$ 1815859 1793656 1766055 1733192 1694893 1652381 1608280 1564576 1521300 1477805 1434721 1393715
63150A393715l8147l6022l4672l2813k9732k5996k2431j9316j6656j4422j2259
$$ 1393715 1355568 1319546 1284874 1252061 1222329 1196333 1173902 1154586 1137930 1123508 1111249
63139A111249r653o695m146k451j168L15K030L701N160O183O488O468P287R531
$$ 1111249 1101596 1094901 1090755 1088304 1087136 1087451 1089481 1093182 1098342 1104525 1111013 1117481 1124768 1134299
63125A134299J2147J3556J3515J3030J2653J1880J0407Q956Q296Q060P166N136
$$ 1134299 1146446 1160002 1173517 1186547 1199200 1211080 1221487 1230443 1238739 1246799 1253965 1259101
63113A259101K452q6j985l071l296k753j817j075r52j283j531j511j627k079k263
$$ 1259101 1261553 1261467 1259482 1256411 1253115 1250362 1248545 1247470 1246518 1245235 1243704 1242193 1240566 1238487 1236224
63098A236224j547l73J96r4m81n04n15o43k32J050K337K686K467K816M110N900
$$ 1236224 1234677 1234304 1234500 1234406 1233925 1233421 1232906 1232263 1232031 1233081 1235418 1238104 1240571 1243387 1247497 1253397
63082A253397P986J0499J3004J4667J5461J6239J7400J8485J9410K0969K3369
$$ 1253397 1261383 1271882 1284886 1299553 1315014 1331253 1348653 1367138 1386548 1407517 1430886
63071A430886K5357K5983K6492K9016L3626L8162M1185M3728M7489N2594N8143
$$ 1430886 1456243 1482226 1508718 1537734 1571360 1609522 1650707 1694435 1741924 1794518 1852661
63060A852661O3993P0615P7638Q3967Q9439R5135J01823J09101J16415J23800
$$ 1852661 1916654 1987269 2064907 2148874 2238313 2333448 2435271 2544372 2660787 2784587
63050B784587J30948J36578J39756J41186J42231J43124J43227J42669J42354
$$ 2784587 2915535 3052113 3191869 3333055 3475286 3618410 3761637 3904306 4046660
63041D046660J42435J42046J40820J39330J37572J34309J28793J21868J14078
$$ 4046660 4189095 4331141 4471961 4611291 4748863 4883172 5011965 5133833 5247911
63032E247911J03634Q8102O7890M6186K5061L294k1019m7103p2272r5197j16622
$$ 5247911 5351545 5439647 5507537 5553723 5578784 5582078 5561059 5513956 5441684 5346487 5229865
63021E229865j36857j54233j66841j74640j78768j79494j76045j68347j57854
$$ 5229865 5093008 4938775 4771934 4597294 4418526 4239032 4062987 3894640 3736786
63012C736786j46278j34179j21195j07163r2492p7781o3597n0497l8789k8166
$$ 3736786 3590508 3456329 3335134 3227971 3135479 3057698 2994101 2943604 2904815 2876649
63002B876649j7885p504K621J1593J8601K3380K6247K7908K9137L0443L1827L2809
$$ 2876649 2858764 2851260 2853881 2865474 2884075 2907455 2933702 2961610 2990747 3021190 3053017 3085826
62990C085826L2811L1667K9622K6773K2675J6829R527J814n586j3127k2024l2971
$$ 3085826 3118637 3150304 3179926 3206699 3229374 3246203 3255730 3257544 3251958 3238831 3216807 3183836
62978C183836m5171n6593o5415p1498p6318q1115q5395q7762q7895q6833q5332
$$ 3183836 3138665 3082072 3016657 2945159 2868841 2787726 2702331 2614569 2526674 2439841 2354509
62967B354509q3018p9471p5142p0623o5935o1244n7400n4721n2020m8023m3370
$$ 2354509 2271491 2192020 2116878 2046255 1980320 1919076 1861676 1806955 1754935 1706912 1663542
62956A663542l9936l8377l7605l6574l5272l3841l2078l0234k9140k8905k8460
$$ 1663542 1623606 1585229 1547624 1511050 1475778 1441937 1409859 1379625 1350485 1321580 1293120
62945A293120k7022k5162k3664k2197k0025j7483j5689j5033j4768j4015j2487
$$ 1293120 1266098 1240936 1217272 1195075 1175050 1157567 1141878 1126845 1112077 1098062 1085575
62934A085575j0391q285p047p199q089q251o847m469k307q78J37R27R45l94k559
$$ 1085575 1075184 1066899 1059852 1052653 1044564 1036313 1029466 1024997 1022690 1021812 1021949 1022876 1023821 1023427 1020868
62919A020868l979l605k158j498k804n681q717j0490j0265q520o897o838p982
$$ 1020868 1016889 1013284 1011126 1009628 1006824 1001143 992426 981936 971671 963151 956254 949416 941434
62906I41434q432p055m965m189n251o689o786n298l366k145j761j609j405j568
$$ 941434 933002 925947 920982 916793 911542 904853 898067 892769 889403 887258 885497 883888 882483 880915
62892H80915k352l044k596r10J024K254K521J920P13l50l58P26J894K270J933
$$ 880915 878563 875519 872923 872013 873037 875291 877812 879732 880445 880095 879737 880463 882357 884627 886560
62877H86560J304M73m29q98p88q84j976l633m570m232l381l011k996k125K69K893
$$ 886560 887864 888337 887908 887010 886222 885338 883362 879729 875159 870927 867546 864535 861539 859414 859683 862576
62861H62576L371J047j761k312p16P08R41J224K287K889K139J293J640K211J484
$$ 862576 865947 866994 865233 862921 862205 862913 863854 865078 867365 870254 872393 873686 875326 877537 879021
62846H79021J13j92K94l17k352l997l948k795j517l48N25P79Q23J363J940J444
$$ 879021 879134 878942 879236 878919 876567 872570 868622 865827 864310 863962 864487 865266 866089 867452 869392 870836
62830H70836L93P65K910M618M272L143L177M174M828N300O741Q973J0619J1241
$$ 870836 871229 871994 874904 879522 883794 886937 890114 894288 899116 904416 911157 920130 930749 941990
62816I41990J1632J2142J2360J2494J3388J4813J5272J4158J2963J3536J5921
$$ 941990 953622 965764 978124 990618 1004006 1018819 1034091 1048249 1061212 1074748 1090669
62805A090669J8680K0723K2080K3345K5056K7397L0023L2347L4410L7155M1446
$$ 1090669 1109349 1130072 1152152 1175497 1200553 1227950 1257973 1290320 1324730 1361885 1403331
62794A403331M7114N3413O0041O7062P4090Q0560Q6943R4879J05531J18319J31717
$$ 1403331 1450445 1503858 1563899 1630961 1705051 1785611 1872554 1967433 2072964 2191283 2323000
62783B323000J44763J57259J69014J79863J90209K00502K09863K16126K17624
$$ 2323000 2467763 2625022 2794036 2973899 3164108 3364610 3574473 3790599 4008223
62774D008223K14362K07103J96122J81474J63723J43223J19015Q9664N5491J9239
$$ 4008223 4222585 4429688 4625810 4807284 4971007 5114230 5233245 5322909 5378400 5397639
62764E397639j5893m8481p8913j07757j34498j57749j76364j90219j99922k05868
$$ 5397639 5381746 5333265 5254352 5146595 5012097 4854348 4677984 4487765 4287843 4081975
62754D081975k07963k06456k02522j97443j91320j83242j72807j60984j49332
$$ 4081975 3874012 3667556 3465034 3267591 3076271 2893029 2720222 2559238 2409906
62745B409906j38699j28754j18605j07780r6829q6860p8398p0972o4011n7653
$$ 2409906 2271207 2142453 2023848 1916068 1819239 1732379 1653981 1583009 1518998 1461345
62735A461345n2207m7284m2259l7281l2918k8985k4662j9960j6088j4035j3309
$$ 1461345 1409138 1361854 1319595 1282314 1249396 1220411 1195749 1175789 1159701 1145666 1132357
62724A132357j2458j0348o905l104k31J356K655M708P217R407J1788J5632K0648
$$ 1132357 1119899 1109551 1102646 1099542 1099311 1100667 1103322 1108030 1115247 1124654 1136442 1152074 1172722
62711A172722K4973K7983L1400L6675M2729M7696N1691N6274O2031O8284P4662
$$ 1172722 1197695 1225678 1257078 1293753 1336482 1384178 1435869 1492143 1554174 1622458 1697120
62700A697120Q1256Q7426R2107R5418R8546J01696J03473J02684R9646R5141Q8977
$$ 1697120 1778376 1865802 1957909 2053327 2151873 2253569 2357042 2459726 2559372 2654513 2743490
62689B743490Q0248O8449N3786L6902J8766M64j7236l3860m8809o1518p2210q1801
$$ 2743490 2823738 2892187 2945973 2982875 3001641 3002105 2984869 2951009 2902200 2840682 2768472 2686671
62677B686671r0693r8173j03318j05912j06158j04217j00712r7050r4236r1446
$$ 2686671 2595978 2497805 2394487 2288575 2182417 2078200 1977488 1880438 1786202 1694756
62667A694756q6716p9275p0663o3242n7986n4043n0088m5623m1035l6837l3181
$$ 1694756 1608040 1528765 1458102 1394860 1336874 1282831 1232743 1187120 1146085 1109248 1076067
62656A076067k9862k6592k3324k0476j8768j8443j8628j7899j5674j2844j0753
$$ 1076067 1046205 1019613 996289 975813 957045 938602 919974 902075 886401 873557 862804
62645H62804r864r711r728r576q907p478n608l969k833j989j342j027p93l4J192
$$ 862804 852940 843229 833501 823925 815018 807540 801932 797963 795130 793141 791799 790772 789979 789945 791137
62630G91137J882J359L14q7L04P54R70J424K390L576M870O551Q420R492R262Q760
$$ 791137 793019 794378 794692 794605 794909 795663 796633 798057 800447 804023 808893 815444 823864 833356 842618 851378
62614H51378R566J2028J5131J7962K0546K3234K5987K8648L1406L4577L8190M2186
$$ 851378 860944 872972 888103 906065 926611 949845 975832 1004480 1035886 1070463 1108653 1150839
62602A150839M6731N2095N8218O4710P1204P7618Q4047R0452R6418J01200J04139
$$ 1150839 1197570 1249665 1307883 1372593 1443797 1521415 1605462 1695914 1792332 1893532 1997671
62591A997671J04941J03492R9587R3233Q5029P5584O4581N1029L4744J6995n54
$$ 1997671 2102612 2206104 2305691 2398924 2483953 2559537 2624118 2675147 2709891 2726886 2726332
62580B726332j7125l2705m7299o0697p2552q2229q9099r3344r5904r7101r6089
$$ 2726332 2709207 2676502 2629203 2568506 2495954 2413725 2324626 2231282 2135378 2038277 1942188
62569A942188r2458q7603q3368p9846p5651p0043o3548n6884n0629m5786m2973
$$ 1942188 1849730 1762127 1678759 1598913 1523262 1453219 1389671 1332787 1282158 1236372 1193399
62558A193399m0838l6943l0809k4665k0624j8470j6910j5449j3870j1396p879
$$ 1193399 1152561 1115618 1084809 1060144 1039520 1021050 1004140 988691 974821 963425 955546
62547I55546m877l894m164l753k407j759k798m560n428m635k395L46K188K412
$$ 955546 950669 946775 942611 938858 936451 934692 931894 927334 921906 917271 914876 915222 917410 919822
62533I19822K008K673M691O719P797Q543J0049J2603J5869J9500K3100K6253K9052
$$ 919822 921830 924503 929194 935913 943710 952253 962302 974905 990774 1010274 1033374 1059627 1088679
62520A088679L2060L5558L9382M3630M8591N3708N7588N9585O0702O2169O3799
$$ 1088679 1120739 1156297 1195679 1239309 1287900 1341608 1399196 1458781 1519483 1581652 1645451
62509A645451O4340O2941N9674N5158N0273M5722M1128L5072K6866J7895J0352
$$ 1645451 1709791 1772732 1832406 1887564 1937837 1983559 2024687 2059759 2086625 2104520 2114872
62498B114872N002J011k241m270m408k631P81N659J1690J8375K5472L3035M0915
$$ 2114872 2119874 2120885 2118644 2114374 2109966 2107335 2108116 2113775 2125465 2143840 2169312 2202347 2243262
62485B243262M8760N6493O4090P0740P5176P7014P6879P4771O9415O0177M8698
$$ 2243262 2292022 2348515 2412605 2483345 2558521 2635535 2712414 2787185 2856600 2916777 2965475
62474B965475L7316K6224J3463k311k0219l8359n5408p0578q3095r2608r9632
$$ 2965475 3002791 3029015 3042478 3040167 3019948 2981589 2926181 2855603 2772508 2679900 2580268
62463B580268j04903j08537j10216j09861j07665j03784r8394r1878q4586p6574
$$ 2580268 2475365 2366828 2256612 2146751 2039086 1935302 1836908 1745030 1660444 1583870
62453A583870o7816n8584m9443m1104l4222k8896k4296j9370j4163r739o516l520
$$ 1583870 1516054 1457470 1408027 1366923 1332701 1303805 1279509 1260139 1245976 1236237 1229721 1226201
62441A226201J58L939O595P855Q230P871O702N359M695M358K966j11m019p566
$$ 1226201 1226359 1230298 1236893 1244748 1252978 1260849 1267551 1272910 1277605 1281963 1284929 1284818 1280799 1273233
62427A273233j0305j2366j4081j5876j7799j9070j8998j8249j8243j9144j9622
$$ 1273233 1262928 1250562 1236481 1220605 1202806 1183736 1164738 1146489 1128246 1109102 1089480
62416A089480j8847j7567j6695j6028j5037j3935j3089j2156j0681r007p815p155
$$ 1089480 1070633 1053066 1036371 1020343 1005306 991371 978282 966126 955445 946438 938623 931468
62404I31468o602n872m810l249j420%P31J347K420L824N232O603P753Q230Q123
$$ 931468 924866 918994 914184 910935 909515 909515 910246 911593 914013 917837 923069 929672 937425 945655 953778
62389I53778Q101Q169P520O396O694R324J2209J2581J0665R183R546J0516J0755
$$ 953778 961879 970048 977568 983964 990658 999982 1012191 1024772 1035437 1044620 1054166 1064682 1075437
62376A075437J0791J1800J3796J5886J7499J8700J9940K1935K5137K8996L2356
$$ 1075437 1086228 1098028 1111824 1127710 1145209 1163909 1183849 1205784 1230921 1259917 1292273
62365A292273L4906L7722M2003M7685N3644N8858O3189O7270P1781P6631Q0894
$$ 1292273 1327179 1364901 1406904 1454589 1508233 1567091 1630280 1697550 1769331 1845962 1926856
62354A926856Q3617Q4427Q3114P9212P2644O4402N5732M6840L7049K6077J4465
$$ 1926856 2010473 2094900 2178014 2257226 2329870 2394272 2450004 2496844 2533893 2559970 2574435
62343B574435K955p860j7626k6580l5436m3953n0289n3001n3309n3755n4846n4718
$$ 2574435 2577390 2569530 2551904 2525324 2489888 2445935 2395646 2342645 2289336 2235581 2180735 2126017
62331B126017n2395m9367m7183m5186m1898l7506l3556l0901k9296k8544k8802
$$ 2126017 2073622 2024255 1977072 1931886 1889988 1852482 1818926 1788025 1758729 1730185 1701383
62320A701383k9760l0527l0587l0242k9963k9691k8905k7216k4866k2618k1018
$$ 1701383 1671623 1641096 1610509 1580267 1550304 1520613 1491708 1464492 1439626 1417008 1395990
62309A395990j9728j8029j6019j4835j5305j6710j7278j5880j3054j0345q778
$$ 1395990 1376262 1358233 1342214 1327379 1312074 1295364 1278086 1262206 1249152 1238807 1230029
62298A230029q068p423o851o979p488o694l561N38L141L524L126L391M301N111
$$ 1230029 1221961 1214538 1207687 1200708 1193220 1186526 1182965 1183503 1186644 1190168 1193294 1196685 1200986 1206097
62284A206097N383N106M720N157O980R319J0683J0948J1478J3116J5174J6761
$$ 1206097 1211480 1216586 1221306 1226463 1233443 1242762 1253445 1264393 1275871 1288987 1304161 1320922
62272A320922J7910J8964J9991K1345K3737K7074L0211L2548L4898L8187M2270
$$ 1320922 1338832 1357796 1377787 1399132 1422869 1449943 1480154 1512702 1547600 1585787 1628057
62261A628057M6742N1883N7960O4445P0724P6727Q2081Q5675Q7012Q7038Q6481
$$ 1628057 1674799 1726682 1784642 1849087 1919811 1996538 2078619 2164294 2251306 2338344 2424825
62250B424825Q4295P9000P0887O1488N1378L9919K6892J3114o24j4134k7379m0217
$$ 2424825 2509120 2588120 2659007 2720495 2771873 2811792 2838684 2851798 2851174 2837040 2809661 2769444
62238B769444n2404o3179p1339p6611q0381q3939q6347q5566q1450p6232p1865
$$ 2769444 2717040 2653861 2582522 2505911 2425530 2341591 2255244 2169678 2088228 2011996 1940131
62227A940131o8221o4174n9155n3146m6352l9640l4444l1337k9152k6224k2215
$$ 1940131 1871910 1807736 1748581 1695435 1649083 1609443 1574999 1543662 1514510 1488286 1466071
62216A466071j8215j5285j3458j2064j0637r250q093o972n453l449j307Q90L540
$$ 1466071 1447856 1432571 1419113 1407049 1396412 1387162 1379069 1372097 1366644 1363195 1361888 1362778 1366318
62203A366318O711R509J0849J0690J0117J0285J1582J3404J4412J3548J1376R925
$$ 1366318 1373029 1382538 1393387 1404077 1414194 1424479 1436061 1449465 1463877 1477425 1488801 1498726
62191A498726J0486J2039J2756J2553J2826J3879J4234J2935J1173J0575J0840
$$ 1498726 1509212 1521251 1534007 1546560 1559386 1573265 1587499 1600434 1611607 1622182 1633022
62180A633022J0344Q691P395P849R567J1114J2162J3771J6693K0306K3655K6918
$$ 1633022 1643366 1652057 1659452 1667301 1676868 1687982 1700144 1713915 1730608 1750914 1774569 1801487
62168A801487L1030L6199M1625M6663N1242N4938N6627N5627N2472M8034M2530
$$ 1801487 1832517 1868716 1910341 1957004 2008246 2063184 2119811 2175438 2227910 2275944 2318474
62157B318474L5931K8665K1162J3265M810l715j1782j9525k7082l3813l9087m3333
$$ 2318474 2354405 2383070 2404232 2417497 2422307 2418592 2406810 2387285 2360203 2326390 2287303 2243970
62145B243970m7306n0675n2482n2688n2097n0876m8393m4680m0884l7867l5227
$$ 2243970 2196664 2145989 2093507 2040819 1988722 1937846 1889453 1844773 1803889 1766022 1730795
62134A730795l2096k8320k4425k1024j8483j6772j5488j4342j3498j3064j2437
$$ 1730795 1698699 1670379 1645954 1624930 1606447 1589675 1574187 1559845 1546347 1533283 1520846
62123A520846j0839q374n955m140k787j739j275j730l180n466q049j0014j0788
$$ 1520846 1510007 1501633 1495678 1491538 1488751 1487012 1485737 1484007 1480827 1475361 1467312 1457298 1446510
62110A446510j0730j0561j0516j0620j1266j2725j4401j5469j5888j5995j5542
$$ 1446510 1435780 1425219 1414703 1404083 1392817 1380092 1365691 1350222 1334334 1318339 1302797
62099A302797j4285j2904j2056j0917q323n022k988k472j752m4J406J903K768
$$ 1302797 1288512 1275608 1263552 1252635 1244312 1239290 1236302 1233830 1232078 1232034 1233440 1235343 1238111
62086A238111M957P014P113N947N837P735J0615J3357J5836J8341K0969K3513
$$ 1238111 1243068 1250082 1257195 1263142 1268979 1276714 1287329 1300686 1316522 1334863 1355832 1379345
62074A379345K5380K6116K6520K8320L1923L5474L7238L8024L9849M2974M5854
$$ 1379345 1404725 1430841 1457361 1485681 1517604 1553078 1590316 1628340 1668189 1711163 1757017
62063A757017M7606M8664M9031M7681M4075L8968L3178K6737J9653J2380M872
$$ 1757017 1804623 1853287 1902318 1949999 1994074 2033042 2066220 2092957 2112610 2124990 2129862
62052B129862l753j3716k3502l1178l6559m1310m6987n3472n9278o3023o4531
$$ 2129862 2126109 2112393 2088891 2057713 2021154 1979844 1932857 1879385 1820107 1757084 1692553
62041A692553o4626o4017o2655o0364n7637n5116n2479m8718m3661l8373l3802
$$ 1692553 1627927 1563910 1501255 1440891 1383254 1328138 1275659 1226941 1183280 1144907 1111105
62030A111105k9882k6488k4305k3699k3384k1538j8186j5271j4106j3933j3562
$$ 1111105 1081223 1054735 1030430 1006731 983347 961809 943623 928352 914246 900313 886751
62019H86751j3206j3635j4195j3247j0580q064p434q351r214r037p797n655k926
$$ 886751 873545 859910 845715 832468 821888 813824 806390 798039 788825 779788 771991 766336 763410
62006G63410o00J96n03j327r44P34K733M014M254L910L634L490K988K018J258
$$ 763410 762810 763006 762503 761176 760232 760966 763699 767713 771967 775877 779511 783001 785989 788007 789265
61991G89265J249J588J709J785J939J088j921o109q906r220q544q494q694q149
$$ 789265 790514 792102 793811 795596 797535 798623 796702 790593 781687 772467 763923 755429 746735 738586
61977G38586p298p172p378o561m631k975k342j939r79K3K14k22m32k07j12m97
$$ 738586 731288 724116 716738 710177 705546 702571 700229 698290 697311 697334 697548 697326 696894 696687 696575 696078
61961F96078j012j241j227j166r53m97k58p99j703j593K13K614L992M299M933
$$ 696078 695066 693825 692598 691432 690479 689982 689724 688925 687222 685629 685842 688456 692448 696747 701680
61946G01680O623Q474R395R592J0038J1170J2719J4330J5664J6285J6104J5662
$$ 701680 708303 716777 726172 735764 745802 756972 769691 784021 799685 815970 832074 847736
61934H47736J5495J5413J4868J3784J2543J1358J0175Q936P578N960M279L256
$$ 847736 863231 878644 893512 907296 919839 931197 941372 950308 957886 963846 968125 971381
61922I71381L305L702L123J074j582l378l342j598P56K599L963N802Q318J0172
$$ 971381 974686 978388 981511 982585 981003 977625 974283 972685 973441 976040 980003 985805 994123 1004295
61908A004295J0235R491R906J1683J2847J1870R438P202N894N377N598O385O837
$$ 1004295 1014530 1024021 1033927 1045610 1058457 1070327 1079765 1086967 1092861 1098238 1103836 1110221 1117058
61895A117058O010M158K459J522Q65j10j310k324k946l076k622j942k007l589
$$ 1117058 1123068 1127226 1129685 1131207 1132072 1131962 1130652 1128328 1125382 1122306 1119684 1117742 1115735 1112146
61881A112146o431r515j1930j3327j3802j3852j4228j5191j5903j5103j2527r243
$$ 1112146 1105715 1096200 1084270 1070943 1057141 1043289 1029061 1013870 997967 982864 970337 961094
61869I61094o505m722l588k671j610l16Q19J417J985L608O456R410J1658J3789
$$ 961094 954589 949867 946279 943608 941998 941682 942501 943918 945903 949511 955967 965377 977035 990824
61855I90824J6477J8950J9949J9757J9948K1297K3055K4222K4491K3880K2586
$$ 990824 1007301 1026251 1046200 1065957 1085905 1107202 1130257 1154479 1178970 1202850 1225436
61844A225436K1205K0152J8754J6010J2270R018O767M487J431j672l737m500m099
$$ 1225436 1246641 1266793 1285547 1301557 1313827 1322845 1329612 1334099 1335530 1333858 1330121 1325621 1321522
61831A321522k680r86j11R9J208L935O924Q635R231R446Q842O713L870J769L73
$$ 1321522 1318842 1317856 1317745 1317844 1319052 1322987 1329911 1338546 1347777 1357223 1366065 1372778 1376648 1378417 1378790
61816A378790j523m138o455q001r383j0861j1824j1967j1899j2164j2622j3202
$$ 1378790 1377267 1373129 1366674 1358673 1349290 1338429 1326605 1314638 1302739 1290575 1277953 1264751
61804A264751j4410j6496j8725k0037k0200j9937j9993k0221j9683j7790j5323
$$ 1264751 1250341 1233845 1215120 1195083 1174883 1154946 1134953 1114732 1095049 1077259 1061936
61793A061936j3829j3861j4335j3845j2010r370o825n548o209p554o996l883r15
$$ 1061936 1048107 1034246 1019911 1006066 994056 984686 977861 972313 966104 958550 951554 947671 946756
61780I46756p70k315k241J47K255K261J446J660K699L439L984N116O542P302P481
$$ 946756 945986 943671 941430 941577 943832 946093 947539 949199 951898 955337 959321 964437 970979 978281 985762
61765I85762Q236J0136J2387J3857J4263J4146J3947J3458J2292J0747R635Q965
$$ 985762 993998 1004134 1016521 1030378 1044641 1058787 1072734 1086192 1098484 1109231 1118866 1127831
61753A127831P497M312L18k748m473n886p673r534j1242j2971j4446j5077j5303
$$ 1127831 1135328 1139640 1139958 1137210 1132737 1126851 1119178 1109644 1098402 1085431 1070985 1055908 1040605
61740A040605j6365j8171j8778j6913j3883j1816j0947r790p522m990l491l433
$$ 1040605 1024240 1006069 987291 970378 956495 944679 933732 923942 916420 911430 907939 904506
61728I04506m266n079n323n134m885m367l048j228j95o89j870k406k032j398r11
$$ 904506 900240 895161 889838 884704 879819 875452 872404 871176 870981 870292 868422 866016 863984 862586 861675
61713H61675n03k37l84r72j778k658l507m022l882l173k468k554l849n742o747
$$ 861675 861172 860935 860551 859579 857801 855143 851636 847614 843732 840559 838091 835537 831688 825946 819199
61698H19199o027m636m342n242n722n035m482n273o616p000o396n843n653n418
$$ 819199 813172 808536 804194 798952 793230 788195 783713 778440 771824 764824 758428 752585 746932 741514
61684G41514n238n482n646m839l353k387k286k325k279k732l482l196j480p4p68
$$ 741514 736276 730794 725148 720309 716956 714569 712283 709958 707679 704947 701465 698269 696789 696715 695947
61669F95947k810l599j786J261L201L168K181J743K463L978N706P425R152J0654
$$ 695947 693137 689538 687752 689013 692214 695382 697563 699306 701769 705747 711453 718878 728030 738684
61655G38684J1220J0086P306M226K609K801L155K020R0l24J460L282K922J069
$$ 738684 749904 759990 767296 771522 774131 776932 780087 782107 782197 781873 783333 786615 789537 790606
61641G90606K24J332K853L165K526K312L220M668N501M987L498K122J309K10j977
$$ 790606 790830 792162 795015 798180 800706 803018 806238 810906 816407 821394 824892 827014 828323 828533 826556
61626H26556m536o099o781p901r533r992q516o873p033q309q505p153n867n651
$$ 826556 822020 815921 809140 801239 791706 781714 773198 766325 759292 750983 742478 735325 729458 723807
61612G23807n690n228n050o136p925q965q755p891o847n573m297l726m098m672
$$ 723807 718117 712889 707839 701703 693778 684813 676058 668167 661320 655747 651450 647724 643626 638954
61598F38954m522l559k561k339l011l922m250l818l325l404l602k812q13J177
$$ 638954 634432 630873 628312 625973 622962 619040 614790 610972 607647 604243 600641 597829 597016 598193
61584E98193J805R87l77j569k448k954k890k239j193m4P23M14j090k680k819j154
$$ 598193 599998 600985 600608 599039 596591 593637 590747 588508 587315 587271 587994 588408 587318 584638 581819 580665
61568E80665J110K560K794K326J953K316L530M891N433N024M495M453M525M060
$$ 580665 581775 584335 587129 589455 591408 593724 597254 602145 607578 612602 617097 621550 626075 630135
61554F30135L047K000J401J633K799M098M065K200p6r51m01L4n17j254j134k78
$$ 630135 633182 635182 636583 638216 641015 645113 649178 651378 651302 650351 649950 649984 649467 648213 647079 646801
61538F46801N23J020J557K212K446J669o7j863k501j434N78J990J864O00p28j493
$$ 646801 647324 648344 649901 652113 654559 656228 656161 654298 651797 650363 650941 652931 654795 655395 654667 653174
61522F53174j795j909j951j998k186k385k068p79J254L188M281M404L915L262
$$ 653174 651379 649470 647519 645521 643335 640950 638882 638103 639357 642545 646826 651230 655145 658407
61508F58407K847K911L281L450L278L415M518O135O950O291M947M193M413M926
$$ 658407 661254 664165 667446 670896 674174 677589 682107 688242 695192 701483 706430 710623 715036 719962
61494G19962M913M295L868M571O276P365O242L476J552J980L464L771K706K039
$$ 719962 724875 729170 733038 737609 743885 751250 757492 760968 762520 764500 767964 771735 774441 776480
61480G76480K832M203M799M236K792Q68p57j148n29m61j944m050n345n903o661
$$ 776480 779312 783515 788314 792550 795342 796210 795453 794305 793776 793315 791371 787321 781976 776073 769412
61465G69412p404o973n482m601n195n957n303l545k222k019k344k493k195j332
$$ 769412 762008 755035 749553 744952 739757 733800 728497 724952 722730 720711 718367 715874 713679 712347
61451G12347l8J099J697K129K696K794K012J464K499M352M885L802L201M310N664
$$ 712347 712309 713408 715105 717234 719930 722724 724736 726200 728699 733051 737936 741738 744939 749249 754913
61436G54913N658N043N256N725M911L095J957J845J578Q31P14J676K665K816K469
$$ 754913 760571 765614 770870 776595 781506 784601 786558 788403 789981 790812 791526 793202 795867 798683 801152
61421H01152K054J500J186J954L464M068L105J960J805J670N1k513l960l143o14
$$ 801152 803206 804706 805892 807846 811310 815378 818483 820443 822248 823918 823969 821456 817496 814353 813739
61406H13739K441M868N571M301K313J300J563J956J546O11J22P60K438M209M896
$$ 813739 816180 821048 826619 830920 833233 834533 836096 838052 839598 840209 840331 841091 843529 847738 852634
61391H52634M196K914J782O30p05j449r00J12k6j555k937k661p49J602L154L343
$$ 852634 856830 859744 861526 862156 861451 860002 859102 859214 859188 857633 854696 852035 851286 852888 856042 859385
61375H59385K555J806J665J577P80m16j067j164j671k907l819l400k057j033r68
$$ 859385 861940 863746 865411 866988 867768 867352 866285 865121 863450 860543 856724 853324 851267 850234 849266
61360H49266j568k264k587k039l35K089M143N059N216N615O442O616N259L229
$$ 849266 847698 845434 842847 840808 840473 842562 846705 851764 856980 862595 869037 875653 880912 884141
61346H84141K425L447M869N197M619M204M207M153M070M422M972M868L995L208
$$ 884141 886566 890013 894882 900079 904698 908902 913109 917262 921332 925754 930726 935594 939589 942797
61332I42797K970K655J678N95M12J191K046K376K609L598N471P261P779O923O039
$$ 942797 945767 948422 950100 950695 951107 952298 954344 956720 959329 962927 968398 975659 983438 990361 996400
61317I96400O789R522J2940J5398J6411J6729J7084J7266J6806J6197J6723J8697
$$ 996400 1003189 1012711 1025651 1041049 1057460 1074189 1091273 1108539 1125345 1141542 1158265 1176962
61305A176962K0602K0752J9300J7779J6874J5774J3632J0509O619J923l098p276
$$ 1176962 1197564 1218316 1237616 1255395 1272269 1288043 1301675 1312184 1318803 1320726 1317628 1310352
61293A310352j0001j1756j3029j3735j4241j5646j8092j9974j9935j8704j7710
$$ 1310352 1300351 1288595 1275566 1261831 1247590 1231944 1213852 1193878 1173943 1155239 1137529
61282A137529j6925j5463j3605j2321j1335r355o331l836k992l241l434l104k449
$$ 1137529 1120604 1105141 1091536 1079215 1067880 1058525 1052194 1048358 1045366 1042125 1038691 1035587 1033138
61269A033138j901j882k187j722L51L328N663O723O868O252M813L324K932L524
$$ 1033138 1031237 1029355 1027168 1025446 1025797 1029125 1034788 1041511 1048379 1054631 1059444 1062768 1065700 1069224
61255A069224L818L324K966L396L900L585K707K182K400K998L364L162K656K451
$$ 1069224 1073042 1076366 1079332 1082728 1086628 1090213 1092920 1095102 1097502 1100500 1103864 1107026 1109682 1112133
61241A112133K627K462J563O34L95M70M98J431M164P481R225R184Q915Q966Q516
$$ 1112133 1114760 1117222 1118785 1119419 1119814 1120284 1120782 1122213 1126377 1133858 1143083 1152267 1161182 1170148 1178664
61226A178664P891Q956J2162J5352J6529J6142J5634J5448J5461J5867J6401J6050
$$ 1178664 1186555 1195511 1207673 1223025 1239554 1255696 1271330 1286778 1302239 1318106 1334507 1350557
61214A350557J4576J3057J2053J0742Q787P483P633P918O856N181M673N703P390
$$ 1350557 1365133 1378190 1390243 1400985 1409772 1417255 1424888 1432806 1439662 1444843 1449516 1455219 1462609
61201A462609R183J0752J1381J1046J1201J2863J4794J5170J4150J3032J1719
$$ 1462609 1471792 1482544 1493925 1504971 1516172 1529035 1543829 1558999 1573149 1586181 1597900
61190A597900R152N758L265K031N31k245n603q636j1373j3960j5890j6739j6832
$$ 1597900 1607052 1612810 1616075 1618106 1618637 1616392 1610789 1602153 1590780 1576820 1560930 1544191 1527359
61177A527359j6855j7262j8166j9178j9607j9395j9411k0070k0273j8830j6455
$$ 1527359 1510504 1493242 1475076 1455898 1436291 1416896 1397485 1377415 1357142 1338312 1321857
61166A321857j5104j5522j6630j7185j6891j5991j4864j3874j2703j0211o044
$$ 1321857 1306753 1291231 1274601 1257416 1240525 1224534 1209670 1195796 1183093 1172882 1166838
61155A166838j922R5L17Q56K697M854O344P110O926N328L068J872J987J693R8
$$ 1166838 1164916 1165011 1165328 1166184 1168881 1173735 1180079 1187189 1194115 1199443 1202511 1204383 1206370 1208063 1208161
61140A208161j209m21J897L922N159O551Q644J0992J3163J5185J7165J9259K1883
$$ 1208161 1206952 1206531 1208428 1212350 1217509 1224060 1232704 1243696 1256859 1272044 1289209 1308468 1330351
61127A330351K5237K8719L1441L3290L5020L7337M0372M3953M7899N1856N5168
$$ 1330351 1355588 1384307 1415748 1449038 1484058 1521395 1561767 1605720 1653619 1705475 1760643
61116A760643N7235N8221N9134O0880O3106O4391O3793O1809N9561N7670N6272
$$ 1760643 1817878 1876099 1935233 1996113 2059219 2123610 2187403 2249212 2308773 2366443 2422715
61105B422715N5315N4042N1014M5810M0023L5277L0735K4212J5458O609p67p226
$$ 2422715 2478030 2532072 2583086 2628896 2668919 2704196 2734931 2759143 2774601 2781210 2780443 2773217
61093B773217j3700j9886k5226k9938l4073l6867l8165l9449m2307m6427n0047
$$ 2773217 2759517 2739631 2714405 2684467 2650394 2613527 2575362 2535913 2493606 2447179 2397132
61082B397132n1784n1395m9543m7611m7005m7720m8146m6936m4411m1526l8503
$$ 2397132 2345348 2293953 2244410 2196799 2149794 2102074 2053928 2006992 1962581 1921055 1882552
61071A882552l5356l2764l1218k9970k8150k6216k5105k4398k2808k0139j7363
$$ 1882552 1847196 1814432 1783214 1753244 1725094 1698878 1673773 1649375 1626567 1606428 1589065
61060A589065j4926j2370r656p548o355n402m045k194L30L886Q075J1624J3750
$$ 1589065 1574139 1561769 1552113 1544565 1538210 1532808 1528763 1526569 1526899 1530785 1538860 1550484 1564234
61047A564234J4926J6081J7698J9947K2851K5894K8196K9629L1052L3074L5183
$$ 1564234 1579160 1595241 1612939 1632886 1655737 1681631 1709827 1739456 1770508 1803582 1838765
61036A838765L6672L7754L9184M1225M3650M6248M8723N0495N1446N2605N5355
$$ 1838765 1875437 1913191 1952375 1993600 2037250 2083498 2132221 2182716 2234162 2286767 2342122
61025B342122N9979O5661P1770P8453Q6018R4576J04644J17312J33324J52490
$$ 2342122 2402101 2467762 2539532 2617985 2704003 2798579 2903223 3020535 3153859 3306349
61015C306349J74626K00944K34088K76771L30500L95231M69678N52148O42119
$$ 3306349 3480975 3681919 3916007 4192778 4523278 4918509 5388187 5940335 6582454
61006F582454P42182Q58609R98754J165609J352957J545147J721192J857904J929050
$$ 6582454 7324636 8183245 9181999 10347608 11700565 13245712 14966904 16824808 18753858
60997A8753858J906992J775817J550884J283007J033177Q35088O80785N41743
$$ 18753858 20660850 22436667 23987551 25270558 26303735 27138823 27819608 28361351
60989B8361351L98186K43991P0045j42598m04969p00097r88625j236311j433544
$$ 28361351 28759537 29003528 29073573 28930975 28526006 27825909 26837284 25600973 24167429
60980B4167429j588894j708928j787416j811576j774831j683485j554116j406075
$$ 24167429 22578535 20869607 19082191 17270615 15495784 13812299 12258183 10852108
60972A0852108j254759j108786r71145q42314p22993o15078n20783m40917l73999
$$ 10852108 9597349 8488563 7517418 6675104 5952111 5337033 4816250 4375333 4001334
60963D001334l17463k69663k30345j99034j73778j52090j32713j15788j01554
$$ 4001334 3683871 3414208 3183863 2984829 2811051 2658961 2526248 2410460 2308906
60954B308906q9656p9586p0974o3224n5760m8904m3784m0803l8883l6813l4763
$$ 2308906 2219250 2139664 2068690 2005466 1949706 1900802 1857018 1816215 1777332 1740519 1705756
60943A705756l3590l3082l2011k9877k7656k6528k6663k7462k8287k8615k8088
$$ 1705756 1672166 1639084 1607073 1577196 1549540 1523012 1496349 1468887 1440600 1411985 1383897
60932A383897k6901k5680k4712k3682k2366k1010j9790j8501j7138j6083j5382
$$ 1383897 1356996 1331316 1306604 1282922 1260556 1239546 1219756 1201255 1184117 1168034 1152652
60921A152652j4584j3852j4308j6303j7996j6900j2862q485o439o925p873p198
$$ 1152652 1138068 1124216 1109908 1093605 1075609 1058709 1045847 1037362 1030923 1023998 1016125 1008927
60909A008927m820k696k742m652o350o645o385o421n847l786j757k201m896p021
$$ 1008927 1004107 1001411 998669 994017 987667 981022 974637 968216 962369 958583 956826 954625 949729 942708
60895I42708o967o066n880n865m937l770l916n475p127p960p981p206n596l847
$$ 942708 935741 929675 923795 917930 912993 909223 905307 899832 892705 884745 876764 869558 863962 860115
60881H60115l164l919n187n821n469m464l150j594J67J757K527K243J540J376
$$ 860115 856951 853032 847845 842024 836555 832091 828941 827347 827514 829271 831798 834041 835581 836957
60867H36957K020L015M010M949N532N373M825M762N142M829L311J628R48J104
$$ 836957 838977 841992 846002 850951 856483 861856 866681 871443 876585 881414 884725 886353 887301 888405
60853H88405J351J666K266K630K149J278Q23N15n65k436m325o059q061r966j0710
$$ 888405 889756 891422 893688 896318 898467 899745 900568 901083 900518 898082 893757 887698 879637 869671 858961
60838H58961j0347j0406j1807j3378j3320j1449r320q441r048j0274j0955j0354
$$ 858961 848614 838208 826401 813023 799703 788254 778934 770493 761445 751171 740216 729862
60826G29862q563o389m751m144m517n354n985o052n696n181m565l992l813l860
$$ 729862 721299 714910 710159 706015 701498 696144 690159 684107 678411 673230 668665 664673 660860 657000
60812F57000l077p83J903K996K070P30L30L26m31j654j833j63K562M809N569M942
$$ 657000 653923 653140 655043 658039 660109 660839 661169 661495 661064 659410 657577 657414 659976 664785 670354 675296
60796F75296L856L167K821K183J192N18L57N2m44J40K370M199K907j057m057l713
$$ 675296 679152 682319 685140 687323 688515 689033 689390 689442 688998 689138 691508 695707 698614 697557 693500 689787
60780F89787j771j431l131m592m432l795m171n046m718k697l97N19j31j099j247
$$ 689787 688016 686585 683454 678862 674430 670635 666464 661418 656700 654003 653606 654125 653994 652895 651648
60765F51648o83l23n36p32m03M1j3l09j24N65J147J455J787J859R07p72j505j79
$$ 651648 650965 650642 650106 649374 648971 649012 648999 648690 648566 649131 650278 651733 653520 655379 656286 655514 654009 653830
60747F53830K387M593N749N880M821K656M45p47j136j567k034k064k060k810l782
$$ 653830 656217 660810 666559 672439 677260 679916 680361 679614 678478 676911 674877 672813 670753 667943 664161
60732F64161l529j841m7J030J882K695K661J596P82J079J514Q59m90j356j543
$$ 664161 660632 658791 658744 659774 661656 664351 667012 668608 669390 670469 671983 672842 672352 670996 669453
60717F69453j408o10J143K653K299L70j149j191o30n06o12l74j3j28p78j590k334
$$ 669453 668045 667435 668578 671231 673530 673900 672751 671560 670930 670424 669812 669438 669425 669297 668519 666929 664595
60700F64595k955l324l306k869k077j241j043j932l302l878l153j964j267p66
$$ 664595 661640 658316 655010 652141 650064 648823 647780 645848 642546 638668 635515 633551 632284 631518
60686F31518O44L174N443N930M860M118M916O231O204M773L753M141M692L875
$$ 631518 632162 635336 640779 646709 651569 655687 660603 666834 673038 677811 681564 685705 690397 694272
60672F94272K117Q95M60j05r23j033j50O90O33P7k81n55j164j909k134j517l37
$$ 694272 696389 697284 697744 697639 696716 695683 695533 696223 696856 696933 696652 696097 694933 693024 690890 689373 689036
60655F89036P74J178P59K72P26K241L878M722M705M303L938L691L090J213k183
$$ 689036 689810 690988 691747 692019 692745 694986 698864 703586 708291 712594 716532 720223 723313 724526 722343
60640G22343n632o959n643l364j870j140k15J033J822J603N22r69k230k526j622
$$ 722343 716711 709752 704109 700745 698875 697735 697520 698553 700375 701978 702500 701531 699301 696775 695153
60625F95153j17J287K455L373L489K406R12M42J392K601K659J276o61j908j751
$$ 695153 695036 696323 698778 702151 705640 708046 708958 709400 710792 713393 716052 717328 716667 714759 713008
60610G13008m73R06J599J762J974K274K146J340K48n38o93k90J69M1o63r02K91
$$ 713008 712535 713441 715040 716802 718776 721050 723196 724536 724784 724246 723553 723263 723432 723473 722810 721908 722199
60593G22199K449M048M220L353J998J44k023l599l824k812r40J703M495N776M530
$$ 722199 724648 728696 732916 736269 738267 738411 736388 732789 728965 726153 725213 726916 731411 737187 741717
60578G41717K167J274K616M540N548O015O833P760Q153Q424R453J0986J1846J1627
$$ 741717 743884 745158 747774 752314 757862 763877 770710 778470 786623 795047 804500 815486 827332 838959
60564H38959J1037J0513R456P109L597j30k946m137l936l423l261k760j022J213
$$ 838959 849996 860509 869965 877074 880671 880541 877595 873458 869522 866099 862838 860078 859056 860269
60550H60269K162J576J313K684M617N547N980P686J0887J3861J5330J5841J6532
$$ 860269 862431 864007 865320 868004 872621 878168 884148 891834 902721 916582 931912 947753 964285
60537I64285J7663J8929K0351K2161K4112K5418K5329K3649K0766J7229J3212
$$ 964285 981948 1000877 1021228 1043389 1067501 1092919 1118248 1141897 1162663 1179892 1193104
60526A193104Q577L533j202n168q591j1584j3492j3787j3176j2855j2946j2597
$$ 1193104 1201681 1205214 1204012 1198844 1190253 1178669 1165177 1151390 1138214 1125359 1112413 1099816
60514A099816j1470j0055q500o339l623j170O68K594N277Q662J2743J7947K3965
$$ 1099816 1088346 1078291 1069791 1063452 1059829 1058659 1059327 1061921 1067198 1075860 1088603 1106550 1130515
60501A130515K9211L2428L4201L5885L7687L8751L8744L8204L7478L6273L4286
$$ 1130515 1159726 1192154 1226355 1262240 1299927 1338678 1377422 1415626 1453104 1489377 1523663
60490A523663L1539K8154K4545K1614J9936J8751J6750J3865J1321R578P204K389
$$ 1523663 1555202 1583356 1607901 1629515 1649451 1668202 1684952 1698817 1710138 1719716 1726920 1729309
60478A729309n016j3618k2081k9873l6757m2363m6539m9577n1816n3115n3024
$$ 1729309 1724293 1710675 1688594 1658721 1621964 1579601 1533062 1483485 1431669 1378554 1325530
60467A325530n1524m9370m7353m5208m1802l6815l1706k8291k6552k4823k2114
$$ 1325530 1274006 1224636 1177283 1132075 1090273 1053458 1021752 993461 966909 942086 919972
60456I19972j9229j7170j5635j3832j1937j0605r684q674p992q327q843p710m845
$$ 919972 900743 883573 867938 854106 842169 831564 821880 813206 805214 796887 788044 780334 775489
60443G75489k510k355l202l002j779j087j238j015k2N03k93j461j653r30l00j99
$$ 775489 772979 770624 767422 764420 762641 761554 760316 759301 759279 759782 759489 758028 756375 755445 755145 754946
60427G54946k64j40K10P44J347J799K033K112J794P77l29j17J799L853M349L690
$$ 754946 754682 754542 754752 755496 756843 758642 760675 762787 764581 765358 765029 764912 766711 770564 774913 778603
60411G78603L663M851O000O005N216M424L710L028K973L885M713L978J914M92
$$ 778603 782266 787117 793117 799122 804338 808762 812472 815500 818473 822358 827071 831049 832963 833455
60397H33455J009K471L116K839L030M180N001M369L046K554L109L808M336N151
$$ 833455 834464 836935 840051 842890 845920 850100 855101 859470 862516 865070 868179 871987 876323 881474
60383H81474O034N916M459K661J445P42M14Q09J717J983J204P55J814L259L031
$$ 881474 887508 893424 897883 900544 901989 902731 903145 903954 905671 907654 908858 909613 911427 914686 917717
60368I17717J118l71r3J101J791J838K044K863M134N649P394R167J0215R651P713
$$ 917717 918835 918464 918371 919472 921263 923101 925145 928008 932142 937791 945185 954352 964567 974218 981931
60353I81931O236O940R073R907Q045M971K662J086o51k175k729l150m835p229
$$ 981931 988167 995107 1004180 1014087 1022132 1027103 1029765 1030851 1030200 1028025 1025296 1022146 1017311 1010082
60339A010082q475q198p521o568m465k009j662l912o019n655l963l439m438n443
$$ 1010082 1001607 993409 985888 979320 974855 972846 971184 967272 961253 955598 951635 948196 943758 938315
60325I38315n588n107m008k039K79J835K228K124K439L609N373O997Q121R338
$$ 938315 932727 927620 923612 921573 921852 923687 925915 928039 930478 934087 939460 946457 954578 963916
60311I63916J1169J2606J2062J0035R071J0249J1420J0219P412N539N256M917
$$ 963916 975085 987691 999753 1009788 1018859 1029108 1040528 1050747 1058159 1063698 1068954 1073871
60299A073871L256O87k028m829p778j0470j2322j2969j2376j1058r858r047q040
$$ 1073871 1077127 1077814 1075786 1070957 1063179 1052709 1040387 1027418 1015042 1003984 994126 985079 977039
60286I77039o479n052m591m918n294n423n329m879m178l903m399n102n449n700
$$ 977039 970560 965508 960917 955999 950705 945282 939953 935074 930896 926993 922594 917492 912043 906343
60272I06343o040n885m980m216m244m243l476k972l922n230m730k447n87k97n59
$$ 906343 900303 894418 889438 885222 880978 876735 873259 870287 866365 861135 856405 853958 853371 853074 852515
60257H52515m19k57k25N77K429L964L943K916K252K284K436K456K628L087L503
$$ 852515 852096 851839 851614 852191 854620 858584 862527 865443 867695 869979 872415 874871 877499 880586 884089
60242H84089L319K187N63l15K97J394J247l59j908k273j813r78P46L590O342P565
$$ 884089 887408 889595 890158 889843 890140 891534 892781 892422 890514 888241 886428 885450 886196 889786 896128 903693
60226I03693P391P077P182P215O901O838P763R626J1637J2922J3267J3413J4459
$$ 903693 911084 918161 925343 932558 939459 946297 954060 963686 975323 988245 1001512 1014925 1029384
60213A029384J6684J9009J9892J8855J6974J5803J5834J6167J5806J5038J4995
$$ 1029384 1046068 1065077 1084969 1103824 1120798 1136601 1152435 1168602 1184408 1199446 1214441
60202A214441J5843J6202J4823J2160R586P617N792L902K239P56j000l023m808
$$ 1214441 1230284 1246486 1261309 1273469 1283055 1290672 1296464 1300366 1302605 1303361 1302361 1299338 1294530
60189A294530o182p444q669r705j0724j1867j2412j1551j0035r702j0887j1705
$$ 1294530 1288348 1280904 1272235 1262530 1251806 1239939 1227527 1215976 1205941 1196239 1185352 1173647
60177A173647j0641q690p788q091q050o766n046m123m343n169n880o053n835n793
$$ 1173647 1163006 1154316 1146528 1138437 1130387 1123621 1118575 1114452 1110109 1104940 1099060 1093007 1087172 1081379
60163A081379o227o623o186m848l470k888l011l014k306j099P1J153K561M254
$$ 1081379 1075152 1068529 1062343 1057495 1054025 1051137 1048126 1045112 1042806 1041707 1041778 1042931 1045492 1049746
60149A049746N274M637K579N31j13R23K657L667L295K368K395L806N447O175O326
$$ 1049746 1055020 1059657 1062236 1062767 1062654 1063577 1066234 1069901 1073196 1075564 1077959 1081765 1087212 1093387 1099713
60134A099713O995Q406R813J0576J0534R638Q119O806O434O823P390Q062Q855
$$ 1099713 1106708 1115114 1124927 1135503 1146037 1155675 1163794 1170600 1177034 1183857 1191247 1199309 1208164
60121A208164R129Q469P791Q255R395R776R239Q859Q790P997O396N420N768O361
$$ 1208164 1217293 1225762 1233553 1241808 1251203 1260979 1270218 1279077 1287867 1295864 1302260 1307680 1313448 1319809
60107A319809O149N451M614L001M14j803k407j936j679j930k420l526n613p935
$$ 1319809 1325958 1331409 1336023 1339024 1339438 1337635 1335228 1333292 1331613 1329683 1327263 1323737 1318124 1310189
60093A310189r362r781r751r417q864q872j0098j1832j2695j2348j1574j0968
$$ 1310189 1300827 1291046 1281295 1271878 1263014 1254142 1244044 1232212 1219517 1207169 1195595 1184627
60081A184627j0443r865r258q599q052q109q864r507r231q239p311o900p223q355
$$ 1184627 1174184 1164319 1155061 1146462 1138410 1130301 1121437 1111930 1102699 1094460 1087149 1080249 1073026 1064671
60067A064671r497r112o936m913m748n287m163j595l24j623l406l179j289N6p3
$$ 1064671 1055174 1046062 1039126 1034213 1029465 1024178 1020015 1018420 1018096 1016473 1013067 1009888 1008599 1008655 1008582
60052A008582m79K72K201M219N392N738N978O597P217P156O468O032O346O654
$$ 1008582 1008103 1008375 1010576 1014795 1020187 1025925 1031903 1038500 1045717 1052873 1059341 1065373 1071719 1078373
60038A078373N680L265R22L51J369J886L40k261l626l267l163m979p911j0036
$$ 1078373 1084053 1087318 1088240 1088591 1089960 1091846 1092186 1089925 1086299 1083032 1079869 1074890 1066979 1056943
60024A056943j0790j0996j1075j0611r545q654q665r515j0615j1295j1078j0047
$$ 1056943 1046153 1035157 1024082 1013471 1003926 995272 986607 977092 966477 955182 944104 934057
60012I34057q894q197p809p271o521n763n046m504m537n094n166l823j539K54
$$ 934057 925163 916966 909157 901886 895365 889602 884556 880052 875515 870421 865255 861432 859893 860147
59998H60147Q66R00J333K571M262N558N770N195M955N569O246O119N450M911M438
$$ 860147 861013 861913 863246 865817 870079 875637 881407 886602 891557 897126 903372 909491 914941 919852 924290
59983I24290L753L295L385L086J321j277l124l956m762n643n536m354l583m109
$$ 924290 928043 931338 934723 937809 939130 937853 934729 930773 926011 920368 914832 910478 906895 902786
59969I02786m888m615l497k549k119j883j575j030j58O11O44K60P04K450M415
$$ 902786 897898 893283 889786 887237 885118 883235 881660 880630 880472 881083 881727 881987 882691 885141 889556
59954H89556N452N699N658M951L126J038J78Q44J968K620K781K704K390J997K027
$$ 889556 895008 900707 906365 911316 914442 915480 915658 916502 918470 921090 923871 926575 928965 930962 932989
59939I32989K686L426L482K816K233K525L632M858N832O749P545P451O073M432
$$ 932989 935675 939101 942583 945399 947632 950157 953789 958647 964479 971228 978773 986224 992297 996729
59925I96729M016M860N503M891L392J796L82n96o12K24Q08N43N33K148M753O127
$$ 996729 1000745 1005605 1011108 1015999 1019391 1021187 1021569 1020973 1020361 1020585 1021393 1021936 1022469 1024617 1029370 1035497
59909A035497N266L648L196L793L687K022Kq25o52r46k230l360l307k627k422
$$ 1035497 1040763 1044411 1047607 1051400 1055087 1057109 1057111 1056286 1055634 1054688 1052458 1049098 1045791 1043164 1040742
59894A040742k548j897o6K242M319N965P012P323P371P776Q226P838O808O473
$$ 1040742 1038194 1036297 1036231 1038473 1042792 1048757 1055769 1063092 1070463 1078239 1086465 1094303 1101111 1107584
59880A107584P336Q174P829O816O332O530O708O545O068M984L141J305L95pj268
$$ 1107584 1114920 1123094 1130923 1137739 1144071 1150601 1157309 1163854 1169922 1174906 1178047 1179352 1179747 1179740 1178472
59865A178472l667n632n456l232o64O88O45J60K45J260K924M704O100O819O990
$$ 1178472 1174805 1169173 1163717 1160485 1159821 1160509 1161154 1161314 1161559 1162819 1165743 1170447 1176547 1183366 1190356
59850A190356P128P632Q386R007R264Q903P502N132K941K146K454K302Q93q49
$$ 1190356 1197484 1205116 1213502 1222509 1231773 1240676 1248178 1253310 1256251 1258397 1260851 1263153 1264046 1263197
59836A263197j741j960k682m531o878q413q323p207o729p746q988q579o816n997
$$ 1263197 1261456 1259496 1256814 1252283 1245405 1236992 1228669 1221462 1214733 1206987 1197999 1189420 1182604 1176607
59822A176607p166q459p625m942k414j082m21K16R38J733K338K050P61j04R53
$$ 1176607 1169441 1160982 1153357 1148415 1146001 1144919 1144498 1144714 1145652 1147385 1149723 1151773 1152534 1152430 1153383
59807A153383L289M708M315L413L249L192J966k22j802j816r36n61j267k371k940
$$ 1153383 1156672 1161380 1165695 1169108 1172357 1175549 1177515 1177293 1175491 1173675 1172739 1172178 1170911 1168540 1165600
59792A165600l024l604n268p351q715q949q421p621p025p137p884q211p155n229
$$ 1165600 1162576 1158972 1153704 1146353 1137638 1128689 1120268 1112647 1105622 1098485 1090601 1082390 1075235 1070006
59778A070006l904l715l797l334k494j640n50R27K180K532K316K658M266O788
$$ 1070006 1066102 1062387 1058590 1055256 1052762 1051122 1050572 1051499 1053679 1056211 1058527 1061185 1065451 1072239
59764A072239R250J0838J1437J1662J2295J3470J4516J4770J4443J4474J5480
$$ 1072239 1081489 1092327 1103764 1115426 1127721 1141191 1155707 1170477 1184920 1199394 1214874
59753A214874J7042J8091J7953J6835J5276J3380J1045Q755P475P467P696O897
$$ 1214874 1231916 1250007 1267960 1284795 1300071 1313451 1324496 1333251 1340726 1348193 1355889 1362786
59741A362786M921K690J109M12K94J74l67j071j167n12n9o71j965l059l973n146
$$ 1362786 1367707 1370397 1371506 1371918 1372212 1372386 1372019 1370948 1369781 1369269 1369210 1368539 1366574 1363515 1359542 1354396
59725A354396n935m972k299J40O52l52j189q00P14K669M177M471L626K798L096
$$ 1354396 1348461 1343489 1341190 1341330 1341982 1341630 1340441 1339641 1340355 1343024 1347201 1351672 1355298 1358096 1361192
59710A361192M451O035P512R281J1533J3755J5340J6282J6950J7401J7234J6305
$$ 1361192 1365643 1371678 1379190 1388471 1400004 1413759 1429099 1445381 1462331 1479732 1496966 1513271
59698A513271J5292J5192J6139J7161J7269J6438J5114J3285J0750P944N630L770
$$ 1513271 1528563 1543755 1559894 1577055 1594324 1610762 1625876 1639161 1649911 1657855 1663485 1667255
59686A667255J556j315m226o629q620j0212j1008j1162j1774j3558j5654j6555
$$ 1667255 1668811 1667496 1663270 1656641 1648021 1637809 1626801 1615639 1603865 1590307 1574653 1558098
59674A558098j5841j4353j2893j1541j0031q230o322m827m211m074l190q60K199
$$ 1558098 1542257 1527904 1515011 1503470 1493439 1485209 1478887 1474060 1469849 1465775 1462585 1461725 1463924
59661A463924M877O995Q852J0091J0169R741J0239J1912J3360J3249J1511Q609
$$ 1463924 1468801 1475796 1484648 1494739 1504908 1514649 1524888 1536800 1550160 1563409 1574920 1583529
59649A583529M803P42k421m453o730j0384j4408j6890j7775j8958k1434k3756
$$ 1583529 1588332 1589074 1586653 1582200 1575470 1565086 1550678 1533788 1516013 1497055 1475621 1451865
59637A451865k3986k2245k0382j9664j9752j9833j9730j9560j8977j7464j5292
$$ 1451865 1427879 1405634 1385252 1365588 1345836 1326003 1306273 1286713 1267736 1250272 1234980
59626A234980j3639j3575j5104j7233j8815j9118j8010j5961j3825j2236j1045
$$ 1234980 1221341 1207766 1192662 1175429 1156614 1137496 1119486 1103525 1089700 1077464 1066419
59615A066419r685q093o904o532o444n758m253k422p53M93R69M41n74j042o40
$$ 1066419 1056734 1048641 1041737 1035205 1028761 1023003 1018750 1016328 1015575 1016068 1017037 1017478 1016904 1015862 1015222
59600A015222k60p46j554j292M74K680M081M566M789M926M446L071J426L17m13
$$ 1015222 1014962 1014216 1012662 1011370 1011844 1014524 1018605 1023171 1027960 1032886 1037332 1040403 1041829 1042146 1041733
59585A041733j718l957o028o375m747k493j099q39j074j396k027l224m730n860
$$ 1041733 1040015 1036058 1030030 1023655 1018908 1016415 1015316 1014477 1013403 1012007 1009980 1006756 1002026 996166
59571I96166n976m899l098j447o34p44j349j859j773r90q5J34l76o62m0Q08P20
$$ 996166 990190 985291 982193 980746 980112 979368 978019 976160 974387 973397 973312 973446 973070 972408 972368 973176 973896
59554I73896j33k40J299L608N254O006O771Q214J0019J1561J2787J4261J6351
$$ 973896 973763 973523 974822 978430 983684 989690 996461 1004675 1014694 1026255 1039042 1053303 1069654
59541A069654J8487J9556J9329J9045J9835K0694J9168J4531R158N897M879M005
$$ 1069654 1088141 1107697 1127026 1146071 1165906 1186600 1205768 1220299 1229457 1235354 1240233 1244238
59529A244238J977n90k881n079p355q852q612o869m816l530l556m893o751p941
$$ 1244238 1246215 1245625 1242744 1237665 1230310 1221458 1212846 1205977 1201161 1197631 1194075 1189182 1182431 1174490
59515A174490q207q689j0267j1975j2124j0766r689r914j0484j0156r116q267
$$ 1174490 1166283 1157594 1147327 1135352 1123228 1112462 1102773 1092859 1082375 1072219 1063103 1054836
59503A054836p797p322o694n732l872j214O86N23n88k34J982L886M011L689M951
$$ 1054836 1047039 1039717 1033023 1027291 1023419 1022205 1022891 1023414 1022826 1022592 1024574 1028460 1032471 1036160 1041111
59488A041111P643J0023J1285J1995J2468J2314J1480J0508R579Q325O794N722
$$ 1041111 1048754 1058777 1070062 1082057 1094525 1106839 1118319 1128827 1138406 1146731 1153525 1159247
59476A159247N508N674N653N481N436N452N140M127K323K46j122j169k90P81J852
$$ 1159247 1164755 1170429 1176082 1181563 1186999 1192451 1197591 1201718 1204041 1204287 1203165 1201996 1201706 1202487 1204339
59461A204339K885L205K324J311J938M254O276O659O447P458R798J1826J1933
$$ 1204339 1207224 1210429 1212753 1214064 1216002 1220256 1226532 1233191 1239638 1247096 1256894 1268720 1280653
59448A280653R728O085K704J048J015J096J54j503l092m426n407n400m168k676
$$ 1280653 1290381 1296466 1299170 1300218 1301233 1302329 1302483 1300980 1297888 1293462 1288055 1282655 1278487 1275811
59434A275811j976j736r26N33J768K436L167M612O870R778J3067J6339J9401K2415
$$ 1275811 1273835 1272099 1271173 1271706 1273474 1275910 1279077 1283689 1290559 1300337 1313404 1329743 1349144 1371559
59420A371559K5325K7528K8846L0249L2752L5903L8301L9231L8743L6399L1271
$$ 1371559 1396884 1424412 1453258 1483507 1516259 1552162 1590463 1629694 1668437 1704836 1736107
59409A736107K3516J5000P955L466J311O40O80J177K167L059K448n79n419j0820
$$ 1736107 1759623 1774623 1782578 1786044 1787355 1787995 1788675 1789852 1792019 1795078 1797526 1796947 1791528 1780708
59395A780708j6142k0920k4131k5325k5954k7808l0234l0767k8638k5813k4012
$$ 1780708 1764566 1743646 1719515 1694190 1668236 1640428 1610194 1579427 1550789 1524976 1500964
59384A500964k2507j9844j6252j3026j0567q233n595k870n31R08J305J577L111
$$ 1500964 1478457 1458613 1442361 1429335 1418768 1410535 1404940 1402070 1401539 1402447 1403752 1405329 1408440
59371A408440N907Q293R202R633J0848J2266J2656J2491J3254J4743J5032J3381
$$ 1408440 1414347 1422640 1431842 1441475 1452323 1464589 1477245 1489736 1502990 1517733 1532765 1546146
59359A546146J1514J1276J2406J3542J4329J5443J7021J8257J8540J8221J8129
$$ 1546146 1557660 1568936 1581342 1594884 1609213 1624656 1641677 1659934 1678474 1696695 1714824
59348A714824J8741J9778K0192J8670J4909J0555Q036P913P957N682J355k585
$$ 1714824 1733565 1753343 1773535 1792205 1807114 1817669 1825705 1833618 1841575 1847257 1848612 1846027
59336A846027m940p121j0636j4746j7738j9358k0527k1406k1646k2147k4420k7833
$$ 1846027 1841087 1833966 1823330 1808584 1790846 1771488 1750961 1729555 1707909 1685762 1661342 1633509
59324A633509k9498k7793k4448k2043k0883j9720j8406j7986j8591j8982j8263
$$ 1633509 1604011 1576218 1551770 1529727 1508844 1489124 1470718 1452732 1434141 1415159 1396896
59313A396896j6808j5272j3788j2345j1054r704p716n020k419p81j13K73Q28J196
$$ 1396896 1380088 1364816 1351028 1338683 1327629 1317925 1310209 1305189 1302770 1301989 1301876 1302149 1302977 1304173
59299A304173N22j655m732p381q660q677q166p739p554p320o424m526k246o58
$$ 1304173 1304695 1303040 1298308 1290927 1282267 1273590 1265424 1257685 1250131 1242811 1236387 1231861 1229615 1228957
59285A228957J66J438M024P263J0045J2302J4575J6776J8592K0550K3244K5699
$$ 1228957 1229123 1230561 1234585 1241848 1251893 1264195 1278770 1295546 1314138 1334688 1357932 1383631
59273A383631K6201K5008K4594K6326K8309K7860K5180K2913K2372K1920J9595
$$ 1383631 1409832 1434840 1459434 1485760 1514069 1541929 1567109 1590022 1612394 1634314 1653909
59262A653909J5883J2855J1232R630O678K775p83l572o112q506j0028j0212r707
$$ 1653909 1669792 1682647 1693879 1703509 1710187 1712962 1712179 1708607 1702495 1693989 1683961 1673749 1664042
59249A664042r663j0566j1910j2729j2365j1065j0021j0407j2133j3828j4191
$$ 1664042 1654379 1643813 1631903 1619174 1606809 1595744 1585723 1575316 1563183 1549355 1535164
59238A535164j3109j1429j0159j0009j1056j2527j3352j3276j2923j2586j1691
$$ 1535164 1522055 1510626 1500467 1490458 1479402 1466875 1453523 1440247 1427324 1414738 1403047
59227A403047r921q105p326p658q392q906q784p780o472o145p091p657o145l032
$$ 1403047 1393126 1385021 1377695 1370037 1361645 1352739 1343955 1336175 1329703 1323558 1316467 1308810 1302665 1299633
59213A299633j75J585K671L233L077K863L486M189L256Q61p08k90O73Q04R39K080
$$ 1299633 1299458 1301043 1303714 1306947 1310024 1312887 1316373 1320562 1323818 1324679 1323971 1323681 1324354 1325158 1326097 1328177
59197A328177L046K171J65q26m53l80j535k983l593l267k312j026j31k78q88q20
$$ 1328177 1331223 1333394 1333559 1332733 1332280 1331900 1330365 1327382 1323789 1320522 1318210 1317184 1317053 1316775 1315887 1315067
59181A315067l36j019l278n428o000n637n739o337o488o062n821o120o517o468
$$ 1315067 1314731 1313712 1310434 1305006 1299006 1293369 1287630 1281293 1274805 1268743 1262922 1256802 1250285 1243817
59167A243817n775m593l655l935n445o752o570n382m754n418o911q592r857r893
$$ 1243817 1238042 1233449 1229794 1225859 1220414 1213662 1207092 1201710 1196956 1191538 1184627 1176035 1166178 1156285
59153A156285q572p487q489j1025j2464j1491r685r053r364r109p965o986o857
$$ 1156285 1147713 1140226 1131737 1120712 1108248 1096757 1087072 1078019 1068655 1059546 1051581 1044595 1037738
59140A037738p243p536p375o570n257l932k853j812r04p07r78j79K549N689P192
$$ 1037738 1030495 1022959 1015584 1009014 1003757 999825 996972 995160 994256 993549 992571 992392 994941 1000630 1007822
59125A007822P429Q641J1568J4436J5539J5251J5007J5687J7589K0541K3210K3562
$$ 1007822 1015251 1023892 1035460 1049896 1065435 1080686 1095693 1111380 1128969 1149510 1172720 1196282
59113A196282K0999J7155J3840J1212Q750O913O433O709O250M405J673j228l566
$$ 1196282 1217281 1234436 1248276 1259488 1268238 1275151 1281584 1288293 1294543 1298948 1300621 1299393 1295827
59100A295827m416l611k629l226n171o558o449n944o310p214p485o717n358l885
$$ 1295827 1291411 1287800 1285171 1281945 1276774 1270216 1263767 1257823 1251513 1244299 1236814 1230097 1224739 1220854
59086A220854k680k285k919l859m024l342l009m060o038p393p226o232n756o222
$$ 1220854 1218174 1215889 1212970 1209111 1205087 1201745 1198736 1194676 1188638 1181245 1174019 1167787 1162031 1155809
59072A155809o873o902o242n225m144l503l996n592o960o668m878l214k891l499
$$ 1155809 1148936 1142034 1135792 1130567 1126423 1122920 1118924 1113332 1106372 1099704 1094826 1091612 1088721 1085222
59058A085222l764l141k259k050k565k824k013p01m01j637l106l310k458j813
$$ 1085222 1081458 1078317 1076058 1074008 1071443 1068619 1066606 1065905 1065504 1063867 1060761 1057451 1054993 1053180
59044A053180j515l68J907L585L020J008j45K80N96p14k709l202j653L35J390
$$ 1053180 1051665 1051297 1053204 1056789 1059809 1060817 1060672 1060952 1061548 1060834 1058125 1054923 1053270 1053605 1054995
59029A054995K032L444N605P636R373J1358J3360J4263J3682J2612J1915J1129
$$ 1054995 1057027 1060471 1066076 1073712 1083085 1094443 1107803 1122066 1135748 1148360 1160275 1171404
59017A171404R495P329N519M232L064K003J311P51j33j088j410j104r47j303j726
$$ 1171404 1180899 1188228 1193747 1197979 1201043 1203046 1204357 1205108 1204975 1203887 1202477 1201373 1200426 1199123 1197397
59002A197397j748j340m50J082K787L559K881J647J141J609K225K318K069K014
$$ 1197397 1195649 1194309 1193859 1194941 1197728 1201287 1204168 1205815 1206956 1208565 1210790 1213108 1215177 1217191
58988A217191K237K267J712Q74O96J993M657P676R992J1404J2592J4248J6159
$$ 1217191 1219428 1221695 1223407 1224281 1224977 1226970 1231627 1239303 1249295 1260699 1273291 1287539 1303698
58975A303698J7478J8007J8854K1238K4821K7869K9097K8634K7102K4743K1893
$$ 1303698 1321176 1339183 1358037 1379275 1404096 1431965 1461062 1489696 1516798 1541541 1563434
58964A563434J9440J7970J6897J5227J2673R441N405M69m622q803j1986j4980
$$ 1563434 1582874 1600844 1617741 1632968 1645641 1655082 1660487 1660956 1656334 1647531 1635545 1620565
58952A620565j8149k0920k2825k4260k5917k7767k8908k8354k6054k3232k1360
$$ 1620565 1602416 1581496 1558671 1534411 1508494 1480727 1451819 1423465 1397411 1374179 1352819
58941A352819k0535j9297j6565j3145j0688r497q351o281l670j568o55r14j729
$$ 1352819 1332284 1312987 1296422 1283277 1272589 1263092 1254741 1248460 1244790 1243222 1242567 1241653 1239924
58928A239924k187j836j157q32p48k69O36J243J088N40K81O41J533K668L811M912
$$ 1239924 1237737 1235901 1234744 1233912 1233164 1232895 1233531 1234774 1235862 1236402 1236683 1237324 1238857 1241525 1245336 1250248
58912A250248N850O135N530N054O325R395J2421J4327J6481K0333K4445K5889
$$ 1250248 1256098 1262233 1267763 1272817 1279142 1288537 1300958 1315285 1331766 1352099 1376544 1402433
58900A402433K4133K1572K0330K0407K1104K2331K3883K4955K5134K4776K4125
$$ 1402433 1426566 1448138 1468468 1488875 1509979 1532310 1556193 1581148 1606282 1631058 1655183
58889A655183K3199K2765K3904K6110K7224K5895K2902J9517J6114J2964J0881
$$ 1655183 1678382 1701147 1725051 1751161 1778385 1804280 1827182 1846699 1862813 1875777 1886658
58878A886658R876Q508N757K586M85o71k018l774n215o185p234q452r197r167
$$ 1886658 1896534 1905042 1910799 1913385 1913870 1913199 1911181 1907407 1902192 1896007 1888773 1880321 1871124 1861957
58864A861957r108j0214j3037j6798j9765k0749k0421k0593k2120k4174k5638
$$ 1861957 1852849 1842635 1829598 1812800 1793035 1772286 1751865 1731272 1709152 1684978 1659340
58853A659340k6277k6285k5833k5460k5881k6715k6513k4725k2681k1735k1435
$$ 1659340 1633063 1606778 1580945 1555485 1529604 1502889 1476376 1451651 1428970 1407235 1385800
58842A385800k0513j8894j7519j6818j6481j6399j6714j7030j6505j4818j2489
$$ 1385800 1365287 1346393 1328874 1312056 1295575 1279176 1262462 1245432 1228927 1214109 1201620
58831A201620j0267q517p053n393l347j405p5J001K596M576N934O199N897N616
$$ 1201620 1191353 1182836 1175783 1170390 1167043 1165638 1165563 1166564 1169160 1173736 1179670 1185869 1191766 1197382
58817A197382N625O374P982R204Q554O696N884O491O320M169J837J132R97n08
$$ 1197382 1203007 1209381 1217363 1226567 1235121 1241817 1247701 1254192 1260512 1264681 1266518 1267650 1268647 1268139
58803A268139l145n503p566r914j1612j1323r787q880q799q340p449p201p466
$$ 1268139 1264994 1259491 1251925 1242011 1230399 1219076 1209289 1200409 1191610 1183270 1175821 1168620 1161154
58790A161154o868n088l263j954n44J309L215N082P016Q358Q436Q028Q431R295
$$ 1161154 1154286 1149198 1145935 1143981 1143437 1144746 1147961 1153043 1160059 1168417 1176853 1184881 1193312 1202607
58776A202607R239Q231P315O249L766J97k664m572p189j0863j3644j4388j4332
$$ 1202607 1211846 1220077 1227392 1233641 1237407 1237604 1234940 1230368 1223179 1212316 1198672 1184284 1169952
58763A169952j4440j3640j1316r334r535j0893j1197j0296r561r190q162o410
$$ 1169952 1155512 1141872 1130556 1121222 1111687 1100794 1089597 1079301 1069740 1060550 1052388 1045978
58751A045978n012m373l769k668j180P44L294N854P179O902O113O268P848J0154
$$ 1045978 1040966 1036593 1032824 1030156 1028976 1029720 1033014 1038868 1046047 1052949 1059062 1065330 1073178 1083332
58737A083332J1978J2480J1738J0565R629Q966Q314P622P043O695O517O210N437
$$ 1083332 1095310 1107790 1119528 1130093 1139722 1148688 1157002 1164624 1171667 1178362 1184879 1191089 1196526
58724A196526M396L931M532N617O500P580R513J1533J2092J1107J0022R378P979
$$ 1196526 1200922 1204853 1209385 1215002 1221502 1229082 1238595 1250128 1262220 1273327 1283349 1292727 1300706
58711A300706N119K002o1j608l923p043j0056j2667j5336j8301k1508k4989k8373
$$ 1300706 1305825 1307827 1307766 1306158 1302235 1295192 1285136 1272469 1257133 1238832 1217324 1192335 1163962
58698A163962l0413l0007k7588k4837k3041k2177k1322j9614j7102j4883j3994
$$ 1163962 1133549 1103542 1075954 1051117 1028076 1005899 984577 964963 947861 932978 918984
58687I18984j4056j3629j1975r691p497n533m141l961m610m543l141j699j403
$$ 918984 904928 891299 879324 869633 862136 856603 852462 848501 843891 839348 836207 834508 833105
58674H33105j422l32J629L119L807M399N108N570N940O711P595P751P001N743
$$ 833105 831683 831351 832980 836099 839906 844305 849413 854983 860923 867634 875229 882980 889981 895724
58660H95724L989J639o21j964k817m349o601q402r094r068q512p066n038l656
$$ 895724 899713 901352 900731 898767 895950 891601 885000 876598 867504 858436 849924 842858 837820 834164
58646H34164l507l788l638l225k969k644j964j211n28O36K437L613K797N51j037
$$ 834164 830657 826869 823231 820006 817037 814393 812429 811218 810690 811326 813763 817376 820173 820724 819687
58631H19687r32l57r46k554l621l276k131j069j23J053K296L140L530L728L835
$$ 819687 818755 818398 817452 814898 811277 808001 805870 804801 804678 805731 808027 811167 814697 818425 822260
58616H22260M002M770O369P816P788O418N308N518O461P040O903O137M811L503
$$ 822260 826262 831032 837401 845217 853005 859423 864731 870249 876710 883750 890653 896790 901601 905104
58602I05104L236M082M557L411J375K62Q42K491M288N560N927N807O449Q407J0484
$$ 905104 908340 912422 916979 920390 921765 922027 922869 925360 929648 935208 941135 946942 953391 961798 972282
58587I72282J1284J1285J2026J3741J5329J6523J8199K0200K0644J8386J4974
$$ 972282 983566 994851 1006877 1020618 1035947 1052470 1070669 1090869 1111513 1129899 1144873
58576A144873J3052J3507J5108J6422J7210J8168J9946K2539K5313K7704K9843
$$ 1144873 1157925 1171432 1186540 1202962 1220172 1238340 1258286 1280825 1306138 1333842 1363685
58565A363685L2256L4929L7238L8736L9450L9240L7606L4459L0390K5749K0149
$$ 1363685 1395941 1430870 1468108 1506844 1546294 1585534 1623140 1657599 1687989 1713738 1733887
58554A733887J3459O721J317k449n210p305q613r580j1352j4407j7654j9635k0375
$$ 1733887 1747346 1754067 1755384 1752935 1747725 1740420 1731807 1722227 1710875 1696468 1678814 1659179 1638804
58541A638804k1446k4161k8215l2162l4788l5805l5664l5034l4324l3292l1355
$$ 1638804 1617358 1593197 1564982 1532820 1498032 1462227 1426563 1391529 1357205 1323913 1292558
58530A292558k8555k5874k4116k2813k0894j8371j6367j5415j4653j3148j1231
$$ 1292558 1264003 1238129 1214013 1191200 1170306 1151935 1135568 1120153 1105500 1092352 1081121
58519A081121r865r272q969q688q530q382p813o623n071l593k554k086j941j708
$$ 1081121 1071256 1061984 1053015 1044327 1035797 1027415 1019602 1012979 1007908 1004315 1001761 999675 997734 996026
58505I96026j394j366j545j170P6J263J171q6j098o39J373M210P081R490J1292
$$ 996026 994632 993266 991721 990551 990627 991890 993061 992975 991877 991238 992611 996821 1003902 1013392 1024684
58490A024684J2565J3328J3629J3991J5255J7672K0486K2817K4491K5555K5663
$$ 1024684 1037249 1050577 1064206 1078197 1093452 1111124 1131610 1154427 1178918 1204473 1230136
58479A230136K4651K3306K2614K2354K1228J8384J4197R543M948N92l361o627
$$ 1230136 1254787 1278093 1300707 1323061 1344289 1362673 1376870 1386413 1391361 1391953 1388592 1381965
58467A381965q831r648r072p407m868j573J963M843O688Q098R875J2203J4777
$$ 1381965 1373134 1363486 1354414 1347007 1342139 1340566 1342529 1347372 1354060 1362158 1372033 1384236 1399013
58454A399013J6963J7429J4791R539M378J465n3k575o736j1077j4506j7253j9389
$$ 1399013 1415976 1433405 1448196 1457735 1462113 1463578 1463525 1460950 1454214 1443137 1428631 1411378 1391989
58441A391989k0140j9289j7817j6504j5001j2894j0701q992p454n504l184p21
$$ 1391989 1371849 1352560 1334743 1318239 1303238 1290344 1279643 1270651 1263197 1257693 1254509 1253788
58429A253788K083N257P927R133R131R081R518R671Q512N991L053N75j498l905
$$ 1253788 1255871 1261128 1269055 1278188 1287319 1296400 1305918 1315589 1324101 1330092 1333145 1333720 1332222 1328317
58415A328317p000j0142j2298j3101j2959j2284j1145r717q577q181q230p909
$$ 1328317 1321317 1311175 1298877 1285776 1272817 1260533 1249388 1239671 1231094 1222913 1214683 1206774
58403A206774o728n001l358j957m71J083K096K341K662L832N079N008L923L800
$$ 1206774 1200046 1195045 1191687 1189730 1189259 1190342 1192438 1194779 1197441 1201273 1206352 1211360 1215283 1219083
58389A219083N412P036O999O082O091P108P839P969Q351R179R669R696J0088J1110
$$ 1219083 1224495 1231531 1238530 1244612 1250703 1257811 1265650 1273619 1281970 1291149 1300818 1310514 1320602 1331712
58375A331712J1975J2272J2674J3700J4761J4941J4173J3314J3604J5919J9730
$$ 1331712 1343687 1355959 1368633 1382333 1397094 1412035 1426208 1439522 1453126 1469045 1488775
58364A488775K2931K3628K2204K0672K0070J9674J8795J7901J7330J6180J3506
$$ 1488775 1511706 1535334 1557538 1578210 1598280 1617954 1636749 1654650 1671980 1688160 1701666
58353A701666R979P386O708P229P498O857O014O169P511R022R979J1022J2995
$$ 1701666 1711645 1719031 1725739 1732968 1740466 1747323 1753337 1759506 1767017 1776039 1786018 1797040 1810035
58340A810035J5408J7114J8210J9971K2905K5979K7958K8590K8268K7477K6685
$$ 1810035 1825443 1842557 1860767 1880738 1903643 1929622 1957580 1986170 2014438 2041915 2068600
58329B068600K6013K4916K2867K0247J7769J5355J2660J0465J0035J1163J2215
$$ 2068600 2094613 2119529 2142396 2162643 2180412 2195767 2208427 2218892 2228927 2240090 2252305
58318B252305J2389J2523J3293J4124J4528J5175J6787J8916K0661K1802K2527
$$ 2252305 2264694 2277217 2290510 2304634 2319162 2334337 2351124 2370040 2390701 2412503 2435030
58307B435030K2763K2581K2717K3916K5978K7963K9228L0076L1418L3687L6040
$$ 2435030 2457793 2480374 2503091 2527007 2552985 2580948 2610176 2640252 2671670 2705357 2741397
58296B741397L7075L6691L6467L7607L9379M0636M1924M4482M7803N0035N0678
$$ 2741397 2778472 2815163 2851630 2889237 2928616 2969252 3011176 3055658 3103461 3153496 3204174
58285C204174N1089N2317N4090N6174N8966O2323O5296O7534O9790P2704P6125
$$ 3204174 3255263 3307580 3361670 3417844 3476810 3539133 3604429 3671963 3741753 3814457 3890582
58274C890582P9739Q3169Q5547Q6362Q6720Q8316R1280R4451R7482J00892J04308
$$ 3890582 3970321 4053490 4139037 4225399 4312119 4400435 4491715 4586166 4683648 4784540 4888848
58263D888848J06745J08660J11616J15677J19190J21443J23432J25780J28069
$$ 4888848 4995593 5104253 5215869 5331546 5450736 5572179 5695611 5821391 5949460
58254E949460J30570J34417J39547J44686J49793J56329J64601J73211J81642
$$ 5949460 6080030 6214447 6353994 6498680 6648473 6804802 6969403 7142614 7324256
58245G324256J90992K01622K12524K23658K36358K50683K64908K78444K92839
$$ 7324256 7515248 7716870 7929394 8153052 8389410 8640093 8905001 9183445 9476284
58236I476284L09163L26937L46148L67582L90695M14154M38972M67780N00538
$$ 9476284 9785447 10112384 10458532 10826114 11216809 11630963 12069935 12537715 13038253
58227A3038253N34644N70000O09878O55706P05289P57673Q15491Q80943R53830
$$ 13038253 13572897 14142897 14752775 15408481 16113770 16871443 17686934 18567877 19521707
58218A9521707J035268J128715J235501J354258J486982J640579J820254K027223
$$ 19521707 20556975 21685690 22921191 24275449 25762431 27403010 29223264 31250487
58210C1250487K265953K548080K886112L289941L774298M364535N091092N982949
$$ 31250487 33516440 36064520 38950632 42240573 46014871 50379406 55470498 61453447
58202F1453447P067290Q364408R874487J1576465J3453071J5527242J7885518
$$ 61453447 68520737 76885145 86759632 98336097 111789168 127316410 145201928
58195A45201928K0666494K3984646K7788236L1742482L5264960L7701512L8467008
$$ 145201928 165868422 189853068 217641304 249383786 284648746 322350258 360817266
58188C60817266L7053939L3065463K6453038J7804380Q286945q68615q941182
$$ 360817266 397871205 430936668 457389706 475194086 483481031 482612416 473671234
58181D73671234j5846605k1780280k6791303l0663834l3102937l3976764l3421199
$$ 473671234 457824629 436044349 409253046 378589212 345486275 311509511 278088312
58174B78088312l1781295k9466770k6819923k4062816k1322742j8680876j6199061
$$ 278088312 246307017 216840247 190020324 165957508 144634766 125953890 109754829
58167A09754829j3925100j1893322j0122452q610308p335128o267006n377047
$$ 109754829 95829729 83936407 73813955 65203647 57868519 51601513 46224466
58160D6224466m636939m018138l497001l057655k687276k372209k100849j866276
$$ 46224466 41587527 37569389 34072388 31014733 28327457 25955248 23854399 21988123
58152B1988123j663498j487102j333094j199280j082232r77341q83144q01585
$$ 21988123 20324625 18837523 17504429 16305149 15222917 14245576 13362432 12560847
58144A2560847p32491o71774o16543n67694n25559m87379m51433m19543l92724
$$ 12560847 11828356 11156582 10540039 9972345 9446786 8959407 8507974 8088431 7695707
58135G695707l68028l42681l18137k97113k79326k62965k47683k33474k19121
$$ 7695707 7327679 6984998 6666861 6369748 6090422 5827457 5579774 5346300 5127179
58126E127179k04438j91794j82772j75335j66743j57189j48172j39485j30457
$$ 5127179 4922741 4730947 4548175 4372840 4206097 4048908 3900736 3761251 3630794
58117C630794j22283j16314j11509j06165j00801r6828r3558q9110q3492p8592
$$ 3630794 3508511 3392197 3280688 3174523 3073722 2976894 2883336 2794226 2710734 2632142
58107B632142p5623p4272p3568p2198o8938o4248o0315n8088n5690n1268m5935
$$ 2632142 2556519 2482247 2408679 2336481 2267543 2203295 2142980 2084892 2029202 1977934 1931999
58096A931999m1960l9470l7040l4554l3175l3030l2892l1871k9957k7416k4965
$$ 1931999 1890039 1850569 1813529 1778975 1745800 1712770 1679878 1648007 1618050 1590634 1565669
58085A565669k3874k4555k5668k5761k5015k4357k3944k3764k4419k5837k6439
$$ 1565669 1541795 1517240 1491572 1465811 1440796 1416439 1392495 1368731 1344312 1318475 1292036
58074A292036k5269k3764k3626k4106k3345k1552k0487k0428j9871j8119j6164
$$ 1292036 1266767 1243003 1219377 1195271 1171926 1150374 1129887 1109459 1089588 1071469 1055305
58063A055305j4955j4402j4219j4301j4324j4103j4155j4781j5191j4730j4257
$$ 1055305 1040350 1025948 1011729 997428 983104 969001 954846 940065 924874 910144 895887
58052H95887j4746j5279j4277j2142j0625j0026r186q054p890q634q478o870n772
$$ 895887 881141 865862 851585 839443 828818 818792 809606 801552 793662 785028 776550 769680 763908
58039G63908o876r190j0656j0804j0549j0391j0146r840r763r833r697r334r048
$$ 763908 757032 747842 737186 726382 715833 705442 695296 685456 675693 665860 656163 646829 637781
58026F37781r041r267r527r549r245q831q445p870p126o942p796q636p645m573
$$ 637781 628740 619473 609946 600397 591152 582321 573876 566006 558880 551938 544142 535506 527861 523288
58012E23288j412l55j678l944n630o162n783m908l661k015m29J77m21j035m13
$$ 523288 521876 521521 519843 515899 510269 504107 498324 493416 489755 487740 487311 487488 487067 486032 485619
57997D85619R50J322Q2j495k026j658j522k275l613m736m883l980k902k628k848
$$ 485619 486569 487891 487973 486478 484452 482794 481272 478997 475384 470648 465765 461785 458883 456255 453407
57982D53407k203j94J862K336J187k77j048j088o91J7Q53J454J642J610J542J387
$$ 453407 451204 451010 452872 455208 456395 456118 455070 453982 453291 453308 454161 455615 457257 458867 460409 461796
57966D61796J179J347K268L405L377J332j912m570n898o858q523j0372j0882r470
$$ 461796 462975 464322 466590 469995 473372 474704 472792 468222 462324 455466 446943 436571 425689 416219
57952D16219p165n279m142l270k151o23J111K360K272Q08o41j97K615O148Q174
$$ 416219 409054 403775 399633 396363 394212 393589 394700 397060 399332 400140 399499 399302 401917 408065 416239
57937D16239Q056P168P072P786Q112P276N702M252L328K676J670k16k789n045
$$ 416239 424295 431463 438535 446321 454433 461709 467411 471663 474991 477667 479337 479121 476332 471287
57923D71287o165o498o991p860q560q921r218r165q141o552n600n246l980j475
$$ 471287 465122 458624 451633 443773 435213 426292 417074 407909 399768 393216 387616 382370 378390 376915
57909C76915K59k58j465r54R36J866J172M36M85J94j158k427k502k018k054k356
$$ 376915 377174 376916 375451 374497 375433 377299 378471 378907 379392 379586 378428 376001 373499 371481 369427 367071
57893C67071k039j151m00J23R07K054L173L956M234L765K611J473J063J241J282
$$ 367071 365032 363881 363481 363604 364511 366565 369738 373694 377928 381693 384304 385777 386840 388081 389363
57878C89363Q35J75l19m60p3J006K607M172N179N552N567N391M896M014L141K847
$$ 389363 390198 390373 390054 389594 389521 390527 393134 397306 402485 408037 413604 418995 423891 427905 431046 433893
57862D33893L193L736M337N284O380O603N428L868L220L180K369N83o96l25J014
$$ 433893 437086 440822 445159 450443 456823 463426 468854 472722 475942 479122 481491 482074 481378 481053 482067
57847D82067J834J529N99k42o65q48j252j918k025q02J109K065J353j70j518k527
$$ 482067 483901 485430 486029 485787 485122 484274 483022 481104 479079 478277 479386 481451 482804 482634 481116 478589
57831D78589k975k133j02J450J213J84L46J836K874K486J844K351L588L998K941
$$ 478589 475614 473481 473379 474829 476042 476226 476572 478408 481282 483768 485612 487963 491551 495549 498490
57816D98490J173m18j697k841l751m401n344p194r548j1083j1068j0295r997j0167
$$ 498490 499663 499245 497548 494707 490956 486555 481211 474017 464469 453386 442318 432023 422026 411859
57802D11859r774q475p218o854o965o502n208l809l098l164l398l015j793l76
$$ 411859 402085 393610 386392 379538 372573 366071 360863 357054 353956 350792 347394 344379 342586 342210
57788C42210M04N10N86Q57Q96O69J021K467M096M432L209J680J231K123L429L919
$$ 342210 342614 343124 343710 344567 345463 346132 347153 349620 353716 358148 361357 363037 364268 366391 369820 373739
57772C73739L131J845J324J976L051L652L497K445K83k375l750k593M7J761J401
$$ 373739 376870 378715 380039 382015 385066 388718 392215 394660 394943 392568 388818 386225 386272 388033 389434
57757C89434k2r15o60M56J845K821K961K710L034M169N301N857O407P634Q908
$$ 389434 389412 388497 387837 388293 390138 392959 395920 398630 401664 405833 411134 416991 423398 431032 439940
57742D39940Q755O751M214K869L303M852O428P048O102L832J597Q70J554J851
$$ 439940 448695 455446 459660 462529 465832 470684 477112 484160 490262 494094 495691 496561 498115 499966
57728D99966M05j815k544j066R91J898J804J659J094j189n040q281r042p809o446
$$ 499966 500371 498556 496012 494946 495937 497835 499639 501298 502392 501203 496163 487882 478840 471031 464585
57713D64585n873n579n086m788n080n472n090l759k144j071j029j975l190l487
$$ 464585 458712 453133 448047 443259 438179 432707 427617 423858 421714 420643 419614 417639 414449 410962
57699D10962k315n89K26k8k7J081K469K899K399J831J433R31P27J679L612N200
$$ 410962 408647 408058 408284 408256 408229 409310 411779 414678 417077 418908 420341 421272 421999 423678 427290 432490
57683D32490N715O048P638J1031J5688K0549K4642K7884L1453L6556M2831M8853
$$ 432490 438205 444253 451891 462922 478610 499159 523801 551685 583138 619694 662525 711378
57671G11378N4248N9835O5402O8941O8851O5326N8489M6851K9540R042j0401k6727
$$ 711378 765626 825461 890863 959804 1028655 1093981 1152470 1199321 1228861 1237903 1227502 1200775
57659A200775m0673n2707o1476o5676o5899o3820o0528n6197n0658m4033l7170
$$ 1200775 1160102 1107395 1045919 980243 914344 850524 789996 733799 683141 639108 601938
57648F01938l1318k6738k2175j6787j1950r605r190q204n859m042l963m100k693
$$ 601938 570620 543882 521707 504920 492970 483365 474175 465971 460112 456070 452107 448007 445314
57635D45314n22M96J46l36m91q63j573k203k803l674m427m458m098m044l952k978
$$ 445314 444792 445288 445434 445098 444607 443744 442171 439968 437165 433491 429064 424606 420508 416464 412512 409534
57619D09534j589j294k470l792m167l930l661l058j812o49n10j249j915j975j590
$$ 409534 407945 406651 404181 400389 396222 392292 388631 385573 383761 383112 382602 381353 379438 377463 375873
57604C75873j053n94n96j316k389l016k784k046j496j575k312l472m585m993m260
$$ 375873 374820 374226 373630 372314 369925 366909 364125 362079 360583 359008 356696 353224 348639 343646 339386
57589C39386k902k322l363m996n277l835k383k204k279j033R50J724R42J36p5
$$ 339386 336484 334162 330799 325803 320526 316691 314308 312104 309825 308792 309742 311466 312408 312544 312469
57574C12469r91l357n755o584o217n861n522m578l380k584j667J50J954K102R00
$$ 312469 311478 308121 302366 295782 289565 283704 278182 273604 270224 267640 265973 266123 268077 270179 271079
57559B71079L47R26P64j247l228k552Q81M813P242P703O582M513K334P84P1J68
$$ 271079 271426 272352 273116 271869 268641 266089 266970 271783 279025 286728 293310 297823 300157 300941 301012 301180
57543C01180J102K588L772M020L551K858J965Q57J03K31R75J857K990M396N138
$$ 301180 302282 304870 308642 312662 316213 319071 321036 321893 321996 322227 323202 325059 328049 332445 337583
57528C37583M342K853K511L757N124N187L865J729n42j632p9L761P344Q609Q176
$$ 337583 341925 344778 347289 351046 356170 361357 365222 366951 366409 364777 364698 368459 375803 384412 392588
57513C92588P927Q222P847O245M374L350L248L407L125K044N85o6P15J785J384
$$ 392588 400515 408737 416584 422829 427203 430553 433801 437208 440333 442377 442962 442896 443611 445396 446780
57498D46780l48j290k63J140P48r99j523M46L263M544L798K310J280J017J493
$$ 446780 446432 445142 444879 446019 446767 445768 444245 444691 447954 452498 456296 458606 459886 460903 462396
57483D62396K588L805M545M751M701M151K612N72n79l30J57j44n08L57K150L341
$$ 462396 464984 468789 473334 478085 482786 486937 489549 490121 489542 489212 489369 489225 488717 489074 491224 494565
57467D94565L271K546J588L50m76L28K538M202M139L452L646M462M795M720N171
$$ 494565 497836 500382 501970 502320 501844 502172 504710 508912 513051 516503 520149 524611 529406 534126 539297
57452E39297O210O986P197P322P522P356O684O032O027O949Q471R454Q634O376
$$ 539297 545507 552493 559690 567012 574534 581890 588574 594606 600633 607582 616053 625507 634141 640517
57438F40517M934N769P366P252N628N085O830R187J0334J0542J0799J0811R703
$$ 640517 645451 651220 658586 665838 671466 676551 683381 692568 702902 713444 724243 735054 744757
57425G44757P768O271O038O936Q255R034Q680P837P925R254J0468J0412R675R485
$$ 744757 752525 758796 764834 771770 780025 789059 797739 805576 813501 822755 833223 843635 853310 862795
57411H62795J0009J0621J0995J0863R584P274N714O654R404J1565J2003J1768
$$ 862795 872804 883425 894420 905283 914867 922141 927855 934509 943913 955478 967481 979249
57399I79249J2018J2403J2112J1324J0921J1317J2121J2712J2765J2494J2448
$$ 979249 991267 1003670 1015782 1027106 1038027 1049344 1061465 1074177 1086942 1099436 1111884
57388A111884J2891J3500J3943J4358J4813J4835J4276J4207J5722J8082J9373
$$ 1111884 1124775 1138275 1152218 1166576 1181389 1196224 1210500 1224707 1240429 1258511 1277884
57377A277884J9118J8748J9083J9038J7739J6469J6944J8522J8913J7420J5869
$$ 1277884 1297002 1315750 1334833 1353871 1371610 1388079 1405023 1423545 1442458 1459878 1475747
57366A475747J6105J7773J9259J9704J9507J9307J9228J8947J8188J7132J6329
$$ 1475747 1491852 1509625 1528884 1548588 1568095 1587402 1606630 1625577 1643765 1660897 1677226
57355A677226J5972J5463J4270J3064J3136J4495J5517J5016J3831J3513J4196
$$ 1677226 1693198 1708661 1722931 1735995 1749131 1763626 1779143 1794159 1807990 1821503 1835699
57344A835699J4770J4685J4398J4257J4213J4586J5847J7402J7989J7641J7829
$$ 1835699 1850469 1865154 1879552 1893809 1908022 1922608 1938455 1955857 1973846 1991487 2009316
57333B009316J9060J9857J9198J8432J9193K0573K0443J8876J8041J8842J9905
$$ 2009316 2028376 2048233 2067431 2085863 2105056 2125629 2146072 2164948 2182989 2201831 2221736
57322B221736K0171K0392K1281K1988K1448J9884J8113J6718J6607J8742K2159
$$ 2221736 2241907 2262299 2283580 2305568 2327016 2346900 2365013 2381731 2398338 2417080 2439239
57311B439239K3919K2623K0573K0600K2029K2018K0160J9060K0353K2504K3238
$$ 2439239 2463158 2485781 2506354 2526954 2548983 2571001 2591161 2610221 2630574 2653078 2676316
57300B676316K2320K1037K0263J9970J9771J9311J8677J8689J9970K1742K2529
$$ 2676316 2698636 2719673 2739936 2759906 2779677 2798988 2817665 2836354 2856324 2878066 2900595
57289B900595K2144K1848K2262K2533K2017K1595K2316K3704K4300K3392K1505
$$ 2900595 2922739 2944587 2966849 2989382 3011399 3032994 3055310 3079014 3103314 3126706 3148211
57278C148211J9696J8838J9053J9436J8863J7481J6760J7684J9663K1498K2583
$$ 3148211 3167907 3186745 3205798 3225234 3244097 3261578 3278338 3296022 3315685 3337183 3359766
57267C359766K2716K1722K0048J8862J8774J9037J8675J7679J6541J5323J3945
$$ 3359766 3382482 3404204 3424252 3443114 3461888 3480925 3499600 3517279 3533820 3549143 3563088
57256C563088J2661J1440R758P808P002Q175J0137J1240J1674J2810J4858J6842
$$ 3563088 3575749 3587189 3596947 3604755 3611757 3619932 3630069 3641309 3652983 3665793 3680651 3697493
57244C697493J8557K0795K3495K5308K5466K4757K4099K3213K1288J8069J3762
$$ 3697493 3716050 3736845 3760340 3785648 3811114 3835871 3859970 3883183 3904471 3922540 3936302
57233C936302Q646L361j030l907n760p687j0377j3610j6389j7693j7472j6734
$$ 3936302 3944948 3948309 3947279 3943372 3937612 3929925 3919548 3905938 3889549 3871856 3854384 3837650
57221C837650j6178j5132j2655r203o083l397J26N125J0702J5835K0519K5028
$$ 3837650 3821472 3806340 3793685 3784482 3778399 3775002 3775128 3780253 3790955 3806790 3827309 3852337
57209C852337K9133L2706L6136L9472M2000M3313M3994M4639M5031M4894M4568
$$ 3852337 3881470 3914176 3950312 3989784 4031784 4075097 4119091 4163730 4208761 4253655 4298223
57198D298223M4101M2623L9626L6203L3785L2118K9665K5808K1484J7667J4205
$$ 4298223 4342324 4384947 4424573 4460776 4494561 4526679 4556344 4582152 4603636 4621303 4635508
57187D635508J0410N988J080m177r827j5965k2481k9042l5646m3260n3115o4944
$$ 4635508 4645918 4651906 4652986 4648809 4638982 4623017 4600536 4571494 4535848 4492588 4439473 4374529
57175D374529p6621q6266r4318j02853j13308j25605j38990j52716j66027j78429
$$ 4374529 4297908 4211642 4117324 4014471 3901163 3775558 3636568 3483852 3317825 3139396
57165C139396j90047k01090k11130k19520k26473k32895k39166k44783k49069
$$ 3139396 2949349 2748259 2537129 2317609 2091136 1858241 1619075 1374292 1125223
57156A125223k51591k51992k50174A24758a17492k36751k30070k23425k18904
$$ 1125223 873632 621640 371466 124758 -117492 -354243 -584313 -807738 -1026642
57147a026642k17163k16689k16023k15969k18748k25542k35766k48544k63811
$$ -1026642 -1243805 -1460494 -1676517 -1892486 -2111234 -2336776 -2572542 -2821086 -3084897
57138c084897k81540l00618l19135l35708l50011l62050l71712l79839l89164
$$ -3084897 -3366437 -3667055 -3986190 -4321898 -4671909 -5033959 -5405671 -5785510 -6174674
57129f174674m02988m22582m46832m74853n08008n48607n97538o54020p16961
$$ -6174674 -6577662 -7000244 -7447076 -7921929 -8429937 -8978544 -9576082 -10230102 -10947063
57120a0947063p85299q57560r32623j011213j095910j189891j296546j420150
$$ -10947063 -11732362 -12589922 -13522545 -14533758 -15629668 -16819559 -18116105 -19536255
57112a9536255j565767j738186j941753k181425k463973k799067l200738l688352
$$ -19536255 -21102022 -22840208 -24781961 -26963386 -29427359 -32226426 -35427164 -39115516
57104c9115516m286108n022491n930673p047833q410915j0050104j1981643j4198536
$$ -39115516 -43401624 -48424115 -54354788 -61402621 -69813536 -79863640 -91845283 -106043819
57096a06043819j6659830j9285344k1959672k4536513k6832256k8616295k9622431
$$ -106043819 -122703649 -141988993 -163948665 -188485178 -215317434 -243933729 -273556160
57089b73556160k9598198k8383622k5990008k2640030j8736968j4762856j1150562
$$ -273556160 -303154358 -331537980 -357527988 -380168018 -398904986 -413667842 -424818404
57082d24818404q186943n965461m370354l093898j722421J07854K568557N609687
$$ -424818404 -433005347 -438970808 -443341162 -446435060 -448157481 -448049627 -445481070 -439871383
57074d39871383R044049J2647892J6199498J9475028K2262606K4405264K5830947
$$ -439871383 -430827334 -418179442 -401979944 -382504916 -360242310 -335837046 -310006099
57067c10006099K6542969K6589184K6039057K4975649K3494218K1701277J9711030
$$ -310006099 -283463130 -256873946 -230834889 -205859240 -182365022 -160663745 -140952715
57060a40952715J7636466J5577111J3610303J1789439J0145843Q691660P424816
$$ -140952715 -123316249 -107739138 -94128835 -82339396 -72193553 -63501893 -56077077
57053e6077077O335302N408849M627338L970319L419175K959437K578247K261286
$$ -56077077 -49741775 -44332926 -39705588 -35735269 -32316094 -29356657 -26778410 -24517124
57045b4517124J994093J765965J570942J404866J262722J139098J030052R33586
$$ -24517124 -22523031 -20757066 -19186124 -17781258 -16518536 -15379438 -14349386 -13415800
57037a3415800Q48418P72855P05043O43989N90008N44100N06863M77544M53571
$$ -13415800 -12567382 -11794527 -11089484 -10445495 -9855487 -9311387 -8804524 -8326980 -7873409
57028g873409M30991M06158L77672L46810L16106K87760K63014K42120K24468
$$ -7873409 -7442418 -7036260 -6658588 -6311778 -5995672 -5707912 -5444898 -5202778 -4978310
57019d978310K09322J96690J86881J79142J71686J63643J55990J49789J44415
$$ -4978310 -4768988 -4572298 -4385417 -4206275 -4034589 -3870946 -3714956 -3565167 -3420752
57010c420752J38521J32000J25733J19887J13848J07626J01909R6643R0854Q4258
$$ -3420752 -3282231 -3150231 -3024498 -2904611 -2790763 -2683137 -2581228 -2484585 -2393731 -2309473
57000b309473P8014P3309P0017O7238O4518O1965N9579N7127N4656N2785N2287
$$ -2309473 -2231459 -2158150 -2088133 -2020895 -1956377 -1894412 -1834833 -1777706 -1723050 -1670265 -1617978
56989a617978N3215N4415N4270N2239M9349M6846M4842M2743M0488L8473L6628
$$ -1617978 -1564763 -1510348 -1456078 -1403839 -1354490 -1307644 -1262802 -1220059 -1179571 -1141098 -1104470
56978a104470L4531L2354L0724K9646K8472K7106K6269K6382K7046K8002K9653
$$ -1104470 -1069939 -1037585 -1006861 -977215 -948743 -921637 -895368 -868986 -841940 -813938 -784285
56967g84285L2096L4406L5626L6034L6698L7987L9214L9691L9485L8859L7424
$$ -784285 -752189 -717783 -682157 -646123 -609425 -571438 -532224 -492533 -453048 -414189 -376765
56956c76765L4378K9675K4487J9957J5854J1153N988J987K80J92N80J500L369
$$ -376765 -342387 -312712 -288225 -268268 -252414 -241261 -235273 -233286 -233006 -232814 -232234 -230734 -227365
56943b27365N423O539P255R275J2915J6654J9426K1848K4686K7457K9255a6834
$$ -227365 -221942 -215403 -208148 -198873 -185958 -169304 -149878 -128030 -103344 -75887 -46632 -16834
56930A2099K6179K1521J5843R836L441k983q089j1115j2997j4807j5938G754e458
$$ 12099 38278 59799 75642 85478 88919 85936 77847 66732 53735 38928 22990 7754 -5458
56916a7052j0878r900p760m920k237j51R21O24k92l6K303N479P494P786P238O408
$$ -17052 -27930 -37830 -45590 -50510 -52747 -52898 -51977 -51353 -51645 -51681 -49378 -43899 -36405 -28619 -21381 -14973
56900a4973M979L190K718I00Q981J1753J1692J0341J0373J2249J3958J3901J2833
$$ -14973 -9994 -6804 -4086 900 9881 21634 33326 43667 54040 66289 80247 94148 106981
56887A06981J2517J3355J4090J3393J1024P701M385J744q0j251j842j799j257
$$ 106981 119498 132853 146943 160336 171360 179061 183446 185190 185110 183859 182017 180218 178961
56874A78961n17L62J568L124M896P078R982J3357J6513J9321K2316K5559K8166
$$ 178961 178444 178806 180374 183498 188394 195472 205454 218811 235324 254645 276961 302520 330686
56861C30686K9287K8697K6189K1409J4915Q399L043j453n447q123q886q915r687
$$ 330686 359973 388670 414859 436268 451183 459582 462625 461172 455725 447602 438716 429801 420114
56848D20114j0507r234n311l93M099Q413J3155J8140K3282K9256L6250M2752M6511
$$ 420114 409607 400373 395062 394669 398768 407181 420336 438476 461758 491014 527264 570016 616527
56835F16527M6394M2863L7066K9856K1391J1315k84j1913k1303k7317l0761l2987
$$ 616527 662921 705784 742850 772706 794097 805412 805128 793215 771912 744595 713834 680847
56823F80847l4210l3714l1218k7432k3254j8898j3903p889j186N295J0923J5823
$$ 680847 646637 612923 581705 554273 531019 512121 498218 490329 489143 494438 505361 521184
56811E21184K0340K4273K6899K7386K4903J8844R817R4p870j3571j8357k3278
$$ 521184 541524 565797 592696 620082 644985 663829 673646 673740 665870 652299 633942 610664
56799F10664k7753l0487l0778k8703k4877k0423j6489j3216r730n402o83L568
$$ 610664 582911 552424 521646 492943 468066 447643 431154 417938 408208 402806 402123 405691
56787D05691O929R351J0969J2283J3857J5292J5211J2720Q427L598r90n032q313
$$ 405691 412620 421971 432940 445223 459080 474372 489583 502303 510730 514328 513338 508306 499993
56774D99993j1025j3760j6567j8578j9272j9390j9736j9681j7980j4674j1209
$$ 499993 488968 475208 458641 440063 420791 401401 381665 361984 344004 329330 318121
56763C18121q815p674p400p343o557m584k313j092j015j043q99j545l411n272
$$ 318121 309306 301632 294232 286889 280332 275748 273435 272343 271328 270285 269386 267841 264430 259158
56749B59158n592m194j984J47J438J157n37k063j852k41R98J001O50Q80J212N95
$$ 259158 253566 249372 247388 247535 248973 250130 249593 247530 245678 245437 246435 247436 248086 248966 250178 250773
56733B50773q90k032j978j008J29R95J403J239P24O18J540L103M073L564J884
$$ 250773 249883 247851 245873 244865 244994 245989 247392 248631 249355 249973 251513 254616 258689 262253 264137
56718B64137J81o13l57N02J503K495L428M015L831K901J898J429J286Q75K74K91
$$ 264137 264318 263705 263348 263850 265353 267848 271276 275291 279122 282023 283921 285350 286636 287511 287785 288076
56702B88076J295K545K986K384J317M01j04j70L2K24K98M38O60O55L84M66J343
$$ 288076 289371 291916 294902 297286 298603 299004 298900 298730 298762 298986 299284 299722 300382 301037 301421 301887 303230
56685C03230K471K964K949L330M304M950M590L659K759J679N4j520k000j294m08
$$ 303230 305701 308665 311614 314944 319248 324198 328788 332447 335206 336885 336939 335419 333419 332125 331717
56670C31717j55l55m11r8L64O18L28o06j747k317j861p09L60O84J24p74r60J73
$$ 331717 331562 331207 330796 330698 331062 331680 332008 331402 329655 327338 325477 324768 325128 325812 325936 325162 324202 324375
56652C24375J860K541J703N40K66N03L18K36J666M147M964K551r81k169l89J935
$$ 324375 326235 328776 330479 331019 331285 331788 332106 332342 334008 338155 343119 345670 344689 342520 342131 344066
56636C44066K914L046L141K504M96j547j858j034j312l107m146k737k04J008N02
$$ 344066 346980 350026 353167 355671 356167 354620 352762 351728 350416 347309 343163 340426 340222 341230 341732
56621C41732k99o78j300k384k811j660L53J680J602O02m23q83q12p69j120j277
$$ 341732 341433 340755 339455 337071 334260 332600 332953 334633 336235 336837 336414 335531 334719 333950 332830 331553
56605C31553l93J060J434K62p24m2J106N97j044j068J289L379K935J312J204K566
$$ 331553 331160 332220 333654 333916 333192 333150 334256 334853 333809 332741 334030 337409 340344 341656 342860 345426
56589C45426K972J458k19l46N88J137R40N39J63k83n15j9J079J977K080J650J440
$$ 345426 348398 349856 349637 349291 349879 351016 351956 352495 352658 352375 351860 351841 352920 354897 356977 358627 360067
56572C60067J804K240K022J353J503L363O100P901P948P063O434O458O963P643
$$ 360067 361871 364111 366133 367486 368989 372352 378452 386353 394301 401364 407798 414256 421219 428862
56558D28862P856O810M579K394J242N68q32l018m751n100m413l541k828k279k206
$$ 428862 436718 443528 448107 450501 451743 452311 451479 448461 443710 438610 434197 430656 427828 425549 423343
56543D23343k965l995l781j418J834L296J677j260k558j505k34p58k383k849j342
$$ 423343 420378 416383 412602 411184 413018 416314 417991 416731 414173 412668 412434 411676 409293 406444 405102
56528D05102O76J517J152Q32J416K483K824J628n99k307k356j220m05p01j506
$$ 405102 405778 407295 408447 409279 410695 413178 416002 417630 417031 414724 412368 411148 410743 410042 408536
56513D08536j969k071k114j771n82Q45J111j16j419j451q27j203k754l718k740
$$ 408536 406567 404496 402382 400611 400029 400874 401985 401869 400450 398999 398172 396969 394215 390497 387757
56498C87757o94N08K65m43o83n40m20k37L00J016J275O28n99j345p24Q74J966
$$ 387757 387063 387571 387836 387393 386710 386170 385750 385513 385813 386829 388104 388732 388133 386788 386064 386938 388904
56481C88904J676Q65R12J704J856Q41k01k48Q3m34j753k637k281r91O09K124L036
$$ 388904 390580 391445 392357 394061 395917 396758 396557 396309 396392 395958 394205 391568 389287 388296 388905 391029 394065
56464C94065K721J374K96N58J549J689N52n41n03n8m62j275r32O86J920J982K197
$$ 394065 396786 398160 398456 399014 400563 402252 402804 402263 401760 401702 401240 399965 399033 399719 401639 403621 405818
56447D05818L541M615L670J494K76L51K49l79k68Q07J209J00j097r87l14n11j460
$$ 405818 409359 413974 417644 419138 419414 419765 420014 419635 419367 420174 421383 421483 420386 419399 419085 418574 417114
56430D17114k021j796j149k41Q26J542J549J080L72m67o39Q58L213L955K325Q11
$$ 417114 415093 413297 412148 411907 412733 414275 415824 416904 417276 416809 416170 417028 420241 424196 426521 427332
56414D27332J562K996K148p79k836k590j297q8J265K453K138L28q62n8J453J777
$$ 427332 428894 431890 434038 433259 430423 427833 426536 426448 427713 430166 432304 432632 431770 431712 433165 434942
56398D34942J021N81Q59J043O21L5KP07J506J348j5j251p06J521L667M519M488
$$ 434942 435963 436544 437403 438446 439067 439102 439104 439811 441317 442665 442650 441399 440693 442214 445881 450400 454888
56381D54888M310L948L300K823K737K596K212K061K179J688K28j116j169j61J003
$$ 454888 459198 463146 466446 469269 472006 474602 476814 478875 481054 482742 482970 481854 480685 480524 481527
56366D81527K106L195L569K513P30j62M80J745K533K682K731L137L797M044L279
$$ 481527 483633 486828 490397 492910 493640 493478 493958 495703 498236 500918 503649 506786 510583 514627 517906
56351E17906J814P95R81J969K958L722M312M385L645K563J896J728J698J936K853
$$ 517906 519720 520515 521496 523465 526423 530145 534457 538842 542487 545050 546946 548674 550372 552308 555161
56336E55161M110M669M104L214L060L862M977N635N503M986M958N898P073P039
$$ 555161 559271 563940 568044 571258 574318 578180 583157 588792 594295 599281 604239 610137 617210 624249
56322F24249N193K551O84R4L4k06l00N39K306L996M588L872K355R26P27K556N769
$$ 624249 629442 631993 632677 632771 632805 632599 632299 632838 635144 639140 643728 647600 649955 650881 651608 654164 659933
56305F59933Q339Q816Q026P957R127J0044R396P801O977P774R540J0905J0970
$$ 659933 668272 677088 685114 693071 702198 712242 721638 729439 736416 744190 753730 764635 775605
56292G75605J0089R685J0868J3110J4747J4869J4139J3684J3950J4830J6138J7444
$$ 775605 785694 795379 806247 819357 834104 848973 863112 876796 890746 905576 921714 939158
56280I39158J8074J7805J7270J7418J8801K1354K4296K6361K6951K7122K8535
$$ 939158 957232 975037 992307 1009725 1028526 1049880 1074176 1100537 1127488 1154610 1183145
56269A183145L1342L4196L6478L9146M2877M6929N0822N5785O3081P1853Q0194
$$ 1183145 1214487 1248683 1285161 1324307 1367184 1414113 1464935 1520720 1583801 1655654 1735848
56258A735848Q7819R6200J06368J18000J30634J44483J59859J76618J94316K12152
$$ 1735848 1823667 1919867 2026235 2144235 2274869 2419352 2579211 2755829 2950145 3162297
56248C162297K28899K43662K56614K68232K77909K84180K86120K83579K76075
$$ 3162297 3391196 3634858 3891472 4159704 4437613 4721793 5007913 5291492 5567567
56239E567567K62582K42626K16812J86010J50818J12098P1211K9308j3019n5013
$$ 5567567 5830149 6072775 6289587 6475597 6626415 6738513 6809724 6839032 6826013 6771000
56229F771000r5148j31718j63708j90881k13292k31059k44329k53249k57881k58230
$$ 6771000 6675852 6544134 6380426 6189545 5976253 5745194 5500865 5247616 4989735 4731505
56219D731505k54504k47500k38664k29288k19466k08319j95479j81756j68085
$$ 4731505 4477001 4229501 3990837 3761549 3542083 3333764 3138285 2956529 2788444
56210B788444j54606j41457j29602j19758j11109j02360r3745q6570q0811p4720
$$ 2788444 2633838 2492381 2362779 2243021 2131912 2029552 1935807 1849237 1768426 1693706
56200A693706o7252n9517n3159m8350m4183m0113l6062l1800k7336k3496k1151
$$ 1693706 1626454 1566937 1513778 1465428 1421245 1381132 1345070 1313270 1285934 1262438 1241287
56189A241287j9971j8834j7293j5740j4152j1783q462n366l809l836m558n301
$$ 1241287 1221316 1202482 1185189 1169449 1155297 1143514 1135052 1129686 1125877 1122041 1117483 1112182
56177A112182n664m983k903m31Q00N75M88J826M079O052P415Q304Q504Q209Q682
$$ 1112182 1106518 1101535 1098632 1098201 1099001 1099576 1100064 1101890 1105969 1112021 1119436 1127740 1136244 1144453 1153135
56162A153135J0652J2750J3258J2916J3982J6676J8874J9527K0043K1482K2841
$$ 1153135 1163787 1176537 1189795 1202711 1216693 1233369 1252243 1271770 1291813 1313295 1336136
56151A336136K3532K5392L0194L6728M2541M7532N3638O1639P0432P9170Q8036
$$ 1336136 1359668 1385060 1415254 1451982 1494523 1542055 1595693 1657332 1727764 1806934 1894970
56140A894970R6787J04183J09294J12083J12577J10569J06256J00193R2607Q3732
$$ 1894970 1991757 2095940 2205234 2317317 2429894 2540463 2646719 2746912 2839519 2923251
56130B923251P4642O6655N9824N3021M5387L6881K7679J8145R164J321o151j4663
$$ 2923251 2997893 3064548 3124372 3177393 3222780 3259661 3287340 3305485 3314649 3315970 3309819 3295156
56118C295156k4686l5911m8411o2130p5474q6107r3315r8189j01377j02196j00260
$$ 3295156 3270470 3234559 3186148 3124018 3048544 2962437 2869122 2770933 2669556 2567360 2467100
56107B467100r6484r1876q6435p9785p1872o2869n3356m4633l7606l1369k4373
$$ 2467100 2370616 2278740 2192305 2112520 2040648 1977779 1924423 1879790 1842184 1810815 1786442
56096A786442j7051j1509q335n641k126R71K184K483L936O831R790J2001J3752
$$ 1786442 1769391 1757882 1749547 1743906 1741780 1742751 1744935 1747418 1751354 1758185 1767975 1779976 1793728
56083A793728J5145J5845J6062J6629J7863J9192K0040K0568K1315K2440K3488
$$ 1793728 1808873 1824718 1840780 1857409 1875272 1894464 1914504 1935072 1956387 1978827 2002315
56072B002315K3880K3823K4515K6956L0496L3176L3711L2676L1634L1673L2845
$$ 2002315 2026195 2050018 2074533 2101489 2131985 2165161 2198872 2231548 2263182 2294855 2327700
56061B327700L4319L4836L3722L1805L0781L1422L2872L3820L3825L3376L3232
$$ 2327700 2362019 2396855 2430577 2462382 2493163 2524585 2557457 2591277 2625102 2658478 2691710
56050B691710L3862L5058L6131L6982L8657M2080M6405M9716N1373N2664N4958
$$ 2691710 2725572 2760630 2796761 2833743 2872400 2914480 2960885 3010601 3061974 3114638 3169596
56039C169596N8182O1396O3987O6015O7972P0321P2857P4802P6073P7703Q0115
$$ 3169596 3227778 3289174 3353161 3419176 3487148 3557469 3630326 3705128 3781201 3858904 3939019
56028C939019Q1841Q1505Q0375Q1104Q4219Q7867R0848R3856R7544J01404J05102
$$ 3939019 4020860 4102365 4182740 4263844 4348063 4435930 4526778 4620634 4718178 4819582 4924684
56017D924684J09082J13489J18130J23637J30764J38376J44305J48592J53590
$$ 4924684 5033766 5147255 5265385 5389022 5519786 5658162 5802467 5951059 6104649
56008F104649J60504J68259J76287J85635J96255K06013K13961K22213K32927
$$ 6104649 6265153 6433412 6609699 6795334 6991589 7197602 7411563 7633776 7866703
55999G866703K45645K59175K73899K90318L07371L24206L41998L62124L84031
$$ 7866703 8112348 8371523 8645422 8935740 9243111 9567317 9909315 10271439 10655470
55990A0655470M06638M30374M56397M85283N17791N55103N96987O41578O88361
$$ 10655470 11062108 11492482 11948879 12434162 12951953 13507056 14104043 14745621 15433982
55981A5433982P39560P97308Q61688R32875J012833J103516J205786J321614J454837
$$ 15433982 16173542 16970850 17832538 18765413 19778246 20881762 22087548 23409162 24863999
55972B4863999J608677J785717J991604K235533K526190K872186L288494L797994
$$ 24863999 26472676 28258393 30249997 32485530 35011720 37883906 41172400 44970394
55964D4970394M424986N192817O128754P260910Q602785J0146625J1879466J3805443
$$ 44970394 49395380 54588197 60716951 67977861 76580646 86727271 98606737 112412180
55956A12412180J5956686J8395187K1195547K4376625K7795887L1098497L3783275
$$ 112412180 128368866 146764053 167959600 192336225 220132112 251230609 285013884
55949B85013884L5311200L5144830L2763504K7819163K0437313J1389279J870993
$$ 285013884 320325084 355469914 388233418 416052581 436489894 447879173 449750166
55942D49750166p010848j4637132k0870344k5754018k9258314l1277201l1796542
$$ 449750166 442739318 428102186 407231842 381477824 352219510 320942309 289145767
55935B89145767l1018914k9324294k7117627k4696370k2220394j9763375j7374034
$$ 289145767 258126853 228802559 201684932 176988562 154768168 135004793 117630759
55928A17630759j5103517j3004050j1118730r471592q062513o872271n874445
$$ 117630759 102527242 89523192 78404462 68932870 60870357 53998086 48123641
55921D8123641n042698m350288l770370l280763k866166k514313k213152j953241
$$ 48123641 43080943 38730655 34960285 31679522 28813356 26299043 24085891 22132650
55913B2132650j729483j537936j373041j229547j104707r96615r02405q19700
$$ 22132650 20403167 18865231 17492190 16262643 15157936 14161321 13258916 12439216
55905A2439216p47823o85865o31282n81792n36921m96350m58673m23239l91302
$$ 12439216 11691393 11005528 10374246 9792454 9255533 8759183 8300510 7877271 7485969
55896G485969l63561l38316l13755k90473k69838k51336k33599k16946k02790
$$ 7485969 7122408 6784092 6470337 6179864 5910026 5658690 5425091 5208145 5005355
55887E005355j91165j80703j70650j61340j53058j45721j39389j33918j28448
$$ 5005355 4814190 4633487 4462837 4301497 4148439 4002718 3863329 3729411 3600963
55878C600963j22350j16330j11561j08018j04690j01109r7613r4288r0572q6084
$$ 3600963 3478613 3362283 3250722 3142704 3038014 2936905 2839292 2745004 2654432 2568348
55868B568348q1123p6236p1605o7029o2442n8475n6112n5238n4070n1041m7089
$$ 2568348 2487225 2410989 2339384 2272355 2209913 2151438 2095326 2040088 1986018 1934977 1887888
55857A887888m4662m4409m4409m3104m1278m0197l9411l7795l5560l3773l2642
$$ 1887888 1843226 1798817 1754408 1711304 1670026 1629829 1590418 1552623 1517063 1483290 1450648
55846A450648l1765l1388l1849l2181l0790k7655k4591k3200k3412k4039k4010
$$ 1450648 1418883 1387495 1355646 1323465 1292675 1265020 1240429 1217229 1193817 1169778 1145768
55835A145768k3015k1693k1058k1204k0776j8524j5077j2396j1608j2199j3124
$$ 1145768 1122753 1101060 1080002 1058798 1038022 1019498 1004421 992025 980417 968218 955094
55824I55094j3717j3656j3096j2959j4002j5383j5260j3191j0927j0134j0405
$$ 955094 941377 927721 914625 901666 887664 872281 857021 843830 832903 822769 812364
55813H12364j0283r361q122o398l524rK458L204L586N066P239Q743R272R435R111
$$ 812364 802081 792720 784598 778200 774676 774667 777125 780329 783915 788981 796220 804963 814235 823670 832781
55798H32781P458M598J874J26j122k387l505m603o398q580r371p949o157o196
$$ 832781 840239 844837 846711 846837 845715 843328 839823 835220 828822 820242 810871 802922 796765 790569
55784G90569p616q351p919p454p027n268j864J753M745P874J1521J4560J6007
$$ 790569 782953 774602 766683 759229 752202 746934 745070 746823 751568 759442 770963 785523 801530
55771H01530J5945J3848Q162p33q957j2795j3061j3811j7256k1876k5174k6306
$$ 801530 817475 831323 839485 838752 829795 817000 803939 790128 772872 750996 725822 699516
55759F99516k5829k4607k3522k3049k2620k1195j8670j5996j3916j2515j1944
$$ 699516 673687 649080 625558 602509 579889 558694 540024 524028 510112 497597 485653
55748D85653j2431j3385j3494j2196j0283q726p652o809o201n801n201m137k996
$$ 485653 473222 459837 446343 434147 423864 415138 407486 400677 394476 388675 383474 379337 376341
55735C76341k435k781l947n492o538o207m595k966k573l443m560m951m362l162
$$ 376341 373906 371125 367178 361686 355148 348941 344346 341380 338807 335364 330804 325853 321491 318329
55721C18329j982j333j217j103m02R27K264K795K373J905K518M047M783L309K24
$$ 318329 316347 315014 313797 312694 312292 313219 315483 318278 320651 322556 325074 329121 333904 337213 337437
55706C37437k587m170n010n465n039l650k526k823m028m602l919k714j889j629
$$ 337437 334850 330680 325670 320205 315166 311516 308990 306167 302139 297537 293618 290904 289015 287386
55692B87386j574j253l99O19Q94R0p79m32J035K494L542M685N726N509L983K993
$$ 287386 285812 284559 284160 284779 285673 285763 284984 284552 285587 288081 291623 296308 302034 307543 311526 314519
55676C14519L692M371K588j004k994j557J345K735K080R06K05k22m47k3R81J715
$$ 314519 318211 322582 325170 324166 321172 319615 320960 323695 325775 326681 326886 326664 326217 326194 327175 328890
55660C28890J692J370J266J136M81n27j113p83J81J018J198P61O4p45j709k636
$$ 328890 330582 331952 333218 334354 334835 334308 333195 332412 332593 333611 334809 335570 335634 334889 333180 330544
55644C30544l054l004l361m886p037q318p883o412n355n582o668p287o411m436
$$ 330544 327490 324486 321125 316239 309202 300884 293001 286589 281234 275652 268984 261697 255286 250850
55630B50850k914k825l464l516k847k370k386k150j245l69k59o22o93k98J82M30
$$ 250850 247936 245111 241647 238131 235284 232914 230528 228378 227133 226764 226505 225883 225190 224892 225074 225504
55614B25504K85m47j609k376j863p0J939K790J718q16l325m445m177l686l812
$$ 225504 225789 225342 223733 221357 219494 219424 221363 224153 225871 225055 221730 217285 213108 209422 205610
55599B05610m064l415j632M36J685J702J002L53k39j457l245m102k946j134j112
$$ 205610 201546 198131 196499 196935 198620 200322 201324 201677 201438 199981 196736 192634 189688 188554 187442
55584A87442k975m158l045r82K07P89J596J715M6j902j403J465L778L996L789
$$ 187442 184467 180309 177264 176282 176489 177278 178874 180589 180635 178733 177330 178795 182573 186569 190358
55569A90358M735N501L952N82k011k374j401n83m16o46j020j386j570j542j510
$$ 190358 195093 200594 204546 205128 203117 200743 199342 198759 198343 197697 196677 195291 193721 192179 190669
55554A90669j699k051k085j217M99K079K598K330K233K296J387q16k840l038j516
$$ 190669 188970 186919 184834 183617 184116 186195 188793 191123 193356 195652 197039 196223 193383 190345 188829
55539A88829M68K263L791M226K405j084l630l406j628j021k263l204j732J392
$$ 188829 189297 191560 195351 199577 201982 200898 197268 193862 192234 191213 188950 185746 184014 185406
55525A85406L373K570Q5j887k492k517k826l372l723l776l579k977j912p95j39
$$ 185406 188779 191349 191434 189547 187055 184538 181712 178340 174617 170841 167262 164285 162373 161578 161439
55510A61439j4j51m39r05j354j470j278j105j042q44m19L0N26J462K760L323K111
$$ 161439 161425 161274 160835 159930 158576 157106 155828 154723 153681 152837 152418 152448 152974 154436 157196 160519 162630
55493A62630j83j410l73J627K316J192k19o02k91o5K07Q06R09m58k514l240k015
$$ 162630 162447 161037 160664 162291 164607 165799 165580 164978 164687 164622 164829 165635 166544 166086 163572 160332 158317
55476A58317m45kp3O29J773J839M55j091j626j287p29k41q9p22j924k519j726
$$ 158317 157872 157870 157797 158426 160199 162038 162493 161402 159776 158489 157760 157519 157430 156708 154784 152265 150539
55459A50539l13L93K96L29P37P02j29q75p81m56q58j576j193P04K826L650K936
$$ 150539 150226 150619 150915 151244 151981 152683 152554 151679 150898 150442 149584 148008 146815 147519 150345 153995 156931
55442A56931J539L70j66j75q0j43lQ45K013K251R90p04j335o65L87J174J737K054
$$ 156931 158470 158840 158674 158499 158419 158276 158273 159118 161131 163382 164372 163668 162333 161668 162055 163229 164966 167020
55424A67020J762P93m37j609k611l009k252p24J80l75j544j868j036nK87l30j555
$$ 167020 168782 169575 169138 167529 164918 161909 159657 158933 159113 158738 157194 155326 154290 154285 154572 154242 152687
55407A52687k855l476k884j451k25J91J80L06M94L78J83O16J743K569K138Q81
$$ 152687 149832 146356 143472 142021 141796 141987 142167 142473 142967 143345 143528 144144 145887 148456 150594 151475
55391A51475K29P98J471P91j020k164j409N00J870J895J063J29n69q85o85q6M67
$$ 151475 151704 152502 153973 154764 153744 151580 150171 150671 152541 154436 155499 155628 155059 154174 153489 153403 153870
55374A53870O23M06mn45j160j684j934j865j517r90m86j98r3j2L1q2j20M10J468
$$ 153870 154493 154899 154895 154350 153190 151506 149572 147707 146190 145200 144714 144516 144423 144411 144442 144360 144240 144650 146118
55355A46118K154J693N52j7M86J290J487J079O08K56j72p58j402k056k479k070
$$ 146118 148272 149965 150517 150500 150986 152276 153763 154842 155450 155706 155534 154776 153374 151318 148839 146769
55339A46769o24R31J386R23Q91J634J626l37k949l693k105l55l95j591j869m54
$$ 146769 146145 147076 148462 149385 150276 151910 153536 153199 150250 146557 144452 144097 143702 142111 140242 139788
55323A39788J401K136J546O62L90N59K84q41k077k299j223M41J891K838L172K748
$$ 139788 141189 143325 144871 145533 145923 146482 146766 145925 143848 141549 140326 140767 142658 145496 148668 151416
55307A51416J784R55O85P07O87Q02J300J855J930J485Q44J81l64m53j15j86j350
$$ 151416 153200 154155 154840 155547 156234 157036 158336 160191 162121 163606 164450 164631 164267 163814 163699 163513 162163
55290A62163k955l705l327k545j562M7J744J948L49j064n66Q35R13m78j396q59
$$ 162163 159208 155503 152176 149631 148069 148116 149860 151808 152157 151093 150527 151362 152275 151797 150401 149542
55274A49542n5j95p48n84L25J216J665J577P41o32j486r91K12P02N1q11r56l48
$$ 149542 149487 149292 148544 147960 148285 149501 151166 152743 153484 152852 151366 150375 150587 151289 151340 150529 149573 149225
55256A49225N63J471K157K353J940J071Pr51j513j633j583j435p19Q66K519K873
$$ 149225 149788 151259 153416 155769 157709 158780 158787 157836 156323 154690 153107 151672 150953 151819 154338 157211
55240A57211J590j69j038p73o6M40N87N48N53O67O38J68o32j266j415j223r67
$$ 157211 158801 158632 157594 156821 156755 157195 157782 158330 158883 159550 160188 160356 159724 158458 157043 155820 154853
55223A54853p16m11lM80P97N67j91p44l85O03J270J185P27K24l86r56j000m10
$$ 154853 154137 153726 153723 154203 155000 155567 155376 154632 154247 154850 156120 157305 158032 158256 157870 156914 155914 155504
55205A55504L66J043J711K175J987J296Q00N55j14j095j180k1Q69J42j356j843
$$ 155504 155870 156913 158624 160799 162786 164082 164882 165437 165323 164228 163048 163027 163896 164038 162682 160839
55189A60839j132m88n62p88n26L60J734K915K642O36j312j274J79Q76L14J15J134
$$ 160839 159707 159219 158657 157869 157343 157703 159437 162352 164994 165630 164318 163044 163223 164099 164413 164528 165662
55172A65662K102J799Q52M53O45Q10O91J08j308l143l924k787p00Q09J437J792
$$ 165662 167764 169563 170415 170868 171513 172323 173014 173122 171814 168671 164747 161960 161260 162069 163506 165298
55156A65298K013J718R14K07K14J102K369K877J909L55o1Q90J528O75q38j872
$$ 165298 167311 169029 169943 170150 170364 171466 173835 176712 178621 178976 178915 179805 181333 182008 181170 179298
55140A79298k703l823m291l067j125m28j122j571j009l98m61m95K84J437J982
$$ 179298 176595 172772 168481 165414 164289 163861 162739 161168 160159 159761 159300 158805 159089 160526 162508
55125A62508J533L12j230k438k658j807l78J128K285K560J818Q95P61J154J003
$$ 162508 164041 164353 163123 160685 158027 156220 155842 156970 159255 161815 163633 164528 165289 166443 167446
55110A67446K28p2O26J415J358P54L82M01O06R82J432J547J313J392J985K155
$$ 167446 167674 167602 168228 169643 171001 171755 172137 172538 173144 174126 175558 177105 178418 179810 181795 183950
55094A83950J098m05p86L65K018L090L189K213M22r64m86J645L285K775R76n9
$$ 183950 185048 184643 183857 184222 186240 189330 192519 194732 195154 194190 193704 195349 198634 201409 202385 202326
55078B02326J86M62k2n59n03m69j113j768j384l00K32q8m35l48j31J51O85Q37
$$ 202326 202512 202974 202952 202393 201890 201421 200308 198540 197156 196856 197088 197000 196565 196217 196086 196237 196922 197759
55060A97759l52k175k465o31J143Q68n30j023o27q23j721j971j199m76l96m63
$$ 197759 197407 195232 192767 192136 193279 194147 193617 192594 191967 191144 189423 187452 186253 185777 185381 184918
55044A84918n11r05j156k20J332J396o32k677k928k327k705l734l509j539O40
$$ 184918 184407 183502 182346 182126 183458 184854 184222 181545 178617 176290 173585 169851 166342 164803 165443
55029A65443J699J946K234K471J853K45j139p16J627L941M144K369O41K13L78
$$ 165443 167142 169088 171322 173793 175646 175891 174752 174036 175663 179604 183748 186117 186758 186971 187349
55014A87349J51j92l3K35j38q48r35k06O02Q80O97N60J056K369L720L876K746
$$ 187349 187500 187308 187275 187510 187372 186524 185589 185383 185985 186865 187562 188122 189178 191547 195267 199143 201889
54997B01889J649J366Q70q81k773k742q05P96O02m05o19oL39o7o56q20n39j25
$$ 201889 203538 204904 205774 204893 202120 199378 198573 199369 199971 199566 198947 198941 199280 199213 198557 197737 197198 197073
54979A97073K44N71Q24Q36M49k25q71j253j350j174p70l18J86J176K887M522M871
$$ 197073 197317 197888 198712 199548 199997 199772 198901 197648 196298 195124 194354 194036 194222 195398 198285 202807 207678
54962B07678L850K458J101p08k570k733o35J481J087j309l028k754j455k59O60
$$ 207678 211528 213986 215087 214379 211809 209076 208441 209922 211009 209700 206672 203918 202463 202204 202864
54947B02864J139Q27J90J84O67N50k30n07N9M06J33L94J830L187L145K311K141
$$ 202864 204003 204830 205020 205204 205871 206421 206191 205684 205743 206149 206282 206676 208506 211693 214838 217149 219290
54930B19290K844L678M538N961P861R372R845R392Q643Q333Q669Q934Q371P527
$$ 219290 222134 225812 230350 236311 244172 253544 263389 272781 281424 289757 298426 307360 315731 323258
54916C23258P576Q093P096M030R15o89k147n291q968j0545r978r728j0785j1423
$$ 323258 330834 338927 346023 350053 350968 350279 348132 342841 333873 323328 313350 303622 292837 281414
54902B81414j0339q501p020n342l004j380j881l468l687j779O08J659J215L94
$$ 281414 271075 262574 255554 250212 247208 245828 243947 240479 236792 235013 235621 237280 238495 238889
54888B38889L85J656L697N343N745N154M636N053O516Q469J0047J0651J0418R994
$$ 238889 239274 240930 244627 249970 255715 260869 265505 270558 277074 285543 295590 306241 316659 326653
54874C26653R619Q791P001M463J844m24k266l802n352p237r170j0294j0218r684
$$ 326653 336272 345063 352064 356527 358371 357947 355681 351879 346527 339290 330120 319826 309608 299924
54860B99924r714j0369j0878j0684r835q575p245o382o246o223n338l487j650
$$ 299924 290210 279841 268963 258279 248444 239869 232624 226242 219996 213773 208435 204948 203298
54847B03298p65q47j322j615j251j4J625K622K391J416M81l85j610k935l282k048
$$ 203298 202533 201686 200364 198749 197498 197484 199109 201731 204122 205538 206019 205634 204024 201089 197807 195759
54831A95759j00R65M72o72j045k28R26J410J174Q62O96P9j420l044l313j615J056
$$ 195759 195659 196624 197096 196424 195379 195151 196077 197487 198661 199523 200219 200298 198878 195834 192521 190906 191962
54814A91962L115L900L900L687L176K079P02j53j06K65l3j301k609k539o40J817
$$ 191962 195077 198977 202877 206564 209740 211819 212521 212368 212262 212527 212494 211193 208584 206045 205405 207222
54798B07222K933K177R44P90J496J565L61j096j670j422r50j71J238K700L031
$$ 207222 210155 212332 213276 214066 215562 217127 217488 216392 214722 213300 212350 212179 213417 216117 219148
54783B19148K017Q43P10J572K575L203L569L857L994L860L574L490L907M798N887
$$ 219148 221165 222008 222718 224290 226865 230068 233637 237494 241488 245348 248922 252412 256319 261117 267004
54768B67004P048Q460J0114J1391J1538J0592R418Q642P848O059K855j008m102
$$ 267004 274052 282512 292626 304017 315555 326147 335565 344207 352055 358114 360969 359961 355859
54755C55859n510n764o294p717r079r376r196r743j0563r847p356n245n027n301
$$ 355859 350349 344585 338291 330574 321495 312119 302923 293180 282617 272770 265414 260169 255142 249841
54741B49841m031j814q36j240r46Q61K394K161J240J394K446L042L022L370M374
$$ 249841 245810 243996 243160 241920 240974 241835 244229 246390 247630 249024 251470 254512 257534 260904 265278
54726B65278N321N922O731Q031R316R975R839R002P792O738N840M172J063k512
$$ 265278 270599 276521 283252 291283 300599 310574 320413 329415 337207 343945 349785 353957 355020 352508
54712C52508m797n444n755o572p319p467p647q431r086q600p256o145n637n262
$$ 352508 347711 342267 336512 329940 322621 315154 307507 299076 289990 281390 274134 267989 262352 257090
54698B57090m749m166l377k267j254p01j79O71R15o11l102m237l141j425p00o51
$$ 257090 252341 248175 244798 242531 241277 240576 240397 241068 241983 241372 238270 234033 230892 229467 228767 228116
54682B28116n57j100l014m982m806k391K06J598K153K140Q30j733l694l470j811
$$ 228116 227559 226459 223445 218463 213657 211266 211472 213070 215223 217363 218193 216460 212766 209296 207485
54667B07485n41r0L25P43L36p97j383r19n22j147j945j416M23J958J930O28q23
$$ 207485 206944 206854 207179 207922 208258 207461 206078 205159 204637 203490 201545 200129 200552 202510 204440 205068 204245
54650B04245j672j772j190r1J124J990K436K845L448L857L505K496J583J181Q03
$$ 204245 202573 200801 199611 199520 200644 202634 205070 207915 211363 215220 218725 221221 222804 223985 224788
54635B24788j39j366k048j889j350q28l05J04r0j084k289k821k280q63Q82K192
$$ 224788 224649 223283 221235 219346 217996 217168 216863 216967 216877 215793 213504 210683 208403 207540 208422 210614
54619B10614K419J690R60R15J099N95o08j561j681j466j527j496o08Q07J279J07
$$ 210614 213033 214723 215683 216598 217697 218292 217684 216123 214442 212976 211449 209953 209345 210152 211431 211538
54603B11538j296q31J556L471K876N58r29l25J280K241K057J085l55j817k431
$$ 211538 210242 209411 210967 214438 217314 217872 216943 216618 217898 220139 222196 223281 222926 221109 218678
54588B18678j630m4R46N95o32j614j497l09J035J451P39k42n72r9P86J658J925
$$ 218678 217048 217004 217950 218545 217913 216299 214802 214493 215528 216979 217718 217476 216904 216805 217591 219249 221174
54571B21174Q99j325l388l841k656r86L15J268K053K510K498K113J426M52m80
$$ 221174 222073 220748 217360 213519 210863 209877 210192 211460 213513 216023 218521 220634 222060 222512 222032
54556B22032q14l87L30P43O75L64J57J65Q6l74q03k66J399K956L144K228J456
$$ 222032 221218 220831 221161 221904 222579 222943 223100 223265 223351 222977 222174 221908 223307 226263 229407 231635 233091
54539B33091J230Q69Q9m04p3N44O44K69J31O43J403J567O92o57j350j164j184
$$ 233091 234321 235190 235279 234875 234802 235346 235990 236259 236390 237033 238436 240003 240695 240038 238688 237524 236340
54522B36340k194l233k896j630j198j852j676O84L941N704N032K805M38r35q53
$$ 236340 234146 230913 228017 226387 225189 223337 221661 222345 226286 231990 237022 239827 240265 239330 238477
54507B38477l2J17p80j460q52L09N13m61j536j852j399n24L61Q88J199J859K751
$$ 238477 238445 238562 237782 236322 235470 235779 236292 235831 234295 232443 231044 230520 230881 231769 232968 234827 237578
54490B37578K705J111q46j521p74L37J162J600J335L95m0J041K648K880J685P54
$$ 237578 240283 241394 240548 239027 238253 238590 239752 241352 242687 243082 243042 244083 246731 249611 251296 252050
54474B52050O73K27r90j299N50L121M024K929J535J143J518J827J639J005L13
$$ 252050 252723 252950 251960 250661 251211 254332 258356 261285 262820 263963 265481 267308 268947 269952 270265
54459B70265J3J23K05N5k2K3m58j831l321l838l324k549j910j260p64r96j850
$$ 270265 270278 270401 270606 270661 270639 270662 270204 268373 265052 261214 257890 255341 253431 252171 251407 250411 248561
54442B48561k249j470l26k33j197j572k44J551J576m44k339k366j255n05J31J811
$$ 248561 246312 244842 244516 244283 243086 241514 241270 242821 244397 243953 241614 239248 237993 237488 237619 239430
54426B39430L927M368K578N43K7M57M16j59m27k11J43O87J464J755R54k43o10
$$ 239430 243357 247725 250303 250846 250873 251330 251746 251587 251160 250949 251092 251779 253243 254998 255952 255709 255099
54409B55099n2N42P44Q10P24J16p53r47M2J736L236L754K891J142p1K99J640K454
$$ 255099 255047 255589 256333 257143 257867 257983 257230 256283 256325 258061 261297 265051 267942 269084 269013 269312 270952 273406
54391B73406K273J936K027K070J421J31j317k413k710k101j122l97K11J169K234
$$ 273406 275679 277615 279642 281712 283133 283264 281947 279534 276824 274723 273601 273204 273415 274584 276818
54376B76818K755K896L475M500N085N009N125N752N932N010L789L170K592R91
$$ 276818 279573 282469 285944 290444 295529 300538 305663 311415 317347 322357 326146 329316 331908 332899
54362C32899j347k976l042j893l42P61N55j176l429m815m919m297l449k596k140
$$ 332899 331552 328576 325534 323641 323299 324060 324615 323439 320010 315195 310276 305979 302530 299934 297794
54347B97794k339k632k206j360j304k441l751m170l742l005k093j036k56lK21
$$ 297794 295455 292823 290617 289257 287953 285512 281761 277591 273849 270844 268751 267715 267459 267456 267677
54332B67677R78J830J732L79j322k176j732m23Q91J544J515J303J174P83j12r28
$$ 267677 268655 270485 272217 272596 271274 269098 267366 266943 267834 269378 270893 272196 273370 274153 274041 273113
54316B73113q39M7Q44J312K156L428L607J382k139m294l966k543j574q00N02J499
$$ 273113 272274 272321 273165 274477 276633 280061 283668 285050 282911 278617 274651 272108 270534 269734 270236 271735
54300B71735P98j022j684l09J297J195j26q09k83N20J034J618K308K411J773J319
$$ 271735 272533 271511 269827 269518 270815 272010 271884 271075 270792 271312 272346 273964 276272 278683 280456 281775
54284B81775J685K084J319n52k205k481j337K95J179N87j065k504k837k239j198
$$ 281775 283460 285544 286863 286311 284106 281625 280288 280583 281762 282349 281284 278780 275943 273704 272506
54269B72506K48J950K959K518J414J202J966K145Q98n77p37K60J148J390J352
$$ 272506 272754 274704 277663 280181 281595 282797 284763 286908 287806 287229 286492 286752 287900 289290 290642
54254B90642J273J154J306J854J979Q44q42j510r12k91j77L68J728K567J693j24
$$ 290642 291915 293069 294375 296229 298208 299052 298210 296700 295788 295497 295320 295688 297416 299983 301676 301552
54238C01552j384j812j901j585q51p45j980l226k759j397j480l011l298j122J252
$$ 301552 300168 298356 296455 294870 294019 293274 291294 288068 285309 283912 282432 279421 276123 275001 276253
54223B76253J498N30O04J751K250J632R71O47j27j488k320j862o06N52J053M59
$$ 276253 277751 278281 278885 280636 282886 284518 285489 286136 286009 284521 282201 280339 279733 280285 281338 281797
54207B81797j267l110l760l157k317j601m95Q15J207N03J36R80J813J114n96j480
$$ 281797 280530 277420 273660 270503 268186 266585 266090 266905 268112 268615 268751 269731 271544 272658 272062 270582
54191B70582q42L90J302J905K475K907K941K502J816J475J992K888K757R61j245
$$ 270582 269740 270130 271432 273337 275812 278719 281660 284162 285978 287453 289445 292333 295090 296051 294806
54176B94806k091j347j59P64J532J940J358K6q17o62n27j393k644k966k142j125
$$ 294806 292715 291368 291209 291973 293505 295445 296803 296829 296012 295350 294823 293430 290786 287820 285678 284553
54160B84553n97l55m4K07O7m59r58r43k12R07J690J602P99Kk12m2k83j324k365
$$ 284553 283956 283601 283557 283764 283831 283372 282414 281471 281259 282166 283856 285458 286257 286259 286047 286005 285722 284398 282033
54141B82033k083k82J504J667L69p94p62J45J137J748J594M54r20r70R54L531
$$ 282033 279950 279668 281172 282839 283208 282414 281652 281797 282934 284682 286276 286730 285810 284840 285794 289325
54125B89325M821M312L142K613L018L628L415K099P93J098L192N442O370O209
$$ 289325 294146 298458 301600 304213 307231 310859 314274 316373 317166 318264 321456 326898 333268 339477
54111C39477N770M825K868P47j65j92r78k724l565k378o73n94k122l522l839l621
$$ 339477 345247 350072 352940 353687 353522 353330 352352 349628 346063 343685 343012 342418 340296 336774 332935 329314
54095C29314l511l316k667j683p79k06J24N60J294J904J659N85l70o63r34j687
$$ 329314 325803 322487 319820 318137 317358 317152 317276 317836 319130 321034 322693 323278 322908 322245 321311 319624
54079C19624j911k17K914N390O008N453M628L417J836J049J903L205K983J262
$$ 319624 317713 317496 320410 325800 331808 337261 341889 345306 347142 348191 350094 353299 356282 357544
54065C57544J45Q55K062J926Q14P55K459M175L877J798P5K95K078L995N080N344
$$ 357544 357689 358544 360606 362532 363346 364101 366560 370735 374612 376410 376485 376780 378858 382853 387933 393277
54049C93277N395O084Q000J0706J2651J2518J0749R277R590J1479J3708J5381
$$ 393277 398672 404756 412756 423462 436113 448631 459380 468657 478247 489726 503434 518815
54037E18815J6263J6243J5243J3691J2550J2455J2971J2944J1652R464P344N886
$$ 518815 535078 551321 566564 580255 592805 605260 618231 631175 642827 652291 659635 665521
54025F65521N016M419L880L085J584o70k927m399n244o329p844q876q711q099
$$ 665521 670537 674956 678836 681921 683505 682835 679908 675509 670265 663936 656092 647216 638505 630406
54011F30406q522j0420j2685j3943j3852j2963j1825j0596r370q412p906p693
$$ 630406 621884 611464 598779 584836 570984 558021 546196 535600 526230 517818 509912 502219
53999E02219p476p207p036o762n727l647j439o23j638l139l351j944k40L27m13
$$ 502219 494743 487536 480500 473738 468011 464364 462925 462302 460664 457525 454174 452230 451990 452317 451904
53984D51904j354j152P03L459N680O431N963N077M128L013J806P97j13j326k761
$$ 451904 450550 449398 450101 453560 459240 465671 471634 476711 480839 483852 485658 486455 486342 485016 482255
53969D82255l800m284m855n910o764o475n057l373k095j326q41k42Q30K082K666
$$ 482255 478455 474171 469316 463406 456642 450167 445110 441737 439642 438316 437475 437233 438063 440145 442811
53954D42811K472K750M450O549P211O358N577N602N680N709O980R754J1889J1512
$$ 442811 445283 448033 452483 459032 466243 472601 478178 483780 489460 495169 502149 511903 523792 535304
53940E35304R863R592J1108J2578J3079J3503J4245J4154J2630J1069J1030J2097
$$ 535304 545167 554759 565867 578445 591524 605027 619272 633426 646056 657125 668155 680252
53928F80252J2637J1990J0951J0563J1243J2727J4269J5189J5639J6335J7338
$$ 680252 692889 704879 715830 726393 737636 750363 764632 779821 795460 811795 829133
53917H29133J7809J7332J6658J6408J5935J4321J1863R589P867O461N424M777
$$ 829133 846942 864274 880932 897340 913275 927596 939459 949048 956915 963376 968800 973577
53905I73577L710J343j825m425o136p924j0262j2337j3399j3873j4591j5718j6840
$$ 973577 977287 978630 976805 972380 966244 958320 948058 935721 922322 908449 893858 878140 861300
53892H61300j7547j7579j7071j6857j7782j9433k0402k0055j9114j8134j6575
$$ 861300 843753 826174 809103 792246 774464 755031 734629 714574 695460 677326 660751
53881F60751j4219j2294j2000j2613j2386j1016r853r755r989r530q404p319o752
$$ 660751 646532 634238 622238 609625 597239 586223 576370 566615 556626 547096 538692 531373 524621
53868E24621o850p682r075j0437j1044j0413q452n690l260k148k259k691k955
$$ 524621 517771 510089 501014 490577 479533 469120 460668 454978 451718 449570 447311 444620 441665
53855D41665l348l965m158l497k666k590k973k634j264l4q4j063j670j290n25
$$ 441665 438317 434352 430194 426697 424031 421441 418468 415834 414570 414536 414452 413389 411719 410429 409904
53840D09904j67k19p9N85J413J675R94k40j096j001l70n6j46K68J844L923N210
$$ 409904 409737 409518 409439 410024 411437 413112 414106 413866 412770 411769 411399 411343 411197 411465 413309 417232 422442
53823D22442N191M385L406K492J916K118L107M287N135N694O170O650P416Q857
$$ 422442 427633 432018 435424 437916 439832 441950 445057 449344 454479 460173 466343 472993 480409 489266
53809D89266J0600J1410J0707R701J0121J2018J3749J4085J3456J2900J2646J2118
$$ 489266 499866 511276 521983 531684 541805 553823 567572 581657 595113 608013 620659 632777
53797F32777J0865Q970O891N233M454M467M615M187K878Q58j275k676k947k817
$$ 632777 643642 652612 659503 664736 669190 673657 678272 682459 685337 686195 684920 682244 679297 676480
53783F76480l585n607p793q977r310r850j1121j2657j3724j3925j3250j2087j1167
$$ 676480 672895 667288 659495 650518 641208 631358 620237 607580 593856 579931 566681 554594 543427
53770E43427j0913j0807r945q292o850o417o664o733o291n590m884m312m080m256
$$ 543427 532514 521707 511762 503470 496620 490203 483539 476806 470515 464925 460041 455729 451649 447393
53756D47393m472m284l876l912m564n116m832l920l335l602m097l623j738N62
$$ 447393 442921 438637 434761 430849 426285 421169 416337 412417 409082 405480 401383 397760 396022 396584
53742C96584J679J025l71j054o27K48R91J568J869J455L04q02j144q80n61k71
$$ 396584 398263 399288 398917 397863 397236 397484 398475 400043 401912 403367 403671 402869 401725 400845 400284 400013
53726D00013J77N55N30M38R89K167L136L341L057K710K287J701J217J193J724
$$ 400013 400190 400745 401275 401713 402702 404869 408005 411346 414403 417113 419400 421101 422318 423511 425235
53711D25235K710L890M723M683L951L377L552M309N230O051O383N802M635M044
$$ 425235 427945 431835 436558 441241 445192 448569 452121 456430 461660 467711 474094 479896 484531 488575
53697D88575M627N470N221L841K555K279K711K949K475J471N53K13M01O77P26
$$ 488575 493202 498672 503893 507734 510289 512568 515279 518228 520703 522174 522727 522940 523341 524018 524744
53682E24744L88o72k482l940l546j535q5m89j255l78J464J871L45j082r47q3K68
$$ 524744 525132 524460 521978 518038 514492 512957 512872 512383 511128 510750 512214 514085 514430 513348 512401 512318 512586
53665E12586K89O76J373K114K966L419K305j98j758n70K033L303K703K014K279
$$ 512586 512875 513551 514924 517038 520004 523423 525728 525530 523772 523202 525235 528538 531241 533255 535534
53650E35534K567K049J443J733K743L782M681N397N447M558L339K541K091J505
$$ 535534 538101 540150 541593 543326 546069 549851 554532 559929 565376 569934 573273 575814 577905 579410
53636E79410P91K80n4l19q7J076K593L298L006K838L664M928N571N454N134M639
$$ 579410 580201 580481 580427 580108 580021 581097 583690 586988 589994 592832 596496 601424 606995 612449 617583 622222
53620F22222L451J722N60O54J363J815K373M064O710Q720Q967Q019O989N947M381
$$ 622222 625673 627395 627955 628609 629972 631787 634160 638224 644934 653654 662621 670640 677629 683576 687957
53605F87957K642J752J835J843J250Q77J413J974J292k46r74l25N36P33R52J841
$$ 687957 690599 692351 694186 696029 697279 698156 699569 701543 702835 702589 701615 701290 701826 702559 703511 705352
53589G05352K249N21k853n381n413l711j975j006q52j589k984m000l702k472j501
$$ 705352 707601 708122 705269 699888 694475 690764 688789 687783 686931 685342 682358 678358 674656 672184 670683
53574F70683j272j218q54m08k77m00m20j17M53J000J169Q74L79j10o11r79p18
$$ 670683 669411 668193 667339 666931 666654 666254 665834 665717 666170 667170 668339 669213 669592 669482 668871 667892 667174
53557F67174L29J436J711J129L97J42O19J874L460M438M452M402N265O652P579
$$ 667174 667503 668939 670650 671779 672176 672318 672937 674811 678271 682709 687161 691563 696828 703480 711059
53542G11059Q101Q869R369Q293N887M184M525O217Q147J0151J2150J3482J4149
$$ 711059 719160 728029 737398 745691 751578 755762 760287 766504 774651 784802 796952 810434 824583
53529H24583J5281J7219J8369J7503J6038J6420J8886K1490K2848K3305K3649
$$ 824583 839864 857083 875452 892955 908993 925413 944299 965789 988637 1011942 1035591
53518A035591K4212K5358K7396K9780L1389L1881L2116L3094L5094L7637L9748
$$ 1035591 1059803 1085161 1112557 1142337 1173726 1205607 1237723 1270817 1305911 1343548 1383296
53507A383296M0540M0203L9986M0462M0425L8605L5771L3837L3320L3105L2493
$$ 1383296 1423836 1464039 1504025 1544487 1584912 1623517 1659288 1693125 1726445 1759550 1792043
53496A792043L1833L1183L0015K8518K7752K8073K8689K9048K9441K9891K9894
$$ 1792043 1823876 1855059 1885074 1913592 1941344 1969417 1998106 2027154 2056595 2086486 2116380
53485B116380K9626K9944L0594K9874K6979K3406K1005J9765J8505J6769J4837
$$ 2116380 2146006 2175950 2206544 2236418 2263397 2286803 2307808 2327573 2346078 2362847 2377684
53474B377684J2611R694O236K813k47k881n124p352j0072j3013j5219j6540j8062
$$ 2377684 2390295 2399989 2406225 2409038 2408791 2405910 2400786 2393434 2383362 2370349 2355130 2338590 2320528
53461B320528k0399k2593k3542k3624k3946k4912k6419k8483l0527l1098k9703
$$ 2320528 2300129 2277536 2253994 2230370 2206424 2181512 2155093 2126610 2096083 2064985 2035282
53450B035282k8036k7872k8534k8099k6318k4343k2153j8638j4291j1279j0200
$$ 2035282 2007246 1979374 1950840 1922741 1896423 1872080 1849927 1831289 1816998 1805719 1795519
53439A795519q905n733k180q62j971l166k263J044N466R024J0173R151Q094R079
$$ 1795519 1786614 1780881 1778701 1777839 1775868 1772702 1770439 1771483 1776949 1785973 1796146 1805297 1813391 1822470
53425A822470J2168J5823J8765K0799K2300K3737K5623K8152L0892L3261L5331
$$ 1822470 1834638 1850461 1869226 1890025 1912325 1936062 1961685 1989837 2020729 2053990 2089321
53414B089321L7677M0526M3359M5448M6520M7043M7994N0179N3532N7197O0434
$$ 2089321 2126998 2167524 2210883 2256331 2302851 2349894 2397888 2448067 2501599 2558796 2619230
53403B619230O3271O6070O8900P1515P3692P5243P6137P6945P8692Q1650Q4562
$$ 2619230 2682501 2748571 2817471 2888986 2962678 3037921 3114058 3191003 3269695 3351345 3435907
53392C435907Q5723Q4917Q3646Q3318Q3624Q3006Q0464P6559P2553O8800O4329
$$ 3435907 3521630 3606547 3690193 3773511 3857135 3940141 4020605 4097164 4169717 4238517 4302846
53381D302846N8272N1363M5390M1052L7042L1572K4227J5894P453p66q629j6200
$$ 4302846 4361118 4412481 4457871 4498923 4535965 4567537 4591764 4607658 4615111 4614345 4605716 4589516
53369D589516k3877l1877l9613m6305n2097n7728o3206o7781p1302p4487p7441
$$ 4589516 4565639 4533762 4494149 4447844 4395747 4338019 4274813 4207032 4135730 4061243 3983802
53358C983802p9023p8502p6850p5411p4019p1643o8412o5587o3639o1821n9895
$$ 3983802 3904779 3826277 3749427 3674016 3599997 3528354 3459942 3394355 3330716 3268895 3209000
53347C209000n8815n9015n9095n7296n3619m9538m6114m3391m1322l9973l8695
$$ 3209000 3150185 3091170 3032075 2974779 2921160 2871622 2825508 2782117 2740795 2700822 2662127
53336B662127l6191l2040k7507k4278k2760k2110k1638k1434k1625k1737k1292
$$ 2662127 2625936 2593896 2566389 2542111 2519351 2497241 2475603 2454169 2432544 2410807 2389515
53325B389515k0744k1126k2587k3883k3792k2623k1537k0644j8947j6431j4817
$$ 2389515 2368771 2347645 2325058 2301175 2277383 2254760 2233223 2212579 2193632 2177201 2162384
53314B162384j5293j6452j5863j3181j0215q066n919k972JJ987L465N609Q519
$$ 2162384 2147091 2130639 2114776 2101595 2091380 2083314 2077395 2074423 2074424 2076411 2079876 2085485 2094004
53301B094004J1329J3696J6149J9093K2289K5344K8066L0364L2278L3974L5261
$$ 2094004 2105333 2119029 2135178 2154271 2176560 2201904 2229970 2260334 2292612 2326586 2361847
53290B361847L5360L3738L1083K8897K8134K8497K8811K7716K4410J9405J4338
$$ 2361847 2397207 2430945 2462028 2490925 2519059 2547556 2576367 2604083 2628493 2647898 2662236
53279B662236J0334O806K480k656p422j1343j5342k0148k4875k7880k8717k8768
$$ 2662236 2672570 2679376 2681856 2679200 2671778 2660435 2645093 2624945 2600070 2572190 2543473 2514705
53267B514705l0020l3290l7444m0418m1292m1235m1946m3514m4530m4153m3053
$$ 2514705 2484685 2451395 2413951 2373533 2332241 2291006 2249060 2205546 2161016 2116863 2073810
53256B073810m2207m1779m1567m1612m1694m1025l9214l7023l5434l4380l3106
$$ 2073810 2031603 1989824 1948257 1906645 1864951 1823926 1784712 1747689 1712255 1677875 1644769
53245A644769l1514l0290k9804k9581k8903k7455k5351k3017k1111k0048j9487
$$ 1644769 1613255 1582965 1553161 1523580 1494677 1467222 1441871 1418854 1397743 1377695 1358208
53234A358208j8657j7383j6360j6191j6449j6171j5215j4639j5436j7170j8351
$$ 1358208 1339551 1322168 1305808 1289617 1273168 1256997 1241782 1227143 1211707 1194537 1176186
53223A176186j8182j7405j7227j7905j8856j9677k0306k0506k0095j9691k0251
$$ 1176186 1158004 1140599 1123372 1105467 1086611 1066934 1046628 1026122 1006027 986336 966085
53212I66085k1610k2408k1966k1274k1389k1567k0133j6951j3957j3018j4000
$$ 966085 944475 922067 900101 878827 857438 835871 815738 798787 784830 771812 757812
53201G57812j5371j6198j6885j8042j9159j8957j7068j4804j3764j3937j3868
$$ 757812 742441 726243 709358 691316 672157 653200 636132 621328 607564 593627 579759
53190E79759j2618j0859r747r485r425r046q252p006n342l628k486k354l124l960
$$ 579759 567141 556282 546535 537050 527625 518579 510327 503321 497979 494351 491865 489511 486387 482427
53176D82427l697k019k63j65j669k923k782k110j972j865r64L6l6o59l69N88L20
$$ 482427 478730 476711 476448 476283 474614 471691 468909 466799 464827 462962 461998 462034 461998 461339 460970 461558 461878
53159D61878j778l936m388l351j943n74O35J080M65m04o20m07m48o45m87j20j4
$$ 461878 460100 456164 451776 448425 446482 445908 446543 447623 448088 447684 447064 446657 446209 445564 445077 444957 444943
53142D44943J6M32Q62N03m78j026p72n08p61r02k55P25J095Q54Q71J568K395K768
$$ 444943 444959 445391 446253 446756 446278 445252 444480 443972 443211 442309 442054 442779 443874 444728 445599 447167 449562 452330
53124D52330K825K934K922K379J578J364K065L020L455L328K938K184R18l65r88
$$ 452330 455155 458089 461011 463390 464968 466332 468397 471417 474872 478200 481138 483322 484240 483875 482887
53109D82887j092j434k157k617k456k027j512o34M06O86j11j002j152j203k205
$$ 482887 481795 480361 478204 475587 473131 471104 469592 468958 469364 470050 469939 468937 467785 466582 464377
53094D64377l814m707m484l989l860l777l288k455j547p10j01K67P06J311J419
$$ 464377 460563 455856 451372 447383 443523 439746 436458 434003 432456 431746 431645 431912 432618 433929 435348
53079D35348M40j020j847k049k506l127k824j587r54j581j980q87N14L54r31j331
$$ 435348 435788 434768 432921 430872 428366 425239 422415 420828 419874 418293 416313 415426 415940 416294 415363 414032
53063D14032m61M3o44j254o50L69M41l42q02l47O64J657K164J917J306J210J681
$$ 414032 413571 413614 412970 411716 411066 411435 411876 411534 410732 410385 411049 412706 414870 416787 418093 419303 420984
53046D20984J412m45k512k543m71J258P87q89j480l05J302J986J663R30J64l67
$$ 420984 422396 421951 419439 416896 416425 417683 418470 417581 416101 415796 417098 419084 420747 421677 421841 421474
53030D21474k75M57J108R44K44l1L62N63j19j126j456j065o17j43Q74K091K220
$$ 421474 421199 421656 422764 423708 423952 423921 424283 424846 424727 423601 422145 421080 420463 420320 421194 423285 425505
53013D25505J027J06P07J775J576N31N28J575J326j394m434m953k912n06R07J687
$$ 425505 426532 426638 427345 429120 430696 431227 431755 433330 434656 433262 428828 423875 420963 420457 421364 423051
52997D23051K297K537K395K214J912J195O50J328K922L722K954J912K102L312
$$ 423051 425348 427885 430280 432494 434406 435601 436251 437579 440501 444223 447177 449089 451191 454503
52983D54503M372M815M751M003K575J408J342J743J401N04K88Q07N82j105k979
$$ 454503 458875 463690 468441 472444 475019 476427 477769 479512 480913 481417 481705 482512 483094 481989 479010
52968D79010l538k907k137j475l89J161K445K805K105N56j327k758l208k901k451
$$ 479010 475472 472565 470428 468953 468564 469725 472170 474975 477080 477636 476309 473551 470343 467442 464991
52953D64991k207k270k696l136k689r15J152J859Q42n92j134p21M4Q83J646J833
$$ 464991 462784 460514 457818 454682 451993 451078 452230 454089 454931 454339 453205 452484 452528 453411 455057 456890
52937D56890J086m4n37j15M74M20l13j222j867k046j714j095p00p98r55n21L53
$$ 456890 457976 457932 457395 457280 457754 458174 457861 456639 454772 452726 451012 449917 449217 448419 447464 446943 447296
52920D47296P46K67k56K7N90L11n36m03J147K408J807J21p30l60O9N1K08M95j79
$$ 447296 448042 448309 448053 448080 448670 448981 448445 448042 449189 451597 453404 453525 452795 452435 452504 452555 452763 453258 453079
52901D53079j912k925j864J56J067O41L83J088J893J782R24J63J9M15R14J034
$$ 453079 451167 448242 446378 446534 447601 448242 448625 449713 451606 453388 454312 454475 454494 454909 455823 456857
52885D56857P36N68R64J529J536R82N86P74J328J992K794L659M228M227L618K499
$$ 456857 457593 458161 459125 460654 462190 463172 463758 464532 465860 467852 470646 474305 478533 482760 486378 488877
52869D88877J301Q81J618K550K323J053K00L74L73r62k944l937l510k707k566
$$ 488877 490178 491059 492677 495227 497550 498603 498803 499177 499550 498588 495644 491707 488197 485490 482924
52854D82924l208m247n341o189o461n875m314k197o75q71k442l531k835j263p66
$$ 482924 479716 475469 470128 463939 457478 451603 447289 445092 444417 443546 441104 437573 434738 433475 432709
52839D32709j852l204l588l179k716k270j307L37K059K952K584J336K4r39j793
$$ 432709 430857 427653 424065 420886 418170 415900 414593 414930 416989 419941 422525 423861 423885 422946 421153
52824D21153k729l318l072k247j473q12J14J127J456Q65R0j61l3Rj5J84N07N43
$$ 421153 418424 415106 412034 409787 408314 407502 407616 408743 410199 411064 411154 410993 410960 410969 410954 411138 411645 412188
52806D12188J72l59q37j288j805k365k765k669j923q76j27J16J59K68L83N35J043
$$ 412188 412360 412001 411164 409876 408071 405706 402941 400272 398349 397473 397346 397462 397621 397889 398272 398807 399850
52789C99850J935K574K333J354J96r02j865k161j235M18J376Q71l23r01m91L22
$$ 399850 401785 404359 406692 408046 408242 407340 405475 403314 402079 402497 403873 404744 404421 403520 403029 403351
52773D03351R25J060O05l40j177j289r23r68j671k066j116R30K845L740L718L340
$$ 403351 404276 405336 405941 405601 404424 403135 402212 401244 399573 397507 396391 397321 400166 403906 407624 410964
52757D10964L037K995L098K828J712L7j154j035K02J644K519K664K443K341K544
$$ 410964 414001 416996 420094 422922 424634 424671 423517 422482 422684 424328 426847 429511 431954 434295 436839
52742D36839K762K647K304K055J782R86l48j438j576q80Q2J003J736J936J417
$$ 436839 439601 442248 444552 446607 448389 449375 449027 447589 446013 445133 445215 446218 447954 449890 451307
52727D51307O22J86J24n6n12q41p32m50n54j332k478l197k819j567m83k41l07
$$ 451307 451929 452115 452239 452183 451671 450830 450098 449648 449094 447762 445284 442087 439268 437701 437218 436977 436670
52710D36670K80J545K538K583K054J813K219K773K539J042j140k874l703m055
$$ 436670 436950 438495 441033 443616 445670 447483 449702 452475 455014 456056 454916 452042 448339 444284
52696D44284m031k844k09K431L213K052M26o82j344j424l89J285K038J243J52
$$ 444284 440253 437409 437200 439631 442844 444896 445322 444640 443296 441872 441483 442768 444806 446049 446201
52681D46201k5J48n23j900k861k950k553j851p13M33P58K85J81J458L672N258
$$ 446201 446176 446324 445801 443901 441040 438090 435537 433686 432973 433406 434164 434449 434630 436088 439760 445018
52665D45018M989L057P71p19j196p87P02L076M863M453K290O07N59R61N05k21
$$ 445018 450007 453064 453835 453116 451920 451133 451835 454911 459774 464227 466517 467124 467683 468644 469149 468928
52649D68928r1M01m8j332k164k127j930j783j086J52R81Q91M69M08P95J440J981
$$ 468928 468837 469238 469190 467858 465694 463567 461637 459854 458768 458920 459901 460792 461261 461669 462464 463904 465885
52632D65885J697L33r23n34J235K584K801L014L930M453L534J928R08L69m33j149
$$ 465885 467582 467915 466992 466458 467693 470277 473078 476092 480022 484475 488009 489937 490845 491214 490781 489632
52616D89632q46K40Q74N65n9l90l70P2R73J783J812J333J383K307L303L451K499
$$ 489632 488786 489026 489900 490465 490406 490016 489646 489718 490691 492474 494286 495619 497002 499309 502612 506063 508562
52599E08562P43j065j720o60Q02N67j444k793j687M74R88n07j800j439n49p81
$$ 508562 509305 508240 506520 505860 506662 507229 505785 502992 501305 501779 502767 502260 500460 499021 498472 497691
52583D97691j724j536M18K710L653L086K035J244N74l91j694k942l609l410k624
$$ 497691 495967 494431 494849 497559 501212 504298 506333 507577 508151 507760 506066 503124 499515 496105 493481
52568D93481k029k200k840l148k795k077j089N31K507L371J992o12k122j692q41
$$ 493481 491452 489252 486412 483264 480469 478392 477303 477834 480341 483712 485704 485092 482970 481278 480437
52553D80437j113j958j794m67O00M30m48j065j108o77J66J085J405R16L69N96
$$ 480437 479324 477366 475572 475105 475705 476135 475687 474622 473514 472837 473003 474088 475493 476409 476778 477374
52537D77374J424J958J657P42k09o36j92R90K321L304L780L556K375O78k65J97
$$ 477374 478798 480756 482413 483155 482946 482310 482118 483108 485429 488733 492513 496069 498444 499122 498857 499054
52521D99054J122J258P84P75J393J925K310L120M029L966L133L111M238M643L050
$$ 499054 500176 501434 502218 502993 504386 506311 508621 511741 515770 519736 522869 525980 530218 534861 537911
52506E37911R59L45M03j261m723p211o702m264k236j457j144n62J25K90n01k112
$$ 537911 538870 539215 539618 538357 533634 526423 519721 515457 513221 511764 510620 510058 510183 510473 509972 507860
52490E07860l862n021n308m821l779k607j902j700j194J29J398J358K14n28j37
$$ 507860 503998 498977 493669 488848 485069 482462 480560 478860 477666 477795 479193 480551 480765 480237 480100
52475D80100N79Q13J004K004L702N191N899O056O257O786P284P106O180N236M780
$$ 480100 480679 481492 482496 484500 488202 493393 499292 505348 511605 518391 525675 532781 538961 544197 548977
52460E48977M230K819R23l53p73j067j663k413l476n101o491o346m909l898l860
$$ 548977 553207 556026 556949 556596 555823 554756 553093 550680 547204 542103 535612 529266 524357 520459 516599
52445E16599l307j327M87K03j649l005l103k795k635k338j966k036k237j421P69
$$ 516599 513292 511965 512452 512655 511006 508001 504898 502103 499468 497130 495164 493128 490891 489470 490239
52430D90239L117M035L015Q46j028j443m59O01N79j10l3J486L650N074M914L378
$$ 490239 493356 497391 500406 501252 500224 498781 498322 498923 499502 499392 499359 500845 504495 509569 514483 517861
52414E17861J789J812L928O811Q815R721J0410J1130J1113R700P047L843J100
$$ 517861 519650 521462 525390 532201 541016 550737 561147 572277 583390 593090 600137 603980 605080
52401F05080p9M68J238M10k069m634o227p129p611p082n192k787j053k48K40R96
$$ 605080 605001 605469 606707 607117 605048 600414 594187 587058 579447 572365 567173 564386 563333 563085 563325 564321
$$ [...]
##END NTUPLES=NMR SPECTRUM
##END=
