##TITLE=AC1764_NAR_16_9683554_1oXbSsTABL
##JCAMPDX= 6.0         $$ Bruker NMR JCAMP-DX V2.0
##DATA TYPE= NMR SPECTRUM
##DATA CLASS= NTUPLES
##ORIGIN= BRUKER
##OWNER= Administrator
$$ 1.72 TOPSPIN		Version 2.1
$$ 2016-04-17 00:35:52.689 -0700  Administrator@X
$$ Compression mode = diff/dup
##.OBSERVE FREQUENCY= 400.02188249412
##.OBSERVE NUCLEUS= ^1H
##.ACQUISITION MODE= SIMULTANEOUS (DQD)
##.ACQUISITION SCHEME= undefined
##.AVERAGES= 8
##.DIGITISER RES= 22
##SPECTROMETER/DATA SYSTEM= spect
##.PULSE SEQUENCE= zg30
##.SOLVENT NAME= COFFEE_meoh
##.SHIFT REFERENCE= INTERNAL, COFFEE_meoh, 1, 14.98509
##AUDIT TRAIL= $$ (NUMBER, WHEN, WHO, WHERE, PROCESS, VERSION, WHAT)
$$ ##TITLE= Audit trail, TOPSPIN		Version 2.1
$$ ##JCAMPDX= 5.01
$$ ##ORIGIN= Bruker BioSpin GmbH
$$ ##OWNER= Administrator
$$ $$ E:\/data/COFFEE/nmr/AC1764_NAR_16_9683554_1oXbSsTABL/10/pdata/1/auditp.txt
$$ ##AUDIT TRAIL=  $$ (NUMBER, WHEN, WHO, WHERE, PROCESS, VERSION, WHAT)
(   1,<2016-04-17 00:35:45.533 -0700>,<Administrator>,<X>,<go>,<TOPSPIN 2.1>,
      <created by zg
	started at 2016-04-17 00:34:39.642 -0700,
	POWCHK enabled, PULCHK disabled,
       configuration hash MD5:
       21 0F 79 D6 B3 7B B4 F6 88 20 88 DB 03 48 BD 9F
       data hash MD5: 64K
       33 89 12 72 A6 8F 1E 19 A8 88 23 E8 08 43 F4 7F>)
(   2,<2016-04-17 00:35:48.642 -0700>,<Administrator>,<X>,<proc1d>,<TOPSPIN 2.1>,
      <Start of raw data processing
       efp LB = 0 FT_mod = 6 PKNL = 1 PHC0 = 0 PHC1 = 0 SI = 32K 
       data hash MD5: 32K
       B0 16 14 3A 34 FA 35 3D B6 D6 0D 9A D4 8C 60 2C>)
(   3,<2016-04-17 00:35:48.923 -0700>,<Administrator>,<X>,<proc1d>,<TOPSPIN 2.1>,
      <pk PHC0 = 91.43921 PHC1 = 0 
       data hash MD5: 32K
       48 D5 2E EF 15 4D 74 AE 12 2A 0C 25 59 27 39 A2>)
(   4,<2016-04-17 00:35:49.033 -0700>,<Administrator>,<X>,<proc1d>,<TOPSPIN 2.1>,
      <abs ABSG = 1 
       data hash MD5: 32K
       AC CD D8 33 46 D5 BD A5 DF E3 2E 49 34 20 6E D3>)
(   5,<2016-04-17 00:35:49.095 -0700>,<Administrator>,<X>,<proc1d>,<TOPSPIN 2.1>,
      <abs ABSG = 2 
       data hash MD5: 32K
       E8 02 ED 4E 5F 05 5A F5 C2 80 22 4A C9 C8 75 68>)
(   6,<2016-04-17 00:35:49.158 -0700>,<Administrator>,<X>,<proc1d>,<TOPSPIN 2.1>,
      <abs ABSG = 3 
       data hash MD5: 32K
       86 25 4B 9A 8C 6B 67 C9 1C 11 5F 76 05 40 D1 8F>)
(   7,<2016-04-17 00:35:49.220 -0700>,<Administrator>,<X>,<proc1d>,<TOPSPIN 2.1>,
      <abs ABSG = 4 
       data hash MD5: 32K
       DD 58 49 3F 3A E8 E4 CF FB 60 4B 44 97 48 00 C0>)
(   8,<2016-04-17 00:35:49.283 -0700>,<Administrator>,<X>,<proc1d>,<TOPSPIN 2.1>,
      <abs ABSG = 5 
       data hash MD5: 32K
       16 36 F8 25 9A A0 17 59 23 3C 8F 24 0A 9E CA 6E>)
$$ ##END=
$$ 
$$ $$ hash MD5
$$ $$ D5 0C 18 3D 24 D6 44 BC 35 A5 3A 71 7D 3A 24 84
##$RELAX= 
##$RELAX= 
##$RELAX= 
##$RELAX= 
##$RELAX= 
##$RELAX= 
##$RELAX= 
$$ Bruker specific parameters
$$ --------------------------
##$DU= <E:\>
##$EXPNO= 10
##$NAME= <AC1764_NAR_16_9683554_1oXbSsTABL>
##$PROCNO= 1
$$ [...]
150 150 150 150 150 150 150 150
##$TP07= 0
##$TPNAME0= <>
##$TPNAME1= <>
##$TPNAME2= <>
##$TPNAME3= <>
##$TPNAME4= <>
##$TPNAME5= <>
##$TPNAME6= <>
##$TPNAME7= <>
##$TPOAL= (0..7)
0.5 0.5 0.5 0.5 0.5 0.5 0.5 0.5
##$TPOFFS= (0..7)
0 0 0 0 0 0 0 0
##$TUNHIN= 0
##$TUNHOUT= 0
##$TUNXOUT= 0
##$USERA1= <user>
##$USERA2= <user>
##$USERA3= <user>
##$USERA4= <user>
##$USERA5= <user>
##$V9= 5
##$VALIST= <valist>
##$VCLIST= <CCCCCCCCCCCCCCC>
##$VD= 0
##$VDLIST= <DDDDDDDDDDDDDDD>
##$VPLIST= <PPPPPPPPPPPPPPP>
##$VTLIST= <TTTTTTTTTTTTTTT>
##$WBST= 2048
##$WBSW= 25
##$XGAIN= (0..3)
0 0 0 0
##$XL= 0
##$YL= 0
##$YMAX_a= 562923
##$YMIN_a= -483698
##$ZGOPTNS= <>
##$ZL1= 120
##$ZL2= 120
##$ZL3= 120
##$ZL4= 120
##$ABSF1= 14.98509
##$ABSF2= -5.573092
##$ABSG= 5
##$ABSL= 3
##$ALPHA= 0
##$AQORDER= 0
##$ASSFAC= 0
##$ASSFACI= 0
##$ASSFACX= 0
##$ASSWID= 0
##$AUNMP= <proc_prof1d_extract_pilot.lims>
##$AXLEFT= 0
##$AXNAME= <>
##$AXNUC= <1H>
##$AXRIGHT= 0
##$AXTYPE= 0
##$AXUNIT= <>
##$AZFE= 0.1
##$AZFW= 0.1
##$BCFW= 0
##$BC_mod= 0
##$BYTORDP= 0
##$COROFFS= 0
##$CY= 15
##$DATMOD= 1
##$DC= 0
##$DFILT= <>
##$DTYPP= 0
##$F1P= 0
##$F2P= 0
##$FCOR= 0.5
##$FTSIZE= 32768
##$FT_mod= 6
##$GAMMA= 0
##$GB= 0
##$INTBC= 1
##$INTSCL= 1
##$ISEN= 128
##$LB= 0
##$LEV0= 0
##$LPBIN= 0
##$MAXI= 10000
##$MC2= 0
##$MEAN= 0
##$ME_mod= 0
##$MI= 0
##$NCOEF= 0
##$NC_proc= -8
##$NLEV= 6
##$NOISF1= 0
##$NOISF2= 0
##$NSP= 0
##$NTH_PI= 0
##$NZP= 0
##$OFFSET= 14.98509
##$PC= 1
##$PHC0= 91.43921
##$PHC1= 0
##$PH_mod= 1
##$PKNL= yes
##$PPARMOD= 0
##$PPDIAG= 0
##$PPIPTYP= 0
##$PPMPNUM= 2147483647
##$PPRESOL= 1
##$PSCAL= 4
##$PSIGN= 0
##$PYNMP= <proc.py>
##$REVERSE= no
##$SF= 400.02
##$SI= 32768
##$SIGF1= 0
##$SIGF2= 0
##$SINO= 400
##$SIOLD= 32768
##$SPECTYP= <>
##$SREGLST= <1H.CDCl3>
##$SSB= 0
##$STSI= 32768
##$STSR= 0
##$SW_p= 8223.68421052631
##$SYMM= 0
##$S_DEV= 0
##$TDeff= 65536
##$TDoff= 0
##$TI= <>
##$TILT= no
##$TM1= 0
##$TM2= 0
##$TOPLEV= 0
##$USERP1= <user>
##$USERP2= <user>
##$USERP3= <user>
##$USERP4= <user>
##$USERP5= <user>
##$WDW= 1
##$XDIM= 32768
##$YMAX_p= 443432576
##$YMIN_p= -776429
##$CURPLOT= <Network HP LaserJet P1505>
##$CURPRIN= <$Network HP LaserJet P1505>
##$DFORMAT= <normdp>
##$LAYOUT= <+/1D_H.xwp>
##$LFORMAT= <normlp>
##$PFORMAT= <normpl>
##$SURQMSG= 1
$$ End of Bruker specific parameters
$$ ---------------------------------
##NTUPLES= NMR SPECTRUM
##VAR_NAME=  FREQUENCY,     SPECTRUM/REAL,   SPECTRUM/IMAG
##SYMBOL=    X,             R,               I
##VAR_TYPE=  INDEPENDENT,   DEPENDENT,       DEPENDENT
##VAR_FORM=  AFFN,          ASDF,            ASDF
##VAR_DIM=   32768,         32768,           32768
##UNITS=     HZ,            ARBITRARY UNITS, ARBITRARY UNITS
##FACTOR=    0.250966925370066, 1,           1
##FIRST=     8223.43324360094, -19262,       22585
##LAST=      0,             -73245,          -253001
##MIN=       0,             -776429,         0
##MAX=       8223.43324360094, 443432576,    0
$$ Real data points
##PAGE= N=1
##DATA TABLE= (X++(R..R)), XYDATA
$$ [...]
19585D1261a07216A33460c33340c0802A53679a37182L6606r9478J4542H8776K52070
19574C40846A61776G5968b44995r7507J4031d8251I8371c7716n9226j42533R7245
19563a42230e7405q1944f2448l43100b01928N2230B5197i5836D8619a08180j4522
19552a22702j47241J11659I792J03236J46360D9572a03160B4626Q7054j3629a83635
19540b39992B7472d3858k2721j84587c8054r3791A11065d19009a01441d9843j08409
19529a58252A29372a49494B03106a9838j0596j28217A43109o6128M3845a95500
19518c36793O3159B63253j18133g0969D45107B2909J3880c9593j05661l24031
19508d69285B2455J97053D3299Q795J43564b71262A95894K617a52742o3830C9420
$$ plain form
19585 41261 -107216 133460 -333340 -30802 153679 -137182 -100576 -200054 -185512 88776 340846
19574 340846 161776 75968 -244995 -342502 -328471 -48251 98371 -37716 -96942 -239475 -142230
19563 -142230 -57405 -139349 -62448 -405548 -201928 -149698 25197 -95836 48619 -108180 -122702
19552 -122702 -269943 -158284 9792 113028 259388 49572 -103160 24626 111680 98051 -183635
19540 -239992 27472 -43858 -66579 -251166 -38054 -131845 111065 -419009 -101441 -49843 -158252
19529 -158252 129372 -149494 203106 -19838 -30434 -158651 143109 76981 120826 -195500
19518 -336793 -273634 263253 145120 -70969 445107 22909 36789 -39593 -145254 -469285
19508 -469285 22455 219508 43299 52094 195658 -271262 195894 198511 -152742 -216572 39420
19496a25580l33596D18397a95312q0347b2923a203k74767L0048Q9406o44a4696
19484a37039N1920n1460B6537R4365b06625b3923j87848A03497a63033J4674L9960
19473a08399l243L5664K7067a7487k42499K0292e7802a0895j01132k15169B9406
19461a2378k20365E9146a78072q7545a23079A68920M8881a12979n4275A52219
19450C9768M10060A62004b51872f1976k00033O5860h1029K7561o536C023h6715
19438A55240i1205j69101A93634a46325F9519J51793B1193a85897l492L8254A22927
19426f7370j17383I8963i6871a411j16896D7750b05977K8303B04847d3445k1659
19415f5104j9650L0022K2687o3885j33989b2660k34412e5318k08470H5751h3750
$$ plain form
19496 -125580 -459176 418397 -195312 -275659 -22923 -1203 -275970 -245922 -156516 -157160 -14696
19484 -137039 -85119 -136579 26537 120902 -206625 -23923 -211771 103497 -163033 -148359 -108399
19473 -108399 -111642 -75978 -48911 -17487 -259986 -239694 -57802 -10895 -112027 -327196 29406
19461 -12378 -232743 59146 -178072 -265617 -123079 168920 217801 -112979 -167254 152219
19450 39768 449828 162004 -251872 -61976 -262009 -196149 -81029 -53468 -60004 3023 -86715
19438 155240 -91205 -260306 193634 -146325 69519 221312 21193 -185897 -189389 -151135 122927
19426 -67370 -184753 98963 -96871 -1411 -118307 47750 -205977 -177674 204847 -43445 -65104
19415 -65104 -84754 -54732 -32045 -95930 -229919 -22660 -257072 -55318 -263788 85751 -83750
19403c33104Q1402d4825k36918g5542B2056I862d6397K0822n2318A03311a49539
19391a86532l1738O1234e9003j31749B08305d977l789k38663a6523E0137Q4531
19380A34668F363K405M5428J63954a60262B28405b141j50749H8951B8507a91336
19368B58977b27246n4782C5097K94803a91271j18767B3794M9345d4151j54586
19358a98737G6680i6035E6951g0339D3411d438D4189J32673a22786A48049a64425
19346g1021A09135C2501a9172m8197B00882a91869L3103I8228g3478B6536b89305
19334D7061a2191A5952J7726b05747r383b6060j25203r0344B44346d5630B11083
19322c9591j61203a1004o2456k8541A18901L4736c16844M5938I8999a75133B4359
$$ plain form
19403 -333104 -251702 -44825 -281743 -75542 22056 9862 -46397 -25575 -77893 103311 -149539
19391 -186532 -218270 -157036 -59003 -190752 208305 -4977 -8766 -247429 -16523 50137 134668
19380 134668 6363 8768 54196 218150 -160262 228405 -2141 -152890 88951 28507 -191336
19368 258977 -227246 -282028 35097 329900 -191271 -310038 23794 73139 -44151 -198737
19358 -198737 76680 -96035 56951 -70339 43411 -4438 44189 176862 -122786 148049 -164425
19346 -71021 109135 32501 -19172 -67369 200882 -191869 -158766 98228 -73478 26536 -289305
19334 47061 -12191 15952 33678 -205747 -215130 -26060 -151263 -241607 244346 -45630 211083
19322 -39591 -200794 -11004 -73460 -102001 118901 153637 -316844 -270906 98999 -175133 24359
19310a9560q4466k0731C60774a48113p931m0988g0857j83232Q9988L4915a0063
19298b51529a9226A68160f0827F3413b30731b7349A75938a51240E6610j8291R7639
19287A35958r773C1265a01288a9390A72266c4305j9424m8234d3340r8020a3388
19275a41528H0112Q9853c71267a71687j94621e0612q3589B01460i7782B20447
19264c75884d4111A02627a70378L8221A47611c8451A803a81167j2510f5488k4396
19253h9884k77386e0230A89275e737l37609J07845c2573A0734d8313E8583h7029
19241f0870A80029d7031A48123J90698i2471b4139C17148b35350e5252l01586
19231c56838a6293p3864m13447B40586b00280a2164q4020K4F4084A1555L64741
$$ plain form
19310 -19560 -104026 -124757 360774 -148113 -156044 -197032 -70857 -254089 -164101 -129186 -10063
19298 -251529 -19226 168160 -60827 63413 -230731 -27349 175938 -151240 56610 38319 135958
19287 135958 126185 31265 -101288 -19390 172266 -34305 -53729 -101963 -43340 -141360 -13388
19275 -141528 80112 169965 -371267 -171687 -366308 -50612 -134201 201460 -97782 220447
19264 -375884 -44111 102627 -170378 -132157 147611 -38451 1803 -181167 -193677 -65488 -89884
19253 -89884 -367270 -50230 189275 -5737 -343346 -235501 -32573 10734 -48313 58583 -87029
19241 -60870 180029 -47031 148123 338821 -92471 -24139 317148 -235350 -55252 -356838
19231 -356838 -16293 -90157 -503604 240586 -200280 -12164 -96184 -96160 64084 11555 376296
19220C76296c73689J22184g2658a1563H5824k2962a84269r3740a7916j25699m3812
19209a87427A35322a59216B63128b08062h1146j342q8765a7819m9378j12971A48000
19197e3709H3373c04130B6516a57506k8750g811l29884C3431f6801k46916J02128
19186b11589d1872A30516j7184b24175k13442a18187N3196q6458p4016J4884o2241
19175b72822a12607C0974i5595k66930f1499G7783b55259K5848b7640A09789J43912
19164B53701a68445K2460b4096j95742a02256d8128j72379j63537a9664D00488
19153i3610A85942a9684j22364B0077c95728L7835H7193j6528b1635k08940j85925
19142d16500A75638b72887I1439m504J1846K73b50487B21747A6117a11942j22212
$$ plain form
19220 376296 -373689 -251505 -72658 -11563 85824 62862 -184269 -278009 -17916 -143615 -187427
19209 -187427 135322 -159216 263128 -208062 -81146 -82488 -171253 -17819 -67197 -180168 148000
19197 -53709 83373 -304130 26516 -157506 -186256 -7811 -337695 33431 -66801 -313717 -211589
19186 -211589 -41872 130516 113332 -224175 -437617 -118187 -64991 -151449 -225465 -210581 -272822
19175 -272822 -112607 30974 -95595 -362525 -61499 77783 -255259 -229411 -27640 109789 253701
19164 253701 -168445 -145985 -24096 -219838 -102256 -48128 -220507 -384044 -19664 400488
19153 -93610 185942 -19684 -142048 20077 -395728 -357893 87193 70665 -21635 -230575 -416500
19142 -416500 175638 -272887 91439 86935 98781 99054 -250487 221747 16117 -111942 -234154
19131b34154N0966B18039P3362a74135B51229f0735C6957J50024N7695c78521
19120A77940D8025J34175i846k71763J12966r7116A7871J4343a64464e5512C9653
19108E2112f9946k23268e4498J7311A94733b6939j45739P4300l7070B05960f9575
19096a24913K0609j8628b6447r8517j40628J00405Q0396F846J65741c8678B85722
19084G3689c9339o0875r4816K4284d237j85211A77094e506F7657b3205F6525a49677
19071a10034k95545E0345K03990C6757a33411M9344N418H6817a8509j19323k01979
19060c39811a29771p4104A75551G0313b36882c6130J3540q9014A08492M697J026
19049A14215c49376c5254B40228h6554A4383i12A62859b04205o3557J23589d0286
$$ plain form
19131 -234154 -183188 218039 291401 -174135 251229 -60735 36957 186981 244676 -378521
19120 177940 48025 182200 -9846 -281609 -168643 -265759 17871 32214 -164464 -55512 39653
19108 52112 -69946 -293214 -54498 -37187 194733 -26939 -172678 -98378 -135448 205960 -69575
19096 -124913 -104304 -122932 -26447 -124964 -265592 -165187 -84791 6846 172587 -38678 285722
19084 73689 -39339 -100214 -195030 -170746 -4237 -189448 177094 -5506 67657 -23205 66525 -149677
19071 -110034 -405579 50345 254335 36757 -133411 -84067 -78649 86817 -18509 -137832 -339811
19060 -339811 -129771 -203875 175551 70313 -236882 -36130 -22590 -111604 108492 113189 114215
19049 114215 -349376 -35254 240228 -86554 14383 -912 162859 -204205 -267762 -144173 -40286
19037f2035q3391c8239A72847E4997c8329D48447C610d7064A27075J24845M8435
19026C00355j32475B9007L3511a13512B6345K42461A8495K68971a81398j991p709
19015a91098G1987a83573h2718l70372J84692L7624B06305M8625c7838j87532
19005b25370A13711B5636b31k16030A26062a71920A6050K71092c86670j03309
18995d89979J75914a04398C14045G9836k6158N0764b71845i8144j83568B7487
18984B00683a58465A87527k7121f86q9830D5866R2580J39185a26918L0562D5227
18972A88698b24940l8019A01692C063d0339F7016M8639k0278J2558c62551I9583
18960a40237d2843p6113A3077i0058C6820g8904L095h757A66601j9862b30786
$$ plain form
19037 -62035 -145426 -38239 172847 54997 -38329 448447 3610 -47064 127075 251920 300355
19026 300355 167880 29007 62518 -113512 26345 268806 18495 287466 -181398 -183389 -191098
19015 -191098 71987 -183573 -82718 -453090 -268398 -230774 206305 254930 -37838 -225370
19005 -225370 113711 25636 -231 -216261 126062 -171920 16050 287142 -386670 -489979
18995 -489979 -314065 -104398 314045 79836 53678 104442 -271845 -98144 -281712 27487
18984 200683 -158465 187527 160406 -686 -90516 45866 138446 277631 -126918 -96356 45227
18972 188698 -224940 -262959 101692 3063 -40339 67016 115655 95377 107935 -362551 99583
18960 -140237 -42843 -118956 13077 -90058 36820 -78904 -75809 -8757 166601 146739 -230786
18948H6507D77e3890A3963a8715j21333C9691K25524h4848A79699H365c86876
18936a22557B48510c40203E9587b29217H9218J55731A16579C0347b92379B08597
18925c631A13028a35849B7144j3508d26617C0362b12220A26588a27579d0015D5652
18913c57947a16378q5987N1008K1530r6834R7836Q42j11540k8811A75732b62044
18901i6142r6112P2638r4617k4304l7365b7901K081j06348q5153d367k30756a08431
18888g0534K4648k36169H7283b33976c3774k66367f9203A26434F2780b05678q0114
18877b85792a42436J9388e0646f364E6455b42121a08003l6448G0499J02003M1377
18866B13879b50409G354f1942p3265H6265a29691j1186H8858m4070L7735J26963
$$ plain form
18948 86507 477 -53890 13963 -18715 -140048 39691 265215 -84848 179699 8365 -386876
18936 -122557 248510 -340203 59587 -229217 89218 244949 116579 30347 -292379 208597
18925 -3631 113028 -135849 27144 13636 -426617 30362 -212220 126588 -127579 -40015 45652
18913 -357947 -116378 -202365 -151357 -129827 -226661 -128825 -127983 -239523 -268334 175732 -262044
18901 -96142 -192254 -119616 -214233 -238537 -275902 -27901 -25820 -132168 -217321 -4367 -235123 -108431
18888 -70534 -45886 -282055 87283 -233976 -33774 -300141 -69203 126434 62780 -205678 -285792
18877 -285792 -142436 -123048 -50646 -6364 56455 -242121 -108003 -144451 70499 172502 213879
18866 213879 -250409 7354 -61942 -135207 86265 -129691 -140877 88858 44788 82523 209486
18855B09486b77424L2177C47402b37371E2762e863k1237H0819P2173a72544A48152
18843A62958a79870A0442J1601b98613b1329D5191a26267A23096e1147C7891J03203
18832A41094A6220K04369n1785i4475J6422H1146C8487b66358e5410l4979J6508
18821g3881g779j54400p7375A14790L44080A92164b78198a26378A02750j3484
18811H9266N8766J41570d2216F0904K07344b54855j24285J35973g4866l4580I1979
18799D0581i8492A45068K78669b37l634k09263I4337a83513O0322M990M3947E1440
18786A82843D4463E382J01907j7892J8343j2617J36734e9332m20732a84745j79546
18775c64291j3851I740g7972k21644J0899A61301a80113a6132r6664A66404i1938
$$ plain form
18855 209486 -277424 -245247 347402 -237371 52762 -5863 -27100 80819 152992 -172544 148152
18843 162958 -179870 10442 22043 -298613 -21329 45191 -126267 123096 -51147 37891 141094
18832 141094 16220 220589 168804 -94475 -78053 81146 38487 -266358 -55410 -90389 -73881
18821 -73881 -7779 -162179 -239554 114790 458870 192164 -278198 -126378 102750 89266
18811 89266 148032 289602 -42216 60904 268248 -254855 -379140 -243167 -74866 -109446 91979
18799 40581 -98492 145068 423737 -237 -3871 -213134 94337 -183513 -123191 -118201 -74254 51440
18786 182843 44463 5382 107289 89397 107740 95123 231857 -59332 -480064 -184745 -364291
18775 -364291 -378142 9740 -77972 -299616 -288717 161301 -180113 -16132 -112796 166404 -91938
18763B57340b16286F0706e1913K2309j43175l9518A12184e87816A19540G551L9551
18752D7102b0833j54865B16297a7951A02114b61606a25793j20259E5344g0172
18741C3544c17789a29195A4517a23549p2216e4904A07261c39898a05855L756E9384
18729G6499a60638B70111a0884C26612A901e9387j07036m4370A88637c0248K275
18718b7973j83415B8430O9272A6150a06071D7625a46661r4145h5305L5663j75895
18707b25537J0289A61424b44144H3166d20362h7405c3716o101A03575d6310F1367
18695C12833c36288J45839n6105p2066C03734A26362d4150A09149q155C6630c58981
18683b50476L2260K2426h8403p4292B24881i7482j37986m9385G7053k4177a79443
$$ plain form
18763 257340 -216286 60706 -51913 -29604 -172779 -212297 112184 -587816 119540 7551 47102
18752 47102 -20833 -175698 216297 -17951 102114 -261606 -125793 -246052 55344 -70172
18741 33544 -317789 -129195 14517 -123549 -195765 -54904 107261 -339898 -105855 -102099 59384
18729 76499 -160638 270111 -10884 326612 1901 -59387 -166423 -210793 188637 -30248 -27973
18718 -27973 -211388 28430 97702 16150 -106071 47625 -146661 -240806 -85305 -49642 -225537
18707 -225537 -215248 161424 -244144 83166 -420362 -87405 -33716 -39817 103575 -46310 61367
18695 312833 -336288 -190449 -246554 -318620 303734 126362 -44150 109149 100994 36630 -358981
18683 -250476 -218216 -195790 -88403 -162695 224881 -97482 -235468 -284853 77053 52876 -179443
18671A05847B4395L562N9477J18340p2633A7386a67888B216J53340b97714J23560
18660a74154e2141l90737J97561d9002C9057i4186I6898j3498R076a53040L0701
18649a22339C084J06994i2568l62016J31049J36684A13668a71538B60442n5455
18639B04987D9528R3896N4016e5041l63088E6843a71006I2029e0301j06081B17589
18627c8181r093C17059p3664f9061k35530B26150c17118a104A13379n4873b41339
18615c58036a70839q1064F7834J65374f6655r2947c3034F1486L9872D7905a0440
18603I9023b94624f9950b4499A02708K66156j79289a04846K5055L5941p7880C52562
18591c74201g6316j14379B29220g6715K7150B8104b42522N1362N1143o8279B17527
$$ plain form
18671 105847 24395 27957 87434 205774 133141 17386 -167888 2216 155556 -297714 -174154
18660 -174154 -52141 -442878 -245317 -49002 39057 -94186 96898 83400 92476 -153040 -122339
18649 -122339 3084 110078 -92568 -454584 -323535 -186851 113668 -171538 260442 204987
18639 204987 49528 143424 197440 -55041 -418129 56843 -171006 92029 -50301 -156382 217589
18627 -38181 -47274 317059 243395 -69061 -304591 226150 -317118 -1104 113379 58506 -241339
18615 -358036 -170839 -251903 67834 233208 -66655 -159602 -33034 61486 101358 47905 -10440
18603 99023 -294624 -69950 -24499 102708 368864 189575 -104846 -79791 -43850 -121730 352562
18591 -374201 -76316 -190695 229220 -76715 -49565 28104 -242522 -191160 -140017 -208296 217527
18579A27552b11672A18039b99676R1723A01402o936a8922p6252q2634N9100K1930
18568i6778Q576A08111b15329F0569a55493A14818A489O4948H141d9010m8312
18557i7322q3926C9389b67228b2795k9986A70131B3918K2030c95068a14293j00438
18546b14731E4732e7775A92418b09206N5254a1776C34663D0853b54205J21999
18536a32206j921H2188c81786O5860A96132a14499A64292K0622p9421h9853j13243
18525b03096P4664B6865e3160p1865P869l6037B100d2113j62849C2635I481a22179
18512c59873C2554E82J28296c2534G5207i666F413a05359A2347Q3188a92747B03052
18499a23221r727j84399g0973o4305j41707Q6407j2115A54515h2466J6580k51060
$$ plain form
18579 127552 -211672 118039 -299676 -207953 101402 94466 -18922 -95174 -177808 -118708 -96778
18568 -96778 -88202 108111 -215329 60569 -155493 114818 1489 66437 8141 -49010 -97322
18557 -97322 -181248 39389 -267228 -22795 -52781 170131 23918 45948 -395068 -114293 -214731
18546 -214731 54732 -57775 192418 -209206 -153952 -11776 334663 40853 -254205 -132206
18536 -132206 -134127 82188 -381786 -315926 196132 -114499 164292 184914 105493 -89853 -203096
18525 -203096 -128432 26865 -53160 -125025 -117156 -153193 2100 -42113 -204962 32635 9481 -122179
18512 -359873 32554 582 128878 -32534 75207 -9666 6413 -105359 12347 95535 -192747 203052
18499 -123221 -132948 -317347 -70973 -135278 -276985 -190578 -202693 154515 -82466 -65886 -316946
18488c16946c0176A24522J61141A13922a95706e0548j17156A92159a37335I1742
18477b20170d0701k24704A48145a59493j18873C25980a04276C1193c99969e4813
18466c92499H6802d2870J2688H1122a16614C110Q4361a46889L305A32136a71374
18454b08180b8495A69607c00094J22491a2597A44931a52233A12121a38280H7293
18443a77987A18476E1055b77607a3239A9124J29551b8621k02899N6041g099B2631
18431A69061b40894g0097j13539M0977A1706a16465M1396j70757G2701a38050
18420b93538i9137j54501g8484n0463j55272N5813j2673M8658k8197D1582i0732
18408I0723b24308e1753A05572Q9167C5743d7743B80893G1433O2224m0696L0594
$$ plain form
18488 -316946 -30176 124522 285663 113922 -195706 -50548 -167704 192159 -137335 91742
18477 -220170 -40701 -265405 148145 -159493 -278366 325980 -104276 31193 -399969 -54813
18466 -392499 86802 -42870 -30182 81122 -116614 3110 87471 -146889 -143584 132136 -171374
18454 -208180 -28495 169607 -300094 -177603 -12597 144931 -152233 112121 -138280 87293
18443 -177987 118476 51055 -277607 -13239 19124 148675 -28621 -231520 -175479 -7099 22631
18431 169061 -240894 -70097 -183636 -142659 11706 -116465 -75069 -245826 72701 -138050
18420 -293538 -99137 -253638 -78484 -128947 -284219 -228406 -241079 -192421 -220618 41582 -90732
18408 90723 -224308 -51753 105572 194739 35743 -47743 280893 71433 133657 92961 123555
18397A23555D1509j9226M1811b35670G3409k3173b80393a14057A01640b28349
18386H5966d03393J88045i2268I7725a46932k9722e9411D391P8260b15348A89937
18374D9640K22566A19554a23734j81924D14168A38396L4641B813J37766D1488
18363B96849A26155A2068R9246j8440j0739a49149O8583B49214b08998k9089C46459
18351B94612a08183j15970d7465k3416c1436l39087A88568D6335b33033A1476
18340C78156D5241a22307q0610P9274A38528a59838K7663f5914q1224d2651C74889
18328A94843b57520i0535A38395c27960J31464B661J79043b03304p296c7909k96248
18317c34157A30053h6822j04192N5083B53977a75263a7088r9243A15037c96177
$$ plain form
18397 123555 41509 22283 64094 -235670 73409 50236 -280393 -114057 101640 -228349
18386 85966 -403393 -215348 -92268 97725 -146932 -176654 -59411 4391 82651 -215348 189937
18374 49640 272206 119554 -123734 -305658 414168 138396 173037 2813 140579 41488
18363 296849 126155 12068 111314 92874 82135 -149149 -80566 249214 -208998 -238087 346459
18351 294612 -108183 -224153 -47465 -70881 -31436 -370523 188568 46335 -233033 11476
18340 378156 45241 -122307 -202917 -123643 138528 -159838 -132175 -65914 -147138 -42651 374889
18328 194843 -257520 -90535 138395 -327960 -196496 2661 181704 -203304 -210600 -37909 -334157
18317 -334157 130053 -86822 -191014 -135931 253977 -175263 -17088 -116331 115037 -396177
18306F1661J00089c4376j9516a6192A81023e1221A4742K61310I1997a70341m0151
18295b10492A56842a22860N7801H2776c3809C01129e9548M202P834j09593H3191
18283b73578G244Q4887b17926G4645d9590j24735A50530A4948a39590k02391i1943
18271c92376e3294a257A00329g0465k89968a32845A92845a59904A21334R8490
18261B19824c80113E45541d1926D4171a08098k05451I2495a61734f3551k41992
18251c05543A9386a1787B41058l161l6011I6926A0100N4313c00253J33320j02223
18240b69156c1336C646L1238A4323a33209p7986N5725M7859A44488b13205A76214
18228C4407c62741G4126h0258L0410j26290j37916J47640J769C35837h6023F4
$$ plain form
18306 61661 161750 -34376 -53892 -16192 181023 -51221 14742 276052 91997 -170341 -210492
18295 -210492 156842 -122860 -65059 82776 -33809 301129 -59548 -55346 -47512 -157105 83191
18283 -273578 7244 92131 -217926 74645 -49590 -174325 150530 14948 -139590 -341981 -91943
18271 -392376 -53294 -1257 100329 -70465 -360433 -132845 192845 -159904 121334 219824
18261 219824 -380113 545541 -41926 44171 -108098 -313549 92495 -161734 -63551 -305543
18251 -305543 19386 -11787 241058 237897 201886 96926 10100 64413 -300253 -166933 -269156
18240 -269156 -31336 3646 34884 14323 -133209 -211195 -155470 -107611 144488 -213205 176214
18228 34407 -362741 74126 -80258 -49848 -176138 -314054 -166414 -164645 335837 -86023 64
18216A69225c28236g2878b0148H1636c17335A79384H6611J5730C2997J93913E5420
18204c37G7910a6326m2069r3730N1543K8787l0689A14252O0120m7353n8696d29745
18191g7586j0270i094A05198c56288e5524n5122r1515d1618J7500C0349a57828
18179a38532G7431i0041k53979d8103k4725j35860d8421q7250r5875R9248H6595
18167A6757a25373k2716j40862H8314q141k0746e3017c165C6813b68162A74625
18155C7779R9296L334B882a48258L5878n9663N4211B24646h5935D3001L0038a20628
18142c7491j90560B05285b15099D5013Q7173d31151D6656m884a25790r1591h5531
18130a72237E0420a6502C04290f5581J0251A51390i8621p353O495J4849n12189
$$ plain form
18216 169225 -328236 -72878 -20148 81636 -317335 179384 86611 102341 32997 226910 55420
18204 -337 77910 -16326 -58395 -152125 -100582 -71795 -102484 114252 174372 127019 68323 -429745
18191 -77586 -87856 -9094 105198 -356288 -55524 -110646 -202161 -41618 -24118 30349 -157828
18179 -138532 77431 -90041 -344020 -48103 -72828 -208688 -48421 -135671 -231546 -132298 86595
18167 16757 -125373 -148089 -288951 88314 80173 59427 -53017 -3165 36813 -268162 174625
18155 37779 137075 140409 2882 -148258 -112380 -172043 -117832 224646 -85935 43001 73039 -120628
18142 -37491 -228051 205285 -215099 45013 132186 -431151 46656 41772 -125790 -217381 -85531
18130 -172237 50420 -16502 304290 -65581 -55330 151390 -98621 -105974 -99479 -84630 -596819
18119e96819a01373M3733a9716B6978L8895b26665r628R7708A63486J39200f6066
18107C9787K15423d6362A98523I9197K47336c61160g9688J6718A9375b11071g7228
18095i2645A52758A8925N15915G1209P475B8615b40479B8098a05761F3577K41515
18084C05092A48356c7179H183M0025a84697m0595h3561l37485b9410j6482A20968
18072b19055G8205a04133l4486a7717k89038A04538C210N4131Q4053J94271b00736
18060a18865B43104b58629O6017E6637K15250b38655F4367a16649C37043b04447
18049e3629k97659B2917R212c8445A41915b1215o180B61287h8225C56219A9048
18037d6298r6800L8332q378d8576B3713O644M7809a08452H2776J45306a17371
$$ plain form
18119 -596819 -101373 -57640 -19716 26978 65873 -226665 -236293 -138585 163486 302686 -66066
18107 39787 255210 -46362 198523 99197 346533 -361160 -79688 -62970 19375 -211071 -77228
18095 -92645 152758 18925 534840 71209 78684 28615 -240479 28098 -105761 63577 305092
18084 305092 148356 -37179 8183 48208 -184697 -225292 -83561 -421046 -29410 -45892 120968
18072 -219055 78205 -104133 -138619 -17717 -306755 104538 3210 57341 141394 335665 -200736
18060 -118865 243104 -258629 -192612 56637 271887 -238655 64367 -116649 337043 -204447
18049 -53629 -351288 22917 32129 -38445 141915 -21215 -27395 261287 -88225 356219 19048
18037 -46298 -143098 -104766 -113144 -48576 23713 30357 78166 -108452 82776 228082 -117371
18025G8922R3513f425F0537a49621k19874E2190b89292A6870h278C6978b55935
18013a14034l6648j8254c5842o852G4154a82293A59024a01611O118C64115a48801
18001a33238n6644j45192a02188J8979k22060H9986g7116j8604H5207O8554h3213
17989I9028q332J22152F5625a20155L3737d0701B20511g8090A78949d12722I6492
17977a6535A13233a38024K7877C9777a99433I1377l4139J83352i1166j13282D043
17965A53077O7260c40391A12417Q7033a110j4204f023j74240k2598B63802e4164
17953f9675m4519B25990b04461B99658a87843H3318a73441C7805M923b24716A95884
17941a30836A46370c37691B06473b23897d8486k6064E6365L4306a21951k85830
$$ plain form
18025 78922 172435 -6425 60537 -149621 -369495 52190 -289292 16870 -8278 36978 -255935
18013 -114034 -150682 -168936 -35842 -42694 74154 -182293 159024 -101611 -95493 364115 -148801
18001 -133238 -189882 -335074 -102188 -83209 -305269 89986 -77116 -95720 85207 153761 -83213
17989 99028 90696 212848 65625 -120155 -86418 -40701 220511 -78090 178949 -412722 96492
17977 -16535 113233 -138024 -110147 39777 -199433 91377 57238 240590 -91166 -204448 4043
17965 153077 220337 -340391 112417 199450 -1110 -15314 -6023 -180263 -202861 263802 -54164
17953 -69675 -114194 225990 -204461 299658 -187843 83318 -173441 37805 42728 -224716 195884
17941 -130836 146370 -337691 206473 -223897 -48486 -74550 56365 90671 -121951 -407781
17931d07781G2472J7113b10233O9962A02564b07772F4450j5434J11369L3261a0732
17919C6899a98992p957B93361I0874N6807p404d521q35j47965C24716a13113F3555
17906A8191c71735J30140A91396a27119d2114B56087C8140J00852n5749C2491
17895B65287j9020i9301o0558e8514J6368r1257b5130A65088a67211j72001D43572
17883a58270l8989d6717C7622c15040P5063c2281A40398e2156j20764n6757k3387
17872b53064c5823A45749n5463h5948g534A43268d9665n3099A07143b85955i1083
17860i8596A5438d4696B66685A7856i159l12078d3444j6587B16744H3048b9790
17848a05790A678b02680B12375H8691a7183F376a09327b8294G92J52997J9896
$$ plain form
17931 -407781 72472 89585 -210233 -140271 102564 -207772 64450 49016 160385 193646 -10732
17919 36899 -198992 -206949 293361 90874 147681 140277 -4521 -5356 -153321 324716 -113113 63555
17906 18191 -371735 -241595 191396 -127119 -42114 256087 38140 138992 83243 32491
17895 265287 246267 -99301 -159859 -58514 -42146 -133403 -25130 165088 -167211 -339212 443572
17883 -158270 -197259 -46717 37622 -315040 -239977 -32281 140398 -52156 -172920 -229677 -253064
17872 -253064 -35823 145749 90286 -85948 -7534 143268 -49665 -102764 107143 -285955 -91083
17860 -98596 15438 -44696 266685 17856 -9159 -321237 -43444 -60031 216744 83048 -29790
17848 -105790 1678 -202680 212375 88691 -17183 6376 -109327 -28294 792 153789 173685
17837A73685a89307L4340m2864A9477J63268e8538k855K7738l3326j83429G4312
17825a49714A12805J4948C9431B794d28809h5369B5629L10469P0194a22834b5526
17813g0988G1087a58798H0968b671m9510o875j7507q5200A33969e6571F3818i399
17800e3123m5492B46896d0731B73208c49811O3691h1729B5291n843d776B53978
17788A33268J43224a69195f0404C47918a25832n3611c2621n0274b1103I943b39320
17776G3352f2055J7829C87984d48844K18054B14800G8908a03654a6163D0303a12865
17764D4532N5176A8665K06635P1172j28125E8722g5449E1509j6434R4586o0819
17753F8842Q0331b52380d739n4920b8917q0244C1143a42712C8614b14906p4199
$$ plain form
17837 173685 -189307 -154967 -197831 19477 182745 -58538 -61393 -33655 -66981 -250410 74312
17825 -149714 112805 127753 39431 2794 -428809 -85369 25629 336098 406292 -122834 -25526
17813 -70988 71087 -158798 80968 -2671 -52181 -59056 -76563 -161763 133969 -56571 63818 -9399
17800 -53123 -98615 246896 -40731 273208 -349811 -286120 -81729 25291 19448 -4776 253978
17788 133268 276492 -169195 -60404 347918 -125832 -179443 -32621 -82895 -21103 9943 -239320
17776 73352 -62055 -44226 387984 -448844 -230790 214800 78908 -103654 -16163 40303 -112865
17764 44532 99708 18665 225300 296472 168347 58722 -75449 51509 35075 129661 68842
17753 68842 149173 -252380 -4739 -59659 -28917 -109161 31143 -142712 38614 -214906 -289105
17742b89105I2226K15935j835J1375a61479D2548g8622I1409B423a95019B51649
17730d5816A29775E5558a0842m2251a5131C5983a91379C56187A55666b62996B3458
17718a72252D5210a04481d6445A42107M388h1403m4428H3983b52456H8612O5256
17707A53868a52396L3120j07892A15649i6585A03645C8745J3841k0809i4723j64224
17696b58947Q5716B37016b59274J10744a5220E4792J07295M2000P8073K9093a08072
17684a44687j02990a18289A28788b64112j4581F7390K985i1386B03781q3294O3332
17673A83819G0088k5875a50526B157M6031h2477c5092l3282B93583a00161b6495
17661e1153A605P5150a19197a2730l10137B39031a17692B73263A8722c08644B09881
$$ plain form
17742 -289105 92226 308161 306326 317701 -161479 42548 -78622 91409 2423 -195019 251649
17730 -45816 129775 55558 -10842 -53093 -15131 35983 -191379 356187 155666 -262996 23458
17718 -172252 45210 -104481 -46445 142107 146495 -81403 -125831 83983 -252456 88612 153868
17707 153868 -152396 -119276 -227168 115649 -96585 103645 38745 52586 31777 -94723 -258947
17696 -258947 -173231 237016 -259274 -148530 -15220 54792 162087 204087 282160 311253 -108072
17684 -144687 -247677 -118289 128788 -264112 -278693 67390 70375 -91386 203781 120487 183819
17673 183819 70088 44213 -150526 2157 48188 -82477 -35092 -68374 293583 -100161 -26495
17661 -51153 1605 76755 -119197 -12730 -322867 239031 -117692 273263 18722 -308644 209881
17649I8299a11204G3235g2348A55064g5422C2838C488J70514a03370o2015j42459
17638c07844A20328a51101C5266L24059H2735i3901A62808J24767j04238f0708
17627D4870J31068L1957R5555b0269M190j10409A88985C1557J4409a76775Q3139
17616i3636C58425a77428A66732K2733q9263K66218A43837L1334e0670C529d03874
17604C10237b86039m8695B19362b5337A26680C4447J33865a94609e5487k6065
17594h1552o3446H7177g7860D4455a89884f97j2612B08633C1735h8470E9111M5256
17582A04367b47333i1136A43322h4989j07069k28913e206C0548N8515k2088O3954
17571A30929m0584a6017E3345M3204J6784b57565a13214A72328p9771d3612A13147
$$ plain form
17649 98299 -111204 73235 -72348 155064 -75422 32838 3488 174002 -103370 -165385 -307844
17638 -307844 120328 -151101 35266 359325 82735 -93901 162808 287575 183337 -60708
17627 44870 175938 207895 303450 -20269 -16079 -126488 188985 31557 45966 -176775 -93636
17616 -93636 358425 -177428 166732 189465 100202 366420 143837 175171 -50670 3529 -403874
17604 310237 -286039 -334734 219362 -25337 126680 34447 168312 -194609 -55487 -81552
17594 -81552 -144998 87177 -77860 44455 -189884 -697 -13309 208633 31735 -88470 59111 104367
17582 104367 -247333 -91136 143322 -84989 -192058 -420971 -5206 30548 89063 66975 130929
17571 130929 90345 -16017 53345 96549 113333 -257565 -113214 172328 92557 -43612 113147
17559a43995A08204M5178o8663J07185i4845c5948o4882A57297b7515J2602q1534
17548i6447N849F0133P2356d8988j25013B32885A09311m2941J94961A12317L8090
17537A50407d3259A88520C84a1718r208k87325D8474J16804N3639m7288K15810
17526C87439a28439A59611D2509a05498A1136K01607J44287A34039a18390j42533
17516b60923d1276j5766j23949A58266J01814G0796K011b70411A57683d053l1881
17505c5934A61256E4190Q0113l3280N3220f1142e833A55732p4224Q0090a49583
17493i9446G9202Q5442c8452A29303C5205m416Q51N1560J04272O112o6516L5488
17481A62556O3219J40044G6899K21197a3087A06774g9741E665J02436P2237G3062
$$ plain form
17559 -143995 108204 153382 84719 191904 -94845 -35948 -100830 157297 -27515 -14913 -96447
17548 -96447 -90598 60133 132489 -48988 -174001 232885 109311 66370 261331 112317 150407
17537 150407 -43259 188520 384 -11718 -20926 -308251 48474 165278 218917 171629 387439
17526 387439 -128439 159611 42509 -105498 11136 212743 357030 134039 -118390 -260923
17516 -260923 -41276 -57042 -180991 158266 260080 70796 72807 -270411 157683 -4053 -35934
17505 -35934 161256 54190 134303 101023 154243 -61142 -5833 155732 81508 161598 -149583
17493 -99446 79202 164644 -38452 129303 35205 30789 31640 83200 187472 193584 127068 162556
17481 162556 225775 365819 76899 298096 -13087 106774 -79741 5665 108101 180338 73062
17469g4346p7984I7998B4204g0270A2219b05295A25572e6826B51011j7703j2576
17458B20732b1510B14311K4584k2595g7428G8105Q1509R6296C6805J19886J81577
17447C38268J21243l051I1920m0379R3168d0332E03091A55633K25219m0533q6652
17436B53667l9651G5905L8304B7081a76605B03716L2704a69237H9409P7819o8949
17425I8279B8648J90630j2382F6747M5326K38429H3874K46815q3288K87475B01887
17413B61190a74114A05189M3694Q6647B887d065B53888A08059K49878A18742J87271
17402C06013e3229A54045i533j29390f863j17537A3478a59733G3288J2826Q3054
17391A69168a09615o1699e9484n6251B77608A04782J87396A33537l0845R9238
$$ plain form
17469 -74346 -152330 97998 24204 -70270 12219 -205295 125572 -56826 251011 233308 220732
17458 220732 -21510 214311 238895 216300 -77428 78105 159614 255910 36805 156691 338268
17447 338268 459511 456460 91920 51541 144709 -40332 503091 155633 380852 340319 253667
17436 253667 214016 75905 114209 27081 -176605 203716 236420 -169237 89409 167228 98279
17425 98279 28648 219278 206896 66747 112073 350502 83874 330689 247401 534876 201887
17413 261190 -174114 105189 148883 235530 2887 -4065 253888 108059 357937 118742 306013
17402 306013 -53229 154045 -9533 -138923 -6863 -124400 13478 -159733 73288 86114 169168
17391 169168 -109615 -171314 -59484 -115735 277608 104782 292178 133537 102692 201930
17381B01930p5266e6480A44001C402K0378e6558G9717E991e3601D845K34501C7346
17368G1300M6346c1411B17950P3184k1996a4502A24198q072J54118K7737d4377
17356A17260a40298C41555b9456A21763J74785p6608J09997A2669L26J59255D1614
17344b60797B52643K86239c4476C47158j37705r0710m2018C6485J6522j2771J89203
17333B29439F0501g0530Q914D24497C1646Q4675i8384A85044N4335a4126l2053
17322d6179N155B95154E3806N6616m9324K4255K52889F0100K14968B0634J40143
17311A60777D964K26914B2498K99658O2810A3659K42190a55043C07178Q7755F3456
17299B21407m4206k8275J95107I8622g6991B27963K2624f3964A63217L14546F0144
$$ plain form
17381 201930 126664 -56480 144001 3402 23780 -56558 79717 5991 -53601 4845 239346 37346
17368 71300 117646 -31411 217950 291134 269138 -14502 124198 116126 270244 297981 -44377
17356 117260 -140298 341555 -29456 121763 296548 219940 329937 12669 12995 172250 41614
17344 -260797 252643 538882 -34476 347158 209453 118743 76725 36485 53007 40236 229439
17333 229439 60501 -70530 -61616 424497 31646 116321 -98384 185044 239379 -14126 -46179
17322 -46179 -41024 295154 53806 110422 61098 85353 338242 60100 275068 20634 160777
17311 160777 4964 231878 22498 322156 384966 13659 255849 -155043 307178 394933 63456
17299 221407 177201 148926 344033 98622 -76991 227963 250587 -63964 163217 477763 60144
17287h5645A47177J57977a3990G3717K84158e1217B33285R6705j59577m9296n229
17276A15888b4456C3202J53962i9293C98191A05285K102J20645l1378e6752B07280
17264A14765N4298J19506L17476B84380R8967a37625C50480j04715m4377a15842
17253B86908D2515J06410K81791g3623G3850f2258A39158K7225o496a2515C93158
17241B76984a52083A08728O2004p733E3219J3423N9530a13177K0246A63846K3363
17230A87209J01346M1216A4092K33284A21766B5042J98378r7223J57634J22990
17220D06821j6282P7361f3629B25020K35171A09019l9364J61423R2229A28722
17209A94882O1727D1441M9123J55295r2745b9697G7671P0297L7524D3540b35098
$$ plain form
17287 -85645 147177 305154 -13990 73717 357875 -51217 233285 329990 170413 121117 115888
17276 115888 -24456 33202 187164 -99293 398191 105285 107387 228032 196654 -56752 207280
17264 114765 169063 288569 606045 284380 383347 -137625 350480 245765 201388 -115842
17253 286908 42515 148925 430716 -73623 73850 -62258 139158 166383 159887 -12515 393158
17241 276984 -152083 108728 170732 162999 53219 66642 126172 -113177 -92931 163846 187209
17230 187209 288555 329771 14092 247376 121766 25042 223420 126197 283831 406821
17220 406821 390539 467900 -63629 225020 460191 109019 69655 231078 323307 128722
17209 194882 256609 41441 90564 245859 153114 -29697 77671 147968 185492 43540 -235098
17197B68930j561n4017l6585k85J79861F8197J29802J9089M3596j16013M43663
17186E88334k76686A12345O8957J43054L01179A67548o5424A0305L82185A87243
17175d1043C00756N4952E3730M50246k24244O5890n7442N892A05743b7085A82192
17163C53492H8204K47252r3803L3600m1673o2375j7436Q2443M0940h3638A33586
17151D52847k16508J30332m6300J74280c6023A85468I1287f917B58825G9319A0596
17139D9917K90060A56113J22361J1087L44763j74942l7615n325j37223L52572
17129F31791j58474P2094j53870j54639P8184N6012n0184K66140k45459j59371
17119A82224J50136l796Q0144A28561J76404A17674K17142j59793J79666A55326
$$ plain form
17197 268930 267369 213352 176767 176482 356343 68197 197999 217088 260684 144671 588334
17186 588334 311648 112345 181302 324356 625535 167548 102124 10305 392490 187243
17175 -41043 300756 355708 53730 503976 279732 345622 288180 294072 105743 -27085 182192
17163 353492 88204 335456 241653 275253 233580 171205 153769 236212 277152 -83638 133586
17151 452847 236339 366671 320371 494651 -36023 185468 91287 -6917 258825 79319 10596
17139 49917 339977 156113 278474 289561 634324 459382 421767 416442 279219 631791
17129 631791 473317 545411 391541 236902 315086 371098 320914 587054 341595 182224
17119 182224 332360 328564 408708 128561 304965 117674 334816 175023 354689 155326
17108C98265A68591K89561r9591K61243A32115C8934K37729k4956K9786K31600
17098E13093k7502m1173K4670j02349M5071k00398J62973l2973J9500N8497K4544
17087D43953A22690K1082L47223O8371l7811k52259j32414M40748B83005I9516
17076C10622K06058m3979n0734A16084L13987j32697K17593N7978B34941J96930
17066D31871R2717l9040I8627L84955p4884j04125J9790J49179K6944B46597l5663
17055B10934J52270J14599j38606R3660m7045M5997j14857Q5397P1623K5011j65805
17044C33178Q6698R9846J9352j91551J53968k30475K04878j22075J49195n2108
17034D50906K75087o7296m1713j08533j65181M23950R030j68608j73123J28437
$$ plain form
17108 398265 168591 458152 358561 619804 132115 38934 276663 251707 281493 513093
17098 513093 485591 444418 469088 366739 411810 211412 374385 341412 360912 419409 443953
17087 443953 122690 143772 490995 559366 521555 269296 136882 577630 283005 99516
17076 310622 516680 472701 421967 116084 430071 297374 514967 572945 234941 431871
17066 431871 524588 485548 98627 483582 408698 304573 324363 473542 500486 246597 210934
17055 210934 363204 477803 339197 432857 385812 431809 316952 402349 473972 498983 333178
17044 333178 419876 519722 539074 347523 501491 271016 475894 353819 503014 450906
17034 450906 725993 658697 616984 508451 343270 767220 776250 607642 434519 562956
17024E62956J70579j69458j12616M1581r6105J56551j52873K21938P7803L2514
17014G32870j19844J88889l50254O9768j84544K60187k67866J60870J94939m8794
17004F36221o3587j7586J77623j01728n2983j26370K35278k17913L48562K9452
16994H46969j15430j77508K16035k77658K00305r6462K74213q1098Q1329C40069
16983H83578k08347J05068N5101j23482J6169r3783m9529K76326J70734j35460
16973H96375m6074J58021j73847p3357K48735m09496K91298O8116j65479R850
16963H04142n4977j00660j17993L21781j77222l9021L68837L13488m86725J16191
16953I47841j08433J36210j8398j5254J20262k82232L53229p9308j93661M08015
$$ plain form
17024 562956 733535 564077 451461 493042 396937 553488 400615 622553 700356 732870
17014 732870 613026 801915 451661 521429 336885 597072 329206 490076 685015 636221
17004 636221 572634 555048 732671 630943 577960 451590 686868 468955 817517 846969
16994 846969 731539 554031 770066 492408 692713 596251 870464 789366 870695 340069
16983 883578 675231 780299 835400 711918 728087 634304 584775 861101 1031835 896375
16973 896375 850301 1008322 834475 761118 1009853 600357 891655 959771 794292 804142
16963 804142 749165 648505 530512 852293 675071 636050 1004887 1318375 831650 947841
16953 947841 839408 975618 957220 941966 1062228 779996 1133225 1053917 860256 1268271
16943A268271n21273J45873J39132q6190R3464m4695K9438m401J95773k93968
16933I21424P3369J16123j33780K140R425N8115L0137P4252J42226k04131K86084
16922A375384o0419p0339J23419O7956l29174j09493K23296J30146J73316m02135
16912A121957M16370l61000L37417n5494j34453K13381o8123K97034l44096K36547
16902A659540k62841l319J24889j07266l48237K41719K95135K18378k49402K19684
16892A788280L62983n47718J19601R8713K36721l01883m3410N2628K46189j13531
16882A898573K87038r6446k70083L37045k22358L94649l38792o4004J88491J18747
16872B232860L25024k00219j85090Q1184n1956k7856J41107O3252k76822M40724
$$ plain form
16943 1268271 746998 892871 1032003 945813 1039277 994582 1024020 1019619 1215392 921424
16933 921424 994793 1110916 977136 979276 988701 1046816 1076953 1151205 1293431 1089300 1375384
16922 1375384 1314965 1244626 1368045 1436001 1106827 997334 1220630 1350776 1524092 1121957
16912 1121957 1538327 1177327 1514744 1459250 1324797 1538178 1470055 1767089 1422993 1659540
16902 1659540 1396699 1393380 1518269 1411003 1062766 1304485 1599620 1817998 1568596 1788280
16892 1788280 2151263 1603545 1723146 1821859 2058580 1756697 1713287 1765915 2012104 1898573
16882 1898573 2185611 2089165 1819082 2156127 1933769 2328418 1989626 1925622 2114113 2232860
16872 2232860 2557884 2357665 2172575 2253759 2201803 2173947 2315054 2378306 2101484 2542208
16862B542208M0996r0405o3582K22598J26048L0119j92161j4570k5934L10620
16852B885937j1041j8319k42605J019J1278k5724P14807l86306m3806K09456k57344
16841B837352L25576n05862M41128K31490M9416O517J11153J68371M6684J47480
16831C859305K93540l90282J08386n2474L50593k10993L14787P7250L86329j30842
16821D605599J2697j01704R1820K02642p9981k823K83028q159J8545J62391j5027
16810E169028M88377j0816K0624N69477J9957R4246k41475K75740N51418k76914
16800F659662J94992K92775p9987K11669K83534J20884N04386r1777L647N55304
16790H655089k5652K45658N04743L37155j06725J44954M32247K34902P65344j81574
$$ plain form
16862 2542208 2583204 2492799 2429217 2651815 2777863 2807982 2615821 2601251 2575317 2885937
16852 2885937 2874896 2856577 2613972 2614991 2626269 2600545 3315352 2929046 2885240 3094696 2837352
16841 2837352 3162928 2657066 3098194 3329684 3379100 3385617 3496770 3665141 3711825 3859305
16831 3859305 4152845 3762563 3870949 3818475 4169068 3958075 4272862 4350112 4736441 4605599
16821 4605599 4618296 4516592 4608412 4811054 4731073 4728250 5011278 5003119 5021664 5184055 5169028
16810 5169028 5657405 5646589 5667213 6236690 6256647 6350893 6109418 6385158 6936576 6659662
16800 6659662 6854654 7147429 7067442 7279111 7562645 7683529 8187915 8096138 8099785 8655089
16790 8655089 8629437 8875095 9379838 9716993 9610268 9755222 10187469 10422371 11187715 11006141
16780A1006141N49789j22643O53208M72836N08399M01313M09249K75798N08090
16771A4662180N51254L95694L83858M58516P75947P79931M03042P25219Q85065
16762B0020706M99953P29637J099845Q33474Q02580Q48734J221889J176304J188122
16753B8421244J315316J063115J540507J508758J731191J798271J451999J944263
16745D0774664K356678K173283K278610K505022K818705K976593L382712L454274
16737F2720541L659310L789947L677919M524221M547277N214177N535519N082535
16729I8751446N914334O002573O364127O254463O555837O420093O229861N956453
16721A48449187N325374N032624M154448L556514K294580J250587L24531j058920
$$ plain form
16780 11006141 11555930 11433287 12086495 12559331 13067730 13469043 13878292 14154090 14662180
16771 14662180 15213434 15609128 15992986 16451502 17227449 18007380 18410422 19135641 20020706
16762 20020706 20520659 21250296 22350141 23183615 23986195 24834929 26056818 27233122 28421244
16753 28421244 29736560 30799675 32340182 33848940 35580131 37378402 38830401 40774664
16745 40774664 43131342 45304625 47583235 50088257 52906962 55883555 59266267 62720541
16737 62720541 66379851 70169798 73847717 78371938 82919215 88133392 93668911 98751446
16729 98751446 104665780 110668353 117032480 123286943 129842780 136262873 142492734 148449187
16721 148449187 153774561 158807185 162961633 166518147 168812727 170063314 170387845 169328925
16713A69328925k238134k637475m057776m685415n225435o234414o046222o566429
16705A31637625o500619o291609o338221o225935o096495n584115n367547n067715
16697H4165369n010628m403374m303426m280399l287267l737711l479315k891543
16689E2771706k791324k689500k284963k474502j968444k330996j794289j587816
16681C4849872j933024j117601j658941j008147j370346j391654j144299j111777
16673B4114083r32709p94687j106493p41050q28104n78615j157038k01901r10166
16664A6863320m71716p07207m69300n48565l87413m13104q30835j44842p24843
16655A2165495j17172p57713O8627l64092q08390J12180j03347p46000L06018
$$ plain form
16713 169328925 167090791 164453316 160395540 155710125 150484690 144250276 138204054 131637625
16705 131637625 125137006 118845397 112507176 106281241 100184746 94600631 89233084 84165369
16697 84165369 79154741 74751367 70447941 66167542 62880275 59142564 55663249 52771706
16689 52771706 49980382 47290882 45005919 42531417 40562973 38231977 36437688 34849872
16681 34849872 32916848 31799247 30140306 29132159 27761813 26370159 25225860 24114083
16673 24114083 23181374 22386687 21280194 20539144 19711040 19132425 17975387 17773486 16863320
16664 16863320 16391604 15684397 15215097 14666532 14279119 13866015 13035180 12890338 12165495
16655 12165495 12048323 11290610 11359237 10995145 10186755 10298935 10195588 9449588 9755606
16646I755606q90788L08065n87330L3278j80897n15200l86368k5749j06060p9688
16636G324869o72777m7062M31851p65894R8215r9680k7017m67293q0638r7086
16626E597488o7452l07628J76091m24915J74689m4050j55588j47693k61602J66229
16616D705569j59363l42307J92270k89785J99954k93081J2450k05252k2005k0976
16606C777474J93326n69240j5745m786P4583o3798j72058o441J74562m59438K45297
16595C173736l29433Q8536l332j7535k58271k3263J48757k63884J87104j54993
16585B547422J75339m19168K23668p5636K3276p8548j00112k78270J53393J81199
16575B352563j97581J84138j30769k01998K54230o30239L79557j86827K36171
$$ plain form
16646 9755606 8864818 9172883 8585553 8618831 8437934 7922734 7536366 7510617 7404557 7324869
16636 7324869 6652092 6605030 7036881 6270987 6369202 6269522 6242505 5775212 5694574 5597488
16626 5597488 5530036 5222408 5398499 4973584 5148273 5104223 4948635 4800942 4539340 4705569
16616 4705569 4546206 4203899 4396169 4106384 4306338 4013257 4025707 3820455 3798450 3777474
16606 3777474 3970800 3401560 3385815 3381029 3455612 3391814 3219756 3213315 3387877 2928439 3173736
16595 3173736 2844303 2932839 2929507 2911972 2653701 2630438 2779195 2515311 2702415 2547422
16585 2547422 2722761 2303593 2527261 2451625 2474901 2396353 2296241 2017971 2171364 2352563
16575 2352563 2154982 2339120 2208351 2006353 2260583 1630344 2009901 1823074 2059245
16566B059245m09212M21132J02289q5367l12991l0027J24332j49644k15871K34347
16556A738233r1931J22911k59263P3380j13997K17602j56001J8872k19787J11954
16546A441973K95751l70516N9402p6245j48474P3306n9839K86091k09286o6730
16536A225433j3657K80352j79317J33084k05743j07678l61974L85510j04249L16383
16526A368144m38458k97885M86007m48227L88873n2563Q3058k61251M88180k02677
16516A113201M4726j62701j72354K1676M0881k6760j61904J70783J05032O7164
16506A039744k23643r3519k9164J65120o2829M20584m80179J07516J27000l12272
16496F58358K21040l96034N80799k50637j49290J61853j15746M10724k65782l47219
$$ plain form
16566 2059245 1650033 2071165 2173454 2088087 1775096 1745069 1869401 1719757 1503886 1738233
16556 1738233 1646302 1769213 1509950 1583330 1469333 1686935 1530934 1549806 1330019 1441973
16546 1441973 1737724 1367208 1426610 1350365 1201891 1275197 1215358 1501449 1292163 1225433
16536 1225433 1211776 1492128 1312811 1445895 1240152 1132474 770500 1156010 1051761 1368144
16526 1368144 929686 631801 1117808 669581 1058454 1005891 1088949 827698 1315878 1113201
16516 1113201 1157927 995226 822872 844548 885429 858669 696765 867548 972580 1039744
16506 1039744 816101 722582 693418 858538 795709 1216293 736114 843630 970630 658358
16496 658358 879398 483364 1064163 813526 664236 826089 710343 1121067 855285 508066
16486E08066L26700l59671K40765J70348j74713k729j9580J34018P9777k40639
16476F62342n7225L13882k86779K9673P0195k24197J23206N4705J95754D32494
16465D40481K20338J95494l99043M9757K5469n3949J88098j73093j6991B12979
16454E01705R5696B18906o0590N60141C45358K52687j9181B72640K21871M3795
16444E38306J1364j03097J24467B70849M30359D0732K15003p1346K14797J97148
16434E96334B27129J57656J52955A18025L8719K69363K65971A36368J1005K54952
16424D02325k9087J36193j53873A08585M20866B39914L67279j74092R052K6804
16414D68957A21484J48205J18753J27282j37564O0607j17376p7244m4032J89342
$$ plain form
16486 508066 834766 475095 715860 886208 711495 708766 689186 823204 902981 662342
16476 662342 605117 918999 632220 661893 732088 507891 631097 685802 881556 432494
16465 440481 660819 856313 457270 507027 532496 478547 666645 493552 476561 212979
16454 501705 597401 218906 158316 718457 345358 598045 578864 272640 494511 538306
16444 538306 549670 446573 571040 270849 701208 40732 255735 184389 399186 596334
16434 596334 227129 384785 537740 118025 156744 426107 692078 136368 147373 402325
16424 402325 373238 509431 355558 108585 529451 239914 607193 433101 442153 468957
16414 468957 121484 269689 388442 515724 378160 438767 321391 244147 200115 389457
16404C89457Q9977J70410H5137K20681K71928A83325F9939L36435k7776j3958
16394C64640P6637j34348p7487R6895j11516N646m9309m0723a9214F5761J78023
16383B43784J20343J37820k09356j03183K20322j58960J68352I8381J05438q4045
16373A19774L06075j2850A98474J06175L78919H5261L25874j4350j59289R9552
16363C37048A63932J88436j2153G5520K47959n3278q4102J43350j57411m4499
16353A27539C435N59051k65866E5191L05174H3750B8779J92158b0528M307B91882
16341B15888J21606D9322L25261j29791G4386N52499A05344K21561A24254E5901
16330a21822F7913L8696a18391A30020L2328L6923J54701J33936a34109C8120
$$ plain form
16404 389457 479434 649844 85137 305818 577746 183325 69939 406374 378598 364640
16394 364640 441277 306929 229442 326337 214821 220467 171158 130435 -19214 65761 243784
16383 243784 364127 501947 292591 189408 409730 250770 419122 98381 203819 119774
16373 119774 425849 412999 198474 304649 683568 85261 411135 396785 237496 337048
16363 337048 163932 352368 340215 75520 323479 270201 186099 329449 172038 127539
16353 127539 3435 562486 296620 55191 360365 83750 28779 220937 -20528 -16221 291882
16341 215888 337494 49322 374583 244792 74386 626885 105344 326905 124254 55901
16330 -121822 67913 106609 -118391 130020 162348 199271 353972 487908 -134109 38120
16319b58897A95552B4575L77427A66707J28717j41609k6473J72909a54363A63684
16308A06683R1435I1500K31840p6285J57864h9229I3751J223k9715L10868q4086
16297B92041a03564A48111p1122J3521j4630M7082C699J37710J2233G4598K03403
16286B78001o5746J7168d8036B99110Q0669A82057L25029A16845B3076L24295
16276C47371b44343D2790L73059K1799A18708I21h1669E1400J317P4516E4257
16264A13716K32383b84658E5514J16931J13368A05025e8334f74C85844j48480
16254B37364q1609P0452F1241K45360J96831A3010P3167m0049a55147F8679K04333
16243B73012f2949A34271a5330q081j00050D7598M5K11581B4187b47369e8204
$$ plain form
16319 -258897 195552 24575 402002 166707 295424 153815 127342 300251 -154363 163684
16308 106683 198118 91500 323340 247055 404919 -89229 93751 94974 65259 376127 292041
16297 292041 -103564 148111 76989 90510 75880 122962 3699 141409 153642 74598 278001
16286 278001 212255 229423 -48036 299110 379779 182057 507086 116845 23076 347371
16276 347371 -244343 42790 415849 437648 118708 921 -81669 51400 52717 127233 54257
16264 113716 346099 -284658 55514 172445 285813 105025 -58334 -674 385844 237364
16254 237364 155755 226207 61241 306601 503432 13010 86177 46128 -155147 68679 273012
16243 273012 -62949 134271 -15330 -23411 -123461 47598 47643 259224 24187 -247369 -58204
16231B26321Q5128L7928A5710J69786D6758J77130b06513f7078A98809M8430o2081
16220A85158j1435a55326B18872a00196C36496j06315J55018I8221a02413B44063
16209B5289h8130f012I8456J3513C1172h097A7967K2071b43138A68096a19248
16197c3214A74621e6180P892m5442o826l6482C8378R2991P6406c28160g3336C65441
16184b8771k56937A02813a07749n9684A77021J37825H0125P8155c7855A79148
16173f5306I6842b7079j4761A86666f2108K5447A79662J84978A55978M5986i2223
16161A60470c81826A51177B3540a95194j6757B60396A10070n2622L6190d7949
16150a75683l4303O9163E0050b05893P6716C57209a4115j73562B52086I4963c25635
$$ plain form
16231 226321 311449 349377 15710 185496 46758 223888 -206513 -67078 198809 247239 185158
16220 185158 173723 -155326 218872 -100196 336496 230181 385199 98221 -102413 244063
16209 25289 -88130 -6012 98456 111969 31172 -8097 17967 40038 -243138 168096 -119248
16197 -33214 174621 -56180 -48288 -93730 -100556 -137038 38378 131369 207775 -328160 -73336 365441
16184 -28771 -285708 102813 -107749 -167433 177021 314846 80125 158280 -37855 179148
16173 -65306 96842 -27079 -41840 186666 -62108 -36661 179662 364640 155978 201964 -92223
16161 160470 -381826 151177 23540 -195194 -211951 260396 110070 57448 93638 -47949
16150 -175683 -209986 -140823 50050 -205893 -129177 357209 -14115 -187677 252086 94963 -325635
16138a67392J2304A01820h2570C23377b46976A62009Q5798G2790a27129A26442
16127F7781a92359j56180B15737a13597H1053b31207I592d29375D08186E2362
16116a59603B1171a47814E7863B0582N8572a1351k421A17058e1132H4361a91929
16104I0816f9688B7050J39842K04011A4173b8931k04446J13041F9769a32223F6727
16092a119j37444A71067h6298C8640j6656J70595b7608p1094A31547b33320A8811
16080B54832K0724F6179A4803a36175o3909A2718K32246d5239B29701f7670j94359
16069b62029l6223A71741c4346k45078C9633f1083n9439l25962A04654f12659
16058a0984A40998o7910J11901i2817A6333b16282g3652A15261c2856D245b8764
$$ plain form
16138 -167392 -155088 101820 -82570 323377 -246976 162009 247807 72790 -127129 126442
16127 67781 -192359 -348539 215737 -113597 81053 -231207 9592 -429375 408186 52362
16116 -159603 21171 -147814 57863 20582 79154 -11351 -13772 117058 -51132 84361 -191929
16104 90816 -69688 27050 166892 370903 14173 -28931 -233377 -120336 69769 -132223 66727
16092 -1119 -138563 171067 -86298 38640 21984 192579 -27608 -98702 131547 -233320 18811
16080 254832 275556 66179 14803 -136175 -200084 12718 244964 -45239 229701 -67670 -262029
16069 -262029 -298252 171741 -34346 -279424 39633 -61083 -120522 -446484 104654 -612659
16058 -10984 140998 73088 184989 -92817 16333 -216282 -73652 115261 -32856 4245 -28764
16046c93547B64914i4647m1648A59421G4403b8750k85552J56356j5871B04426
16035E0102c14001A7628J59025c3211j41348M1714a8642l5801E9426K44388b73318
16023b0489j7062j7233B29605H8756K5039a8953h551B43136c96773J11613A18523
16011i6645j9183b0486j68887j1195C3078L7188h5476A12026l5624A4299L04958
16000C19257b12544B14416b45129a4883E6079c2525a5207D31665k10361a43541
15989E3174R8895e3400A47852b67414A67628J48246I8926L24483B3054K20204
15979B43258j17258n4656O3636b01209A0249M30478A34911A2106b60728B3491
15968b10516F5275k1270a80366C20975b16745E9394b20370G443a83317K0656B06111
$$ plain form
16046 -393547 264914 -94647 -136295 159421 74403 -28750 -314302 -157946 -173817 204426
16035 50102 -314001 17628 176653 -33211 -174559 -132845 -18642 -54443 59426 303814 -273318
16023 -20489 -37551 -54784 229605 88756 113795 -18953 -8551 243136 -396773 -285160 118523
16011 -96645 -115828 -20486 -189373 -200568 33078 70266 -85476 112026 76402 14299 319257
16000 319257 -212544 214416 -245129 -14883 56079 -32525 -15207 431665 221304 -143541
15989 53174 152069 -53400 147852 -267414 167628 315874 98926 423409 23054 243258
15979 243258 126000 71344 134980 -201209 10249 440727 134911 12106 -260728 23491
15968 -210516 65275 44005 -180366 320975 -216745 59394 -220370 7443 -183317 -162661 206111
15956d9068B11604E6595c24996h054l4513l4932j22235j312L3517K1294D6299
15944G2268J28112g8335n2212O4390j55056g9228b1651k30930A25576b53974a1496
15932h9961A2467b65877a04996j91082A74749K1708L17568a07699A69553D1898
15921a21766k6407D83666B19493a92985B57147h7840a4782o8795C65509j78536
15911A86973b95216K4772c4300k51886K8292A1449g5858c0490H0410B2380c8172
15899b04606B35784a19438b4328r3292j24633m550H1637b24179B47570o3060d1438
15887a29868G4187P7296f8506k92494E1058a22231B57763a51674E9156n537A6092
15875A11676J8007J8573G985a73462F4016f5996l6355j25262J02129A60714a75432
$$ plain form
15956 -49068 211604 56595 -324996 -8054 -42567 -77499 -199734 -201046 -167529 -146235 46299
15944 72268 200380 -78335 -130547 -66157 -221213 -79228 -21651 -252581 125576 -253974 -11496
15932 -89961 12467 -265877 -104996 -296078 174749 196457 514025 -107699 169553 41898
15921 -121766 -148173 483666 219493 -192985 257147 -87840 -14782 -83577 365509 186973
15911 186973 -295216 -270444 -34300 -286186 -257894 11449 -75858 -30490 80410 22380 -38172
15899 -204606 235784 -119438 -24328 -117620 -242253 -246803 81637 -224179 247570 184510 -41438
15887 -129868 74187 151483 -68506 -361000 51058 -122231 257763 -151674 59156 53619 16092
15875 111676 129683 148256 7985 -173462 64016 -65996 -102351 -227613 -125484 160714 -175432
15863A89804b00246O153n3922B31056a33414f2053B696b97783A56641d34651a83612
15851A05037j4762O2912E9552J10314A7081J02142d9833A8417c3654A06731b74713
15839a19072A7284K8007J14749M7238g0993I7958K21627g5709K4761B62477c16767
15827e416q5513H3865J17735a15406C4057a88078A68191M8252b68191Q4436j35097
15816c18852j56266b1930H6068K33979a03551r4449a0553r6384k85269m647J35823
15805b61030J04084D5047a44793L1747B7555a2691j8875k0466C3693g6647p7559
15794a54206c5789p7171F5056j7368R8104d938k00978B94979f993l34531a35790
15782i0124k3409C1598h3559H6269e2214e681j25063m16254B0457d699A0620J10615
$$ plain form
15863 189804 -200246 -194093 -248015 231056 -133414 -62053 2696 -297783 156641 -434651 -183612
15851 105037 90275 153187 59552 169866 17081 119223 -49833 18417 -33654 106731 -274713
15839 -119072 17284 45291 160040 207278 -70993 97958 319585 -75709 -50948 262477 -316767
15827 -5416 -90929 83865 201600 -115406 34057 -188078 168191 216443 -268191 -183755 -318852
15816 -318852 -475118 -21930 86068 320047 -103551 -198000 -10553 -106937 -392206 -396853 -261030
15805 -261030 -156946 45047 -144793 -113046 27555 -12691 -31566 -52032 33693 -76647 -154206
15794 -154206 -35789 -112960 65056 47688 145792 -4938 -205916 294979 -6993 -341524 -135790
15782 -90124 -113533 31598 -83559 86269 -52214 -5681 -130744 -546998 20457 -4699 10620 121235
15770A21235a2892A6389g1438I4584a64162l3377A58545A6397a69666l1757f0660
15758a74440B53166q1146b7224B52149Q9838j05779a07466C33824E4669c06994
15747a7684A12768h9341p2764D9224h4100C8399d5524p6435j37675E31662c32142
15735A28529b72110c5212J1204B35307a94130E3748e4698j75657J08360q2573
15725b04568A67495P598a25302L3147E7215M3144a69099j0031j92890a70942d8716
15713A38881a34927c2732A30657d3924j51315A75299J17674a5569j79044g6304
15702d9472k08420J05765R230Q093j6230B42814I6491l7838j1162Q0668l6839
15691I1320K11277I8353K60937D5728c00361K5645C70994b4287A72996c34076
$$ plain form
15770 121235 -12892 16389 -71438 94584 -164162 -197539 158545 16397 -169666 -201423 -60660
15758 -174440 253166 172020 -27224 252149 341987 236208 -107466 333824 54669 -306994
15747 -17684 112768 -89341 -162105 49224 -84100 38399 -45524 -121959 -259634 531662 -332142
15735 128529 -272110 -35212 -24008 235307 -194130 53748 -54698 -230355 -121995 -204568
15725 -204568 167495 175093 -125302 -92155 57215 100359 -169099 -179130 -372020 -170942 -48716
15713 138881 -134927 -32732 130657 -43924 -195239 175299 292973 -15569 -194613 -76304
15702 -49472 -257892 -152127 -142897 -134804 -151034 242814 96491 58653 47491 128159 91320
15691 91320 302597 98353 359290 45728 -300361 -274716 370994 -24287 172996 -334076
15680b86060f5983C05675a28498k3370k5578B93253r6578L9816A1401Q0289J38725
15669B30415a61258A92151K22184A48807M8555b13233d2751A7442a28103A52534
15658c6652q4150C1013a71941j38587B4644b0249m1309D91L1017O454N4493K297
15646I4752J3300c5718m3297j7331B09380A02807Q5458F945b26976q3594a53823
15634A18975a5258B991b0352m9621D75K6611K86998A3435d5159A00084J8392a08852
15621a57354O4155C1879e3785A1174J2543b60054K2705B11497f0293j47457A11504
15609e3743j5687B131b30871b8778B2234g3526n8932c7900n0232B3507L2905g6852
15596b18883A3543a09596m2935A22711J09157a98870f4090c0151H8201L1222n0769
$$ plain form
15680 -286060 -65983 305675 -128498 -151868 -177446 293253 196675 236491 11401 91690 230415
15669 230415 -161258 192151 414335 148807 197362 -213233 -42751 17442 -128103 152534
15658 -36652 -120802 31013 -171941 -310528 24644 -20249 -61558 491 31508 37962 92455 94752
15646 94752 108052 -35718 -79015 -96346 209380 102807 188265 6945 -226976 -310570 -153823
15634 118975 -15258 2991 -20352 -69973 475 27086 314084 13435 -45159 100084 118476 -108852
15621 -157354 -93199 31879 -53785 11174 23717 -260054 -237349 211497 -60293 -207750 111504
15609 -53743 -69430 2131 -230871 -28778 22234 -73526 -132458 -37900 -88132 23507 56412 -76852
15596 -218883 13543 -109596 -152531 122711 231868 -198870 -64090 -30151 88201 119423 68654
15585F8654J03833h4412j18898L5334L2931A70450o3915d5263k2963j99675D3390
15573e6675L499j01346j02746B52263J92691A04189K9922B7271J2894J19665P8055
15562B37885C9049K14345C3300a4722A66241A3374a42113o6463h9958K9503G1138
15550b7194a598A42131E7765a51030K7325B59630a64737a1929A13085c3471r8339
15539a31810d612A61339m3623i0982D3369J19512C3707a65542M6597F9454b59328
15527H3349c39300A06152L0248j7047C8542b39382A06162c1864H1061d13891a63123
15515b20565d0352i913A70023e0412A88006b34617D0634c45197b1191l5964n0100
15504a07255K0338L3881k12997d2177k11260D1713a86021A91465a87399N7005
$$ plain form
15585 68654 172487 -84412 -203310 -167976 -135045 170450 106535 -45263 -68226 -267901 43390
15573 -56675 -53176 -154522 -257268 252263 444954 104189 134111 27271 40165 159830 237885
15562 237885 39049 253394 33300 -14722 166241 13374 -142113 -208576 -89958 -60455 71138
15550 -27194 -1598 142131 57765 -151030 -123705 259630 -164737 -11929 113085 -33471 -131810
15539 -131810 -4612 161339 117716 -90982 43369 162881 33707 -165542 -118945 69454 -259328
15527 83349 -339300 106152 136400 119353 38542 -239382 106162 -31864 81061 -413891 -163123
15515 -220565 -40352 -9913 170023 -50412 188006 -234617 40634 -345197 -21191 -57155 -107255
15504 -107255 -86917 -53036 -266033 -42177 -253437 41713 -186021 191465 -187399 -130394
15494a30394c8634F2687a77186H4460J44395f7873B12440F5930a2460k28354J0453
15483b30361e4092n7514A52486B3080b5227l20719C8813b71p445E6406a51271
15471A21845R3666j3101m0896A7937b72523L8934d5984j35895F7591A6557a67359
15459a04964F9849Q1343o7967j8124a11117F0065J8507J04591b41062g0674G5633
15447E9095h9355j24679j8412O7166g5351L1552A30901o540J78453a6898C64919
15435h3889F9837b32842P814E1078J35807f1655m1857C0433Q1503a64074n5482
15424b19556j9315d1180B44410a88541j96061a64918f4585a3939B852d0981m6747
15413h7728r2730A05773b2049A78525n8165f8549e274j25426H6471a59210d2465
$$ plain form
15494 -130394 -38634 62687 -177186 84460 228855 -67873 212440 65930 -12460 -240814 -230361
15483 -230361 -54092 -111606 152486 23080 -25227 -345946 38813 -271 -7716 56406 -151271
15471 121845 215511 202410 161514 17937 -272523 -233589 -45984 -181879 67591 16557 -167359
15459 -104964 69849 151192 83225 65101 -111117 60065 78572 183163 -241062 -70674 75633
15447 59095 -89355 -214034 -232446 -165280 -75351 -43799 130901 124361 302814 -16898 364919
15435 -83889 69837 -232842 -225028 51078 186885 -61655 -103512 30433 111936 -164074 -219556
15424 -219556 -238871 -41180 244410 -188541 -384602 -164918 -64585 -13939 2852 -40981 -87728
15413 -87728 -180458 105773 -22049 178525 120360 -68549 -5274 -130700 86471 -159210 -42465
15401c61026A34529d9523J543k7154A57569l7575a01164j30958B16131a55199
15390a70149m6467a4210l07089e3758m1214K7776B45981b49836h2545H3550E728
15378a05577B4730i7471A77733F3228a17103A4046J351J31514a11653M3007C08738
15366A02378l9257k146K66618b46306b4367P640j61024A53713b85443C65378A49054
15354F0949L5870m6942J15665f5424d458B55257f4535j43888g2896p4805O7540
15343h0161A60253o7386a89084a7277A924J50338A9220b04447e1324d01A5118
15331d1669k51548Q5480A09744a02644A98768l4809D310J83235P2511I7351J2004
15320A09355J17293a39554B45152A10708a24897M9969C8748J06130c1733J4746
$$ plain form
15401 -361026 134529 -49523 -47980 -75134 157569 119994 -101164 -232122 216131 -155199
15390 -170149 -216616 -14210 -321299 -53758 -94972 -67196 245981 -249836 -82545 83550 5728
15378 -105577 24730 -97471 177733 63228 -117103 14046 15397 146911 -111653 -68646 308738
15366 102378 63121 60975 327593 -246306 -24367 -16727 -177751 153713 -285443 365378 149054
15354 60949 96819 49877 165542 -65424 -4458 255257 -64535 -208423 -72896 -147701 -80161
15343 -80161 160253 92867 -189084 -17277 1924 152262 19220 -204447 -51324 -401 15118
15331 -41669 -293217 -207737 109744 -102644 198768 163959 4310 187545 260056 97351 109355
15320 109355 226648 -139554 245152 110708 -124897 -74928 38748 144878 -31733 -16987
15310a6987G6822a99134i8323A12551b7942A79993p9019k1715b40337a02803A9652
15298g180B05497a95241Q2556D3283b2884j07099A56386c8248B69511H6781b20394
15286A88076a40815A33752J83556b09885k8144H4148k5601b63421e1203A5836
15275B4053a46336C04600B3208L26895h3443D4792f7569q0530E8656J62519I5811
15263B2196J6952M2663D0621L91380g1415B37715h1860A01542L0194b09770A35957
15251I2700J61895j04724J60107O44764j53605M1917L2284l89208A91787J820
15241A93607q9610M9979e5708P135B42586a99648I8859K4036O1202p4122k7873
15230H2102Q8458d3742j51301C18201G0958a96817P1367p1142J2816B00763a59463
$$ plain form
15310 -16987 76822 -199134 -98323 112551 -27942 179993 100974 79259 -240337 -102803 19652
15298 -7180 205497 -195241 -112685 43283 -22884 -129983 156386 -38248 269511 86781 -220394
15286 188076 -140815 133752 317308 -209885 -238029 84148 58547 -263421 -51203 15836
15275 24053 -146336 304600 23208 350103 -83443 44792 -67569 -148099 58656 221175 95811
15263 22196 39148 81811 40621 432001 -71415 237715 -81860 101542 131736 -209770 135957
15251 92700 254595 149871 309978 954742 801137 843054 875338 486130 191787 193607
15241 193607 103997 153976 -55708 -48573 242586 -199648 98859 122895 184097 109975 82102
15230 82102 170560 -43742 -195043 318201 70958 -196817 -125450 -196592 -183776 200763 -159463
15218a31500b329G6950c5992G0535K99852d9228C66920a44260A38411d7999A40660
15206D05613k8879j78408a43264C8682d5118B12488R0393h0791A53603J19451
15196B73054h2246C7975O8349b12861i7002A05031m6370a3113C6051a83556c9935
15184B14789A00653D9802A9306a45750L5748B51204A05150c6180B05074a69111
15173a40499a7816A14583g9619a1879A57918m9009J77263A3574K40635a23922
15162B14727p3137i5528B51818a47741J1322j9252A59822B4489B939L14677d7416
15150A70530R590J84994l7881a43546B40432F7233M6392M315c28061g9976n6394
15139a36370l2095C36866e7971A9518a39057A23398a05791j14314E6047j3383
$$ plain form
15218 -131500 -2329 76950 -35992 70535 370387 -49228 366920 -144260 138411 -47999 140660
15206 405613 376734 198326 -143264 38682 -45118 212488 302881 -80791 153603 273054
15196 273054 -82246 37975 106324 -212861 -97002 105031 58661 -13113 36051 -183556 -39935
15184 214789 100653 49802 19306 -145750 -110002 251204 105150 -36180 205074 -169111
15173 -140499 -17816 114583 -79619 -11879 157918 108909 286172 13574 254209 -123922
15162 214727 141590 -95528 251818 -147741 -136419 -155671 159822 24489 2939 317616 -47416
15150 170530 180120 365114 327233 -143546 240432 67233 113625 117940 -328061 -79976 -136370
15139 -136370 -168465 336866 -57971 19518 -139057 123398 -105791 -220105 56047 42664
15129D2664b2758j21018C54501j72021L9102c2184I0265K40231M0656G7522K2098
15118I9620J64733D376K54715K91868B02314J45154f1697B00574r828J84541J1525
15107C86812i7400A21681m5254d10239A89380b78285f9731C65319A49014A9885
15096C2780a3143k9902I1560B4654K7589A2261c3365B37151e0180J3465C17216
15084B3213r139J27624i1371A54956h708B08128q752a00212A91715J54482A54134
15072f1343B45658n4848a25177A85800J48099d90D07546A20321m7395e4064l1082
15061h5146A89976G1897N0816O6270o4566a56430A74857b0073B19999j07539L05326
15050D17786A16749m2344J3781K37498G5795R0089Q1396L2908A29504l1377K3116
$$ plain form
15129 42664 -22758 -143776 354501 182480 221582 -32184 90265 330496 371152 77522 99620
15118 99620 264353 4376 259091 550959 202314 347468 -61697 200574 190746 375287 386812
15107 386812 -97400 121681 76427 -410239 189380 -278285 -69731 365319 149014 19885
15096 32780 -13143 -43045 91560 24654 52243 12261 -33365 237151 -50180 -36715 317216
15084 23213 14074 141698 -91371 154956 -8708 208128 199376 -100212 191715 346197 154134
15072 -61343 245658 190810 -125177 185800 333899 -490 407546 120321 72926 -54064 -85146
15061 -85146 189976 71897 122713 188983 124417 -156430 174857 -20073 219999 112460 417786
15050 417786 116749 74405 88186 325684 75795 165884 247280 280188 129504 98127 121243
15039A21243M47639A77724o2447h9181C65749E0642J42354C0081P1234O5449H1683
15027C1055k762K58215A2450J97601m9530A2529L62433Q542j54926Q3515H5577
15015A71553B658L81549j64911o5979K12617A43630F5456b15256A35025k8854
15005A06171L29533q7299C6025c5661l5813A13445J2022Q2583o7022J33829q0443
14994A94414M6923j00082m7520O8408G9649o270g3542B51322K85194k20099k8410
14983B88007J88415F9412J21750a2284H3950J57184J0534C8621O3510K44172j65649
14972A80654K60232j5052A68595m5479N78500B38863b20097B5441N0563l7958
14962C8046K51561M9727Q0344b6630A87798p9707J67384A449M52098A41400K4163
$$ plain form
15039 121243 568882 177724 115277 -89181 365749 50642 192996 30081 101315 166764 81683
15027 31055 28293 286508 12450 210051 160521 12529 374962 383504 228578 312093 85577
15015 171553 2658 384207 219296 153317 365934 143630 65456 -215256 135025 106171
15005 106171 435704 348405 36025 -35661 -71474 113445 125467 208050 141028 274857 194414
14994 194414 241337 141255 93735 162143 79649 73379 -73542 251322 536516 316417 288007
14983 288007 476422 69412 191162 -12284 83950 241134 251668 38621 102131 346303 180654
14972 180654 440886 425834 168595 123116 701616 238863 -220097 25441 76004 38046
14962 38046 289607 339334 419678 -26630 187798 108091 275475 1449 453547 141400 165563
14951A65563k1388J11920k1712J30675M953r6567K1255I8160l6404J20113H1997
14939I3896K17446I3579L10398E1788K06504P7187j08962J99853j75636q9742
14929A60992j9734L3640J25489A19492n0923M11687j50648I6889K75176A62726
14918g667D39221j85038J52159j10867p4452L7418D5097J66055g4953B2072K59115
14907B81187A31232k9895P3022J40477j11915O864Q1904K50231A20527J85720
14897C06247L7042K7239l7434K26206A74315K99561j12860P3155m9563A80695
14886H9381J05690H4947L91629j89037O1294A25137E5051M25917k09621J43722
14876D15069j35802P0733A03579J9856K37810j0714J82690A79778K08232Q7020
$$ plain form
14951 165563 144175 256095 234383 365058 370011 273444 294699 98160 61756 181869 81997
14939 93896 311342 93579 403977 51788 258292 335479 226517 426370 250734 160992
14929 160992 141258 174898 300387 119492 68569 480256 329608 96889 372065 162726
14918 -7667 439221 254183 406342 295475 221023 258441 45097 211152 -74953 22072 281187
14907 281187 131232 101337 174359 314836 202921 209785 291689 541920 120527 306247
14897 306247 343289 370528 333094 559300 174315 473876 361016 434171 384608 180695
14886 89381 195071 84947 476576 287539 348833 125137 55051 480968 271347 415069
14876 415069 279267 350000 103579 123435 361245 350531 533221 179778 388010 475030
14866D75030j18497Q4399J16835J43682B55520M6376L62937B31021J97274o8542
14856C59753A15442K63344H6135L71913J54620k03491j95629K24452j77901j3928
14846B46171O2468J61436G6644O94083l73494A59196F4611M39158J89146C28011
14835C52852k5062p4520L79284j52901K61119j31998B72740A25070J15154K30928
14825D71152k754B00348P8863J6462P7854k0489R9104j47049J93136J07508B10539
14813C19485r9785J09543K53321k32328j54675M78211p4920k32567L9316J07495
14803E13096L4682B25548J20888J74038I769L82097K69980J7725C34051L64601
14793F98652C30817o8328a42556C68965L15090k01143j60758R9792J27644m3192
$$ plain form
14866 475030 356533 440932 557767 701449 255520 301896 664833 231021 428295 359753
14856 359753 115442 378786 86135 458048 612668 409177 213548 438000 260099 246171
14846 246171 308639 470075 76644 770727 397233 159196 64611 503769 692915 328011
14835 352852 327790 253270 632554 479653 740772 608774 272740 125070 240224 471152
14825 471152 468398 200348 279211 295673 373527 353038 452142 305093 498229 605737 210539
14813 319485 219700 329243 582564 350236 195561 673772 598852 366285 405601 513096
14803 513096 547778 225548 346436 520474 9769 391866 661846 679571 334051 698652
14793 698652 330817 262489 -142556 368965 684055 482912 322154 421946 549590 506398
14783E06398n2970K66432C01775J97880j17781D0543N86297m1927L186K25893
14773H13992j96233O1843P006q9046j15919k2277o2138J05607r3518L1775q3685
14762C57407K36060N8309n4969j45501l9070j73283K65505M8517B02262O2098
14752B64360K23366K57700j78330J1977L97210D83030R0735j78820N20085L6122
14742I51152B48786K35959N5658M8106K35231l84669N2064l9318m1482j03759
14732C06576K42555n64J85619j97804K39657L6123C83558J58885J91072K5590
14722G59105k67521j31081K38500M6749n4429J33315l03071J00522K27682j23421
14712F26350J30707j65971J71696k82152J9279L01817M0685D06928J19395K36730
$$ plain form
14783 506398 453428 719860 301775 499655 381874 40543 626840 584913 588099 813992
14773 813992 617759 679602 686608 597562 481643 459366 397228 502835 409317 441092 357407
14762 357407 593467 651776 596807 451306 412236 238953 504458 552975 202262 264360
14752 264360 487726 745426 567096 579073 976283 483030 573765 394945 915030 951152
14742 951152 248786 484745 540403 588509 823740 439071 491135 451817 410335 306576
14732 306576 549131 548567 734186 536382 776039 812162 383558 542443 733515 759105
14722 759105 491584 360503 599003 645752 591323 724638 421567 522089 749771 626350
14712 626350 757057 591086 762782 480630 499909 801726 842411 406928 526323 763053
14702G63053L09527l31002k77606K71487r8408J15238p6943J88079r8540n637
14692G59248J96376r4956k63542p4796K26684J96591k35945J51469j26211j47664
14682E87254J02444J76366N5701k50922K52846J06336D07480N83103k57506j06651
14672F26426L9386J62425R9358k48054O9619J05717j52288K44670k76396R6662
14662G67525L37803k08084K5836P9980k06668J90707k69535K14802l49891N29590
14652A112065j73292L383k82092J5089J97796m7060L24823l37942L69798o9145
14642A113423N16525m63770N6414n4757p5370k86238Q1149K29425j03628K10273
14632A223446r4857k35127L68431k68109o1635L47644j40945J7679j82049N1790
$$ plain form
14702 763053 1072580 741578 463972 735459 637051 752289 675346 863425 764885 759248
14692 759248 955624 860668 597126 522330 749014 945605 709660 861129 734918 587254
14682 587254 689698 866064 921765 670843 923689 1030025 407480 990583 733077 626426
14672 626426 665812 828237 927595 679541 749160 854877 702589 947259 670863 767525
14662 767525 1105328 897244 923080 1003060 796392 987099 717564 932366 582475 1112065
14652 1112065 938773 942156 660064 675153 872949 825889 1150712 812770 1182568 1113423
14642 1113423 1629948 1166178 1222592 1167835 1092465 806227 887376 1116801 1013173 1223446
14632 1223446 1128589 893462 1261893 993784 932149 1279793 1138848 1156527 974478 1026268
14622A026268J98252J25024n13468L78279Q7293l07300M75366n02894K01770q838
14612A159752N2628K74453R7806m26734R1327j07980K34919k40245j40995J13622
14602A108553M33714k25702k87014K261J94093J18855J55450J94735m34487N8352
14592A318810K71499l10323l411J28387J42099k85777J50288L5622J19356R0694
14582A657244P3168m19981M57612n75628N63791k99581k6209K11208K31583j23585
14572A749622k52478K60774j20364K02837k03253J94645K06639J33262k42687
14563A928997J44382r8256Q3317K8052K77512j30274J76069O1513J07379J75257
14553B753948j1943N45484K24626J106053J885136M498863J0913969J7402765
$$ plain form
14622 1026268 1224520 1349544 836076 1214355 1301648 994348 1469714 966820 1168590 1159752
14612 1159752 1212380 1486833 1584639 1157905 1249232 1141252 1376171 1135926 994931 1108553
14602 1108553 1542267 1316565 1029551 1031812 1225905 1344760 1500210 1694945 1260458 1318810
14592 1318810 1590309 1279986 1276575 1404962 1547061 1261284 1411572 1447194 1566550 1657244
14582 1657244 1730412 1310431 1768043 1192415 1756206 1456625 1430416 1641624 1873207 1749622
14572 1749622 1497144 1757918 1637554 1840391 1637138 1831783 2038422 2171684 1928997
14563 1928997 2073379 1975123 2058440 2086492 2364004 2233730 2409799 2471312 2578691 2753948
14553 2753948 2742005 3287489 3512115 4618168 6503304 11002167 21916136 39318901
14545C9318901k391540A6301354F804911l267403j300325k41003k89284q5999
14537A620897K60174K1751o40827L29922L45056n79396K98501K30503k41991K9020
14527A673610O3719O2726K46873k67682n6302L86969j14745K77901m45576N12494
14517B339987q0222j09259j88613J14984M02167r4261l54107L93893m2226P3873
14507B456216l20893R2692K58480J64181m53292K05032J37019j10198J91681J20587
14497B741505j09246l50121N68380k29226M29683k88606l0608j17745L75497J25124
14487C114637k85035J05372j71169N25895k35226j21688L08856J11731P88k64837
14477C089324L3638K35723J74431l64259K51403j72365J91510J79563l79393J24049
$$ plain form
14545 39318901 36927361 16301354 6804911 3537508 2237183 1996180 1706896 1620897
14537 1620897 1881071 1902822 1261995 1591917 1936973 1357577 1656078 1886581 1644590 1673610
14527 1673610 1737329 1800055 2046928 1779246 1722944 2109913 1995168 2273069 1827493 2339987
14517 2339987 2259765 2150506 1961893 2076877 2479044 2384783 2030676 2424569 2382343 2456216
14507 2456216 2135323 2228015 2486495 2650676 2197384 2402416 2539435 2429237 2620918 2741505
14497 2741505 2632259 2282138 2850518 2621292 3050975 2762369 2731761 2614016 2989513 3114637
14487 3114637 2829602 2934974 2763805 3289700 3054474 2932786 3241642 3353373 3354161 3089324
14477 3089324 3122962 3358685 3533116 3168857 3420260 3247895 3439405 3618968 3239575 3363624
14467C363624J85896j1518K82393N827K03127l34713J48017P0245J32565j96425
14457C849038K08639J56706J11133q490m01663K38404R1479r9815M10740l5051
14447D521120K27073m37472L66491K22726m3683J0646q4393L50285P3099j65044
14437E040848K72388k06467L8147R0369k46837O77637m24663N93692k31977M65218
14427F068355j45375k72441K58252j3352K57927k1323j33730K35775L48622P253
14417F589963l738J29042J65313j08835L06162J90272j18627K58913j53770R3025
14407G347720L19549N1718j99309O94406j413J99520k8879L14450l00427M48123
14397H845458O5876M24009N3538o7084J03407L6575M90814R7812K97823O0887
$$ plain form
14467 3363624 3549520 3538002 3820395 3826222 4029349 3694636 3842653 3912898 4045463 3849038
14457 3849038 4057677 4214383 4325516 4317026 3915363 4153767 4245246 4145431 4556171 4521120
14447 4521120 4748193 4310721 4677212 4899938 4856255 4866901 4782508 5132793 5205892 5040848
14437 5040848 5313236 5106769 5144916 5235285 4988448 5666085 5241422 5835114 5603137 6068355
14427 6068355 5922980 5650539 5908791 5895439 6153366 6132043 5998313 6234088 6582710 6589963
14417 6589963 6586225 6715267 6880580 6771745 7077907 7268179 7149552 7408465 7254695 7347720
14407 7347720 7667269 7718987 7519678 8214084 8212671 8412191 8383312 8697762 8397335 8845458
14397 8845458 8911334 9335343 9388881 9321797 9425204 9461779 9952593 10050405 10348228 10409115
14387A0409115P412J73824L91769J519L61332P6821L79823O9943N55105j59686
14377A2266977O70571m25179R56092j3218M65256j48765N02287K10748K61580
14368A4746349L44430K86998p635R17376J58813K43031L36619K20186R26146j43101
14358A8029212O41329L72408O29132M49862Q20995j34362O75697N78816M23821
14349B2486910P01435N82835L39190O65058Q27505L41632J021145P83787P04625
14340B8454122M25811J424191O29309O80425J075572R43323J047701R20040J019401
14331C6619895J396165J086200R95151J085454J648123J262998J483770J873103
14323D7450859J332035J776348J743677K114460J646725K434056J870972K601033
$$ plain form
14387 10409115 10416527 10590351 10982120 10983639 11344971 11421792 11801615 11871558 12426663 12266977
14377 12266977 12937548 12512369 13468461 13455243 13920499 13771734 14274021 14484769 14746349
14368 14746349 15090779 15377777 15370142 16287518 16446331 16689362 17025981 17246167 18172313 18029212
14358 18029212 18670541 19042949 19672081 20121943 20942938 20808576 21484273 22063089 22486910
14349 22486910 23188345 23771180 24110370 24775428 25602933 25944565 26965710 27749497 28454122
14340 28454122 28879933 30304124 30933433 31613858 32689430 33632753 34680454 35600494 36619895
14331 36619895 38016060 39102260 40097411 41182865 42830988 44093986 45577756 47450859
14323 47450859 48782894 50559242 52302919 54417379 56064104 58498160 60369132 62970165
14315F2970165K297967K753848L028254K557993L022030L281441L614305L589233
14307H7115236L740478M513893M346907M696082M578665N895092N441386N635479
14299A25963218O830206O937792O885129Q203161Q251884Q694766R571199R999308
14291A91336663J0486020J1416735J2181127J2873122J2886866J4042175J4618474
14284B79841182J5224742J5205418J5879140J5807291J6001651J5185576J5045281
14277C88190281J4072460J2827151J1176288R314138P020689Q31569k657972j136683
14269D39637921j975290l858384l842272o148738r993747j2577667j3572258j5078002
14261C72591563j5638857j6432891j6086597j6118846j5583320j5154532j4006189
$$ plain form
14315 62970165 65268132 68021980 71050234 73608227 76630257 79911698 83526003 87115236
14307 87115236 90855714 95369607 99716514 104412596 108991261 114886353 120327739 125963218
14299 125963218 132793424 139731216 146616345 154819506 163071390 171766156 181337355 191336663
14291 191336663 201822683 213239418 225420545 238293667 251180533 265222708 279841182
14284 279841182 295065924 310271342 326150482 341957773 357959424 373145000 388190281
14277 388190281 402262741 415089892 426266180 435580318 442601007 443432576 440774604 439637921
14269 439637921 437662631 433804247 429961975 423813237 413819490 401241823 387669565 372591563
14261 372591563 356952706 340519815 324433218 308314372 292731052 277576520 263570331
14254B63570331j4034097j3304258j2578133j1995054j1472695j0462897j0435858
14247A79287339q824334q953224q030098p508178p305266o846068o395991o154017
14239A19270163n705095m547317n257184m551630m403149m205848m037273l372205
14231H3190462k818124l755035l011760k948049k619276k722814k617200k364666
14223F0333538k231438k102340j970986j498788j983262j875390j497865j865814
14215D5307655j256367j037602j263464j589453j670106p70709j245483p90705
14207C5683766o53906j028079j203845j031757q02452r60109p60987n52515r28627
14198B7761489q38443o71224o99968n64054l61222p89154o59293o88858n92524
$$ plain form
14254 263570331 249536234 236231976 223653843 211658789 200186094 189723197 179287339
14247 179287339 170463005 161509781 153479683 145971505 138666239 131820171 125424180 119270163
14239 119270163 113565068 109017751 103760567 99208937 94805788 90599940 86562667 83190462
14231 83190462 80372338 76617303 73605543 70657494 68038218 65315404 62698204 60333538
14223 60333538 58102100 55999760 54028774 52529986 50546724 48671334 47173469 45307655
14215 45307655 44051288 43013686 41750222 40160769 38490663 37719954 36474471 35683766
14207 35683766 35029860 34001781 32797936 31766179 30963727 30003618 29242631 28690116 27761489
14198 27761489 26923046 26251822 25551854 24987800 24626578 23837424 23178131 22489273 21896749
14189B1896749o47945m01581p2802r66489k09705o88769m1665l86436l04547o14618
14179A7562192m17268j91118m17801n25230k92834j45152k23272m59371j03655
14170A4786491k00077n40758m20292m573P157o03408M9273n90096m74030L85730
14160A2395417l71475j41882o1008o46125j95792J05164k16316k70787J81441
14151A0778637l92453m32442N8386j79000l44225J2511j66855l52471o9802J60113
14141I072399k23455o40297N07680m09548J50665k68539k59100j77009j17695
14132G635101l94972K34763k6248j75651k63701K88483l58241k32120P8551r6806
14122F689159j59196J3307P0940L9998k56201l98286R1831M3162J81314l85783
$$ plain form
14189 21896749 21248804 20847223 20774421 19807932 19598227 18909458 18867793 18481357 18176810 17562192
14179 17562192 17144924 16953806 16536005 16010775 15717941 15572789 15349517 14890146 14786491
14170 14786491 14586414 14045656 13625364 13620791 13627948 13024540 13073813 12483717 12009687 12395417
14160 12395417 12023942 11882060 11821052 11174927 10979135 11084299 10867983 10597196 10778637
14151 10778637 10386184 9953742 10012128 9833128 9488903 9501414 9334559 8982088 8912286 9072399
14141 9072399 8848944 8208647 8716327 8306779 8457444 8188905 7929805 7752796 7635101
14132 7635101 7240129 7474892 7448644 7272993 7009292 7297775 6939534 6707414 6785965 6689159
14122 6689159 6529963 6543270 6614210 6654208 6398007 5999721 6091552 6134714 6316028 5930245
14112E930245P6987j47615m17638J08929K5346n4452j19696K65297k64470K258
14102E405191r5194q30l07787N2905n14915L63979J14850l40265M26513n32067
14092D572380O5783q9708p8398J35348k52433J06785k04325L6224K8396l28955
14082C991097O536r1860Q4370p9982o4340o665k9597N0103L1974j09452l30760
14071C451424K28200l37398K73142j27915J33575k17770j85834K21389j86507
14062C252306K47792n4514k58237L42458q8683L28991o90356K70165o279m89646
14052B853997m4692L24041K7092l59876J52608k0456q4717j11218N115Q7338l2746
14041B796486r1911M2279J51775q0127o28987L99141j3498P6546k43166K30668
$$ plain form
14112 5930245 6007232 5859617 5441979 5550908 5576254 5521802 5402106 5667403 5402933 5405191
14102 5405191 5309997 5309167 5001380 5054285 4539370 4903349 5018199 4677934 5104447 4572380
14092 4572380 4638163 4548455 4470057 4605405 4352972 4459757 4255432 4291656 4320052 3991097
14082 3991097 3997633 3905773 3990143 3910161 3845821 3839156 3809559 3859662 3891636 3782184 3451424
14071 3451424 3679624 3342226 3615368 3487453 3621028 3403258 3217424 3438813 3252306
14062 3252306 3500098 3445584 3187347 3529805 3441122 3770113 3079757 3349922 3343643 2853997
14052 2853997 2809305 3133346 3160438 2800562 2953170 2932714 2847997 2736779 2741894 2829232 2796486
14041 2796486 2704575 2746854 2898629 2818502 2189515 2588656 2575158 2651704 2408538 2639206
14031B639206J20043Q207m75146J67882P514M970k08534Q2700k75282L00902J17227
14020B489689m16578N9438K5410j75136L59362K22856l69723k40631j54858L37504
14010B137333j91144Q8909j87360M8017j41907Q9425p1380J11209K21472k17931
14000A886643j19037o3097K4063j2348j4510J26879l55549J33503j2060M37292
13990B031779J51113P59462K933931R523562J7914980O972010j9704201j0083967
13982A0498669m107014j920490n69639n59647j71398l77075K97587o74077R0814
13973B507730k94700k59790K99445j56176k2761K31715k26532k85346K40841j87289
13963A847137n401K12803j51458l90190M46260l26919K0147K33093j80455J68706
$$ plain form
14031 2639206 2759249 2767456 2292310 2460192 2467706 2472676 2264142 2346842 2071560 2372462 2489689
14020 2489689 2073111 2132549 2157959 1982823 2342185 2565041 2195318 1954687 1799829 2137333
14010 2137333 1946189 2035098 1847738 1895755 1753848 1843273 1771893 1883102 2104574 1886643
14000 1886643 1767606 1704509 1728572 1716224 1701714 1828593 1473044 1606547 1594487 2031779
13990 2031779 2182892 2942354 5876285 15399847 33314827 40286837 20582636 10498669
13982 10498669 6391655 4471165 3901526 3341879 3170481 2793406 3090993 2416916 2507730
13973 2507730 2213030 1953240 2252685 2096509 2073748 2305463 2078931 1793585 2034426 1847137
13963 1847137 1841736 2054539 1903081 1512891 1959151 1632232 1652379 1885472 1705017 1873723
13953A873723K40994k32485j57822m0364J51179l77330O5341n5157j61361N8274
13943A364992L19829J0366m19220P1031J40739N4374l1530j96352j16945K57249
13933A454533R5454m18802L08226K55204j97064l01899Q1826J19035j49904M6240
13923A292849q7290J01172K9185k78211K94702j0448l30356J5396K31262J0222
13913A268483J77040j95747j63687K05924J17481Q4533r8053l70776K57160J52967
13903A435325k06572k11247J69607j7408K4639P5792o1557j85149M4945l8033
13893A030342k03903L5482j17346L57028P9037J17048L956k54313R8540k57222
13883H88649k8290L57239m92842N56302j37453m39497M43188p4072q3608J22852
$$ plain form
13953 1873723 2114717 1882232 1724410 1684046 1835225 1457895 1523236 1468079 1306718 1364992
13943 1364992 1684821 1695187 1275967 1346998 1487737 1542111 1510581 1314229 1197284 1454533
13933 1454533 1549987 1131185 1439411 1694615 1497551 1195652 1277478 1396513 1246609 1292849
13923 1292849 1205559 1306731 1335916 1057705 1352407 1341959 1011603 1026999 1258261 1268483
13913 1268483 1445523 1249776 1086089 1292013 1409494 1494027 1395974 1025198 1282358 1435325
13903 1435325 1228753 1017506 1187113 1169705 1194344 1270136 1208579 1023430 1068375 1030342
13893 1030342 826439 861921 744575 1101603 1180640 1297688 1301644 1047331 1145871 888649
13883 888649 860359 1217598 724756 1281058 1143605 704108 1147296 1073224 989616 1112468
13873A112468j26639l0107K5102j71529K55961l19090J67514j50208j0585O54733
13863A407620n57359J84944j60792J08796L9977l77124K3116O36596n04697j20857
13853F80220L0447J91606k39012k23761L41120L8781j39145M9456L91934m76256
13843F45390J11782M5756L99886m03835K75139k28757m35M3132l3188k82063R1539
13832F64346J44987j53841m8237J91567q6113m6947k32521J84998P717r463M86762
13821A103255m85763K86328D11382M06997m9902Q955o7146J70771k16786N5339
13811G19610J27144m03215N08204j81867j25387L18676k38454m9440j94431L31033
13801H11873R6519k94204j55560J35729Q0334q1816J37659l2043K4024k24371
$$ plain form
13873 1112468 985829 955722 980824 809295 1065256 746166 913680 763472 752887 1407620
13863 1407620 850261 1035205 874413 983209 1023186 646062 669178 1305774 801077 680220
13853 680220 710667 902273 663261 439500 780620 819401 680256 729712 1121646 645390
13843 645390 757172 802928 1202814 798979 1074118 845361 844926 888058 854870 572807 664346
13832 664346 809333 655492 607255 798822 712709 665762 433241 618239 625956 616493 1103255
13821 1103255 617492 903820 411382 818379 768477 777432 710286 881057 664271 719610
13811 719610 846754 443539 951743 769876 644489 963165 724711 675271 480840 811873
13801 811873 908392 614188 458628 594357 674691 592875 730534 698491 722515 498144
13791D98144O6701M3314P0461K82234C71068M62309A47068R41855l54209j83459
13781E51255k45462K92120j80854K0392j08795K43596j30749K68035k18836J82179
13771F72881j36903l9478M62354C29781j06497M10156J55810k70902J86125j36588
13761E67885K82203k92757j31471Q5353j5151p5889L0672j06419K03696j55711
13751C92411J35010r8493L8184r101J26201m3171K376D4517P74787C98593J39084
13740E37677o1447j45660O7549Q5299l1300K63373l5642M4963k79455L0708J37034
13729F13099j38981j83355L92453B27233C8017M86144r4311L96517D06583o0079
13719C46504J57307B18156M79565C20856K22939Q2307O6421n09B92845J72915
$$ plain form
13791 498144 564845 608159 678620 960854 371068 833377 147068 1088923 734714 551255
13781 551255 305793 597913 417059 437451 328656 572252 441503 709538 490702 672881
13771 672881 535978 496500 958854 329781 223284 633440 789250 518348 704473 567885
13761 567885 850088 557331 425860 511213 496062 420173 450845 344426 548122 392411
13751 392411 527421 428928 467112 458011 584212 541041 543417 44517 819304 398593 537677
13740 537677 476230 330570 398119 483418 452118 715491 679849 724812 445357 476065 613099
13729 613099 474118 290763 683216 227233 38017 524161 429850 826367 406583 346504
13719 346504 503811 218156 697721 320856 543795 626102 692523 692014 292845 465760
13709D65760j68849L39418B07073M15413j7217k99632L37201m6350J7023K5600
13699F39111J35645j07550B74921J26191j15698K75545r1341K49812a1484D84982
13688C85777j22431k3519K75868L2903F6681K48775j51259J69369J38704O5314
13678E37584R7269B61473r8501L24782K7526j61629K28686B21995J46596n1227
13668C17364k4591P0193r3941Q5951J69100j81252q5039p7941O5900L5738K72463
13657E53945k14355j07592K46503j32121K24569j61086J53549j9759r5952A34988
13646A80061J02078M35622B53648J04756l719R4460F6809J61201K0277K92728
13636E41015D4815K67088q9472J48179O2213A34607K76162J41757q3597j61210
$$ plain form
13709 465760 296911 636329 207073 622486 605269 305637 642838 596488 613511 639111
13699 639111 774756 667206 274921 401112 285414 560959 469618 719430 -11484 484982
13688 385777 263346 239827 515695 548598 66681 315456 164197 333566 472270 537584
13678 537584 634853 261473 162972 487754 515280 353651 582337 221995 368591 317364
13668 317364 292773 362966 269025 354976 524076 342824 257785 179844 245744 281482 553945
13657 553945 339590 231998 478501 346380 570949 409863 563412 543653 447701 134988
13646 180061 282139 717761 253648 358404 354685 449145 66809 228010 248287 541015
13636 541015 44815 311903 222431 370610 432823 134607 410769 552526 468929 307719
13626C07719a38638C79349O4053p0038j43758J74275H8654L22609q9625A29550
13615G40461B72299L2426p5455L85529B04765J54734q2291K19612q046B06234
13604A83293K77229k03294L9174R1650j7927o2143Q1287k7945H8710L38420a86041
13592B90976J54178N8886N0205j18157A43626L52453B20670J78335q3655j36281
13582A79069K36879K45959k12141O1387A38848R3821L33993j45820q6554L5382
13572C69670L6102N7100k03455J6772G7173L29386K1742A01618J53500Q5919A04899
13560B38773j17921O0218g6380E1666K77225j42567J61798j47003Q4950o5595
13550B20474M0650Q3523m6082j21735J6845J45397H6021J88773j20169E9252L29544
$$ plain form
13626 307719 -138638 379349 443402 373364 229606 403881 88654 411263 321638 129550
13615 740461 272299 304725 229270 614799 204765 359499 277208 496820 488774 206234
13604 183293 460522 257228 296402 388052 370125 307982 389269 361324 88710 427130 -186041
13592 290976 445154 504040 554245 436088 143626 496079 220670 399005 315350 179069
13582 179069 415948 661907 449766 511153 138848 232669 566662 420842 334288 369670
13572 369670 405772 462872 259417 276189 77173 406559 428301 101618 255118 341037 104899
13560 238773 120852 181070 -76380 51666 328891 186324 348122 201119 286069 220474
13550 220474 261124 344647 298565 176830 193675 339072 86021 274794 154625 59252 388796
13539C88796B5985L52498A07511D2193K98432G1412K71307a17609B62530A29923
13528D21053j93079I0816a2437A94176H0155B1732M9178L74822j92730I2203k6962
13517F5241J72722m3407L54926k71436A18290m6638J85952I4422J19425K53648
13507D67495j75185j05781n2124J66165C972L54127A36358L6174M6106J09028
13497C27666A09946P5214L42321F5060J79488J35664H1847h4492C68583M9104
13487D17687A78550k5583J61162h9745B93046A29524K59422F7416J7428K68443
13477C53287A14842A4168K84974Q459A23320a6650I9514m4346L00371H3050J71694
13466B54744d0650j0668D6480K29446J37870m4600A53905o866Q8793G8751a03063
$$ plain form
13539 388796 25985 378483 107511 42193 340625 71412 342719 -117609 262530 129923
13528 421053 227974 90816 -12437 194176 80155 21732 70910 445732 253002 92203 65241
13517 65241 237963 194556 549482 278046 118290 71652 257604 94422 213847 467495
13507 467495 292310 186529 134405 300570 3972 358099 136358 172532 218638 327666
13497 327666 109946 185160 527481 65060 244548 380212 81847 -84492 368583 417687
13487 417687 178550 152967 314129 -89745 293046 129524 388946 67416 84844 353287
13477 353287 114842 14168 299142 307601 123320 -16650 99514 55168 355539 83050 254744
13466 254744 -40650 -51318 46480 275926 413796 369196 153905 147039 235832 78751 -103063
13454A43227O3969b848k23892A50163L07719B26312J15270O9069I2207K92277
13444C84484A03170L30505A49331J36220h7097D39528j13690F191L71797d3589
13433E1128J62725P5345H6856N7445C4459J44186K13560a4066B69350C1986J36085
13422A68071J48724d0427B39044J28489A19044J50830a9136A49830K05854C6787
13411E7581K57573j41314D3444d5115A04976L4407R4493l2471K5041M0738b8167
13399B55772a30323B58570Q4249A55411K43975j95658k4487e267A4555L83664
13389C98219j16644e5764A58429A5008M0248J83036H0251e9435D3357r945O2259
13378I5671a26062A47363l500a02947J2983B08906J66755A48576K30891A89537
$$ plain form
13454 143227 207196 -2848 -226740 150163 457882 226312 341582 410651 92207 384484
13444 384484 103170 433675 149331 285551 -87097 439528 325838 6191 377988 -43589
13433 51128 213853 289198 86856 144301 34459 178645 392205 -14066 269350 31986 168071
13422 168071 316795 -40427 239044 367533 119044 269874 -19136 149830 355684 36787
13411 57581 315154 173840 43444 -45115 104976 139383 233876 201405 226446 267184 -28167
13399 255772 -130323 258570 342819 155411 399386 203728 179241 -5267 14555 398219
13389 398219 281575 -55764 158429 15008 55256 238292 80251 -59435 43357 33412 95671
13378 95671 -126062 147363 143863 -102947 -89964 208906 375661 148576 379467 189537
13367B20190n8127R4254J67408M7793h2733A23643D7141N9466M31796m9493a29004
13355I243a4143D74718j80302p9584p4348C4335N31841B26276R5499o6730B0104
13343H5060J13733k0304P492R5887k9198j10162k4687b5551A48104J61101p7921
13332B31284K83913B15193J12257j00967E9363b9264j784A10542L02L38396j50282
13321B98958A23424J64700A15677a05728A50840O8652J06604r4083a099A05480
13310b36600A13361J1026L544a20143B37752f1404m2765F8651a08716E3269K17187
13299B70456H6177l0671O9370L4562P5118o8083a48933B02184D355a5423A58819
13287C20089j11421J11957E0615b73422C52446q1701A06045O8811F7027j9437
$$ plain form
13367 220190 162063 256317 423725 471518 -82733 123643 47141 106607 538403 488910 -129004
13355 9243 -14143 474718 294416 214832 140484 34335 566176 226276 321775 255045 20104
13343 85060 198793 178489 185981 281868 252670 142508 117821 -25551 148104 309205 231284
13332 231284 515197 215193 327450 226483 59363 -29264 -31048 110542 110844 449240 298958
13321 298958 123424 288124 115677 -105728 150840 219492 326096 232013 -1099 105480
13310 -236600 113361 124387 127931 -120143 237752 -61404 -104169 68651 -108716 53269 270456
13299 270456 86177 55506 124876 159438 234556 166473 -148933 202184 4355 -15423 158819
13287 320089 208668 320625 50615 -273422 352446 270745 106045 174856 67027 47590
13277D7590a7115A91629K8513p612l8462n9150A0256J28609J2986K81911c38934
13265A49389H858B688a4902j55493A4757b75790C3759b33634C70753A45474Q670
13254A54144D0345i0599B94510o2020a08299E4728f48A54010l1579K4547m773
13243A42205F6746J88029j7603a4638A87949b2100C22835A37347M5470a05903
13232A25633j3831O323K14612j63903a44956B70861J28879A02437J52537j00947
13222A54027f4800c1857B81800j22998a91790b9599B72567F9614K02672A0671
13211C5867J24050h0554i189B44686a05653B17a94016B65151p5532k8378e4069
13199A64069C4431J37797F4146K37790b02973E7814J53622m8313D7804j6680M25041
$$ plain form
13277 47590 -17115 191629 220142 212530 174068 114918 10256 138865 151851 433762 -338934
13265 149389 8858 2688 -14902 -170395 14757 -275790 33759 -233634 370753 145474 154144
13254 154144 40345 -90599 294510 232490 -108299 54728 -648 154010 122431 146978 142205
13243 142205 66746 254775 237172 -14638 187949 -22100 322835 137347 182817 -105903
13232 125633 111802 118125 332737 168834 -144956 270861 399740 102437 254974 154027
13222 154027 -64800 -31857 281800 158802 -191790 -29599 272567 69614 272286 10671
13211 35867 159917 -80554 -9189 244686 -105653 217 -194016 265151 189619 161241 -54069
13199 164069 34431 172228 64146 301936 -202973 57814 211436 163123 47804 31124 456165
13188D56165j55664A23770Q3524L1035B7660N7540l2984J0491J02950L85670b77711
13176f58l4695C98143A74930E0504b74050C8189a61343k4729F6155b28424h5785
13164F6800N520e0728l36029F2389a25180A86726F6273a29118A7208R0166g0942
13152a0214m1610j46520f6369F3994J13593b21739l6664A11896c47816A91728
13141D15642j19904b58579B22486a6298A45900a6213p0686A54055l6648D98b3633
13129A09641M7501J05817n4926I1818b4000A32898h4877A16521j0808Q9156O461
13118B01330K0858f6432k3985C0109a6819D470a67358B62584a86567e3145H0405
13106C7180K26111I6376I096J28579M5491D2857J83083g4611H8263N0077k861
$$ plain form
13188 456165 300501 123770 207294 238329 27660 85200 52216 62707 165657 551327 -277711
13176 -658 -35353 398143 174930 50504 -274050 38189 -161343 -186072 66155 -228424 -85785
13164 66800 72320 -50728 -386757 62389 -125180 186726 66273 -129118 17208 107374 -70942
13152 -10214 -51824 -198344 -66369 63994 177587 -221739 -258403 111896 -347816 191728
13141 415642 295738 -258579 222486 -16298 145900 -16213 -86899 154055 117407 498 -23633
13129 109641 157142 262959 208033 91818 -24000 132898 -84877 116521 105713 194869 201330
13118 201330 222188 -66432 -90417 30109 -16819 4470 -167358 262584 -186567 -53145 80405
13106 37180 263291 96376 9096 137675 183166 42857 225940 -74611 88263 138340 135479
13095A35479J395F1498B9089a30703A73313K2907a71523B69736N7319a088m591
13084e679B51401a63030A5066L28345j61758D0264J3438a57087G5389l1157L62040
13073D06272A81872J96684j67671a57047D54119g9447m3293e2047A06371R7164
13063B03535r8647C3586J28435K14610j27981E4816J05806J58671c2785J4242
13053a8543j89493B9252J2494J19710g3036A31751a11162B96229h5889j29244
13043b15133A46203a71753F1920e1489b5325G4079c3252A42192Q2359O347A14347
13031c87974B72586K6987r4155A9247d4641p2923A99213D3836L91165g8150r9246
13020a77396k212l6602A01178P0616B6J61874a52830A69431n6490j2373B9826
$$ plain form
13095 135479 136874 61498 29089 -130703 173313 196220 -171523 269736 327055 -1088 -5679
13084 -5679 251401 -163030 15066 343411 181653 40264 53702 -157087 75389 44232 406272
13073 406272 181872 378556 210885 -157047 454119 -79447 -122740 -52047 106371 203535
13063 203535 104888 33586 162021 376631 248650 54816 160622 319293 -32785 -18543
13053 -18543 -208036 29252 41746 161456 -73036 131751 -111162 296229 -85889 -215133
13043 -215133 146203 -171753 61920 -51489 -25325 74079 -33252 142192 224551 230898 114347
13031 -387974 272586 299573 205418 19247 -44641 -117564 199213 43836 435001 -78150 -177396
13020 -177396 -179608 -216210 101178 171794 26 161900 -152830 169431 112941 100568 29826
13008C4864Q7964J83052j9218A17628q201k5281a13288B9990L94271a50131O2055
12997h8076I4173O9458C1471M6013J6194c3934j32018G1662a93085C91305A83836
12985a59224e8286A04177a75947k9184A29891c53338A64151a10391k2885d2878
12974a2406C02252c9389C22344b25867c1234B25895j08350J45035a48103A24970
12963c1023E5333a12052O211A34572J16364b68412b4776A67153J2348c91300a58131
12951b2773j3146k996o2562l5416A94245d5337j64843l5381B03694b32993D0057
12939a70849P2372B61224a00883B35792a02532C728K23561r5041f226F1226N7527
12928A18753c03255B46923F8387a40036k28194g9270a7442j34874H4434J05477
$$ plain form
13008 34864 122828 305880 286662 117628 109427 84146 -113288 29990 424261 -150131 -88076
12997 -88076 94173 163631 31471 77484 93678 -33934 -165952 71662 -193085 391305 183836
12985 -159224 -58286 104177 -175947 -205131 129891 -353338 164151 -110391 -133276 -42878
12974 -12406 302252 -39389 322344 -225867 -31234 225895 117545 262580 -148103 124970
12963 -31023 55333 -112052 -105841 134572 250936 -268412 -24776 167153 179501 -391300 -158131
12951 -22773 -35919 -38915 -101477 -136893 194245 -45337 -210180 -245561 203694 -232993 40057
12939 -170849 -98477 261224 -100883 235792 -102532 3728 227289 132248 -6226 61226 118753
12928 118753 -303255 246923 68387 -140036 -368230 -79270 -17442 -152316 84434 189911
12918A89911J4013J59560A56143a11104A99650G3291A0261a52828C7457g2727
12907A24428a46983j8330B63202A07998i838A45634B3100L76870A68464j8594
12897A49870D5935e9845o7261A73527J51161d9236k08003K2580e4618A94959R4774
12886B89733b61221A03651A2809K77389d229J050H1668C5035a42886A61565c10078
12874b06661A05379a68886B12986G9035a9166k96614a02221B52083a44091c4805
12863E7908K5973f4818H3295G849a46655f8288G2374k5942R5973o1727b96697
12851a38720B51574i2525J6169B27027O5276G618K836O2040O6878M3489h1645
12839g358K108A69193G9305b60042a04713E4691a88462i13k49497h9089C26247
$$ plain form
12918 189911 203924 363484 156143 -111104 199650 73291 10261 -152828 37457 -72727
12907 124428 -146983 -165313 263202 107998 -9838 145634 23100 399970 168464 149870
12897 149870 45935 -59845 -127106 173527 324688 -49236 -257239 -234659 -54618 194959 289733
12886 289733 -261221 103651 12809 290198 -4229 -3179 81668 35035 -142886 161565 -310078
12874 -206661 105379 -168886 212986 79035 -19166 -315780 -102221 252083 -144091 -34805
12863 57908 83881 -64818 83295 7849 -146655 -68288 72374 46432 142405 80678 -296697
12851 -138720 251574 -92525 -76356 227027 292303 7618 10454 72494 139372 182861 -81645
12839 -7358 -5250 169193 79305 -260042 -104713 54691 -188462 -913 -250410 -89089 326247
12827B66543b05213J3417J2333h2167q7069b3785C5125M6212f5115b2295q8075
12816a10370A5544O6542c1896j5207C3516a52632a3177k12997d462j9488B57720
12804A74234c5990H5192c5871G0763J42688p4654j992J36921A09329l6573a422
12792A4219D660L497a0425m5496j08726L7687K1801F5371a58448D0105N182J99974
12780B45261J74390B0433a85521p0758B19243f9972A06382b24239i0970B48345
12769B22571I5265g6599F3833K6395c1611B00526b67707Q8882A14757c10335H3563
12757A69219F4032l553a90124C12665a27164j91367C91347j50956F2571k3553
12747C9018c33458A64593l7406m0406J95740I285c0565k5217A84675H7158L32216
$$ plain form
12827 266543 -205213 -191796 -179463 -82167 -169236 -23785 35125 81337 -65115 -22295 -110370
12816 -110370 15544 82086 -31896 -47103 33516 -152632 -13177 -226174 -4462 -23950 257720
12804 174234 -35990 85192 -35871 70763 213451 138797 136805 273726 109329 72756 -1422
12792 14219 4660 8157 -10425 -55921 -164647 -126960 -105159 65371 -158448 40105 45287 245261
12780 245261 419651 20433 -185521 -256279 219243 -69972 106382 -224239 -90970 248345
12769 222571 95265 -76599 63833 90228 -31611 200526 -267707 -178825 114757 -310335 83563
12757 169219 64032 60479 -190124 312665 -127164 -318531 391347 240391 62571 39018
12747 39018 -333458 164593 127187 86781 282521 9285 -30565 -55782 184675 87158 419374
12736D19374A50236a50954A78575N4385j05322L4562d1674A11879b3266B83314
12725b2975j07604e6469l04869h2259p6644N8553j68981e1347J3295j60398a7013
12713h6248B070a49218B51592A12897J46571K25230b9722A17018M08859A14812
12702A50786R6630F9610f5432C2848M3390b3419B14077r6054i7332D19925f583
12690d26637a1302B8650N777J5102Q7287l1012j7146M8642a17838A95076g8174
12678G5381J74428j13204j3347E8151b03875C28650p7651b41125C2785K36896
12668B69681a32378d4429A38944a73264e2585k66157d7386A29650a86306H8262
12657G2842J99979k1906M8280A5078Q8867L1569f8056A71291b29997F5154J37036
$$ plain form
12736 419374 150236 -150954 178575 232960 127638 162200 -41674 111879 -23266 283314
12725 -22975 -130579 -56469 -361338 -82259 -158903 -100350 -269331 -51347 -38052 -198450 -17013
12713 -86248 2070 -149218 251592 112897 259468 484698 -29722 117018 525877 114812
12702 150786 247416 69610 -65432 32848 76238 -23419 214077 118023 -97332 419925 -6583
12690 -426637 -11302 28650 34427 49529 136816 105804 88658 137300 -117838 195076 -78174
12678 75381 249809 136605 123258 58151 -203875 328650 250999 -241125 32785 269681
12668 269681 -132378 -44429 138944 -173264 -52585 -318742 -47386 129650 -186306 88262
12657 72842 272821 250915 299195 15078 103945 135514 -68056 171291 -229997 65154 202190
12646B02190a19084c0906C14204C6757J17661o7450b31401I4689J87352m3514
12636B38527q6451A1761c4709k57706f8062A90027j4560b8187j86475A38036n9337
12625G8699K8262J0580B4355L03441j21550i5149C29282h4790A82335c15002a27719
12613e1909j13288B50314o474d2627j57019B05712f1705B03898n8110A7277b17650
12601b75780e8111C42231A34680J7582R845K6548F5924b40540D43785k00021a22437
12589b2641A13748b1044q6947e44A00405B0764a44630B26475f636j40129H5767
12577I0355C1110J64238a93608e0458B17883A05674K05946d23879b02888C59296
12566b69562J01153L249A33335C4080J67383n9416J76289A38258l4408k9581a08255
$$ plain form
12646 202190 -119084 -30906 314204 36757 154418 86968 -231401 94689 282041 238527
12636 238527 152076 11761 -34709 -292415 -68062 190027 175467 -28187 -214662 138036 78699
12625 78699 106961 117541 24355 327796 206246 -95149 329282 -84790 182335 -315002 -127719
12613 -51909 -165197 250314 243840 -42627 -199646 205712 -61705 203898 145788 17277 -217650
12601 -275780 -58111 342231 134680 152262 162107 188655 65924 -240540 443785 243764 -122437
12589 -22641 113748 -21044 -107991 -544 100405 20764 -144630 226475 -6636 -146765 85767
12577 90355 31110 195348 -193608 -50458 217883 105674 311620 -423879 -202888 359296
12566 -269562 -168409 -165160 133335 34080 201463 142047 318336 138258 103850 74269 -108255
12554A07003b45613b3044A49414g7924A68128D5606J58077m838c1730H7822h3771
12542B68693a94585P6098F8199a1441j15979J1715J4430B62808b62085C3003L5502
12531F8505b77100c4430A05998c35546B6653c52912F9238b1874C2880c2506j2910
12520d5416j40710E7087k6936a93490B09771a50241f3553a3971A21783a82290
12509i2207B79388a44160f8990K700A89482B4980j1372J93692F898J50921K4413
12498A82232a45824j06239a03170E8488L06946G0449d18708A44803i1650J7132
12488g4518F8160a38033A68130J41794E5071N3955J41870D2414j7911J24028c64761
12476a35843B00214r0801b8198B34685J3816a07908d3284I7101i1827A78675N428
$$ plain form
12554 107003 -245613 -23044 149414 -77924 168128 45606 203683 198845 -31730 87822 -83771
12542 268693 -194585 -118487 68199 -11441 -127420 -115705 -101275 262808 -262085 33003 68505
12531 68505 -277100 -34430 105998 -335546 26653 -352912 69238 -21874 32880 -32506 -45416
12520 -45416 -186126 57087 30151 -193490 209771 -150241 -63553 -13971 121783 -182290
12509 -92207 279388 -144160 -68990 -66290 189482 24980 13608 207300 6898 157819 182232
12498 182232 -145824 -252063 -103170 58488 365434 70449 -418708 144803 -91650 -74518
12488 -74518 68160 -138033 168130 309924 55071 109026 250896 42414 24503 148531 -364761
12476 -135843 200214 109413 -28198 234685 248501 -107908 -43284 97101 -91827 178675 184103
12465A84103m5822f8428r6922c2198C3023A4493R795N918K89315C1504M9196a14501
12452I4430g0089j6635C60804I4120a19437A82499D1774a59228A34953J91848
12442C26801H9508R3166i166B4362f9941I5630K6250c49538J02586a18483G39
12430a52431J9977A0495b36943A15000Q3396b44444j45028a05061A45984K9802
12420A75786F6214a82104B24205p7904m6614b68898M4290D3272a39449E6104J08324
12409A64428i0336o1081A97149A8134R5384a30254j2290B1774e2556k24509e7804
12397b04944h4750B7699a14252B35528F6721b76285A82084j0747c23552J15188
12387b08364A68601g9351j06913I3241A0525a0745n2879L1051C16128f1877K4175
$$ plain form
12465 184103 138281 -68428 -165350 -32198 33023 14493 24288 30206 319521 31504 80700 -114501
12452 94430 -70089 -86724 360804 94120 -119437 182499 41774 -159228 134953 326801
12442 326801 89508 182674 -9166 24362 -69941 95630 121880 -349538 -246952 -118483 739
12430 -152431 -132454 10495 -236943 115000 198396 -244444 -389472 -105061 145984 175786
12420 175786 66214 -182104 224205 146301 99687 -268898 -224608 43272 -139449 56104 164428
12409 164428 -90336 -151417 197149 18134 113518 -130254 -142544 21774 -52556 -277065 -57804
12397 -204944 -84750 27699 -114252 235528 66721 -276285 182084 171337 -323552 -208364
12387 -208364 168601 -79351 -186264 93241 10525 -10745 -63624 -32573 316128 -61877 -37702
12376c7702B31806F7304K10600D4372a84366O092A82574c3263l40264c8093j45095
12365a83188f7369A06158j4316b3231k88312a07068j73542i2187k9777C12445
12354a2674m9398J4523j77471C03468a5129A60499J39516b51353g4826k6260A02001
12342a04403A63382E8143K53274H7095J40564J25462q7989A16346a46255I8065
12331A91895g1211A10242a46183a7014j35994L1727e8355A0362Q7831N9606p7168
12320H0631O4418n9567K2943c52718A0555J76609b6870A93479c4522A85756e0556
12308F7477J52089g7086J0418i826B40487a10536k12067n6723J24258k16060a59939
12296a3554B29940G0267a42345D115J30876F4101h3739j84914H2167K38060A23517
$$ plain form
12376 -37702 231806 67304 277904 44372 -184366 -178274 182574 -33263 -373527 -38093 -183188
12365 -183188 -67369 106158 91842 -23231 -311543 -107068 -280610 -92187 -121964 312445
12354 -12674 -62072 -47549 -225020 303468 -15129 160499 300015 -251353 -74826 -101086 102001
12342 -104403 163382 58143 311417 87095 227659 353121 265132 116346 -146255 98065
12331 191895 -71211 110242 -146183 -17014 -153008 -121281 -58355 10362 98193 157799 80631
12320 80631 145049 85482 108425 -352718 10555 187164 -26870 193479 -34522 185756 -50556
12308 67477 219566 -77086 -66668 -9826 240487 -110536 -322603 -379326 -255068 -471128 -159939
12296 -13554 229940 70267 -142345 4115 134991 64101 -83739 -268653 82167 320227 123517
12284h2378L3639l2559B88505G3230d0814g470A60647J16738b7317B45741l7961
12273B07780e2654C60095j20132l1638J66137C928c30336A01082G89Q5729P1139
12262A57657L25495c9008H8409c05047i1903A00137a72494a0497H1898b8120j33638
12251a61758f0621B5212a22445D26549D5373M0905J91885g9296J3677B63062D9132
12239h6470n9735A22332K71232A16911b5910A74547O0634f3623A63576b4016A98432
12227A19767f8301B58438K06231b05760A63399M1628a56329n1556E8061I879J0167
12216B0046K30486A12210K49787A23533C4050L64477j5039A01466K8701K47503
12206C77670B1099P9379l6626k6993K34516j31185a21656D01778b66657l7862
$$ plain form
12284 -82378 -48739 -81298 288505 73230 -40814 -7470 160647 277385 -27317 245741 207780
12273 207780 -52654 360095 239963 208325 374462 3928 -330336 101082 789 86518 157657
12262 157657 483152 -39008 88409 -305047 -91903 100137 -172494 -10497 81898 -28120 -161758
12251 -161758 -60621 25212 -122445 426549 45373 86278 278163 -79296 -65619 263062 49132
12239 -86470 -146205 122332 393564 116911 -25910 174547 235181 -63623 163576 -24016 198432
12227 119767 -68301 258438 464669 -205760 163399 205027 -156329 -207885 58061 9879 20046
12216 20046 250532 112210 361997 123533 34050 398527 383488 101466 130167 377670
12206 377670 21099 100478 63852 36859 271375 140190 -121656 401778 -266657 -304519
12196c04519B71224D6698A2223K58723a96074k831L6859B13273K3969F4097J8434
12185H2531d6047A58467K95A993a12830B55189o9019h5197B07979C6987A8069
12173B16421I0288L0564c9801b085A11096L57413A160a66581E0483J31883F5519
12161F436a26858B57985A20737D5135O7760c47232B5764L42349e3353J4506e504
12149a51009f5006b6325G0997J57289E8503J04767C4366d9915n6320d6921B48254
12137h7196o1915A17285G231J9752b7499B02151O8219e4037H8223K19840b33892
12125B83590n0994a04604A26651C7024K16288G76b60102N4382F1454A4732R2857
12114A07589k8905A5129d4568o0799F2481J02494f6637R093j42866H8414a93143
$$ plain form
12196 -304519 271224 46698 12223 270946 -196074 -198905 -162046 213273 237242 64097 82531
12185 82531 -46047 158467 158762 1993 -112830 255189 186170 -85197 207979 36987 18069
12173 216421 90288 120852 -39801 -2085 111096 468509 1160 -166581 50483 182366 65519
12161 6436 -126858 257985 120737 45135 112895 -347232 25764 368113 -53353 -38847 -5504
12149 -151009 -65006 -26325 70997 228286 58503 163270 34366 -49915 -106235 -46921 248254
12137 -87196 -149111 117285 7231 26983 -27499 202151 270370 -54037 88223 308063 -233892
12125 283590 232596 -104604 126651 37024 253312 776 -260102 -205720 61454 14732 107589
12114 107589 78684 15129 -44568 -105367 62481 164975 -66637 -57544 -200410 88414 -193143
12102A01404C1457a6762k38870i5404C7849b82134d1004A36925K0598P9831g6392
12090A4642b5039A88043P0509b9598l7708k29118J38106A72773l7904b0110C09969
12078G30830P89952j40356E65383j4462c6734j47123p12C273J45272a6666j9833
12067c6499D27580G8505g7143A55274C4165g8486j36315d1888J822F7958e416
12055G3186d6729o9520j98130c228B67773D0137e2908j8725A24106a16308A55762
12043b6585A62572l1049C6996c29342B27215D879b21498i9907n8734A65171f5661
12031G5068i4682I5524J59247b63520A31707A4033Q8880a18571d583H4258b08983
12019g7566m9617e4989j95625i0992m7308B79139H379O2561A9954K6890J35066
$$ plain form
12102 101404 31457 -16762 -255632 -95404 37849 -282134 -41004 136925 157523 237354 -76392
12090 14642 -25039 188043 258552 -29598 -67306 -296424 -158318 172773 134869 -20110 309969
12078 730830 1520782 1380426 565383 550921 -36734 -183857 -184569 3273 148545 -16666 -36499
12067 -36499 427580 78505 -77143 155274 34165 -78486 -214801 -41888 -40066 67958 -5416
12055 73186 -46729 -116249 -314379 -3228 267773 40137 -52908 -71633 124106 -116308 155762
12043 -26585 162572 131523 36996 -329342 227215 4879 -221498 -99907 -158641 165171 -65661
12031 75068 -94682 95524 254771 -263520 131707 14033 102913 -118571 -4583 84258 -208983
12019 -77566 -127183 -54989 -250614 -90992 -138300 279139 8379 70940 19954 46844 181910
12008A81910K44201A06656m5567J82696j17214a2235k02972a3147I4416j6889
11998G7527l1826F266L8077a87616g7897j22365J8829C2081N7720K11277a66901
11986a97090A63K36660F8052c0807k19185A0836h8021r3455o6839I2512g0137
11974c21723A60652G5980c4668A06346b90270M9393A21377O795b93923M3592b1391
11962b0636j12558j3297n5544L9694A11340K81950G9373a84228N3326F8815E48
11950I3185c20223b1499j39681n5640e8129A83844e5994I1319a70727N9997D9570
11938B2043J49095b24624h4825L648J8849l2894B42888b58670J12299A2041J37716
11927A49757e5390B72280f9329b8670B42204C4996J73625o6205F7541J69670Q7533
$$ plain form
12008 181910 426111 106656 61089 243785 126571 -12235 -215207 -13147 94416 77527
11998 77527 45701 6266 44343 -187616 -77897 -200262 -181433 32081 89801 301078 -166901
11986 -197090 163 236823 68052 -30807 -249992 10836 -88021 -181476 -248315 92512 -70137
11974 -321723 160652 75980 -34668 106346 -290270 -240877 121377 128172 -293923 -250331 -21391
11962 -20636 -133194 -146491 -202035 -162341 111340 393290 79373 -184228 -130902 68815 548
11950 93185 -320223 -21499 -161180 -216820 -58129 183844 -55994 91319 -170727 -110730 49570
11938 22043 171138 -224624 -84825 -81177 -62328 -95222 242888 -258670 -146371 12041 149757
11927 149757 -55390 272280 -69329 -28670 242204 34996 208621 142416 67541 237211 324744
11916C24744c5169C30503p1883b96593A16066Q1658a21967N0323F8504a17271
11905A13583b2301j64342b1324B11928H5474O5828a27129j89888B06366F2230
11894A8108m290c2337B78640a70831C1979a4139d764k12603N6461A86405D9636
11882a27505G4542g8939o8902A22697h6353B4447L7739a29399B47735A4685b90490
11870c31689J13944B31668b45281O9222O2844A57720l5793d2878B7937b0557j36183
11859a56740B89698b84325J12941j3011F2748A5239c4664j17040i275l194l6991
11848d9460q2340e7992k57432C7211a37090k93656i2373j89081C5276b4848o1043
11837h5891j09873A34899N0903a66339E8519a61976C33418A17475J28427a973
$$ plain form
11916 324744 -35169 330503 258620 -296593 116066 197724 -121967 -71644 68504 -117271
11905 113583 -22301 -186643 -21324 211928 85474 151302 -127129 -317017 206366 62230
11894 18108 13818 -32337 278640 -170831 31979 -14139 -4764 -217367 -160906 186405 49636
11882 -127505 74542 -78939 -147841 122697 -86353 24447 62186 -129399 247735 14685 -290490
11870 -331689 -217745 231668 -245281 -176059 -113215 157720 121927 -42878 27937 -20557 -156740
11859 -156740 289698 -284325 -171384 -184395 62748 15239 -34664 -151704 -9275 -12469 -49460
11848 -49460 -131800 -57992 -315424 37211 -137090 -430746 -92373 -281454 35276 -24848 -85891
11837 -85891 -195764 134899 185802 -166339 58519 -161976 333418 117475 245902 -1973
11826A16928B6892e2845l77663i8131n9913j8453l272D6268L8937a12536k6059
11815a38595j44247K7630M2733A34528a04233b4778p0911D1912a2188A834h1390
11803a11353a5189A2593J5549K8705h5728D2340L07698B4132e4552j80975f7043
11791B33372a8958C59588I9347a03265k76705G3322k9889Q4976b08663F2736g1920
11779a48435L4574A32113b09888C22469c4474k3072m2235M9207F6204n401a7474
11767H1201a24488G7971R0070k5316e19239b820k96255A66845B0677a70506B3765
11755a38291L0712k81698E2868a19908A69888b47832d8511j49626N4666D39192
11744D117N0493a04733a5597j29666b5849K095k21940d1174D42432E2380J55963
$$ plain form
11826 116928 26892 -52845 -430508 -98131 -158044 -176497 -179769 46268 85205 -112536 -138595
11815 -138595 -282842 -255212 -212479 134528 -104233 -24778 -95689 41912 -12188 1834 -81390
11803 -111353 -15189 12593 28142 56847 -85728 42340 350038 24132 -54552 -235527 -67043
11791 233372 -18958 359588 99347 -103265 -379970 73322 43433 128409 -208663 62736 -71920
11779 -148435 -113861 132113 -209888 322469 -34474 -57546 -99781 -50574 66204 60803 -17474
11767 81201 -124488 77971 168041 142725 -519239 -2820 -299075 166845 20677 -170506 23765
11755 -138291 -107579 -389277 52868 -119908 169888 -247832 -48511 -198137 -143471 439192
11744 4117 54610 -104733 -15597 -145263 -25849 -23754 -245694 -41174 442432 52380 208343
11733B08343o3072c55869C45136A19285b1187I6004a92749E830a24782H7786K6606
11722A14392a6084j57610A08830P1549m7638j4428J32676A00428R6112K0352N8890
11711B75782F3784P4578N1005L4064C1709K26185g9970k68467C6243J21014J65266
11700C22523H4212J8771e2436C63189E2626J26564J49176h0462F0574A3630e0181
11688D18217a26174h648I3513J11911o5926b9061n8495L4304A24859c833D03920
11676a0505C69104a59447P7929E272c8651A42660C4519b72225b2604A62011B983
11664A51382J00913b2682j0948j4255A2957P2223K12202a21960b7152A8953a655
11652A60269A8161J65305b7996k10944A02242b9399l4187l7739A00020b7375j14347
$$ plain form
11733 208343 145271 -355869 345136 119285 -21187 96004 -192749 5830 -124782 87786 114392
11722 114392 -16084 -173694 108830 180379 132741 118313 250989 100428 196540 216892 275782
11711 275782 63784 138362 189367 223431 31709 257894 -79970 -348437 36243 157257 322523
11700 322523 84212 102983 -52436 363189 52626 179190 328366 -80462 60574 13630 -50181
11688 418217 -126174 -8648 93513 205424 139498 -29061 -87556 -53252 124859 -3833 403920
11676 -10505 369104 -159447 -81518 5272 -38651 142660 34519 -272225 -22604 162011 2983
11664 151382 252295 -22682 -33630 -47885 12957 85180 297382 -121960 -27152 18953 -1655
11652 160269 18161 183466 -27996 -238940 102242 -29399 -63586 -101325 100020 -27375 -141722
11641a41722m6146I5085N1800O5796p8672c60537d8866k780A1441K04324b08900
11629C5650q115b30068a13954J9070r539H9251p110J28550r5022D7561J11778
11618A59339b17391A66578E4579J95438j00897g4927g772B39671m6287c23492
11607b51020i4138C70872a91334E0095M3247K47700b44942C25827j57524L1892
11597B00195a30380F75513d53177A66847B9675L58276B0913J54074a45365C62912
11586F0885J29563c9128C1297J14111A8164L52684a68215A09614C6767J22311
11576A59078a84710A07338a45170E674R004d3007H9139a15854B18248B6355a2288
11564A97267p7743a94203A70905e7575K6838B5833L5225K68957A21164g5234H6022
$$ plain form
11641 -141722 -187868 95085 146885 212681 134009 -360537 -48866 -51646 11441 215765 -208900
11629 35650 27535 -230068 -113954 -94884 -104423 89251 82141 210691 115669 47561 159339
11618 159339 -217391 166578 54579 250017 149120 -74927 -7772 239671 193384 -323492
11607 -251020 -94138 370872 -191334 50095 93342 341042 -244942 325827 168303 200195
11597 200195 -130380 675513 -453177 166847 29675 387951 20913 174987 -145365 362912
11586 60885 190448 -39128 31297 145408 18164 370848 -168215 109614 36767 159078
11576 159078 -184710 107338 -145170 5674 14678 -43007 89139 -115854 218248 26355 -12288
11564 197267 119524 -194203 170905 -57575 -30737 25833 61058 330015 121164 -75234 86022
11552G5739J02435F3673J34799K19145g0288A93455b59488A79360M0522n3535
11542A66347K75034j55505j31127F3229J21895o5330J85270A12049m3042b06143
11531E7027K69143g3427A0963b4662m18j76414M9931D8138K63959a61079A22584
11519d1744A52958L2938r2780a3024A20390a25205B36295b33505E2672K10782
11509B63454j3070n3307g488D223K05949H0247A3623L54596e2204A61086M9953
11498B11039r6708C1334D524K40064A4814a46428D458P4032C1745g9623C32960
11486A18500K16421b4454B1373K55828j03702O1326K34127a95031j03607A76572
11475A56340n7324b3404C1764J58019B957b46830F7748J21136m8087e8648C87752
$$ plain form
11552 75739 178174 63673 198472 417617 -70288 193455 -259488 179360 219882 166347
11542 166347 441381 285876 154749 63229 185124 119794 305064 112049 69007 -206143
11531 57027 326170 -73427 10963 -24662 -25080 -201494 -151563 48138 312097 -161079 122584
11519 -41744 152958 185896 93116 -13024 120390 -125205 236295 -233505 52672 263454
11509 263454 250384 197077 -7488 4223 210172 80247 13623 368219 -52204 161086 211039
11498 211039 114331 31334 4524 244588 14814 -146428 4458 78490 31745 -79623 332960
11486 118500 334921 -24454 21373 277201 173499 234825 468952 -195031 -298638 176572
11475 156340 99016 -23404 31764 189783 2957 -246830 67748 188884 140797 -58648 387752
11463A32699a59955H5899M12223A74748a91987E51405k68541k8863A06047J55157
11453B61204b2997k1483B59362A06584M3072e4482B98860a92173A93111h142C35787
11441B56728A10985e4459l53448D6296J87908j716K5868k7812H1403j9658a7714
11429d7299a5242q5128l0146E7747k8296c6093H2503b98738R9197D0978J11269
11418A52247D2729P2928m7299L6133f7277C0069b27072j08818A04168a36994A76327
11406f4626j48986B24583d7243A15948i84j0304j27566A825c08555k8139C9165
11394A84280m8226r105b604A863J27355d8701l4912C52493a75075d3631A87565
11382b17319h7858C15378E4965g6476B49252I5044g0877A97861A5944a95230B07780
$$ plain form
11463 132699 -159955 85899 498122 174748 -191987 551405 282864 254001 106047 261204
11453 261204 -22997 -44480 259362 106584 149656 -54482 298860 -192173 193111 -8142 335787
11441 256728 110985 -54459 -407907 46296 234204 232488 258356 230544 81403 61745 -17714
11429 -47299 -15242 -100370 -130516 57747 29451 -36093 82503 -298738 -199541 40978 152247
11418 152247 42729 115657 68358 104491 -67277 30069 -227072 -335890 104168 -136994 176327
11406 -64626 -213612 224583 -47243 115948 -984 -11288 -138854 1825 -308555 -336694 39165
11394 184280 136054 126949 -2604 1863 129218 -48701 -83613 352493 -175075 -43631 187565
11382 -217319 -87858 315378 54965 -76476 249252 95044 -70877 197861 15944 -195230 207780
11370A11151a93502F9403a92285N1250O983j10652n8889f5312j57707g554B3777
11358a57104A29795N180c3581A43038c16780A3036c0691A23258c38497A59440
11347B08795h4994B53040A1957i0549A69779g3224B87224e2981j0108A07693b60899
11335F024a4982k24042I7421e4752n8700j84602h390K833o0253A48846J80697
11324C29543j64485a98923d4779j0152p6392A60072b50399j34586B13452a79172
11313B77279h5731b4852A11289Q1082p2106a65714I7585g895G1645J12478q6436
11302I7687a08523G6319J09455c97607f6423C8351M0757a21008D0787d3114a8819
11290D2686a29229C0621J82496c40506J42051R1117K7716F1727J47697b09215
$$ plain form
11370 111151 -193502 69403 -192285 -141035 -134052 -244704 -303593 -65312 -223019 -7554 23777
11358 -157104 129795 134975 -33581 143038 -316780 13036 -30691 123258 -338497 159440
11347 208795 -84994 253040 11957 -90549 169779 -73224 287224 -52981 -63089 107693 -260899
11335 6024 -14982 -239024 97421 -54752 -113452 -298054 -8390 -5557 -65810 148846 329543
11324 329543 165058 -198923 -44779 -54931 -131323 160072 -250399 -384985 213452 -179172
11313 277279 -85731 -24852 111289 192371 120265 -165714 97585 -7895 71645 184123 97687
11302 97687 -108523 76319 185774 -397607 -66423 38351 79108 -121008 40787 -43114 -18819
11290 42686 -129229 30621 213117 -340506 -198455 -107338 -79622 61727 209424 -209215
11279b36704A94247e4168B02769a13008a9022B8256a04658e1204j55579r581e5106
11267B80011b99984a26805O256a5314I1527l0277B0129b19298J06739A45118J74455
11256C19573I215J21507k9219a19485A44892j7454d2940p2751B0374a52150F9156
11244A46340b1414B52804a31423l9541A06777H640c592j22685j38871b2216n2801
11233g5017j03260b092k50764A42446l0416b86226e1526j00472d123A30578f7151
11221A05192a30468D8921J93631D576M22621c5079C24899d21416k72617a61261
11210A11379a30386O1945A64452K42222c54376A47799J66686a84499M7336p3257
11200b10420A56344f7993B20936c56703E4644A6536N4554a8643j18746q4622q6508
$$ plain form
11279 -236704 194247 -54168 202769 -113008 -19022 28256 -104658 -51204 -206783 -216364 -55106
11267 280011 -299984 -126805 -120549 -15314 91527 61250 20129 -219298 -112559 145118 319573
11256 319573 9215 130722 101503 -119485 144892 127438 -42940 -115691 20374 -152150 69156
11244 146340 -21414 252804 -131423 -170964 106777 8640 -3592 -126277 -265148 -22216 -75017
11233 -75017 -178277 -2092 -252856 142446 112030 -286226 -51526 -151998 -4123 130578 -67151
11221 105192 -130468 48921 242552 4576 427197 -35079 324899 -421416 -694033 -161261
11210 111379 -130386 -68441 164452 406674 -354376 147799 314485 -184499 -137163 -210420
11200 -210420 156344 -67993 220936 -356703 54644 16536 71090 -18643 -137389 -222011 -308519
11189c08519A5147b29350J02036F9679f230C3268b10474H3761I406K06380I2528
11177A08822a33296A00569b11071A22801a7129F24M1715c0198K375l8538l73905
11166d40266G0905J54870j6023D9351a49614O8065A93430d3649J3946j23019A152
11154E8620a1697G428a53554e8099g30A44205a14938p3911B87377a42865l53823
11143d96688g7076G4218b08281B05513r1925R0653g3302K1053B36160A00215a20775
11131B85086b8768D6734J48736b6189j62269A48690h2860A07868a43679f6208
11120F0694J20340E5037M7817a4903m8623H7560a03039A41996j0270N7867e3118
11108A62028k1578P8324r3316C9090c29907H1121P8529J19924k3940p8042e3452
$$ plain form
11189 -308519 15147 -229350 -127314 69679 -6230 33268 -210474 83761 9406 215786 92528
11177 108822 -133296 100569 -211071 122801 -17129 624 42339 -30198 -27823 -66361 -440266
11166 -440266 70905 225775 209752 49351 -149614 -81549 193430 -43649 -29703 -152722 1152
11154 58620 -11697 7428 -153554 -58099 -730 144205 -114938 -188849 287377 -142865 -496688
11143 -496688 -77076 74218 -208281 205513 113588 204241 -73302 -52249 236160 100215 -120775
11131 285086 -28768 46734 195470 -26189 -188458 148690 -82860 107868 -143679 -66208
11120 60694 181034 55037 102854 -14903 -63526 87560 -103039 141996 131726 189593 -53118
11108 162028 140450 218774 125458 39090 -329907 81121 159650 279574 255634 177592 -53452
11096A98420r4182J45862F6357Q3957P7935C3473L0985J5703j8075P7967O3252
11085B03305J9056J40790j55544J05553N1102p0556n8261b27490G7630O4658M84813
11074F27101B0031J90917A03661L65274B217K94564j20317N02626j36775B53985
11063C8361K67095J01368j5712n061m3534N9609J6753M32551C76119J0570J27599
11052E14288k53668K58098j43234L51932k82772K46702j79338L3354J22733k12422
11042D55673J38741O9028K33969m05689R4599j22074M1854J10365j53235K12268
11032F75499L3228l2725j68209K00682j67149q9445J10221n8735J71907K15116
11022H90390D42381K60227j16441J80781l31309n8068K0250K23490j81448M0051
$$ plain form
11096 198420 104238 250100 66357 150314 228249 33473 64458 80161 62086 140053 203305
11085 203305 222361 363151 207607 313160 364262 293706 235445 -227490 77630 142288 627101
11074 627101 20031 210948 103661 468935 2217 296781 176464 679090 542315 253985
11063 38361 305456 406824 391112 386051 342517 402126 418879 851430 376119 386689 514288
11052 514288 260620 518718 375484 727416 444644 691346 512008 545362 668095 455673
11042 455673 594414 663442 897411 491722 586321 464247 506101 616466 463231 675499
11032 675499 708727 676002 507793 708475 541326 451881 562102 503367 675274 890390
11022 890390 442381 702608 586167 766948 435639 377571 397821 621311 439863 479914
11012D79914L19006l3524k33338K09687j70411j56765J78095l2038k52536r6696
11002B11394P6797I8604N55766J66647j04499m1116o7992K00650j53650l8668
10992F15742L38263q0059l2261k97096J37035M947o6984M64125k07992L99905
10982A275625l80945N2188L46813J44875k39020L44384K20709K43595J91896K92543
10972B492663r4080L26661l47130L25330k30199l46545j0400k28223l5486k26382
10962A626209Q7461K24490J98975n33213O37386K94293j19502O9299o07484P4852
10952A952766m81578L3922l16795k48868k33997R9732l60588R1463M6413j32299
10942D50171B24963p4818J93813k1028B3400q201K72411A15393K3257K0718J4784
$$ plain form
11012 479914 798920 765396 532058 741745 571334 414569 592664 560626 308090 211394
11002 211394 288191 98604 654370 821017 716518 675402 607410 808060 654410 615742
10992 615742 954005 873946 841685 544589 681624 686571 619587 1083712 875720 1275625
10982 1275625 894680 946868 1293681 1438556 1199536 1543920 1764629 2008224 2200120 2492663
10972 2492663 2398583 2725244 2378114 2703444 2473245 2126700 2116300 1888077 1852591 1626209
10962 1626209 1713670 1938160 2137135 1603922 2241308 2535601 2416099 2485398 1877914 1952766
10952 1952766 1471188 1505110 1188315 939447 705450 805182 444594 536057 582470 450171
10942 450171 224963 150145 343958 322930 23400 15199 287610 115393 138650 159368 174152
10931A74152e6800B62846a07475A49479j2163m0186a45542G8189J74199r6390
10921A55998K87859D255a88793B6365A337a248o0898j89763A97336E4693h5432
10909c3975G1796K37019b14057h7442J3740r7792M1973o0861I9478i2025k1592
10898a13617N4320n1495B35223a52014A58295R8673a65542A16496J6197Q5639
10888B18332a9984D3714A1963c7356C0288a23451M2264A99611F8144a07540A99386
10876a81709h6575B79107B1547b41020A91727a6021C7647J1152J03124a86336
10865C6295b03819E1136a65353O956A06235E2720a37587D6645A0882a97329q1419
10854b78748e6871j07570B73246h3330B37916a62125f6355A90224c497G5027h0344
$$ plain form
10931 174152 -56800 262846 -107475 149479 137316 97130 -145542 78189 252388 155998
10921 155998 443857 4255 -188793 26365 1337 -1248 -62146 -251909 197336 54693 -85432
10909 -33975 71796 308815 -214057 -87442 -73702 -171494 -129521 -190382 99478 -92025 -113617
10898 -113617 -59297 -110792 235223 -152014 158295 256968 -165542 116496 132693 218332
10888 218332 -19984 43714 11963 -37356 30288 -123451 -81187 199611 68144 -107540 199386
10876 -181709 -86575 279107 21547 -241020 191727 -16021 37647 48799 151923 -186336
10865 36295 -203819 51136 -165353 -158397 106235 52720 -137587 46645 10882 -197329 -278748
10854 -278748 -56871 -164441 273246 -83330 237916 -162125 -66355 190224 -3497 75027 -80344
10842D6571P421L1982a63465f7149j26754C51344H5315i0852H8065J59435b46468
10830f6515c807G8444d6095D36734H4997a10070d3285n5917A20185j424c52270
10818d09184J71883R7777O1191B9868a98375o3190d2941D9961A522K1469d01948
10806b5569C36653d17424K08593a7659F3731b35905B4913d6285C07316a27660
10795b06863I6423b18515C73224b05369o6257d1395I6493g0721C25614g00124
10784b97329g168r2455B73759A9672d570j31799K6961G6801O2646a65643n513
10773a71156c7868B0608c6723p7756j19360B9326a22672F2072a98179e7438m5611
10762a03049j91078A6938f3723A9012c91446G4992J70123a7997A29217Q6956g1047
$$ plain form
10842 46571 53992 85974 -163465 -67149 -193903 351344 85315 -90852 88065 247500 -246468
10830 -66515 -3807 78444 -46095 436734 84997 -110070 -43285 -99202 120185 118761 -352270
10818 -409184 -237301 -139524 -78333 29868 -198375 -261565 -42941 49961 1522 22991 -401948
10806 -25569 336653 -417424 -208831 -17659 63731 -235905 24913 -46285 307316 -127660
10795 -206863 96423 -218515 373224 -205369 -271626 -41395 96493 -70721 325614 -700124
10784 -297329 -7168 -99623 273759 19672 -4570 -136369 -109408 76801 139447 -165643 -171156
10773 -171156 -37868 20608 -36723 -114479 -233839 29326 -122672 62072 -198179 -57438 -103049
10762 -103049 -294127 16938 -63723 19012 -391446 74992 245115 -17997 129217 216173 -71047
10750a77361a0087l8962C54571j43445c3139B93523b82798a09678b1943o6765
10740h8708p399l4998l1153J5229A34467a13756l7316k24558i1277n9642H2759
10728A40553b47247K76G1838a76087k04665A04418H604J23644R9845b03672R5207
10717a08465G6456a59190b1848M704l1174A8656a16809j11303f098B706b24114
10705A01910A3929b44119a14610a8303M287A27982c6064K618B07075J2154G7326
10693a28374a9535q2181b3648j760A33727g2124A53939a0094j80678B270K07311
10682B09581b01412b6932q4898K4509j04707A8556a41261C3330O9261b71242a9446
10670a34675o6986B7289P9511C7546b62606A86714m2501b19075K0242d8697o8697
$$ plain form
10750 -177361 -10087 -49049 354571 211126 -33139 293523 -282798 -109678 -21943 -88708
10740 -88708 -96107 -131105 -162258 -147029 134467 -113756 -151072 -375630 -91277 -150919 82759
10728 140553 -247247 -246971 71838 -176087 -380752 104418 8604 132248 232093 -203672 -108465
10717 -108465 76456 -159190 -21848 -17144 -48318 18656 -116809 -228112 -6098 2706 -224114
10705 101910 13929 -244119 -114610 -18303 -14016 127982 -36064 -33446 207075 219229 77326
10693 -128374 -19535 -101716 -23648 -25408 133727 -72124 153939 -10094 -190772 2270 209581
10682 209581 -201412 -26932 -111830 -87321 -192028 18556 -141261 33330 102591 -271242 -19446
10670 -134675 -201661 27289 106800 37546 -262606 186714 144213 -219075 -198833 -48697 -117394
10659a17394B06217C3970b44003H9730l0708a07280M3933j05820A46414a15590
10648h3682A44715h1132j88137A59964D9782b29814A36696a91659F5784e264l00294
10637c05558F8812a04680k9274b6644k89810C42349a28058j55097B7482D36a1254
10625d2981A94617B5006a04968G4655a95792B0310a70374E8771R1437d2077j44315
10614a86392j8865J0098A31598g0374C5445b926B5518c8667q140F3947G786K7980
10602C5766e8778B39b76497c4903C5642c07202J29384B33297b2386k05287i545
10590a57164L8213A92302b14952C05411b13968i0693A14334J2929l0308K12706
10580C09661a01683j03925j11036a03411G8990j9462a40860L8435D9806a31283
$$ plain form
10659 -117394 206217 33970 -244003 89730 59022 -107280 -63347 -169167 146414 -115590
10648 -83682 144715 -81132 -269269 159964 49782 -229814 136696 -191659 65784 -5264 -305558
10637 -305558 68812 -104680 -133954 -26644 -316454 342349 -128058 -283155 27482 436 -11254
10625 -42981 194617 25006 -104968 74655 -195792 20310 -170374 58771 150208 -42077 -186392
10614 -186392 -205257 -195159 131598 -70374 35445 -2926 25518 -38667 -46807 63947 7786 35766
10602 35766 -58778 239 -276497 -34903 35642 -307202 -177818 233297 -22386 -227673 -9545
10590 -157164 -118951 192302 -214952 305411 -213968 -90693 114334 127263 96955 309661
10580 309661 -101683 -205608 -316644 -103411 78990 59528 -140860 -102425 49806 -131283
10569b32202G3326b03870m0624M7673E4925M2964m1729B6761r2P1824B7857K07405
10557B35262n9370B3769J0440a91595A66226b60552A02986K14224e0630n6337
10547a06967N760H296J43988a66561O7660I1092a87162a9564p0391b1913q1647
10536a03560c1284P730p1917c6280E7232L3944i2829B98394D5703a41892M9165
10525i2727o0363a5927k05752C09799d4186r43j332j68583C4018c17333h6405
10513A14393c96806A8970a92110h323k25938C6395h4310B13089b32997M314J07517
10502a21166F6644P5383a46854j63516f2836A24605a22178k083j4145b7151G4987
10490b04603b2602C4465N1365L6305q218k7620c161E12452A62837L64038k1881
$$ plain form
10569 -232202 73326 -203870 -244494 -196821 54925 97889 56160 26761 26669 98493 27857 235262
10557 235262 175892 23769 34209 -191595 166226 -260552 102986 317210 -50630 -106967
10547 -106967 -101207 8296 152284 -166561 -98901 91092 -187162 -19564 -89955 -21913 -103560
10536 -103560 -31284 -23554 -95471 -36280 57232 91176 -92829 298394 45703 -141892 -92727
10525 -92727 -153090 -15927 -221679 309799 -44186 -45129 -46461 -215044 34018 -317333 -86405
10513 114393 -396806 18970 -192110 -8323 -234261 36395 -84310 213089 -232997 -228683 -121166
10502 -121166 66644 142027 -146854 -310370 -62836 124605 -122178 -124261 -138406 -27151 74987
10490 -204603 -22602 34465 85830 122135 113917 86297 -3161 512452 162837 526875 504994
10479E04994K7265j18674L7654j53086g867q9295C17828p6680P3174A1382R9690
10468A11072c09749A99600P3141g6188C53625D4989Q6460d02247L4134B01677
10457c59808A610J73354B2804L3658h4821A22416q920O5294E9757O1911g77n9241
10445f0018j15377A35894b9672k30164B98263h3245A30152a58491A65334A6654
10434h4227I656L2227J53410K03509a37935F0964h6953G1162a74989B7350b53151
10422b44346G058b40401e3426j18032A26910N3148G2331Q227a84723C076b56306
10410c00322C318O6328J86140f2963A3577O3896d246j96755b5876A04061N108
10399A09169O2303q0777C3928J13210g9261j6304m6945B17461J0468b2491B37039
$$ plain form
10479 504994 532259 413585 451239 298153 -7867 -97162 317828 241148 314322 11382 111072
10468 111072 -309749 199600 272741 -76188 353625 44989 131449 -402247 -368113 201677
10457 -359808 1610 174964 22804 56462 -84821 122416 113496 178790 59757 121668 -777 -60018
10445 -60018 -175395 135894 -29672 -259836 298263 -83245 130152 -158491 165334 16654
10434 -84227 9656 41883 195293 398802 -137935 60964 -86953 71162 -174989 27350 -253151
10422 -244346 7058 -240401 -53426 -171458 126910 180058 72331 80558 -184723 3076 -256306
10410 -300322 3318 69646 255786 -62963 13577 77473 -4246 -201001 -25876 104061 109169
10399 109169 171472 90695 33928 147138 -79261 -95565 -142510 217461 227929 -22491 237039
10387H7259O8403b0337j32092h51A15615m4700B7106J466J44292a33349B49817
10375C0058J17823K00279J1192m2726R4156L2893A03853K76993j69386K50833
10365D62293F6559J48192C1635P44506H8415J21747r0580b9531l2744A2096K90044
10354C02140j50945B1373J02658L09245A75925L61449J79828k26404A60169J7831
10344A78000L24113A14489l6330P8529l8283J58094N4449H5109J40621f5191A76349
10332A10313K81498B8718R123K15470a528A9577b7531A58067L32865A13576J35199
10321B48775E4359L83968c4285A56387l4103J61232A8844J60369n5482E4115J62797
10310B16912a97538R4013o8614B09733a22450c8783J5115A95857G6299C2423b4387
$$ plain form
10387 87259 155662 -20337 -152429 -851 115615 70915 27106 28572 172864 -133349 249817
10375 30058 147881 348160 359352 316626 410782 443675 103853 380846 211460 462293
10365 462293 66559 214751 31635 776141 88415 210162 119582 -29531 -62275 12096 302140
10354 302140 151195 21373 124031 433276 175925 537374 717202 490798 160169 178000
10344 178000 502113 114489 78159 156688 118405 276499 330948 85109 225730 -65191 176349
10332 110313 391811 28718 37841 253311 -1528 19577 -27531 158067 490932 113576 248775
10321 248775 54359 438327 -34285 156387 122284 283516 18844 179213 123731 54115 216912
10310 216912 -197538 -103525 -172139 209733 -122450 -38783 -23668 195857 76299 32423 -24387
10298B11299j02654a30729c478k44044H015d7927Q812a668B08083c01676I3653
10286b50616k26007g8041C5652a11593c7966B13652m6844c33294J44848L3244
10276a55202A55653b60102N3522C881K8232O4228b95j66316A00713K7992P2280
10265B00985k3730c061H3560K838N4117o3149J09112k2663M5126n5903k1092Q3798
10253B15744o6941E6854c9918n5824A05217h30j82520C042a61247g133q6217c9367
10240C24810A46640b16272f1504F1694P8782A8579J41868g3548n4495b1228C8500
10228B5175a05834C03918B9981c7407M447p791l8581B86082b22749h4483E5788
10216b09568A39949j0054B0281b41200e5110j16117B16943m6674h8244B15005
$$ plain form
10298 211299 108645 -130729 -3478 -247522 8015 -47927 -39115 -1668 208083 -301676 93653
10286 -250616 -476623 -78041 35652 -111593 -37966 213652 166808 -333294 -188446 -155202
10276 -155202 155653 -260102 -206580 3881 32113 96341 -295 -166611 100713 128705 200985
10265 200985 177255 -3061 83560 86398 140515 77366 186478 163815 208941 153038 131946 215744
10253 215744 148803 56854 -39918 -95742 105217 -830 -183350 3042 -161247 -7133 -93350 -39367
10240 324810 146640 -216272 -61504 61694 140476 18579 160447 -73548 -128043 -21228 38500
10228 25175 -105834 303918 29981 -37407 -32960 -40751 -79332 286082 -222749 -84483 55788
10216 -209568 139949 129895 20281 -241200 -55110 -171227 216943 170269 -88244 215005
10205E8089K394J25550f4510p5586B55603a08232K9235B13999a40177F0860R8006
10194A58866a59361J7659d1894G4074a98966g4336k5392j20229A09957a6249B0271
10182c1089J0189r8530F9983a40826G1588Q8162k6770m1375K2253b93104A82191
10170c95120R0694a40812r0258B6740a41950F6054N7822L28539D9622i8315A65492
10158d3653q2701j33552q19C80Q2728a85460l3126K3863g9709F1517J28615e7712
10145g4438I5426d3910F2825d08929a16414N4508G1728d22820d8761j34741j60067
10134c43569D9667a47091A64338a08339K1338n4753D4310J45490p3190M6762b09035
10122c38486a11198E7373i3564k42381J669h8781l9795c3444D4135d203j52751
$$ plain form
10205 58089 60483 186033 -64510 -140096 255603 -108232 -78997 213999 -140177 60860 158866
10194 158866 -159361 -141702 -41894 74074 -198966 -74336 -99728 -219957 109957 -16249 20271
10182 -31089 -20900 -119430 69983 -140826 71588 159750 132980 91605 113858 -293104 182191
10170 -395120 -304426 -140812 -231070 26740 -141950 66054 123876 452415 49622 -98315 165492
10158 -43653 -126354 -259906 -260725 380 83108 -185460 -218586 -194723 -79709 61517 190132 -57712
10145 -74438 95426 -43910 62825 -408929 -116414 -61906 71728 -422820 -48761 -183502 -343569
10134 -343569 49667 -147091 164338 -108339 -87001 -141754 44310 189800 116610 163372 -209035
10122 -338486 -111198 57373 -93564 -335945 -334276 -88781 -128576 -33444 44135 -4203 -156954
10111a56954F2980d3109k28263J26660C01250a68094A40362i7240j99706D6931
10100c70375A12812e57808A2311c07211A84500J088j1295C3393c68152B09650
10089b81777c6643B88381A23739a77598b7220k34799d2721E5611j2574a37349
10078a9294k6575p9274q1320A81008b7928F4387B6280a1849B62006a93696E5986
10066D2197a31622A27245J33979a9416B12401C0881a61249F6943a74372N2832
10056a21540A12477K76050I0049L4123P7672o4497f8708E9612B9686J71389q3703
10045A17372j964b74286G4235p45b45294h0107A01804f4283n809B11441e1806
10033a03382M5959A66661a76316E5220a3323j193C35292c5775H9237L6569i9718
$$ plain form
10111 -156954 62980 -43109 -271372 -144712 301250 -168094 140362 -97240 -296946 46931
10100 -370375 112812 -557808 12311 -307211 184500 185588 174293 33393 -368152 209650
10089 -281777 -36643 288381 123739 -177598 -27220 -262019 -42721 55611 43037 -137349
10078 -19294 -45869 -125143 -206463 181008 -27928 64387 26280 -11849 262006 -193696 55986
10066 42197 -131622 127245 261224 -19416 212401 30881 -161249 66943 -174372 -121540
10056 -121540 112477 388527 90049 124172 201844 137347 -68708 59612 29686 201075 117372
10045 117372 115408 -274286 74235 73490 -245294 -80107 101804 -64283 -70092 211441 -51806
10033 -103382 -57423 166661 -176316 55220 -13323 -14516 335292 -35775 89237 125806 -99718
10021a55140r121B5997K7718b66009E0392b47635i9390F3881b12098f2057A35168
10009b93028j8792g6189K8210l89708d679A57370c01154a22014e8385I081c95837
9997a10503B18032q811D2201b27053P6224A0497c701k81880c1229A100a2813j8563
9985c1376B33440H3498J5027B953c52281o1099H1948a34212p818f0729H8706B1862
9972A89274J7719A5842b8082j19459A57292F7435A3895M80O1691c59442B1484
9960a44367J2953l062p4084a8203l58602A11405J41905E5607K8192b13740p9218
9949b92958G8639a24000d943B3001R3360a42431B05244l0955c40407A33983D4766
9937b25938e6533q9922C30677I0091c23061a31025a2275E0560K15848a85185n4446
$$ plain form
10021 -155140 -164261 25997 53715 -266009 50392 -247635 -99390 63881 -212098 -62057 135168
10009 -293028 -311820 -76189 -47979 -437687 -4679 157370 -301154 -122014 -58385 9081 -395837
9997 -110503 218032 209221 42201 -227053 -150829 10497 -3701 -285581 -31229 1100 -12813 -31376
9985 -31376 233440 83498 98525 2953 -352281 -413380 81948 -134212 -142030 -60729 88706 21862
9972 189274 206993 15842 -28082 -147541 157292 67435 13895 14375 76066 -359442 21484
9960 -144367 -131414 -134476 -208560 -18203 -376805 111405 253310 55607 83799 -213740 -292958
9949 -292958 78639 -124000 -4943 23001 116361 -142431 205244 174289 -340407 133983 44766
9937 -225938 -56533 -146455 330677 90091 -323061 -131025 -12275 50560 266408 -185185 -239631
9926b39631A32909b50579B22904n0895b14292M3334H8730a56395j08676J17128
9916a47943E7011J31252j7069d6700k32030f6871H0114b6576k15045F8794a9258
9904i1283A60719b01771I9828C6250h9402A48316H36c5938M164A50429a34964
9892d11907a3946k4212A89323b05648a6365j70737Q156J5854J1855A3034J9903
9881C2937b02540k6697J6483P9570N6343B28119D63g5309j20967D6108Q8953a20373
9868a40808c717C0703K84548f6761j15974H8926i1261l17709d3931n9915j67459
9857b71305a09649B50940b7487o1502L8564j45746l8870R9479E0820a28758B37638
9845a79699b8054A16104n3091a55866l989O1207D7440J68577b66840j60764A17571
$$ plain form
9926 -239631 132909 -250579 222904 172009 -214292 -170958 88730 -156395 -265071 -147943
9916 -147943 57011 188263 171194 -46700 -278730 -66871 80114 -26576 -241621 68794 -19258
9904 -91283 160719 -201771 99828 36250 -89402 148316 836 -35938 -31774 150429 -134964
9892 -411907 -13946 -38158 189323 -205648 -16365 -187102 -178946 -163092 -151237 13034 32937
9881 32937 -202540 -229237 -212754 -133184 -76841 228119 463 -75309 -196276 46108 135061 -120373
9868 -140808 -3717 30703 315251 -66761 -182735 88926 -91261 -408970 -43931 -103846 -271305
9857 -271305 -109649 250940 -27487 -88989 -50425 -196171 -235041 -135562 50820 -128758 237638
9845 -179699 -28054 116104 63013 -155866 -159855 -98648 47440 216017 -266840 -427604 117571
9833B70231E674a78050k13229F2540I456b05966p907d9994r1797A44483f5141
9821b37745B37703i568j04000L7743q2225A43898a30143N5284D2539c12976F4823
9809B00341b11803p9761I2140P9105a4408e353j86077A18995a2931G7810c5093
9797a94400l74139a37802c1884q8560m9933f4102A652b29419j3376C9565a30275
9785B2416b13912A90024a32878O3978D8409b27335G7506a43264K0848H7291g0215
9773A79248k2176h4483j61865C2984J68257e2278G0382a65409d7540k72239F1670
9761b78333h4527p7377d1662j9835C817a96678g8183l9209B06582I8355a21962
9749a5262B42111i9059j8779J0467D0038a53489M3093H0060d3967A10713j7954
$$ plain form
9833 270231 5674 -178050 -391279 62540 9456 -205966 -213873 -49994 -141791 144483 -65141
9821 -237745 237703 -9568 -113568 -75825 -158050 143898 -130143 -74859 42539 -312976 64823
9809 200341 -211803 -291564 92140 171245 -14408 -5353 -191430 118995 -12931 77810 -35093
9797 -194400 -568539 -137802 -31884 -120444 -170377 -64102 1652 -229419 -242795 39565 -130275
9785 22416 -213912 190024 -132878 -68900 48409 -227335 77506 -143264 -122416 87291 -70215
9773 179248 157072 -84483 -246348 32984 201241 -52278 70382 -165409 -47540 -319779 61670
9761 -278333 -84527 -161904 -41662 -61497 3817 -196678 -78183 -117392 206582 98355 -121962
9749 -15262 242111 -99059 -117838 -107371 40038 -153489 -110396 80060 -43967 110713 92759
9738I2759k4159b63720J13216j42073i0578L2197r3571L5499a695A17034b77883
9726A12080C3393R0714b30166C9110g1131n64506A31823a42263q6828f0510k86995
9715c47505J40670b9430D5401b09683P2573A0928K33103a46692d7161B4758b02082
9703A20836d6206C83946d34271e5575A87757q5797b86433B88891c7334l04773
9693c42107a45780o5307I1726C6410K5146e0432A38955C6887J26035A9720a38894
9681e3177j18302N0326c1012A09684f6032A27085b42406O6103P2494j78223E0565
9669A69294f4218k10776Q9482I2637D5974j9602K33255j15434b28034A10555g7297
9657H7104L7133L3455D8719i7087A57113k5415m3622B8946f00453b9545A83229
$$ plain form
9738 92759 68600 -263720 -150504 -292577 -90578 -58381 -151952 -116453 -1695 117034 -277883
9726 112080 33393 124107 -230166 39110 -71131 -635637 131823 -142263 -229091 -60510 -347505
9715 -347505 -206835 -29430 45401 -209683 -137110 10928 244031 -146692 -47161 24758 -202082
9703 120836 -46206 383946 -434271 -55575 187757 101960 -286433 288891 -37334 -342107
9693 -342107 -145780 -211087 91726 36410 61556 -50432 138955 36887 162922 19720 -138894
9681 -53177 -171479 -121153 -31012 109684 -66032 127085 -242406 -176303 -103809 -282032 50565
9669 169294 -64218 -274994 -185512 92637 45974 26372 259627 144193 -228034 110555 -77297
9657 87104 124237 157692 48719 -97087 157113 131698 88076 28946 -600453 -29545 183229
9645a43844j6658A76224a28857j20726n945K9119d5652r6168f5066B91610e3884
9633G5093J18576d60970a17011e4403L786H568b16816C32951B6622e0375E2393
9621a65673O8542b1368q6111I1118d09597g3992B65174H5110a92243h5553p661
9610i3214A0291b7842H221a13669C0126c0377j80628R8325h754m1399n4576B07079
9597F4014d28697I9682a50319G2710a32881M0935G0130e9705k82044J45263g6463
9585B98722b08888h64A65409c3105F6676c18763J24595j24749a47304A49446m542
9574A44904a14245E1210J6207j1970e04722A50255f6961l1888A5252i9137j76658
9563b75795j3653B03530a99993c2422C154M6304L7633a32447d1431k61828G164
$$ plain form
9645 -143844 -160502 176224 -128857 -249583 -255528 -226409 -45652 -141820 -65066 291610 -53884
9633 75093 193669 -460970 -117011 -54403 -50617 8568 -216816 332951 26622 -50375 52393
9621 -165673 -97131 -21368 -107479 91118 -409597 -73992 265174 85110 -192243 -85553 -93214
9610 -93214 10291 -27842 8221 -113669 30126 -30377 -211005 -112680 -8754 -50153 -104729 207079
9597 64014 -428697 99682 -150319 72710 -132881 -91946 70130 -59705 -341749 -196486 -76463
9585 298722 -208888 -864 165409 -33105 66676 -318763 -194168 -318917 -147304 149446 144904
9574 144904 -114245 51210 67417 55447 -504722 150255 -66961 -98849 15252 -99137 -275795
9563 -275795 -289448 203530 -199993 -32422 3154 49458 87091 -132447 -41431 -303259 7164
9551h0092b9121j45820I4829f7180k2115j17503K1010A6776d8627j99126i7132
9539b0037m0723H9459a79891A86418H739a34365o8830B9427K00285A05107J2119
9528A17226a75169A36375C6931i0998o9960G5578g5844N710j58635j21995a29631
9516B92436a27190A27192b53385q0220h7635E2414L9805j136b15314P8484L2107
9505a04723C37497e1101a8356l31439J28000B4290g0484l2616K9534B28061q6762
9494A41299m394b36742k4699A39258i7784j64342F526J90702b41156h7279E9897
9482b21803q4699Q6462e9443k45255J42424j08561J18831n8221A8312a818k386
9471d204j51388J3848j88501o0411D3771a39939b4900J1147j64619I8929g8232
$$ plain form
9551 -80092 -29121 -174941 94829 -67180 -89295 -206798 -185788 16776 -48627 -247753 -97132
9539 -20037 -60760 89459 -179891 186418 8739 -134365 -203195 29427 229712 105107 117226
9528 117226 -175169 136375 36931 -90998 -160958 75578 -75844 -70134 -228769 -350764 -129631
9516 292436 -127190 127192 -253385 -333605 -87635 52414 92219 91083 -215314 -136830 -104723
9505 -104723 337497 -51101 -18356 -349795 -221795 24290 -70484 -103100 -73566 228061 141299
9494 141299 136905 -236742 -261441 139258 -97784 -262126 6526 197228 -241156 -87279 59897
9482 -221803 -306502 -220040 -59443 -304698 -162274 -270835 -152004 -210225 18312 -1818 -4204
9471 -4204 -155592 -141744 -330245 -390656 43771 -139939 -24900 -13753 -178372 98929 -78232
9459I159c4024q9946C4881c91964a5983j3655j84370j3322L5382R149d8748p9144
9447a27892j36829a7015m4451A73745b32425O9369P9118j34445c0289q125j05780
9436a44194j12374J07401B57511a87486e4358k06975c4760B19703I5609a84305
9425A27516O0400n3334a0241A6760J28421A7165J1643c84076a56937B99552a27220
9413A18699f2177m5347k18071A8847A535M0367i7833a9729j91830C29179a36955
9401d8462h963m86930a60531l9255e2097p5681d0991m14776e1542A29493c5429
9389a1694B53293C2841d8169l1584L5926r5798A8274b1243C19283H5740e6355
9377b69618C5536b22008g379k70731a33271j46202a28152A82186a75360c3124
$$ plain form
9459 9159 -34024 -123970 34881 -391964 -15983 -29638 -214008 -227330 -191948 -182799 -48748 -127892
9447 -127892 -264721 -17015 -61466 173745 -232425 -163056 -83938 -218383 -30289 -38414 -144194
9436 -144194 -256568 -149167 257511 -187486 -54358 -261333 -34760 219703 95609 -184305
9425 127516 187916 134582 -10241 16760 145181 17165 28808 -384076 -156937 299552 -127220
9413 118699 -62177 -107524 -325595 18847 1535 41902 -97833 -19729 -211559 329179 -136955
9401 -48462 -8963 -495893 -160531 -199786 -52097 -127778 -40991 -455767 -51542 129493 -35429
9389 -11694 253293 32841 -48169 -79753 -43827 -139625 18274 -21243 319283 85740 -56355
9377 -269618 35536 -222008 -7379 -278110 -133271 -279473 -128152 182186 -175360 -33124
9366a25270j50744j1996n1247a42643A02704b9259l70736C54061b51951M5769
9356b06182O1384c6130B65581B7660c1778A15626g1144a2916k87921P0377H8484
9344c27291c6280j72300Q0053B70864a42989N6886B54737B2227J08732P645a87963
9332c05960a28678b9340A01337l6417d3913o098l5592k9518k9923a8935j9059
9321c7994B57451f413j23703A00241J29352o3690d36060E2987a41028b7429j30667
9310a58096L678a6975I9748M0965o7549J42560A4231K47273j5996b77549b0328
9298a58052q0454E2932a45065O8308m9220k30167h6454q8856k3800O0109e2083
9286H9642B3686P4510J08260O4550j09732C5283c0725G1134b90757J02108j02034
$$ plain form
9366 -125270 -276014 -288010 -339257 -142643 102704 -29259 -399995 354061 -251951 -206182
9356 -206182 -144798 -36130 265581 27660 -31778 115626 -71144 -12916 -300837 -230460 88484
9344 -327291 -36280 -208580 -128527 270864 -142989 -86103 254737 22227 130959 138604 -187963
9332 -305960 -128678 -29340 101337 64920 -43913 -50011 -85603 -115121 -145044 -18935 -37994
9321 -37994 257451 -6413 -130116 100241 229593 165903 -436060 52987 -141028 -27429 -158096
9310 -158096 -154418 -16975 99748 140713 73164 215724 14231 261504 245508 -277549 -20328
9298 -158052 -238506 52932 -145065 -76757 -125977 -356144 -86454 -175310 -199110 -139001 -52083
9286 89642 23686 98196 206456 271006 161274 35283 -30725 71134 -290757 -188649 -290683
9275b90683G5354b06736b8604j4623B5415a70491g2783l16115a69103M873A35865
9263B9914P1667a33466l5422f0562j79202D5127h3166D7373b09770j14443i6140
9251d8797j42305g8945G4074B0274a29177k8371b2288r1669N0429B7899b16622
9239b09346k49464a69584A69883c08946A20775e9962H2390b18196j40891J57169
9229b01918E4244c26259J39457a0643l08841a3875j01226D5395P6003n4742h9663
9217a61798j49965a06354m6945j65593G8588b55806j0335e0513A30686C8483f9419
9205a5395A78517E9798N7607k9028h1396j51116Q4178D38609I4658m2181a9907
9193A06665B9977J14170a52159j13229G1003b60716A31556a05367L1539B30501
$$ plain form
9275 -290683 75354 -206736 -28604 -43227 25415 -170491 -72783 -388898 -169103 -164230 135865
9263 29914 101581 -133466 -168888 -60562 -239764 45127 -83166 47373 -209770 -324213 -96140
9251 -48797 -191102 -78945 74074 20274 -129177 -157548 -22288 -113957 -63528 27899 -216622
9239 -209346 -458810 -169584 169883 -308946 120775 -59962 82390 -218196 -359087 -201918
9229 -201918 54244 -326259 -186802 -10643 -319484 -13875 -115101 45395 121398 66656 -89663
9217 -161798 -311763 -106354 -153299 -318892 78588 -255806 -266141 -50513 130686 38483 -69419
9205 -15395 178517 59798 117405 88377 -81396 -232512 -148334 438609 94658 52477 -19907
9193 106665 29977 144147 -152159 -265388 71003 -260716 131556 -105367 -73828 230501
9182B01657H8507b11548g0448k46152J20264C09102a64036B8503d8688H0923J37588
9171B18511a01587E5160A3374d4900A3420a12018A25306C256L4810c38241A26657
9159d78213b2027k900l1057j53349a4901A24348a24176A72985M7846f492A00894
9147a83508r0746L5574J01030A65791a3821A13146b72582C69660h7719j02113
9137a89832c1510A32754b38035Q8566B01180H158a80658H3987a74871D1330j228
9126D0102a25499d3173A10190A2856a904k10578p8544H2966c42897B0428b0838
9114a77890N3463q6269g049j76593b6068k64181D4486a80039B25695i6240l3657
9103a29897j61872h1684b6565A43145c08493d6077A66128Q0074a45817e0010B476
$$ plain form
9182 201657 88507 -211548 -70448 -316600 -196336 309102 -164036 28503 -48688 80923 218511
9171 218511 -101587 55160 13374 -44900 13420 -112018 125306 3256 38066 -338241 126657
9159 -478213 -22027 -24927 -55984 -209333 -14901 124348 -124176 172985 220831 -6492 100894
9147 -183508 -274254 -238680 -137650 165791 -13821 113146 -272582 369660 -87719 -189832
9137 -189832 -31510 132754 -238035 -149469 201180 8158 -180658 83987 -174871 41330 40102
9126 40102 -125499 -43173 110190 12856 -1904 -212482 -291026 82966 -342897 20428 -20838
9114 -177890 -124427 -210696 -7049 -183642 -26068 -290249 44486 -180039 225695 -96240 -129897
9103 -129897 -291769 -81684 -26565 143145 -308493 -46077 166128 246202 -145817 -50010 2476
9091f615o0325j02519f9577B28971q9830a14541d9497K2993B96353d52527h590
9079h7324c3820G9715f2210A1623a49409q3594k38096K31730Q3141E8576a36244
9067E2668a40646C23253G0731J5156b76109o8227J65014p4643F048c96804A46298
9055e1433o2109r0732c3814k3380o9398e5162j99226c802j32209A91438a6372
9043a59086o7063j80497f6204p2438B08022i1887B9876f0793D3049b86880E8745
9031a04064A0469J42845a76888a905p9935A30206C5887c46190f6635A00701l7847
9020F2854g1031j51059E0817O0121a92359E6569b83548Q7271K7452k2141h169
9008b58886j20289a70051N8322k1527E0976A3259b5623m6356l15482I8259b76610
$$ plain form
9091 -6615 -66940 -169459 -69577 228971 139141 -114541 -49497 -26504 296353 -452527 -8590
9079 -87324 -33820 79715 -62210 11623 -149409 -233003 -471099 -239369 -156228 58576 -136244
9067 52668 -140646 323253 70731 85887 -276109 -344336 -179322 -253965 6048 -396804 146298
9055 -51433 -113542 -204274 -33814 -57194 -126592 -55162 -254388 -3802 -136011 191438 -16372
9043 -159086 -226149 -406646 -66204 -138642 208022 -91887 29876 -60793 43049 -286880 58745
9031 -104064 10469 153314 -176888 -1905 -81840 130206 35887 -346190 -66635 100701 62854
9020 62854 -71031 -222090 50817 110938 -192359 56569 -283548 -196277 -168825 -190966 -8169
9008 -258886 -379175 -170051 -111729 -133256 50976 13259 -25623 -71979 -387461 98259 -276610
8996d8111B5789a01543k35125e5603I6904b31362a14180j84511J27552n1559I4173
8984A4921b11682d8496K1754A99189o5619b4433n3239E57819c98458a77906l9040
8973b16946J6671j70726a01397j3617a7958h968A60442g923l1097H3935e9663
8961c00125A90108R3740F9533K16777c27363A02606a43033A01820c6214P796r6987
8950a25405e7512H2391c045n3099A3455b548j49973A59032B7495a11431q6647
8939a98078K1101f6682D7799K62810L2492E8156J2509j6906a2943A1604a48730
8927A57482g9899D47499n0771P15731L905023Q437385J56246C910625A444486
8917D02938K91735l28001j82037G4012L2354g3363A30225J46597j6801K83948
$$ plain form
8996 -48111 25789 -101543 -336668 -55603 96904 -231362 -114180 -298691 -171139 -222698 94173
8984 14921 -211682 -48496 -26742 199189 133570 -24433 -77672 557819 -398458 -177906 -216946
8973 -216946 -200275 -371001 -101397 -115014 -17958 -8968 160442 -7923 -39020 83935 -59663
8961 -300125 190108 283848 69533 286310 -327363 102606 -143033 101820 -36214 -28418 -125405
8950 -125405 -57512 82391 -3045 -56144 13455 -2548 -152521 159032 27495 -111431 -198078
8939 -198078 -176977 -66682 47799 310609 343101 58156 70665 53759 -12943 11604 -148730
8927 157482 -79899 447499 396728 1112459 5017482 13454867 13611113 3910625 1444486
8917 402938 694673 366672 184635 74012 106366 -73363 130225 276822 260021 543969
8907E43969k46276J0356q7855b00409g3059q4634k3062A87142a26094N1300F2848
8895H5758a45604A31747g8405l25161a52824B00607E2443a18274A66900n7679
8885A09221c694E4748P701L8042g0866j0507g290p3923j1720H7785d30871M8298
8873c82573a78548i236l3630j39965o0442A2039J1229J3516g0661A4668b18992
8861a24125I0442i9779L0675r1415H6065J4138b36073E034J24502g571B50257
$$ plain form
8907 543969 297693 308049 220194 -200409 -73059 -157693 -180755 187142 -126094 -74794 62848
8895 85758 -145604 131747 -78405 -403566 -152824 200607 52443 -118274 166900 109221
8885 109221 -3694 54748 62449 100491 -70866 -81373 -7290 -81213 -92933 87785 -430871 -382573
8873 -382573 -178548 -9236 -42866 -182831 -243273 12039 23268 36784 -70661 14668 -218992
8861 -124125 90442 -99779 -69104 -160519 86065 100203 -236073 5034 129536 -7571 250257
$$ [...]
##END NTUPLES=NMR SPECTRUM
##END=
