##TITLE=AC1764_NAR_16_9683554_1oXbSsTABL
##JCAMPDX= 6.0         $$ Bruker NMR JCAMP-DX V2.0
##DATA TYPE= NMR SPECTRUM
##DATA CLASS= NTUPLES
##ORIGIN= BRUKER
##OWNER= Administrator
$$ 1.72 TOPSPIN		Version 2.1
$$ 2016-04-17 00:48:55.892 -0700  Administrator@X
$$ Compression mode = diff/dup
##.OBSERVE FREQUENCY= 400.02188249412
##.OBSERVE NUCLEUS= ^1H
##.ACQUISITION MODE= SIMULTANEOUS (DQD)
##.ACQUISITION SCHEME= undefined
##.AVERAGES= 64
##.DIGITISER RES= 22
##SPECTROMETER/DATA SYSTEM= spect
##.PULSE SEQUENCE= noesygpps1d.comp
##.SOLVENT NAME= COFFEE_meoh
##.SHIFT REFERENCE= INTERNAL, COFFEE_meoh, 1, 14.96082
##AUDIT TRAIL= $$ (NUMBER, WHEN, WHO, WHERE, PROCESS, VERSION, WHAT)
$$ ##TITLE= Audit trail, TOPSPIN		Version 2.1
$$ ##JCAMPDX= 5.01
$$ ##ORIGIN= Bruker BioSpin GmbH
$$ ##OWNER= Administrator
$$ $$ E:\/data/COFFEE/nmr/AC1764_NAR_16_9683554_1oXbSsTABL/12/pdata/1/auditp.txt
$$ ##AUDIT TRAIL=  $$ (NUMBER, WHEN, WHO, WHERE, PROCESS, VERSION, WHAT)
(   1,<2016-04-17 00:48:50.689 -0700>,<Administrator>,<X>,<go>,<TOPSPIN 2.1>,
      <created by zg
	started at 2016-04-17 00:37:21.173 -0700,
	POWCHK enabled, PULCHK disabled,
       configuration hash MD5:
       21 0F 79 D6 B3 7B B4 F6 88 20 88 DB 03 48 BD 9F
       data hash MD5: 64K
       A5 D4 1C 1D 36 1C 1A B6 86 F1 CC 98 F5 FF C4 23>)
(   2,<2016-04-17 00:48:53.829 -0700>,<Administrator>,<X>,<proc1d>,<TOPSPIN 2.1>,
      <Start of raw data processing
       efp LB = 0.3 FT_mod = 6 PKNL = 1 PHC0 = 0 PHC1 = 0 SI = 128K 
       data hash MD5: 128K
       53 9E 5E 19 7B 47 46 C4 20 8D 1F A9 75 E5 06 02>)
(   3,<2016-04-17 00:48:54.704 -0700>,<Administrator>,<X>,<proc1d>,<TOPSPIN 2.1>,
      <pk PHC0 = -83.77625 PHC1 = 0 
       data hash MD5: 128K
       67 BB 53 55 A5 D5 1F 60 73 31 66 C7 02 69 67 10>)
(   4,<2016-04-17 00:48:55.079 -0700>,<Administrator>,<X>,<proc1d>,<TOPSPIN 2.1>,
      <abs ABSG = 1 
       data hash MD5: 128K
       33 D9 90 3E D9 C9 B5 BF 89 AC F2 76 44 FB 03 20>)
(   5,<2016-04-17 00:48:55.189 -0700>,<Administrator>,<X>,<proc1d>,<TOPSPIN 2.1>,
      <abs ABSG = 2 
       data hash MD5: 128K
       6B 3A EC B5 3F 30 CA 8C 5F 04 AA 6A A3 11 B8 3E>)
(   6,<2016-04-17 00:48:55.267 -0700>,<Administrator>,<X>,<proc1d>,<TOPSPIN 2.1>,
      <abs ABSG = 3 
       data hash MD5: 128K
       54 17 D6 DF FA E4 50 9E 44 80 8F BD 9C 9B E2 2D>)
(   7,<2016-04-17 00:48:55.361 -0700>,<Administrator>,<X>,<proc1d>,<TOPSPIN 2.1>,
      <abs ABSG = 4 
       data hash MD5: 128K
       17 1E AD 46 EE 6B DA 00 B2 85 56 B0 98 FA 78 A5>)
(   8,<2016-04-17 00:48:55.439 -0700>,<Administrator>,<X>,<proc1d>,<TOPSPIN 2.1>,
      <abs ABSG = 5 
       data hash MD5: 128K
       E0 D4 AD BF A5 A3 85 6C A0 A8 92 EB BF B4 BE 8F>)
$$ ##END=
$$ 
$$ $$ hash MD5
$$ $$ 6F 1E 0F 12 E9 9B 57 A4 83 70 D2 FF 06 64 BD 91
##$RELAX= 
##$RELAX= 
##$RELAX= 
##$RELAX= 
##$RELAX= 
##$RELAX= 
##$RELAX= 
##$RELAX= 
$$ Bruker specific parameters
$$ --------------------------
##$DU= <E:\>
##$EXPNO= 12
$$ [...]
##$TP07= 0
##$TPNAME0= <>
##$TPNAME1= <>
##$TPNAME2= <>
##$TPNAME3= <>
##$TPNAME4= <>
##$TPNAME5= <>
##$TPNAME6= <>
##$TPNAME7= <>
##$TPOAL= (0..7)
0.5 0.5 0.5 0.5 0.5 0.5 0.5 0.5
##$TPOFFS= (0..7)
0 0 0 0 0 0 0 0
##$TUNHIN= 0
##$TUNHOUT= 0
##$TUNXOUT= 0
##$USERA1= <user>
##$USERA2= <user>
##$USERA3= <user>
##$USERA4= <user>
##$USERA5= <user>
##$V9= 5
##$VALIST= <valist>
##$VCLIST= <CCCCCCCCCCCCCCC>
##$VD= 0
##$VDLIST= <DDDDDDDDDDDDDDD>
##$VPLIST= <PPPPPPPPPPPPPPP>
##$VTLIST= <TTTTTTTTTTTTTTT>
##$WBST= 2048
##$WBSW= 25
##$XGAIN= (0..3)
0 0 0 0
##$XL= 0
##$YL= 0
##$YMAX_a= 6050767
##$YMIN_a= -12203990
##$ZGOPTNS= <>
##$ZL1= 120
##$ZL2= 120
##$ZL3= 120
##$ZL4= 120
##$ABSF1= 14.96082
##$ABSF2= -5.597362
##$ABSG= 5
##$ABSL= 3
##$ALPHA= 0
##$AQORDER= 0
##$ASSFAC= 0
##$ASSFACI= 0
##$ASSFACX= 0
##$ASSWID= 0
##$AUNMP= <proc_prof1d_extract.lims>
##$AXLEFT= 0
##$AXNAME= <>
##$AXNUC= <1H>
##$AXRIGHT= 0
##$AXTYPE= 0
##$AXUNIT= <>
##$AZFE= 0.1
##$AZFW= 0.1
##$BCFW= 0
##$BC_mod= 0
##$BYTORDP= 0
##$COROFFS= 0
##$CY= 15
##$DATMOD= 1
##$DC= 0
##$DFILT= <>
##$DTYPP= 0
##$F1P= 0
##$F2P= 0
##$FCOR= 0.5
##$FTSIZE= 131072
##$FT_mod= 6
##$GAMMA= 0
##$GB= 0
##$INTBC= 1
##$INTSCL= 1
##$ISEN= 128
##$LB= 0.3
##$LEV0= 0
##$LPBIN= 0
##$MAXI= 10000
##$MC2= 0
##$MEAN= 0
##$ME_mod= 0
##$MI= 0
##$NCOEF= 0
##$NC_proc= -2
##$NLEV= 6
##$NOISF1= 0
##$NOISF2= 0
##$NSP= 0
##$NTH_PI= 0
##$NZP= 0
##$OFFSET= 14.96082
##$PC= 1
##$PHC0= -83.77625
##$PHC1= 0
##$PH_mod= 1
##$PKNL= yes
##$PPARMOD= 0
##$PPDIAG= 0
##$PPIPTYP= 0
##$PPMPNUM= 2147483647
##$PPRESOL= 1
##$PSCAL= 4
##$PSIGN= 0
##$PYNMP= <proc.py>
##$REVERSE= no
##$SF= 400.020009709279
##$SI= 131072
##$SIGF1= 0
##$SIGF2= 0
##$SINO= 400
##$SIOLD= 131072
##$SPECTYP= <>
##$SREGLST= <1H.CDCl3>
##$SSB= 0
##$STSI= 131072
##$STSR= 0
##$SW_p= 8223.68421052631
##$SYMM= 0
##$S_DEV= 0
##$TDeff= 65536
##$TDoff= 0
##$TI= <>
##$TILT= no
##$TM1= 0
##$TM2= 0
##$TOPLEV= 0
##$USERP1= <user>
##$USERP2= <user>
##$USERP3= <user>
##$USERP4= <user>
##$USERP5= <user>
##$WDW= 1
##$XDIM= 131072
##$YMAX_p= 379320659
##$YMIN_p= -124034
##$CURPLOT= <Network HP LaserJet P1505>
##$CURPRIN= <$Network HP LaserJet P1505>
##$DFORMAT= <normdp>
##$LAYOUT= <+/1D_H.xwp>
##$LFORMAT= <normlp>
##$PFORMAT= <normpl>
##$SURQMSG= 1
$$ End of Bruker specific parameters
$$ ---------------------------------
##NTUPLES= NMR SPECTRUM
##VAR_NAME=  FREQUENCY,     SPECTRUM/REAL,   SPECTRUM/IMAG
##SYMBOL=    X,             R,               I
##VAR_TYPE=  INDEPENDENT,   DEPENDENT,       DEPENDENT
##VAR_FORM=  AFFN,          ASDF,            ASDF
##VAR_DIM=   131072,        131072,          131072
##UNITS=     HZ,            ARBITRARY UNITS, ARBITRARY UNITS
##FACTOR=    0.0627417313425164, 1,          1
##FIRST=     8223.62146879497, -403,         -64040
##LAST=      0,             2106,            -64453
##MIN=       0,             -124034,         0
##MAX=       8223.62146879497, 379320659,    0
$$ Real data points
##PAGE= N=1
##DATA TABLE= (X++(R..R)), XYDATA
$$ [...]
65297 147097 149800 153313 157523 161454 164109 165498 166431 167414 168202 168430 168183 167726 167095 166321 165808 166018 166771
65280 166771 167282 167051 166408 165940 165596 164828 163550 162444 162030 161828 160879 158940 156670 154652 152778 150827
65264 150827 149147 148260 148019 147644 146676 145499 144771 144607 144527 144080 143210 142036 140545 138701 136797 135378 134687
65247 134687 134302 133557 132318 131091 130317 129833 129217 128491 128164 128597 129581 130608 131409 132126 133032 134150 135141
65230 135141 135599 135524 135455 135945 136921 137706 137710 136913 135629 134093 132493 131165 130411 130172 130207 130567 131504 132852 133933
65211 133933 134349 134496 134909 135362 135203 134487 134137 134778 135887 136445 136087 135278 134621 134398 134586 134924 135032 134842
65193 134842 134822 135414 136290 136664 136417 136410 137420 139097 140376 140774 140946 142011 144511 148033 151654 154681 157018
65176 157018 158895 160466 161800 163139 164790 166713 168513 169991 171422 173119 175023 176989 179259 182286
65162 182286 186127 190294 194210 197631 200713 203933 207907 212997 219030 225597 232651 240645 250094 261248
65148 261248 274324 289818 308394 330464 355923 384199 414457 445774 477232 507964 537346
65137 537346 565296 592334 619019 645133 669485 690595 707592 720432 729382 734481 735488 732223
65125 732223 724850 713872 699900 683441 664711 643491 619262 591743 561484 529859 498300 467549
65113 467549 437614 408329 379905 353085 328953 308417 291564 277432 264644 252393 240839
65102 240839 230625 222178 215417 209860 204856 199920 195067 190765 187420 184888 182652 180420 178406 176931
65088 176931 175982 175325 174978 175231 176081 176879 176875 176086 175292 175084 175153 174764 173680 172344 171257 170471 169736 168877 167962
65069 167962 167251 167047 167437 168148 168844 169531 170438 171439 171965 171724 171216 171230 171990 173170 174578 176261 177863
65052 177863 178467 177537 175714 174186 173385 172764 171867 171020 170727 170786 170497 169578 168424 167425 166454 165195 163694
65035 163694 162298 161206 160324 159466 158505 157258 155503 153239 150855 148864 147445 146310 145029 143462 141875
65020 141875 140709 140258 140434 140783 140831 140587 140628 141523 143182 145015 146668 148311 150132 152002 153826 155873
65004 155873 158346 160894 162977 164541 165890 166998 167523 167539 167714 168563 169907 171285 172553 173856 175257
64989 175257 176609 177622 178029 177945 178082 179239 181413 183771 185519 186432 186453 185420 183460 181143 178827 176336
64973 176336 173630 171245 169538 168074 166366 164756 163719 162658 160456 157149 154121 152466 151926 151665 151322
64958 151322 150951 150584 150267 150117 150005 149586 148894 148461 148549 148683 148337 147690 147255 147042 146607 145885 145498 146137 147794
64939 147794 149672 150826 150928 150471 150165 150161 150071 149647 149163 149083 149618 150661 151873 152742 152856 152224 151161 149873
64921 149873 148536 147687 147951 149169 150272 150435 150020 150124 151432 153743 156312 158359 159547 160352 161800 164594
64905 164594 168611 173306 178288 183372 188510 193955 200061 206549 212330 216531 219416 221859 224188 226068
64891 226068 227322 228233 229074 229797 230225 230229 229701 228638 227248 225784 224341 222923 221479 219675 217038 213723
64875 213723 210752 209000 208179 207345 206137 204900 203782 202473 200864 199224 197622 195815 193896 192428 191611
64860 191611 190790 189141 186508 183339 180106 177072 174334 171852 169565 167559 165992 164814 163808 162923 162246
64845 162246 161671 160981 160281 159938 160035 160239 160296 160241 160074 159740 159544 159981 160884 161307 160680 159635 159252 159870 161076
64826 161076 162463 163820 164882 165541 166264 167768 170237 173278 176687 180828 186194 192848 200448 208573 216961
64811 216961 225532 234277 243084 251716 259981 267697 274416 279430 282320 283281 282639 280258 275836 269630 262451
64796 262451 254947 247353 240004 233555 228353 223944 219550 214922 210441 206487 203076 200131 197771 196130
64782 196130 195138 194681 194849 195724 197036 198447 200243 203299 208045 213800 219550 225141 231249 238304 246013
64767 246013 253883 261619 268878 275270 280854 286053 290771 294159 295742 296328 297188 298561 299614 299647 298723
64752 298723 297152 295031 292471 289793 287192 284487 281300 277291 272195 265953 258971 251956 245325 238964
64738 238964 232697 226787 221785 217927 214865 212008 209093 206402 204383 203095 202138 201139 200136 199353 198798
64723 198798 198296 197823 197589 197798 198544 199876 201791 204129 206586 208842 210670 211980 212788 213025 212456 211025
64707 211025 209192 207512 205789 203253 199793 196385 193854 191799 189443 187010 185412 184823 184535 184095 183642
64692 183642 183125 182187 181134 181098 182757 185544 188494 191216 193638 195594 197276 199566 203228 208154 213961
64677 213961 220872 229320 239001 249054 258994 268808 278291 286953 294552 301076 306137 308934 308986 306504
64663 306504 302008 296021 289161 282043 274867 267458 259842 252507 245944 240236 235221 230855 227277 224724
64649 224724 223423 223393 224358 226119 228968 233406 239393 246288 253685 261960 271732 283051 295384 308175
64635 308175 321120 334015 346650 358862 370400 380611 388506 393350 395207 394727 392374 388039 381593
64622 381593 373645 365365 357491 349837 341956 333933 326206 318877 311677 304538 297775 291686 286311 281627
64608 281627 277606 273971 270195 265913 261148 256070 250758 245227 239440 233242 226613 220105 214687 210869
64594 210869 208196 205774 203140 200432 197987 196072 194918 194663 195170 196074 197099 198259 199756 201692 203924
64579 203924 206171 208287 210356 212452 214415 215964 217006 217658 218035 218169 218084 217734 216947 215663 214168 212753
64563 212753 211152 208734 205351 201638 198340 195639 193337 191358 189808 188758 188165 187835 187387 186534 185543
64548 185543 185072 185309 185616 185354 184673 184137 183874 183595 183209 182931 182917 183274 184272 185981 187738 188593 188438 188150
64530 188150 188476 189243 189914 190402 190944 191511 191874 192184 193018 194748 197046 199129 200396 200822 200862 201075 201811 203140
64512 203140 204954 207132 209684 212804 216671 221155 225870 230601 235609 241452 248622 257397 267708 278871
64498 278871 289668 298959 306173 311038 313201 312564 309744 305651 300657 294678 288021 281476 275416 269439
64484 269439 263243 257317 252320 248169 244255 240336 236657 233267 229721 225648 221339 217568 214876 213069
64470 213069 211434 209502 207552 206245 205830 206000 206547 207707 209631 211850 213710 215155 216667 218429 219914
64455 219914 220440 219982 219314 219382 220518 222203 223591 224286 224583 225059 226108 227832 230052 232367 234477 236525
64439 236525 238838 241334 243706 246370 250586 257115 265254 273803 282618 292481 303724 315985 329434
64426 329434 345333 364951 388573 416099 448176 486170 531158 583264 641774 705445 772727
64415 772727 841950 911517 979969 1046084 1108845 1167020 1218652 1261363 1293454 1314528 1324926
64404 1324926 1324936 1314889 1295587 1267991 1232477 1188940 1137728 1080123 1017833 952439 885531 818929
64392 818929 754331 692835 635138 582076 534578 492996 456808 425200 397792 374616 355527
64381 355527 339968 327296 317059 308798 301803 295306 288882 282544 276464 270748 265393 260350 255648
64368 255648 251496 248074 245121 241974 238368 235007 232891 232084 231648 230906 230270 230539 231841 233747 236191
64353 236191 239668 244515 250484 257177 264508 272404 280303 287331 293068 297840 302094 305643 307803 308210
64339 308210 307169 305031 301660 296949 291680 287245 284382 282649 281305 280267 279888 280287 281351 283102 285436
64324 285436 287672 288938 289040 288469 287515 285900 283464 280701 278246 276108 273762 270841 267460 263948 260535
64309 260535 257267 254024 250600 246870 242899 238844 234843 231002 227351 223794 220312 217312 215520 215217
64295 215217 215738 216043 215810 215739 216791 219359 223209 227950 233312 239109 245160 251351 257670 264089 270435
64280 270435 276495 282343 288534 295765 304195 313129 321539 328873 335239 340822 345360 348340 349552 349274
64266 349274 347972 346023 343808 341819 340472 339781 339348 338747 337871 336871 335805 334422 332278 329015 324485
64251 324485 318663 311554 303301 294347 285330 276700 268521 260774 253792 248158 244098 241203 238910 237116
64237 237116 236116 236008 236366 236559 236298 235857 235838 236655 238099 239463 240210 240509 240905 241580 242137 242191 241854 241541
64219 241541 241450 241335 240661 238977 236402 233790 232132 231593 231346 230536 229113 227534 226012 224501 223248 222827
64203 222827 223504 224932 226545 228034 229421 230915 232816 235332 238497 242479 247823 255066 264068 274179
64189 274179 285190 297704 312312 328653 345503 361462 375309 385993 392791 395489 394292 389654
64177 389654 382320 373211 362925 351516 339069 326290 314185 303221 293214 283965 275647 268590
64165 268590 263004 258896 255924 253404 250830 248450 246933 246482 246620 246861 247080 247143 246765 246036 245621 246079 247356
64148 247356 249243 251890 255377 259154 262459 265079 267167 268539 268825 268272 267639 267138 266141 264275 262230
64133 262230 261003 260694 260587 260195 259675 259254 258817 258332 258356 259768 262974 267518 272408 276837 280758 284968
64117 284968 290579 298160 307238 316791 326305 336190 346996 358363 369111 378368 386281 393434 399937
64104 399937 405385 409523 412591 415071 417508 420597 425087 431301 438875 447095 455405 463469 470864 476946
64090 476946 481097 483068 483043 481395 478415 474293 469230 463379 456686 448984 440338 431158 421882 412724 403782
64075 403782 395081 386351 377091 367341 358122 350631 345050 340595 336729 333742 332063 331554 331793 332554 333616
64060 333616 334418 334443 333827 333210 333039 333358 334232 336028 339140 343621 349195 355578 362740 370918 380339 390905
64044 390905 402231 413998 426205 439045 452664 467002 481647 495705 508059 517997 525527 530982
64032 530982 534472 535891 535309 533148 529975 526222 522077 517633 513214 509444 506687 504426 501579 497583
64018 497583 492770 487524 481570 474542 466811 459106 451521 443559 435151 427060 420151 414701 410514 407247
64004 407247 404486 401936 399820 398783 399094 400139 400896 400818 400223 400062 401379 404710 409755 415790 422447 429916
63988 429916 438293 447119 455817 464402 473462 483572 494899 507268 520353 533774 547187 560282
63976 560282 572724 584237 594919 605386 616507 629027 643461 660128 679057 699924 722281
63965 722281 745927 770987 797739 826509 857680 891647 928666 968863 1012547 1060549 1114124
63954 1114124 1174397 1241918 1316908 1399938 1492141 1594715 1708516 1834343 1973280 2126318
63944 2126318 2293716 2475065 2669873 2877566 3096812 3325259 3560112 3798570 4037531
63935 4037531 4273165 4501098 4716823 4915832 5093724 5246576 5371243 5465234 5526523 5553658
63925 5553658 5545893 5503228 5426635 5318483 5182386 5022301 4841848 4644552 4434375 4215613
63915 4215613 3992457 3768780 3547993 3332683 3124559 2925146 2736321 2559815 2396335
63906 2396335 2245593 2107092 1980539 1865649 1762017 1669139 1586191 1511848 1444702 1383839
63896 1383839 1328701 1278615 1232904 1191208 1153000 1116870 1081135 1045424 1010869 978391 947442
63885 947442 917001 887222 859359 834306 811907 791636 773348 757246 743563 732407 723672 716962
63873 716962 711777 707785 704790 702566 701077 700790 702335 705728 710206 715008 720114 726033 733021 740727
63859 740727 748508 755827 762367 767974 772601 776254 778919 780596 781419 781592 781059 779306 775692 770055 762835
63844 762835 754577 745479 735459 724368 711868 697363 680531 661910 642595 623282 603964 584593
63832 584593 565506 546939 528573 510061 491811 474772 459490 445729 433019 421253 410649
63821 410649 401395 393368 386091 378958 371719 364632 357985 351626 345330 339525 335050 332096 329868 327556
63807 327556 325200 323244 321667 320037 318132 315988 313449 310271 306687 303315 300382 297468 294195 290700
63793 290700 287167 283326 278875 274150 269905 266506 263670 260953 258213 255555 253154 251157 249606 248378
63779 248378 247326 246388 245505 244646 244095 244386 245565 246805 247264 247135 247176 247333 246686 244973 243206 242290 241861
63762 241861 241162 240341 239903 239392 237828 235348 233281 232410 232171 231871 231720 232088 232549 232479 232110 232227 233104 234416
63744 234416 236015 238034 240235 241933 242817 243379 244310 245804 247700 250004 252927 256455 260152 263475 266212
63729 266212 268496 270445 271988 273164 274397 276146 278333 280476 282420 284536 286956 289086 290240 290501
63715 290501 290611 291129 292011 292798 292899 291864 289763 287243 284890 282733 280637 278905 278005 277876 278098 278683
63699 278683 280066 282296 284846 287302 289654 291765 293225 294048 294919 296328 297938 299192 300085 300852 301359
63684 301359 301389 301233 301325 301507 301279 300609 299839 298894 297376 295547 294443 294651 295559 296285 296838 297784 299093 300004
63666 300004 299985 299274 298411 297697 297250 297145 297144 296604 295052 292755 290479 288705 287353 286140 284796 282870 279788
63649 279788 275499 270844 266987 264575 263643 264044 265510 267440 269154 270495 271788 273186 274511 275843 277701
63634 277701 280339 283261 285847 288128 290569 293405 296671 300638 305639 311514 317754 324194 331170 338995
63620 338995 347688 357258 367781 379188 391387 404718 419791 436738 455043 474336 494939 517352
63608 517352 541506 566759 592213 616705 638874 657782 673381 686020 695613 701610 703676 702060
63596 702060 697454 690918 683840 677403 671834 666379 660084 652359 642765 630753 615959 598629 579508
63583 579508 559394 539012 519205 500894 484678 470559 458132 447007 437083 428585 421966 417668
63571 417668 415746 415690 416829 418940 422270 426818 431939 436926 441793 447006 452615 458195 463726 469914 477302
63556 477302 485641 494604 504706 516934 531706 548791 568106 589880 614007 639912 667230 695923
63544 695923 725253 753099 776833 794771 806542 812420 812936 809116 802506 794603 786316 778011 769872
63531 769872 762017 754307 746191 736837 725435 711424 694513 674676 652281 628184 603469 578942
63519 578942 554944 531654 509415 488678 469746 452654 437236 423239 410506 399159 389514 381714
63507 381714 375528 370544 366444 362971 359750 356361 352628 348748 345100 341911 339069 336326 333772 332025
63493 332025 331687 332575 333745 334447 334767 335140 335521 335456 334854 334264 334296 335080 336379 337974 339737 341517 343194
63476 343194 344774 346312 347703 348644 348823 348159 346865 345229 343298 340861 337795 334368 331061 328162 325659
63461 325659 323506 321827 320817 320582 321097 322262 323978 326200 328843 331596 334020 336123 338693 342704 348279
63446 348279 354530 360525 366197 372160 378892 386385 394492 403320 413236 424592 437546 452122 468383
63433 468383 486416 505958 526073 545397 562853 578122 591554 603856 615828 628049 640633
63422 640633 653498 667008 682070 699447 719235 741219 765307 791131 817429 842394 864627
63411 864627 883329 897634 906491 909604 908121 903932 898395 891906 884460 876140 866958 856516 844084
63398 844084 829150 811853 792761 772129 749552 724677 698206 671709 646268 621679 597386
63387 597386 573796 552137 533133 516424 501439 488323 477673 469683 463890 459714 456985 456009 457286
63374 457286 461094 467140 474644 482912 491793 501483 511981 523020 534477 546548 559362 572710 586415
63361 586415 600890 617071 635763 657188 681162 707389 735356 764006 791800 817218 839186
63350 839186 857010 870105 878051 881054 880213 877041 872543 866784 859444 850658 841034 830805 819285
63337 819285 805460 789030 770561 750620 729169 706008 681570 656924 633073 610576 589928
63326 589928 571930 557296 545914 536859 529334 523516 520151 519218 519145 517626 513246 506164 497265 487037
63312 487037 475557 463304 451337 440462 430590 421336 413017 406571 402372 399639 397330 395311 394148
63299 394148 393877 393593 392509 390911 389574 388492 386756 383706 379664 375353 371010 366395 361360 356068 350784
63284 350784 345831 341668 338735 337096 336342 335819 334918 333374 331473 329814 328655 327696 326693 325992 326062 326732
63268 326732 327422 327990 328780 329862 330947 332244 334633 338559 343269 347680 351596 355619 360171 365196 370554
63253 370554 376114 381536 386536 391373 396637 402620 409324 417043 426329 437333 449706 463322 478551
63240 478551 495635 514215 533884 554873 577864 603330 631278 661413 693241 726194 759924
63229 759924 794396 829480 864642 899335 933605 968034 1003085 1038675 1074428 1110145 1145999
63218 1145999 1182296 1219075 1255895 1292034 1326823 1359575 1389166 1413935 1432168 1442643 1444717
63207 1444717 1438162 1423143 1400287 1370584 1335168 1295126 1251416 1205025 1157380 1110473 1066199
63196 1066199 1025443 988091 953921 923068 895603 871284 850103 832562 818917 808627 801141
63185 801141 796873 796643 800268 806491 814311 823667 834659 846820 859554 872716 886354 900272 914304
63172 914304 928663 943514 958384 972425 985162 996574 1006480 1014240 1019107 1020559 1018192 1011607 1000623
63159 1000623 985481 966668 944627 919762 892721 864494 836164 808546 782044 756792 732841
63148 732841 710224 688948 669009 650401 633202 617693 604347 593473 584850 577878 572162 567676
63136 567676 564314 561665 559560 558476 558891 560447 562280 564192 566889 570985 576367 582733 590203 598890
63122 598890 608264 617428 625902 633741 640971 647309 652391 656024 658214 659180 659295 658833 657864 656576 655504
63107 655504 655071 654978 654373 652706 650196 647465 644971 642834 640910 638918 636654 634191 631812 629768 628275
63092 628275 627666 628227 629772 631641 633264 634589 635910 637547 639884 643429 648463 654644 661244 667846 674671
63077 674671 682206 690665 699868 709489 719311 729278 739472 750124 761641 774499 789017 805185 822762
63064 822762 841572 861692 883454 907379 934067 963936 997010 1033178 1072789 1116735 1165666
63053 1165666 1219260 1276660 1337593 1402595 1472019 1545217 1621003 1698562 1777502 1857197 1936635
63042 1936635 2015015 2092265 2168897 2245623 2323066 2401554 2481065 2561459 2642577 2723654 2802626
63031 2802626 2876561 2942997 3000426 3047228 3080714 3097838 3096757 3077296 3040098 2985916 2915860
63020 2915860 2831921 2737009 2634476 2527445 2418327 2309041 2201744 2099042 2003185 1915273
63010 1915273 1835660 1764814 1703252 1650873 1607144 1571979 1545703 1527918 1517078 1511496 1510316 1513269
62998 1513269 1520059 1530486 1544662 1562545 1583391 1606048 1629650 1653770 1678203 1702907 1727911
62987 1727911 1752933 1777209 1799869 1820145 1837002 1849014 1855010 1854520 1847249 1832568 1810081 1780332
62975 1780332 1744356 1702763 1655954 1605045 1551848 1497898 1444071 1391059 1339510 1289623 1241321
62964 1241321 1195034 1151744 1112007 1075477 1041622 1010424 981997 955960 931525 907964 884772
62953 884772 861745 839173 817712 797780 779207 761598 744739 728566 713100 698608 685450
62942 685450 673534 662293 651451 641417 632607 624765 617439 610753 605184 600712 596753 592928 589437
62929 589437 586626 584543 583018 581864 580946 580161 579391 578364 576749 574586 572394 570497 568404 565343 561347
62914 561347 557285 553738 550380 546736 543029 539800 536980 533871 530012 525641 521294 517380 514230 512038
62900 512038 510476 508729 506378 504087 502914 502938 503123 502662 501911 501641 501850 501894 501528 501189 501292 501810 502612 503670
62882 503670 504808 505717 506387 507042 507527 507297 506328 505401 505045 504649 503231 500736 497983 495567 493455 491538
62866 491538 489884 488432 487040 485904 485425 485542 485765 485950 486447 487293 487893 487945 488102 489169 490979 492605 493473
62849 493473 493742 493772 493782 494035 494687 495272 494864 493121 490896 489448 489166 489294 488839 487485 485711 484274 483646
62832 483646 483714 483909 483770 483462 483603 484466 485572 486343 487054 488778 492252 496999 501709 505359 507889 510057
62816 510057 512914 517249 523152 529965 536808 543290 549669 556365 563452 570619 577529 584187 591057 598813
62802 598813 607849 618017 628883 640233 652260 665356 679885 696126 714233 734237 756243 780641
62790 780641 808059 839116 874413 914598 960169 1011180 1067527 1129646 1198661 1275716 1361457
62779 1361457 1456274 1560545 1674177 1796069 1924479 2057806 2194510 2332224 2467377 2595901
62769 2595901 2714128 2818943 2907511 2977267 3026122 3052588 3055900 3036343 2995382 2935209 2858018
62758 2858018 2765768 2660576 2545173 2422866 2297087 2170830 2046298 1924926 1807763 1695821
62748 1695821 1590039 1490989 1398810 1313521 1235248 1164063 1099727 1041769 989723 943065 901000
62737 901000 862617 827466 795779 767916 743680 722276 702832 684770 667875 652354 638832
62726 638832 627908 619526 612945 607410 602635 598668 595655 593984 594246 596607 600389 604672 609255 614696
62712 614696 621508 629816 639825 652099 667124 684947 705406 728422 753881 781712 812448 847351
62700 847351 887434 932500 981545 1034008 1090112 1150038 1213299 1279006 1346161 1413373 1478699
62689 1478699 1540186 1596377 1645985 1687298 1718315 1737511 1744328 1738972 1722032 1694281 1656631 1610156
62677 1610156 1556236 1496630 1433262 1367828 1301644 1235828 1171495 1109722 1051348 996876 946509
62666 946509 900208 857689 818470 782189 748927 719056 692589 668900 647345 627927 610926
62655 610926 595954 581977 568390 555569 544117 534046 524992 516680 508746 500616 492243 484594 478649
62642 478649 474105 469910 466007 463597 463403 464493 465324 465339 465003 464743 464463 463877 462756 460953 458582 456107
62626 456107 453950 452092 450350 448916 448293 448812 450477 453180 456763 460918 465285 469659 473957 478184 482648
62611 482648 488011 494723 502537 510947 519994 530270 542192 555791 571219 589032 609814 633945
62599 633945 661847 693990 730418 770693 814679 863027 916450 974752 1036947 1102065 1169218
62588 1169218 1236870 1302708 1364518 1420805 1470223 1510856 1540659 1558572 1564687 1559291 1542307 1514006
62576 1514006 1475899 1430419 1379777 1325457 1268619 1210451 1151954 1093879 1037140 982973 932330
62565 932330 885326 841600 801089 764134 730939 701279 674765 651115 630165 611865 596287
62554 596287 583381 572609 563025 553849 544876 536358 528677 522164 516998 513064 509935 507098 504247 501406
62540 501406 498856 496849 495304 493820 492105 490344 489015 488375 488271 488420 488764 489599 491456 494762 499435
62525 499435 504965 511143 518607 528316 540477 554426 569631 586528 606146 629168 655520 684733
62513 684733 716466 750725 787644 827044 868205 910125 951912 992713 1031406 1066735 1097814
62502 1097814 1124197 1145400 1160746 1169857 1173090 1171369 1165860 1157926 1149025 1140373 1132938 1127839 1126386
62489 1126386 1129460 1137196 1149601 1167198 1190732 1220510 1256360 1297881 1344200 1393624 1443941 1492928
62477 1492928 1538236 1577258 1607967 1629885 1643483 1648475 1643310 1626533 1598067 1558988 1510716 1454919
62465 1454919 1393631 1328797 1261826 1193931 1126692 1061822 1000535 943463 891013 843435 800759
62454 800759 763099 730861 704219 682516 664709 650382 639754 632632 627995 624962 623681 624782
62442 624782 628229 633188 638963 645664 653876 663832 674890 685576 694237 699976 703105 704524 704600 702739
62428 702739 698069 690347 680144 668334 655667 642790 630360 618865 608245 597852 586991 575551
62416 575551 564061 553155 543096 533852 525371 517612 510463 503896 498130 493328 489172 485045 480733
62403 480733 476688 473431 471012 469242 468189 468048 468703 469846 471501 474009 477351 480858 483832 486261 488702
62388 488702 491651 495262 499455 503933 508159 511748 515041 518979 524210 530491 537186 544093 551426 559108
62374 559108 566526 573175 579237 585379 592230 600182 609355 619360 629334 638830 648744 660898 676502
62361 676502 695398 717011 741608 770105 802916 839590 879570 922670 968445 1015491 1061822
62350 1061822 1105828 1146498 1182783 1213281 1236867 1253441 1263761 1268571 1268204 1262982 1253594 1240745
62338 1240745 1224610 1205020 1182197 1157028 1130545 1103491 1076511 1050500 1026419 1004805 985608
62327 985608 968424 952708 937857 923352 908870 894239 879402 864472 849619 834685 819078
62316 819078 802376 784965 767799 751520 736087 721256 707077 693843 681789 670992 661397 652813
62304 652813 645037 638040 631869 626361 621192 616294 611933 608270 605090 602186 599786 598230 597354 596521 595347
62289 595347 594140 593505 593680 594398 595329 596457 597967 599906 602114 604498 607230 610559 614515 618879 623352
62274 623352 627673 631753 635886 640752 646938 654401 662550 670827 679078 687490 696561 707136 720214 736506
62260 736506 756342 779935 807457 838870 874076 913339 957138 1005311 1056569 1109064 1161114
62249 1161114 1211120 1257236 1297762 1331867 1359540 1380821 1395406 1402980 1403531 1397182 1383979 1363952
62237 1363952 1337220 1303978 1264703 1220581 1173617 1126069 1079647 1035207 993031 953296 916266
62226 916266 882165 851040 822846 797692 775824 757267 741507 727748 715534 705050 696692 690355
62214 690355 685190 680210 675099 670376 666715 664242 662639 661706 661555 662227 663482 665137 667467 671113 676583
62199 676583 683772 691842 699613 706389 712439 718486 724734 730701 735995 740813 745494 750080 754621 759585
62185 759585 765504 772397 779887 787675 795467 802575 808118 811731 813793 814908 815409 815471 815523 816477 819530 825622
62169 825622 834901 846857 861133 878096 898512 922849 950969 982125 1014923 1047612 1078910 1108376
62157 1108376 1135608 1159336 1177900 1190561 1197782 1200247 1198238 1191995 1182034 1168790 1152351 1132825
62145 1132825 1110633 1086328 1060497 1034056 1008235 983962 961510 940910 922426 906464 893291
62134 893291 882962 875136 868808 862638 855868 848618 841184 833530 825735 818285 811375 804422 796987 789817
62120 789817 784182 780306 777291 774579 772618 771821 771671 771298 770409 769098 767149 764161 760119 755273 749565
62105 749565 742729 735003 727188 719862 712933 706143 699620 693661 688301 683501 679537 676795 675237 674445
62091 674445 674216 674720 675958 677390 678318 678508 678340 678476 679421 681231 683559 686197 689543 694276 700470 707449
62075 707449 714672 722366 730963 740314 749967 760027 771216 784121 798764 814866 832231 850945
62063 850945 871515 894574 919985 946273 971468 994472 1015184 1033432 1048471 1059672 1067022 1070626
62051 1070626 1070226 1065570 1056844 1044421 1028482 1009129 986593 961090 932890 902758 871956 841418
62039 841418 811230 781194 751576 722912 695497 669541 645628 624458 606225 590568 576997
62028 576997 565086 554446 544952 536823 530098 524159 518177 511874 505422 498781 491716 484414 477479 471166
62014 471166 465149 459264 454027 450021 447062 444339 441285 438103 435462 433883 433433 433851 434783 435856 436724
61999 436724 437375 438361 440342 443175 445818 447426 448239 449015 449876 450223 449534 447664 444473 439902 434511 429284
61983 429284 424543 419593 413786 407583 402154 398192 395474 393399 391578 389962 388683 387781 387010 385982 384610
61968 384610 383302 382575 382566 382964 383313 383335 383108 382954 383016 383013 382708 382506 383096 384362 385210 384854 383846 383334 383644 384211
61948 384211 384774 385931 388336 391879 395965 400290 405082 410737 417456 425133 433432 441983 450564 459078
61934 459078 467397 475390 483152 490993 499126 507454 515705 523561 530546 535968 539268 540374 539652 537563
61920 537563 534562 531235 528205 525763 523676 521511 519157 517061 516042 516873 519909 524981 531643 539564
61906 539564 548605 558503 568600 578025 586125 592673 597678 601180 603298 604339 604704 604617 604080 603166 602354
61891 602354 602384 603638 605648 607424 608281 608291 607931 607506 606930 605777 603317 598751 591812 583141 573800 564386
61875 564386 554821 544877 534605 524281 514377 505612 498637 493453 489434 486029 483122 480630 478334 476459
61861 476459 475939 477575 481150 485859 491366 497905 505544 514085 523718 535054 548242 562494 576893
61848 576893 591299 606164 621609 637030 651505 664371 675407 684638 691960 696999 699409 699336 697478
61835 697478 694689 691584 688432 685218 681871 678690 676543 676395 678547 682579 687990 694617 702280 710370
61821 710370 717966 724225 728597 730879 731173 729638 726251 721106 714877 708572 702609 696540 689904 682893
61807 682893 675873 668694 661013 653029 645238 637527 629094 619416 608855 598167 587814 577957 568804
61794 568804 560687 553864 548343 543795 539637 535400 531148 527359 524364 522032 520071 518382 516966 515660
61780 515660 514196 512457 510581 508871 507681 507263 507551 508141 508652 509135 510076 511991 515056 519036 523523 528367
61764 528367 533961 541078 550189 560960 572501 584142 595820 607665 619376 630151 639148 645915
61752 645915 650352 652422 651958 648775 643003 635283 626461 616963 606548 594872 582298 569966 559078
61739 559078 550202 543140 537171 531375 525159 518728 512862 508049 504073 500581 497635 495343 493314 491150
61725 491150 489302 488735 489614 490923 491606 491544 491165 490656 489952 489117 488225 487133 485777 484451 483366 482161 480299
61708 480299 477814 475193 472657 470062 467454 465153 463149 460913 457996 454519 450918 447506 444414 441628
61694 441628 438916 435956 432651 429116 425308 421078 416735 413113 410745 409198 407555 405347 402744 400071
61680 400071 397535 395316 393566 392267 391268 390421 389520 388306 386809 385558 385104 385362 385730 385886 386117 386822
61664 386822 388016 389511 391237 393232 395449 397858 400571 403663 406953 410120 413056 415955 419019 422136
61650 422136 424906 426949 428210 428953 429479 429924 430340 430838 431519 432388 433545 435344 438070 441405 444510 446802
61634 446802 448470 450145 452223 454603 456867 458545 459313 459070 457743 455047 450728 445118 439135 433514 428305
61619 428305 423319 418692 414670 411153 407921 405105 402876 400855 398445 395789 393710 392508 391366 389255
61605 389255 386008 382247 378629 375451 372631 369697 366079 361771 357558 354308 352238 351044 350316 349492 347840
61590 347840 345144 342242 340252 339298 338527 337421 336497 336522 337493 338654 339214 338838 337696 336288 335095 334209
61574 334209 333372 332414 331536 331083 331162 331495 331620 331298 330860 330938 331699 332560 333089 333883 335942 339211 342473 344869
61556 344869 346815 349049 351476 353592 355504 357711 360035 361579 361864 361390 360863 360370 359616 358588 357630 357025
61540 357025 356809 356907 357247 357735 358324 359145 360444 362294 364411 366328 367757 368728 369352 369585 369318 368588 367469
61523 367469 365830 363501 360755 358298 356612 355551 354751 354196 354101 354480 355159 356086 357233 358302 358946 359328
61507 359328 360037 361327 362800 364050 365318 367147 369598 372157 374413 376540 379085 382521 387038 392441
61493 392441 397971 402444 405010 405955 406515 407746 409687 411755 413649 415577 417752 420088 422436 424759 426964
61478 426964 428896 430709 432866 435459 437705 438467 437275 434672 431692 429153 427277 425721 423958 421830
61464 421830 419671 417812 416113 414205 412005 409754 407674 405886 404570 403830 403486 403277 403259 403687 404540 405485
61448 405485 406311 407076 407843 408632 409669 411272 413374 415535 417577 419828 422540 425424 427944 429779 430796
61433 430796 430982 430690 430562 430837 431068 430941 430998 432005 433800 435423 436349 436995 437963 439364 441052 442989 445078
61416 445078 447012 448567 449712 450293 450026 449057 448088 447493 446708 445114 443270 442555 443517 445211 446388 446780
61400 446780 446887 447025 447125 447279 447910 449347 451566 454394 457586 460666 463065 464753 466493 469097 472392
61385 472392 475244 476806 477566 478881 481456 484548 486826 487804 488114 488507 489070 489539 489963 490643 491620 492597 493285
61368 493285 493500 492990 491551 489405 487079 484777 482149 478863 475206 471937 469677 468580 468389 468623 468832
61353 468832 468841 468748 468702 468875 469662 471545 474511 477819 480614 482637 484166 485546 487084 489161 491968 495112
61337 495112 497855 499804 501119 502083 502850 503645 504788 506285 507717 508791 509850 511540 514037 516822 519262
61322 519262 521309 523569 526731 530958 535892 541154 546737 552866 559643 567037 575083 583889 593510 604006
61308 604006 615562 628292 641945 656037 670242 684370 697975 710322 720818 729212 735343 739055
61296 739055 740461 739931 737630 733401 727326 720017 712019 703193 693116 681862 669997 657985 646101
61283 646101 634808 624656 615679 607382 599487 592297 586136 580785 575780 570945 566361 562079 558236 555269
61269 555269 553517 552640 551853 550811 549973 549995 551081 553116 556081 560000 564635 569557 574505 579437 584209
61254 584209 588466 591923 594562 596474 597701 598307 598452 598307 598074 598173 599097 600785 602337 602772 602084 601134 600483
61237 600483 599780 598583 597358 597122 598197 599861 601411 603126 605896 610193 615773 622315 629920 638865 649149
61222 649149 660427 672214 684013 695467 706644 718005 729733 741133 751087 759246 766438 773647
61210 773647 780811 786957 791410 794513 797139 799929 803219 807399 812864 819514 826655 833638 840533 847948
61196 847948 856210 864974 873740 882484 891493 900607 908905 915204 918770 919606 918334 915773 912309 907526
61182 907526 900718 891849 881718 871024 859703 847548 835072 823065 811428 799144 785645 771651
61170 771651 758302 745826 733502 720761 707866 695489 683959 673077 662515 652225 642438 633392
61158 633392 625189 618002 612263 608405 606390 605636 605483 605576 605745 605756 605391 604685 603947 603487 603362 603320 602917 601835
61140 601835 600172 598417 597048 596243 596064 596801 598890 602466 607188 612641 618873 626419 635817 647205 660380
61125 660380 675090 691121 708247 726326 745545 766399 789280 814147 840713 868822 898434
61114 898434 929240 960530 991535 1021818 1051252 1079684 1106743 1132055 1155589 1177645 1198339
61103 1198339 1217250 1233865 1248415 1261914 1275080 1287405 1297570 1304744 1309326 1312573 1315833 1320009
61091 1320009 1325376 1331788 1339213 1348052 1358753 1371188 1384671 1398553 1412454 1425901 1438133 1448454
61079 1448454 1456540 1462201 1465031 1464464 1460053 1451594 1439135 1422983 1403643 1381610 1357287 1331077 1303435
61066 1303435 1274864 1245935 1217220 1188968 1160974 1133072 1105708 1079687 1055413 1032830 1012162
61055 1012162 994080 978874 965959 954669 945217 938337 934201 932201 931724 932612 934840 938211 942697
61042 942697 948744 956900 967064 978305 989498 1000167 1010663 1021588 1033193 1045410 1058271 1071981
61030 1071981 1086692 1102468 1119493 1137957 1157709 1178345 1199796 1222504 1246885 1273040 1301198
61019 1301198 1332086 1366548 1405149 1448478 1497471 1552991 1615429 1685369 1764641 1856279 1963592
61008 1963592 2089945 2239618 2418540 2634091 2894786 3210581 3593345 4056555 4613806
60999 4613806 5276170 6048640 6926259 7890752 8908386 9930653 10900439 11764628 12488719
60990 12488719 13065114 13509859 13850570 14112981 14311147 14441964 14484088 14403170 14164050 13745420
60980 13745420 13149258 12400527 11539214 10610508 9657289 8715878 7814304 6972259 6201959
60971 6201959 5509244 4894849 4356060 3888277 3485689 3141245 2847054 2595508 2380130
60962 2380130 2195423 2036426 1898836 1779383 1675724 1585931 1508107 1440335 1380819 1328177
60952 1328177 1281624 1240582 1204008 1170477 1139106 1109983 1083353 1058735 1035226 1012309 989872
60941 989872 967719 945684 924074 903333 883299 863375 843454 824020 805290 786948 769048
60930 769048 752476 738005 725287 713302 701555 690326 679972 670574 662265 655286 649465 644020
60918 644020 638276 632382 627010 622397 618078 613586 609055 604825 600752 596401 591876 587942 585056 582644
60904 582644 579659 575667 571140 566794 562939 559388 555712 551562 546884 541834 536468 530677 524533 518435
60890 518435 512736 507458 502555 498241 494742 491938 489565 487564 485900 484203 481963 478976 475379 471398
60876 471398 467434 464189 462252 461622 461907 462815 464098 465378 466583 468296 471019 474268 477197 480014 483862
60861 483862 489142 494829 499750 503759 507264 510390 513203 516080 519146 521748 523168 523587 523716 523705 523050
60846 523050 521487 519366 517165 515094 513219 511472 509417 506354 501882 496211 489877 483283 476564 469727
60832 469727 462821 455995 449370 442939 436705 430920 425957 421851 418208 414632 411103 407839 405067 402977
60818 402977 401542 400180 397936 394388 390227 386634 384240 382897 382231 382000 381977 381916 381795 381891 382482 383487 384413
60801 384413 384705 384291 383789 384007 385199 386979 388976 391259 393990 396949 399637 401681 403012 403839 404564 405436
60785 405436 406206 406436 406221 406164 406391 406101 404539 402037 399605 397699 395948 393893 391486 388847 386005 383008
60769 383008 380031 377371 375449 374632 374780 375174 375212 375076 375343 376114 376902 377306 377382 377312 377017 376179 374570 372484
60751 372484 370884 370754 372014 373471 374218 374731 376040 378268 380630 382571 384008 384611 383816 381745 379305
60736 379305 377111 375002 372857 371147 370269 369952 369775 369796 370226 370939 371730 372695 374003 375664 377854 380924
60720 380924 384632 387890 389892 391094 392475 394196 395754 397154 399004 401425 403660 404973 405248 404535 402662
60705 402662 399696 396312 393231 390579 388135 385909 384044 382298 380112 377278 374257 371732 369943 368549
60691 368549 367091 365564 364500 364428 365272 366373 367156 367665 368477 370193 373023 376673 380531 384076 387240 390396
60675 390396 393970 398165 402953 408057 412830 416390 418124 418021 416473 413956 411032 408407 406590 405484
60661 405484 404534 403350 402036 400989 400539 400705 401086 401025 400179 398997 398440 399213 401405 404722 408599 412057
60645 412057 414019 414160 413138 411761 410209 408381 406576 405218 404065 402322 399725 397102 395665 395921 397280
60630 397280 398549 398839 398278 397830 398239 399295 400386 401488 403006 404678 405386 404379 402217 400223 399330 399711
60614 399711 401032 402691 404095 405143 406224 407470 408296 408044 406823 405302 403890 402599 401531 400946 400799
60599 400799 400678 400309 399744 399016 398031 396986 396565 397343 399077 400844 401936 402542 403456 405140 407179 408738
60583 408738 409397 409342 408893 408303 408054 408723 410275 411934 413227 414730 417206 420398 423448 426403 430385 436045
60567 436045 442590 448748 454154 459270 464334 468946 472639 475344 477233 478382 478661 477891 476091 473715 471589
60552 471589 470461 470489 471186 471910 472427 473060 474284 476213 478552 481057 483922 487599 492332 497993 504371 511497
60536 511497 519711 529368 540376 551997 563308 573916 583954 593291 601148 606795 610298 612145 612415
60523 612415 610841 607614 603564 599431 595298 590833 585768 580174 574563 569772 566355 564042 562099 560179
60509 560179 558532 557450 557000 557368 558906 561717 565625 570770 577809 587282 599162 613163 629066 646497
60495 646497 664860 683887 703843 724740 745582 764922 782070 797415 811637 824939 836972
60484 836972 847189 855260 861298 865568 867770 866788 861439 851423 837297 819677 798793 774929 748993
60471 748993 722475 696809 672716 650097 628593 608253 589575 572915 558121 544813 532738
60460 532738 521682 511383 501810 493339 486227 480011 473796 467175 460582 454685 449695 445392 441593 438348
60446 438348 435736 433603 431651 429729 427954 426471 425237 424166 423370 423034 423079 423168 423031 422560 421656 420383
60430 420383 419313 419235 420306 421830 423155 424403 425968 427626 428672 428850 428680 428823 429462 430380 431451 432882
60414 432882 435012 437863 440909 443465 445373 447126 449242 451712 454159 456147 457205 457017 456061 455678 456936
60399 456936 459520 462202 464212 465635 466694 467438 468224 469749 472247 475161 477965 480822 484011 487119 489397
60384 489397 490771 491939 493444 495124 496635 498139 500110 502556 504798 506150 506695 507173 508149 509508 510873
60369 510873 512285 514172 516699 519410 521595 522874 523427 523846 524880 527095 530608 535117 540275 546001 552482
60354 552482 559950 568462 577764 587286 596412 604844 612587 619484 624882 627974 628473 626794 623510 618812
60340 618812 612720 605744 598940 593056 587791 582206 575918 569553 563958 559268 554940 550470 545730 540773
60326 540773 535729 530965 527023 524196 522275 520801 519464 518252 517444 517604 519449 523435 529378 536578 544381
60311 544381 552601 561443 571099 581455 592004 601896 610172 616288 620544 623797 626568 628542 629062 627924
60297 627924 625396 621679 616751 610726 603961 596707 589082 581463 574522 568646 563669 559380 555917 553341
60283 553341 551189 548852 546208 543463 540572 537276 533601 529860 526134 522127 517604 512714 507795 503099
60269 503099 498740 494719 491002 487687 484971 482786 480686 478411 476377 475239 475072 475415 475971 476812 477925
60254 477925 479175 480828 483478 487140 490870 493698 495624 497312 499115 500801 502014 502530 502135 500745 498751
60239 498751 496968 496012 495838 495924 495803 495420 495097 495274 496228 498014 500546 503632 506918 510033 513012 516497
60223 516497 521332 527852 535625 543831 551867 559626 567389 575524 584230 593405 602767 612106 621495 631172
60209 631172 641191 651248 660958 670229 679209 687915 696188 704094 712036 720159 727792 733819 737640 739518
60195 739518 739999 739273 737261 734144 730459 726584 722253 716762 709758 701764 693772 686285 678967 671269 663167
60180 663167 655167 647805 641415 636200 632175 629041 626307 623535 620369 616548 612196 607957 604455 601580
60166 601580 598685 595484 592421 590034 588222 586342 583818 580604 577231 574490 572850 572111 571717 571428 571449
60151 571449 571953 572814 573866 575114 576552 578139 580107 582983 586993 591658 596235 600461 604750 609831 616299
60136 616299 624194 632802 641061 648459 655360 662302 669281 675958 682230 688120 693334 697537 701063 704792
60122 704792 709189 713924 718598 723343 728383 733404 737891 741862 745806 749913 753800 757109 759948 762513
60108 762513 764551 765539 765291 764132 762475 760410 757798 754591 751036 747559 744450 741615 738729 735708 732846
60093 732846 730336 727814 724786 721406 718413 716154 714103 711530 708249 704363 699663 693802 687004 680190
60079 680190 674353 669952 666739 663796 659926 654487 648011 641750 636540 632265 628242 623747 618196 611420
60065 611420 604037 597222 591797 587635 584100 580863 578128 576180 574906 573761 572194 570213 568525 567990
60051 567990 568877 570775 573117 575673 578572 582106 586482 591575 596907 602131 607417 613043 618614 623072
60037 623072 625686 626786 627390 628285 629528 630602 630934 630327 628967 626970 624131 620251 615418 609582 602221
60022 602221 593102 583256 574377 567075 560406 553360 546110 539414 533459 527869 522423 517199 512336 508128
60008 508128 505025 503015 501270 498945 496176 493802 492271 491285 490471 489874 489820 490615 492360 494786 497377 499942
59992 499942 502912 506784 511494 516697 522367 528574 534882 540520 545145 548908 551814 553554 553994 553337 551729
59977 551729 549200 546094 543006 540047 536604 532125 526901 521855 517786 514974 513242 512200 511566 511359 511698
59962 511698 512461 513480 515073 517950 522388 527742 532912 537078 539902 541407 541944 542085 542296 542769 543624 544982
59946 544982 546649 547986 548421 548006 547337 546972 547100 547517 547742 547258 545976 544510 543850 544746 547437 551804 557478
59929 557478 563829 570150 576096 581886 587872 593822 598713 601457 601916 601131 600418 600290 600378 600313 600409 601477 604163
59912 604163 608532 614037 619723 624710 628738 632165 635233 637456 638025 636820 634654 632382 630056 627210
59898 627210 623768 620221 616960 613855 610764 608103 606575 606535 607958 610836 615117 620233 625240 629647 633767
59883 633767 638097 642704 647463 652535 658194 664343 670501 676135 680880 684737 688297 692368 696979 701081
59869 701081 703727 705183 706230 706694 705513 702312 697981 693499 688990 684367 680113 676738 673990 671348
59855 671348 669011 667668 667412 667603 667856 668522 669991 672004 674014 675917 678006 680325 682370 683528 683637
59840 683637 683064 682271 681435 680498 679507 678710 678239 677858 677239 676527 676388 677313 678925 680159 680165 678960 677131 675070
59822 675070 672681 669731 666174 662110 657749 653602 650436 648713 648208 648482 649535 651498 653764 655059 654645
59807 654645 653054 651367 650161 649565 649860 651294 653311 654653 654539 653318 651708 649770 647071 643603 639950
59792 639950 636509 633033 629148 624932 620656 616271 611597 606855 602489 598486 594417 590299 586853 584511
59778 584511 582613 580214 577482 575698 575780 577331 579287 581099 582990 585348 588313 591899 596231 601462 607535
59763 607535 614130 620955 628100 636044 645253 655819 667502 679961 692809 705604 718026 730054
59751 730054 741793 753140 763716 773058 780814 786926 791787 796006 799794 802778 804681 805839 806590 806473
59737 806473 804768 801741 798623 796148 793845 791047 787909 784966 782290 779702 777418 775774 774516 773020
59723 773020 771179 769531 768477 767824 767120 766029 764324 762003 759563 757827 757249 757631 758659 760510 763713
59708 763713 768529 774634 781388 788394 795811 804139 813605 823824 834147 844280 854398 864745 875350
59695 875350 886100 896810 907105 916456 924428 930824 935569 938662 940255 940591 939708 937457 933873 929347
59681 929347 924196 918222 911055 902799 894063 885252 876175 866532 856594 847104 838580 830996 824172 818172
59667 818172 813182 809275 806597 805635 806912 810321 815058 820462 826712 834477 843937 854399 864887 874930
59653 874930 884679 894364 903756 912114 918553 922396 923216 920708 914728 905530 893845 880586 866391 851477
59639 851477 835910 820000 804431 789954 776914 765116 754204 744105 734949 726574 718374 709820
59627 709820 701016 692501 684489 676511 667903 658546 648943 639603 630580 621739 613272 605586 598694 592104
59613 592104 585589 579787 575661 573398 572199 571135 569904 568774 568154 568367 569480 571115 572701 574061 575518
59598 575518 577214 578647 579235 579089 578898 579199 580086 581497 583271 584971 586098 586638 587038 587490 587535 586593 584663
59581 584663 582348 580369 579152 578622 578166 576985 574767 571969 569268 566871 564517 562011 559489 557215 555454
59566 555454 554513 554578 555323 555939 555780 554908 553870 553070 552473 551811 550883 549718 548655 548239 548826 550200 551717
59549 551717 552918 553923 555205 557127 559834 563454 568229 574452 582419 592490 605102 620578 638751
59536 638751 658594 678150 695027 707358 714616 717657 717932 716555 713962 710363 706351 702867 700494
59523 700494 698996 697729 696353 694847 692935 689956 685462 679609 672770 665070 656567 647623 638736 630140
59509 630140 621918 614386 607952 602579 597674 592661 587511 582740 579056 576943 576352 576764 577658 578883 580436
59494 580436 582127 583773 585675 588524 592783 598339 604726 611407 617937 624186 630425 636884 643244 648896
59480 648896 653685 657978 662019 665702 669121 672839 677283 682166 686768 690557 693335 695075 695814 695579 694300
59465 694300 692078 689538 687562 686572 686488 687431 689807 693461 697483 701390 705915 711928 719025 725961 732218
59450 732218 738217 744097 749181 752857 755211 756424 756159 753986 750097 745176 739786 734204 728649 723384
59436 723384 718665 714746 711811 709710 707857 705626 702925 700411 699133 699916 702904 707642 713652 720872
59422 720872 729468 739427 750640 763299 777894 794746 813825 835095 858693 884603 912235 940278
59410 940278 966573 988172 1002208 1007485 1005307 998634 990510 983330 978954 978663 982790 990786 1001650
59397 1001650 1013731 1024052 1028629 1024436 1011233 991330 967711 942647 917671 893888 871839 851489
59385 851489 832778 816046 801712 789854 780378 773317 768543 765372 762936 760926 759605 759175 759528 760576
59371 760576 762351 764723 767432 770482 774126 778388 783088 788434 795008 802894 811372 819908 828941 839177
59357 839177 850473 862064 873723 886042 899612 914488 930499 947543 965395 983629 1001934
59346 1001934 1020184 1037923 1054051 1067385 1077519 1084954 1090340 1093647 1094128 1091083 1084678 1075908 1065723
59333 1065723 1054251 1040939 1025458 1008405 991060 974443 958515 942394 925447 908040 891028
59322 891028 874732 858813 843141 828181 814319 801279 788592 776301 764763 753999 743703
59311 743703 733812 724695 716784 710216 704782 700131 696230 693803 694006 697344 703112 710080 717385 724345
59297 724345 729857 732740 732690 730356 726432 721072 714286 706469 698362 690757 684336 679599 676827 676122 677355
59282 677355 680064 683761 688587 695366 704674 716147 729037 743086 758319 774358 790681 807302
59270 807302 824435 841535 857463 871700 884638 896471 906579 914412 920327 925084 928858 931176
59258 931176 931579 930067 927117 923469 919659 915654 911151 906238 901400 896808 892079 886899 881507 876396
59244 876396 871942 868402 865791 863583 860968 857641 853838 849477 843945 837142 830084 823829 818158 811937
59230 811937 804518 796169 787264 777723 767430 756748 746368 736773 727959 719669 711954 705433 700797
59217 700797 698013 696312 695063 694303 694247 694669 695143 695646 696546 698116 700368 703259 706792 710924 715523 720332
59201 720332 724912 728861 732213 735374 738527 741390 743736 745816 747971 750134 752079 753947 756132 758711
59187 758711 761317 763495 764990 765788 766083 766124 765938 765289 764024 762246 760062 757445 754540 751754 749347 747259
59171 747259 745541 744501 744076 743546 742437 741285 740883 741014 740667 739321 737250 734558 730802 725828 720266
59156 720266 714694 708791 701899 694176 686660 680197 674707 669535 664229 658762 653166 647302 641089 634742
59142 634742 628576 622679 617044 611975 607923 604790 601829 598507 595121 592269 590043 588218 586977 586891 588246
59127 588246 590825 594344 598645 603530 608867 614952 622293 630874 640056 649335 658883 669136 680160 691623
59113 691623 703096 714107 724097 732650 739715 745448 749949 753258 755494 756740 756872 755666 753125 749574
59099 749574 745409 740793 735643 729932 723985 718413 713715 709996 707156 705198 704162 703754 703326 702379 700969
59084 700969 699558 698476 697597 696447 694607 692081 689315 686791 684527 682043 678872 675106 671378 668347
59070 668347 666196 664554 662788 660368 657137 653466 650072 647420 645145 642333 638591 634677 631722 629960
59056 629960 628580 626850 624896 623241 622021 621031 620235 619815 619804 620039 620448 621131 622084 622990 623390 623023 622057
59039 622057 621005 620351 620179 620236 620316 620413 620572 620883 621685 623461 626331 629976 634299 639865 647392 656919 667725
59022 667725 678876 689641 699613 708734 717032 724041 728643 729929 728202 724828 721129 717600 714085 710300
59008 710300 706155 701878 697920 694665 692299 691100 691612 694106 697957 701978 705492 708718 712075 715492
58994 715492 718639 721526 724517 727799 731090 733896 735921 737175 737806 738028 738264 739223 741612 745713 751358
58979 751358 758295 766419 775675 785969 797274 809621 822906 836932 851645 867049 882823 898371
58967 898371 913322 927625 941056 953187 964088 974423 984320 992664 998163 1000771 1001297 999854 995566
58954 995566 987854 977237 964695 950926 936452 921753 906872 891331 874959 858546 843318 829900
58942 829900 818103 807552 798194 790155 783381 777567 772439 768044 764717 762699 761853 761779 762088 762512 762922
58927 762922 763383 764007 764579 764525 763511 761936 760577 759856 759637 759516 759071 758142 757260 757555 759738 763337 767391
58910 767391 771684 776722 782741 789512 797194 806480 817608 829895 842612 855772 869605 883791 897721
58897 897721 911203 924394 937338 950013 962653 975504 988368 1000868 1013109 1025684 1039033
58886 1039033 1053156 1067942 1083248 1098437 1112239 1123468 1131824 1137820 1142045 1144801 1146334 1146971 1146872
58873 1146872 1145928 1144123 1141778 1139104 1135764 1131290 1125884 1120340 1115099 1109736 1103408 1095426 1085376 1073233
58859 1073233 1059620 1045498 1031297 1016800 1002048 987752 974386 961433 948160 934699 921722
58848 921722 909441 897596 886055 874641 862660 849525 835705 822184 809025 795334 780739
58837 780739 766006 752031 739097 727399 717455 709544 703351 698579 695343 693648 693054 693234 694344 696479
58823 696479 699324 702724 706999 712215 717696 722762 727510 732315 737048 741464 745966 751141 756628 761188
58809 761188 764000 765318 765787 765601 764610 762798 760282 756977 752649 747430 742046 737243 732956 728290 722472
58794 722472 715653 708632 702161 696842 693235 691414 690562 689785 689342 690398 693485 697977 703299 709762 717719
58779 717719 726602 735455 743909 751970 759178 764697 768049 769203 768107 764671 759188 752266 744315 735370
58765 735370 725444 714789 703854 693211 683481 675097 668130 662379 657499 653041 648629 644258 640181
58752 640181 636438 632793 629245 626176 623832 622050 620777 620537 622008 625346 630093 635542 641080 646553
58738 646553 652442 659264 666702 673848 680438 687099 694017 700188 704738 708287 712136 716558 720898 724999
58724 724999 729460 734461 739403 743962 748690 754269 760819 768255 776638 785690 794426 801803 807572 812060
58710 812060 815255 816457 814854 810248 803155 794216 783552 770763 755595 738489 720315 701753 683138
58697 683138 664747 646847 629499 612725 596966 583041 571436 561881 553833 547136 541825 537363
58685 537363 532568 526616 519949 513838 509041 505199 501639 498316 495603 493538 491860 490749 490876 492566
58671 492566 495326 498451 501771 505609 510343 516258 523543 532128 541573 551160 559902 566575 570216 570810
58657 570810 569157 565952 561328 555309 548146 540010 530993 521787 513802 507976 503883 500478 497379 494816
58643 494816 492658 490326 487661 485242 483684 483080 483251 484180 485906 488214 490601 492584 494012 495098 496091
58628 496091 496936 497419 497541 497446 496978 495757 493944 492569 492725 494638 497707 501233 504918 508908 513545 518899
58612 518899 524388 529179 533130 536989 541489 546597 551815 556767 561220 565047 568536 572348 576691 580845
58598 580845 583916 585800 587029 587999 588813 589608 590586 591806 593364 595674 599317 604695 611942 620943 631283
58583 631283 642483 654401 667006 679700 691430 701692 710801 718947 725796 731568 737761 746000 756524
58570 756524 768474 781289 795221 810905 829178 851035 876945 906216 937479 969532 1001244
58559 1001244 1030991 1056882 1077486 1092044 1100393 1103199 1101903 1097863 1091764 1084302 1076867 1070763 1065967
58546 1065967 1061267 1055472 1047983 1038541 1027001 1013157 996431 976197 952865 928070 903165 878154
58534 878154 852848 828344 806274 786944 769270 752340 736154 721124 707738 696509 687320 679021
58522 679021 670475 661782 653731 646525 639950 634318 630018 626505 622988 619930 618459 618337 617870 616009 613323
58507 613323 610656 608061 605482 603372 602087 601367 600842 600395 599900 599270 598882 599271 600362 601745 603689 606959
58491 606959 611633 617014 622780 629296 636748 644996 654433 665995 680097 696407 714692 734914 756389
58478 756389 777930 798955 819311 837873 852587 862333 867643 869236 867070 861388 853501 844696 835256
58465 835256 825269 815656 807724 802286 799731 800267 803709 809674 818356 830306 845124 861172 876970
58452 876970 891943 905332 915385 920384 919865 914292 904273 890655 874670 857306 838954 820076
58440 820076 801646 784582 769362 756505 746685 739947 735490 732630 731291 731395 732665 735398 740466
58427 740466 748011 756948 766237 775688 784953 792742 797867 800337 800687 798897 794720 788464 780741 771963
58413 771963 762712 754031 746632 740186 733896 727403 720783 714220 708086 702824 698441 694660 691736 690361
58399 690361 690496 691215 692054 693638 696516 700310 704444 708815 713167 716761 719270 721244 723146 724905 726875
58384 726875 730156 735120 740607 745423 749784 754401 759085 763258 767123 771239 775551 779881 784879 791421
58370 791421 799281 807356 815117 823193 832597 843798 856441 869660 882785 895768 908618 920703
58358 920703 931304 940617 949187 956410 960848 962231 961900 961008 959580 957677 955987 954693 953188 951658
58344 951658 951595 953906 957750 962125 967365 974255 982892 993370 1006319 1021701 1038124 1054355 1070465
58331 1070465 1086653 1102091 1115970 1128525 1139987 1149574 1156546 1161213 1163988 1164614 1163343 1161712 1161072
58318 1161072 1161332 1162044 1163476 1165675 1167867 1169901 1173013 1178047 1184228 1190835 1198580 1207995 1217933 1227130
58304 1227130 1236022 1245631 1255980 1266971 1279436 1293775 1308825 1323604 1338861 1355414 1372326 1388307
58292 1388307 1403609 1418980 1434181 1449171 1465276 1483385 1502419 1521380 1541428 1564016 1588413
58281 1588413 1613138 1638415 1665117 1692668 1720213 1748623 1779130 1811127 1843400 1876328 1910762
58270 1910762 1946023 1981261 2017577 2056594 2098093 2141147 2186226 2233962 2283205 2332661 2383069
58259 2383069 2435431 2488460 2540093 2590182 2639479 2687721 2735123 2783942 2835959 2890141 2945363
58248 2945363 3003427 3066635 3134557 3206220 3283254 3367515 3457811 3552557 3653488 3762982 3879839
58237 3879839 4001643 4129350 4265590 4410475 4563074 4724817 4897274 5078930 5268603
58228 5268603 5469624 5686125 5917884 6163776 6427405 6713884 7023872 7356535 7715610
58219 7715610 8106592 8531044 8990147 9490835 10041773 10646676 11308723 12037854 12846287
58210 12846287 13741423 14732088 15837507 17081227 18481908 20061396 21857546 23919478
58202 23919478 26299536 29066825 32326489 36218581 40918387 46670007 53825515 62848962
58194 62848962 74313162 88917767 107445646 130565085 158568586 191218722 227643086
58187 227643086 266057777 303435297 335703171 358840068 370329806 369909097 359134490
58180 359134490 340336499 315842347 287761335 258013012 228271274 199828534 173528808
58173 173528808 149815508 128838007 110560154 94838968 81462218 70165760 60662385
58166 60662385 52679212 45975446 40338263 35581347 31551820 28128115 25207274 22699793
58158 22699793 20534538 18657516 17022359 15587226 14319952 13197684 12199667 11305932
58150 11305932 10502690 9781930 9134630 8549670 8019254 7539246 7103773 6705117 6339187
58141 6339187 6005382 5700423 5417605 5152829 4906339 4677767 4464180 4263805 4077209
58132 4077209 3903857 3741473 3589376 3448512 3317722 3193804 3075647 2964521 2860044
58123 2860044 2759865 2663704 2573659 2489826 2409458 2331253 2256817 2187041 2120543 2056640 1996493
58112 1996493 1940271 1886271 1833888 1784485 1738399 1693947 1650390 1609125 1570907 1534427 1498595
58101 1498595 1463867 1430470 1397635 1365369 1334739 1305720 1277019 1248627 1222239 1198456 1175908
58090 1175908 1153916 1133752 1116375 1100953 1086476 1072913 1060007 1046743 1032658 1018074 1002620
58079 1002620 985394 966923 948992 932112 915167 897955 881945 867862 854618 841328 828448
58068 828448 816200 803876 791484 780238 770581 761474 752379 744156 737173 730268 722492 714283 706087
58055 706087 697400 688018 678720 669820 660500 650419 640659 632244 625011 618569 612950 607644 601488 594415
58041 594415 587977 583257 579435 575168 570117 564411 557900 550886 544459 539140 534108 528419 522133 515670
58027 515670 509067 502426 496140 490163 484024 477947 472847 468834 464889 460440 456087 452272 448515 444536
58013 444536 440889 437910 435164 432483 430363 428771 426845 424402 422548 422048 422229 422193 421948 421657 420982 420017
57997 420017 419793 420894 422438 423218 423024 422194 420841 419253 418202 418032 418138 417926 417520 417025 416023 414331
57981 414331 412450 410709 408842 406866 405428 404808 404538 404442 404977 406092 406906 407159 407807 409468 411367 412556
57965 412556 413133 413463 413268 412283 410927 409521 407723 405369 402917 400434 397223 393152 389295 386491 384333
57950 384333 382289 380625 379422 377954 376079 375012 375580 376809 377467 377989 379575 382303 385410 388618 391905
57935 391905 394776 397096 399895 404075 408971 413359 417107 420430 422323 421390 417801 412897 407236 400541
57921 400541 393270 386637 381055 375888 370822 366277 362483 359335 357157 356428 356696 356897 356870 357469 359029 360787
57905 360787 362040 362915 363693 364215 364298 364021 363293 361771 359510 357190 355466 354445 353884 353531 353270 353231 353683
57888 353683 354549 355272 355539 355831 356808 358489 360567 363107 366195 369215 371218 371961 371993 371956 372378 373848 376613
57871 376613 380083 383429 386587 390107 394139 398201 401826 404812 406992 408346 409286 410288 411347 412212 412876
57856 412876 413294 413025 411924 410924 411285 413127 415419 417303 418715 419813 420599 421178 421732 422161 422277 422341 422864
57839 422864 423922 425188 426490 427782 428676 428763 428348 428244 428795 429676 430622 431732 433018 434212 435108 435642 435703
57822 435703 435338 435063 435493 436674 438179 439694 441035 441863 441973 441620 440946 439301 435838 430600 424370 417676
57806 417676 410709 403977 397999 392392 386283 379768 374067 369959 366921 364170 361751 360165 359514 359530 360033
57791 360033 360934 362073 363320 364673 366108 367541 368920 370038 370403 369765 368723 368312 368949 370206 371559
57776 371559 372841 374010 375043 376121 377454 378888 380115 381143 381971 382025 380683 378404 376484 375559 375053
57761 375053 374296 373380 372586 371774 370861 370395 371064 372898 375355 378026 381029 384863 389983 396276 402984 409418
57745 409418 415670 422233 429024 435350 440765 445398 449403 452730 455513 458041 460226 461778 463011 464717
57731 464717 466916 468527 468732 468018 467381 467055 466585 465693 464472 463054 461584 460342 459401 458379 456872 454945
57715 454945 452819 450323 447144 443492 440075 437369 435176 432922 430159 426790 423052 419416 416443 414534
57701 414534 413626 413153 412516 411764 411594 412534 414357 416520 418798 421067 422824 423564 423493 423227 422911 422241 421319
57684 421319 420712 420620 420692 420871 421763 423962 427662 433238 441607 453704 470194 492026 520762 557964 604657
57669 604657 661502 728606 804216 883602 959530 1023909 1069476 1091392 1088590 1063827 1022079 968733
57657 968733 908901 847263 787552 732108 682223 638548 600902 568268 539762 515453 495771
57646 495771 480352 468113 458288 450709 445001 440175 435347 430509 426345 423501 422183 422236 423273 424690
57632 424690 425730 425793 424855 423551 422628 422276 422100 421669 420809 419346 416961 413593 409794 406394 403857 402034
57616 402034 400474 398876 397332 396199 395645 395315 394582 393098 391044 388891 387051 385624 384236 382291 379626
57601 379626 376820 374557 372869 371363 369938 368674 367155 364673 361208 357588 354454 351619 348618 345328
57587 345328 341801 338104 334631 331978 330106 328161 325596 322998 321264 320333 319340 317761 315819 313803 311555
57572 311555 308737 305320 301639 298100 294852 291785 288866 286309 284152 281912 279141 276252 274188 273181
57558 273181 272487 271545 270713 270487 270643 270700 270801 271527 273129 275424 278229 281433 284780 287958 290774 293026
57542 293026 294478 295211 295696 296262 296832 297434 298518 300322 302271 303456 303452 302421 300848 299613 299771 301540
57526 301540 303703 304642 303877 302206 300675 299977 300595 302696 305781 309032 312184 315617 319517 323347 326329
57511 326329 328219 329452 330697 332299 334079 335651 336889 337914 338737 339231 339471 339560 339056 337193 334031 330769
57495 330769 328386 326529 324304 321718 319539 318064 316825 315415 313847 312104 310010 307640 305350 303288
57481 303288 301263 299152 297075 295199 293643 292439 291289 289574 287033 284234 281895 280014 278168 276395
57467 276395 275115 274292 273421 272359 271560 271356 271543 271731 271650 271104 270122 269131 268462 267792 266689 265592 265473 266444
57449 266444 267521 268017 268393 269347 270749 272025 273082 274262 275698 277248 278894 280823 283194 286059 289263
57434 289263 292234 294170 294856 295153 296303 298709 301549 303571 304169 303814 303531 303905 304539 304604 303865 302882 302198
57417 302198 301719 301106 300495 300480 301484 303414 305933 308839 312064 315334 318050 319644 320043 319598 318540 316837
57401 316837 314723 312971 312209 312124 311847 311040 310157 309648 309481 309515 309793 310135 309965 309031 308127 308558 310849 314257
57383 314257 317667 320674 323588 326580 329211 330973 332004 332936 334126 335399 336574 337730 338752 339050 338208
57368 338208 336697 335542 335368 336075 337320 338862 340461 341802 342709 343286 343789 344397 345069 345667 346345 347747
57352 347747 350425 354050 357653 360777 363762 366699 368923 370118 371191 373140 375531 377074 377367 377074 376531
57337 376531 375396 373770 372593 372489 373027 373533 373893 374160 374011 373117 371626 369936 368362 367309 367249 368179 369472
57320 369472 370625 371706 372803 373565 373757 373883 374653 376033 377337 378190 378973 380244 382022 383735 384784 385119
57304 385119 385241 385644 386396 387353 388515 389809 390752 390879 390517 390649 391871 393932 396348 398962 401700 404284
57288 404284 406535 408692 411113 413797 416342 418271 419399 420100 421163 423140 425870 428864 431913 434929
57274 434929 437524 439458 441303 443855 446947 449699 451999 454681 458012 461106 463379 465621 468808 472669
57260 472669 476296 479552 482915 486330 489227 491615 494258 497702 501722 505792 509580 512919 515776 518302
57246 518302 520599 522433 523573 524414 525894 528691 532721 537412 542243 546965 551554 556052 560433 564627
57232 564627 568617 572407 575917 579171 582577 586712 591733 597259 602906 608663 614699 621127 627972 635031
57218 635031 641695 647462 652744 658681 665928 674052 682301 690336 697923 704580 710173 715522 721805 729510
57204 729510 738259 747422 756557 765530 774588 784106 794073 804075 813950 824070 834758 845921 857504
57191 857504 869696 882315 894599 906199 917852 930494 944151 958279 972724 987587 1002554
57180 1002554 1017237 1032059 1048025 1065546 1084033 1102611 1120769 1138469 1156157 1174621 1194411
57169 1194411 1215442 1237456 1260519 1284576 1308898 1332721 1356277 1380466 1405592 1431128 1456753
57158 1456753 1482871 1509900 1537672 1565819 1594312 1623280 1652579 1681885 1711177 1741052 1772518
57147 1772518 1806316 1842326 1879741 1917900 1956733 1996349 2036644 2077609 2119597 2162849 2207020
57136 2207020 2251609 2296713 2343094 2391682 2443146 2497555 2554141 2611686 2669423 2727317 2785579
57125 2785579 2844743 2906520 2973608 3047863 3129194 3216747 3310451 3410680 3517255 3629859 3748973
57114 3748973 3875466 4009794 4152592 4305622 4470982 4649681 4842194 5050478 5278776
57105 5278776 5532802 5819196 6145619 6520665 6954136 7458667 8051288 8753182 9588950
57096 9588950 10587618 11784290 13219906 14939019 16986400 19400878 22205849 25400249
57088 25400249 28953583 32803954 36859598 41008967 45136401 49125394 52840250 56112471
57080 56112471 58771174 60712368 61946032 62569167 62685186 62340062 61518858 60184735 58317795
57071 58317795 55932400 53076787 49823860 46259188 42472754 38558093 34614072 30741593
57063 30741593 27034338 23569386 20402119 17564996 15068647 12904973 11051919 9478679
57055 9478679 8150225 7030907 6087119 5289006 4611155 4032054 3532862 3097122 2712311
57046 2712311 2371318 2071166 1809538 1582611 1385828 1215420 1068321 941298 831178
57037 831178 735844 654368 586079 529933 484820 450129 425788 411905 408331 414231 427576 444723
57025 444723 460625 470187 470183 460116 441094 414029 379274 337826 292166 245485 200306 157996
57013 157996 119198 84254 53226 25861 1755 -19405 -37694 -53007 -65395 -75367 -83755 -91236
57001 -91236 -97994 -103829 -108546 -112282 -115514 -118683 -121668 -123715 -124034 -122428 -119218 -114630 -108434 -100147 -89337
56986 -89337 -75750 -59383 -40707 -20915 -1935 13909 24683 29606 29158 24372 16138 5240 -7335
56972 -20566 -33763 -46440 -57830 -66921 -73104 -76509 -77516 -76082 -71628 -63419 -50974 -34289 -13841
56958 9615 35297 62191 88511 111467 127985 136119 135933 129041 117250 101733 83455 63943 45069
56945 45069 28009 12844 -603 -11874 -20105 -24773 -25799 -22940 -15521 -2867 15256 38689 67049
56932 67049 99585 134700 169544 200239 222974 235384 237118 229204 213127 190544 163403 133754
56920 133754 103336 73572 45771 20944 -668 -19560 -36305 -51040 -63619 -73987 -82331 -89001
56908 -89001 -94350 -98565 -101644 -103609 -104670 -105013 -104565 -103213 -101227 -99160 -97250 -95168 -92383 -88493 -83159
56893 -83159 -76046 -67097 -56601 -44643 -30630 -13713 6161 27758 49026 67987 83169 93574
56881 93574 98664 98576 94258 87166 78617 69335 59614 49873 40988 34002 29567 27756 28478 32030 39248
56866 39248 51216 68871 92764 123005 159251 200637 245539 291187 333676 368821 393452 406141
56854 406141 406966 396942 377775 351774 321596 290017 259812 233378 212044 195933 184897 179489
56842 179489 180749 189298 205284 229358 263164 308408 365413 432435 505853 580619 650656 709382
56830 709382 750728 770608 768168 745779 707648 658265 601854 542449 483630 428073 377651 333834
56818 333834 297614 269256 248763 236541 233246 239124 254195 278940 313915 358350 409603 463953
56806 463953 517139 563941 598502 616302 616002 599274 569306 529730 484244 436273 388733 344100
56794 344100 304264 270020 241044 216756 197071 182302 172887 169505 172943 183405 200238 222510
56782 222510 249282 278882 308379 334220 353157 362644 361340 349975 331115 307349 280079 250464
56770 250464 220594 192679 167377 143975 121974 101749 83858 68617 56240 46582 38730 31598
56758 31598 24909 19037 14059 9718 6106 3526 1688 -107 -1940 -3273 -4064 -5065 -6731 -8574 -9873
56743 -9873 -10432 -10400 -9959 -9455 -9305 -9463 -9475 -9225 -9148 -9489 -9875 -9819 -9209 -8126 -6743 -5596 -5334 -5793 -5820 -4482
56723 -4482 -2094 318 2224 3749 5012 5870 6392 7140 8748 11244 13910 15906 17111 18264 20152 22810
56707 22810 25690 28440 31186 34144 37263 40213 42502 43762 44122 44087 43728 42341 39436 35824 33056
56692 33056 31916 32080 33113 34998 37609 40423 43070 45618 48102 50289 52183 54272 56950 60023 62985
56677 62985 65514 67498 68855 69445 69068 67638 65590 63838 62873 62164 61017 59797 59507 60240 60925 60680
56661 60680 59635 58271 56822 55650 55402 56273 57629 58674 59069 58781 57996 57351 57497 58103 58041 56933 55730
56644 55730 55355 55592 55914 56573 58037 59916 61318 61993 62368 62769 63204 63715 64302 64649 64436 63744 62774 61452
56626 61452 59767 58166 57095 56425 55868 55592 55780 55822 54699 52197 49185 46731 45438 45588 47288 50129
56610 50129 53071 55020 55593 55352 55297 55967 56956 57489 57439 57425 57848 58319 58328 58022 57911 58195 58757 59554 60559 61602
56590 61602 62637 63920 65494 66783 67189 66877 66547 66603 67011 67794 69114 70877 72698 74257 75411 76066
56574 76066 76338 76775 77985 79996 82244 84257 86093 88137 90717 94054 98450 104383 112269 121941 132469
56559 132469 142819 152660 162130 170758 177230 180547 180945 179310 176138 171618 166334 161215 156809 153084
56545 153084 149901 147271 145102 143086 141020 139067 137597 136711 135864 134100 130968 127172 123976 122010 121047
56530 121047 120826 121355 122262 122671 122171 121260 120358 119041 116886 114484 112823 112003 111324 110432 109655 109293 109207 109125
56512 109125 108845 108205 107256 106424 106115 106267 106533 106700 106665 106358 106080 106538 108015 109796 110972 111510 112016 112725
56494 112725 113371 113848 114285 114581 114502 114220 114149 114242 114016 113355 112756 112730 113275 114007 114432 114120 112936 111162 109243
56475 109243 107523 106306 105774 105610 105165 104481 104626 106381 108965 110776 111194 110931 110796 110913 111075 111147 111025
56458 111025 110818 111119 112565 115018 117620 119646 120925 121576 121881 122373 123544 125439 127859 130696 133548
56443 133548 135429 135633 134743 133974 133590 132778 131087 129100 127497 126293 125299 124645 124436 124431 124440 124638 125190 125955
56425 125955 126819 127906 129168 130148 130489 130543 131118 132611 134500 135729 135707 134918 134394 134598 135183 135838 136747 137948
56407 137948 138950 139511 140124 141050 141531 140930 140074 140282 141339 141716 140786 139617 139379 140050 141054 142114 143025
56390 143025 143432 143396 143539 144194 144977 145568 146276 147443 148826 150012 150978 151839 152444 152624 152528 152442 152546 153027 154109
56371 154109 155780 157750 159737 161511 162769 163439 164081 165440 167540 169726 171595 173283 174842 176046 177004
56356 177004 178282 180173 182338 184356 186111 187495 188265 188435 188348 188213 188033 187991 188361 188974 189359 189499 189892
56339 189892 190902 192683 195651 200106 205316 209913 213486 216878 220629 224068 226459 228140 229939 232145
56325 232145 234694 237745 241368 245114 248435 251234 253600 255457 256879 258296 259980 261692 263138 264344
56311 264344 265278 265714 265882 266721 268984 272443 276361 280340 284452 289020 294591 301584 309534 317193 323766
56296 323766 329593 335267 340690 345548 350169 355249 361021 367254 373839 380908 388545 396777 405682 415259
56282 415259 425320 435661 446056 456100 465592 475209 486145 498805 512457 526482 541280 557433
56270 557433 574620 592083 609789 628486 648836 671072 695347 721902 750961 782849 818242
56259 818242 858037 902999 953682 1010591 1074391 1146021 1226566 1316877 1417479 1529100 1652947
56248 1652947 1789941 1939908 2102022 2275706 2460237 2653635 2852805 3054740 3256634
56239 3256634 3454828 3644699 3821751 3981861 4120371 4232280 4314029 4364363 4383211 4370800
56229 4370800 4328353 4258547 4164451 4048724 3914331 3765136 3605049 3437274 3264943 3091622
56219 3091622 2920378 2752970 2590613 2434893 2287230 2148030 2017051 1894159 1779205
56210 1779205 1671720 1571293 1477855 1391300 1311367 1238081 1171434 1110443 1053592 1000646 952854
56199 952854 910724 872731 837097 803720 773396 746111 721310 699052 679711 663012 648359
56188 648359 635581 624429 613863 602888 591665 581005 571194 562155 554183 547623 542270 537871 534758
56175 534758 533130 532257 531241 530156 529645 529797 530239 530916 532090 534027 537237 542453 549630 557576 565262
56160 565262 572906 581197 590217 599937 610862 623239 636332 649445 663001 677735 693640 710711
56148 710711 729983 752684 779050 809155 844183 885584 933418 986763 1045261 1109019 1177301
56137 1177301 1248506 1321195 1394051 1465181 1532592 1595270 1653012 1705528 1752536 1794356 1831466
56126 1831466 1863679 1890386 1911133 1925333 1932143 1931487 1924606 1912736 1895787 1872898 1843395 1806472
56114 1806472 1761118 1707605 1648134 1584975 1518922 1450675 1382528 1317151 1255605 1198000 1145136
56103 1145136 1097873 1055744 1017928 984925 957557 934959 915304 898026 883696 872207 862787
56092 862787 855436 850673 848155 847009 847086 848437 850104 851097 852137 854781 859153 864026 868736 873567 878753
56077 878753 884582 891855 900710 909692 917710 926167 937305 951123 965856 980818 996607 1013003 1028934
56064 1028934 1044350 1059998 1075459 1089419 1101886 1114287 1127355 1140550 1153358 1165591 1176683
56053 1176683 1186324 1195450 1205176 1215372 1225776 1237519 1251661 1267215 1282674 1298579 1316360 1335664
56041 1335664 1355318 1376000 1399295 1424770 1450647 1476753 1504211 1532880 1561854 1591806 1624024
56030 1624024 1657754 1691418 1725742 1762574 1801239 1839304 1876507 1914731 1954516 1994994 2036837
56019 2036837 2081801 2129507 2177997 2227276 2279008 2333193 2388650 2446302 2508232 2573906 2641190
56008 2641190 2710670 2784918 2863932 2945652 3030676 3121961 3219980 3322719 3430423 3545608 3668408
55997 3668408 3796752 3931216 4074688 4227046 4385245 4548927 4720895 4902078 5091427
55988 5091427 5290813 5504291 5732571 5974260 6232437 6513440 6819120 7147271 7499924
55979 7499924 7883889 8302862 8756885 9250178 9791370 10385435 11034090 11744862 12530879
55970 12530879 13401572 14363870 15433344 16633880 17986808 19513436 21249858 23247515
55962 23247515 25561275 28255259 31425027 35203932 39759247 45317414 52209531 60886711
55954 60886711 71912458 85978762 103894202 126422023 153998539 186527494 223287493
55947 223287493 262717117 302023975 337128906 363539091 377925082 379320659 369079601
55940 369079601 349824244 324347596 295105253 264180218 233316492 203860967 176704730
55933 176704730 152310518 130812464 112137975 96108436 82491265 71013945 61380064
55926 61380064 53302131 46525811 40830300 36023942 31949043 28482247 25522275 22980774
55918 22980774 20785393 18881195 17222447 15767538 14483723 13348828 12343613 11447329
55910 11447329 10642894 9919851 9268749 8677879 8138211 7645891 7196795 6783485 6400183
55901 6400183 6045889 5719790 5418156 5138208 4880454 4644427 4426183 4222538 4033878
55892 4033878 3860361 3699262 3548488 3409062 3281625 3163837 3053520 2951100 2856627 2767460
55882 2767460 2681200 2598116 2518634 2441158 2364491 2289858 2218533 2149722 2082465 2017382 1955014
55871 1955014 1894616 1835990 1780390 1728545 1680027 1635397 1596397 1563001 1532844 1504405 1477882
55860 1477882 1452031 1423435 1390465 1355042 1318977 1281571 1242533 1204169 1168475 1134622 1101483
55849 1101483 1070205 1041989 1015554 989168 963357 939398 916824 894585 873121 853210 834125
55838 834125 814918 796300 779442 764031 749164 735098 722547 711281 700828 691490 683358 675459
55826 675459 667160 659273 652474 645813 638038 629247 619957 609751 598234 586338 575405 565786 557384
55813 557384 550555 545405 541172 537375 534616 533364 533061 533382 535263 539600 545955 553459 561873 570773 578824
55798 578824 584939 589141 591382 590632 586173 578718 569290 558054 545277 532310 520590 510582 502461
55785 502461 496613 492516 488446 483404 478243 473970 470321 467176 466018 468632 475620 487569 506270 532836
55771 532836 565285 599388 631086 656707 672171 674453 663927 643825 617425 586913 554369 522090
55759 522090 491661 463700 438552 416402 396875 379407 363949 350688 339339 329352 320467 312466
55747 312466 304808 297158 289838 283236 277225 271635 266607 261911 256715 250728 244873 240083 236153 232518
55733 232518 229335 226917 224799 222355 219766 217504 215419 213151 210917 209087 207448 205629 203735 201942
55719 201942 200083 198229 196931 196325 195866 195639 196865 200182 204438 208161 211274 214218 216447 217223 217086
55704 217086 217029 216771 215296 212630 209629 206391 202363 197751 193402 189323 184780 179888 175816 173148 171170
55689 171170 169043 166740 164615 162882 161819 161790 162781 164315 165921 167367 168595 169830 171466 173400 174849
55674 174849 175322 175356 175718 176333 176680 176726 176745 176672 176467 176704 177933 179797 181638 183614 186337 189706 193057 196242
55656 196242 199653 203318 206865 210229 213582 216621 218681 219448 218928 216951 213490 209272 205213 201387 197235
55641 197235 192630 187909 183038 177590 171543 165368 159357 153556 148348 144407 141989 140738 140159 139875 139610
55626 139610 139349 139334 139543 139492 138862 137806 136236 133599 130029 126933 125441 124858 123684 121616 119412 117293
55610 117293 114803 112061 109881 108571 107668 106870 106282 105823 105372 105406 106403 107607 107439 105364 102426 99876
55594 99876 98129 97138 96679 96029 94324 91728 89522 88687 88956 89473 89805 90067 90561 91506 92772 93879 94624
55577 94624 95520 97108 99067 100670 101918 103462 105541 107771 109906 112076 114327 116580 118903 121122 122437
55562 122437 122260 121201 120260 119291 117342 114361 111378 108944 106692 104630 103668 104361 106102 108034 109880
55547 109880 111499 112491 112764 112741 112632 112136 111183 110247 109604 108983 108263 107800 107759 107830 107885 108070 107995 106776 104354
55528 104354 101889 100248 98937 97192 95307 93998 93097 91828 90054 88387 87213 86320 85463 84657 83895
55513 83895 83013 81974 80998 80370 80235 80465 80622 80215 79087 77465 75621 73723 72032 70930 70665 71207 72335
55496 72335 73634 74528 74753 74751 75203 76169 77066 77414 77171 76398 75198 74076 73788 74592 76008 77450 78774 80149
55478 80149 81684 83221 84218 83993 82480 80562 79214 78496 77862 77202 76886 76926 76868 76478 75872 75029 73881 72830
55460 72830 72370 72216 71622 70587 69882 69746 69521 68786 68001 67636 67465 67110 66636 66289 66240 66795 68184 69929
55442 69929 71130 71616 72081 72860 73392 73217 72724 72495 72648 73219 74450 76269 78160 79963 82089 84536 86433
55425 86433 87050 86615 85723 84680 83834 83747 84394 84927 84893 85040 86261 88351 90425 91996 92983 93279 93041 92836
55407 92836 92802 92166 90315 87832 85689 83937 82022 79996 78432 77364 76227 74827 73611 72865 72250 71266
55391 71266 69802 68239 67238 67242 67952 68567 68751 68977 69679 70626 71524 72569 73762 74243 73208 71211 69770
55374 69770 69765 70836 72196 73375 74209 74686 74880 74723 73963 72614 71203 70211 69603 69247 69343 69832 69887 68795
55356 68795 67118 66164 66323 66650 66180 65036 64059 63787 64049 64314 64308 64313 64723 65293 65228 64220 62977 62333 62280 62332
55336 62332 62362 62490 62497 62085 61485 61154 60965 60402 59473 58778 58612 58643 58599 58753 59444 60488 61306 61526 61370 61498
55316 61498 62398 63852 65165 65931 66302 66447 66296 66057 66424 67733 69321 70216 70198 69734 69246 68954 69069 69471
55298 69471 69480 68604 67368 66767 67028 67494 67606 67377 66960 66348 65590 64860 64318 64189 64774 65997 67151 67604 67546
55279 67546 67623 68093 68844 69851 70943 71415 70707 69331 68340 67997 67759 67418 67350 67593 67631 67344 67275 67684 68116
55260 68116 68289 68671 69659 70783 71284 71049 70519 70044 69746 69683 69683 69250 68133 66898 66536 67451 68997 70010
55242 70010 69734 68389 66953 66310 66478 66727 66427 65641 64849 64330 64008 63820 63972 64671 65660 66312 66373 66375 66916
55223 66916 67704 67896 67383 67046 67480 68231 68712 69137 69874 70511 70450 69973 69780 69730 69071 67816 66915 66942 67534 68285
55203 68285 69289 70472 71184 70972 70189 69394 68597 67517 66202 64960 63921 63059 62499 62511 63223 64454 65821
55186 65821 67009 68025 69035 69868 69953 69050 67747 66813 66327 65951 65806 66367 67589 68862 69893 70925 72019
55169 72019 72841 73348 74006 74986 75721 75676 75126 74806 75122 75944 76874 77414 77195 76304 75214 74290 73554 72946 72448
55150 72448 71938 71298 70731 70595 70858 71158 71358 71536 71400 70408 68727 67404 67181 67636 67906 67839 67887 68161 68188
55131 68188 67618 66780 66357 66630 67156 67304 67122 67440 68894 71077 72994 74178 74924 75598 76195 76510 76230 74958
55113 74958 72707 70333 68899 68593 68812 69224 70040 71228 72307 73122 74092 75483 77103 78877 80898 82686
55097 82686 83316 82815 82603 83838 85955 87523 88007 87973 87975 88044 88092 88143 88232 88489 89218 90544 92080 93234 93729
55078 93729 93650 93283 93019 93049 93004 92345 91306 90885 91634 92981 94037 94468 94211 93073 91242 89625 89001 89241
55060 89241 89874 90882 92230 93158 92806 91328 89628 88236 87096 86227 85743 85409 84923 84593 85009 86081 87055
55043 87055 87474 87470 87092 86045 84278 82327 80879 80299 80510 80954 80796 79679 78237 77367 77108 76837 76461 76682
55025 76682 77885 79417 80287 80223 79761 79591 80001 80747 81340 81588 81802 82252 82634 82440 81708 80953 80470 80148 79879
55006 79879 79599 79020 77948 76882 76685 77514 78656 79550 80297 80964 81089 80403 79544 79442 80239 81273 82007 82547
54988 82547 83275 84320 85483 86563 87656 89086 90951 92805 94048 94576 94809 95074 95312 95429 95549 95774
54972 95774 95962 95951 95755 95437 95039 94746 94798 95072 95094 94699 94412 94840 95916 97084 98049 98952 99850 100424 100301
54953 100301 99427 98007 96299 94658 93626 93735 95044 96946 98512 99118 98741 97772 96696 95955 95893 96595
54937 96595 97819 99187 100365 101048 100996 100388 99973 100506 102091 104375 107377 111647 117454 124211 131061 137841
54921 137841 145114 153318 162108 170544 177713 183070 186347 187350 185986 182463 177367 171398 165005 158371
54907 158371 151690 145326 139597 134467 129594 124730 120060 116133 113445 112073 111693 111924 112536 113351 114052
54892 114052 114243 113734 112790 112105 112421 113945 116111 118123 119865 122135 125879 131332 138019 145419 153354
54877 153354 161830 170715 179535 187382 193089 195803 195556 193187 189601 185136 179672 173268 166471 159905
54863 159905 153674 147411 141000 134962 129865 125560 121383 117072 113072 109885 107527 105715 104199 102718
54849 102718 101034 99278 97952 97293 96893 96156 94872 93138 91095 89062 87535 86685 86136 85629 85537 86215
54833 86215 87175 87514 87029 86335 86026 86273 87138 88579 90117 91111 91521 91880 92396 92664 92467 92286 92656 93410
54815 93410 93919 93860 93430 92983 92692 92467 92015 91095 89805 88587 87972 88385 89957 92173 93930 94513 94526 95280
54797 95280 97111 98886 99478 99148 99022 99605 100385 100671 100272 99434 98612 98407 99231 100817 102282 102907 102825 102826 103566
54778 103566 105029 106718 108199 109431 110696 112472 115384 119999 126367 133832 141527 149078 156730 164849
54764 164849 173458 182122 190056 196326 200242 201647 200768 197872 193206 187163 180240 172843 165321 158074
54750 158074 151387 145237 139567 134624 130686 127530 124583 121630 118974 116905 115387 114360 113895 113939 114281
54735 114281 114944 116232 118212 120555 123093 126178 130187 134916 139766 144347 148769 153535 159291 166270
54721 166270 173754 180380 185227 188348 190079 190276 188618 185256 180640 174982 168444 161671 155481 149996
54707 149996 144641 139191 134271 130556 127848 125382 122822 120574 119109 118320 117653 116687 115420 114096 112984
54692 112984 112295 112090 112115 111901 111222 110361 109704 109145 108209 106757 105232 104047 102979 101464 99326 96992 94985
54675 94985 93484 92435 91944 92276 93435 94865 95814 96041 95964 96059 96326 96501 96520 96476 96294 95834 95285 95118 95581
54656 95581 96465 97321 97692 97259 96158 95144 95021 95844 96977 97921 98708 99446 99986 100228 100336 100483 100646 100767
54638 100767 100763 100337 99250 97902 97106 97089 97226 97033 96847 97078 97342 96933 95861 94797 94181 93969 94108 94731
54620 94731 95830 97116 98292 99217 99871 100387 100993 101688 102121 102044 101695 101467 101406 101349 101353 101570 101851 101888 101681 101522
54600 101522 101588 101903 102563 103605 104715 105446 105713 105756 105728 105693 105967 106940 108435 109593 109586 108299 106390 104883
54582 104883 104550 105294 106110 105993 104902 103600 102662 102095 101855 102164 103111 104310 105278 105877 106247 106502 106678 106829
54564 106829 107042 107420 107996 108547 108615 107985 107058 106420 106137 105872 105608 105744 106399 107174 107758 108300 108950 109463 109611
54545 109611 109639 109942 110531 111092 111375 111269 110811 110377 110566 111489 112411 112506 111839 111211 111143 111434 111705 111910 112215 112712
54525 112712 113374 114054 114416 114111 113188 112202 111739 111928 112461 112940 113083 112705 111779 110617 109886 110171 111357 112537
54507 112537 112770 112049 111332 111510 112497 113483 113880 113732 113296 112635 111745 110781 109970 109447 109296 109541 109947 110045 109639
54488 109639 109209 109513 110828 112773 114835 116742 118314 119343 119789 119823 119459 118418 116666 114909 114126 114615
54472 114615 115800 117010 118153 119605 121733 124612 127920 130960 133010 133837 133760 133165 132224 131174 130509 130550
54456 130550 131016 131331 131273 131067 130926 130808 130563 130015 128879 126924 124339 121790 119920 118879 118377 118107 117994
54439 117994 118105 118403 118684 118771 118702 118607 118427 117947 117203 116626 116587 116903 116970 116351 115169 114036 113706 114619 116511
54420 116511 118555 120059 120987 121687 122335 122914 123512 124188 124612 124300 123310 122327 121927 122065 122396 122687 122749 122387
54402 122387 121818 121873 123291 125789 128213 129641 130095 130152 130198 130204 130049 129804 129727 130112 131054 132275 133210 133431 133021
54383 133021 132444 132028 131692 131233 130772 130785 131716 133567 135872 138020 139753 141416 143626 146601 149923 153053
54367 153053 155847 158392 160633 162571 164584 166945 168992 169505 168219 166388 165481 165723 166344 166745 166739 166032
54351 166032 164354 162122 160241 158992 157654 155482 152586 149624 147003 144756 142948 141800 141429 141616 141830
54336 141830 141487 140382 138921 137704 136811 135744 134175 132497 131437 131358 132122 133429 134975 136351 137137 137279
54320 137279 137265 137744 138882 140091 140492 139699 138091 136295 134625 133180 132227 132035 132352 132462 131995 131377 131292
54303 131292 131858 132557 132804 132367 131403 130315 129629 129724 130530 131483 131909 131601 131063 131019 131562 131980 131651 130977 131004
54284 131004 132157 133793 135125 136085 136968 137626 137637 137141 136922 137485 138399 138837 138557 138069 137946 138229 138541 138553
54266 138553 138234 137802 137593 137867 138567 139369 140164 141338 143250 145449 146872 146967 146247 145508 144907 144182 143473 143367
54248 143367 144200 145693 147211 148072 147792 146546 145292 144925 145242 145187 144183 142774 141883 141938 142827 144145 145239
54231 145239 145436 144630 143428 142532 142157 142160 142355 142560 142689 142973 143698 144566 144765 143920 142535 141239 140100 139087
54213 139087 138624 139038 139788 139956 139395 138812 138712 138821 138591 137841 136832 136033 135892 136525 137539 138361 138723 138736
54195 138736 138663 138805 139405 140333 141049 141244 141286 141600 141853 141354 140196 139344 139478 140359 141456 142653 144043 145546
54177 145546 147058 148653 150266 151478 151930 151726 151171 150371 149379 148470 147865 147360 146611 145679 144905 144322 143599
54160 143599 142594 141643 141152 141159 141442 141787 142011 141940 141554 141037 140516 139835 138839 137824 137462 138141 139473 140603
54142 140603 140968 140727 140472 140601 140979 141156 140855 140227 139623 139229 139034 139138 139845 141278 143036 144452 145211 145563
54124 145563 145964 146686 147800 149295 151053 152814 154352 155725 157305 159423 161938 164202 165684 166655 167993
54109 167993 170089 172212 173325 173353 173162 173313 173421 172937 171978 171005 170026 168627 166635 164364 162222 160408
54093 160408 158966 157935 157398 157478 158169 159129 159876 160295 160751 161486 162200 162492 162436 162465 162904 163969 165897 168606
54075 168606 171401 173555 175167 176945 179214 181657 184059 186626 189336 191508 192512 192573 192483 192692 193015 193153
54059 193153 193093 192983 192886 192839 193054 193917 195713 198374 201625 205326 209498 213946 218119 221687 225129 229479
54043 229479 235467 243091 251884 261298 270939 280806 291320 302754 314625 325993 336443 346316 355882
54030 355882 364784 372574 379413 385851 392134 398041 403205 407263 409867 410950 410944 410435 409562 407911 404991
54015 404991 400691 395341 389433 383208 376417 368624 359858 350732 341790 332985 324066 315222 306947 299442
54001 299442 292587 286433 281196 276645 271995 266691 261046 255875 251721 248604 246245 244220 242131 239955
53987 239955 238183 237258 236965 236657 236014 235238 234563 234106 234362 236230 239986 244564 248396 250953 252931 255003
53971 255003 256961 258241 258691 258402 257254 255116 252336 249631 247541 246256 245754 245788 245882 245749 245653 246047 246986
53954 246986 248253 249858 251947 254293 256534 258897 262024 265912 269724 273016 276567 281481 287866 294928
53940 294928 302016 309075 316323 324057 332607 341941 351400 360332 368891 377666 386582 394779 401761 408136
53926 408136 414991 422894 431692 440866 449867 458424 466826 475683 485267 495359 505901 517333 529961
53913 529961 543296 556384 568560 579473 588677 595757 600843 604486 606943 607942 607228 604951 601386 596634
53899 596634 590769 584053 576733 568797 560052 550288 539334 527173 514177 500998 488038 475131 461865
53886 461865 448078 433949 419903 406529 394339 383318 372961 362971 353732 345738 338782 332127
53874 332127 325371 318685 312214 305726 298977 292118 285570 279671 274525 269980 265748 261758 258333 255712
53860 255712 253451 250693 247093 243079 239181 235618 232646 230718 229866 229373 228487 227150 225646 223966 222058
53845 222058 220421 219703 219812 220004 219938 220073 220807 221714 221956 221233 220066 219229 219082 219368 219539 219241 218499 217568
53827 217568 216846 216872 218017 219895 221403 221784 221489 221676 223004 225287 228078 231060 233920 236479 239106 242544
53811 242544 247113 252394 257855 263484 269707 276944 285371 294847 304908 315035 324957 334618 343933 352862
53797 352862 361605 370354 378842 386513 393096 398629 403054 406301 408780 411133 413396 414935 415312 414538 412300
53782 412300 407723 400434 391275 381462 371502 361388 351345 341732 332541 323569 314855 306521 298481 290814
53768 290814 284014 278316 273158 267962 263089 259200 255888 251931 246911 241710 237226 233380 229676 226037
53754 226037 222623 219423 216507 214295 213055 212304 211139 209076 206430 203997 202549 202432 203372 204666 205667
53739 205667 206133 206189 206092 205949 205513 204387 202643 201023 200127 199613 198686 197295 196248 196118 196689 197583 198767
53722 198767 200114 201139 201645 202145 203128 204344 205275 205918 206567 207194 207657 208290 209603 211504 213429 215149
53706 215149 216857 218542 219956 221277 223076 225404 227545 228996 230183 231852 234210 237063 240362 244090
53692 244090 247861 251173 253930 256243 257843 258272 257739 257254 257595 258424 258724 257973 256663 255700 255518 255828 256071
53675 256071 255958 255558 255024 254461 254041 253938 254027 253889 253411 253205 254033 255876 257929 259543 260744 261759 262530
53658 262530 262978 263325 263742 263979 263812 263619 263959 264725 265348 265858 267028 269190 271506 272924 273430 273816 274493
53641 274493 275200 275820 276809 278577 280878 283110 284982 286608 288130 289515 290673 291604 292489 293681 295531
53626 295531 298044 300792 303317 305492 307374 308854 309747 310226 310835 311922 313253 314367 315165 316006 317350
53611 317350 319492 322542 326355 330516 334611 338566 342471 346040 348590 349759 350015 350215 350890 352181 354203
53596 354203 356958 359896 362071 363000 363103 363084 363105 362762 361727 360093 358143 356001 353620 350993 348272 345718
53580 345718 343572 341976 340933 340248 339553 338634 337731 337302 337307 337018 335836 334046 332337 330820 329124 327411
53564 327411 326511 326820 327723 328505 329230 330217 331221 331856 332450 333637 335229 336345 336763 337341 338797 340595 341478
53547 341478 340798 339116 337750 337921 339927 342881 345500 347367 349150 351504 354299 357249 360718 365159 370025
53532 370025 374035 376758 379352 383366 389146 395780 402409 409183 416825 425516 434494 442866 450693 459068
53518 459068 469005 480504 492948 506239 521038 537706 555483 573155 590359 607769 626053 645138
53506 645138 664642 684508 704791 725094 744797 763793 782551 801320 819683 837060 853346
53495 853346 868833 883812 898570 913514 928893 944454 959735 974647 989510 1004581 1019893
53484 1019893 1035549 1051731 1068308 1084771 1100756 1116377 1131817 1146841 1160989 1174038 1186011
53473 1186011 1196832 1206216 1213851 1219436 1222663 1223455 1222212 1219482 1215327 1209411 1201828 1193511 1185443 1177625
53459 1177625 1169200 1159533 1148852 1137765 1126478 1114643 1101780 1087755 1073013 1058387 1044432 1030771
53447 1030771 1016347 1000528 983819 967408 952305 939149 928328 919707 912407 905528 899108 893912
53435 893912 890245 887598 885537 884246 883935 884396 885554 887863 891575 896104 900756 905709 911551 918150 924803
53420 924803 931447 938876 947634 957466 968121 980065 993943 1009710 1026706 1044328 1062416 1081224
53408 1081224 1101284 1123053 1146431 1170789 1195676 1221378 1248633 1277906 1309067 1341570 1374879
53397 1374879 1408917 1444230 1481519 1520890 1561730 1603432 1645970 1689615 1734313 1779576 1824823
53386 1824823 1869664 1913936 1957606 2000527 2042152 2081647 2118483 2152811 2185125 2215650 2244140
53375 2244140 2270128 2293198 2313088 2329635 2342590 2351427 2355444 2354169 2347660 2336382 2320800 2301093
53363 2301093 2277169 2249037 2217235 2182776 2146527 2108811 2069923 2030756 1992435 1955269 1918615
53352 1918615 1881978 1845835 1811138 1778390 1747471 1718013 1689580 1661647 1633750 1605652 1577291
53341 1577291 1548813 1520818 1494264 1469854 1447593 1427104 1408104 1390477 1374228 1359604 1346972
53330 1346972 1336295 1327012 1318633 1310959 1303316 1294072 1281779 1266803 1251216 1236850 1223846 1211104
53318 1211104 1197650 1183307 1168419 1153449 1138897 1125337 1113185 1102345 1092329 1083027 1075190 1069676
53306 1069676 1066158 1063128 1059462 1055515 1052418 1050888 1051184 1053645 1058477 1065262 1073385 1082862 1094084 1106871
53292 1106871 1120542 1134901 1150466 1167572 1185901 1205007 1224656 1244381 1263262 1280505 1295944
53281 1295944 1309798 1322342 1333857 1344383 1353317 1359800 1363639 1365341 1365093 1362445 1357313 1350494 1342527
53268 1342527 1332697 1319954 1304438 1287316 1269357 1250489 1230713 1210639 1190882 1171465 1152007
53257 1152007 1132123 1111581 1090502 1069549 1049548 1030736 1012613 994586 976499 958494 940733
53246 940733 923348 906351 889439 872209 854719 837571 821268 805816 791143 777546 765320
53235 765320 754179 743470 732922 722805 713394 704626 696414 688898 682115 675664 669037 662192 655422
53222 655422 648591 640781 630926 618757 605032 590893 577087 563657 550173 536227 521889 507746
53210 507746 494548 482756 472373 462990 453903 444475 434695 425340 417240 410338 403752 396701 389032
53197 389032 380787 371763 361861 351539 341501 332118 323473 315791 309291 303664 298195 292586 287254 282638
53183 282638 278522 274348 269986 265839 262281 259283 256664 254449 252805 251707 250840 249868 248706 247445 246085
53168 246085 244545 242960 241741 241151 240920 240509 239708 238763 237909 237017 235774 234046 231991 230067 228971 229242
53152 229242 230659 232164 232690 232051 230883 229887 229302 228949 228403 227192 225241 223252 222278 222671 223644 224100 223701
53135 223701 222953 222475 222528 223147 224261 225544 226434 226552 226087 225638 225716 226391 227357 228240 228925 229638 230700 232230
53117 232230 234120 236235 238501 240800 242904 244577 245691 246282 246563 246775 246871 246414 245052 243113 241404 240301
53101 240301 239315 237785 235735 233805 232494 231811 231529 231431 231303 230986 230513 229950 229092 227620 225686 224067 223460
53084 223460 223718 224028 223849 223461 223502 224097 224695 224824 224764 225146 225954 226344 225702 224470 223586 223271 222896 221901 220335
53065 220335 218458 216328 214052 212000 210438 209218 208173 207552 207682 208386 209123 209639 210044 210320 210163 209502
53049 209502 208818 208729 209412 210582 211872 213021 213783 213966 213670 213340 213391 213701 213685 213004 212162 212097 213088 214312 214717
53030 214717 214180 213528 213474 213926 214379 214648 214892 215163 215279 215197 215249 215848 217054 218542 219927 221047 221966 222854
53012 222854 223874 225014 225917 225993 224940 223201 221654 220780 220305 219825 219537 220028 221407 223026 224142 224631
52996 224631 224863 225166 225624 226286 227226 228404 229671 230992 232467 234068 235485 236426 237055 237976 239626 241681
52980 241681 243191 243433 242595 241468 240572 239812 239030 238502 238570 239084 239609 240069 240678 241259 241244 240609 240269 241086 242777
52961 242777 244307 245131 245500 245699 245719 245798 246561 248112 249445 249323 247593 245214 243143 241662 240695 240157 239755
52944 239755 238940 237448 235713 234451 233925 233886 234072 234402 234664 234480 233809 233222 233300 233835 233965 233214 232103 231595
52926 231595 232072 233089 233984 234453 234543 234346 233905 233278 232570 231886 231316 230924 230713 230587 230331 229672 228505 227154
52908 227154 226261 226248 226922 227797 228725 229957 231552 233098 234150 234748 235271 235921 236524 236791 236620 236157 235649 235194
52890 235194 234690 234095 233652 233636 233893 233950 233607 233146 232820 232530 232247 232386 233361 235007 236781 238484 240427 242884
52872 242884 245629 248025 249512 250142 250704 252031 254030 255723 256493 256837 257460 258094 257830 256351 254084 251323
52856 251323 248015 244437 241289 238854 236710 234529 232518 230839 229226 227583 226300 225495 224465 222537
52842 222537 220091 218105 216935 216132 215331 214703 214571 215018 215856 216650 216834 216273 215654 215872 216965 218031 218200
52825 218200 217338 215782 213880 212034 210783 210428 210599 210445 209360 207584 206103 205858 206922 208511 209893
52810 209893 211077 212425 213811 214630 214568 213896 212920 211647 210182 209040 208579 208365 207516 205722 203657 202339
52794 202339 202282 203233 204474 205316 205534 205501 205806 206632 207545 208002 207986 207958 208259 208744 209104 209351 209798 210607 211561 212328
52774 212328 212867 213459 214336 215253 215500 214495 212456 210358 209079 208663 208542 208296 207960 207709 207594 207676 208100 208896
52756 208896 209850 210711 211423 212130 213050 214326 215822 217100 217862 218360 219070 219981 220587 220698 220793 221364 222279 223163
52738 223163 224044 225203 226575 227792 228765 229805 231124 232521 233678 234506 235078 235328 234972 233795 232000 230183
52722 230183 228796 227701 226483 225165 224281 224125 224365 224613 225035 226018 227498 229034 230360 231499 232402 232837
52706 232837 232622 231771 230474 229106 228084 227517 227153 226855 226722 226507 225434 223295 221388 221477 223728 226385
52690 226385 227701 227601 227198 227258 227654 227976 228137 228360 228809 229277 229237 228332 226861 225568 224903 224680 224507 224332
52672 224332 224481 225257 226587 227980 228896 229286 229626 230225 230743 230710 230372 230476 231307 232488 233810 235661 238365
52655 238365 241535 244428 246659 248277 249370 249863 249600 248484 246708 244841 243420 242384 241245 239913 238923
52640 238923 238713 239094 239705 240616 242120 244268 246959 250240 254222 258944 264645 271944 281294 292236 303375
52625 303375 312970 319491 322091 321014 317450 312563 306664 299526 291321 282942 275477 269597 265255 261746
52611 261746 258262 254728 251957 250693 250691 251094 251451 251866 252363 252726 252971 253338 253692 253549 252917 252557 252984 253669
52593 253669 253709 253074 252597 252866 253642 254499 255518 257023 258895 260543 261584 262232 262865 263455 263674 263501 263367
52576 263367 263647 264187 264583 264671 264525 264107 263287 262267 261614 261650 261949 261704 260585 259065 257872 257307 257149 257026
52558 257026 256735 256254 255736 255440 255422 255233 254307 252812 251766 251942 252886 253467 253269 252903 252967 253336 253603 253700 253711
52539 253711 253523 253077 252659 252574 252769 253118 253823 255113 256746 258265 259608 261013 262370 263172 263188 262783 262421
52522 262421 262186 261978 261945 262469 263796 265746 267764 269329 270443 271734 273950 277374 281820 286967 292346
52507 292346 297093 300175 301144 300464 298939 296967 294471 291355 287784 284007 280125 276132 272174 268633 265829
52492 265829 263659 261701 259805 258444 258299 259465 261191 262373 262297 261043 259363 258146 257814 258143 258648 259067
52476 259067 259513 260282 261604 263460 265550 267547 269397 271230 273008 274621 276361 278871 282324 286040 289262
52461 289262 291951 294414 296514 297866 298508 298672 298011 295880 292469 288920 286049 283625 281224 279087 277585
52446 277585 276340 274601 272282 270014 268200 266517 264462 262022 259694 258061 257389 257419 257519 257202 256551 256040
52430 256040 255923 255981 255910 255859 256390 257848 259795 261231 261530 261124 261076 261991 263521 265004 266258 267587 269234
52413 269234 271128 273119 275180 277379 279876 283071 287567 293760 301434 309831 318108 325585 331556 335164
52399 335164 335878 334134 331132 327774 324035 319662 315132 311395 308710 306308 303462 300455 298224 297234 297015
52384 297015 296716 295915 294953 294638 295563 297648 300341 303255 306442 310110 314328 319110 324536 330601 337026
52369 337026 343360 349096 353664 356531 357514 356969 355578 354019 352819 352265 352298 352590 352803 352682 352059 351075 350421
52352 350421 350897 352531 354462 355955 357191 358821 361063 363610 366187 368863 372026 376317 382306 389783
52338 389783 397671 405129 412551 420959 430587 440746 451064 462124 474732 489172 505438 523588
52326 523588 543472 564565 586475 609222 632634 655950 678617 701255 725136 750702 777110
52315 777110 803239 828686 853685 878536 903359 928103 952517 976312 999446 1022056 1044058
52304 1044058 1065120 1085149 1104377 1122691 1139318 1153629 1165933 1176831 1185861 1191554 1193036 1190986
52292 1190986 1186656 1180462 1172102 1161648 1149829 1137245 1124024 1110393 1097084 1084824 1073779 1063877
52280 1063877 1055424 1049044 1045047 1043241 1043394 1045612 1050091 1056644 1064648 1073529 1083248 1094298 1107217 1122102
52266 1122102 1138574 1156104 1174245 1192640 1210996 1229166 1247208 1265288 1283522 1301853 1320014
52255 1320014 1337608 1354288 1369778 1383593 1394899 1402869 1407175 1407962 1405387 1399480 1390408 1378541 1364124
52242 1364124 1347192 1327920 1306725 1283965 1259940 1235377 1211375 1188459 1166072 1143501 1121031
52231 1121031 1099565 1079301 1059531 1039867 1021057 1004310 990169 978270 967877 958436 949829 942300
52219 942300 936033 930770 926056 921917 918962 917704 918039 919477 921585 924052 926643 929310 932170 935237
52205 935237 938376 941582 944966 948404 951636 954934 959158 964752 971126 977495 983958 991090 998766 1006107
52191 1006107 1012546 1018291 1023639 1028375 1031978 1033946 1033859 1031641 1027869 1023348 1018211 1011972 1004497 996312
52177 996312 987766 978666 969160 960253 952817 946642 941172 936687 933905 932738 932359 932373 933034 934329 935815
52162 935815 937588 940528 945130 950708 956137 960851 964679 967306 968524 968774 968928 969609 970967 972867 975030
52147 975030 977252 979728 982869 986594 990217 993348 996476 1000238 1004539 1008996 1013862 1019861 1027259 1035831
52133 1035831 1045712 1057616 1072116 1089256 1108991 1131494 1156775 1184366 1213588 1243996 1275608
52122 1275608 1308916 1344517 1382255 1420811 1458545 1494743 1529544 1562735 1593366 1620744 1645168
52111 1645168 1667333 1687456 1705314 1720750 1733764 1744468 1753267 1760756 1767073 1771550 1773332 1772186
52099 1772186 1768508 1762720 1754834 1744364 1730541 1712911 1691900 1668541 1643536 1617028 1589397 1561658
52087 1561658 1534660 1508417 1482855 1458800 1437567 1419732 1404919 1392687 1382994 1375742 1370520 1367043
52075 1367043 1365546 1366584 1370621 1377876 1388315 1401726 1417852 1436371 1456682 1478021 1500038 1522936
52063 1522936 1546687 1570421 1593121 1614756 1636123 1657629 1678751 1698656 1716723 1732325 1744713
52052 1744713 1753421 1758393 1759500 1756305 1748580 1736672 1721109 1702156 1679987 1655015 1627770 1598731
52040 1598731 1568577 1538291 1508630 1479544 1450487 1421228 1392140 1363769 1336481 1310547 1286257
52029 1286257 1263702 1242578 1222299 1202337 1182509 1163061 1144491 1127137 1110795 1094843 1078907
52018 1078907 1063381 1049050 1036115 1023834 1011402 998910 987089 976167 965488 954362 942727
52007 942727 930698 917945 904088 889456 874863 860699 846696 832699 819202 806974 796448
51996 796448 787633 780367 774344 768880 762854 755150 745434 734454 723238 711881 699498 685606 671051
51983 671051 657103 643962 630710 616603 601833 587118 573155 560411 548899 538131 527880
51972 527880 519073 513302 511262 512146 514687 518221 522551 527460 532775 538447 544106 548868 551951 553206
51958 553206 552809 550774 547167 542491 537477 532652 528380 525077 523165 523006 525104 530028 537938 548543
51944 548543 561835 578444 598856 622509 647990 673810 698582 720804 739070 752554 760938 764026
51932 764026 761726 754300 742318 726572 708234 688711 668803 648233 626473 603913 581754 560947
51920 560947 541774 524271 508454 494115 481026 469410 459699 451780 445013 439145 434713 432357 432183
51907 432183 433928 437217 441392 445552 449200 452576 456064 459497 462249 463670 463148 460090 454367 446659
51893 446659 437906 428442 418069 407038 396540 387922 381637 377160 373834 371553 370603 371125 372946 375867
51879 375867 379896 385122 391433 398413 405446 411969 417750 422938 427661 431606 434260 435580 436106 436241 435800
51864 435800 434551 432897 431599 431039 431168 432036 433876 436651 439990 443648 447619 451636 454934 456745 456792
51849 456792 455153 451889 447067 440946 433910 426276 418290 410256 402520 395346 388814 382867 377474 372874
51835 372874 369587 368006 367978 368873 370010 370932 371396 371356 370901 370009 368437 366133 363596 361443 359653 357718
51819 357718 355629 354178 353999 354670 355154 354926 354347 354018 354126 354413 354545 354417 354212 354221 354643 355527 356788 358171
51801 358171 359332 360194 361171 362730 364740 366483 367359 367316 366580 365346 363878 362553 361551 360688 359729 358669
51785 358669 357561 356363 355238 354745 355421 357171 359262 360866 361593 361730 362188 363998 367596 372606 378417
51770 378417 384827 391997 399968 408445 416917 424744 431206 435639 437630 437118 434494 430568 426094 421132
51756 421132 415091 407584 399060 390476 382579 375683 369779 364563 359576 354638 350029 346064 342778 340261
51742 340261 338880 338729 339182 339572 340177 341952 345322 349757 354517 359199 363468 366851 369186 370887 372432
51727 372432 373783 374583 374798 374927 375547 376631 377314 376515 373975 370555 367275 364311 361338 358568 356770 356255
51711 356255 356552 357216 358234 359297 359506 358472 357237 357302 358897 360882 362296 363335 364615 366037 366765 366188
51695 366188 364664 363261 362751 362889 362821 362244 361816 362173 362878 362749 361147 358520 355787 353580 352102 351209 350475
51678 350475 349520 348436 347680 347461 347512 347529 347461 347284 346967 346959 348306 351812 357165 363202 368906 373848 377842 380631
51660 380631 381970 381761 380145 377720 375589 374780 375423 376816 378406 380471 383648 388030 392909 397222 400070
51645 400070 401023 400312 398745 397211 396122 395388 394765 394023 392776 390480 386778 381841 376274 370690 365419
51630 365419 360586 356377 353102 350915 349507 348252 346702 344829 342787 340673 338648 336991 335729 334424
51616 334424 332631 330487 328417 326388 323979 321254 318981 317725 317199 316886 316842 317372 318322 319365 320769 323122
51600 323122 326320 329670 333229 338237 345633 354662 363594 371426 378138 383455 386314 385926 382813 378404
51586 378404 373915 369981 366999 365218 364457 364164 364010 364297 365663 368562 373161 379576 387927 398039 409263
51571 409263 420827 432485 444690 458024 472469 487374 502212 517253 533480 551948 573276
51560 573276 597527 624224 652454 681168 709429 736298 760468 780303 794451 802365 804219 800527
51548 800527 791953 779269 763232 744575 724228 703371 682925 663062 643457 624018 605103 587079
51536 587079 569966 553540 537473 521341 504859 488314 472511 458164 445543 434715 425672 418011
51524 418011 410923 403908 397211 391185 385532 379713 373849 368565 364014 359723 355536 352020 349623 347900
51510 347900 345972 343467 340739 338445 337198 337319 338496 339901 341058 342477 344998 348571 352146 354848
51496 354848 356875 358990 361432 363653 365129 366065 367093 368365 369267 369243 368711 368713 369615 370559 370463 369191 367378
51479 367378 365350 362731 359058 354308 348764 342771 336773 331262 326522 322605 319584 317529 316131 314763
51465 314763 313160 311734 310950 310664 310431 310221 310386 310981 311569 311786 311784 311974 312604 313736 315431 317795 320945
51448 320945 325069 330476 337489 346316 357014 369435 383093 397111 410344 421604 429924 434927 437075
51435 437075 437404 436806 435515 433280 429906 425518 420413 414853 409039 403202 397573 392226 386971 381493 375727
51420 375727 370110 365310 361652 358917 356781 355243 354433 354135 353805 353173 352608 352768 353931 355745 357537 358807
51404 358807 359533 360180 361343 363263 365632 367977 370251 372903 376330 380384 384582 388743 393208 398409 404498
51389 404498 411582 420152 430881 443990 459147 476216 495908 519432 547554 580150 616495 655723
51377 655723 697045 739772 783118 825654 864905 897895 922466 937964 944503 941887 929719 908558
51365 908558 880409 847746 812243 774659 735682 696389 657821 620545 584954 551780 521951
51354 521951 495948 473630 454681 438892 425863 414805 405009 396404 389397 384254 380868 378929 377910
51341 377910 376982 375457 373430 371546 369995 368171 365534 362322 359070 355870 352625 349702 347603 346120
51327 346120 344488 342531 341043 340795 341544 342330 342392 341551 340051 338421 337330 337175 337804 338806 339991 341406
51311 341406 343049 344799 346607 348474 350211 351415 351811 351590 351278 351218 351151 350455 348911 347040 345426 343875
51295 343875 341713 338912 336356 334756 333820 332887 331928 331381 331338 331596 332406 334459 338025 342651 347847 353556
51279 353556 359692 365693 370821 374642 376990 377868 377672 377198 377001 376880 376240 374849 372978 371065 369539 368774
51263 368774 368771 368951 368661 367927 367377 367302 367149 366120 364112 361827 360036 358864 357786 356162 353734 350726 347664
51246 347664 345169 343684 343162 343064 342917 342843 343264 344106 344755 344939 345134 345740 346282 345976 344866 343746 343006 342173
51228 342173 340722 338843 337147 335985 335322 334999 334858 334789 334839 335199 335997 337217 338797 340551 342023 342808 343188
51211 343188 344098 346164 349003 351675 353632 355064 356591 358931 362558 367228 371887 375424 377541 378641
51197 378641 378963 378220 376213 373460 370956 369326 368321 367136 365234 362855 360738 359381 358689 358298 358011
51182 358011 357850 357917 358341 359172 360152 360824 361037 361081 361116 360750 359567 357828 356137 354560 352647 350362 348468
51165 348468 347745 348251 349576 351446 353718 356017 357849 359118 360280 361850 363840 365789 367249 368126 368441
51150 368441 368000 366600 364596 362828 361784 361188 360718 360676 361412 362385 362613 362005 361492 361658 362021 361970 361739 361909
51132 361909 362406 362622 362333 361993 362268 363617 366143 369397 372422 374375 375175 375401 375705 376504 377923 379661
51116 379661 381122 382066 382985 384490 386495 388402 389890 391008 391667 391657 391254 391210 391986 393426 395318 397740
51100 397740 400585 403225 405061 406205 407254 408547 409894 410936 411500 411731 412023 412733 413807 414827 415505
51085 415505 415929 416192 416082 415489 414876 414922 415702 416575 416967 416927 416843 416898 417066 417398 418032 419013 420400 422524 425834
51066 425834 430386 435813 442042 449808 460078 473028 487921 503895 520397 536741 551837 564830
51054 564830 575701 584777 591941 596940 600428 603979 608720 614323 619612 623780 626668 628150 627803 625283
51040 625283 620704 614504 607147 599139 591295 584673 579995 576982 574329 570397 564018 554868 543567 531610
51026 531610 520817 512292 505920 501158 498196 497848 500390 505100 511168 518477 527128 536647 546215 555476
51012 555476 564612 573644 582098 589462 595694 601056 605591 608890 610459 610338 609270 608126 607205 606280 605237
50997 605237 604291 603602 603134 603112 604087 606279 609326 613115 618404 625990 635633 646546 658730 672976 689536
50982 689536 707750 727209 748389 771528 795601 819207 842155 865526 890424 917373 946893
50971 946893 979933 1017496 1060203 1108425 1162467 1222442 1288213 1359670 1436908 1520000 1608683
50960 1608683 1702251 1799486 1898592 1997434 2094033 2186709 2273660 2352697 2421660 2479078 2524360
50949 2524360 2557591 2579388 2590722 2592458 2585035 2568818 2544741 2514341 2479205 2440699 2400171 2358915
50937 2358915 2317694 2276698 2236305 2197529 2161247 2127059 2093422 2058966 2023386 1986975 1949603
50926 1949603 1910382 1868182 1822379 1773168 1721301 1667570 1612590 1557079 1502100 1448735 1397514
50915 1397514 1348355 1301099 1255929 1213286 1173621 1137264 1104349 1074816 1048545 1025375 1004794
50904 1004794 985824 967616 950176 934157 919928 907254 895894 885948 877385 869755 862732 856596
50892 856596 851815 848456 846303 845176 844742 844363 843717 843371 844271 846751 850433 854907 860061 865995 873150
50877 873150 882372 894197 908016 922500 936860 951258 966139 981861 999033 1018407 1040092 1063483
50865 1063483 1088281 1115032 1144362 1176334 1211069 1249458 1292630 1341116 1395208 1455864 1524598
50854 1524598 1602548 1690304 1788628 1898744 2021757 2158160 2308030 2471340 2647899 2837219
50844 2837219 3038497 3250495 3471207 3697641 3925763 4150536 4366196 4566866 4747108
50835 4747108 4902009 5027211 5119471 5177348 5201219 5192745 5154580 5090391 5004615 4902097 4788146
50824 4788146 4668744 4549908 4436420 4331176 4235644 4150392 4074990 4007828 3946444 3887889
50814 3887889 3828819 3765835 3696315 3618841 3532673 3437112 3331728 3216964 3094087 2964748
50804 2964748 2830932 2695098 2559752 2426818 2297803 2174551 2059221 1953284 1856896 1769477
50794 1769477 1690581 1619978 1557338 1502304 1454732 1414460 1380803 1352591 1328725 1308514 1291569
50783 1291569 1277634 1266560 1258096 1251542 1245777 1239786 1233158 1226077 1218995 1212320 1206125 1199965 1193088
50770 1193088 1185052 1176045 1166454 1156250 1145072 1132922 1120440 1108319 1096635 1085001 1073304 1062050
50758 1062050 1051936 1043290 1036108 1030578 1027331 1026998 1029541 1034157 1040014 1047109 1056423 1069226 1086223
50745 1086223 1107285 1131944 1160084 1192127 1228534 1269278 1314048 1363056 1417367 1478181 1545883
50734 1545883 1620039 1700281 1786847 1880177 1980233 2086325 2197363 2312063 2429060 2547089
50724 2547089 2665003 2781495 2894826 3002756 3102410 3189983 3260941 3311140 3338088 3341268 3321531
50713 3321531 3280603 3221088 3146507 3061082 2969525 2876847 2787689 2705301 2631124 2565522 2508855
50702 2508855 2461725 2424215 2394979 2371103 2348982 2325538 2298707 2266853 2228100 2180772 2124474
50691 2124474 2060321 1990042 1915317 1838070 1760619 1684888 1611727 1541541 1475347 1414622 1360288
50680 1360288 1312452 1271068 1236135 1207128 1182952 1162858 1147017 1135968 1129854 1128452 1131423 1138144
50668 1138144 1147602 1158846 1171261 1184137 1196407 1207394 1217548 1227894 1238875 1250238 1261842
50657 1261842 1273849 1286044 1297716 1308624 1319619 1331873 1345712 1360504 1375530 1390742 1406804
50646 1406804 1424649 1444949 1467918 1493646 1522481 1554730 1589980 1627250 1666112 1707222 1751232
50635 1751232 1797373 1843673 1888660 1932381 1975696 2018977 2061815 2103714 2144586 2184368 2222151
50624 2222151 2255788 2282396 2299438 2305617 2301164 2287706 2268004 2245454 2223228 2203447 2186981 2173902
50612 2173902 2164089 2157504 2154087 2153490 2154958 2157480 2160042 2161568 2160578 2155179 2143702 2125352 2100069 2067830
50598 2067830 2028454 1982134 1929876 1873170 1813325 1751244 1687681 1623543 1559970 1498236 1439435
50587 1439435 1384100 1332137 1283273 1237519 1195080 1155952 1119964 1087297 1058626 1034513 1014793
50576 1014793 998780 985984 976364 969939 966454 965491 966685 969809 974905 982404 992830 1006146 1021521
50563 1021521 1037830 1054252 1070389 1086262 1102437 1119768 1138591 1158442 1178874 1200197 1222791
50552 1222791 1246037 1268692 1290280 1311286 1331923 1351634 1370134 1388143 1406531 1425397 1444591
50541 1444591 1464629 1486442 1510673 1537890 1569105 1605217 1646077 1690736 1738475 1788957 1841695
50530 1841695 1896415 1954111 2016917 2086530 2163227 2246505 2335932 2430990 2530652 2633556 2738234
50519 2738234 2842833 2944995 3042432 3133370 3216170 3288772 3348875 3394459 3423964 3436346 3431394
50508 3431394 3409860 3372986 3322058 3258678 3185252 3104888 3020924 2936791 2856045 2782025 2717305
50497 2717305 2663607 2622136 2593730 2578689 2576657 2586689 2607238 2636008 2669906 2705259 2738108
50486 2738108 2764426 2780207 2781767 2766488 2733705 2684791 2622165 2548225 2465234 2375604 2281518
50475 2281518 2184354 2085198 1986001 1889498 1797720 1711205 1629979 1554642 1485937 1423782 1367383
50464 1367383 1316134 1269960 1229062 1193701 1163994 1139542 1119594 1103917 1093095 1087428 1086042 1087762
50452 1087762 1092547 1101283 1114324 1131094 1151158 1174841 1202595 1234383 1269924 1308879 1350320 1392279
50440 1392279 1432128 1467393 1496298 1517995 1532493 1540221 1541655 1537535 1529190 1518216 1505814 1492707
50428 1492707 1479502 1466606 1453928 1441363 1429565 1419607 1411760 1405352 1400125 1397094 1397674 1402432 1411100
50415 1411100 1423424 1439618 1460229 1485853 1516718 1552307 1591608 1633908 1678991 1726502 1775593
50404 1775593 1825382 1875218 1924182 1970991 2014795 2055446 2092326 2123443 2146435 2160230 2164935
50393 2164935 2160336 2145396 2119309 2082390 2035852 1981422 1921453 1858805 1796061 1734939 1676549
50382 1676549 1622008 1572674 1529979 1495092 1468513 1449951 1438829 1434896 1437987 1447195 1460632 1476150
50370 1476150 1491884 1505931 1516050 1520303 1518019 1509787 1496502 1478649 1456593 1431260 1404250 1377192
50358 1377192 1350965 1325497 1300171 1274237 1246799 1216740 1183119 1145923 1106323 1066073 1026675
50347 1026675 989167 954523 923890 898174 877409 860788 847376 836765 828963 823924 821419 821272
50335 821272 823380 827414 832786 839027 845954 853313 860526 867090 873111 879286 886402 894958 904981 915943
50321 915943 927013 937763 948569 960073 972279 984379 995360 1004453 1011167 1015409 1017775 1019321
50309 1019321 1020758 1021958 1022355 1021685 1020329 1019308 1020115 1024255 1032493 1044581 1059943 1078625 1101394 1129025
50295 1129025 1161789 1199508 1241447 1285493 1327385 1361298 1381991 1387069 1377650 1357058 1328804 1295469
50283 1295469 1258987 1221436 1185188 1152158 1123057 1097531 1075058 1055623 1039562 1027034 1017798
50272 1017798 1011357 1007044 1004105 1002041 1000951 1001352 1003547 1007358 1012459 1018708 1026029 1034262 1043340 1053444
50258 1053444 1064776 1077316 1090888 1105341 1120514 1136219 1152408 1169027 1185421 1200046 1211146
50247 1211146 1217718 1219697 1217476 1211573 1202710 1191836 1180082 1168834 1159590 1153297 1149779 1148014 1146791
50234 1146791 1144760 1140191 1131472 1118130 1100959 1081082 1059279 1036300 1013094 990325 967989 945975
50222 945975 924722 904941 886865 870135 854336 839340 825217 812117 800255 789803 780716 772709
50210 772709 765362 758353 751822 746499 743057 741182 739642 737506 734909 732304 729486 725957 721941 718253
50196 718253 715156 712034 708346 704304 700358 696513 692504 688226 683642 678583 673051 667542 662640 658362
50182 658362 654239 650014 645968 642538 639837 637562 635280 632833 630552 629006 628419 628475 628779 629296 630018 630455
50166 630455 630013 628905 628275 629174 631608 634701 637531 639705 641498 643784 647648 653764 662149 672558 684956
50151 684956 699403 715759 733787 753462 774887 797961 822392 847955 874436 901350 928033
50140 928033 954115 979794 1005732 1032879 1062160 1093723 1126322 1157737 1185993 1209911 1228508
50129 1228508 1240445 1244533 1240538 1229142 1211295 1187979 1160519 1130728 1100512 1071333 1043959 1018561
50117 1018561 995102 973746 954871 938618 924483 911435 898407 884810 870867 857513 845655
50106 845655 835372 826013 817166 809139 802331 796549 791356 786686 782593 778605 773988 768703 763655 759858
50092 759858 757656 756702 756350 756094 756062 757130 760120 764754 769812 774437 778866 783692 788894 793978 798767
50077 798767 803557 808589 813742 818752 823468 827809 831692 835077 837933 840062 841025 840512 838823 836774 834899
50062 834899 832853 829921 826091 822109 818411 814564 810195 805888 802514 799988 797508 794922 793070 792678
50048 792678 793617 795398 797792 800764 804475 809629 817096 826754 837227 847301 857163 867807 879633
50035 879633 892172 904844 917424 930021 943124 957512 973564 990704 1007935 1024762 1041206
50024 1041206 1057120 1072061 1085805 1098507 1110335 1121403 1132033 1142659 1153279 1163320 1172018
50013 1172018 1178671 1182451 1182363 1177558 1167549 1152132 1131375 1105854 1076796 1045916 1015067 985800
50001 985800 958993 934910 913698 895669 880975 869251 859838 852199 845911 840511 835668 831190 826479
49988 826479 820303 811643 800569 787770 773489 757666 741074 725401 711895 700433 690148 680406
49976 680406 670909 661476 652280 643998 637299 632289 628604 625748 623105 619995 616133 611883 607836 604329
49962 604329 601575 599941 599766 601037 603506 606989 611358 616480 622373 629176 636667 644095 650837 657001
49948 657001 662927 668329 672515 675416 677757 680004 681695 682140 681396 680092 678498 676283 673125 669106 664285
49933 664285 658315 650849 642137 632911 623731 614769 606136 598081 590828 584648 580113 577737 577070 576655 575456
49918 575456 574021 573710 575002 577178 579489 581811 584053 585774 586901 588395 591657 597376 605163 614098
49904 614098 623457 633123 643437 654427 665212 674563 682186 688909 695385 701124 705202 707383 707952 706791
49890 706791 703320 697317 689284 680030 670305 660761 651755 643159 634692 626501 619066 612572 606725 601192
49876 601192 595891 590814 585938 581410 577505 574309 571737 569957 569533 570935 574124 578754 584619 591751
49862 591751 600148 609511 619225 628661 637560 646164 654846 663680 672421 680798 688581 695485 701248 705845
49848 705845 709451 712164 713899 714484 713619 710845 705842 698856 690593 681663 672385 663174 654747 647674 641848
49833 641848 636666 631719 627131 623223 620137 617940 616988 617777 620260 623509 626502 629261 632813 637948 644373
49818 644373 651246 658092 664829 671298 677310 682991 688547 693733 697981 701021 703003 704030 703973 702732 700303
49803 700303 696636 691869 686705 682093 678405 675240 671974 668121 663187 656819 649235 641009 632369 623257
49789 623257 614204 606354 600199 594898 589402 583832 579175 576009 574139 573200 572979 573240 573823 574924 576886
49774 576886 579709 583206 587541 593142 599983 607361 614504 621107 627187 632667 637312 640973 643771 646031
49760 646031 647963 649378 649817 648957 646709 642925 637437 630564 623173 615942 608888 602010 595988 591715 589337
49745 589337 588231 587702 587168 586009 584042 582096 581294 581631 582010 581900 582205 584110 587672 592001 596376 600671
49729 600671 605076 609914 615496 621755 628236 634807 642137 651082 661736 673363 685080 696253 706444
49716 706444 715369 722843 728511 731821 732564 731216 728399 724179 718318 711075 703357 696223 690649 687551
49702 687551 687346 689312 691898 693921 695173 695826 695759 694716 692786 690360 687825 685543 683908 683204 683503 684867
49686 684867 687500 691538 696789 702859 709507 716903 725732 737006 751472 769037 788921 810322 832396
49673 832396 853465 870885 882390 887525 887530 884061 878513 872268 866786 863122 861678 862563 865816 871062
49659 871062 877171 882423 884979 883315 876719 865580 851059 834374 816585 798896 782546 768129
49647 768129 755458 744402 735496 729324 725607 723455 722334 722279 723298 725090 727351 729765 731569 731736
49633 731736 729873 726565 722486 717552 711362 704160 696813 689933 683507 677435 671932 667172 662883 658675
49619 658675 654637 651287 648937 647387 646351 645931 646415 647700 649174 650245 650829 651278 652042 653566 656178
49604 656178 659747 663495 666569 668800 670601 672098 672796 672332 671233 670531 670789 671841 673424 675635 678613
49589 678613 681973 684835 686494 687046 687255 687760 688495 689008 689242 689677 690700 692148 693662 695145 696664 698229
49573 698229 700050 702756 706929 712492 718917 725968 733884 742932 753137 764341 776030 787070 796195
49560 796195 803006 808140 812251 815121 815971 814356 810552 805352 799770 794662 790375 786837 784106 782584
49546 782584 782520 783543 784934 786204 787245 788137 789029 790049 791229 792741 795300 799864 806585 814435 822335
49531 822335 830377 839541 850543 863607 879179 898018 920444 946069 974343 1004713 1035820 1065068
49519 1065068 1089538 1107401 1118519 1124210 1126733 1128525 1131256 1135474 1141235 1148705 1157805 1167521 1176156
49506 1176156 1182356 1185474 1184876 1179413 1168124 1151390 1131050 1109161 1086743 1063832 1040557 1017845
49494 1017845 996976 978705 962999 949409 937426 926622 916873 908521 901958 896957 892760 888971
49482 888971 886039 884590 884530 885075 885443 885207 884253 882847 881691 881443 882064 882902 883547 884322 885811 888171 891146
49465 891146 894581 898578 903141 907931 912556 916995 921480 925979 930002 933126 935520 937679 939647 940910
49451 940910 941194 941049 941349 942420 944002 945955 948564 952077 956252 960557 964695 968827 973310 978235 983180
49436 983180 987568 991434 995729 1001736 1010324 1021974 1037211 1056301 1078366 1101347 1123237 1143167
49424 1143167 1161241 1177879 1193689 1209355 1224678 1237625 1244991 1244488 1236242 1222495 1206241 1190058
49412 1190058 1175545 1163404 1154096 1148487 1147626 1151833 1160389 1172312 1187094 1204476 1223891 1244594
49400 1244594 1266105 1288140 1310230 1331863 1352895 1373349 1392810 1410463 1425818 1438936 1449742
49389 1449742 1457549 1461498 1461254 1457073 1449530 1439452 1427766 1414989 1401002 1385621 1369292 1352992
49377 1352992 1337621 1323825 1312190 1303098 1296378 1291501 1288209 1286571 1286324 1286603 1286611 1286328 1286260 1286595 1286808 1286018
49361 1286018 1283514 1278962 1272305 1263612 1253047 1240939 1227848 1214506 1201703 1190099 1179972 1171046
49349 1171046 1162810 1155186 1148733 1143954 1140580 1137808 1135139 1132631 1130370 1128124 1125575 1122587 1119278 1116200
49335 1116200 1114561 1115787 1120654 1129173 1141461 1158251 1180167 1206717 1236235 1266540 1295408 1320911
49323 1320911 1341850 1357892 1369115 1375712 1378287 1377822 1374608 1367406 1354424 1335261 1311462 1285232
49311 1285232 1258170 1231337 1205839 1182796 1162865 1146148 1132593 1122372 1115868 1113226 1113848 1116499
49299 1116499 1120164 1124645 1130061 1135941 1141228 1145134 1147538 1148551 1148154 1146367 1143329 1139007 1133110 1125487
49285 1125487 1116381 1106350 1096370 1087961 1082557 1080460 1080884 1083274 1088057 1095719 1105750 1117076 1129070
49272 1129070 1141383 1153134 1163154 1171007 1176967 1180851 1181666 1178785 1172781 1164634 1154730 1143344 1131645
49259 1131645 1121234 1112642 1105237 1098968 1095357 1095945 1100158 1105633 1110588 1114982 1119084 1121913 1121862 1118289
49245 1118289 1111676 1102515 1091022 1077937 1064650 1052157 1040524 1029635 1019858 1011572 1004749 999501
49233 999501 996541 996435 998714 1002336 1006773 1012031 1017918 1024069 1030636 1038170 1046643 1055284 1063636 1072239
49219 1072239 1081899 1092684 1104000 1115339 1126580 1137709 1148581 1158923 1168442 1177039 1185073 1193283
49207 1193283 1202333 1212535 1224054 1237121 1251836 1267954 1285032 1302672 1320431 1337657 1353678
49196 1353678 1368185 1381305 1393383 1404809 1415900 1426707 1436988 1446516 1455348 1463598 1471103 1477635
49184 1477635 1483567 1489987 1497968 1507895 1519617 1533102 1548741 1567151 1588997 1614988 1645768 1681583
49172 1681583 1722060 1766207 1812423 1858424 1901424 1938745 1968520 1990123 2004295 2012958 2018480 2022621
49160 2022621 2026062 2028888 2031257 2033356 2035083 2036314 2037431 2039136 2041771 2045370 2050406 2057752 2067557 2078761
49146 2078761 2090294 2102368 2115966 2131369 2147869 2164863 2182436 2200682 2219106 2237134 2254879
49135 2254879 2272916 2291459 2310150 2328634 2347018 2365547 2384037 2401867 2418578 2434248 2449210
49124 2449210 2463643 2477730 2492058 2507450 2524382 2542936 2563322 2586001 2611204 2639110 2671023
49113 2671023 2709963 2759556 2822678 2901637 2999069 3117345 3256458 3412544 3578514 3746486
49103 3746486 3911157 4072275 4233123 4393814 4544365 4665499 4738817 4758096 4731692 4674577
49093 4674577 4597737 4503500 4388942 4252829 4099800 3938941 3779267 3626810 3485089 3356701
49083 3356701 3243608 3146485 3064713 2996942 2941325 2895594 2857600 2825839 2799193 2776440 2756522
49072 2756522 2739005 2723713 2710036 2697210 2685167 2674394 2664845 2655662 2646126 2636282 2626247 2615475
49060 2615475 2603299 2589987 2576737 2564564 2553445 2542578 2531307 2519819 2509100 2500262 2493792 2489332
49048 2489332 2486058 2483150 2479896 2475573 2469494 2461327 2451355 2440343 2429040 2417852 2407114 2397564 2390271
49035 2390271 2385910 2384320 2384865 2386952 2389967 2393061 2395441 2396890 2397643 2397801 2397146 2395524 2393066 2389958 2386300
49020 2386300 2382267 2378168 2374300 2370939 2368478 2367227 2366999 2367211 2367545 2368309 2370026 2372851 2376436 2380069 2382882
49005 2382882 2384329 2384713 2384999 2385848 2387003 2387800 2388007 2387836 2387347 2386296 2384508 2382028 2378857 2374859 2370051 2364742
48989 2364742 2359269 2353742 2348125 2342423 2336638 2330692 2324522 2318258 2312156 2306293 2300352 2293745 2286101 2277685
48975 2277685 2269236 2261248 2253419 2245038 2235966 2226991 2219020 2212128 2205770 2199850 2195164 2192573 2192125 2193308
48961 2193308 2195942 2200371 2206836 2215116 2224907 2236157 2248876 2262918 2278148 2294462 2311469 2328533
48949 2328533 2345516 2363088 2381819 2401142 2419799 2437215 2453892 2470498 2487315 2504810 2524051
48938 2524051 2545959 2570442 2596765 2624580 2654196 2685898 2719489 2754643 2791395 2830104 2871026
48927 2871026 2914027 2958694 3004684 3051920 3100488 3150426 3201709 3254298 3307949 3362017 3415765
48916 3415765 3468931 3521716 3574132 3625703 3675964 3724869 3772406 3818098 3861317 3901958 3940428
48905 3940428 3977087 4012030 4045260 4076615 4105544 4131455 4154398 4175029 4193681 4209856 4222931
48894 4222931 4233104 4241289 4248142 4253490 4256757 4257736 4256825 4254573 4251043 4245701 4237898 4227429 4214486 4199172
48880 4199172 4181317 4160853 4138075 4113237 4085987 4055523 4021432 3984177 3944643 3903313 3860034
48869 3860034 3814568 3767194 3718755 3670220 3622292 3575419 3530066 3486892 3446502 3408939 3373451
48858 3373451 3339000 3305165 3272457 3241617 3212757 3185472 3159619 3135590 3113716 3093839 3075713
48847 3075713 3059551 3045841 3034813 3026408 3020572 3017204 3015879 3016125 3018026 3022209 3029098 3038449 3049715
48834 3049715 3062470 3076304 3090716 3105495 3120972 3137445 3154472 3171153 3187150 3203015 3219388
48823 3219388 3236189 3252797 3268798 3284277 3299563 3315028 3331089 3348014 3365498 3382625 3398562
48812 3398562 3413383 3428129 3444006 3461548 3480454 3500090 3520043 3540385 3561549 3583946 3607569
48801 3607569 3631906 3656306 3680440 3704359 3728102 3751382 3773743 3794902 3814774 3833153 3849545
48790 3849545 3863485 3874988 3884541 3892593 3899112 3903664 3905839 3905523 3902838 3897951 3890924 3881614 3869687
48777 3869687 3854851 3837047 3816325 3792583 3765666 3735779 3703524 3669383 3633352 3595307 3555522
48766 3555522 3514545 3472668 3429845 3386223 3342518 3299730 3258584 3219229 3181397 3144847 3109769
48755 3109769 3076718 3046078 3017610 2990710 2964971 2940311 2916677 2893997 2872490 2852669 2834955
48744 2834955 2819540 2806679 2796759 2789858 2785483 2782997 2782149 2783051 2785805 2790323 2796333 2803440 2811421 2820491
48730 2820491 2830872 2841876 2852007 2860468 2868223 2876870 2886678 2896448 2905256 2913450 2921632 2929378 2935613
48717 2935613 2939918 2942915 2945445 2947804 2949828 2951423 2952845 2954485 2956424 2958281 2959660 2960706 2961954 2963589
48703 2963589 2965176 2966306 2967269 2968836 2971554 2975419 2980114 2985268 2990590 2995935 3001230 3006254 3010609 3014056
48689 3014056 3016791 3019292 3022064 3025642 3030530 3036790 3043785 3050691 3057311 3064257 3072428 3082503 3094792
48676 3094792 3109327 3126162 3145933 3170064 3200125 3236831 3279594 3326659 3375196 3421395 3461053
48665 3461053 3490378 3506215 3505962 3488160 3453577 3405181 3346596 3280700 3209753 3136238 3062879 2991986
48653 2991986 2925184 2863662 2808178 2758798 2715038 2676339 2642200 2611935 2584669 2559654 2536341
48642 2536341 2514130 2492408 2470948 2450025 2430026 2411193 2393742 2377804 2362984 2348346 2333267
48631 2333267 2318126 2303757 2290356 2277384 2264509 2252129 2240761 2230357 2220579 2211438 2203305 2196460
48619 2196460 2191015 2187176 2185125 2184617 2185047 2185989 2187297 2188654 2189468 2189432 2188790 2187733 2185874 2182706 2178319 2173273
48603 2173273 2168069 2163253 2159772 2158416 2158714 2159013 2157968 2155612 2152807 2150137 2147596 2144861 2141409 2136667
48589 2136667 2130499 2123322 2115328 2105735 2093288 2077482 2058988 2038934 2018124 1996905 1975454 1954107
48577 1954107 1933633 1915073 1899028 1885240 1873246 1863262 1855896 1851086 1847946 1845803 1844601 1843948 1842467
48564 1842467 1838806 1832898 1825527 1816858 1806196 1793182 1778495 1763169 1747798 1732721 1718342 1704798
48552 1704798 1691620 1678250 1664679 1651144 1637426 1623030 1607964 1592825 1578018 1563480 1549322
48541 1549322 1536183 1524557 1514128 1504125 1494120 1484154 1474426 1465297 1457337 1450888 1445719 1441635 1439289
48528 1439289 1439779 1443412 1449465 1457259 1466786 1477880 1489304 1499091 1505562 1507721 1505257 1498783 1489880 1480235
48514 1480235 1470640 1461164 1452198 1444811 1439951 1437648 1437191 1437922 1439738 1443033 1448235 1455331 1463780 1472899
48500 1472899 1482217 1491315 1499410 1505270 1507555 1505336 1498582 1488330 1476056 1462527 1447404 1430316 1412120
48487 1412120 1394627 1379098 1365377 1352510 1339809 1327278 1315493 1305206 1296773 1289780 1283460 1277559
48475 1277559 1272454 1268439 1265308 1262813 1260992 1259768 1258654 1257344 1256302 1256255 1257223 1258565 1259929 1261642 1264030
48460 1264030 1266806 1269412 1271618 1273409 1274462 1274149 1272160 1268844 1264831 1260496 1255909 1251066 1245856 1239945
48446 1239945 1233055 1225435 1217692 1209988 1201692 1192134 1181459 1170420 1159498 1148647 1137851 1127449
48434 1127449 1117747 1108662 1100033 1092078 1085228 1079579 1074700 1070056 1065520 1061436 1058181 1055620 1053101 1050142
48420 1050142 1047122 1045033 1044356 1044262 1043170 1040217 1036094 1032320 1029735 1027857 1025701 1022859 1019528 1015837 1011724
48405 1011724 1007476 1003727 1000609 997369 993263 988472 983666 978973 973928 968352 962724 957625 953256 949527
48391 949527 946200 942895 939387 936093 933930 933439 934183 935182 935876 936516 937626 939204 940523 940840 940197 939347
48375 939347 938953 939162 939959 941529 944120 947966 953518 961269 971152 982699 995976 1011586 1029117 1046304
48361 1046304 1060506 1070633 1077068 1080341 1080847 1079427 1077162 1074706 1072531 1071515 1072480 1075445 1080187 1087163
48347 1087163 1097020 1109617 1124503 1141918 1162262 1185178 1210402 1239038 1272609 1311352 1354797
48336 1354797 1403507 1458665 1520703 1590234 1669833 1762958 1871962 1999611 2151822 2336479
48326 2336479 2561300 2837302 3184532 3631863 4214644 4979775 5990522 7312960 8989621
48317 8989621 11027243 13398194 16017050 18684329 21066968 22788705 23593860 23453375
48309 23453375 22530517 21059655 19251376 17271254 15254489 13310847 11516872 9913098
48301 9913098 8511325 7305424 6280929 5421322 4709199 4124651 3646142 3254170 2932983
48292 2932983 2669221 2451416 2271239 2123008 2001063 1899194 1813067 1741239 1682812 1635494
48282 1635494 1596742 1565312 1540555 1521242 1506128 1494940 1487842 1484397 1483729 1485239 1488561 1493200 1498698
48269 1498698 1504910 1511814 1519415 1528011 1538177 1550178 1563725 1578464 1594342 1611321 1628950 1646222
48257 1646222 1661563 1672994 1678862 1678701 1673345 1664319 1653223 1641352 1629412 1617645 1606462 1596631
48245 1596631 1588515 1581538 1574890 1568459 1562567 1557236 1552338 1548015 1544176 1539961 1534638 1528684 1522983 1517174
48231 1517174 1509970 1501099 1491679 1482381 1472313 1460209 1445862 1429889 1412784 1394657 1375267 1353907
48219 1353907 1329818 1303192 1275260 1247058 1218575 1189410 1159654 1129728 1099876 1070333 1041619
48208 1041619 1014177 987898 962331 937199 912556 888726 866255 845651 826951 809770 793782
48197 793782 778843 764716 751184 738486 727119 717129 708116 699957 692899 686797 681009 675287 670089
48184 670089 665669 661525 657194 652945 649197 645730 642035 638021 633921 629907 626260 623439 621435 619457
48170 619457 616819 613824 611266 609363 607750 606212 604822 603562 602381 601483 600973 600419 599299 597820 596727
48155 596727 596364 596431 596605 596892 597362 598105 599460 601778 604825 607889 610595 613163 615761 618086 619897 621565
48139 621565 623677 626297 628947 631237 633204 635061 636914 638827 640969 643479 646207 648820 651202 653630
48125 653630 656393 659426 662560 665955 669901 674189 678157 681538 684927 689143 694473 700729 707684 715076
48111 715076 722523 730053 738531 748943 761163 773996 786686 799915 814937 832015 850202 868608
48099 868608 887400 907374 928835 951261 973991 996873 1020070 1043542 1067063 1090643 1114599
48088 1114599 1139087 1163804 1188260 1212203 1235658 1258687 1281205 1302964 1323672 1343110 1361115
48077 1361115 1377488 1392134 1405455 1418320 1431293 1443983 1455617 1466175 1476491 1487173 1497982
48066 1497982 1508450 1518549 1528335 1537363 1544989 1551084 1556046 1560267 1563945 1567251 1570204 1572302 1572634 1570508
48052 1570508 1565873 1559168 1550912 1541434 1530817 1519048 1506232 1492598 1478282 1463234 1447361 1430581
48040 1430581 1412666 1393282 1372360 1350258 1327400 1303933 1279846 1255240 1230304 1205139 1179753
48029 1179753 1154061 1127867 1101090 1074178 1047925 1022743 998384 974660 952016 930965 911219
48018 911219 891921 872685 853965 836361 819918 804182 788755 773705 759602 747132 736549
48007 736549 727531 719628 712651 706525 701000 695828 691068 686923 683376 680222 677338 674766 672645 671252
47993 671252 670828 671060 671019 670050 668622 667821 668062 668719 669004 668678 667805 666291 664041 661342 658722 656502 654610
47976 654610 652809 650917 648788 646217 643061 639550 636303 633793 631805 629708 627282 624963 623209 622011
47962 622011 621174 620670 620426 620250 620338 621460 624098 627702 631361 634985 639240 644489 650483 657027 664307 672423
47946 672423 681215 690677 701009 712108 723547 735282 747887 761762 776496 791338 805941 820342
47934 820342 834477 848098 861023 873145 884228 893902 901895 908144 912718 915621 916656 915542 912380
47921 912380 907860 902766 897224 890688 882642 873088 862407 851071 839532 828034 816454 804617 792858
47908 792858 781950 772299 763517 754956 746512 738742 732319 727484 723913 721101 718985 718088 718877 721126
47894 721126 724199 727827 732213 737482 743580 750725 759330 769271 779757 790290 801333 813633 827197
47881 827197 841244 854947 867886 879964 891233 901709 911171 919210 925583 930350 933627 935450 935944
47868 935944 935242 933087 928845 922205 913518 903275 891606 878572 864549 849897 834552 818439 802094
47855 802094 786406 771811 758153 745297 733428 722678 712842 703689 695379 688415 683206 679675 677306
47842 677306 675641 674726 674925 676303 678486 681211 684637 688871 693515 698094 702759 708147 714476 721086 727019
47827 727019 731924 736382 741293 746920 752611 757637 762181 767129 772918 779159 785529 792445 800464 809484
47813 809484 819101 829472 841311 855190 871174 888863 907434 925998 944409 963391 983271 1002884
47801 1002884 1020458 1035363 1048231 1059460 1068475 1074576 1077703 1078070 1075793 1071253 1065250 1058409 1050832
47788 1050832 1042588 1034100 1025805 1017905 1010775 1005107 1001293 999121 998359 999112 1001149 1003490 1005314 1006900
47774 1006900 1008897 1010844 1011201 1008866 1004045 997503 989520 979745 967727 953446 937610 921487 906129
47761 906129 891645 877530 863724 850985 840187 831573 824820 819450 815046 811453 808995 808215 809150
47748 809150 811185 813869 817567 822954 830110 838570 848206 859546 873144 888979 906640 925773 946170
47735 946170 967679 990269 1014005 1038682 1063542 1087632 1110438 1132008 1152443 1171560 1189173
47724 1189173 1205411 1220399 1233704 1244408 1251818 1255920 1257056 1255453 1251186 1244300 1234647 1221775 1205446
47711 1205446 1186277 1165500 1144009 1121955 1099323 1076479 1053940 1032060 1011302 992470 976171
47700 976171 962227 950101 939698 931312 924929 920251 917414 916961 918966 922835 928263 935754 945763
47687 945763 957956 971863 987696 1005790 1025569 1045929 1066500 1087726 1109711 1131744 1153141
47676 1153141 1173804 1193689 1212356 1229371 1244635 1257935 1268623 1276191 1280832 1283026 1282860 1280142
47664 1280142 1274858 1267044 1256339 1242243 1224930 1205527 1185542 1166044 1147198 1128311 1108497 1087655
47652 1087655 1066804 1047282 1029741 1014143 1000464 988883 979243 970832 962980 955758 949918 946191
47640 946191 944686 944860 946012 947862 950622 954551 959595 965613 972831 981823 993012 1006217 1020665 1035452
47626 1035452 1050139 1065054 1080790 1097290 1113542 1128318 1140984 1151384 1159207 1163879 1164962 1162270
47614 1162270 1155625 1144860 1130045 1111421 1089161 1063539 1035386 1005972 976315 946817 917585
47603 917585 888794 860678 833506 807720 783849 762176 742636 725060 709246 694858 681616
47592 681616 669610 659040 649580 640572 631991 624669 619133 614723 610317 605611 601146 597417 594539 592579
47578 592579 591485 590671 589325 587332 585406 584110 583152 581826 579763 577045 573972 571025 568733 567225 566010
47563 566010 564430 562151 559135 555453 551424 547667 544606 542040 539526 536959 534403 531603 528308 525025
47549 525025 522803 522018 521843 521207 519898 518429 517182 516059 514726 512880 510454 507853 505793 504611 503940
47534 503940 503342 502937 502972 503120 502849 502382 502625 504052 506211 508414 510285 511491 511651 510974 510480 511087 512707
47517 512707 514600 516283 517718 518938 519951 520842 521568 521849 521674 521663 522506 524150 526009 527769 529464 530962
47501 530962 532030 532866 533913 535027 535491 535087 534532 534486 534679 534509 534073 534010 534508 535052 535176 535006 534938 535107 535337
47482 535337 535453 535427 535317 535244 535485 536492 538610 541688 545084 548224 551073 553901 556714 559276 561624 564142
47466 564142 566950 569624 571809 573840 576273 578985 581179 582338 582804 583252 583897 584486 584934 585645 587204 589889
47450 589889 593571 597924 602602 607429 612678 619207 627932 639026 651778 665386 679666 694770 710560
47437 710560 726692 743176 760256 777703 794737 810817 826008 840274 852887 862995 870491 875874
47425 875874 879468 881255 881347 880007 877156 872391 865727 857950 849970 842051 833978 825668 817255 808676 799640
47410 799640 790159 780741 771825 763196 754279 744968 735877 727683 720474 713938 707963 702741 698375 694707
47396 694707 691633 689259 687601 686303 684918 683427 682368 682493 684302 687810 692563 697933 703526 709324
47382 709324 715445 721901 728621 735579 742770 750149 757681 765261 772430 778361 782434 784772 785961 786299
47368 786299 785565 783466 779898 774664 767379 758022 747383 736578 726102 715591 704447 692447 679751
47355 679751 666717 653876 641842 630922 620826 610959 601022 591290 582321 574509 567820 561842 556086
47342 556086 550395 545116 540802 537746 535766 534313 532759 530784 528724 527412 527389 528319 529440 530485 531806
47327 531806 533601 535556 537447 539600 542428 545780 549132 552198 555019 557688 560310 563009 565605 567466
47313 567466 568129 567930 567556 567137 566332 565236 564490 564400 564548 564602 565007 566505 569315 573131 577611 582504 587563
47296 587563 592766 598582 605669 614287 624134 634703 645656 656979 668958 682030 696547 712721
47284 712721 730783 750980 773366 797671 823318 849208 873455 893792 908691 918054 922819 924147
47272 924147 923058 920297 916125 910490 903777 897106 891467 886717 881928 876632 871167 865786 860018 853241
47258 853241 845626 838130 831598 825977 820411 814038 806721 798966 791175 783164 774549 765416 756364 748004
47244 748004 740625 734246 728698 723654 718863 714375 710384 706887 703799 701372 700126 700275 701492 703393
47230 703393 705987 709454 713755 718737 724488 731255 739065 747654 756768 766269 775846 784956 793290 801149
47216 801149 808996 816639 823132 827655 830255 831554 831978 831512 830035 827487 823754 818774 812842 806440 799713
47201 799713 792474 784910 777909 772378 768473 765785 764083 763553 764435 766731 770224 774588 779566 785279 792296
47186 792296 801149 811788 823650 836191 849222 862918 877719 894126 912315 931890 952203 972827
47174 972827 993664 1014621 1035354 1055256 1073645 1090190 1105284 1119665 1133442 1145770 1155793
47163 1155793 1163577 1169672 1174048 1176123 1175777 1173649 1170247 1165372 1158807 1151129 1143362 1135969 1128561 1120617
47149 1120617 1112189 1103812 1095881 1088398 1081368 1075229 1070559 1067398 1065230 1063798 1063534 1064951 1067990 1072325
47135 1072325 1078011 1085201 1093440 1101865 1110157 1118748 1127985 1137540 1146807 1155452 1163289 1169911 1174667 1176919
47121 1176919 1176301 1172905 1167203 1159490 1149515 1136952 1122187 1106202 1089666 1072601 1054987 1037166
47109 1037166 1019379 1001413 983093 964846 947447 931353 916496 902571 889329 876652 864483
47098 864483 852661 840986 829599 819144 810174 802512 795640 789653 785297 783072 782871 784496 787842
47085 787842 792365 797137 801831 807068 813373 820375 827479 834784 842745 851357 860223 869033 877392 884633
47071 884633 890468 895550 900680 905707 909867 913048 915892 918735 921136 922537 922795 922028 920609 919412 919432
47056 919432 920901 923223 925957 929348 933703 938754 944043 949574 955747 962878 971064 980330 990565 1001371
47042 1001371 1012210 1022773 1033166 1043725 1054664 1065882 1077191 1088646 1100453 1112457 1124137
47031 1124137 1135354 1146750 1159004 1171997 1185170 1198404 1211853 1225085 1237233 1248134 1258506
47020 1258506 1268652 1277565 1283783 1286743 1286955 1285277 1282431 1278833 1274357 1268411 1260625 1251435 1241696 1231814
47006 1231814 1221565 1210756 1199864 1189977 1182129 1176507 1172293 1168381 1164369 1160676 1157791 1155793 1154677
46993 1154677 1154739 1156341 1159631 1164705 1171735 1180610 1190728 1201480 1212734 1224537 1236661 1248853 1261390
46980 1261390 1274913 1289692 1305462 1321925 1339061 1356853 1375013 1393061 1410553 1427211 1443045
46969 1443045 1458305 1473141 1487351 1500618 1512893 1524282 1534640 1543519 1550571 1555845 1559756 1562876
46957 1562876 1565584 1567621 1568263 1567283 1565593 1564479 1564266 1564294 1564226 1564744 1566723 1570260 1574876 1580262 1586329 1592909
46941 1592909 1599928 1607743 1616838 1627241 1638634 1651030 1664855 1680278 1696840 1713954 1731547 1749964
46929 1749964 1769348 1789308 1809081 1827888 1845134 1860386 1873273 1883482 1890836 1895217 1896260 1893197
46917 1893197 1885322 1872732 1856496 1838004 1818211 1797473 1775818 1753188 1729599 1705409 1681437
46906 1681437 1658599 1637416 1618061 1600907 1586703 1575986 1568555 1563880 1562008 1563800 1570203 1581486
46894 1581486 1597200 1616578 1638769 1662971 1688776 1716386 1746230 1778199 1811440 1844946 1878137
46883 1878137 1910742 1942273 1971871 1998666 2022151 2042259 2059253 2073590 2085795 2096306 2105353
46872 2105353 2112937 2118961 2123491 2126994 2130325 2134349 2139561 2146058 2153873 2163230 2174488 2187849 2203201
46859 2203201 2220282 2238977 2259409 2281620 2305138 2328930 2351834 2373038 2392175 2409104 2423652
46848 2423652 2435515 2444372 2450138 2453065 2453416 2451035 2445498 2436804 2425613 2412596 2397927 2381820 2365335
46835 2365335 2349996 2336548 2324598 2313717 2304461 2297983 2294977 2295350 2298728 2304881 2313729 2325227 2339295
46822 2339295 2355677 2373887 2393371 2413608 2433981 2453715 2472121 2488748 2503144 2514702 2522999
46811 2522999 2528047 2529878 2528030 2521940 2511838 2498786 2483680 2466582 2447204 2425757 2403031 2379796
46799 2379796 2356392 2332895 2309470 2286497 2264307 2242867 2221832 2201036 2180898 2162208 2145505
46788 2145505 2130739 2117445 2105117 2093505 2082751 2073240 2065208 2058512 2052883 2048205 2044359 2040934 2037417
46775 2037417 2033617 2029703 2025900 2022383 2019295 2016534 2013691 2010593 2007815 2006140 2005624 2005724 2006333 2007985 2010937
46760 2010937 2014789 2019380 2025428 2033738 2044174 2055866 2068150 2080862 2094057 2107799 2122034 2136289
46748 2136289 2149833 2162451 2174719 2187097 2199150 2210171 2220181 2229653 2238499 2246071 2252156 2257352
46736 2257352 2262457 2267973 2274149 2280956 2287965 2294802 2301755 2309404 2317639 2325632 2332894 2339881 2347361 2355642
46722 2355642 2364560 2373736 2382658 2390918 2398549 2405715 2412021 2416694 2419578 2421287 2422019 2420841 2416732 2409839
46708 2409839 2401046 2390525 2377389 2360795 2340958 2319007 2296126 2272728 2248240 2221767 2193208
46697 2193208 2163627 2134300 2105598 2077080 2048461 2020046 1992247 1965196 1938973 1913915 1890513
46686 1890513 1869128 1849848 1832435 1816352 1801025 1786209 1772021 1758576 1745727 1733240 1721148
46675 1721148 1709844 1699862 1691555 1684930 1679762 1675878 1673405 1672813 1674731 1679626 1687542 1698189 1711357
46662 1711357 1727229 1746143 1768063 1792464 1818709 1846356 1875001 1904059 1932859 1960877 1987714
46651 1987714 2012889 2035705 2055374 2071406 2083998 2093913 2101772 2107519 2110870 2112196 2112597 2113096 2114157
46638 2114157 2116112 2119613 2125389 2133877 2145402 2160395 2179067 2201068 2225826 2253068 2282680 2314191
46626 2314191 2346739 2379466 2411585 2442037 2469490 2492841 2511576 2525559 2534608 2538367 2536565 2529313
46614 2529313 2517026 2499924 2477789 2450503 2418840 2384313 2348119 2310678 2272399 2234315 2197404
46603 2197404 2161687 2126636 2092256 2059151 2027633 1997536 1968974 1942544 1918412 1895735 1873429
46592 1873429 1851212 1829577 1808992 1789517 1770995 1753215 1735863 1718585 1701210 1683854 1666805
46581 1666805 1650347 1634610 1619528 1604987 1591032 1577858 1565618 1554339 1544065 1534909 1526957 1520198
46569 1520198 1514574 1509954 1506058 1502594 1499587 1497343 1495903 1494645 1492668 1489707 1486535 1484302 1483457 1483488 1483761
46554 1483761 1484432 1486222 1489387 1493316 1497246 1501046 1505054 1509531 1514594 1520406 1527054 1534359 1542173 1550740
46540 1550740 1560394 1571012 1582148 1593666 1605933 1619469 1634780 1652325 1672146 1693552 1715672
46529 1715672 1738373 1762187 1787388 1813701 1840927 1869138 1898009 1926617 1954326 1981356 2008083
46518 2008083 2034234 2059250 2083055 2105861 2127375 2146706 2163075 2176387 2187192 2196262 2204005 2210087
46506 2210087 2213880 2215458 2215765 2215566 2214637 2212372 2208714 2204027 2198463 2192145 2185597 2179217 2172404 2163977 2153505
46491 2153505 2141572 2128728 2114879 2099805 2083496 2065706 2045884 2024046 2001071 1977600 1953041
46480 1953041 1926306 1897253 1866785 1835676 1804003 1771729 1739263 1707113 1675402 1644084 1613488
46469 1613488 1584372 1557462 1533089 1511265 1491930 1475122 1461000 1449802 1441671 1436477 1433895 1433810
46457 1433810 1436562 1442580 1451714 1463117 1475901 1489693 1504438 1519893 1535609 1551215 1566422 1580772
$$ [...]
##END NTUPLES=NMR SPECTRUM
##END=
