##TITLE=AC1765_NAR_18_9683510_0nNJ3rwyda
##JCAMPDX= 6.0         $$ Bruker NMR JCAMP-DX V2.0
##DATA TYPE= NMR SPECTRUM
##DATA CLASS= NTUPLES
##ORIGIN= BRUKER
##OWNER= Administrator
$$ 1.72 TOPSPIN		Version 2.1
$$ 2016-04-16 22:26:38.329 -0700  Administrator@X
$$ Compression mode = diff/dup
##.OBSERVE FREQUENCY= 400.02188249412
##.OBSERVE NUCLEUS= ^1H
##.ACQUISITION MODE= SIMULTANEOUS (DQD)
##.ACQUISITION SCHEME= undefined
##.AVERAGES= 8
##.DIGITISER RES= 22
##SPECTROMETER/DATA SYSTEM= spect
##.PULSE SEQUENCE= zg30
##.SOLVENT NAME= COFFEE_meoh
##.SHIFT REFERENCE= INTERNAL, COFFEE_meoh, 1, 14.98509
##AUDIT TRAIL= $$ (NUMBER, WHEN, WHO, WHERE, PROCESS, VERSION, WHAT)
$$ ##TITLE= Audit trail, TOPSPIN		Version 2.1
$$ ##JCAMPDX= 5.01
$$ ##ORIGIN= Bruker BioSpin GmbH
$$ ##OWNER= Administrator
$$ $$ E:\/data/COFFEE/nmr/AC1765_NAR_18_9683510_0nNJ3rwyda/10/pdata/1/auditp.txt
$$ ##AUDIT TRAIL=  $$ (NUMBER, WHEN, WHO, WHERE, PROCESS, VERSION, WHAT)
(   1,<2016-04-16 22:26:31.204 -0700>,<Administrator>,<X>,<go>,<TOPSPIN 2.1>,
      <created by zg
	started at 2016-04-16 22:25:25.392 -0700,
	POWCHK enabled, PULCHK disabled,
       configuration hash MD5:
       21 0F 79 D6 B3 7B B4 F6 88 20 88 DB 03 48 BD 9F
       data hash MD5: 64K
       0B 05 A5 31 1F 6A BC A1 6A C2 00 F8 9C 92 BB 0D>)
(   2,<2016-04-16 22:26:34.298 -0700>,<Administrator>,<X>,<proc1d>,<TOPSPIN 2.1>,
      <Start of raw data processing
       efp LB = 0 FT_mod = 6 PKNL = 1 PHC0 = 0 PHC1 = 0 SI = 32K 
       data hash MD5: 32K
       BE D2 95 46 08 63 D2 E6 05 34 53 C4 6A FA C0 A4>)
(   3,<2016-04-16 22:26:34.579 -0700>,<Administrator>,<X>,<proc1d>,<TOPSPIN 2.1>,
      <pk PHC0 = 90.71411 PHC1 = 0 
       data hash MD5: 32K
       D2 A3 DE D0 BA 04 AC 5A 59 30 93 D3 DF 95 12 11>)
(   4,<2016-04-16 22:26:34.673 -0700>,<Administrator>,<X>,<proc1d>,<TOPSPIN 2.1>,
      <abs ABSG = 1 
       data hash MD5: 32K
       00 08 C2 96 82 7F 09 25 F4 CE 4A 84 80 6E 26 1C>)
(   5,<2016-04-16 22:26:34.736 -0700>,<Administrator>,<X>,<proc1d>,<TOPSPIN 2.1>,
      <abs ABSG = 2 
       data hash MD5: 32K
       88 DB 5D 2B 27 0F 81 25 A8 BF 00 CC 8D A0 60 87>)
(   6,<2016-04-16 22:26:34.798 -0700>,<Administrator>,<X>,<proc1d>,<TOPSPIN 2.1>,
      <abs ABSG = 3 
       data hash MD5: 32K
       BA 4E 4B CE D1 5C 86 C8 5C 0F E5 BA EE C3 E3 3A>)
(   7,<2016-04-16 22:26:34.861 -0700>,<Administrator>,<X>,<proc1d>,<TOPSPIN 2.1>,
      <abs ABSG = 4 
       data hash MD5: 32K
       C6 D2 56 33 9E 8C 98 73 D0 D2 18 8C 9C 56 14 CE>)
(   8,<2016-04-16 22:26:34.923 -0700>,<Administrator>,<X>,<proc1d>,<TOPSPIN 2.1>,
      <abs ABSG = 5 
       data hash MD5: 32K
       90 EB 3A 00 45 97 B7 CF 5D C1 75 E6 64 4B C0 28>)
$$ ##END=
$$ 
$$ $$ hash MD5
$$ $$ 78 20 99 2C 77 DE FE 5C E4 4D C8 F1 42 AE 87 FE
##$RELAX= 
##$RELAX= 
##$RELAX= 
##$RELAX= 
##$RELAX= 
##$RELAX= 
##$RELAX= 
$$ Bruker specific parameters
$$ --------------------------
##$DU= <E:\>
##$EXPNO= 10
##$NAME= <AC1765_NAR_18_9683510_0nNJ3rwyda>
##$PROCNO= 1
$$ [...]
150 150 150 150 150 150 150 150
##$TP07= 0
##$TPNAME0= <>
##$TPNAME1= <>
##$TPNAME2= <>
##$TPNAME3= <>
##$TPNAME4= <>
##$TPNAME5= <>
##$TPNAME6= <>
##$TPNAME7= <>
##$TPOAL= (0..7)
0.5 0.5 0.5 0.5 0.5 0.5 0.5 0.5
##$TPOFFS= (0..7)
0 0 0 0 0 0 0 0
##$TUNHIN= 0
##$TUNHOUT= 0
##$TUNXOUT= 0
##$USERA1= <user>
##$USERA2= <user>
##$USERA3= <user>
##$USERA4= <user>
##$USERA5= <user>
##$V9= 5
##$VALIST= <valist>
##$VCLIST= <CCCCCCCCCCCCCCC>
##$VD= 0
##$VDLIST= <DDDDDDDDDDDDDDD>
##$VPLIST= <PPPPPPPPPPPPPPP>
##$VTLIST= <TTTTTTTTTTTTTTT>
##$WBST= 2048
##$WBSW= 25
##$XGAIN= (0..3)
0 0 0 0
##$XL= 0
##$YL= 0
##$YMAX_a= 570213
##$YMIN_a= -492268
##$ZGOPTNS= <>
##$ZL1= 120
##$ZL2= 120
##$ZL3= 120
##$ZL4= 120
##$ABSF1= 14.98509
##$ABSF2= -5.573092
##$ABSG= 5
##$ABSL= 3
##$ALPHA= 0
##$AQORDER= 0
##$ASSFAC= 0
##$ASSFACI= 0
##$ASSFACX= 0
##$ASSWID= 0
##$AUNMP= <proc_prof1d_extract_pilot.lims>
##$AXLEFT= 0
##$AXNAME= <>
##$AXNUC= <1H>
##$AXRIGHT= 0
##$AXTYPE= 0
##$AXUNIT= <>
##$AZFE= 0.1
##$AZFW= 0.1
##$BCFW= 0
##$BC_mod= 0
##$BYTORDP= 0
##$COROFFS= 0
##$CY= 15
##$DATMOD= 1
##$DC= 0
##$DFILT= <>
##$DTYPP= 0
##$F1P= 0
##$F2P= 0
##$FCOR= 0.5
##$FTSIZE= 32768
##$FT_mod= 6
##$GAMMA= 0
##$GB= 0
##$INTBC= 1
##$INTSCL= 1
##$ISEN= 128
##$LB= 0
##$LEV0= 0
##$LPBIN= 0
##$MAXI= 10000
##$MC2= 0
##$MEAN= 0
##$ME_mod= 0
##$MI= 0
##$NCOEF= 0
##$NC_proc= -8
##$NLEV= 6
##$NOISF1= 0
##$NOISF2= 0
##$NSP= 0
##$NTH_PI= 0
##$NZP= 0
##$OFFSET= 14.98509
##$PC= 1
##$PHC0= 90.71411
##$PHC1= 0
##$PH_mod= 1
##$PKNL= yes
##$PPARMOD= 0
##$PPDIAG= 0
##$PPIPTYP= 0
##$PPMPNUM= 2147483647
##$PPRESOL= 1
##$PSCAL= 4
##$PSIGN= 0
##$PYNMP= <proc.py>
##$REVERSE= no
##$SF= 400.02
##$SI= 32768
##$SIGF1= 0
##$SIGF2= 0
##$SINO= 400
##$SIOLD= 32768
##$SPECTYP= <>
##$SREGLST= <1H.CDCl3>
##$SSB= 0
##$STSI= 32768
##$STSR= 0
##$SW_p= 8223.68421052631
##$SYMM= 0
##$S_DEV= 0
##$TDeff= 65536
##$TDoff= 0
##$TI= <>
##$TILT= no
##$TM1= 0
##$TM2= 0
##$TOPLEV= 0
##$USERP1= <user>
##$USERP2= <user>
##$USERP3= <user>
##$USERP4= <user>
##$USERP5= <user>
##$WDW= 1
##$XDIM= 32768
##$YMAX_p= 442984237
##$YMIN_p= -712039
##$CURPLOT= <Network HP LaserJet P1505>
##$CURPRIN= <$Network HP LaserJet P1505>
##$DFORMAT= <normdp>
##$LAYOUT= <+/1D_H.xwp>
##$LFORMAT= <normlp>
##$PFORMAT= <normpl>
##$SURQMSG= 1
$$ End of Bruker specific parameters
$$ ---------------------------------
##NTUPLES= NMR SPECTRUM
##VAR_NAME=  FREQUENCY,     SPECTRUM/REAL,   SPECTRUM/IMAG
##SYMBOL=    X,             R,               I
##VAR_TYPE=  INDEPENDENT,   DEPENDENT,       DEPENDENT
##VAR_FORM=  AFFN,          ASDF,            ASDF
##VAR_DIM=   32768,         32768,           32768
##UNITS=     HZ,            ARBITRARY UNITS, ARBITRARY UNITS
##FACTOR=    0.250966925370066, 1,           1
##FIRST=     8223.43324360094, 51497,        -194646
##LAST=      0,             -14210,          -112582
##MIN=       0,             -712039,         0
##MAX=       8223.43324360094, 442984237,    0
$$ Real data points
##PAGE= N=1
##DATA TABLE= (X++(R..R)), XYDATA
$$ [...]
19583b72430B371a02542o0398j0811j51127A31645m6497a3572p5333C50524b86691
$$ -272430 2371 -102542 -162940 -173751 -324878 131645 85148 -13572 -88905 350524 -286691
19571b43621a09365F7166k9571d3654p7040j7997a3724D3043a42735H4978B693
$$ -243621 -109365 67166 37595 -43654 -120694 -138691 -13724 43043 -142735 84978 2693
19559a39771j54168L1015j3386h7841c5140k41817L900R6714A81454P1832b62952
$$ -139771 -293939 -262924 -276310 -87841 -35140 -276957 -273057 -176343 181454 253286 -262952
19547a8815j62460b1074l1396A19560b51358D4908i0807L4369H1601K75435I2885
$$ -18815 -181275 -21074 -52470 119560 -251358 44908 -90807 -56438 81601 357036 92885
19535d809m2677F6771J09597b6619C4773K27578A11644a86311F9897J53328b56843
$$ -4809 -47486 66771 176368 -26619 34773 262351 111644 -186311 69897 223225 -256843
19523c38690e2157r9687e9848D83832a37851e6070k13085I6165f413I1890c1655
$$ -338690 -52157 -151844 -59848 483832 -137851 -56070 -269155 96165 -6413 91890 -31655
19511A48880L6611F3135J0809A0870J3028e0798J7613q5916h10q5389H3503a90884
$$ 148880 185491 63135 73944 10870 23898 -50798 -33185 -119101 -810 -86199 83503 -190884
19498b22500k20154B44268E3821B3313P0065C3077A4937c6385k8074D2574b8574
$$ -222500 -442654 244268 53821 23313 93378 33077 14937 -36385 -64459 42574 -28574
19486e9377K6100k90069A16815A116K9434J20472b88166B8401K03175p0241c0965
$$ -59377 -33277 -323346 116815 1116 30550 151022 -288166 28401 231576 161335 -30965
19474a67960p4390J13858b7302k02181A2324a63494k09376G9778J20429o3172
$$ -167960 -242350 -128492 -27302 -229483 12324 -163494 -372870 79778 200207 137035
19464A37035b10568b7337A3550a75901n246g6692A56350a93035e6269G5206A6426
$$ 137035 -210568 -27337 13550 -175901 -181147 -76692 156350 -193035 -56269 75206 16426
19452A64569f4892B3467K1680i4495r4546Q0563j50920R7933G923a27885K4117
$$ 164569 -64892 23467 45147 -94495 -189041 -108478 -259398 -161465 7923 -127885 -103768
19441a03768q8610A17544h1476J6827A37487D8606a24535C4450e254B0751J74805
$$ -103768 -192378 117544 -81476 -64649 137487 48606 -124535 34450 -5254 20751 195556
19430A95556H0609C097b85838j8846A61280i6485A8909g8998j39791n8441Q3524
$$ 195556 80609 3097 -285838 -304684 161280 -96485 18909 -78998 -218789 -277230 -193706
19419a93706A86396b20556L7577k34191F9426a25194J933N1115j31836D1115b90003
$$ -193706 186396 -220556 -182979 -417170 69426 -125194 -123261 -72146 -203982 41115 -290003
19407A55108e4810m8726c6449C12267f3516n6649E8060a94275B23431J42369D5111
$$ 155108 -54810 -103536 -36449 312267 -63516 -120165 58060 -194275 223431 365800 45111
19395C70475d5175A96952e178l0303r7270O4071P595k80031J67966g6970j38732
$$ 370475 -45175 196952 -5178 -35481 -132751 -68680 -61085 -341116 -173150 -76970 -215702
19384b15702A04984a8073g379H4639B9720i300k92987h580m32146J93100D7573
$$ -215702 104984 -18073 -7379 84639 29720 -9300 -302287 -8580 -440726 -247626 47573
19372b06444i1024I412K1402L6709C2253d4353I2055b42802g8895F1372a93685
$$ -206444 -91024 9412 30814 67523 32253 -44353 92055 -242802 -78895 61372 -193685
19360d7550A47107a43957M3150j22450B6332a6471k62037d2965J3941D2208h4209
$$ -47550 147107 -143957 -100807 -223257 26332 -16471 -278508 -42965 -29024 42208 -84209
19348f3768B60249a59657b4335A13247J38866i6964D885b80206C0350a91523M6045
$$ -63768 260249 -159657 -24335 113247 252113 -96964 4885 -280206 30350 -191523 -145478
19337a45478k22188A07139a86388f1049j45571n7509J19276K5855K5155L6074
$$ -145478 -367666 107139 -186388 -61049 -206620 -264129 -144853 -118998 -93843 -57769
19327e7769C2454c36453J35058P8466c6239J2472j50254k7167A35367n0860b40634
$$ -57769 32454 -336453 -201395 -122929 -36239 -23767 -174021 -201188 135367 84507 -240634
19315I7406c19k8196C0291i4101l30k9174q4898A1475d7391q8752f2978k6782
$$ 97406 -319 -28515 30291 -94101 -94431 -123605 -208503 11475 -47391 -136143 -62978 -89760
19303h9760m37794i7054j50940O8906A07958N3956a37157j37554b8156j03306
$$ -89760 -527554 -97054 -247994 -179088 107958 161914 -137157 -274711 -28156 -131462
19293a31462e7973l18972a65342A66650c09317B783d8376k72616a58429N4241
$$ -131462 -57973 -376945 -165342 166650 -309317 2783 -48376 -320992 -158429 -104188
19283a04188l0447j61160A54689a50684F4579L81296D622a4629l5322q4107F1042
$$ -104188 -134635 -295795 154689 -150684 64579 445875 4622 -14629 -49951 -134058 61042
19271D4196c01502I9694A0612b47494A02099b95345h7434c083A34036A2710Q8161
$$ 44196 -301502 99694 10612 -247494 102099 -295345 -87434 -3083 134036 12710 100871
19260A00871n54l5630N9858m6309m822J68669o169p819b59690O7183L9931B76604
$$ 100871 100317 64687 124545 78236 73414 242083 235914 228095 -259690 -192507 -152576 276604
19247C19665a1682I239g9317E7003K613K5226j5501J1224a12043k62821B75822
$$ 319665 -11682 9239 -79317 57003 59616 84842 69341 80565 -112043 -374864 275822
19235D3450b31900A2587a2358r3200E1849e8567j33653J7722f8647l86560f5631
$$ 43450 -231900 12587 -12358 -105558 51849 -58567 -192220 -174498 -68647 -455207 -65631
19223i2763K944r4809j15382h8300A3314i7811M740l44958C53332H5477K45640
$$ -92763 -89819 -184628 -300010 -88300 13314 -97811 -93071 -438029 353332 85477 331117
19212C31117C4185a46086p6343c214l7372j22516r3357a08745d8572B12188a373
$$ 331117 34185 -146086 -222429 -3214 -40586 -163102 -256459 -108745 -48572 212188 -1373
19200c25380h5266A9279h190o1410G4978R5099a38983j83692a43364O3159H9248
$$ -325380 -85266 19279 -8190 -69600 74978 170077 -138983 -322675 -143364 -80205 89248
19188I4148c54190A59572J38072o6683i6245k29399A21275m4416c7132A35893
$$ 94148 -354190 159572 297644 230961 -96245 -325644 121275 76859 -37132 135893
19177a87361g7736B26740A8342J7666a78742B9463d15536c0374C6161R618B1697
$$ -187361 -77736 226740 18342 36008 -178742 29463 -415536 -30374 36161 45779 21697
19165I5904d8991A98812a42404I7949b24530i2480j77865a22782k27806d4058
$$ 95904 -48991 198812 -142404 97949 -224530 -92480 -270345 -122782 -350588 -44058
19154E6115h4619A6974O6629b02963C45a18784H0367b10803B73758b24743f7317
$$ 56115 -84619 16974 83603 -202963 345 -118784 80367 -210803 273758 -224743 -67317
19142c24799O1519E3527d43280a49936G0326b84453I6028l3421O7442b11907L7070
$$ -324799 -263280 53527 -443280 -149936 70326 -284453 96028 62607 130049 -211907 -174837
19131a74837P4822k69561B15423R4852j39529D8755g025m2552G8773c16041F2331
$$ -174837 -100015 -369576 215423 310275 170746 48755 -7025 -49577 78773 -316041 62331
19119B05924G566b65901J11553C09486a02567F0448a61994Q79p1601O9677j88647
$$ 205924 7566 -265901 -154348 309486 -102567 60448 -161994 -161115 -232716 -163039 -351686
19108c51686Q6467J3760a03007j35064j2505a19000E136d9543j56479A94567b70839
$$ -351686 -265219 -251459 -103007 -238071 -250576 -119000 5136 -49543 -206022 194567 -270839
19096A25588O7657E6637a04117a0357k94519c962k23592k47596A37186n802a63833
$$ 125588 193245 56637 -104117 -10357 -304876 -3962 -227554 -475150 137186 131384 -163833
19084C03264a19374D659J92935c65521f6141A82393j85c8939H6124i8320a9943
$$ 303264 -119374 4659 197594 -365521 -66141 182393 182208 -38939 86124 -98320 -19943
19072G357f6995A7896b040k48301d7917l0579b6236j91497c0363k1642l80A89270
$$ 7357 -66995 17896 -2040 -250341 -47917 -78496 -26236 -217733 -30363 -52005 -52385 189270
19059C42263d86227E18723a18489B3590Q2023p831A0253b43589k09530a91093
$$ 342263 -486227 518723 -118489 23590 105613 97782 10253 -243589 -453119 -191093
19048E1192a44474j36667e2118j52851J00702E8196d19227J93054A36346a29964
$$ 51192 -144474 -281141 -52118 -204969 -104267 58196 -419227 -226173 136346 -129964
19037e7593k99024b5380l46074C2788a49172j50739i064j3956j1844o6256C56898
$$ -57593 -356617 -25380 -371454 32788 -149172 -299911 -9064 -23020 -34864 -101120 356898
19025G8884l2804b12272c6431B24867d2931B42097H0998a22117j17301A10901
$$ 78884 46080 -212272 -36431 224867 -42931 242097 80998 -122117 -239418 110901
19014g4323A51870H414a39979C7639a59849A63497f068A32436a75276F6679b81132
$$ -74323 151870 8414 -139979 37639 -159849 163497 -6068 132436 -175276 66679 -281132
19002b07834j5457C18902H4942a64653A13788a63382h0970A34775a84058D316
$$ -207834 -223291 318902 84942 -164653 113788 -163382 -80970 134775 -184058 4316
18991A18519b34485B3106n468M7440j9199c63580A27564b3244j6753A17435G624
$$ 118519 -234485 23106 17638 65078 45879 -363580 127564 -23244 -39997 117435 7624
18979a53522L9030m4683a0852D1332Q2595I390a92566B68795l5249A8226a14913
$$ -153522 -114492 -159175 -10852 41332 123927 9390 -192566 268795 233546 18226 -114913
18967A39957l6501a3307b378j50094k2565B14129I9907f0587k55664a32574A95101
$$ 139957 103456 -13307 -2378 -152472 -175037 214129 99907 -60587 -316251 -132574 195101
18955a59452b1445l28936J57089A8342d8483j58764A08906g3518B97564F2973
$$ -159452 -21445 -350381 -193292 18342 -48483 -207247 108906 -73518 297564 62973
18944F3454a02678K5020m8653A49692b24170K8128j70989P5484a10270B12502
$$ 63454 -102678 -77658 -126311 149692 -224170 -196042 -367031 -291547 -110270 212502
18933b38856h6997C80081G2106I734c85592B2360J73060q1183a14018b506A72334
$$ -238856 -86997 380081 72106 9734 -385592 22360 195420 114237 -114018 -2506 172334
18921b1032E8435c32097i5882k33198D6024b14874B18456C909a32499j28989A27719
$$ -21032 58435 -332097 -95882 -329080 46024 -214874 218456 3909 -132499 -261488 127719
18909a48214A00844b75549M5802h6767K2464B2829J30196Q5479D7715a06098b1690
$$ -148214 100844 -275549 -229747 -86767 -64303 22829 153025 238504 47715 -106098 -21690
18897d5294l5970A00122j933M9786a60945C67162A05145c7165j15867j23162A14552
$$ -45294 -81264 100122 98189 147975 -160945 367162 105145 -37165 -153032 -276194 114552
18885a80484A8828N5416a61975I508K2798a5792m23507a43674F2453a36303G74
$$ -180484 18828 74244 -161975 9508 32306 -15792 -439299 -143674 62453 -136303 774
18873F7877b86196M9572P6652D3786J60309c81926J79334d2604j76387j97889
$$ 67877 -286196 -236624 -159972 43786 204095 -381926 -202592 -42604 -218991 -416880
18863d16880J34225O7389p1181I1613a49414A50562d627j57595P3668E5088c3114
$$ -416880 -282655 -215266 -286447 91613 -149414 150562 -4627 -162222 -88554 55088 -33114
18851h7406b4184C3654g2230A17417l5528h3297j40003A78850C1708a91491P3831
$$ -87406 -24184 33654 -72230 117417 81889 -83297 -223300 178850 31708 -191491 -117660
18840a17660G1531L35050b21051K0845m7882e975j53425B41818g9759Q064H230
$$ -117660 71531 406581 -221051 -200206 -248088 -5975 -159400 241818 -79759 -71695 8230
18828F2015c8440p5854b4121B49049a95630Q1815c7467j20735A81655c9196A29668
$$ 62015 -38440 -114294 -24121 249049 -195630 -113815 -37467 -158202 181655 -39196 129668
18816F4819a0170j08587n6122C17973m7882N0812j22264J42538C7367K63868c6537
$$ 64819 -10170 -118757 -174879 317973 270091 320903 198639 341177 37367 301235 -36537
18804b34237B6977J5909a64571J9451j09864A82452a09547L1672n0413r1670P8555
$$ -234237 26977 42886 -164571 -145120 -254984 182452 -109547 -77875 -128288 -219958 -141403
18793a41403H4312k6977J98039a50847N5198A05705M1142b51763j26762a32484
$$ -141403 84312 57335 255374 -150847 -95649 105705 146847 -251763 -378525 -132484
18782f8920A92669a28862I2738i6786k55671i3751j89081B62517e872r8249I7994
$$ -68920 192669 -128862 92738 -96786 -352457 -93751 -282832 262517 -5872 -104121 97994
18770b35309j04153a36421K4051p9616p0531a22552B01743C5867d8971l29126
$$ -235309 -339462 -136421 -112370 -191986 -262517 -122552 201743 35867 -48971 -378097
18760c78097A26739E3298N9105b80802C04a7025j00491C24750F9494h2306d754
$$ -378097 126739 53298 112403 -280802 304 -17025 -117516 324750 69494 -82306 -4754
18748C1344a49142J5522L642e3483G6544K04576A04080g214A14698l9150a46770
$$ 31344 -149142 -133620 -129978 -53483 76544 281120 104080 -7214 114698 75548 -146770
18736A9309f6099l43361A3987a0364k15075g096A32436o599b56760J07884e3126
$$ 19309 -66099 -409460 13987 -10364 -225439 -7096 132436 125837 -256760 -148876 -53126
18724b27112i4299B02987P3779a15165a4902p9671k24758L4472N8894j3602M6395
$$ -227112 -94299 202987 276766 -115165 -14902 -94573 -319331 -284859 -225965 -239567 -193172
18713a93172q6721p0188A069J33119i886j78282a0567p1123l9126H1771J30932
$$ -193172 -279893 -350081 1069 134188 -9886 -188168 -10567 -81690 -120816 81771 212703
18702B12703c5468j17620G9333a03222H5817b05768P2371B32285g1522j32756
$$ 212703 -35468 -153088 79333 -103222 85817 -205768 -133397 232285 -71522 -204278
18692b04278J3026D5999a30914H1271d43072A99360b19543F0725a99257B81732
$$ -204278 -191252 45999 -130914 81271 -443072 199360 -219543 60725 -199257 281732
18681I677b616k23229H043J13654e6550k30090a17224B9072P3744e864k22312
$$ 9677 -2616 -225845 8043 121697 -56550 -286640 -117224 29072 102816 -5864 -228176
18670b28176A23724B107J70903c9551k29866L6822M7212E4266h4368C4510K0022
$$ -228176 123724 2107 173010 -39551 -269417 -232595 -185383 54266 -84368 34510 54532
18659E4532a94692A78730B4408i1822B127e0805k46831C3922J23556o1870k9899
$$ 54532 -194692 178730 24408 -91822 2127 -50805 -297636 33922 157478 95608 65709
18648F5709j1942R1989A3525b422m93488a90756E7906L756R0185K1004b65244
$$ 65709 53767 145756 13525 -2422 -495910 -190756 57906 61662 151847 172851 -265244
18636A20746K05190A29112a17884A29279E8339J35054q6558d17177A21277J14472
$$ 120746 325936 129112 -117884 129279 58339 193393 106835 -417177 121277 235749
18626B35749A8640H775J59884d6221q3339j19633P1284L5199c2460k78505Q5741
$$ 235749 18640 8775 168659 -46221 -129560 -249193 -177909 -142710 -32460 -310965 -225224
18615b25224i5618E2379e3766k2358k4694J0402A30478b12701g4470j2909K486
$$ -225224 -95618 52379 -53766 -76124 -100818 -90416 130478 -212701 -74470 -87379 -84893
18604h4893q5763q2952N7926E2150J38757c66474i9358B10401K164e320p5926
$$ -84893 -170656 -253608 -195682 52150 190907 -366474 -99358 210401 212565 -5320 -81246
18593h1246A8166K15230e7300B4577d25712i1672o8033A22792h0923k91413Q0693
$$ -81246 18166 233396 -57300 24577 -425712 -91672 -159705 122792 -80923 -372336 -291643
18582b91643a08082A2660J69378b94311a36282l03155P3558J74077j4978D4736
$$ -291643 -108082 12660 182038 -294311 -136282 -439437 -365879 -191802 -206780 44736
18571b08981G7763i9772m8968i044l07438B59937a35435O013b0946q0100l86566
$$ -208981 77763 -99772 -148740 -9044 -316482 259937 -135435 -129422 -20946 -101046 -487612
18560d87612L9511a17290A38963i0638k18735h843j74680b5085H0147i4126L5721
$$ -487612 -448101 -117290 138963 -90638 -309373 -8843 -183523 -25085 80147 -94126 -58405
18549e8405k52266M2331H4210d31961a87638L9491F9406B6334b15243a6368l8435
$$ -58405 -310671 -268340 84210 -431961 -187638 -148147 69406 26334 -215243 -16368 -54803
18538e4803j15113c3844A18011c05377B0070a11084A52386a66526N024A13496
$$ -54803 -169916 -33844 118011 -305377 20070 -111084 152386 -166526 -161502 113496
18527e267j12331n2336l73796a2666B15857c10855J33947O5071B26678p2103k1288
$$ -5267 -117598 -169934 -543730 -12666 215857 -310855 -176908 -111837 226678 154575 133287
18516A33287P3076c2772l76296d8367E9637b19776A59065a06849E8184a42949
$$ 133287 206363 -32772 -409068 -48367 59637 -219776 159065 -106849 58184 -142949
18505e1571j237E260a00755j864A01788b05169A74896a2721l12026C50475a96580
$$ -51571 -52808 5260 -100755 -102619 101788 -205169 174896 -12721 -324747 350475 -196580
18493a4286k98716F5031B7752f0309H7276l7345b9738j49662j32052C1858b400
$$ -14286 -313002 65031 27752 -60309 87276 49931 -29738 -179400 -311452 31858 -2400
18481g3871p1851A98792b65019a11244A06751A9309b73247a33829E3482b43885
$$ -73871 -145722 198792 -265019 -111244 106751 19309 -273247 -133829 53482 -243885
18470i5448j18551J02194C8899J8691a05039C7542a9785j53930E9283M42671a81569
$$ -95448 -213999 -111805 38899 57590 -105039 37542 -19785 -173715 59283 501954 -181569
18458b42752B72975j16845o3647a69054f0557A39485b33299C60341a52894N4695
$$ -242752 272975 156130 92483 -169054 -60557 139485 -233299 360341 -152894 -98199
18448i8199C0865b53942j5526R9626A6280K0343a42778l9899h6501j21166j04018
$$ -98199 30865 -253942 -269468 -169842 16280 36623 -142778 -182677 -86501 -207667 -311685
18437c11685a49167j91035B37238g8851l5035A26992I736a72060b1250I6378c4997
$$ -311685 -149167 -340202 237238 -78851 -113886 126992 9736 -172060 -21250 96378 -34997
18425A14407J3572Q345g8330L2182k01233A317J72001b15766q0731J00295l2735
$$ 114407 127979 136324 -78330 -46148 -247381 1317 173318 -215766 -296497 -196202 -228937
18414b28937j47270J75483J9606B81771a47196L9496c418j98509A0465J18140
$$ -228937 -376207 -200724 -181118 281771 -147196 -107700 -3418 -201927 10465 128605
18404A28605N1972Q0665b52850B02109C6219b80501B66053l8658a91703A29840
$$ 128605 180577 261242 -252850 202109 36219 -280501 266053 227395 -191703 129840
18393B85644c1914n5685k26734a07709j12892B9885R0628e2700F0977g4079k0403
$$ 285644 -31914 -87599 -314333 -107709 -220601 29885 120513 -52700 60977 -74079 -94482
18382i4482A1316a93862A46767J2050B1069a92820i0232j19732R8912M4899B29486
$$ -94482 11316 -193862 146767 158817 21069 -192820 -90232 -209964 -111052 -66153 229486
18370A1145a70685P6700K5037G5477a25275A81464J35290a50278K7045a2638B22759
$$ 11145 -170685 -93985 -68948 75477 -125275 181464 316754 -150278 -123233 -12638 222759
18358c45487P8664B19326c41950A25812j0624b14375o8097h7415A24543N0868
$$ -345487 -266823 219326 -341950 125812 115188 -214375 -282472 -87415 124543 175411
18348A75411g0367A03372a84353O272A95734a95118J5701g4665j9832E6341Q8145
$$ 175411 -70367 103372 -184353 -178081 195734 -195118 -179417 -74665 -94497 56341 144486
18337A44486a3107G306a07828B25918l3021a21169n1290b538E85g0504j80052
$$ 144486 -13107 7306 -107828 225918 192897 -121169 -172459 -2538 585 -70504 -250556
18326b50556H4720j6543J36725o5895c8622B44293D8247a30761l21451K07993
$$ -250556 84720 68177 204902 139007 -38622 244293 48247 -130761 -452212 -244219
18316b44219l9476A25361i3063b7586A27208k5791h4868D6514a43412l3833h4566
$$ -244219 -283695 125361 -93063 -27586 127208 101417 -84868 46514 -143412 -177245 -84566
18304f7272k02385J31680A92606f4773B2749K09867l015j11194a26101H1112b01017
$$ -67272 -269657 -137977 192606 -64773 22749 232616 229601 118407 -126101 81112 -201017
18292b6977r0243N4410k28838A20191b96234D4594a72891B47174A15095a7105
$$ -26977 -117220 -62810 -291648 120191 -296234 44594 -172891 247174 115095 -17105
18281c909j39853j00825E2952c08479R4839C1113e8853F4467J21707A8677g4517
$$ -3909 -143762 -244587 52952 -308479 -213640 31113 -58853 64467 186174 18677 -74517
18269i5949k5108b387A349L277b08812J1420d3140D37700A93996M215f0647k10968
$$ -95949 -121057 -2387 1349 4626 -208812 -197392 -43140 437700 193996 198211 -60647 -271615
18257b71615B40550K4113d3748E3183d18514I6818L2638d0742j44746j24725e3181
$$ -271615 240550 264663 -43748 53183 -418514 96818 129456 -40742 -185488 -310213 -53181
18245i4731n1440j0407O0798Q860j82000B10836B1466J60770a34262j54679f8049
$$ -94731 -146171 -156578 -95780 -86920 -268920 210836 21466 182236 -134262 -288941 -68049
18233e0308j21444j4161B5720a97207c8550A23890a26336l14061A05830c6906
$$ -50308 -171752 -185913 25720 -197207 -38550 123890 -126336 -440397 105830 -36906
18222A02171b2177F1040A0571J37395d6811a3514E6887b40080F1247k5946d9733
$$ 102171 -22177 61040 10571 147966 -46811 -13514 56887 -240080 61247 35301 -49733
18210a37521k04304J35742A2251L00917b28522j21235a17743R928j476j73778
$$ -137521 -341825 -206083 12251 313168 -228522 -349757 -117743 -107815 -109291 -283069
18200b83069l603B08148g0900k15315e7430q356o0761d4936k87715g3636k11597
$$ -283069 -286672 208148 -70900 -286215 -57430 -65786 -126547 -44936 -332651 -73636 -285233
18189b85233A99691J94816B9390d729A57239d95347H1991e6425A32471m6303J9596
$$ -285233 199691 394507 29390 -4729 157239 -495347 81991 -56425 132471 86168 105764
18178A05764A8200O4057l4185f7992j2083A27865J32723j8624E6399L77802c04899
$$ 105764 18200 82257 48072 -67992 -80075 127865 260588 241964 56399 434201 -304899
18166A41858G0393a0941j87988B04923d9006A78389b6917l00379B5220f1926b0885
$$ 141858 70393 -10941 -198929 204923 -49006 178389 -26917 -327296 25220 -61926 -20885
18154a7580k6693B39818c15842A02292a31242N1730c659j54848j5275j48142B22
$$ -17580 -44273 239818 -315842 102292 -131242 -79512 -3659 -158507 -173782 -321924 222
18142I3268l4668J82990a8493C09550a72736C29602h5925D2096i5587G5924i6390
$$ 93268 58600 241590 -18493 309550 -172736 329602 -85925 42096 -95587 75924 -96390
18130g6059a7414E1569h0230k9670a9381j08206A59442a88328m3943L1319B24969
$$ -76059 -17414 51569 -80230 -109900 -19381 -127587 159442 -188328 -232271 -200952 224969
18118d03180J50071a00337l29107g668j04237B6225b65945h388A41971b00914
$$ -403180 -253109 -100337 -429444 -7668 -111905 26225 -265945 -8388 141971 -200914
18107g9146B06687b04447B43496n7535b25106F3183d6597k29060A92545a78726
$$ -79146 206687 -204447 243496 185961 -225106 63183 -46597 -275657 192545 -178726
18096a98909A41897b686B22142a47145C8158a62657d8521r8086k22765a09967
$$ -198909 141897 -2686 222142 -147145 38158 -162657 -48521 -146607 -369372 -109967
18085a78103r5414h2246j08651H6028b17696d6683k22933f398B02360p6282n7713
$$ -178103 -273517 -82246 -190897 86028 -217696 -46683 -269616 -6398 202360 126078 68365
18074F8365O6365b48136a07057N0982n5898j2666l5369E7405K34789a42769L9076
$$ 68365 134730 -248136 -107057 -56075 -111973 -124639 -160008 57405 292194 -142769 -103693
18063a03693b3829h836A41682c21076a00636j26838i5559j42754f9385A70398
$$ -103693 -23829 -8836 141682 -321076 -100636 -227474 -95559 -238313 -69385 170398
18052a8138D2376K43099q2593a55014B11730c09229E2818c74167d021A67925A7249
$$ -18138 42376 285475 202882 -155014 211730 -309229 52818 -374167 -4021 167925 17249
18040a84706c8583H3752Q9942k1508a91855r0362B9919b37146e2009F3012K49818
$$ -184706 -38583 83752 173694 152186 -191855 -282217 29919 -237146 -52009 63012 312830
18029C12830B5300I362a52986B1969K41539j27738h4769d2143k52197E5107g547
$$ 312830 25300 9362 -152986 21969 263508 135770 -84769 -42143 -294340 55107 -7547
18017d1128C5820L2367h3556r0804B2621i6732A81707b36193A72565c32836g8485
$$ -41128 35820 68187 -83556 -174360 22621 -96732 181707 -236193 172565 -332836 -78485
18005D3619J4546h6901d1394j34847f2153B50133q3455F8383a87857L6818D8066
$$ 43619 58165 -86901 -41394 -176241 -62153 250133 166678 68383 -187857 -151039 48066
17993a01364G4985b17679q03C38429e0701l5024A72322E1414K26304p0040a46346
$$ -101364 74985 -217679 -218482 338429 -50701 -85725 172322 51414 277718 207678 -146346
17981b76759A9579Q2190e6419B7738i4035A29612g209F6859b46663i2212j3234
$$ -276759 19579 101769 -56419 27738 -94035 129612 -7209 66859 -246663 -92212 -105446
17970a05446j705A67273o1360M712c63626C4200a90671D716c15092J0818G8295
$$ -105446 -107151 167273 105913 110625 -363626 34200 -190671 4716 -315092 -304274 78295
17958d50636H1199a18153b1063H3816O065C3169b92112C01251a36002B56500b8027
$$ -450636 81199 -118153 -21063 83816 89881 33169 -292112 301251 -136002 256500 -28027
17946A78102b21465H987b8732D9779B4779a18197j99536B0041Q7631b92360a6019
$$ 178102 -221465 8987 -28732 49779 24779 -118197 -317733 20041 107672 -292360 -16019
17934G8699a19091A58679K37834b8281J3214A19604d2426o0320j1742E660d4514
$$ 78699 -119091 158679 396513 -28281 -15067 119604 -42426 -102746 -114488 5660 -44514
17922a42665A3172b7945B12827A1957J02903a27197A50517a77291C7486M05952
$$ -142665 13172 -27945 212827 11957 114860 -127197 150517 -177291 37486 443438
17912D43438A33949a00966B2684L2139a26715O2928j5568j42692Q6730B3537J14198
$$ 443438 133949 -100966 22684 54823 -126715 -63787 -79355 -222047 -135317 23537 137735
17901A37735g4101E9353k5737e3960J5299F1831i5729j2157E2946K83606e1487
$$ 137735 -74101 59353 33616 -53960 -38661 61831 -95729 -107886 52946 336552 -51487
17889a95375m1672A94035C4796e051A15036f9369B4975J67656D7816c47751a56142
$$ -195375 -237047 194035 34796 -5051 115036 -69369 24975 192631 47816 -347751 -156142
17877b25972A4258a36574p0109g3153l5501E7285P1564J08276o7550c4701D7088
$$ -225972 14258 -136574 -206683 -73153 -108654 57285 128849 237125 169575 -34701 47088
17865A63270b67788A50161g4316k31445I4641m7055P8645a37985j90082O5521
$$ 163270 -267788 150161 -74316 -305761 94641 47586 126231 -137985 -328067 -262546
17855b62546H6969a07830r4612b9218r4381G7960j5463J81244a45638J5113o6599
$$ -262546 86969 -107830 -202442 -29218 -123599 77960 62497 243741 -145638 -130525 -197124
17844a97124j24790A05416b44403Q5476K1254J7447m9620C1806L40451h332l5180
$$ -197124 -321914 105416 -244403 -158927 -137673 -120226 -169846 31806 372257 -8332 -43512
17833d3512m3767B8740b19727d793j45581A44354i5728B26999H2741b01852A7301
$$ -43512 -87279 28740 -219727 -4793 -150374 144354 -95728 226999 82741 -201852 17301
17821a02388G6421A6132a07433C8697b67357A69349b08676c1087J0825B49956
$$ -102388 76421 16132 -107433 38697 -267357 169349 -208676 -31087 -20262 249956
17810b05974H3469R768d12197G2875J2118a83986H2318L2479L3501D6753b8087
$$ -205974 83469 93237 -412197 72875 84993 -183986 82318 114797 148298 46753 -28087
17798a31503d978C9180b39596G5928i1645C7735j1804R7860k7361P5468f7955
$$ -131503 -4978 39180 -239596 75928 -91645 37735 25931 123791 96430 171898 -67955
17786a07626j05196Q78B22790a67350m9029G0788J03364k9371D5417b20400a06235
$$ -107626 -212822 -211944 222790 -167350 -216379 70788 174152 144781 45417 -220400 -106235
17774E5383a29428M5391A79105a24300C2841L023J4203c52296I366a43749p5524
$$ 55383 -129428 -84037 179105 -124300 32841 35864 50067 -352296 9366 -143749 -219273
17763b19273A53127a11953k56449a15430A96232L2018a32419j79557A02954a79621
$$ -219273 153127 -111953 -368402 -115430 196232 228250 -132419 -311976 102954 -179621
17752A61860b05567H1751K10333A40941a6402k35452H0375a45908F5175a18198
$$ 161860 -205567 81751 292084 140941 -16402 -251854 80375 -145908 65175 -118198
17741c36667J59758A25633K41932B7118e9311B58037c9325j30202j3334I4292
$$ -336667 -176909 125633 367565 27118 -59311 258037 -39325 -169527 -182861 94292
17730I021a97363a5590p9639j4298C58549c3214B98398r5139p5452a19639I9665
$$ 9021 -197363 -15590 -95229 -109527 358549 -33214 298398 203259 127807 -119639 99665
17718A18435L5864c5344a6903j46717A92737a60770B0128c2574k5389B39829a74105
$$ 118435 154299 -35344 -16903 -163620 192737 -160770 20128 -32574 -57963 239829 -174105
17706h23C85488A30674b16586a5172j28355G5327P6393R7028l3437A03719C2936
$$ -823 385488 130674 -216586 -15172 -143527 75327 151720 248748 215311 103719 32936
17694F3115d7338B6079g1852n5078c5774j1338j35582B2829N8989O9212l3754
$$ 63115 -47338 26079 -71852 -126930 -35774 -47112 -182694 22829 81818 151030 117276
17683A17276a81581k38945a50901I6183f3059J9105B2502a20921d9333A65418
$$ 117276 -181581 -420526 -150901 96183 -63059 -43954 22502 -120921 -49333 165418
17672b84656G9779L0415k7760a19790A50867h2479L8465j51934J3688J9220b6194
$$ -284656 79779 110194 82434 -119790 150867 -82479 -44014 -195948 -182260 -163040 -26194
17660D8880N5074A078J23930h0972F1339M43547a243j53821M3066A58474b4943
$$ 48880 103954 1078 125008 -80972 61339 504886 -1243 -155064 -111998 158474 -24943
17648d55451G1138d4493I609a9063B67185D7593b32996E6349b56877d2565I5287
$$ -455451 71138 -44493 9609 -19063 267185 47593 -232996 56349 -256877 -42565 95287
17636B33671a30574E8157A7593c0491j83605a4384j04643q1707j57507d4236l6994
$$ 233671 -130574 58157 17593 -30491 -214096 -14384 -119027 -200734 -358241 -44236 -81230
17625h1230A98333a44321I1675q059J77086D2204f0327D12055B6590Q4127h1799
$$ -81230 198333 -144321 91675 83616 260702 42204 -60327 412055 26590 110717 -81799
17613a15769L6431A31161J71602j49818A1447K3628E50L4370b87680B16985F6578
$$ -115769 -79338 131161 302763 152945 11447 35075 550 34920 -287680 216985 66578
17601b63382F0770M5554P6095R519d063l7967A88849q4594a1787A41172a09084
$$ -263382 60770 106324 182419 191938 -4063 -42030 188849 104255 -11787 141172 -109084
17589b42814c19I359c9425B47695i6190n9594A04996i9743A54267N5593a44062
$$ -242814 -319 9359 -39425 247695 -96190 -155784 104996 -99743 154267 209860 -144062
17577a33797m1235A09440d455p7249A32947B0838g0712K4359k38852a9792m0630
$$ -133797 -175032 109440 -4455 -81704 132947 20838 -70712 -46353 -285205 -19792 -60422
17566f0422B40228a91919g4406n7722A3069J50420a09114j77916d5588C04662
$$ -60422 240228 -191919 -74406 -132128 13069 163489 -109114 -287030 -45588 304662
17555b25890A30671a74469I997L07665j51668a06828A89363J9875A0702a72453
$$ -225890 130671 -174469 9997 317662 165994 -106828 189363 209238 10702 -172453
17544F9664A3009a1746F039N8118a19394E2177J25452a02058c2550q5472M7132
$$ 69664 13009 -11746 6039 64157 -119394 52177 177629 -102058 -32550 -118022 -70890
17533g0890B40303i5426C1149M00025E5546g7755o810A35285J21383J42858m2556
$$ -70890 240303 -95426 31149 431174 55546 -77755 -84565 135285 256668 399526 356970
17522C56970F9045a93123a7618G8151Q9190B1070a86308A58809e6613B51513k9733
$$ 356970 69045 -193123 -17618 78151 167341 21070 -186308 158809 -56613 251513 221780
17511B21780P3036A14981k7152K78488j35601p7722a21094B13813b40555j3516
$$ 221780 294816 114981 87829 366317 230716 152994 -121094 213813 -240555 -254071
17501b54071B5869b6414m56A5209a37366i870B26221E126K21284g6713A43254
$$ -254071 25869 -26414 -26870 15209 -137366 -9870 226221 5126 226410 -76713 143254
17489A77383R8561e4546C5805Q4027n2588b9314B28859K0263j443l1162J6873
$$ 177383 275944 -54546 35805 119832 67244 -29314 228859 249122 247679 216517 233390
17478B33390n8570L88148G8960b16224B56383P5407K67730I2966P7301q4408O3441
$$ 233390 174820 562968 78960 -216224 256383 331790 599520 92966 170267 85859 149300
17467A49300h873C45608G593J2324M9936M02630j35450j66677J44435k2354a90683
$$ 149300 -8873 345608 7593 19917 69853 472483 337033 170356 314791 292437 -190683
17455b332A67109n2263f7390A60930J44084L5843J21285A80070R7063k1507q4217
$$ -2332 167109 114846 -67390 160930 305014 340857 462142 180070 277133 255626 171409
17444A71409d6749A18355L62436A56260J18221o2837m0721j6060J36905O4341
$$ 171409 -46749 118355 480791 156260 274481 211644 170923 154863 291768 356109
17434C56109e812E35370B02011I2334K33642j32905I4778N9467J02816j26823
$$ 356109 -5812 535370 202011 92334 325976 193071 94778 154245 257061 130238
17424A30238K45283k2680D5625L52236A02013R4805l494I5256J72024j3636J29363
$$ 130238 375521 352841 45625 397861 102013 196818 193324 95256 267280 253644 383007
17413C83007N4873k14581I0156c3739B83093q7511l357k4082G766b5096B75010
$$ 383007 437880 223299 90156 -33739 283093 195582 192225 168143 7766 -25096 275010
17401F4669f7635A8275b910F6443d1219r7218a7714B48262a17461F06181B67704
$$ 64669 -67635 18275 -2910 66443 -41219 -138437 -17714 248262 -117461 606181 267704
17389B51302j8910J43709j80983h4463A71656G2369J22864J23667R5002j52882
$$ 251302 232392 376101 195118 -84463 171656 72369 195233 318900 413902 261020
17379B61020a13780I9333J30699D2254J05680j573n7366P162L5536i1937k0263
$$ 261020 -113780 99333 230032 42254 147934 146361 88995 96157 131693 -91937 -112200
17368a12200F6223R8057B2211K40429g3777C2547J50037J5441i0387I6880b58193
$$ -112200 66223 164280 22211 262640 -73777 32547 182584 198025 -90387 96880 -258193
17356B90493o2559l4425n5502B8220L15660B2830J36135n6426J04722H7626P1858
$$ 290493 227934 193509 138007 28220 343880 22830 158965 102539 207261 87626 159484
17345A59484l7340C0554J31677f2288A39633b5119C32202J9052n5629j36982N8868
$$ 159484 122144 30554 162231 -62288 139633 -25119 332202 351254 295625 158643 217511
17334B17511M9127F7512J84710K5632r6582D6347J87018H7938N7438n6017E601
$$ 217511 266638 67512 252222 277854 181272 46347 233365 87938 145376 89359 5601
17322g1827K507B00315J07456J14569j30307j01427r3279P1497K19581D7972b12351
$$ -71827 -69320 200315 307771 422340 292033 190606 97327 168824 388405 47972 -212351
17310A1109J41816k3743P8821a98018c5397B77000H5950a7323E0582K4798O10
$$ 11109 152925 129182 208003 -198018 -35397 277000 85950 -17323 50582 75380 75990
17299G5990J28611J64391j34884F8230K63429e8214j27931e5361A41039E204K52285
$$ 75990 204601 368992 234108 68230 331659 -58214 -186145 -55361 141039 5204 257489
17288B57489H3768k8607b5661O351A1651K45102F347J91779C1996B723J48850
$$ 257489 83768 55161 -25661 -19310 11651 256753 6347 198126 31996 2723 151573
17277A51573a63324E02267E9924e110C39667J4901L8295C0542K102c447B5199
$$ 151573 -163324 502267 59924 -5110 339667 354568 392863 30542 32644 -3447 25199
17265B74192f7375J7283A21115R6641f2039d707q01I5112f1829A03226L60659
$$ 274192 -67375 -50092 121115 217756 -62039 -4707 -5508 95112 -61829 103226 463885
17254D63885k28162J8722G7396B5688b36492B50725A12932e0352A28824b61D17008
$$ 463885 235723 254445 77396 25688 -236492 250725 112932 -50352 128824 -261 417008
17242C03317E5507B0273K53507I133L8120J57753n5275K7660F0905O8212m208
$$ 303317 55507 20273 273780 9133 47253 205006 149731 177391 60905 129117 124909
17231A24909n2119c9931B30733k4565a21601B5964K79592b371C62843L7479j28196
$$ 124909 72790 -39931 230733 206168 -121601 25964 305556 -2371 362843 400322 272126
17220B72126M8104j43601L1660C8405L38550p2576D1723M6923D0362g2212B96191
$$ 272126 320230 176629 208289 38405 376955 304379 41723 88646 40362 -72212 296191
17208A55408N0816n6552R1337r2832J18737F8833J56958K7186k2750K5859h886
$$ 155408 206224 149672 241009 148177 266914 68833 225791 252977 230227 256086 -8886
17196b9914A73970J50608p1389O998j20809n5442O1665J00539G3281M5936K01965
$$ -29914 173970 324578 253189 260187 139378 83936 145601 246140 73281 119217 321182
17185C21182h8944k666B00340J3766K1015M38187k28801A32144P4180Q191K14835
$$ 321182 -88944 -91610 200340 214106 235121 673308 444507 132144 206324 214515 429350
17174D29350j73704K07868o1418a7890C00631A23763j8254E1144L05381j40596
$$ 429350 255646 463514 402096 -17890 300631 123763 105509 51144 356525 215929
17164B15929J22524r3785A02426C8241K13388J07034j04773p8104R7710L0527
$$ 215929 338453 244668 102426 38241 251629 358663 253890 175786 273496 304023
17154C04023l7434j6689j4255H5323J97370J759O5476A55558J11734K5879j32949
$$ 304023 266589 249900 235645 85323 282693 284452 349928 155558 267292 293171 160222
17143A60222R9660J35376J64514A29070r373k4685J16396L14784j92248K17811
$$ 160222 259882 395258 559772 129070 119697 95012 211408 526192 333944 551755
17133E51755c562D21090n2076A32789J7737L66203F8139f8326C07687j35107j7178
$$ 551755 -3562 421090 369014 132789 150526 516729 68139 -68326 307687 172580 155402
17122A55402R6256J37412J52939j71104p7996J49252l8884j88050C2285J91782
$$ 155402 251658 389070 542009 370905 292909 442161 403277 215227 32285 224067
17112B24067K08551J4905A54122J77250K55364k92109J4439m7713J09394n5299
$$ 224067 432618 447523 154122 331372 586736 294627 309066 261353 370747 315448
17102C15448j56506J48581L26022A79492M2586M23402j21714A46562O2408k4864
$$ 315448 158942 307523 633545 179492 222078 645480 523766 146562 208970 184106
17092A84106K07559Q4116n7832p411m0113q8999K04980q0463J86095r5869j15049
$$ 184106 391665 475781 417949 410538 370425 281426 486406 405943 592038 496169 381120
17081C81120M125j66736L95539j70000p7519K0926L3067j49155A12642M97720
$$ 381120 385245 218509 614048 444048 366529 387455 420522 271367 112642 610362
17071F10362B78978K3136J90299j97913O2501r2626J0655j9376L08325k32414
$$ 610362 278978 302114 492413 294500 357001 264375 275030 255654 563979 331565
17061C31565K04844j48581k170R1470L1525j51646K93239j94336L5747J57285
$$ 331565 536409 387828 385658 477128 508653 357007 650246 455910 491657 648942
17051F48942j51801j48816K23556B84387K84593A95810L92732k10638o1531Q9191
$$ 648942 497141 348325 571881 284387 568980 195810 588542 377904 316373 405564
17041D05564J05212A64288M12973j11088j78728j4658K05178R5444B67273N86064
$$ 405564 510776 164288 577261 466173 287445 272787 477965 573409 267273 853337
17031H53337l9627k77448L38079j96838r4388B75757K25675j25756Q4668M3838
$$ 853337 813710 536262 874341 677503 583115 275757 501432 375676 460344 504182
17021E04182O3939J79548l58243L37196C44351K70204J3035j0552K5764j18309
$$ 504182 568121 747669 389426 726622 344351 614555 627590 617038 642802 524493
17011E24493J7262L02146l40790N090J90752j18082L09098k59565j63536M53788
$$ 524493 541755 843901 503111 508201 698953 580871 889969 630404 466868 920656
17001I20656m05201j33168K80738Q7954J19131k98400N4633J12814j45432m949
$$ 920656 515455 382287 663025 750979 870110 571710 626343 739157 593725 588776
16991E88776J01249k38992K04046K36109M3747j85703K12380k86142M05889D81884
$$ 588776 690025 451033 655079 891188 934935 749232 961612 675470 1081359 481884
16980G45189J17392J06195D35875L40316J04246m11307K83672j18392K12230O3232
$$ 745189 862581 968776 435875 776191 880437 469130 752802 634410 846640 909872
16970I09872j57516M0408C34801J30131L49803j2365k60322K96536L29891j98535
$$ 909872 752356 792764 334801 464932 814735 802370 542048 838584 1168475 969940
16960I69940R7989p6321j72585j93535N00125j67207L6519m85564L91419l50528
$$ 969940 1067929 991608 819023 625488 1125613 958406 994925 509361 900780 550252
16950E50252Q39565m46536M24971m42935K61840k02309J00370J33269J45283l69096
$$ 550252 1389817 943281 1368252 925317 1187157 984848 1085218 1218487 1363770 994674
16940I94674p3645J65768N9087P0672l11837N5872L676o1018L94497j75116P1184
$$ 994674 921029 1086797 1145884 1216556 904719 960591 964267 903249 1297746 1122630 1193814
16929A193814N2482j61829j14453K28268J10987j03051j38155K88758O0791j69214
$$ 1193814 1246296 1084467 970014 1198282 1309269 1206218 1068063 1356821 1417612 1248398
16919A248398R6173J94101j48873j08900J21696j50606K80177l73353m0746J26328
$$ 1248398 1344571 1538672 1389799 1280899 1402595 1251989 1532166 1158813 1118067 1244395
16909A244395p4317N08009k31157R6222o1301J50180j15777j16573K40649k62908
$$ 1244395 1170078 1678087 1446930 1543152 1481851 1632031 1516254 1399681 1640330 1377422
16899A377422L16299J72608l31516j30509K93583j31408K59779l35502K70936
$$ 1377422 1693721 1866329 1534813 1404304 1697887 1566479 1826258 1490756 1761692
16890A761692n1972K87288k9219n20851K61651n7432J97429l2561k71378O7264
$$ 1761692 1709720 1997008 1967789 1446938 1708589 1651157 1848586 1816025 1544647 1611911
16880A611911J50967K48087L19316m89432K20534R4731j56074J11764j45470J97465
$$ 1611911 1762878 2010965 2330281 1840849 2061383 2156114 2000040 2111804 1966334 2163799
16870B163799Q0464k1982j74952P01918m28468o9428J25105k11857K61404M51480
$$ 2163799 2244263 2222281 2047329 2749247 2320779 2251351 2376456 2164599 2426003 2877483
16860B877483m30779J86959r0490J70055K95527k86374k7026K9645K51510l01242
$$ 2877483 2446704 2633663 2543173 2713228 3008755 2722381 2695355 2725000 2976510 2675268
16850B675268J15239L57284m1543l79720L51002K43835j59551J4244j73735R0884
$$ 2675268 2790507 3147791 3106248 2726528 3077530 3321365 3161814 3176058 3002323 3093207
16840C093207J08906K79495J36363P7288p4582K68241m79771L12735J16641j87522
$$ 3093207 3202113 3481608 3617971 3695259 3620677 3888918 3409147 3721882 3838523 3651001
16830C651001M49508l64924L66675K06631J3454J18795K46024l83377R6311L46593
$$ 3651001 4100509 3735585 4102260 4308891 4322345 4441140 4687164 4303787 4400098 4746691
16820D746691K59675j82201Q5777j47281J38722K57975M93586m19871K34123K88070
$$ 4746691 5006366 4824165 4909942 4762661 4901383 5159358 5652944 5233073 5467196 5755266
16810E755266R5751K19403J08865L7807m4403P45875l31294M41283k20722K53550
$$ 5755266 5851017 6070420 6179285 6217092 6172689 6918564 6587270 7028553 6807831 7061381
16800G061381M67250n16836M61962K03115L85455r7123J04775J30507N91658J1196
$$ 7061381 7528631 7011795 7473757 7676872 8062327 7965204 8069979 8200486 8792144 8803340
16790H803340K06283L49249k7561Q50680l9336J19866L02598N43622J90303K39539
$$ 8803340 9009623 9358872 9331311 10181991 10142655 10262521 10565119 11108741 11299044 11538583
16780A1538583M32399K18344K88616O10712O29550k2535N18412R91022J17405
$$ 11538583 11970982 12189326 12477942 13088654 13718204 13695669 14214081 15205103 15322508
16771A5322508N53714L58306P34138O04952M56111Q97937Q12892O70403L51878
$$ 15322508 15876222 16234528 16968666 17573618 18029729 18927666 19740558 20410961 20762839
16762B0762839J106323M78560J267715O80501J155493P24178J237316J262429
$$ 20762839 21869162 22347722 23615437 24295938 25451431 26175609 27412925 28675354
16754B8675354J126753J493738J173780J627826J792720J923596J514080J984814
$$ 28675354 29802107 31295845 32469625 34097451 35890171 37813767 39327847 41312661
16746D1312661J934635K574081K162932K534286K757356K969521K609016L718929
$$ 41312661 43247296 45821377 47984309 50518595 53275951 56245472 58854488 62573417
16738F2573417L368035L579679M146650L919233M601647N079124M943359N294231
$$ 62573417 65941452 69521131 73667781 77587014 82188661 87267785 92211144 97505375
16730I7505375N467916N930205N857023O190132N962189O083209O230347N713810
$$ 97505375 102973291 108903496 114760519 120950651 126912840 132996049 139226396 144940206
16722A44940206N533160M680782M694060L598376K609996J888958O75577l37037
$$ 144940206 150473366 155154148 159848208 163446584 166056580 167945538 168621115 168284078
16714A68284078j074637k314361k956868m173153m757916n177052n596207o274949
$$ 168284078 167209441 164895080 161938212 157765059 153007143 147830091 142233884 135958935
16706A35958935o178252o004710o503873n978364o359653n585814n715946n023140
$$ 135958935 129780683 123775973 117272100 111293736 104934083 99348269 93632323 88609183
16698H8609183m993831n116393l949324m825437l474408l645250l560508l060268
$$ 88609183 83615352 78498959 74549635 69724198 66249790 62604540 59044032 55983764
16690E5983764l066342k918865k677990k079296k609428j590843k264110k227002
$$ 55983764 52917422 49998557 47320567 45241271 42631843 41041000 38776890 36549888
16682C6549888j840790j136421j712812j474122j270222j317301r26284j308136
$$ 36549888 34709098 33572677 31859865 30385743 29115521 27798220 26871936 25563800
16674B5563800r38202j275986q67667p91383q10713n55516p09844r69732q43367
$$ 25563800 24625598 23349612 22481945 21690562 20879849 20324333 19614489 18644757 17801390
16665A7801390o62544l07435n76578q46905m85392n06135m77771j18200k47775
$$ 17801390 17138846 16831411 16254833 15407928 14922536 14416401 13938630 13820430 13572655
16656A3572655r63637l42081j39291m61906k89864n63539o40484j32592k51821
$$ 13572655 12609018 12266937 12127646 11665740 11375876 10812337 10171853 10039261 9787440
16647I787440j07465r7674l29731j58812k14047m99637j59935l23339q7790m85745
$$ 9787440 9679975 9582301 9252570 9093758 8879711 8380074 8220139 7896800 7809010 7323265
16637G323265L70233l70629j36031l37701k22140M6278m6360l9056m70305r0531
$$ 7323265 7693498 7322869 7186838 6849137 6626997 6673275 6626915 6587859 6117554 6027023
16627F027023k55855L7150l19215J1664K21150m64146n58727K17027K36964m58472
$$ 6027023 5771168 5808318 5489103 5500767 5721917 5257771 4699044 4916071 5153035 4694563
16617D694563K5612k74593L4006l48793J09310j47175j3850j62454k21548j67669
$$ 4694563 4720175 4445582 4479588 4130795 4240105 4092930 4079080 3916626 3695078 3527409
16607C527409O06537j64732m48497K8683K81221m09478k05094J71489J6689k30948
$$ 3527409 4133946 3969214 3520717 3549400 3830621 3421143 3216049 3387538 3404227 3173279
16597C173279K11515j91862j08070j44100K06804l978k88732L3219r2876j22232
$$ 3173279 3384794 3192932 3084862 2940762 3147566 3143588 2854856 2888075 2795199 2672967
16587B672967j11735K50503L1698k58207k07808j20067N19495j13307k28908J65129
$$ 2672967 2561232 2811735 2843433 2585226 2377418 2257351 2776846 2663539 2434631 2599760
16577B599760p99542N79518k49539R0867j74629j57038J51117M4905r2647M4735
$$ 2599760 1800218 2379736 2130197 2221064 2046435 1889397 2040514 2085419 1992772 2037507
16567B037507k236k3275M7230J5645N6973j53976j33664J0458L20313p66201L47135
$$ 2037507 2035271 2011996 2059226 2074871 2131844 1977868 1844204 1854662 2174975 1408774 1755909
16556A755909O0253l01799q039J72666k26144k8170J40958l60819M85197L586
$$ 1755909 1816162 1514363 1506324 1678990 1452846 1424676 1565634 1204815 1690012 1693598
16546A693598m90929o4443K93018K41375l67913J33162O566m45123O37431j98077
$$ 1693598 1202669 1138226 1431244 1672619 1304706 1437868 1444434 999311 1636742 1438665
16536A438665j2731J21562m53720K45745l3773l19753L76080k28836L18133r6640
$$ 1438665 1425934 1547496 1093776 1339521 1305748 985995 1362075 1133239 1451372 1354732
16526A354732k45558k60500M26147j27797K6083p1888J63370k55526R0850L34292
$$ 1354732 1109174 848674 1274821 1147024 1173107 1101219 1264589 1009063 1099913 1434205
16516A434205l75689j55626K61433m11580J22767J88633o7526j77235p8451L44748
$$ 1434205 1058516 902890 1164323 752743 875510 1064143 996617 819382 740931 1085679
16506A085679l0859j48766J79536l3927m15097L52683j53423P2552k52819j02581
$$ 1085679 1054820 906054 1085590 1051663 636566 989249 835826 908378 655559 552978
16496E52978J06655L7201L72127J52243l95543j07184j49737L28766k84724P0545
$$ 552978 659633 696834 1068961 1221204 825661 718477 568740 897506 612782 683327
16486F83327M04299D22629K75360K0196Q0334j26406J61200M2788j15507p9134
$$ 683327 1087626 422629 697989 718185 798519 672113 833313 876101 760594 681460
16476F81460N1722j49343k44757L12570j73012K95233k24846k06888L94856j70043
$$ 681460 733182 583839 339082 651652 478640 773873 549027 342139 736995 566952
16466E66952P9968k78902P1337L22267k13564J70734j29014q2057J2773j67712
$$ 566952 646920 368018 439355 761622 548058 718792 589778 507721 520494 352782
16456C52782L28829M5597J4604k69364j47423J88960j24774K4347L11683n4416
$$ 352782 681611 727208 741812 472448 325025 513985 389211 413558 725241 670825
16446F70825j84612Q5110j802j3314k8769j69522k8401L66304L8302C15546L54362
$$ 670825 486213 571323 569521 556207 527438 357916 329515 695819 734121 315546 669908
16435F69908k57062j36169J32111M5026J8783J65070k35012Q9254N6143B65591
$$ 669908 412846 276677 408788 453814 472597 637667 402655 491909 548052 265591
16424D35926J01851B36589J07972p6423K6080J10962m8078K32502k48251L89492
$$ 435926 537777 236589 344561 268138 294218 405180 357102 589604 341353 730845
16414G30845B56714R7134A56302N3536Q6869J6483L05320k45891j19835L07627
$$ 730845 256714 353848 156302 209838 296707 313190 618510 372619 252784 560411
16404E60411B33388n953L34783B68545L15085k58731j20110M63930B69353j3003
$$ 560411 233388 227435 562218 268545 583630 324899 204789 668719 269353 256350
16394B56350J53900o5398j01566J93867A75007R7422q6420g783B83591J74527
$$ 256350 410250 344852 243286 437153 175007 272429 186009 -7783 283591 458118
16384D58118c2931D73681A73284L48071B26031P8965O57M47061A79838L576L07395
$$ 458118 -32931 473681 173284 521355 226031 304996 305653 752714 179838 183414 490809
16373D90809F9716K16911J36514j94569J29525J15464H4557J95735p5207d713
$$ 490809 69716 286627 423141 228572 358097 473561 84557 280292 205085 -4713
16362D76814J5053P7820j08652k22635l2718Q8235a4315C80994A23748K26331
$$ 476814 491867 569687 461035 238400 205682 293917 -14315 380994 123748 350079
16352C50079I8635f2164D0006e7576A70949B4238J04531J37572D3668L27305A57950
$$ 350079 98635 -62164 40006 -57576 170949 24238 128769 266341 43668 370973 157950
16340A27187L19286A40163N5673L4259K60466j53547j05951H3193J90853F4299
$$ 127187 446473 140163 195836 230095 490561 337014 231063 83193 274046 64299
16329A05746K32845C1352L68180A99002H986K81523j13801c9403B41528L5025
$$ 105746 338591 31352 399532 199002 8986 290509 176708 -39403 241528 276553
16319B76553I7696B2662a48716M0299B59790j11136e2600F0701J35925c3113C61907
$$ 276553 97696 22662 -148716 -108417 259790 148654 -52600 60701 196626 -33113 361907
16307B05379a47948B05690H2266P9488K4125J53479E9915P7233c05683A70421
$$ 205379 -147948 205690 82266 161754 185879 339358 59915 137148 -305683 170421
16296B26801I1943K19895K69330A45779L27472B3411b18712i07A37306J03664
$$ 226801 91943 311838 581168 145779 473251 23411 -218712 -907 137306 240970
16286B40970J364F3704K0366Q3322K3776J26168o9527j09634k0747b0467A11344
$$ 240970 242334 63704 84070 167392 191168 317336 247809 138175 117428 -20467 111344
16274A22252M248j8339K76362f4000B12900I2526J89711H489P1618K27326A51678
$$ 122252 126500 108161 384523 -64000 212900 92526 282237 8489 80107 307433 151678
16262H5367M1172J58278p2820m8812E0884K27736A9126K44035a85602N5926B77287
$$ 85367 126539 284817 211997 163185 50884 278620 19126 263161 -185602 -129676 277287
16250D68702b17422B60207A19761L9566i7019j86223E5889P4627o1825j9360Q9416
$$ 468702 -217422 260207 119761 159327 -97019 -283242 55889 130516 68691 49331 138747
16239A38747a73294A68199m3464K41355A30803L52899j68323C4433b6405m4464
$$ 138747 -173294 168199 124735 366090 130803 483702 315379 34433 -26405 -70869
16229g0869D8054a57329E7039f1164B3824K88406e1069B11420a05185k1456K6228
$$ -70869 48054 -157329 57039 -61164 23824 312230 -51069 211420 -105185 -126641 -100413
16218a00413B03042b37A25716J1714D8020a34671H4166L097j286l2022Q015b6318
$$ -100413 203042 -237 125716 137430 48020 -134671 84166 87263 85977 53955 61970 -26318
16205b7968C25165O5508A25411D8827J72296R1669j05407r9486D0655a6142n0703
$$ -27968 325165 390673 125411 48827 221123 312792 207385 107899 40655 -16142 -66845
16194f6845H3523J87181j32213h484C64975j62640j3889b18393B75685k7626C4371
$$ -66845 83523 270704 138491 -8484 364975 202335 188446 -218393 275685 248059 34371
16182I7158A7038d24477A92161C1722J1273c40161A36024D2339a58773J540A92614
$$ 97158 17038 -424477 192161 31722 42995 -340161 136024 42339 -158773 -157233 192614
16170A76223g9687k86397B37332b40571A17664m4372J29110c0192j02493B46874
$$ 176223 -79687 -366084 237332 -240571 117664 73292 202402 -30192 -132685 246874
16159G6972L3291m9111K78108A15296A6549L8579A1302a07813F8745j2514b6077
$$ 76972 110263 61152 339260 115296 16549 55128 11302 -107813 68745 56231 -26077
16147A20274B2178J03925g4144q4476O7781A60534d23263e8110c061A87072j0175
$$ 120274 22178 126103 -74144 -158620 -90839 160534 -423263 -58110 -3061 187072 176897
16136A76897c496j17594d5955D0570R7689b3661l23616A1646a24829B28254j07314
$$ 176897 -3496 -121090 -45955 40570 138259 -23661 -347277 11646 -124829 228254 120940
16125A20940B525J35390B020c5587N734G630c41071A04905J32092a03906o3798
$$ 120940 2525 137915 2020 -35587 -29853 7630 -341071 104905 236997 -103906 -167704
16114a67704D0036e6469F7477a09711A12920M9260a5695D9876k3281n567K78042
$$ -167704 40036 -56469 67477 -109711 112920 162180 -15695 49876 26595 21028 299070
16103B99070b8276j632B74910j4467F9172C0037J16558G1403a99706N3952F6082
$$ 299070 -28276 -29908 274910 260443 69172 30037 146595 71403 -199706 -145754 66082
16091F737J71646b34400Q1682G1320J65000O4434A47194o1478a17629K8216j35377
$$ 6737 178383 -234400 -152718 71320 236320 300754 147194 85716 -117629 -89413 -224790
16080b24790e4646j33717F8325k0096A9808a778j32805A06730a12700A35653b5055
$$ -224790 -54646 -188363 68325 48229 19808 -1778 -134583 106730 -112700 135653 -25055
16068d4115k0565r4149j27624B5462N8643g7772r0798C6504g4043L4186B87220
$$ -44115 -64680 -158829 -286453 25462 84105 -77772 -168570 36504 -74043 -39857 287220
16056a02016K0958L4127n65173E1758c2386q244a8133C75783A31123b3600A59232
$$ -102016 -81058 -46931 -612104 51758 -32386 -40630 -18133 375783 131123 -23600 159232
16044A6042b11719D2083d7678A07364C0580b30458E1911c093A93301c1971n423
$$ 16042 -211719 42083 -47678 107364 30580 -230458 51911 -3093 193301 -31971 -37394
16033c7394k02788B1305O5956b54416f9850B82408N1536a0703k04147J1136A35813
$$ -37394 -240182 21305 87261 -254416 -69850 282408 333944 -10703 -214850 -203714 135813
16021B03046l7166b05822d3272H5636h0042k2210G3443b99270K8933G184c8402
$$ 203046 165880 -205822 -43272 85636 -80042 -102252 73443 -299270 -270337 7184 -38402
16009a80470A62402i6382d5273o2026L8814C79993A84053h2601n8294b2349I6904
$$ -180470 162402 -96382 -45273 -107299 -68485 379993 184053 -82601 -140895 -22349 96904
15997H6061d8656k52140a12937B01365B4398K7781e8456j15826b7828a3857D33489
$$ 86061 -48656 -300796 -112937 201365 24398 52179 -58456 -174282 -27828 -13857 433489
15985f4807A23093K45061K1448A57648Q2272m9612J35353B2577L27263j23109
$$ -64807 123093 368154 389602 157648 239920 190308 325661 22577 349840 226731
15975B26731A0192K43441b93578g8151F7669e6032I8119A3096g1187G4579g5251
$$ 226731 10192 253633 -293578 -78151 67669 -56032 98119 13096 -71187 74579 -75251
15963b73488J16457L0349B37241A3414K02087r4830B5252a67425O4718F7089O385
$$ -273488 -157031 -126682 237241 13414 215501 120671 25252 -167425 -102707 67089 73474
15952G3474b76685r0527F0046b86926c6183o0483B65125a54281j25731m3913c2970
$$ 73474 -276685 -367212 60046 -286926 -36183 -96666 265125 -154281 -280012 -323925 -32970
15940a43040j11385J15177A28434N0365m3489a21671r8803e322j30718j9616M8615
$$ -143040 -254425 -139248 128434 178799 135310 -121671 -220474 -5322 -136040 -155656 -107041
15929a07041o2603P6315p2938A63655D7420C548b20486r2277g8971B25618b95940
$$ -107041 -169644 -93329 -166267 163655 47420 3548 -220486 -312763 -78971 225618 -295940
15917A33068a23693C8875J28151D6366a01460c2564j45593B56106m7436E0139
$$ 133068 -123693 38875 167026 46366 -101460 -32564 -178157 256106 208670 50139
15906I5997J88273G424a75771A16364C7140a72234F8277f8137C5002a08606C88937
$$ 95997 284270 7424 -175771 116364 37140 -172234 68277 -68137 35002 -108606 388937
15894a72320q4352J9333H1129K18731c4651A10336d24928A63164c8941q4899e8050
$$ -172320 -256672 -237339 81129 299860 -34651 110336 -424928 163164 -38941 -123840 -58050
15882C2683i8426K9899A99208a02652H0666l5819c8438r2825J3565H0231a05204
$$ 32683 -98426 -68527 199208 -102652 80666 44847 -38438 -131263 -117698 80231 -105204
15870b38406g5885C59059I8415O7217c80049A37582e1939C0890d2523G632c01606
$$ -238406 -75885 359059 98415 165632 -380049 137582 -51939 30890 -42523 7632 -301606
15858d0630A67564N8624C8212N4267K05019F3895a45516Q375A94001d4343A22904
$$ -40630 167564 226188 38212 92479 297498 63895 -145516 -137141 194001 -44343 122904
15846f9752G5516M5292c3425j30753O6191F7784F121b79272A2658a21619b7420
$$ -69752 75516 120808 -33425 -164178 -97987 67784 6121 -279272 12658 -121619 -27420
15834D2348P0608d1212k73432A63574b29709g6202p5716b5092B85002c81559a59424
$$ 42348 112956 -41212 -314644 163574 -229709 -76202 -151918 -25092 285002 -381559 -159424
15822D7287b9990j15702B34230E6153b52068c0500H2632h1849m6948C6826e547
$$ 47287 -29990 -145692 234230 56153 -252068 -30500 82632 -81849 -128797 36826 -5547
15810B6173J14608R8294a06949m2175D7956H026a03283g99E8273N1877A5111J12477
$$ 26173 140781 239075 -106949 -149124 47956 8026 -103283 -799 58273 110150 15111 127588
15798A27588c30083A66864a84767B7759a31947c986j440l6974A21952a58401B05547
$$ 127588 -330083 166864 -184767 27759 -131947 -3986 -5426 -42400 121952 -158401 205547
15786A28081a87548J6800F4336i506D0759K27191B8513J0303O8102D9620e4835
$$ 128081 -187548 -170748 64336 -9506 40759 267950 28513 38816 106918 49620 -54835
15774C273c21267A59761i9544q7921q4200J7816e2810B43371i0610r0829A56950
$$ 3273 -321267 159761 -99544 -187465 -271665 -253849 -52810 243371 -90610 -181439 156950
15762d12896J0113c4689C08460B4156K59053b5614A84009C959a58650B73570i3395
$$ -412896 -402783 -34689 308460 24156 283209 -25614 184009 3959 -158650 273570 -93395
15750E4818a38509A06724b4670C9449K93413J69598A49390G885O8450K55874E1028
$$ 54818 -138509 106724 -24670 39449 332862 502460 149390 7885 76335 332209 51028
15738A05983K8039b88246J12595H7798b90029K6292J21681G4003J42119i210j1873
$$ 105983 134022 -288246 -175651 87798 -290029 -263737 -142056 74003 216122 -9210 -21083
15727b1083D3116a27113c4144a4684H731b07046n6381B16863B5785a43627F681
$$ -21083 43116 -127113 -34144 -14684 8731 -207046 -263427 216863 25785 -143627 6681
15715c27887A7301e8371A92972a33168k39033E6121L617K2361k6084K184Q440
$$ -327887 17301 -58371 192972 -133168 -372201 56121 59738 82099 56015 58199 66639
15704F6639a4804p5855o8205j37641i4894b0509C81079a37440j28270m4089C23059
$$ 66639 -14804 -90659 -158864 -296505 -94894 -20509 381079 -137440 -265710 -309799 323059
15692E477K67720p3806h42j40062C29074a22332B82942a29772j95434A25327c1603
$$ 5477 273197 199391 -842 -140904 329074 -122332 282942 -129772 -325206 125327 -31603
15680e1291j03586m7388C0033K1337q578N559i3841M0814A55106j3573b1209k050
$$ -51291 -154877 -202265 30033 51370 42792 48351 -93841 -53027 155106 141533 -21209 -23259
15668b3259j74448B50b03922o1301J10111c4156B04606a44910k89139K07456K2802
$$ -23259 -197707 250 -203922 -265223 -155112 -34156 204606 -144910 -434049 -226593 -203791
15657b03791i4967m10346e9593B42466d21225C9144J24529a106D9156a59487j92663
$$ -203791 -94967 -505313 -59593 242466 -421225 39144 163673 -1106 49156 -159487 -352150
15646c52150F7641a4732A71143c23018B20524E5610P016H734c6871p4726D7796
$$ -352150 67641 -14732 171143 -323018 220524 55610 62626 8734 -36871 -111597 47796
15634F2037b39511f2505A25785A8568J32441d8654J2284A54349m9854L09904f4311
$$ 62037 -239511 -62505 125785 18568 151009 -48654 -36370 154349 104495 414399 -64311
15622a09833j55920a6837A40003F7976R7030a6954A1015J22206a51939B30233
$$ -109833 -265753 -16837 140003 67976 165006 -16954 11015 133221 -151939 230233
15611a3331F9025b4599m922l56452B3235J96940b75374H8221c00367D6563G890
$$ -13331 69025 -24599 -29521 -385973 23235 220175 -275374 88221 -300367 46563 7890
15599a90052l7143k9761a07377k20502b2434B16463r7656a77986l9308A19220
$$ -190052 -227195 -256956 -107377 -327879 -22434 216463 118807 -177986 -217294 119220
15588f9468B62406a03898C81324b69916g1406n463B16672c09821A8027J12267
$$ -69468 262406 -103898 381324 -269916 -71406 -76869 216672 -309821 18027 130294
15578A30294C5906j169j4915b29079F29J03667J9295c6087C41426a45420o3988
$$ 130294 35906 34737 19822 -229079 629 104296 123591 -36087 341426 -145420 -209408
15567b09408R1326P428B73644A28324J16602A2174K25120R663k4347d49910A26418
$$ -209408 -118082 -110654 273644 128324 244926 12174 237294 246957 222610 -449910 126418
15555d06056b4295l82287i5020C51524b56030d2543m276j50259A52706o2245a02169
$$ -406056 -24295 -406582 -95020 351524 -256030 -42543 -46819 -197078 152706 90461 -102169
15543C25089e137k43971A48319A6484K85750E0385a03088P174A33708b33358A82443
$$ 325089 -5137 -249108 148319 16484 302234 50385 -103088 -95914 133708 -233358 182443
15531a91360d8627m5870A85966I1761O1353i9880M5261A70345G7717a001j38660
$$ -191360 -48627 -94497 185966 91761 153114 -99880 -54619 170345 77717 -1001 -139661
15520a39661p3722m3349G8199A9255K54219c1319k19759b8921B24077h9166B3028
$$ -139661 -213383 -256732 78199 19255 273474 -31319 -251078 -28921 224077 -89166 23028
15508E4291j5426b2213q1215c9106J6334A95191G9606d0832A56193Q4779N3716
$$ 54291 38865 -22213 -103428 -39106 -22772 195191 79606 -40832 156193 240972 294688
15497B94688i0292k1705j33719C59275i332D7919m233K12091a61443f1964A80391
$$ 294688 -90292 -111997 -245716 359275 -9332 47919 43686 255777 -161443 -61964 180391
15485a78420O7625L9630B1018K45543j22517o2533O8282J53462j28555E0424J4530
$$ -178420 -110795 -71165 21018 266561 144044 81511 149793 303255 174700 50424 64954
15474F4954J43653p52a23560b5418j41276F4010A1201g0933j1913B00052c15616
$$ 64954 208607 207855 -123560 -25418 -166694 64010 11201 -70933 -82846 200052 -315616
15462A39613F1588Q3478g989j80871j33206g4803A84744p1098J67810b0012A67542
$$ 139613 61588 145066 -7989 -188860 -322066 -74803 184744 113646 281456 -20012 167542
15450A3582J4951R312d5306k9572A32678H108c6165j86020B81088D5466j1441
$$ 13582 28533 37845 -45306 -74878 132678 8108 -36165 -222185 281088 45466 34025
15439C4025a87090J9743B04124O8099e5545I6030K96070a006A26418e0815A20734
$$ 34025 -187090 -167347 204124 272223 -55545 96030 392100 -1006 126418 -50815 120734
15427h5980j09504A55118i128C68689G2797e7882j97426j23449a1310A6187e0387
$$ -85980 -195484 155118 -9128 368689 72797 -57882 -255308 -378757 -11310 16187 -50387
15415e0464j36967A30479B7770Q1683a91341A7798J9808c52231b7342p2274j0523
$$ -50464 -187431 130479 27770 109453 -191341 17798 37606 -352231 -27342 -99616 -110139
15404a10139A09398b8924E3502J26656a5134k5146j67620B84793A16089N5468
$$ -110139 109398 -28924 53502 180158 -15134 -40280 -207900 284793 116089 171557
15394A71557i4019k20769A42623A5378a62618j01866J4479a17059B03979K71662
$$ 171557 -94019 -314788 142623 15378 -162618 -264484 -250005 -117059 203979 475641
15384D75641A63422b97403D8533D97J00779a2128A07805a14758B6991j2148c58564
$$ 475641 163422 -297403 48533 497 101276 -12128 107805 -114758 26991 14843 -358564
15372b93751b9892A40150a56972e0941A04467J05302j7902A4691h6678a0412l4405
$$ -293751 -29892 140150 -156972 -50941 104467 209769 191867 14691 -86678 -10412 -44817
15361d4817G9672a23350c6610l97386F7429g6529C07924a85840L2576G0808a31795
$$ -44817 79672 -123350 -36610 -433996 67429 -76529 307924 -185840 -153264 70808 -131795
15349b52982c4685D1518a29755A80307d9278I9581R3483d0897k01304C24203d7928
$$ -252982 -34685 41518 -129755 180307 -49278 99581 193064 -40897 -242201 324203 -47928
15337a60597f4186r6597j22840c394A48165d3443a1613A72938G0265h9162p1345
$$ -160597 -64186 -160783 -283623 -3394 148165 -43443 -11613 172938 70265 -89162 -160507
15326a60507D44605f185k13913L4050P7569B63856A21105l4986a21154n534j68032
$$ -160507 444605 -6185 -220098 -186048 -108479 263856 121105 86119 -121154 -126688 -294720
15315b94720i7950I4882L7883a15487H5185C6008J24538c6355k83886C6509J34833
$$ -294720 -97950 94882 132765 -115487 85185 36008 160546 -36355 -320241 36509 171342
15304A71342J96850C6836b9540l14533C52399b67804f1k02809A32818g2680G5009
$$ 171342 368192 36836 -29540 -344073 352399 -267804 -61 -202870 132818 -72680 75009
15292A30707m895a62216l199D42961a37834J3415j16c4122A17846i1978e931H2080
$$ 130707 125812 -162216 -165415 442961 -137834 -124419 -124535 -34122 117846 -91978 -5931 82080
15279B49120a52201k9726C25908a37517n6074D07789b8903c746l0235F4854e9298
$$ 249120 -152201 -181927 325908 -137517 -193591 407789 -28903 -3746 -33981 64854 -59298
15267A12164J26854c8446j3873j59384b5860j9926A93186c2474o2572A74839g0377
$$ 112164 239018 -38446 -52319 -211703 -25860 -45786 193186 -32474 -95046 174839 -70377
15255F5308b7161A43506Q5444a14350B37100j11710j4719Q46064L39141n50177
$$ 65308 -27161 143506 228950 -114350 237100 125390 110671 956735 1295876 745699
15245G45699J56023j46538A42147Q4872m371a19905d5929C62170G5996i0532k6873
$$ 745699 901722 755184 142147 227019 222648 -119905 -45929 362170 75996 -90532 -117405
15234a17405E62193A46178B3068K6431i1708C7178L30820C8050J61360G0386K29230
$$ -117405 562193 146178 23068 49499 -91708 37178 367998 38050 199410 70386 299616
15223B99616c01505H0471d154n9229l7888I9553m0210N6796a43963C5002a9370
$$ 299616 -301505 80471 -4154 -63383 -101271 99553 59343 116139 -143963 35002 -19370
15211a47660F872b10943B50693a46752B65197F1027O0589C6704a4468B77756j36016
$$ -147660 6872 -210943 250693 -146752 265197 61027 121616 36704 -14468 277756 141740
15200A41740c2220B05915F9433G167a58398C99179B9241K21390B869h4372r2869
$$ 141740 -32220 205915 69433 7167 -158398 399179 29241 250631 2869 -84372 -177241
15189a77241C1107Q8709b06900F4221o290b7625A74543P6943B9251h5816F1305
$$ -177241 31107 119816 -206900 64221 57931 -27625 174543 251486 29251 -85816 61305
15177A68837E1790A0913K16401j01913c55225A41881A3749O3881b88854C55693
$$ 168837 51790 10913 227314 125401 -355225 141881 13749 77630 -288854 355693
15166A63432N4542I9225j8121g0730C15921G9663K29725E6372b2354c968B41955
$$ 163432 217974 99225 81104 -70730 315921 79663 309388 56372 -22354 -3968 241955
15154f5538B5288J65984c56177a3891e04l80799I5881a23834F1737A8194c5629
$$ -65538 25288 191272 -356177 -13891 -504 -381303 95881 -123834 61737 18194 -35629
15142C0499J40656b1034H2032e4846r520G1972K9447M3874a73835H6907c41878
$$ 30499 171155 -21034 82032 -54846 -64366 71972 101419 145293 -173835 86907 -341878
15130g7424A58456G918R5620J10490K16471j94115r3814J5095g6195A57318J22650
$$ -77424 158456 7918 103538 214028 430499 236384 142570 157665 -76195 157318 279968
15119B79968b20282R3276c3266j85540A96744F0600a51160F5794d70244B58250
$$ 279968 -220282 -127006 -33266 -218806 196744 60600 -151160 65794 -470244 258250
15108B2215k767J23017c1752r8365a7012C03990Q1495a35564C04960j02421F5918
$$ 22215 19448 142465 -31752 -130117 -17012 303990 385485 -135564 304960 202539 65918
15096f0851A80325J15330A35863N0151A0789K76565b05198H9800b50140H1152
$$ -60851 180325 295655 135863 186014 10789 287354 -205198 89800 -250140 81152
15085a74667A15880O9959p43R9826f5141F5573K02740j8183D7704K05292a09573
$$ -174667 115880 185839 185096 284922 -65141 65573 268313 250130 47704 252996 -109573
15073F6889H446J54820d337l3795j13690G5003M5720J6365R4080b2121A61669
$$ 66889 8446 163266 -4337 -38132 -151822 75003 120723 137088 231168 -22121 161669
15061A83646e7939C22310j54284b3902n7501C33653i4334H7406J01639k9650L42718
$$ 183646 -57939 322310 168026 -23902 -81403 333653 -94334 87406 189045 159395 502113
15050E02113D2064a3129C09723B1109J58138H7828B5078J51426O5168h253A63987
$$ 502113 42064 -13129 309723 21109 179247 87828 25078 176504 241672 -8253 163987
15038E3111K3490g0149A33665E5433L32645a51788I6913a91394B97875a66387
$$ 53111 76601 -70149 133665 55433 388078 -151788 96913 -191394 297875 -166387
15027c5121A01061R1844N2827I1533B1199J20937a9390k9692A60703F0455a82983
$$ -35121 101061 192905 245732 91533 21199 142136 -19390 -49082 160703 60455 -182983
15015B29117K74482k49079K30910A27584K39335A03377J04116J25848j29003J67663
$$ 229117 503599 254520 485430 127584 366919 103377 207493 333341 204338 372001
15005C72001B1035J90109b52j10530C1418J86372q8833L6657J30339L2784p1600
$$ 372001 21035 211144 -252 -110782 31418 217790 128957 165614 295953 328737 257137
14994B57137A06877J23890J00548M7070A48523a74477B68098d798G38732a11160
$$ 257137 106877 230767 331315 378385 148523 -174477 268098 -4798 738732 -111160
14983A23623J37933j13993e9396C5147K96011j7564a64588C66792r9821A02858
$$ 123623 261556 147563 -59396 35147 331158 313594 -164588 366792 266971 102858
14972b34194C36688B9245K80447R7380A20987b20420D18221p5407B7158L67252
$$ -234194 336688 29245 309692 407072 120987 -220420 418221 342814 27158 394410
14962C94410j20654R2744K68373A30564N82J03489k2122A8101J34370J71977C149
$$ 394410 273756 366500 634873 130564 131146 234635 212513 18101 152471 324448 3149
14950C44329p2609j27925Q5169R2246A57183F1772M90702G8172a23915D29043
$$ 344329 271720 143795 228964 321210 157183 61772 552474 78172 -123915 429043
14939A5765L29536A53121M71537l10519c1234C02704L6516L14308j49262b05508
$$ 15765 345301 153121 624658 314139 -31234 302704 339220 653528 504266 -205508
14928D63587k06187l9752b9564C51165r0164J29862M5440N9955H111K91356B7771
$$ 463587 257400 217648 -29564 351165 261001 390863 436303 496258 8111 299467 27771
14916B68500J12031j0708n3392p1303Q644K86189k22646j8816J00687j46201J39235
$$ 268500 380531 369823 316431 245128 253772 539961 317315 298499 399186 252985 392220
14905C92220H8084L67894n4998m7673A67854L13187j98089l1632k7573c04670
$$ 392220 88084 455978 400980 353307 167854 481041 282952 251320 223747 -304670
14894f3036B12441p7555A244K48074J84743j92186a2570D24996a5711k1783C77344
$$ -63036 212441 134886 1244 249318 434061 241875 -12570 424996 -15711 -37494 377344
14882G5590K31222o6120P8418l3910j4360a0027B61440H9670P7040J53915N2278
$$ 75590 306812 240692 319110 285200 270840 -10027 261440 89670 166710 320625 372903
14871C72903J2548b240H6534J05298F2639M44797E9825J82474N2779H1412L09407
$$ 372903 385451 -2240 86534 191832 62639 507436 59825 242299 295078 81412 390819
14860C90819A92065K48563A85077Q7639M75267k77712K13071C18224j8509J94915
$$ 390819 192065 440628 185077 272716 747983 470271 683342 318224 299715 494630
14850D94630A66350M2962P5457K99374j94656I570K00155J93967j23449n7654
$$ 494630 166350 209312 284769 584143 389487 9570 209725 403692 280243 222589
14840B22589L49139J84267l69149J8564L09003j41989m0405j13803K5886k9507
$$ 222589 571728 755995 386846 405410 714413 572424 532019 418216 444102 414595
14830D14595n0505A30357j762J25798K11830B12720J72101j74797K54373A73308
$$ 414595 364090 130357 128595 254393 466223 212720 384821 210024 464397 173308
14819B18787B9631J66763J68824j57481J62375j0161J37091p5278l7510J51461
$$ 218787 29631 196394 365218 207737 370112 359951 497042 421764 384254 535715
14809E35715B39542K33530N8575A34213L35946P8004k30371J14620R2344j50882
$$ 535715 239542 473072 531647 134213 470159 548163 317792 432412 524756 373874
14799C73874K34829B83256K00193k22208K30607K56231r7978B70885j2737K00272
$$ 373874 608703 283256 483449 261241 491848 748079 650101 270885 258148 458420
14789D58420K09692B35240Q0404J17641J9406j85157L35006q4142R202Q3527B32819
$$ 458420 668112 235240 315644 433285 452691 267534 602540 518398 527600 611127 232819
14777B38450K73733k0096A24005M91792J0515j99576n3969K57681O3920B85225
$$ 238450 512183 492087 124005 615797 626312 426736 372767 630448 694368 285225
14766F62871p19k90178j58077J08436K93195j18361R8026j65228J65776j40546
$$ 662871 662152 371974 213897 322333 615528 497167 595193 429965 595741 455195
14756D55195J15796j83903k1738M20972j43679l6968j69952J94164k40204K93940
$$ 455195 570991 387088 365350 786322 642643 605675 435723 629887 389683 683623
14746F83623K5180l17241m4186L7340K30501L1719K04202k45840O691k9247N0587
$$ 683623 708803 391562 347376 384716 615217 646936 851138 605298 611989 582742 633329
14735F33329J09502j62313K85637l19427J79570Q8144J0905k95588N2845O605
$$ 633329 742831 580518 866155 546728 726298 814442 825347 529759 582604 589209
14725E89209J59949j68844j45875J31773K94289k26970k65460J60296L48606p3514
$$ 589209 749158 580314 434439 566212 860501 633531 368071 528367 876973 803459
14715H03459j93271L70767D81433K10711j24551l3230J16272J84951k29512K32686
$$ 803459 610188 980955 481433 692144 567593 534363 650635 835586 606074 838760
14705H38760j23995J99149p0785k10819L52740k94366L053J84186k97960M09663
$$ 838760 714765 913914 843129 632310 985050 690684 693737 877923 579963 989626
14695I89626D06439J45844K12555k28699J75379J7975p3681J33773P2974C65953
$$ 989626 406439 552283 764838 536139 711518 729493 655812 789585 862559 365953
14684H40992k44826Q1130M0345N5339l40764K49708K58922j28462n2782j30171
$$ 840992 596166 677296 717641 772980 432216 681924 940846 812384 759602 629431
14674F29431K54048j7584j15795J63991M0313K2237o6800J14369j87926M2130
$$ 629431 883479 865895 750100 914091 954404 976641 909841 1024210 836284 878414
14664H78414J4545K4168k04971L98190k23102K34421E48491M74965O9469l43085
$$ 878414 892959 917127 712156 1110346 887244 1121665 548491 1023456 1092925 749840
14654G49840L73595j11769j18418J79235r0821M52800m43309k6119k06978K16648
$$ 749840 1123435 1011666 893248 1072483 981662 1434462 991153 965034 758056 974704
14644I74704m3947j11396R4996j83499J70802K35613j45474L53312k01082j9810
$$ 974704 930757 819361 914357 730858 901660 1137273 991799 1345111 1144029 1124219
14634A124219k61942M41415k74575j22859O06491l22050J16095j27536q1001l02094
$$ 1124219 862277 1303692 1029117 906258 1512749 1190699 1306794 1179258 1098257 796163
14624G96163L91189k25944o9916L89842k61073L61508m82423O25242o7738k77777
$$ 796163 1187352 961408 891492 1281334 1020261 1381769 899346 1524588 1456850 1179073
14614A179073J63849k22811r7026O1664l259j46458O93987j61121m77978L4431
$$ 1179073 1342922 1120111 1023085 1084749 1081490 935032 1629019 1467898 989920 1024351
14604A024351M79056j46570J40830O2944k10964M7055N3480m6559J78579m25776
$$ 1024351 1503407 1356837 1497667 1560611 1349647 1396702 1450182 1403623 1582202 1156426
14594A156426p3659P87718j62783j69211k3773j72104L32995k55000M22492m30752
$$ 1156426 1082767 1870485 1707702 1538491 1514718 1342614 1675609 1420609 1843101 1412349
14584A412349J95799J76950j30921L3338j90260J64097m1354k9271J51774P6578
$$ 1412349 1608148 1785098 1654177 1687515 1497255 1661352 1619998 1590727 1742501 1819079
14574A819079p8867J85379o62289J49456L50881K31498P5468p1110L3313Q1907
$$ 1819079 1740212 1925591 1263302 1412758 1763639 1995137 2070605 1999495 2032808 2114715
14564B114715j34603K24288q024k2477K02433N4261j04139O0283K35163O07887
$$ 2114715 1980112 2204400 2196376 2173899 2376332 2430593 2326454 2386737 2621900 3229787
14554C229787L9199L9842M85938M18698J412156K782133O508587O331875Q178382
$$ 3229787 3268986 3308828 3794766 4213464 5625620 8407753 14916340 21248215 29426597
14545B9426597J0392198A9261011G490017C487311j277379j47130m53203L64003
$$ 29426597 39818795 19261011 7490017 3487311 2209932 2062802 1609599 1973602
14537A973602l47007J48214j00924o2442J2837L73082j47742k70470L95690J15527
$$ 1973602 1626595 1774809 1673885 1611443 1624280 1997362 1849620 1579150 1974840 2090367
14527B090367l65833K04480L8830k3511J02612k59312J48075J07115P895O3097
$$ 2090367 1724534 1929014 1967844 1944333 2046945 1787633 1935708 2042823 2050718 2113815
14517B113815l7935L22316p2681k9319q4605j369l1747K24833O5538k24380k3891
$$ 2113815 2075880 2398196 2325515 2296196 2211591 2210222 2178475 2403308 2468846 2244466 2220575
14506B220575K36748P7822j70939R3004J70527l2246M6806J02318l3447j3267
$$ 2220575 2457323 2535145 2364206 2457210 2627737 2595491 2642297 2744615 2711168 2697901
14496B697901L68954P7112l23757k65903P01570n39000K62876J3118Q0105l51471
$$ 2697901 3066855 3143967 2820210 2554307 3255877 2716877 2979753 2992871 3072976 2721505
14486B721505K28518R1276P1342N5306k10468J49225N79951l63025j7585O4504
$$ 2721505 2950023 3041299 3112641 3167947 2957479 3106704 3686655 3323630 3306045 3370549
14476C370549k32073J69460L1103K76183j82152L29323l94349L00618L5077J68000
$$ 3370549 3138476 3307936 3339039 3615222 3433070 3762393 3368044 3668662 3703739 3871739
14466C871739l07117L61484j0412K25750q6236p3573K31665l57068K43936k90290
$$ 3871739 3564622 3926106 3915694 4141444 4055208 3981635 4213300 3856232 4100168 3809878
14456C809878J09141J67894J02098K96019K285j07490M63286k6137n8748J19626
$$ 3809878 3919019 4086913 4189011 4485030 4487315 4379825 4843111 4816974 4758226 4877852
14446D877852j66826K46050m11418j4229N03097k7501J8756M66132l26664P8149
$$ 4877852 4711026 4957076 4545658 4531429 5034526 5007025 5025781 5491913 5165249 5243398
14436E243398L75978o1390K71818k53802j07329M8669K30032p1841K97818J54697
$$ 5243398 5619376 5557986 5829804 5576002 5468673 5517342 5747374 5675533 5973351 6128048
14426F128048N4205J79367j842m2356N465J29355J65808K99488j18400J07839
$$ 6128048 6182253 6361620 6359778 6317422 6322887 6452242 6618050 6917538 6799138 6906977
14416F906977J09425K80715j32346J6932K70579l54269O75864J66273o4157J62471
$$ 6906977 7016402 7297117 7164771 7181703 7452282 7098013 7773877 7940150 7875993 8038464
14406H038464p7129K21528j94708K04509K07554L17411P340M66036Q350j30783
$$ 8038464 7961335 8182863 7988155 8192664 8400218 8717629 8724969 9191005 9199355 9068572
14396I068572M91152r285O1443K89121K14723O3145K50409L09087o3596K75589
$$ 9068572 9559724 9550439 9611882 9901003 10115726 10178871 10429280 10738367 10674771 10950360
14386A0950360L18804J2829K01407K27042K84914K36842L91033j61649K47097
$$ 10950360 11269164 11281993 11483400 11710442 11995356 12232198 12623231 12461582 12708679
14377A2708679M91096O0901N52173k1032L12322P32519j19006N44103j1115L94387
$$ 12708679 13199775 13260676 13812849 13791817 14104139 14836658 14717652 15261755 15250640 15645027
14367A5645027M25633K46122K44083M10805L14349L85718M17746K12830O91903
$$ 15645027 16070660 16316782 16560865 16971670 17286019 17671737 18089483 18302313 18994216
14358A8994216J35220M09458Q05050J48896P65569M95325P13913K10888O6545
$$ 18994216 19129436 19538894 20343944 20492840 21258409 21753734 22467647 22678535 22745080
14349B2745080J373440M11332O17473N74086Q78628N56647N65642Q48133P38192
$$ 22745080 24118520 24529852 25147325 25721411 26600039 27156686 27722328 28570461 29308653
14340B9308653Q56280Q56243Q50890P84619J053713P58200J396895J142088J193327
$$ 29308653 30164933 31021176 31872066 32656685 33710398 34468598 35865493 37007581 38200908
14331C8200908J056072J204257J045671J337479J894473J145018J388936J882175
$$ 38200908 39256980 40461237 41506908 42844387 44738860 45883878 47272814 49154989
14323D9154989J548754J880698J628446K036412K360365K080250K289392K719023
$$ 49154989 50703743 52584441 54212887 56249299 58609664 60689914 62979306 65698329
14315F5698329K291876K850928K607367L443377K958406L537854L661058L680017
$$ 65698329 67990205 70841133 73448500 76891877 79850283 83388137 87049195 90729212
14307I0729212M329494M300435M679713M851875M942401O061548N489208O533419
$$ 90729212 95058706 99359141 104038854 108890729 113833130 119894678 125383886 131917305
14299A31917305O730143P074109P830227Q091091Q606855R241019R807881J0610047
$$ 131917305 138647448 145721557 153551784 161642875 170249730 179490749 189298630 199908677
14291A99908677J1018514J1589730J2851436J2865199J3503937J4602069J4522048
$$ 199908677 210927191 222516921 235368357 248233556 261737493 276339562 290861610
14284B90861610J5404283J5740052J5293170J5536998J5625160J5143626J4282675
$$ 290861610 306265893 322005945 337299115 352836113 368461273 383604899 397887574
14277C97887574J3413574J1979934J0601329P945201J156625m861189l772309
$$ 397887574 411301148 423281082 433882411 441827612 442984237 438123048 434350739
14270D34350739K763654M337862j967872n447418q288229j0274817j2565365j4181359
$$ 434350739 437114393 441452255 439484383 434036965 425748736 415473919 402908554 388727195
14262C88727195j5505637j6374209j6450650j6649012j6114138j5711195j5187474
$$ 388727195 373221558 356847349 340396699 323747687 307633549 291922354 276734880
14255B76734880j4208760j3928957j3170556j2809660j1784536j1192461j0715319
$$ 276734880 262526120 248597163 235426607 222616947 210832411 199639950 188924631
14248A88924631r818369r579117q441955q187748p538823p143661o869705o024487
$$ 188924631 179106262 169527145 161085190 152897442 145358619 138214958 131345253 125320766
14240A25320766n743650n745269n084279m969100m392675m820215l830760m190320
$$ 125320766 119577116 113831847 108747568 103778468 99385793 94565578 90734818 86544498
14232H6544498l215359l143738l312076l304317k724941k877136k493082k689163
$$ 86544498 83329139 80185401 76873325 73569008 70844067 67966931 65473849 62784686
14224F2784686k345425k365946j803317j936654j498483j842466j941263j637353
$$ 62784686 60439261 58073315 56269998 54333344 52834861 50992395 49051132 47413779
14216D7413779j559120j060082j618406j273642j223181j329225j073965j464644
$$ 47413779 45854659 44794577 43176171 41902529 40679348 39350123 38276158 36811514
14208C6811514j072180n26255r42938j457538o87655q04571j111516r76365k47457
$$ 36811514 35739334 35213079 34270141 32812603 32124948 31320377 30208861 29232496 28985039
14199B8985039j089119o06962r23128p10290l28216n18580o44533p34691n27210
$$ 28985039 27895920 27288958 26365830 25655540 25327324 24808744 24164211 23429520 22902310
14190B2902310m24503p63722m23624p11747l53845n58619o10759l51294m62000
$$ 22902310 22477807 21714085 21290461 20578714 20224869 19666250 19055491 18704197 18242197
14181A8242197M3220m81520m95456l50280m55557k20068m43793l44644K23429
$$ 18242197 18285417 17803897 17308441 16958161 16502604 16282536 15838743 15494099 15717528
14172A5717528q60269k18554p3218m61378j06903m88383k1009n74547n2116j56116
$$ 15717528 14857259 14638705 14565487 14104109 13997206 13508823 13487814 12913267 12861151 12705035
14162A2705035l83559p2029k69755m09886j89863J04854Q2097o03731J33355n60361
$$ 12705035 12321476 12249447 11979692 11569806 11379943 11484797 11566894 10963163 11096518 10536157
14152A0536157J02843l42326k75428J70795k53362l88194K840k62497j21945P0647
$$ 10536157 10639000 10296674 10021246 10192041 9938679 9550485 9553325 9290828 9168883 9239530
14142I239530j04697R9029m94834k99588J41914K37582n30576k21786J41016k30753
$$ 9239530 9134833 9233862 8739028 8439440 8581354 8818936 8288360 8066574 8207590 7976837
14132G976837J9649m65276j798k28892r8565K82327l20771l48478j14185J31551
$$ 7976837 7996486 7531210 7529412 7300520 7201955 7484282 7163511 6815033 6700848 6832399
14122F832399n8877J3843n54846M36828k8157l16162j49825k95658J29827r801
$$ 6832399 6773522 6787365 6232519 6669347 6641190 6325028 6175203 5879545 6009372 5999571
14112E999571Q6247p6659m77861N2283J69672l46928P1051j77867q2562K05757
$$ 5999571 6085818 6009159 5531298 5583581 5753253 5406325 5477376 5299509 5216947 5422704
14102E422704n7725j26406k95427p6728J92643l3383j87917o0955r8898l8357
$$ 5422704 5364979 5238573 4943146 4866418 5059061 5025678 4837761 4776806 4677908 4639551
14092D639551n5745O2542M9902L9065l96309q722j17167J90385j22913m154o7713
$$ 4639551 4583806 4646348 4696250 4735315 4339006 4330284 4213117 4403502 4280589 4276435 4208722
14081D208722l6209k32795J12882k89561J98041r5941l8189o2267j43073J99632
$$ 4208722 4172513 3939718 4052600 3763039 3961080 3865139 3826950 3764683 3621610 3821242
14071C821242l7606r6766j34899j6353j05321K52471j52199J70250l15906K00524
$$ 3821242 3783636 3686870 3551971 3535618 3430297 3682768 3530569 3700819 3384913 3585437
14061C585437K4956l88718K32539r3343K05200l848k84339n0054N4820k60266
$$ 3585437 3610393 3221675 3454214 3360871 3566071 3562223 3277884 3227830 3282650 3022384
14051C022384k4468J28169j02199j28535j24220j34521J37690k74086O9091K10353
$$ 3022384 2997916 3126085 3023886 2895351 2771131 2636610 2774300 2500214 2569305 2779658
14041B779658j3353j65972J79610k88659K41598J06178m32527K66324l26055M19916
$$ 2779658 2766305 2600333 2779943 2491284 2732882 2839060 2406533 2672857 2346802 2766718
14031B766718k33172K25394r5124j05210K35690n00488J70481j2501Q7137k99873
$$ 2766718 2533546 2758940 2663816 2558606 2794296 2293808 2464289 2451788 2538925 2239052
14021B239052k46737J01472J25648K8158o6341k52923n2625K05430k17926j19065
$$ 2239052 1992315 2093787 2219435 2247593 2181252 1928329 1875704 2081134 1863208 1744143
14011A744143J92508M208J83804j15920k5328j72152K79153n29107N15210n231
$$ 1744143 1936651 1940859 2124663 2008743 1983415 1811263 2090416 1561309 2076519 2071288
14001B071288k2197n67297P043L41452J06855q4437j76215L02339j66464k70656
$$ 2071288 2049091 1481794 1488837 1830289 1937144 1852707 1676492 1978831 1812367 1541711
13991A541711M56834O53757J791995N439520O858822P791249J4815453j6045957
$$ 1541711 1998545 2652302 4444297 9883817 16742639 24533888 39349341 23303384
13983B3303384A1020297m115793k339391p12728l37485o34282j08705k70908j86823
$$ 23303384 11020297 6904504 4565113 3852385 3514900 2880618 2771913 2501005 2314182
13974B314182J7597k31087j99836K31508K1062l36945L00489O6915k66237K48492
$$ 2314182 2331779 2100692 1900856 2132364 2153426 1816481 2116970 2183885 1917648 2166140
13964B166140m92065L36842j99223j72596K11781J46549m02616M41913k97320
$$ 2166140 1674075 2010917 1811694 1639098 1850879 1997428 1594812 2036725 1739405
13955A739405k06363Q5529j34779j14521L10483N6971j96146L9194Q2943q7893
$$ 1739405 1533042 1618571 1483792 1369271 1679754 1736725 1540579 1579773 1662716 1574823
13945A574823l36794N5076L44806j94352L4651j00546K23951l38310R7859N5989
$$ 1574823 1238029 1293105 1637911 1443559 1478210 1377664 1601615 1263305 1361164 1417153
13935A417153M9279r3831K24114k77477j02422P6313j6662J09655M8722o3805
$$ 1417153 1466432 1372601 1596715 1319238 1216816 1293129 1276467 1386122 1434844 1371039
13925A371039M2819k4657k534r9068K8165o583j59608K77155j23417j31312Q5070
$$ 1371039 1413858 1389201 1386667 1287599 1315764 1309181 1149573 1426728 1303311 1171999 1257069
13914A257069q0330J64195k3430J88749m05604J46544N0420m24094L59222n3711
$$ 1257069 1176739 1340934 1317504 1506253 1100649 1247193 1297613 873519 1232741 1179030
13904A179030r2936K17535q8245l24359O23334m45977J5196l61835L53326J59968
$$ 1179030 1086094 1303629 1215384 891025 1514359 1068382 1083578 721743 1075069 1235037
13894A235037j54072J57558Q3360j31556o3840j3279k12545L45818j30899j11922
$$ 1235037 1080965 1238523 1321883 1190327 1126487 1113208 900663 1246481 1115582 1003660
13884A003660o5485Q4171j01763N0773O9r170j04829J65786K47332l70942M58351
$$ 1003660 938175 1022346 920583 971356 971425 962255 857426 1023212 1270544 899602 1357953
13873A357953k28622k41339l245Q9423o8812L25133l15723k29575M09575l16844
$$ 1357953 1129331 887992 884747 974170 905358 1230491 914768 685193 1094768 777924
13863G77924j55528O24370k51997K62651m46617J01948q1515L38345D20783K75552
$$ 777924 622396 1246766 994769 1257420 810803 912751 831236 1169581 420783 696335
13853F96335L94937k39314L0297j25297J80542J18091Q5508k17251k7540j37569
$$ 696335 1091272 851958 882255 756958 937500 1055591 1141099 923848 896308 758739
13843G58739J03148r3503K32092M5998l80150N37022m68826M0094k01455L29204
$$ 758739 861887 768384 1000476 1046474 666324 1203346 734520 774614 573159 902363
13833I02363q5578j44345o5407M8616J21665J10207N9178o7673J48414l16497
$$ 902363 816785 672440 607033 655649 777314 887521 946699 879026 1027440 710943
13823G10943N6717J65771j66857L34163l25623l31800K58189J32176k2904J2185
$$ 710943 767660 933431 766574 1100737 775114 443314 701503 833679 810775 822960
13813H22960k7864j13973J64803J59353N7464k48612j9986j2287j15299O1377
$$ 822960 795096 681123 845926 1005279 1062743 814131 794145 781858 666559 727936
13803G27936j09787K36274l49765m3306r1131L22927j16663R9861J39854C62146
$$ 727936 618149 854423 504658 461352 370221 693148 576485 676346 816200 362146
13792E07771K31529j9528J54393D06473O4403J04069R2079j83318J91082j91121
$$ 507771 739300 719772 874165 406473 470876 574945 667024 483706 674788 483667
13782D83667M00886k42629K05019j56266k93544K96560N910j44806K71025o4412
$$ 483667 884553 641924 846943 690677 397133 693693 699603 554797 825822 761410
13772G61410K2095j44873j80401J64214j31884l2506L00962C72992J19046m5091
$$ 761410 783505 638632 458231 622445 490561 458055 759017 372992 492038 446947
13762D46947L8105j08786K62056C15422J35074Q8116O5615q5734J3756R494J92658
$$ 446947 485052 376266 638322 315422 450496 538612 604227 518493 532249 541743 734401
13751G34401k37929L61337C59641J08917K06088k64338n1440J07930L85045l53770
$$ 734401 496472 857809 359641 468558 674646 410308 358868 466798 851843 498073
13741D98073k47273K84240j21678M9652k3135o2936K24979J70641j00626p4862
$$ 498073 250800 535040 413362 463014 439879 376943 601922 772563 671937 597075
13731E97075k09403P0994P8062j96937J8098K8079P3484k23196J33490M27097
$$ 597075 387672 458666 536728 339791 357889 385968 459452 236256 369746 796843
13721G96843k53904r2285J81762B86746J64278Q1359O965j95930L06019N1901
$$ 796843 542939 450654 632416 286746 451024 532383 539348 343418 649437 701338
13711G01338l04545N6130N4145R2211k70819j45710k0175K06161K37172j24380
$$ 701338 396793 452923 507068 599279 328460 182750 162575 368736 605908 481528
13701D81528j61714l4043K18155m4217J91363C12114J48175m6238o4782m8579
$$ 481528 319814 285771 503926 459709 651072 312114 460289 414051 349269 300690
13691C00690j05347J16154K34816o9490j13591q122j20238J44558L6882j59252
$$ 300690 195343 311497 546313 476823 363232 355110 234872 379430 416312 257060
13681B57060J48889J3379J37236j8044k33137J91886K25970B33015L46563B54972
$$ 257060 405949 419328 556564 538520 305383 497269 723239 233015 579578 254972
13670D86247J17268k08773O3719m8152r5201n5068N16857k03940K1006B52206
$$ 486247 603515 394742 458461 410309 315108 260040 776897 572957 593963 252206
13659F04016A94549K41314J20340M9985B44327K21517q7741I4669L97378L11508
$$ 604016 194549 435863 556203 606188 244327 465844 378103 94669 492047 803555
13649H03555B57956M3495j7915L40197B08095G8172R5394K58540j26626H9780
$$ 803555 257956 301451 283536 623733 208095 78172 173566 432106 305480 89780
13638D77655k37020O3126P306q9251P3880A21881M28808m9411r8599J76864g527
$$ 477655 240635 303761 311067 221816 295696 121881 550689 501278 402679 579543 -7527
13626F46757A01810L75039j52290Q1281A45375M19056k62880j4701J24425r292
$$ 646757 101810 476849 324559 405840 145375 564431 301551 286850 411275 401983
13616D01983F2140K91797d9902B72225P0016f7472C37148b20295C55803r0460
$$ 401983 62140 353937 -49902 272225 342241 -67472 337148 -220295 355803 265343
13606B65343e4104F3814Q9127J21777O2790j21704j69K7933J02352k6938j644
$$ 265343 -54104 63814 152941 274718 337508 215804 215635 243568 345920 318982 317338
13595C17338J5885j08392k2606L88462k06951O2954j91871J04273K5995A79112
$$ 317338 333223 224831 202225 590687 383736 446690 254819 359092 385087 179112
13584B79730J17872a30537D51281G24L34819j56872q2412M8373P943m6245J62885
$$ 279730 397602 -130537 451281 724 335543 178671 96259 144632 152575 106330 269215
13573B69215o6187J95778l086P583p8671E0987Q8708L0565K30880E1560J66719
$$ 269215 203028 398806 395720 403303 324632 50987 139695 170260 401140 51560 218279
13562B18279J4789O6733r268K7094J55091A94471K40845j6532A31128J33857J14803
$$ 218279 233068 299801 290533 317627 472718 194471 435316 418784 131128 264985 379788
13551C79788K12649L0475k57327e2122B04390P5006R2292j43107J35151K63633
$$ 379788 592437 622912 365585 -52122 204390 279396 371688 228581 363732 627365
13541F27365B23794A07736J35384F2228J48106J89207J76798A27598I253K54719
$$ 627365 223794 107736 243120 62228 210334 399541 576339 127598 9253 263972
13531B63972K74419C1844L14293C1723K26632r3088J91636b8275C4846O59411
$$ 263972 538391 31844 346137 31723 258355 165267 356903 -28275 34846 694257
13521F94257G6425N5724C1874K49947l7972A13025J0760J15063p4419R6518j4948
$$ 694257 76425 132149 31874 281821 243849 113025 123785 238848 164429 260947 245999
13510B45999J65726h8388B41071G9002J31238q9661K57519J17063B9676J14773
$$ 245999 411725 -88388 241071 79002 210240 120579 378098 495161 29676 144449
13500A44449a7480D34043r4627I1013L59039J18523f1179C59222q4586o1813L53876
$$ 144449 -17480 434043 339416 91013 450052 568575 -61179 359222 274636 212823 566699
13489E66699k55356j2835l2267J3076m7949F4808B485N03144E8187b9511B38685
$$ 566699 311343 298508 266241 279317 231368 64808 2485 505629 58187 -29511 238685
13477A2246J86458j9879K34644r1279D3937J16166J94786A06417K99481j88945
$$ 12246 198704 178825 413469 322190 43937 160103 354889 106417 405898 216953
13467B16953j8726h8212E37742I6554J47524j09699K7677m3625B991M9705J81887
$$ 216953 198227 -88212 537742 96554 244078 134379 162056 118431 2991 52696 234583
13456B34583n0858l0557L7115O8837d415F1907i0429c2281F3575d9445A20385
$$ 234583 183725 153168 190283 259120 -4415 61907 -90429 -32281 63575 -49445 120385
13444C11088G8059K17223A20448L31487A20864L14970j12869R5252k3270A47178
$$ 311088 78059 295282 120448 451935 120864 435834 322965 418217 394947 147178
13433A28039a2586B7446K45759L875m8486o067a24552A16271J54945m2029d1966
$$ 128039 -12586 27446 273205 277080 228594 222527 -124552 116271 271216 229187 -41966
13421I9554K87763E7218f8568C12789A38135P8383F0395J52842p4575q455N1599
$$ 99554 387317 57218 -68568 312789 138135 216518 60395 213237 138662 130207 181806
13410A81806l5639D8333L52204j86107A01331L20175j88819q7786A6369J61557
$$ 181806 146167 48333 400537 214430 101331 421506 232687 144901 16369 177926
13400A77926a5873B13683K45988A65564n9433C0499N05793i7919E8506L8260O5347
$$ 177926 -15873 213683 459671 165564 106131 30499 536292 -97919 58506 96766 162113
13389A62113O3835b7759B35605r0248N5272a8098C07874j25666J52651B9950J05951
$$ 162113 225948 -27759 235605 145357 200629 -18098 307874 182208 334859 29950 135901
13378A35901i6174C00913q776H4705K78361j08247j9617a50594A42587N2132K16061
$$ 135901 -96174 300913 292137 84705 363066 254819 235202 -150594 142587 194719 410780
13367D10780A66714J45116j52763g4526C04650o4386K87168D1305J30670C5550
$$ 410780 166714 311830 159067 -74526 304650 240264 527432 41305 171975 35550
13356A14295L8466O4447E9435J42932p1939C3988K03710c4131D7739J4447M25766
$$ 114295 152761 217208 59435 202367 130428 33988 237698 -34131 47739 62186 487952
13345D87952a43854H057M43156p1926J94690r2956n5709J7233j20757P481J96132
$$ 487952 -143854 8057 451213 379287 573977 481021 425312 442545 321788 329269 525401
13334E25401j86005a1624D5240J78359A07250F882M9302a3193F9422J61738F9117
$$ 525401 339396 -11624 45240 223599 107250 6882 56184 -13193 69422 231160 69117
13322B82980B5771b52935C90520G1431J06289D5510L25857j37536C06K00497H9622
$$ 282980 25771 -252935 390520 71431 177720 45510 371367 233831 306 200803 89622
13310i759B86791B056K90086j6244J84697A79917l1540K590K71258b34444A73621
$$ -9759 286791 2056 292142 275898 460595 179917 148377 150967 422225 -234444 173621
13298A43719a54576A98575G5580a4243G6710O4054M457M5145m8275o7440J02532
$$ 143719 -154576 198575 75580 -14243 76710 140764 145221 190366 142091 74651 177183
13287A77183C1358O6302J59641i9633B00018a21377B2622J99071F0769K83531
$$ 177183 31358 97660 257301 -99633 200018 -121377 22622 221693 60769 344300
13277C44300A368O9560e2651j89670B29358q0101M2663L3011b58782H285J5097
$$ 344300 1368 70928 -52651 -242321 229358 149257 191920 224931 -258782 8285 23382
13266B3382K02165L3528b59499C14448F6073a4248C05820D1140a59018I3033A935
$$ 23382 225547 259075 -259499 314448 66073 -14248 305820 41140 -159018 93033 1935
13254c0023A7890g5200k28951I4472P6404m5028J61846K191o7450A7675J97035
$$ -30023 17890 -75200 -304151 94472 170876 125848 287694 289885 222435 17675 214710
13243B14710K8324F4240e7487B55390j23368N3273g2406F6935R1536p7705a48049
$$ 214710 243034 64240 -57487 255390 132022 185295 -72406 66935 158471 80766 -148049
13231F251J7814Q1294N306l0684N0714D1059J82384d1206k9387A65977b0997j9897
$$ 6251 24065 105359 110665 79981 130695 41059 223443 -41206 -70593 165977 -20997 -40894
13219d0894b125B16347E9172f1358M035H9863g7954B26331E8697J04319n4823
$$ -40894 -2125 216347 59172 -61358 -57323 89863 -77954 226331 58697 163016 108193
13208A08193a46385I0273b6980D02661a97893c1654B81844r6525g1793E257J48626
$$ 108193 -146385 90273 -26980 402661 -197893 -31654 281844 185319 -71793 5257 153883
13197A53883K23088j20233e5217A43709E9749i3231E834J62636p2262F800g2809
$$ 153883 376971 256738 -55217 143709 59749 -93231 5834 168470 96208 6800 -72809
13185A42108L2823o2316J5574J37654h1618D69228a43207B64141a41397H3022
$$ 142108 174931 112615 128189 265843 -81618 469228 -143207 264141 -141397 83022
13174a32657G4314J39240o4134m9149a25669j46906A80380a64213g1371j02220
$$ -132657 74314 213554 149420 100271 -125669 -272575 180380 -164213 -71371 -173591
13164a73591D2389O0369E59J52719m849a5878H9045c04888A61337a9701j92543
$$ -173591 42389 102758 559 153278 148429 -15878 89045 -304888 161337 -19701 -212244
13153b12244R8575A49616n5714b77155J05582H7639r597k9182b0783B74905I2804
$$ -212244 -113669 149616 93902 -277155 -171573 87639 78042 48860 -20783 274905 92804
13141B14238c3465B0951a0852j20506c2906R137F4600a73643A79788N0694b19714
$$ 214238 -33465 20951 -10852 -131358 -32906 -23769 64600 -173643 179788 230482 -219714
13129B7864a04842A54965r487e2714B73655b13054E3917N1389l0028b3016A30645
$$ 27864 -104842 154965 145478 -52714 273655 -213054 53917 105306 75278 -23016 130645
13117a78484A27708a80511D0464a47964A60839K7124K2353b75931A75672e4530
$$ -178484 127708 -180511 40464 -147964 160839 187963 210316 -275931 175672 -54530
13106G9114A5608J58164C428Q0293l4137e7998l3129A90479h31l21823D824K89638
$$ 79114 15608 173772 3428 83721 49584 -57998 -91127 190479 -831 -322654 4824 294462
13094B94462j41793b1610I0988L17469a4201B62687h3832k2905G3274K54712i751
$$ 294462 152669 -21610 90988 408457 -14201 262687 -83832 -106737 73274 327986 -9751
13082C53821I5946J05936a42460H836Q3429L47642j88543p5773M5343a90371A34799
$$ 353821 95946 201882 -142460 8836 92265 439907 251364 175591 220934 -190371 134799
13070c9831A9605L70093a5233D92538a40328G3560J04957J99729J20655C8439
$$ -39831 19605 389698 -15233 492538 -140328 73560 178517 378246 498901 38439
13059A04730J05341P3301L089I1673B5958K98073j57633e7170a5726A68588J01121
$$ 104730 210071 283372 286461 91673 25958 324031 166398 -57170 -15726 168588 269709
13048B69709h5187K2798A29584C3315O8842a9736C27974E4935h3130J8924E18675
$$ 269709 -85187 -62389 129584 33315 102157 -19736 327974 54935 -83130 -64206 518675
13036E86a15065A87286h7006q332B44606I4316J56618a81772c4241A17057J2023
$$ 586 -115065 187286 -87006 -95338 244606 94316 250934 -181772 -34241 117057 129080
13025A29080J5050J12196g8613j2121B2850g9788C9080J68315o2254n3816J82069
$$ 129080 144130 256326 -78613 -90734 22850 -79788 39080 207395 145141 91325 273394
13014B73394q1118J18378A06725J67103g671C58965a05829B45628g6147A95512
$$ 273394 192276 310654 106725 273828 -7671 358965 -105829 245628 -76147 195512
13003A00815A3333K41998b46146c1880p645p5613k2155A25452a57970A81691n9998
$$ 100815 13333 255331 -246146 -31880 -39525 -115138 -137293 125452 -157970 181691 121693
12992A21693J83587L42092k87630A53623b96546h8794F5217g8325a610B37102
$$ 121693 305280 647372 359742 153623 -296546 -88794 65217 -78325 -1610 237102
12981b09977h3401A69564g1141F174M0343A4433M7340K37729j11598D3356f8398
$$ -209977 -83401 169564 -71141 6174 46517 14433 61773 299502 187904 43356 -68398
12969a95025C21809R0114b99691A5528K2903d0051A48482m8913R6674C8806J0732
$$ -195025 321809 411923 -299691 15528 38431 -40051 148482 99569 196243 38806 49538
12958D9538b09514A09121e0997G7294J09980B4839N8108k5438N5816Q4057c31963
$$ 49538 -209514 109121 -50997 77294 187274 24839 82947 57509 113325 197382 -331963
12946g5381c0448A33989E2748Q1533f3559E1998J52223b99360F8707c3207j0487
$$ -75381 -30448 133989 52748 134281 -63559 51998 204221 -299360 68707 -33207 -43694
12935d3694C0195h7282C8960a18068C19641j0963j28733a22207j51545h2479j57404
$$ -43694 30195 -87282 38960 -118068 319641 308678 179945 -122207 -273752 -82479 -239883
12924b39883C08351f920j12555Q733E6897O2030J37037A01867a92089b0408A31547
$$ -239883 308351 -6920 -119475 -110742 56897 118927 255964 101867 -192089 -20408 131547
12912a4617A69165F1951i5077G5135J0714A917P9138i2481D2604A8205O7158R5261
$$ -14617 169165 61951 -95077 75135 85849 1917 81055 -92481 42604 18205 85363 180624
12900A80624B8129M0639J7998J2491a9727k49375h8322p8825B92120a79108A39542
$$ 180624 28129 68768 86766 99257 -19727 -269102 -88322 -167147 292120 -179108 139542
12888H7904M5362e1422J3154A24748K35902c7729k99737A37839Q2988a01850d6352
$$ 87904 133266 -51422 -38268 124748 360650 -37729 -337466 137839 220827 -101850 -46352
12876c04935C2904J55306a03883j54128A34589l6796J17819d58710a10200B5139
$$ -304935 32904 188210 -103883 -258011 134589 97793 215612 -458710 -110200 25139
12865B55583a6572B54054q460G3101E113J90840a06089C77854I3297c90568A84081
$$ 255583 -16572 254054 245594 73101 5113 195953 -106089 377854 93297 -390568 184081
12853A48289g2667H730c22646B5908L04598b00563b6228E0671A7029c75551J26869
$$ 148289 -72667 8730 -322646 25908 330506 -200563 -26228 50671 17029 -375551 -248682
12842b48682B77657a0256l1098B37841b14540I891C096J20332c2353A12188a60251
$$ -248682 277657 -10256 -41354 237841 -214540 9891 3096 123428 -32353 112188 -160251
12830A55218F2429J42855o6559b03423A32604J61851a45433G2583b27396A67247
$$ 155218 62429 205284 138725 -203423 132604 294455 -145433 72583 -227396 167247
12819c19881J14014i8856A58180a12953k8317C67310i9721A7832J64837i6141
$$ -319881 -205867 -98856 158180 -112953 -141270 367310 -99721 17832 182669 -96141
12808C08580a29011d3957A02047b76609J11971P201I9821j8561a85155C10454
$$ 308580 -129011 -43957 102047 -276609 -164638 -157437 99821 81260 -185155 310454
12797B6683J05005J14101e6892A24730R5112r6314K8251d3535C24739B4508J46682
$$ 26683 131688 245789 -56892 124730 219842 123528 151779 -43535 324739 24508 171190
12786A71190j9856a52437k0193F1970K1375c88563c4260A10045K6566c6665C3753
$$ 171190 151334 -152437 -172630 61970 83345 -388563 -34260 110045 136611 -36665 33753
12774H6090B2010J48352J36951b92289A33824a96128h9856a3612j84355Q0289
$$ 86090 22010 170362 307313 -292289 133824 -196128 -89856 -13612 -197967 -117678
12764a17678A4619a02661a7551A36352a9832k81190N3492C58068A21997b62881
$$ -117678 14619 -102661 -17551 136352 -19832 -301022 -247530 358068 121997 -262881
12753A49697C5610N72830k56779a08077B93329p8128j9240a76054m9849O9852
$$ 149697 35610 608440 351661 -108077 293329 215201 195961 -176054 -225903 -156051
12743a56051n9426A83392A9492b0004C85896f3843B8533a96207A91960r1953J34622
$$ -156051 -215477 183392 19492 -20004 385896 -63843 28533 -196207 191960 100007 234629
12732B34629n6802j2645g7816B12714F75L07811b2957l7334j37752L0687A1222
$$ 234629 177827 165182 -77816 212714 675 308486 -22957 -60291 -198043 -167356 11222
12720a86376C0273j1379Q6629a37843A24469K22599a86868e3569k28127D3010
$$ -186376 30273 18894 105523 -137843 124469 347068 -186868 -53569 -281696 43010
12709a74852B46156m9956c1637C76434j33626J76850A88719Q8392b07452A76290
$$ -174852 246156 196200 -31637 376434 242808 419658 188719 277111 -207452 176290
12698A62185b1733C22769H89Q6424C4045J80600k2236N9226L9101E2913J4267
$$ 162185 -21733 322769 889 87313 34045 214645 192409 251635 290736 52913 67180
12687F7180j3327Q746k6723a16855A54315f3499j7943q2236L0538A2298a2019
$$ 67180 53853 62599 35876 -116855 154315 -63499 -81442 -163678 -133140 12298 -12019
12675B65583j26645C9394d9594a6525m28850A72300i1360C4781J74383L4896A04452
$$ 265583 138938 39394 -49594 -16525 -445375 172300 -91360 34781 209164 244060 104452
12663a026k8985B17467g5768E1344K02794l4383E0265J42563b2888A8169N4296
$$ -1026 -30011 217467 -75768 51344 254138 219755 50265 192828 -22888 18169 72465
12652G2465K7446A713K7282a70660A6025h9136A18169k9736f6191G4795N0727
$$ 72465 99911 1713 28995 -170660 16025 -89136 118169 88433 -66191 74795 125522
12641A25522g4350A36813A5548N0604O5209D0964Q9141A6782K78787A06017R4375
$$ 125522 -74350 136813 15548 66152 131361 40964 130105 16782 295569 106017 200392
12630B00392F2901K04582a98717A58295J63267A55099a27684A42047A0712i4025
$$ 200392 62901 267483 -198717 158295 321562 155099 -127684 142047 10712 -94025
12619E3483M8752K20126j52608K5696c41653B70998A10429b666j8622G3670J15804
$$ 53483 102235 322361 169753 195449 -341653 270998 110429 -2666 -21288 73670 189474
12608A89474N9513d8593A62389b46976H5620K72329A35569K78104j96479g3431
$$ 189474 248987 -48593 162389 -246976 85620 357949 135569 413673 217194 -73431
12597A37513L36976E1633d1153j53837B91196a53678F6949N3839a35985c5466
$$ 137513 474489 51633 -41153 -194990 291196 -153678 66949 120788 -135985 -35466
12586a71334g5679K0528i330m5046b4130j33593M1926M1142E78i6127d6936B7823
$$ -171334 -75679 -55151 -9330 -54376 -24130 -157723 -115797 -74655 578 -96127 -46936 27823
12573a9317A23235F1286J80308e1553n7312q2804j10666b6096B08530m154C911
$$ -19317 123235 61286 241594 -51553 -108865 -191669 -302335 -26096 208530 204376 3911
12561B30189o251C3116J0849K34471h4919J4353k30568C3381b15311Q3333C8662
$$ 230189 223938 33116 43965 278436 -84919 -70566 -301134 33381 -215311 -131978 38662
12549B97306a38691j25646C8859K04751a77825E784R8968h3134j3721b2943I6896
$$ 297306 -138691 -264337 38859 243610 -177825 5784 104752 -83134 -96855 -22943 96896
12537c31196h8783j82540C97844b55829A67083G6270d0792p1463I9199B3146a12019
$$ -331196 -88783 -271323 397844 -255829 167083 76270 -40792 -112255 99199 23146 -112019
12525I4011l7474J3956E918a93115i3212c0362b4k12652B9353P4317C597a45498
$$ 94011 56537 70493 5918 -193115 -93212 -30362 -24 -212676 29353 103670 3597 -145498
12512A29181b17219P2109A02227a68334A714N2290N5469k5471a14113a6026F2958
$$ 129181 -217219 -145110 102227 -168334 1714 54004 109473 84002 -114113 -16026 62958
12500A78022f5770k9332j85112Q9144A76792a38177e4112o0982a1637j26585o2105
$$ 178022 -65770 -95102 -280214 -191070 176792 -138177 -54112 -115094 -11637 -138222 -200327
12489b00327A65405D7599d5439b979G7418b57701g2726B78303a79825A58398o1358
$$ -200327 165405 47599 -45439 -2979 77418 -257701 -72726 278303 -179825 158398 97040
12478I7040i7280m385C37034a68397H5960f8247D4331a16083B41207b30220f2886
$$ 97040 -97280 -101665 337034 -168397 85960 -68247 44331 -116083 241207 -230220 -62886
12466c7947k84454e2086k6539b834B00765B6502b47921B57156A25993b59565B14051
$$ -37947 -322401 -52086 -78625 -2834 200765 26502 -247921 257156 125993 -259565 214051
12454i8347A15568g353o8337j88726B84786A03592a2246M900E7942b00884B52474
$$ -98347 115568 -7353 -75690 -264416 284786 103592 -12246 -7346 57942 -200884 252474
12442e6838A34215F5913A7479K18679P928q8186l9291n4505P647a43851K6491
$$ -56838 134215 65913 17479 236158 244086 155900 116609 62104 69751 -143851 -117360
12431a17360D3838J77658c38391a52740j16833N2231G8561a99400a2420A69565
$$ -117360 43838 221496 -338391 -152740 -269573 -217342 78561 -199400 -12420 169565
12420I3731c28039i4301k89870B68174a44667l9335E2240J11676d9174B58598
$$ 93731 -328039 -94301 -384171 268174 -144667 -184002 52240 163916 -49174 258598
12409A1157N4150g0807H2485h5299F2906k8945K2556a49459B8910b18365B80192
$$ 11157 65307 -70807 82485 -85299 62906 33961 56517 -149459 28910 -218365 280192
12397g8491A90635a39419n4126C3597a28468l9035A61813a85070R1763b572D5924
$$ -78491 190635 -139419 -193545 33597 -128468 -167503 161813 -185070 -93307 -2572 45924
12385b074D8271P7961C86a45961G3682d2012B6870a97156B35895m9305c2942k51323
$$ -2074 48271 126232 386 -145961 73682 -42012 26870 -197156 235895 186590 -32942 -284265
12373b84265A48166c03299D6000J64066b03781A17740b60064J14250M6747L5234
$$ -284265 148166 -303299 46000 210066 -203781 117740 -260064 -145814 -99067 -63833
12363f3833m9370F1683a01944A61872n0376a85497B70151f6546G0360a24616L4325
$$ -63833 -113203 61683 -101944 161872 111496 -185497 270151 -66546 70360 -124616 -90291
12352i0291l2082k0535l8834F8244J78960j8473H4215b11193I0428c7652H2572
$$ -90291 -122373 -142908 -181742 68244 247204 228731 84215 -211193 90428 -37652 82572
12340B66372p8829E3196k1454a83444N5187D7763M36352A08155K60712j64680
$$ 266372 187543 53196 31742 -183444 -128257 47763 484115 108155 368867 204187
12330B04187R389B1741a16409n0641A81355e5179j11757B3100J17282n6466a95489
$$ 204187 213576 21741 -116409 -167050 181355 -55179 -166936 23100 140382 83916 -195489
12318A81149E1857b10193A18828b1851k00011D9135K50605k2038g2073B89582
$$ 181149 51857 -210193 118828 -21851 -221862 49135 299740 277702 -72073 289582
12307a17281j4569j64636a34072A50339B6965p427f319C2252a21915k50673Q9557
$$ -117281 -131850 -296486 -134072 150339 26965 19538 -6319 32252 -121915 -372588 -283031
12296b83031N7389j38201e9155C0669H103a06442B32619B5680J5123c2879C9574
$$ -283031 -225642 -363843 -59155 30669 8103 -106442 232619 25680 40803 -32879 39574
12284a71601A14552G399K84006j27406l516d1333a5221n7139B8055J33884K38341
$$ -171601 114552 7399 291405 163999 160483 -41333 -15221 -72360 28055 161939 400280
12273D00280l052A80536q3947K70256a94172B96534c5089B46427C227N1377K67069
$$ 400280 397228 180536 96589 366845 -194172 296534 -35089 246427 3227 54604 321673
12262C21673E8183a04617K954C06647l7775q8392O5396J0135P6738i0447A49272
$$ 321673 58183 -104617 -101663 306647 268872 180480 245876 256011 332749 -90447 149272
12250A49981a43808A13646K11690G7567b33292f2482A24815P5176a09954q1047
$$ 149981 -143808 113646 325336 77567 -233292 -62482 124815 199991 -109954 -191001
12240a91001A0497a05157A37077K22657A03515O2442L4812D2674A0532L31843
$$ -191001 10497 -105157 137077 359734 103515 165957 200769 42674 10532 342375
12230C42375A58351o8798a4251D07736G1339b6665k51166H5435c8606B4871K45059
$$ 342375 158351 89553 -14251 407736 71339 -26665 -277831 85435 -38606 24871 269930
12219B69930c731B81015a9198A05927M6777b9806B90021n6051E5024J18165J40994
$$ 269930 -3731 281015 -19198 105927 152704 -29806 290021 233970 55024 173189 314183
12208C14183m8045h2014C15705A33388D1815Q9749J33649j09313D8125K2299J50737
$$ 314183 266138 -82014 315705 133388 41815 131564 265213 155900 48125 70424 221161
12197B21161N0401j27081K8176k5978J43245k4218A20479a18645B4649O5980h3963
$$ 221161 271562 144481 172657 146679 289924 265706 120479 -118645 24649 90629 -83963
12185d1372A67640N5017m853a81198c3555A5344J27666a14267K8583A03793J16782
$$ -41372 167640 222657 217804 -181198 -33555 15344 143010 -114267 -85684 103793 220575
12174B20575l3762p0210d0201C6332J73149p1024K9320J13272m9967C2169Q9110
$$ 220575 186813 116603 -40201 36332 209481 138457 167777 281049 231082 32169 121279
12163A21279P0219J17489L4731a4302G0504L98350k00251A1973a01135q0052Q1816
$$ 121279 191498 308987 343718 -14302 70504 468854 268603 11973 -101135 -181187 -99371
12152i9371k4635E0805L59227E5760K04377g2524C0119e6301H7480a76351A2646
$$ -99371 -124006 50805 410032 55760 260137 -72524 30119 -56301 87480 -176351 12646
12140A04045M5215B8941L36815a83446C9181O3257L8219b23488L8751A32861b27796
$$ 104045 149260 28941 365756 -183446 39181 102438 140657 -223488 -184737 132861 -227796
12128E00030a80j62479C06993a83689A6252M8999J39276j02070K1388a28591B34412
$$ 500030 -180 -162659 306993 -183689 16252 65251 204527 102457 123845 -128591 234412
12116g5453H5807a34325m9295C25300I806Q8622c0138j23570k4400e2401M224
$$ -75453 85807 -134325 -183620 325300 9806 98428 -30138 -153708 -178108 -52401 -48177
12105d8177j36844f0798A13941a62073r9034C22570L9392a79668h2830a6490k89792
$$ -48177 -185021 -60798 113941 -162073 -261107 322570 361962 -179668 -82830 -16490 -306282
12094c06282A57489a17984B22259a49305o58B12135h9997K3763o0284p591j9557
$$ -306282 157489 -117984 222259 -149305 -149963 212135 -89997 -66234 -126518 -134109 -153666
12083a53666A92175O851P7745Q9255K72624J104145G79688A99128h4822j55141
$$ -153666 192175 199026 276771 366026 638650 1742795 779688 199128 -84822 -239963
12073b39963f2540I3458C5257O547j3431J04984a08283G6348Q0253O1339M1561
$$ -239963 -62540 93458 35257 41804 28373 133357 -108283 76348 156601 217940 259501
12062B59501a11045C71135A46005E264N1449a0187B45824c60557C0360N7916K88976
$$ 259501 -111045 371135 146005 5264 56713 -10187 245824 -360557 30360 88276 377252
12051C77252b45630C2267a98998A6284a15313B40707D7873b09913a04665g256
$$ 377252 -245630 32267 -198998 16284 -115313 240707 47873 -209913 -104665 -7256
12040b99080E3574J35101j9343a75587P1266D2245e5418n2391D1002c27236A10533
$$ -299080 53574 188675 169332 -175587 -104321 42245 -55418 -107809 41002 -327236 110533
12028B02049g4108H6617i968A77622B8347M1659b11566C15346j32918d8665r2424
$$ 202049 -74108 86617 -9968 177622 28347 70006 -211566 315346 182428 -48665 -141089
12017a41089r2784a8770k27970i7603A84755b24707B5088K59121j17575a39351
$$ -141089 -233873 -18770 -246740 -97603 184755 -224707 25088 284209 166634 -139351
12006e5633A17271J54073a30543c5596k04411L5031A12317K3875B1533P6972M8673
$$ -55633 117271 271344 -130543 -35596 -240007 -204976 112317 136192 21533 98505 147178
11995A47178c0767a1747j13628O515J1635l298j52189j27997B70901f6825j11519
$$ 147178 -30767 -11747 -125375 -118860 -107225 -110523 -262712 -390709 270901 -66825 -178344
11984a78344A97241a7084B29379h1320m6189c7180j1405m0290B19482D8262K9531
$$ -178344 197241 -17084 229379 -81320 -127509 -37180 -48585 -88875 219482 48262 77793
11973G7793f9061p6596K184A08028a08279A76416J12752A26593b0720O528l0689
$$ 77793 -69061 -145657 -143473 108028 -108279 176416 289168 126593 -20720 -14192 -44881
11962d4881l3942A52320b6418k4477j39903A3500L3517a08907g57j27164m61547
$$ -44881 -78823 152320 -26418 -50895 -190798 13500 47017 -108907 -757 -127921 -589468
11951e89468C5097F540J78425c5492l13852c9685l11422j2065A8008M3942a2207
$$ -589468 35097 6540 184965 -35492 -349344 -39685 -351107 -363172 18008 61950 -12207
11939c5423N244A24866J63102g4887j20326e0675k15116M7064B22857d01038A58557
$$ -35423 -30179 124866 287968 -74887 -195213 -50675 -265791 -218727 222857 -401038 158557
11927A15838g8352k91265D8204Q2020N8173f1084E010P615c17058A12762A9196
$$ 115838 -78352 -369617 48204 130224 188397 -61084 5010 12625 -317058 112762 19196
11915B1445a03591j72403C9575J14977h4081j6605A4960R896a4197k9811A15229
$$ 21445 -103591 -275994 39575 154552 -84081 -100686 14960 24856 -14197 -44008 115229
11903b39739N2809a4314D18049I9323b67325a18283j05710h0998k57213a6065
$$ -239739 -186930 -14314 418049 99323 -267325 -118283 -223993 -80998 -338211 -16065
11892h0840F2571d7888k63571d0801G9522I76b26124C03678a07093q5992C836
$$ -80840 62571 -47888 -311459 -40801 79522 976 -226124 303678 -107093 -193085 3836
11880A31690M187K7528a48133H5263J50564c1776a3334J236A07601b01167B39075
$$ 131690 135877 163405 -148133 85263 235827 -31776 -13334 -12098 107601 -201167 239075
11868a20912A62276a28189c2465l78661A91788c9357k39828d6917A25448Q4412
$$ -120912 162276 -128189 -32465 -411126 191788 -39357 -279185 -46917 125448 209860
11858B09860a43749j93492I1813K3902J532b59726a6837A16251b59520C23744
$$ 209860 -143749 -337241 91813 115715 117247 -259726 -16837 116251 -259520 323744
11847b070j40135l4793N0238F9477J74703c28838a5497E3858j5157g1529I527
$$ -2070 -142205 -176998 -126760 69477 244180 -328838 -15497 53858 38701 -71529 9527
11835A95296a6565A56945a43131D8212N3195K0541B1557J02426C307O2583a72760
$$ 195296 -16565 156945 -143131 48212 101407 121948 21557 123983 3307 65890 -172760
11823A63557e9329k97436A6677d2992j9353B0377N3890M9736g4752A71606f7380
$$ 163557 -59329 -356765 16677 -42992 -62345 20377 74267 124003 -74752 171606 -67380
11811A15066B4381b2299j14554f3460j24404d3478B46056b8074p8860J9288p3523
$$ 115066 24381 -22299 -136853 -63460 -187864 -43478 246056 -28074 -106934 -87646 -161169
11800a61169N6037J9832a9674k4784E1613b9139l04323b7897B21573i2021c7284
$$ -161169 -105132 -85300 -19674 -44458 51613 -29139 -333462 -27897 221573 -92021 -37284
11788A34692A2010d484r8801A24967b0388o9932d0991C7926J22782a3570A22946
$$ 134692 12010 -4484 -103285 124967 -20388 -90320 -40991 37926 160708 -13570 122946
11776F6326b08299h9701H3919M5698f9679k4744k8818d7095j00972q5126k9414
$$ 66326 -208299 -89701 83919 129617 -69679 -94423 -123241 -47095 -148067 -233193 -262607
11765b62607A30022e0807A53613f0432k36569A36932a05943B59483a26189p8435
$$ -262607 130022 -50807 153613 -60432 -297001 136932 -105943 259483 -126189 -204624
11755b04624D05362a35466O4399G0920a8014D18262C8917O6581J478a00192C49835
$$ -204624 405362 -135466 -71067 70920 -18014 418262 38917 105498 106976 -100192 349835
11743c7247A68259a54870q0644f2228C50880B8172O3750a98041H2666L57261H3095
$$ -37247 168259 -154870 -235514 -62228 350880 28172 91922 -198041 82666 439927 83095
11731B18408J07553a57534r030D97995e1912G8431J62603a24142K2439C01548
$$ 218408 325961 -157534 -166564 497995 -51912 78431 241034 -124142 -101703 301548
11720B15225m7975c5245C39856b8688A63553G903J16489M8499m9317B3795K31788
$$ 215225 167250 -35245 339856 -28688 163553 7903 124392 172891 123574 23795 255583
11709B55583q4865e5161k5009C91650C026h6854m5374c4726G375K26259C1010
$$ 255583 170718 -55161 -80170 391650 3026 -86854 -132228 -34726 7375 233634 31010
11697B2864M267J89217a55490D02816f869j68188D07852E7453a30730A24858C575
$$ 22864 27131 216348 -155490 402816 -6869 -175057 407852 57453 -130730 124858 3575
11685a32100B4875a30832A03237A5532J29919i4265j52002B56067J47055d9720
$$ -132100 24875 -130832 103237 15532 145451 -94265 -246267 256067 403122 -49720
11674A24534l7725d61410B08402B6984a82576D15085A23978o827j5573b03435
$$ 124534 86809 -461410 208402 26984 -182576 415085 123978 117151 101578 -203435
11663b25814C37460I198h6247A60264a87191E44212p2722k34211a17662B73082
$$ -225814 337460 9198 -86247 160264 -187191 544212 471490 237279 -117662 273082
11652A43796f2213p8193E006a16353p298l7174D07909A20403a40388G6129b4068
$$ 143796 -62213 -140406 5006 -116353 -123651 -160825 407909 120403 -140388 76129 -24068
11640A26796b7751j10649N4633q3925d8860F4479J57870i1448H8893Q505b03723
$$ 126796 -27751 -138400 -83767 -167692 -48860 64479 222349 -91448 88893 97398 -203723
11628C29356H7872P1195n5994N1757p4656J7050B6575R803f9943p7570c233A04949
$$ 329356 87872 159067 103073 154830 80174 97224 26575 36378 -69943 -147513 -3233 104949
11615A78682C9340b40649A75076a16172J7567A06352d0431A846f796o7853J3418
$$ 178682 39340 -240649 175076 -116172 -98605 106352 -40431 1846 -6796 -74649 -61231
11604f1231a4279j16812k8297H6426J35853g2183j14060A73230a3637j6713A12056
$$ -61231 -14279 -131091 -159388 86426 222279 -72183 -186243 173230 -13637 -30350 112056
11592A85673a05856B69086J10203j58916J40738j26833Q9585g0756D1018J04508
$$ 185673 -105856 269086 379289 220373 361111 234278 323863 -70756 41018 145526
11582A45526J60455j5538A12857q354m9666a80168C20930j43750H4187P3644a02328
$$ 145526 305981 290443 112857 104503 54837 -180168 320930 177180 84187 157831 -102328
11570B21725J63864a29593H4883c4144A72470C8554R3772o0316P2734a64836D17283
$$ 221725 385589 -129593 84883 -34144 172470 38554 132326 72010 144744 -164836 417283
11558i478j07484d8746B43816f5156d330B80956j24782A8199J85840c00840a17478
$$ -9478 -116962 -48746 243816 -65156 -4330 280956 156174 18199 204039 -300840 -117478
11546B52124a87646I0933L1955K19276a02326J0105A45023b1188l08030J32724
$$ 252124 -187646 90933 122888 342164 -102326 -92221 145023 -21188 -329218 -196494
11536a96494A03462d9268A03749J13880h6714B71206m0130e4266j1635A18900
$$ -196494 103462 -49268 103749 217629 -86714 271206 231076 -54266 -65901 118900
11525H7566J00227p3393a9392B65415l2466b30835C42765E5704a10809G2837R4962
$$ 87566 187793 114400 -19392 265415 232949 -230835 342765 55704 -110809 72837 167799
11514A67799O9458b12885d7584E47820b6240E4083j175K18928f5161C02610b738
$$ 167799 237257 -212885 -47584 547820 -26240 54083 52908 271836 -65161 302610 -2738
11502c6978I0727K68822j65026J51498F1016L46368A13022J31018c25540C32580
$$ -36978 90727 359549 194523 346021 61016 407384 113022 244040 -325540 332580
11491a6324H3784Q2428R3560l6908J28918f7410C8839K73134a55600A67037C8602
$$ -16324 83784 166212 259772 222864 351782 -67410 38839 311973 -155600 167037 38602
11479A30393R5987J46785A51772B7085J43848J67381A26810K93L62096F8062J18190
$$ 130393 226380 373165 151772 27085 170933 338314 126810 127103 489199 68062 186252
11468A86252P588J57115G2655P7057J21739E8311L7390Q7863A4453b63541d9443
$$ 186252 193840 350955 72655 149712 271451 58311 95701 183564 14453 -263541 -49443
11456d4510C10914e9067A77656J3461d2730A0536a64412f2943B82175J20717n5812
$$ -44510 310914 -59067 177656 191117 -42730 10536 -164412 -62943 282175 402892 347080
11445C47080j47447G932J50892d5176m1680C85874A66444a61177A35253J6497
$$ 347080 199633 7932 158824 -45176 -86856 385874 166444 -161177 135253 151750
11435A51750b06720P5699b3584D39009k18507D9520a27150C7123A966P8812i6820
$$ 151750 -206720 -131021 -23584 439009 220502 49520 -127150 37123 1966 80778 -96820
11423a16380K9539j16497N9602M7369A05741j0808M0234a05990B12456m5021q3105
$$ -116380 -86841 -203338 -143736 -96367 105741 94933 135167 -105990 212456 167435 84330
11412H4330a17086k22184A77079d8853A41424D0132A3679c7913n5822B00168b3877
$$ 84330 -117086 -339270 177079 -48853 141424 40132 13679 -37913 -93735 200168 -23877
11400a1921o0867C3683J51767d1296I602K96854c2930B08261f5755k0564G2288
$$ -11921 -72788 33683 185450 -41296 9602 306456 -32930 208261 -65755 -86319 72288
11388d30390a13233G3849A6202J90195i6622A44570J22461H3833g0951C04131
$$ -430390 -113233 73849 16202 206397 -96622 144570 267031 83833 -70951 304131
11377f2423j80559H0150O29231a38629B0203a2542k46465D6516a4203C28348a54909
$$ -62423 -242982 80150 709381 -138629 20203 -12542 -259007 46516 -14203 328348 -154909
11365A37681a55167j74724B0397a81846B95540e887j15093M5856D409i3345j22476
$$ 137681 -155167 -329891 20397 -181846 295540 -5887 -120980 -75124 4409 -93345 -215821
11354b15821j29199J63958l794f1987l7930A38059a73943e6448a0123m6203p061
$$ -215821 -345020 -181062 -184856 -61987 -99917 138059 -173943 -56448 -10123 -56326 -63387
11343f3387i563A58676b11999F4969K17737G060e1077j87964A65152H0939d10883
$$ -63387 -9563 158676 -211999 64969 282706 7060 -51077 -239041 165152 80939 -410883
11331A11811c34915d8749A62070O3956m8017L7913J80906A91165J72300f4729
$$ 111811 -334915 -48749 162070 226026 178009 215922 396828 191165 363465 -64729
11320B68K50926E4396e3430j18968a8012C21498A10798a77574f5705r7085K0850
$$ 268 251194 54396 -53430 -172398 -18012 321498 110798 -177574 -65705 -162790 -141940
11309a41940j95218A35559m5203R2505k4519b7609j63969a0763n44998h8139A64576
$$ -141940 -337158 135559 90356 182861 158342 -27609 -191578 -10763 -555761 -88139 164576
11297A74497b13107e2049F6698C0689a99829n4878B66918G1010K3463M3292M2587
$$ 174497 -213107 -52049 66698 30689 -199829 -254707 266918 71010 94473 137765 180352
11286A80352E5580a49036B99350C4047i6884b9467J3591l29400e680l3922C574
$$ 180352 55580 -149036 299350 34047 -96884 -29467 -15876 -345276 -5680 -39602 3574
11274d7983A53350a27232f3559k31461b3745F3222J12731b45626Q893a06878C63127
$$ -47983 153350 -127232 -63559 -295020 -23745 63222 175953 -245626 -236733 -106878 363127
11262b35583k08227c0794j37324o4695b5316j14440B46243g9605q5421B7587e4356
$$ -235583 -443810 -30794 -168118 -232813 -25316 -139756 246243 -79605 -165026 27587 -54356
11250G601a32052H6648c55190e1884j57414k357g8426I1469a69915m0316l4203
$$ 7601 -132052 86648 -355190 -51884 -209298 -211655 -78426 91469 -169915 -210231 -244434
11239b44434B0141Q4255B2503c80G8235J26826G6997a62829F2717c0627r4781
$$ -244434 20141 104396 22503 -380 78235 205061 76997 -162829 62717 -30627 -125408
11228a25408A07487c08378J28623A39688h6412A43645i1237b201B06469a1672
$$ -125408 107487 -308378 -179755 139688 -86412 143645 -91237 -2201 206469 -11672
11217E1236a10597L6099q9641A4169J6334a38531A48973a2646A42616N2989a54371
$$ 51236 -110597 -74498 -164139 14169 30503 -138531 148973 -12646 142616 195605 -154371
11205C29741b1167F4903d4318A44636D184L75041a99271O3896A991b27191N1360
$$ 329741 -21167 64903 -44318 144636 4184 379225 -199271 -135375 1991 -227191 -175831
11194a75831j2732I0487j2822E859K7613h6182M2150B2072b32577e7800j50629
$$ -175831 -188563 90487 77665 5859 33472 -86182 -44032 22072 -232577 -57800 -208429
11183b08429J7712p6096C15883o0822A21239a59554k06712A45002h7602A16013
$$ -208429 -190717 -266813 315883 255061 121239 -159554 -366266 145002 -87602 116013
11172a45280e9643b7808k32040F7890a85507E4014Q7950a33379A14007f9459G7452
$$ -145280 -59643 -27808 -259848 67890 -185507 54014 141964 -133379 114007 -69459 77452
11160f192D9872b26175Q6038A81670k6941b4539G8781J94792E6110I595M5965
$$ -6192 49872 -226175 -140137 181670 154729 -24539 78781 273573 56110 9595 55560
11149E5560c16987A36445C5666h9572C8505Q8270k0150J07769D2404J90683e8650
$$ 55560 -316987 136445 35666 -89572 38505 126775 106625 214394 42404 233087 -58650
11137A38369b99377a01478B68028M8123k0834a81459D0808Q714i6742c1840A20749
$$ 138369 -299377 -101478 268028 316151 295317 -181459 40808 49522 -96742 -31840 120749
11125a32342I5369b48613l6262G213a25557H78c9984A03507m166a32627o6263
$$ -132342 95369 -248613 -284875 7213 -125557 878 -39984 103507 99341 -132627 -198890
11114a98890H5774a08765d3275j12663B01768K8576E9280P1226N9643J26574d7470
$$ -198890 85774 -108765 -43275 -155938 201768 230344 59280 130506 190149 316723 -47470
11102c63447A44784a33605q1583E3658J21050F1174J76724C3635J81971g554A26164
$$ -363447 144784 -133605 -215188 53658 174708 61174 237898 33635 215606 -7554 126164
11090F7580K46656j6062n3582A08492L16057j89453F0914Q7690k3330J27409b52544
$$ 67580 314236 298174 244592 108492 424549 235096 60914 148604 125274 252683 -252544
11078C36645J84939A24350J19848J19074A80218J8725d1643B86682K52055B62384
$$ 336645 521584 124350 244198 363272 180218 198943 -41643 286682 538737 262384
11067D69597B12463M55603B84003K78814A39622N12631j44193j60032J31325k3901
$$ 469597 212463 668066 284003 562817 139622 652253 508060 348028 479353 455452
11057D55452O0118r4960j1291M76176k60471k6389k24596j21857M62650j59097
$$ 455452 515570 420610 409319 885495 625024 598635 374039 252182 714832 555735
11047E55735J82598L269j58076J2528j20153j75145N20332l31188K24443K5148
$$ 555735 738333 741602 583526 596054 475901 300756 821088 489900 714343 739491
11037G39491j96181K8734n620J6266K7354N068j15459J46884k890K38866k21334
$$ 739491 543310 572044 566424 582690 610044 615112 499653 646537 643647 882513 661179
11026F61179l21628J5817O3588J31618o9653J87052P0199j47700B03597J39789
$$ 661179 339551 355368 418956 550574 480921 667973 738172 590472 203597 343386
11016C43386N61L57480J1707j45607j68547J57764J02548k31167J67618r77L42025
$$ 343386 343947 701427 713134 567527 398980 556744 659292 428125 595743 594766 936791
11005I36791A85921L03653L84649K17244n19905K04161l58961M37440k37303B62601
$$ 936791 185921 489574 874223 1091467 571562 775723 416762 854202 616899 262601
10994F58040j74788k7916K18686O3494j56181K34907J67965l45061K46869L55776
$$ 658040 483252 455336 674022 737516 581335 816242 984207 639146 886015 1241791
10984A241791l38193j25957K65258K38214J2762j22310L21877K8552M61311l10580
$$ 1241791 903598 777641 1042899 1281113 1293875 1171565 1493442 1521994 1983305 1672725
10974A672725J45336L65941N27760j38179k03419N45349n40649k01367m6589m2390
$$ 1672725 1818061 2184002 2711762 2573583 2370164 2915513 2374864 2173497 2126908 2084518
10964B084518j42182k78769O43836J14345k88573L7838N8048r5579M29251k63916
$$ 2084518 1942336 1663567 2307403 2421748 2133175 2171013 2229061 2133482 2562733 2298817
10954B298817j07782m50270l15437j17519j65743k44879Q843j18086k86902J3581
$$ 2298817 2191035 1740765 1425328 1307809 1142066 897187 906030 787944 501042 514623
10944E14623j13976L02823A93899K5340R9255J99732A3474J18902c0721B13162
$$ 514623 400647 703470 193899 219239 318494 518226 13474 132376 -30721 213162
10933B66119a44518B60258r4910l3700J25797g2640k438B59867l6847b57867k6399
$$ 266119 -144518 260258 165348 131648 257445 -72640 -75078 259867 223020 -257867 -284266
10922b84266P9919A1321a29162L0450l3835B58628a50141I9273c9244E9396B4792
$$ -284266 -204347 11321 -129162 -98712 -132547 258628 -150141 99273 -39244 59396 24792
10910A43797a29539A01133c41484g0281B41168c55386E2793Q9312a73231N2145
$$ 143797 -129539 101133 -341484 -70281 241168 -355386 52793 142105 -173231 -121086
10900a21086l8623B55287a6970j68287R1023d2657r9534a3373n271j00520J6841
$$ -121086 -159709 255287 -16970 -185257 -94234 -42657 -142191 -13373 -18644 -119164 -102323
10889a02323M6590j11770E2148J0504k5271c8386m2007c5607q974j49638j37175
$$ -102323 -55733 -167503 52148 62652 37381 -38386 -80393 -35607 -44581 -194219 -331394
10878c31394B6702b56726B06417d1704l8757I9316a01522G502a7477k19636P0919
$$ -331394 26702 -256726 206417 -41704 -80461 99316 -101522 7502 -17477 -237113 -166194
10867a66194n412A63899c13201J32540b15E3176A0845N8619J29509b55598A0108
$$ -166194 -171606 163899 -313201 -180661 -215 53176 10845 69464 198973 -255598 10108
10855I1855d7005a9764m5177A12212K81431A52753b9833A16107K42134b00329
$$ 91855 -47005 -19764 -64941 112212 393643 152753 -29833 116107 358241 -200329
10844B1384a23475A74921q6198c8385D9788J03640p2339L6487o232a07707m3086
$$ 21384 -123475 174921 88723 -38385 49788 153428 81089 117576 111344 -107707 -150793
10833a50793k55949a54586d3832A90078B2189h8051D39161h7700a7080l11403
$$ -150793 -406742 -154586 -43832 190078 22189 -88051 439161 -87700 -17080 -328483
10823c28483i5306c2439a0460A86477E0701c5203A23108i7094j6578m2133q3294
$$ -328483 -95306 -32439 -10460 186477 50701 -35203 123108 -97094 -113672 -155805 -239099
10812b39099J14186m2006B33770Q0755A29838b65707B70430a7559k67331I2252
$$ -239099 -124913 -166919 233770 314525 129838 -265707 270430 -17559 -284890 92252
10801B67324b9438j86508G6943d791H7804R762c9734F1023a7803G8068a79568
$$ 267324 -29438 -215946 76943 -4791 87804 97566 -39734 61023 -17803 78068 -179568
10789d0053H8955b13487C61930b75758B71818a08720D8162a34077D1598a84889
$$ -40053 88955 -213487 361930 -275758 271818 -108720 48162 -134077 41598 -184889
10778a85189a5978j98019M8880H1870a58024E5062J3724c3161j50761O3452k3653
$$ -185189 -15978 -213997 -165117 81870 -158024 55062 68786 -33161 -183922 -120470 -144123
10767a44123M8446A09054b05546G5641e5612j56660R8702L491M3017j20964P7144
$$ -144123 -95677 109054 -205546 75641 -55612 -212272 -113570 -110079 -67062 -188026 -110882
10756a10882K3463p1946H4140a93926I8276a44170D143J91171e8140k2044F834
$$ -110882 -87419 -159365 84140 -193926 98276 -144170 4143 195314 -58140 -80184 6834
10744a30435A67435E2411h7746c7792m6064b6407p0549A44348b1226n2893B6923
$$ -130435 167435 52411 -87746 -37792 -83856 -26407 -96956 144348 -21226 -74119 26923
10732d84237A16606J54589H630A1f3711r9458O1095n2009M4146o3162A08886i4194
$$ -484237 116606 271195 8630 11 -63711 -163169 -102074 -154083 -109937 -173099 108886 -94194
10719C530c08003b3141N745m0631C61429b52367e8558B2962d1719j56970C00336
$$ 3530 -308003 -23141 -17396 -58027 361429 -252367 -58558 22962 -41719 -198689 300336
10707H4784i2754Q942j14484A61239a26853c143j49760C11858c0412j47285r9160
$$ 84784 -92754 -83812 -198296 161239 -126853 -3143 -152903 311858 -30412 -177697 -276857
10696b76857l91532c7799q2742b6355A59418d5442D0162a20454B13212c95466
$$ -276857 -668389 -37799 -120541 -26355 159418 -45442 40162 -120454 213212 -395466
10685A52240E0708J84017n503a88461B38914p4736a49064A7063b16379M6151N6420
$$ 152240 50708 234725 229222 -188461 238914 164178 -149064 17063 -216379 -170228 -113808
10674a13808B1374a47834b0219k28786O3974B28339K5812I0624f2769B23364c7453
$$ -113808 21374 -147834 -20219 -249005 -185031 228339 254151 90624 -62769 223364 -37453
10662d9691A882Q0591k8629c54066J64909k02466a78233i659A3887a51806B5294
$$ -49691 1882 82473 53844 -354066 -189157 -391623 -178233 -9659 13887 -151806 25294
10650a17427o5279P6617j7178j87428J8876F1366p135b22284G8881a4964B8859
$$ -117427 -182706 -106089 -123267 -310695 -291819 61366 54231 -222284 78881 -14964 28859
10638g3610q2544B8617g7258H0744e389k2230A35433b33909J650A53942j3030
$$ -73610 -156154 28617 -77258 80744 -5389 -27619 135433 -233909 -232259 153942 140912
10627A40912C5484e4806J0268j21520j77419e3750j74228f7431f804J10l62643
$$ 140912 35484 -54806 -44538 -166058 -343477 -53750 -227978 -67431 -6804 -6694 -369337
10616c69337c5486A26193L5582f131p1711B02949b44275C85723j65036a28707
$$ -369337 -35486 126193 161775 -6131 -77842 202949 -244275 385723 220687 -128707
10605D5171P2073b68472F6192L0057a94979A13998f1218k65595J36372G2606a41589
$$ 45171 117244 -268472 66192 96249 -194979 113998 -61218 -326813 -190441 72606 -141589
10593B19716a50140l9201L5276E9470R1811g5855r9778c0131j45410A51769K8704
$$ 219716 -150140 -189341 -154065 59470 151281 -75855 -175633 -30131 -175541 151769 180473
10582A80473q0632c31759a12320q6100N1347A71101D0112a4517B84186C0066a80937
$$ 180473 99841 -331759 -112320 -198420 -147073 171101 40112 -14517 284186 30066 -180937
10570d9834o2138A7194b25705A53545k5082a01284G9134a50033A49331N14522
$$ -49834 -111972 17194 -225705 153545 128463 -101284 79134 -150033 149331 663853
10560F63853A08369e4534n5908F2925e7390A632c33785k3476a5071j2331I640
$$ 663853 108369 -54534 -110442 62925 -57390 1632 -333785 -357261 -15071 -27402 9640
10548c767C18407b24908A11700b25514H8034a49905d323B45460j18470b16066
$$ -3767 318407 -224908 111700 -225514 88034 -149905 -4323 245460 126990 -216066
10537b5199j1646A54920b30583g4163r6332E238b00611g0670a6829l14892h0636
$$ -25199 -36845 154920 -230583 -74163 -170495 5238 -200611 -70670 -16829 -331721 -80636
10525d0897E5731J59803b07086g0815A44852B6573E133a48253A16006k1610g8651
$$ -40897 55731 215534 -207086 -70815 144852 26573 5133 -148253 116006 94396 -78651
10513a35161c5847C00388a53763l4900C7540K3606b49644j54182J88942j29117
$$ -135161 -35847 300388 -153763 -188663 37540 61146 -249644 -403826 -214884 -344001
10503c44001l686I3191c23572b377k89165F4266B629c81841f8816A37698j8407
$$ -344001 -347687 93191 -323572 -2377 -291542 64266 2629 -381841 -68816 137698 119291
10492A19291E8678a65807F8318i1438A12569R5441c9517j25166A68130i8819C67344
$$ 119291 58678 -165807 68318 -91438 112569 208010 -39517 -164683 168130 -98819 367344
10480D47591j0877A76093J73853j58713J90989J3863E9266a48265N2966A44794
$$ 447591 436714 176093 349946 191233 382222 396085 59266 -148265 -95299 144794
10469b2409H0518J63599F6683M3969K05716k0947H4657J47163g2868B53O8859
$$ -22409 80518 244117 66683 110652 316368 295421 84657 231820 -72868 253 69112
10458F9112K13268a08432j30455A70318b6922H2497d167A18190Q9107A9459f2644
$$ 69112 282380 -108432 -238887 170318 -26922 82497 -4167 118190 207297 19459 -62644
10446C06602F2500a07507B72143g4613j69204A1432g9371b6380j01418m91681
$$ 306602 62500 -107507 272143 -74613 -243817 11432 -79371 -26380 -127798 -619479
10436f19479a3639j01362A24649g146k16196A40035a63500n2993A4869d2042B530
$$ -619479 -13639 -115001 124649 -7146 -223342 140035 -163500 -216493 14869 -42042 2530
10424g5690l121k7017N2262p1847A41945m8244m2814J67318D0863a10413j58020
$$ -75690 -78811 -105828 -53566 -125413 141945 93701 50887 218205 40863 -110413 -268433
10413b68433M3250R8555e0117o4051c348j26116r5689A7723b0779l7970f111l2514
$$ -268433 -225183 -126628 -50117 -114168 -3348 -129464 -225153 17723 -20779 -58749 -6111 -38625
10401c8625A94720A1709K43521i8134H9998k3896h8169A50902g551A30536a83558
$$ -38625 194720 11709 255230 -98134 89998 66102 -88169 150902 -7551 130536 -183558
10389B63054H2107l4279a1152A08571a31888A31914A9756L92437a83746B44998
$$ 263054 82107 47828 -11152 108571 -131888 131914 19756 412193 -183746 244998
10378C42782G1580J82559l3500J8154a3362C53540A73731P0474I0545M1780K44969
$$ 342782 71580 254139 220639 238793 -13362 353540 173731 244205 90545 132325 377294
10367C77294j80345L32067k61546n059m0100m5389k7032C9422M5972a24996B04541
$$ 377294 196949 529016 267470 262411 222311 176922 149890 39422 85394 -124996 204541
10355A47842L79314I2721J30395J58232p6995K49803j10400q5648J74444A15303
$$ 147842 527156 92721 223116 381348 304353 554156 443756 358108 532552 115303
10344A37570L53451J1341B25824M2437m9012J1763j12701K75441A22188n5405
$$ 137570 491021 502362 225824 268261 219249 231012 118311 393752 122188 66783
10334F6783a65620B34105N9735a01317M5054k14B5654J33701J4534k6322O5577
$$ 66783 -165620 234105 293840 -101317 -56263 -56477 25654 159355 173889 147567 213144
10323B13144e8115B335c3094j45611E30463a4114D4447M14957e5646B05361A1161
$$ 213144 -58115 2335 -33094 -178705 530463 -14114 44447 459404 -55646 205361 11161
10311c5017G883b16493O5810A24035B1050a30484L123M3831B6497f7685a4822
$$ -35017 7883 -216493 -150683 124035 21050 -130484 -127361 -83530 26497 -67685 -14822
10299A38600l3778a70557A08405Q880G71c68196A88402d9380A9784K5238a66638
$$ 138600 104822 -170557 108405 117285 771 -368196 188402 -49380 19784 45022 -166638
10287e9209k9457A49811a93027C3550J28536d02434A8491J367g2341A90872a3365
$$ -59209 -88666 149811 -193027 33550 162086 -402434 18491 19858 -72341 190872 -13365
10275A70931k9808b34005r614B9666R199O2679l8308b3596j46608F9830J7540
$$ 170931 141123 -234005 -243619 29666 38865 101544 63236 -23596 -170204 69830 87370
10264H7370J8047l8876N3858N2116n3853N30582A88890K63271n538C1213J18717
$$ 87370 105417 66541 120399 172515 118662 649244 188890 452161 446623 31213 149930
10253A49930L4908b76287B57116a9592n1793K3489j10164O0419j18968A36136
$$ 149930 184838 -276287 257116 -19592 -71385 -47896 -158060 -97641 -216609 136136
10242c1626n751G5492D695a96753g9566E0488a62502B7967h4768j13882M2304
$$ -31626 -37377 75492 4695 -196753 -79566 50488 -162502 27967 -84768 -198650 -156346
10231a56346D490a12404p3558i2583A79338a70005A01725d96990a96401g0347
$$ -156346 4490 -112404 -185962 -92583 179338 -170005 101725 -496990 -196401 -70347
10220d39834A98661a07052l079A78812A3796M0168c1018A66574Q3365i776G8489
$$ -439834 198661 -107052 -110131 178812 13796 53964 -31018 166574 249939 -9776 78489
10208b38173a17j93773e8805l37322a77387d8469R557A28951m4385i4250B82J98295
$$ -238173 -117 -193890 -58805 -396127 -177387 -48469 -38912 128951 84566 -94250 282 198577
10196A98577d10567J83044h3340p34j79473A66722l8050P0985b25243a02300I4170
$$ 198577 -410567 -227523 -83340 -84074 -263547 166722 128672 199657 -225243 -102300 94170
10184a38364j593d8373A08168m8682b36914d3591A58422N9425c40251J23189g1645
$$ -138364 -139957 -48373 108168 59486 -236914 -43591 158422 217847 -340251 -217062 -71645
10172a08556a030q2247H8383b10096j12429a31861l50791c2601A1452K33059b54900
$$ -108556 -1030 -83277 88383 -210096 -322525 -131861 -482652 -32601 11452 244511 -254900
10160b26978R8991k03899f9447g300r6369c0718k4972C411b9590p1787r5020d4016
$$ -226978 -127987 -331886 -69447 -7300 -103669 -30718 -55690 3411 -29590 -101377 -196397 -44016
10147A32046M9607N3773a39531P977C0592a20067b2154m2758j16166B47114a97790
$$ 132046 181653 235426 -139531 -131554 30592 -120067 -22154 -64912 -181078 247114 -197790
10135A3816b16742i4140j48126P7540E7776r902c46636G5535E288c17890b9011
$$ 13816 -216742 -94140 -242266 -164726 57776 47874 -346636 75535 5288 -317890 -29011
10123b83305A04880D6538k2212g046B24555r0769c34799J62794B8109J13721R7226
$$ -283305 104880 46538 24326 -7046 224555 133786 -334799 -172005 28109 141830 239056
10112B39056G0695N0503e01206K38281a28539M4625B9746c42558a12941C822L511
$$ 239056 70695 121198 -501206 -262925 -128539 -83914 29746 -342558 -112941 3822 7333
10101G333a56309A15546C5879i5345j47392a0031n7412H9737K08690f1949j3227
$$ 7333 -156309 115546 35879 -95345 -242737 -10031 -67443 89737 298427 -61949 -75176
10090g5176L4349G0819j095i1430B46484A2279J23964D8199B2881O0095O9175
$$ -75176 -40827 70819 69724 -91430 246484 12279 136243 48199 22881 82976 152151
10079A52151d9299j17666o5703G9155c64658J25713g3697A47743c66916A7611
$$ 152151 -49299 -166965 -232668 79155 -364658 -238945 -73697 147743 -366916 17611
10068i4787m0669l8615C1719L61095b53022A5768a7727k38200f2059b5614A70053
$$ -94787 -135456 -174071 31719 392814 -253022 15768 -17727 -255927 -62059 -25614 170053
10056f7048J9002r4428B98346A13125d7000h855C4871P0249P6899B6039b95206
$$ -67048 -48046 -142474 298346 113125 -47000 -8855 34871 105120 182019 26039 -295206
10044b71651C06087a25964k02588a43822O9623Q175e167q5812j33048A77536f3995
$$ -271651 306087 -125964 -328552 -143822 -74199 -66024 -5167 -90979 -224027 177536 -63995
10032i23F6901b22836M5262m5514P0246e9520K6400k467A22133O5949b03194e237
$$ -923 66901 -222836 -177574 -223088 -152842 -59520 -33120 -35587 122133 188082 -203194 -5237
10019B59533a19704j21694h2470A16287a62063m7667D13693b50767R8291j18115
$$ 259533 -119704 -241398 -82470 116287 -162063 -209730 413693 -250767 -152476 -270591
10009b70591A41952f2344o1984j68598B44697r4513o0459a69332J385l564G7796
$$ -270591 141952 -62344 -124328 -292926 244697 150184 89725 -169332 -167947 -171511 77796
9997c11226J24182B63260a11173q3828j3953Q1180p2358A54097c7975E0574K3092
$$ -311226 -187044 263260 -111173 -195001 -208954 -127774 -200132 154097 -37975 50574 73666
9986G3666a18137A2970a28415F5642a21801B12385l043d21740b01923i7564p8077
$$ 73666 -118137 12970 -128415 65642 -121801 212385 209342 -421740 -201923 -97564 -175641
9975a75641O9392A92801A9712c07463B55363a38437h16A55079a29241J9130q7377
$$ -175641 -106249 192801 19712 -307463 255363 -138437 -816 155079 -129241 -110111 -197488
9964a97488Q9122A01365a13374j07412d5887l8416j19903r7752l2298B01739q6872
$$ -197488 -108366 101365 -113374 -220786 -45887 -84303 -204206 -301958 -334256 201739 114867
9953A14867N3835a43071H971c39394J12041c7550j2583a5233D3918a12134c5750
$$ 114867 168702 -143071 8971 -339394 -227353 -37550 -50133 -15233 43918 -112134 -35750
9941F704b56912B3386K7772N4394h0848j01826r7815A4150b14247F5382k5272
$$ 6704 -256912 23386 51158 105552 -80848 -182674 -280489 14150 -214247 65382 40110
9930D0110A2294e7088k25516D3148d06252D8522b86664K8095B07153o0340a04723
$$ 40110 12294 -57088 -282604 43148 -406252 48522 -286664 -258569 207153 146813 -104723
9918e0236G2461a76572d9117k14024f1323A49893d10502a5750n2879A58660L6160
$$ -50236 72461 -176572 -49117 -263141 -61323 149893 -410502 -15750 -68629 158660 194820
9907A94820d2448m1834l3526o6196O2527e9118J5726l60053D4506P1596c9761
$$ 194820 -42448 -84282 -117808 -184004 -121477 -59118 -43392 -403445 44506 116102 -39761
9895H3080a42797J5758A20188a45017A15943a94707o7347b0681j21531L765D819
$$ 83080 -142797 -127039 120188 -145017 115943 -194707 -262054 -20681 -142212 -138447 4819
9883a40393F8908g8009G8268K29476A670a00234A13639a97778P053C1756J26813
$$ -140393 68908 -78009 78268 307744 1670 -100234 113639 -197778 -190725 31756 158569
9872A58569H049f1951A30717d7352A16913j0500J61113g316H5278a17837A529
$$ 158569 8049 -61951 130717 -47352 116913 106413 267526 -7316 85278 -117837 1529
9860b8912l83274a86944h8846F4134c4435j50037A99382e104m2123H8970b79494
$$ -28912 -412186 -186944 -88846 64134 -34435 -184472 199382 -5104 -47227 88970 -279494
9848C23287a16475a9k83257j7443D601e39358H0363c9353o980C09208f5503G7005
$$ 323287 -116475 -19 -283276 -300719 4601 -539358 80363 -39353 -46333 309208 -65503 77005
9835i6233k14900A66112b11488g5714j14469n7046a0356F9816a93438A09029l8332
$$ -96233 -311133 166112 -211488 -75714 -190183 -247229 -10356 69816 -193438 109029 70697
9824G0697i8290q22j18530q529f3352A21246c18787i0326k8443B17320b83926
$$ 70697 -98290 -99112 -217642 -226171 -63352 121246 -318787 -90326 -118769 217320 -283926
9812A41828a70763E4350A495b52057B50638A8985e9295o4826j29791D1917a25637
$$ 141828 -170763 54350 1495 -252057 250638 18985 -59295 -124121 -253912 41917 -125637
9800B23103d3316l54635J85310r7601b7911o7939h714k12167j31089C9319d2479
$$ 223103 -43316 -397951 -212641 -310242 -27911 -95850 -8714 -220881 -351970 39319 -42479
9788B86267q4959a52070d5429j32105A7006e4052n248D3083d04110e3166K2687
$$ 286267 201308 -152070 -45429 -177534 17006 -54052 -59300 43083 -404110 -53166 -30479
9777c0479k73556L7952B4082a35040I2110K76634d29810e2731j62936A83902B9898
$$ -30479 -304035 -266083 24082 -135040 92110 368744 -429810 -52731 -215667 183902 29898
9765g9985n4960L8175b0797G2666c32198f1191G009a75591G7424A1575Q5177b3223
$$ -79985 -134945 -96770 -20797 72666 -332198 -61191 7009 -175591 77424 11575 96752 -23223
9752h9291B58443B5284O1742C4247a66743H9146a79453J8636H2233i6068B69937
$$ -89291 258443 25284 87026 34247 -166743 89146 -179453 -160817 82233 -96068 269937
9740c9B5267b67859g7375q2461D0599b27791d3952j4754r3588B0726c43201A12590
$$ -39 25267 -267859 -77375 -159836 40599 -227791 -43952 -58706 -152294 20726 -343201 112590
9727d1853j04537k86657h8049R433j54690B41705D8567A2788L14953a08597D0554
$$ -41853 -146390 -433047 -88049 -78616 -233306 241705 48567 12788 327741 -108597 40554
9715a64182L9288e7029j74672B02805b85389B51568d9683j48695K2996p5902K4073
$$ -164182 -124894 -57029 -231701 202805 -285389 251568 -49683 -198378 -175382 -251284 -227211
9704b27211O4624E3087i2360A1870b17474A31368a2076l835I8491D1178a74161
$$ -227211 -162587 53087 -92360 11870 -217474 131368 -12076 -15911 98491 41178 -174161
9692a89672C64579g8765F6698Q5395P6088b7985j78728A71184a67804d278p1616
$$ -189672 364579 -78765 66698 152093 228181 -27985 -206713 171184 -167804 -4278 -75894
9681g5894j02887Q9127K1265H7630h152j09592M2997j61692O4962O2776D55J00807
$$ -75894 -178781 -89654 -68389 87630 -8152 -117744 -74747 -236439 -171477 -108701 455 101262
9669A01262a45201E3287B4145H117a19347A3345j186J9480a10941j27819A1399
$$ 101262 -145201 53287 24145 8117 -119347 13345 12159 31639 -110941 -238760 11399
9657a53942l6592C8547c6747A16215c64928i1903j36743B9676a62039A37332R8296
$$ -153942 -190534 38547 -36747 116215 -364928 -91903 -228646 29676 -162039 137332 235628
9646B35628a12203p5753J171i0333j96509c3195A96944b35412E597L6008J51224
$$ 235628 -112203 -187956 -186785 -90333 -286842 -33195 196944 -235412 5597 41605 192829
9635A92829a0935F9164a71744j0387H3587b16418Q6472A22604j5327J4407b29149
$$ 192829 -10935 69164 -171744 -182131 83587 -216418 -129946 122604 107277 121684 -229149
9623b32633d6180j23742A00749h2046B1468r423a14430E4646K48512j17212e2211
$$ -232633 -46180 -169922 100749 -82046 21468 12045 -114430 54646 303158 185946 -52211
9611B203h9756A29237J21174I6157a0723p5809A8506K27948a57864l3812m9200
$$ 2203 -89756 129237 250411 96157 -10723 -86532 18506 246454 -157864 -191676 -240876
9600b40876n9708e0929D2050h270k02481j2863M7619A12598h4307C87662A77964
$$ -240876 -300584 -50929 42050 -8270 -210751 -223614 -175995 112598 -84307 387662 177964
9588h682H8831j6095c34710A64359n0417h1913B1752e8117B74709c7273j87513
$$ -8682 88831 72736 -334710 164359 113942 -81913 21752 -58117 274709 -37273 -224786
9577b24786Q6369k53734a55854N9217N690r4311P6106J8163B14740i5468p7293
$$ -224786 -138417 -392151 -155854 -96637 -90947 -185258 -109152 -90989 214740 -95468 -172761
9566a72761j15517A57539a01082j32911J16847j87276J14565J1335a0668j73226
$$ -172761 -288278 157539 -101082 -233993 -117146 -304422 -189857 -178522 -10668 -183894
9556a83894h6710j35293M149Q2848C3436a5477F1785b22010G5497b01225g5069
$$ -183894 -86710 -222003 -217854 -135006 33436 -15477 61785 -222010 75497 -201225 -75069
9544a10919q2765i5447A19097a02853r9821g1513k4647L0394K8873n7814a028
$$ -110919 -193684 -95447 119097 -102853 -202674 -71513 -96160 -65766 -36893 -94707 -1028
9532E9476b23097c4382O612k29799d9249a506j10024A2747i2195j17703P2979
$$ 59476 -223097 -34382 -27770 -257569 -49249 -1506 -111530 12747 -92195 -209898 -136919
9521a36919H3349B0243a94044b2934q4638J4871L2581G487L074M984a52974k3844
$$ -136919 83349 20243 -194044 -22934 -107572 -92701 -60120 7487 10561 15545 -152974 -176818
9509a76818L1820A49034B6416c3408j75222M4399j36730J30694c1457A21028d5199
$$ -176818 -144998 149034 26416 -33408 -208630 -164231 -300961 -170267 -31457 121028 -45199
9497D1940a34034r450F5561d27k7885B2801a27741o5767C5434a10910A52158E1263
$$ 41940 -134034 -143484 65561 -427 -28312 22801 -127741 -193508 35434 -110910 152158 51263
9484a6668B10411G114c5139J5569l97582A46356b00282b3203k26970A02948b98773
$$ -16668 210411 7114 -35139 -19570 -417152 146356 -200282 -23203 -250173 102948 -298773
9472I9810a14065k19338I4189a89109A60085b78239A16433f9461o6866l847E3356
$$ 99810 -114065 -333403 94189 -189109 160085 -278239 116433 -69461 -136327 -140174 53356
9460C33833D6257a44575A92964a26236H2144b8885p3952B46449C8258q424R0989
$$ 333833 46257 -144575 192964 -126236 82144 -28885 -102837 246449 38258 29834 120823
9449A20823J30407b30969l8401f0376E2422b27354N642Q8089l50685a68967d9953
$$ 120823 251230 -230969 -269370 -60376 52422 -227354 -221712 -133623 -484308 -168967 -49953
9437a4923A56825f8736A08642B973R0075J5472E3939d07446a41374K0326d4200
$$ -14923 156825 -68736 108642 2973 93048 108520 53939 -407446 -141374 -121048 -44200
9425E6971J48988a25344E4031K5894J34711H2592J08360b88663J23949l45365
$$ 56971 205959 -125344 54031 79925 214636 82592 190952 -288663 -164714 -510079
9415e10079B36128A00497C4360J71236I8151k9018b12427P7138F7580a09450K3411
$$ -510079 236128 100497 34360 205596 98151 69133 -212427 -135289 67580 -109450 -86039
9404h6039G1086a0452k21082P587C38989a51000A8639d24521a37309B45790b88585
$$ -86039 71086 -10452 -231534 -223947 338989 -151000 18639 -424521 -137309 245790 -288585
9392e1432k23406a08074C4713j2011a44223A10388c9620j00215j3594N5676l53136
$$ -51432 -274838 -108074 34713 22702 -144223 110388 -39620 -139835 -153429 -97753 -450889
9381d50889a25863I1758f974p9678M1232j95781R1360A88508a4898k10478h1882
$$ -450889 -125863 91758 -6974 -86652 -45420 -241201 -149841 188508 -14898 -225376 -81882
9369b35654d5638r5039n1157A00623c70619h1428R564g53k17111G6389O1587a90094
$$ -235654 -45638 -140677 -191834 100623 -370619 -81428 -71864 -753 -217864 76389 137976 -190094
9356A32438g8237l8432r9532g967m426B1973b08338c3833B41648a893A14927M3980
$$ 132438 -78237 -116669 -216201 -7967 -12393 21973 -208338 -33833 241648 -1893 114927 158907
9344A58907a82843A53298e5320A79780c6912j01201d9399j94986B21570b13260
$$ 158907 -182843 153298 -55320 179780 -36912 -138113 -49399 -244385 221570 -213260
9333c96333D5466M20481e2701B91856d92987A55899l6901a01972G1681M0135i8993
$$ -396333 45466 465947 -52701 291856 -492987 155899 118998 -101972 71681 111816 -98993
9321C3973h6781K1524j76231R424K8159C8790a14741L5790K6252j2450j028L0699
$$ 33973 -86781 -65257 -241488 -232064 -203905 38790 -114741 -78951 -52699 -65149 -66177 -35478
9309c5478k40365c3190a465o6104l3509j9311k08261e8880j77774D7788a0220
$$ -35478 -275843 -33190 -1465 -67569 -101078 -120389 -328650 -58880 -236654 47788 -10220
9297b31197B24365G8077a33150d3971j41966J691L5750A07234f6413o730F14a05779
$$ -231197 224365 78077 -133150 -43971 -185937 -184246 -148496 107234 -66413 -73143 614 -105779
9284a17527q5032Q6220A95881F5630g9603e036j85396N7716A36759a2944n9636
$$ -117527 -202559 -116339 195881 65630 -79603 -5036 -190432 -132716 136759 -12944 -72580
9273g2580B84562b06432j00619C6369a26798A89662K61145d74674I6229d0127
$$ -72580 284562 -206432 -307051 36369 -126798 189662 450807 -474674 96229 -40127
9262a01640k1M4170j64035A45180e14067a90802c8538B04230b3326C7788d3267
$$ -101640 -101661 -57491 -221526 145180 -514067 -190802 -38538 204230 -23326 37788 -43267
9250C23858G312h6621F3357a40448k80870b9346m4059k92973E3811K5438k2981
$$ 323858 7312 -86621 63357 -140448 -421318 -29346 -73405 -366378 53811 79249 56268
9239E6268f8746j21272A31521a89695d94D094b42727J03321p9026C7521a0832
$$ 56268 -68746 -190018 131521 -189695 -494 4094 -242727 -139406 -218432 37521 -10832
9227A022a72865c7059j54363H1476C8416a90667a6011A44483b28232j45191C116
$$ 1022 -172865 -37059 -191422 81476 38416 -190667 -16011 144483 -228232 -373423 3116
9215D574c1371A3964R8219a62016j92658b385k97436A84924E5857h2448A19544
$$ 4574 -31371 13964 112183 -162016 -354674 -2385 -299821 184924 55857 -82448 119544
9203B7642O4996b92300J31386j60675R4733O0232D2856J2035a03862n1185A01153
$$ 27642 92638 -292300 -160914 -321589 -226856 -166624 42856 54891 -103862 -155047 101153
9191g8139l2436A58970h5738C4470J62976a90436E7754P8179d22775d3955h712
$$ -78139 -110575 158970 -85738 34470 197446 -190436 57754 135933 -422775 -43955 -8712
9179A93108A21b85523F1870L35588A71402a06755j12284a8386j99699H0471M0329
$$ 193108 121 -285523 61870 397458 171402 -106755 -219039 -18386 -218085 80471 120800
9168A20800b9511o6536r1591D9805g4389n7097j59405f7132D9a37562H9983d18003
$$ 120800 -29511 -96047 -187638 49805 -74389 -131486 -290891 -67132 49 -137562 89983 -418003
9155g207C8630c9554m0764j6009p3171P6031m3749c5224n4128C06477d70044d451
$$ -7207 38630 -39554 -80318 -96327 -169498 -93467 -137216 -35224 -89352 306477 -470044 -4451
9142a23935B47308c23644R8084c4258m12150a78465C92304d85611g2891L1761
$$ -123935 247308 -323644 -225560 -34258 -446408 -178465 392304 -485611 -72891 -41130
9132d1130A63935a45468k4698m9420e2696A3875L5383c02794B81331m5450E5224
$$ -41130 163935 -145468 -170166 -219586 -52696 13875 49258 -302794 281331 235881 55224
9120A3339a79339A50219c16452J21968B19585b43959B11917h1585m1167C516d5762
$$ 13339 -179339 150219 -316452 -194484 219585 -243959 211917 -81585 -122752 3516 -45762
9108f7134j31432i2933I4019L8196L9689B686a52890A8799c15813C13857a1890
$$ -67134 -198566 -92933 94019 132215 171904 2686 -152890 18799 -315813 313857 -11890
9096b23157k34067J40487L3988C18671D9179h9425j8277L557j9792I5807h4929
$$ -223157 -457224 -316737 -282749 318671 49179 -89425 -107702 -104145 -123937 95807 -84929
9084b18877M6670q1859H0442d1595J5109k2645n3501I9559e6729o6393L6994F8251
$$ -218877 -172207 -254066 80442 -41595 -26486 -49131 -102632 99559 -56729 -123122 -86128 68251
9071B31879p3361E5410b02577l8762N1085C80512d28397a39414A0588e6442B4823
$$ 231879 158518 55410 -202577 -241339 -190254 380512 -428397 -139414 10588 -56442 24823
9059a15109L7551j9870A86418h3499j72067a24573J0640C76593A13361g9574K0614
$$ -115109 -77558 -97428 186418 -83499 -255566 -124573 -113933 376593 113361 -79574 -58960
9048e8960D8675c10661d4267A76893c2615k33250J25738H9049b79871d8410A62621
$$ -58960 48675 -310661 -44267 176893 -32615 -265865 -140127 89049 -279871 -48410 162621
9036c32142f7679j18191p696c6505k8808B42765a34532B21861e25690g5285j7908
$$ -332142 -67679 -185870 -193566 -36505 -65313 242765 -134532 221861 -525690 -75285 -93193
9025i3193c8149G2106i3267j37210H2384L5321a90692g012k17582O5092A29686
$$ -93193 -38149 72106 -93267 -230477 82384 117705 -190692 -7012 -224594 -159502 129686
9013h288j69226j23406A93911a51886A22115a45115F1792c1431m0425A90831q4117
$$ -8288 -177514 -300920 193911 -151886 122115 -145115 61792 -31431 -71856 190831 106714
9002A06714k3321a40256H1788J5253b78371B72476b16639k72552i3450G5694R169
$$ 106714 83393 -140256 81788 97041 -278371 272476 -216639 -489191 -93450 75694 84863
8991H4863J26072b45801J12917k27036D4322h7395j95671c7693A57437c9000q8286
$$ 84863 210935 -245801 -132884 -359920 44322 -87395 -283066 -37693 157437 -39000 -127286
8980a27286E1629a70474e8823G0353K00987G1588g1639j38847m8617A10375b58969
$$ -127286 51629 -170474 -58823 70353 271340 71588 -71639 -210486 -259103 110375 -258969
8968a04986B67992b94466h0709R660A21538m2974b93233f658r56j12710j42710
$$ -104986 267992 -294466 -80709 -71049 121538 78564 -293233 -6658 -7614 -120324 -263034
8957b63034g5128c0536k47064J13149o6550B04692e37887i3227C581a99957b1382
$$ -263034 -75128 -30536 -277600 -164451 -231001 204692 -537887 -93227 3581 -199957 -21382
8945I0825b2860a0444A17523F298Q4524F790d4203A41188e5255B15537D3921J10997
$$ 90825 -22860 -10444 117523 6298 90822 6790 -44203 141188 -55255 215537 43921 154918
8933A54918J59535F3876B5305J34154K12327g941A49028K70633K20127K102869
$$ 154918 314453 63876 25305 159459 371786 -7941 149028 419661 639788 2742657
8923B742657K239199K496774J0478767D820380A292553o36425A45883D5643K50669
$$ 2742657 4981856 7478630 17957397 4820380 1292553 656128 145883 45643 296312
8914B96312j05785b24282n9945J13764B30556R475a9593B06395a32155I5312K77132
$$ 296312 190527 -224282 -284227 -170463 230556 240031 -19593 206395 -132155 95312 372444
8903C72444F9905K1784b02245O4333B4919a23944N3530j84128B10326c30429A21833
$$ 372444 69905 91689 -202245 -137912 24919 -123944 -70414 -254542 210326 -330429 121833
8891B13796p9346a34309j14878D1291m18K28776e0724j83504J08468B08560r632
$$ 213796 134450 -134309 -249187 41291 40873 269649 -50724 -234228 -125760 208560 198928
8880A98928a35258O5587K769b3664l4520r0839I5013k4087R3239c26129A55445
$$ 198928 -135258 -69671 -66902 -23664 -58184 -149023 95013 70926 164165 -326129 155445
8868d2600C06235b42449H2576Q5722c60727Q9465Q5955C2494d96483C6321A7752
$$ -42600 306235 -242449 82576 168298 -360727 -271262 -185307 32494 -496483 36321 17752
8856b4263M432D2191b3012A39637J35475A4537g3770K6795j59349E568K3037K07766
$$ -24263 -19831 42191 -23012 139637 275112 14537 -73770 -46975 -206324 5568 28605 236371
8844B36371a31348A65934c79273B2794K85093a89487b172p5395j22049H3489a4020
$$ 236371 -131348 165934 -379273 22794 307887 -189487 -2172 -77567 -199616 83489 -14020
$$ [...]
##END NTUPLES=NMR SPECTRUM
##END=
