##TITLE=AC1765_NAR_18_9683510_0nNJ3rwyda
##JCAMPDX= 6.0         $$ Bruker NMR JCAMP-DX V2.0
##DATA TYPE= NMR SPECTRUM
##DATA CLASS= NTUPLES
##ORIGIN= BRUKER
##OWNER= Administrator
$$ 1.72 TOPSPIN		Version 2.1
$$ 2016-04-16 22:39:41.173 -0700  Administrator@X
$$ Compression mode = diff/dup
##.OBSERVE FREQUENCY= 400.02188249412
##.OBSERVE NUCLEUS= ^1H
##.ACQUISITION MODE= SIMULTANEOUS (DQD)
##.ACQUISITION SCHEME= undefined
##.AVERAGES= 64
##.DIGITISER RES= 22
##SPECTROMETER/DATA SYSTEM= spect
##.PULSE SEQUENCE= noesygpps1d.comp
##.SOLVENT NAME= COFFEE_meoh
##.SHIFT REFERENCE= INTERNAL, COFFEE_meoh, 1, 14.96121
##AUDIT TRAIL= $$ (NUMBER, WHEN, WHO, WHERE, PROCESS, VERSION, WHAT)
$$ ##TITLE= Audit trail, TOPSPIN		Version 2.1
$$ ##JCAMPDX= 5.01
$$ ##ORIGIN= Bruker BioSpin GmbH
$$ ##OWNER= Administrator
$$ $$ E:\/data/COFFEE/nmr/AC1765_NAR_18_9683510_0nNJ3rwyda/12/pdata/1/auditp.txt
$$ ##AUDIT TRAIL=  $$ (NUMBER, WHEN, WHO, WHERE, PROCESS, VERSION, WHAT)
(   1,<2016-04-16 22:39:36.017 -0700>,<Administrator>,<X>,<go>,<TOPSPIN 2.1>,
      <created by zg
	started at 2016-04-16 22:28:06.439 -0700,
	POWCHK enabled, PULCHK disabled,
       configuration hash MD5:
       21 0F 79 D6 B3 7B B4 F6 88 20 88 DB 03 48 BD 9F
       data hash MD5: 64K
       DA D3 AC F6 70 B2 78 97 11 93 0A F6 E8 4E CA 5F>)
(   2,<2016-04-16 22:39:39.126 -0700>,<Administrator>,<X>,<proc1d>,<TOPSPIN 2.1>,
      <Start of raw data processing
       efp LB = 0.3 FT_mod = 6 PKNL = 1 PHC0 = 0 PHC1 = 0 SI = 128K 
       data hash MD5: 128K
       0D 87 E3 29 0A BC D7 42 72 06 22 6C EA 90 4D 39>)
(   3,<2016-04-16 22:39:39.986 -0700>,<Administrator>,<X>,<proc1d>,<TOPSPIN 2.1>,
      <pk PHC0 = -85.11108 PHC1 = 0 
       data hash MD5: 128K
       26 D4 18 60 27 48 76 59 E9 30 F7 8B E2 A8 87 E9>)
(   4,<2016-04-16 22:39:40.376 -0700>,<Administrator>,<X>,<proc1d>,<TOPSPIN 2.1>,
      <abs ABSG = 1 
       data hash MD5: 128K
       36 C1 91 9C F8 7A F7 8A D9 8D 4D 36 9F 2A 02 6A>)
(   5,<2016-04-16 22:39:40.470 -0700>,<Administrator>,<X>,<proc1d>,<TOPSPIN 2.1>,
      <abs ABSG = 2 
       data hash MD5: 128K
       65 D0 56 29 2D 55 70 23 5D 5F CF 12 EB E6 F8 39>)
(   6,<2016-04-16 22:39:40.564 -0700>,<Administrator>,<X>,<proc1d>,<TOPSPIN 2.1>,
      <abs ABSG = 3 
       data hash MD5: 128K
       D7 41 F8 4B 9A 18 1D 14 88 16 C8 8A 99 96 FB 18>)
(   7,<2016-04-16 22:39:40.642 -0700>,<Administrator>,<X>,<proc1d>,<TOPSPIN 2.1>,
      <abs ABSG = 4 
       data hash MD5: 128K
       4A 88 19 C5 64 ED B4 33 9C BA 7B F8 B0 91 B5 4C>)
(   8,<2016-04-16 22:39:40.767 -0700>,<Administrator>,<X>,<proc1d>,<TOPSPIN 2.1>,
      <abs ABSG = 5 
       data hash MD5: 128K
       00 A3 E7 E3 7F B5 90 29 9B F3 58 43 43 B2 D7 8C>)
$$ ##END=
$$ 
$$ $$ hash MD5
$$ $$ A9 F8 EB 37 85 15 B5 3C CB EA 27 97 64 40 2D 4B
##$RELAX= 
##$RELAX= 
##$RELAX= 
##$RELAX= 
##$RELAX= 
##$RELAX= 
##$RELAX= 
##$RELAX= 
$$ Bruker specific parameters
$$ --------------------------
##$DU= <E:\>
##$EXPNO= 12
$$ [...]
##$TP07= 0
##$TPNAME0= <>
##$TPNAME1= <>
##$TPNAME2= <>
##$TPNAME3= <>
##$TPNAME4= <>
##$TPNAME5= <>
##$TPNAME6= <>
##$TPNAME7= <>
##$TPOAL= (0..7)
0.5 0.5 0.5 0.5 0.5 0.5 0.5 0.5
##$TPOFFS= (0..7)
0 0 0 0 0 0 0 0
##$TUNHIN= 0
##$TUNHOUT= 0
##$TUNXOUT= 0
##$USERA1= <user>
##$USERA2= <user>
##$USERA3= <user>
##$USERA4= <user>
##$USERA5= <user>
##$V9= 5
##$VALIST= <valist>
##$VCLIST= <CCCCCCCCCCCCCCC>
##$VD= 0
##$VDLIST= <DDDDDDDDDDDDDDD>
##$VPLIST= <PPPPPPPPPPPPPPP>
##$VTLIST= <TTTTTTTTTTTTTTT>
##$WBST= 2048
##$WBSW= 25
##$XGAIN= (0..3)
0 0 0 0
##$XL= 0
##$YL= 0
##$YMAX_a= 6173702
##$YMIN_a= -11694699
##$ZGOPTNS= <>
##$ZL1= 120
##$ZL2= 120
##$ZL3= 120
##$ZL4= 120
##$ABSF1= 14.96121
##$ABSF2= -5.596972
##$ABSG= 5
##$ABSL= 3
##$ALPHA= 0
##$AQORDER= 0
##$ASSFAC= 0
##$ASSFACI= 0
##$ASSFACX= 0
##$ASSWID= 0
##$AUNMP= <proc_prof1d_extract.lims>
##$AXLEFT= 0
##$AXNAME= <>
##$AXNUC= <1H>
##$AXRIGHT= 0
##$AXTYPE= 0
##$AXUNIT= <>
##$AZFE= 0.1
##$AZFW= 0.1
##$BCFW= 0
##$BC_mod= 0
##$BYTORDP= 0
##$COROFFS= 0
##$CY= 15
##$DATMOD= 1
##$DC= 0
##$DFILT= <>
##$DTYPP= 0
##$F1P= 0
##$F2P= 0
##$FCOR= 0.5
##$FTSIZE= 131072
##$FT_mod= 6
##$GAMMA= 0
##$GB= 0
##$INTBC= 1
##$INTSCL= 1
##$ISEN= 128
##$LB= 0.3
##$LEV0= 0
##$LPBIN= 0
##$MAXI= 10000
##$MC2= 0
##$MEAN= 0
##$ME_mod= 0
##$MI= 0
##$NCOEF= 0
##$NC_proc= -2
##$NLEV= 6
##$NOISF1= 0
##$NOISF2= 0
##$NSP= 0
##$NTH_PI= 0
##$NZP= 0
##$OFFSET= 14.96121
##$PC= 1
##$PHC0= -85.11108
##$PHC1= 0
##$PH_mod= 1
##$PKNL= yes
##$PPARMOD= 0
##$PPDIAG= 0
##$PPIPTYP= 0
##$PPMPNUM= 2147483647
##$PPRESOL= 1
##$PSCAL= 4
##$PSIGN= 0
##$PYNMP= <proc.py>
##$REVERSE= no
##$SF= 400.020009553405
##$SI= 131072
##$SIGF1= 0
##$SIGF2= 0
##$SINO= 400
##$SIOLD= 131072
##$SPECTYP= <>
##$SREGLST= <1H.CDCl3>
##$SSB= 0
##$STSI= 131072
##$STSR= 0
##$SW_p= 8223.68421052631
##$SYMM= 0
##$S_DEV= 0
##$TDeff= 65536
##$TDoff= 0
##$TI= <>
##$TILT= no
##$TM1= 0
##$TM2= 0
##$TOPLEV= 0
##$USERP1= <user>
##$USERP2= <user>
##$USERP3= <user>
##$USERP4= <user>
##$USERP5= <user>
##$WDW= 1
##$XDIM= 131072
##$YMAX_p= 343892051
##$YMIN_p= -10378
##$CURPLOT= <Network HP LaserJet P1505>
##$CURPRIN= <$Network HP LaserJet P1505>
##$DFORMAT= <normdp>
##$LAYOUT= <+/1D_H.xwp>
##$LFORMAT= <normlp>
##$PFORMAT= <normpl>
##$SURQMSG= 1
$$ End of Bruker specific parameters
$$ ---------------------------------
##NTUPLES= NMR SPECTRUM
##VAR_NAME=  FREQUENCY,     SPECTRUM/REAL,   SPECTRUM/IMAG
##SYMBOL=    X,             R,               I
##VAR_TYPE=  INDEPENDENT,   DEPENDENT,       DEPENDENT
##VAR_FORM=  AFFN,          ASDF,            ASDF
##VAR_DIM=   131072,        131072,          131072
##UNITS=     HZ,            ARBITRARY UNITS, ARBITRARY UNITS
##FACTOR=    0.0627417313425164, 1,          1
##FIRST=     8223.62146879497, 502,          -64786
##LAST=      0,             2964,            -64189
##MIN=       0,             -10378,          0
##MAX=       8223.62146879497, 343892051,    0
$$ Real data points
##PAGE= N=1
##DATA TABLE= (X++(R..R)), XYDATA
$$ [...]
67826 82461 83445 83923 84440 85070 85611 85933 86034 86059 86242 86568 86628 86186 85684 85605 85506 84504 82695 81181 80436
67807 80436 79630 78025 76159 74964 74366 73616 72489 71402 70660 70336 70638 71671 73019 74105 74773 74970
67791 74970 74300 72594 70641 69514 69388 69765 70582 72066 73648 74168 73377 72224 71383 70507 69311 68374 68244
67774 68244 68565 68854 69453 70889 72758 74084 74570 74737 75033 75505 76258 77513 79149 80758 82286 84053
67758 84053 85972 87274 87382 86778 86566 87200 87944 87701 86244 84408 83139 82581 82230 81676 80867 79851 78778
67741 78778 78147 78454 79374 79796 79027 77580 76378 75556 74586 73309 72189 71577 71312 71155 71148 71308 71375 71136 70818
67722 70818 70858 71353 71922 72056 71549 70660 69958 69942 70686 71825 72886 73605 73966 74023 73824 73457 73074 72787 72557
67703 72557 72234 71676 70836 69733 68426 67072 65908 65091 64602 64332 64193 64111 64063 64211 64859 66107 67638 69040
67685 69040 70227 71341 72354 73079 73562 74123 75020 76329 78125 80384 82672 84360 85355 86278 87720 89613
67669 89613 91545 93307 94830 95888 96307 96327 96422 96755 97129 97413 97740 98252 98831 99119 98711 97379 95266 92869
67651 92869 90774 89323 88430 87634 86414 84726 83149 82212 81632 80691 79359 78463 78504 78921 78978 78862 79301 80451
67633 80451 81819 83052 84116 84846 85067 85199 85992 87476 88781 89268 89323 89750 90863 92511 94534 96722
67617 96722 98604 99843 100713 101793 103199 104500 105440 106377 107844 109865 111914 113478 114469 115056 115258 114901
67601 114901 113918 112480 110731 108633 106237 103939 102117 100616 98863 96533 93873 91368 89348 87979
67587 87979 87290 87029 86659 85758 84379 82930 81789 81082 80638 80060 79003 77568 76348 75901 76170 76526 76442
67570 76442 75996 75673 75722 75913 76013 76338 77484 79439 81277 82013 81618 80865 80316 79869 79298 78751 78491 78477 78548
67551 78548 78810 79499 80468 81125 80976 80125 79123 78432 78070 77712 77028 75927 74605 73472 72965 73213 73778 73877
67533 73877 73039 71552 70178 69462 69353 69399 69178 68582 67831 67204 66708 66071 65094 63885 62633 61338 59960
67516 59960 58729 58047 58130 58864 59959 61113 62147 63136 64253 65367 66031 66109 66084 66397 66773 66696 66349 66419 67042
67497 67042 67591 67622 67401 67275 67163 66948 66864 67043 67112 66689 66010 65666 65922 66610 67426 68049 68232 68145 68344 69071
67477 69071 69798 69897 69498 69236 69324 69391 69149 68651 67916 66854 65710 65059 65136 65539 65863 66257 67041 67996 68471 68166
67457 68166 67464 66951 66889 67298 68303 70026 72128 73796 74428 74194 73692 73235 72815 72694 73493 75447 77855
67440 77855 79583 79978 79231 78075 77304 77301 77754 78024 77983 78212 79170 80454 81209 81007 79936 78126 75773 73497
67422 73497 72054 71577 71507 71307 70847 70105 69053 68025 67641 68069 68756 69182 69502 70022 70442 70176 69319 68733
67404 68733 69074 70166 71438 72553 73286 73144 71708 69403 67468 66835 67260 67805 68003 68137 68455 68673 68477
67387 68477 68074 67822 67589 66962 65997 65323 65433 66211 67232 68209 69006 69453 69371 68734 67780 67026 67052 68086 69738
67368 69738 71304 72291 72587 72306 71779 71555 71946 72519 72415 71306 69788 68759 68685 69504 70800 71866 71999
67351 71999 71119 70008 69698 70704 72803 75265 77172 77927 77740 77404 77332 77119 76317 75252 74602 74425 74176
67334 74176 73626 73176 73166 73407 73632 74056 75189 77282 80135 83280 86125 88078 88774 88309 87208 86185 85761
67317 85761 85888 85914 85191 83820 82596 82094 82063 81892 81424 80996 80889 81141 81823 83009 84344 85129 85095 84795 84922
67298 84922 85512 86167 86744 87299 87471 86579 84518 82097 80319 79685 80355 82381 85339 88105 89581 89571 88611
67281 88611 87190 85536 83932 82646 81580 80469 79426 78846 78764 78809 78843 79180 80054 81338 82845 84461 85907
67264 85907 86933 87855 89300 91136 92348 92320 91582 90805 89731 87870 85724 84394 84110 84072 83732 83465 83772
67247 83772 84482 85037 85133 84799 84220 83672 83433 83549 83827 84035 83967 83494 82885 82929 84157 85972 87072 86873 85998
67228 85998 85269 84822 84493 84468 84995 85742 86057 85782 85446 85575 86116 86564 86521 86094 85756 85780 85869 85507 84631 83678
67208 83678 83020 82691 82719 83279 84312 85353 86024 86376 86558 86523 86424 86868 88248 90022 91216 91589 91784 92358
67190 92358 93152 93712 93860 93667 93218 92687 92395 92496 92725 92700 92465 92576 93526 95138 96604 97207 97021 96815 97244
67171 97244 98228 99125 99332 98690 97545 96586 96402 96950 97590 97768 97513 97095 96520 95703 94918 94561 94585 94611 94597 94929
67151 94929 95755 96686 97330 97746 98176 98657 99098 99497 99867 100149 100346 100498 100400 99686 98419 97376 97409 98686 100730
67132 100730 102984 105047 106568 107320 107465 107552 108210 109864 112504 115520 117990 119386 119982 120404 120953 121541
67116 121541 122045 122341 122190 121534 120843 120735 121202 121630 121645 121535 121743 122361 123332 124700 126396 128088 129589 131114
67098 131114 132803 134254 135029 135404 136109 137270 138165 138218 137809 137780 138393 139190 139801 140495 141775 143628 145435
67081 145435 146624 147194 147449 147440 147032 146521 146734 148092 149899 151067 151497 152219 154047 156582 158823 160327 161383
67064 161383 162366 163430 164691 166158 167474 168203 168470 168910 169894 171188 172553 174217 176432 178875 180915
67049 180915 182360 183573 184926 186448 187983 189454 190894 192392 193992 195604 197153 198984 201846 206068
67035 206068 210845 214753 217048 218123 218714 219158 219601 220432 222029 224261 226629 228854 231053 233397 235862
67020 235862 238300 240562 242536 244335 246428 249359 253186 257281 260806 263400 265432 267629 270450 273775
67006 273775 277219 280670 284427 288720 293304 297692 301671 305401 309029 312491 315716 318843 322129 325763
66992 325763 329819 334240 338767 342994 346689 350061 353578 357471 361532 365448 369269 373363 377910 382607
66978 382607 387027 391113 395124 399220 403408 407915 413199 419354 425821 432000 438025 444591 452071 460105
66964 460105 468064 475673 483099 490653 498497 506514 514388 521966 529530 537539 546051 554609 562842 570988
66950 570988 579651 589115 599138 609393 619908 630940 642524 654343 666064 677612 689028 700288
66938 700288 711544 723369 736334 750281 764472 778637 793400 809366 826227 843262 860336
66927 860336 877728 895197 912074 928370 945035 962821 981500 1000535 1019956 1040132 1061108
66916 1061108 1082658 1104656 1126919 1148990 1170687 1192705 1216115 1241243 1267466 1294078 1320924
66905 1320924 1348135 1375682 1403420 1431389 1459957 1489724 1521135 1553889 1586858 1618951 1650141
66894 1650141 1681407 1713679 1747097 1781204 1815450 1849477 1883364 1917694 1952938 1988589 2023351
66883 2023351 2056503 2088730 2121213 2154215 2186995 2218833 2249529 2278983 2306935 2333406 2358957
66872 2358957 2384143 2408901 2432701 2455135 2476130 2495740 2514024 2531032 2546627 2560352 2571689
66861 2571689 2580477 2586898 2591131 2593337 2593877 2593028 2590333 2584778 2576019 2564999 2552858 2539549 2524171
66848 2524171 2506491 2487332 2467420 2446634 2424623 2401389 2376801 2350231 2321342 2290831 2259703
66837 2259703 2228166 2195877 2162969 2130005 2096998 2063288 2028581 1993413 1958399 1923600 1888901
66826 1888901 1854513 1820765 1787779 1755548 1724022 1692830 1661337 1629222 1596757 1564376 1532307
66815 1532307 1500814 1470237 1440462 1410787 1380805 1351099 1322623 1295628 1269619 1244100 1218838
66804 1218838 1193645 1168514 1143958 1120609 1098430 1076723 1054994 1033357 1012055 991034 970208
66793 970208 949782 930074 911221 893194 875843 858833 841777 824638 807811 791705 776410
66782 776410 761846 747922 734448 721149 707985 695242 683092 671316 659706 648521 638168
66771 638168 628511 618885 608796 598341 587883 577586 567451 557593 548243 539476 531050 522596 513991
66758 513991 505534 497704 490680 484121 477491 470552 463447 456323 449118 441811 434750 428457 423095 418277
66744 418277 413486 408542 403613 398895 394422 390077 385640 380868 375732 370557 365726 361212 356636 351875
66730 351875 347334 343415 339924 336265 332120 327672 323205 318859 314723 310881 307190 303320 299207 295209
66716 295209 291621 288204 284496 280476 276555 272925 269308 265535 262063 259573 258128 256977 255210 252416
66702 252416 248801 245011 241906 240151 239651 239532 238855 237256 234714 231101 226516 221927 218662 216927 215399
66687 215399 212812 209539 207041 206026 205828 205522 204864 203913 202354 199761 196271 192598 189428 187008 185181
66672 185181 183560 181688 179301 176536 173856 171775 170599 170204 170009 169358 168128 166824 165956 165436 164779 163790
66656 163790 162844 162477 162830 163435 163542 162738 161336 160031 159106 158146 156612 154446 151902 149093 146091 143328
66640 143328 141463 140793 141105 142059 143308 144206 143934 142255 139927 138072 137242 137258 137716 138332 138868 139049 138701
66623 138701 137871 136858 136116 135982 136364 136729 136505 135492 133895 132162 130805 130096 129751 129142 128066 127062
66607 127062 126660 126566 126094 125238 124687 124693 124530 123485 121944 121004 121212 122077 122745 122738 122081 121107 120251 119771 119505 118959
66587 118959 117727 115784 113485 111405 110035 109382 108902 108050 106858 105764 104963 104296 103736 103521 103636 103579 102972
66570 102972 102112 101528 101224 100787 100158 99806 100077 100760 101454 101999 102342 102280 101686 100895 100475 100585 100798 100675 100328
66551 100328 100244 100595 100898 100404 98767 96357 94037 92610 92349 92867 93378 93210 92226 90874 89841 89559 89931
66534 89931 90473 90799 90967 91320 91996 92733 93161 93087 92528 91722 91194 91433 92136 92114 90499 87952 86071 85553 85590
66515 85590 85239 84667 84541 84811 84854 84528 84290 84276 84048 83417 82920 83175 84159 85384 86438 87005 86755 85637 84193
66496 84193 83171 82857 83009 83379 83953 84645 85062 84809 83933 82943 82364 82356 82736 83264 83802 84247 84441 84216 83484
66477 83484 82250 80682 79197 78307 78199 78552 78901 79063 79046 78738 78035 77213 76835 77218 78126 78974 79124 78130
66459 78130 76150 74140 73232 73691 74789 75782 76610 77437 78023 78035 77745 77878 78745 79824 80309 79898 79007 78278
66441 78278 77915 77546 76876 76330 76643 77784 78780 78900 78599 78852 79891 81080 81819 82028 81872 81526 81228 81090
66423 81090 80833 80127 79230 78854 79276 79937 80018 79091 77191 74721 72476 71329 71553 72563 73452 73609 72874 71520
66405 71520 70192 69454 69185 68805 68222 68116 68958 70226 71015 71051 70668 70122 69521 69186 69434 70023 70397 70481 70698
66386 70698 71182 71615 71979 72768 74041 74927 74668 73765 73353 73661 73805 73216 72512 72622 73575 74640 75331 75724
66368 75724 75906 75685 74951 73920 72847 71779 70785 70089 69773 69563 69222 68996 69318 70144 70892 71064 70667 70010
66350 70010 69351 68816 68477 68378 68629 69389 70596 71756 72307 72222 71953 71748 71383 70672 69869 69314 69076 69131 69558
66331 69558 70194 70462 70007 69306 69135 69531 69814 69627 69456 69942 71110 72489 73700 74660 75359 75684 75450 74584
66313 74584 73284 71962 70915 70143 69617 69541 70024 70559 70267 68786 66712 65070 64565 65308 66878 68502 69470
66296 69470 69608 69249 68791 68489 68556 69017 69396 69057 68030 67080 66773 66926 67199 67629 68232 68697 68987 69669 70991
66277 70991 72178 72446 72330 72961 74219 74790 74177 73475 73739 74547 74894 74720 74730 75180 75639 75735 75460 74901 74217
66258 74217 73843 74184 75071 75895 76191 75898 75269 74828 75125 76049 76672 76283 75344 74774 74539 73795 72384 71295
66240 71295 71333 72117 72793 73111 73322 73542 73774 74151 74613 74692 74170 73649 73813 74322 74149 73034 71933 71828 72583
66221 72583 73237 73046 72023 70767 70069 70467 71797 73229 73921 73719 73180 72958 73217 73618 73831 74098 75178
66204 75178 77570 80845 83943 86158 87567 88479 88815 88300 87077 85733 84686 83755 82461 80669 78896
66189 78896 77977 78354 79631 80836 81249 80948 80485 80139 79671 78847 77932 77449 77543 77872 78154 78585 79497 80725
66171 80725 81580 81512 80603 79342 78080 76860 75636 74471 73504 72882 72685 72867 73275 73818 74542 75401 76070 76170
66153 76170 75698 75051 74616 74488 74585 74813 75089 75447 76157 77483 79135 80229 80101 79060 78038 77594 77535 77490
66135 77490 77475 77691 78097 78490 78873 79395 79918 79990 79449 78882 79140 80423 82067 83339 84206 85113 86154 86797
66117 86797 86499 85385 84169 83539 83712 84449 85322 85968 86260 86279 86112 85738 85244 85076 85825 87601 89727 91241
66099 91241 91694 91379 90814 90235 89640 89090 88706 88414 88006 87502 87231 87414 87883 88388 88958 89672 90232 90202 89696
66080 89696 89474 90150 91570 93114 94346 95099 95161 94312 92729 91053 89863 89216 88813 88538 88679 89562 91046
66063 91046 92518 93404 93615 93413 93062 92815 93087 94178 95746 96950 97387 97565 98166 99128 99875 100231 100552 100993
66045 100993 101240 101121 101030 101428 102280 103261 104215 105070 105535 105335 104761 104548 105133 106195 107018 107151 106714 106229 106183
66026 106183 106597 107021 107077 106995 107387 108476 109817 110873 111568 112033 112128 111684 111111 111246 112420 114051 115424 116575
66008 116575 118053 120030 122129 124083 126037 128103 130085 131988 134442 138118 142833 147624 151703 154962
65994 154962 157602 159790 161856 164353 167437 170421 172391 173227 173593 173814 173208 170865 166930 162711 159405
65979 159405 156965 154384 150919 146806 142816 139475 136849 134780 133029 131291 129416 127587 125979 124318
65965 124318 122207 119939 118484 118411 119216 120074 120844 121824 122836 123260 122936 122388 122048 121826 121638 121771 122384 123144
65947 123144 123748 124474 125759 127551 129532 131731 134410 137476 140537 143455 146326 148951 150806 151628 151615
65932 151615 151116 150619 150963 152797 155562 157707 158384 158385 158938 160165 161448 162861 165232 168893 173243 177743
65916 177743 182536 187677 192455 196095 198845 201801 205765 210592 215562 219966 223339 225441 226253 225958 224899
65901 224899 223511 222090 220554 218607 216261 214009 212246 210712 208784 206244 203411 200551 197494 193982
65887 193982 190091 186027 181659 176515 170355 163643 157409 152581 149332 147019 144756 142143 139382 136767
65873 136767 134209 131453 128642 126355 124954 124064 122972 121505 120248 119791 120028 120354 120341 119915 119023 117590
65857 117590 115891 114571 114028 114011 114072 114171 114551 115181 115742 116113 116470 116873 117167 117438 118134 119412 120666 121146
65839 121146 120966 121082 122234 124264 126584 128938 131420 133936 136051 137425 138218 138992 140307 142434 145339
65824 145339 148891 153036 157738 162747 167626 172183 176687 181367 185759 188978 190712 191561 192163 192398 191766
65809 191766 190253 188314 186139 183446 180021 176001 171562 166760 161849 157326 153392 149699 145946 142506
65795 142506 140112 139032 138805 138755 138535 138177 137783 137271 136461 135485 135003 135770 137867 140618 143285 145630 147781
65778 147781 149973 152598 156065 160217 164145 166949 168578 169605 170396 170796 170380 168727 165701 161834 158167
65763 158167 155290 152815 150212 147724 145798 144047 141827 139759 139539 141919 145803 149741 153494 157630
65749 157630 162391 167727 173815 180744 188029 195123 202070 209019 215392 220307 223563 225507 226111 225019
65735 225019 222432 219058 215067 209886 203273 195875 188394 180826 172911 164808 156893 149326 142257 136097
65721 136097 131162 127301 124248 121976 120294 118457 115800 112596 109706 107459 105496 103715 102631 102513
65707 102513 102709 102389 101629 101267 101714 102447 102775 102730 102861 103342 103681 103462 103074 103414 104879 106901 108584 109592
65689 109592 110294 111197 112475 113997 115557 116989 118242 119433 120817 122655 125157 128505 132712 137423 142038
65674 142038 146246 150383 155202 161327 168962 177931 187757 197776 207455 216705 225776 234801 243551 251599
65660 251599 258504 263863 267519 269910 271948 274216 276348 277497 277349 276471 275768 275896 277089 279056 280900
65645 280900 281644 281141 280143 279170 277660 274627 269889 264051 257402 249483 239887 228951 217390 205725
65631 205725 194363 183815 174342 165645 157362 149731 143294 138047 133367 128768 124250 119881 115611 111716
65617 111716 108920 107618 107329 107302 107356 107661 107951 107612 106596 105663 105506 106009 106496 106372 105403 103837 102534 102544
65599 102544 104060 105938 106701 106000 104816 104320 104855 105992 107190 108287 109533 111272 113508 115882 118205
65584 118205 120836 124248 128284 132232 135710 139168 143358 148589 154615 161070 167847 175103 182998 191393
65570 191393 199860 208090 216041 223452 229417 233046 234555 235094 235287 234483 231834 227601 222829 218027 212756
65555 212756 206447 199078 191030 182698 174396 166367 158773 151806 145807 141103 137744 135541 134309 133931
65541 133931 134278 135185 136389 137368 137582 137170 137086 138084 139773 141209 142262 143689 145826 147917 149032 149002 148070
65524 148070 146159 143086 139229 135417 132235 129820 128177 127236 126623 125803 124556 123073 121584 120204 119167
65509 119167 118863 119430 120517 121570 122194 122181 121474 120385 119667 119937 120956 121759 121672 121077 121060 122394 124955 128012
65491 128012 130891 133401 135813 138458 141275 143856 146010 148098 150503 152944 154764 155912 157003 158206
65477 158206 158684 157600 155290 152852 150892 149307 147992 146943 145668 143396 140161 136996 134628 132542
65463 132542 129872 126747 124120 122480 121396 120307 119192 118247 117343 116185 114881 114044 114180 115091 116053 116598
65447 116598 116915 117354 117798 117868 117605 117534 118048 119152 120807 123003 125333 127103 128238 129628 132111 135421
65431 135421 138601 141117 143007 144174 144255 143240 141653 139961 138217 136405 134724 133264 131728 129770 127551
65416 127551 125769 125063 125412 126147 126626 126879 127391 128254 128916 128973 128836 129176 130045 131104 132482 134710 137783
65399 137783 140991 143858 146631 149560 152247 154156 155384 156454 157580 158535 159106 159274 159063 158577 158086 157727
65383 157727 157106 155585 153096 150486 148874 148691 149407 150120 150393 150560 151204 152442 153821 154927 155874 157074
65367 157074 158659 160326 161737 162963 164549 167159 171079 176010 181420 187104 193275 200101 207348 214574
65353 214574 221488 228028 234292 240505 246805 252831 257721 260771 262003 261830 260335 257254 252635 247115
65339 247115 241399 235700 229803 223456 216569 209232 201762 194655 188350 183006 178551 174819 171582 168525
65325 168525 165298 161660 157649 153700 150509 148498 147363 146376 145227 144311 143966 143731 142755 140870 138780
65310 138780 137149 135911 134715 133638 133076 133102 133356 133574 133861 134400 135193 136229 137668 139673 142191 144984
65294 144984 147748 150187 152190 154065 156357 159205 162056 164178 165299 165542 164975 163651 161963 160521 159610
65279 159610 159104 158959 159358 160215 160894 160723 159594 157831 155751 153635 151912 150875 150165 148958 146797 144033
65263 144033 141307 138866 136593 134511 132884 131820 131055 130301 129661 129451 129682 129949 129877 129460 128820 127869 126470
65246 126470 124866 123646 123197 123356 123624 123577 123037 122065 120940 120028 119537 119458 119791 120633 121901 123069 123420 122624
65228 122624 121046 119501 118720 118911 119708 120482 120756 120383 119469 118336 117531 117602 118640 120073 121069 121170 120603
65211 120603 120093 120329 121360 122409 122520 121581 120516 120269 120805 121396 121769 122484 124119 126415 128520 129881
65195 129881 130672 131371 132151 132794 133118 133301 133711 134549 135832 137653 140088 142753 144799 145706 145943 146519 147958
65178 147958 149992 152159 154304 156452 158546 160517 162370 164118 165803 167643 169836 172141 174016 175385
65164 175385 176942 179424 182886 187068 192114 198371 205592 212993 220236 227893 236711 246887 258364 271448
65150 271448 286598 303786 322507 342494 364096 387925 414318 443199 474149 506499 539523
65139 539523 572656 605481 637487 668019 696491 722493 745711 765969 783391 798238 810325
65128 810325 818739 822319 820351 812785 800031 782805 761989 738314 712198 684038 654457 623918
65116 623918 592217 558798 523662 487715 452217 418255 386743 358350 333102 310335 289448
65105 289448 270533 254087 240332 229070 219950 212451 205813 199474 193610 188839 185304 182384 179391
65092 179391 176277 173472 171281 169595 168065 166387 164536 162871 161920 161963 162784 163762 164166 163505 161930 160298
65076 160298 159541 159823 160541 161164 161781 162650 163636 164464 165238 166221 167253 167855 167917 167765 167484 166691 165216 163608
65058 163608 162567 162159 161987 161847 161812 161788 161539 161145 160956 161000 160901 160514 160160 159966 159425 158083 156390 155337 155346
65039 155346 155886 156153 155762 154814 153642 152562 151555 150152 147937 145135 142385 139991 137745 135536 133600
65024 133600 132050 130666 129433 128863 129400 130796 132431 133939 135203 136088 136598 137095 137866 138680 139188 139557
65008 139557 140135 140672 140563 139956 139953 141420 144029 146764 149006 150885 152856 155205 157787 160033 161412 162036
64992 162036 162564 163381 164178 164534 164618 164993 165896 167038 168022 168729 169347 170162 171215 172041 171977 170964 169791 169280
64974 169280 169313 169035 167845 165815 163265 160410 157584 155273 153525 151624 148754 145023 141470 139007 137629
64959 137629 136760 136078 135642 135336 134693 133471 132105 131259 131115 131397 131944 132772 133584 133741 133000 131928 131287 131291
64941 131291 131751 132647 134089 135847 137374 138373 138964 139250 139055 138282 137305 136766 137032 137938 139046 140048 140886
64924 140886 141492 141562 140929 140147 140259 141606 143143 143474 142460 141309 141120 141967 143506 145674 148303 150633
64908 150633 151982 152657 153584 155134 156988 159195 162566 167670 173887 179883 184757 188424 191218 193607 196132
64893 196132 199091 202168 204769 206783 208636 210426 211417 210810 208842 206649 204991 203520 201532 199109 197062
64878 197062 195809 194790 193161 190760 188019 185230 182372 179667 177694 176679 176059 175183 174201 173773 173979
64863 173979 174047 173292 171908 170590 169636 168719 167356 165331 162733 159819 156894 154158 151649 149368 147427
64848 147427 146043 145440 145722 146648 147519 147551 146600 145345 144604 144602 145064 145770 146690 147730 148721 149679 150748 151890
64830 151890 152883 153689 154538 155578 156646 157496 158071 158509 159088 160233 162331 165421 169155 173173 177401 181923
64814 181923 186712 191557 196161 200336 204290 208716 214361 221340 228927 236070 242061 246751 250320 252803
64800 252803 253755 252462 248743 243426 237744 232251 226653 220635 214406 208359 202669 197470 193011 189299
64786 189299 185911 182428 178919 175826 173651 172905 173951 176599 180139 183984 187978 191913 195302 198077
64772 198077 201047 205052 209970 215087 220123 225207 230155 234657 239083 244229 250090 255656 260145 263692
64758 263692 266592 268607 269498 269597 269277 268364 266624 264412 262173 259663 256389 252663 249326 246348 242487
64743 242487 236703 229374 221719 214453 207546 201024 195314 190694 186899 183544 180631 178333 176507 174811
64729 174811 173263 172301 172214 172752 173374 173621 173234 172289 171409 171434 172545 174001 175039 175706 176401 176998 177135 177120
64711 177120 177752 179199 180805 182147 183503 184923 185618 184864 183039 181118 179556 178233 177120 176184 174860
64696 174860 172476 169328 166620 165120 164450 163962 163716 164087 164930 165852 167140 169667 173606 177799 180901 182922
64680 182922 185194 188851 193828 199426 205291 211477 217942 224567 231477 238726 245733 251640 256306 260327
64666 260327 263900 266377 267285 267044 266030 263579 258817 252161 245089 238482 232084 225685 219926 215537 212435
64651 212435 210063 208192 207010 206765 207686 209960 213404 217401 221483 225802 230828 236811 243763 251647 260275
64636 260275 269320 278811 289280 300929 312858 323688 332856 340751 347593 352818 355778 356571 355822 353931
64622 353931 350792 346059 339505 331292 322079 312691 303578 294708 286058 277898 270461 263630 257187 251129
64608 251129 245456 239866 234034 227996 221950 215776 209213 202463 196188 190857 186421 182712 179701 177185
64594 177185 174626 171665 168607 166130 164648 164165 164541 165572 166918 168273 169624 171174 173084 175439 178283
64579 178283 181441 184453 186985 189146 191094 192520 193030 193031 193580 195146 197010 198162 198310 197692 196340 194150
64563 194150 191433 188765 186307 183728 180863 178041 175654 173782 172349 171344 170670 170068 169396 168841 168700
64548 168700 169039 169596 169885 169398 168046 166553 166080 167118 168897 170164 170490 170533 171107 172327 173712 174795
64532 174795 175411 175574 175314 174688 173848 173061 172611 172655 173224 174328 175980 177970 179775 180916 181415 181759 182414
64515 182414 183586 185397 187953 191045 194038 196356 198042 199719 202042 205317 209456 214156 219196 224731
64501 224731 231136 238375 245712 252344 258216 263865 269520 274743 278918 281686 282787 281959 279240 275040
64487 275040 269709 263330 256212 249185 243010 237664 232599 227599 223014 219227 216175 213366 210183 206299
64473 206299 202054 198304 195664 194001 192896 192290 192319 192789 193333 193936 194750 195561 196016 196356 197221 198733 200425
64456 200425 202124 204061 205905 206621 205822 204521 203885 203913 204071 204560 205930 207811 209181 209926 211192 213951
64440 213951 217984 222504 227110 231807 236747 242381 249469 258482 269200 281184 294368 309009 325338
64427 325338 343556 363977 386894 412432 440727 472073 506778 544998 586837 632365 681374
64416 681374 733303 787531 843497 900304 956363 1009618 1058137 1100572 1136333 1165349 1187293
64405 1187293 1200934 1204660 1197898 1181695 1157659 1126745 1089449 1046727 999991 950286 898061 843774
64393 843774 788261 732506 677548 624675 575205 529901 488954 452628 421379 395123 372883
64382 372883 353565 336703 322128 309426 298293 289104 282319 277353 272759 267648 262361 257535 253145
64369 253145 248853 244730 241028 237533 233768 229769 226116 223188 220873 219050 217898 217547 217840 218647 220121
64354 220121 222436 225557 229454 234253 239899 245913 251847 257783 264087 270807 277608 284159 290168 295098
64340 295098 298317 299656 299576 298668 297222 295409 293578 292170 291366 290989 290738 290511 290501 290941 291725 292434 292873
64323 292873 293391 294398 295585 295962 294705 291801 287890 283726 279772 276023 272112 267809 263389 259253 255248
64308 255248 250796 245805 241033 237374 235040 233592 232384 230823 228662 226332 224628 223708 222851 221571 220515
64293 220515 220674 222131 224338 227358 231897 238039 244837 251484 258134 265177 272349 279107 285397 291448
64279 291448 297130 302157 306786 311686 317054 322314 326727 330001 332306 334098 335924 337965 339632 339923
64265 339923 338387 335547 332257 328903 325349 321426 317305 313521 310750 309275 308561 307523 305452 302438
64251 302438 298788 294341 288690 281816 274121 265998 257843 250369 244355 239913 236414 233303 230656 228716
64237 228716 227280 225931 224674 223971 224150 225003 225993 226688 227018 227247 227699 228388 228886 228598 227236 225146 223291
64220 223291 222714 223677 225239 225964 225194 223401 221308 219091 216691 214437 212852 212025 211604 211306 211089 210946
64204 210946 210914 211233 212154 213647 215608 218157 221279 224369 226776 228808 231531 235484 240282 245719 252459
64189 252459 261066 270969 281110 291277 301991 313148 323613 332333 339272 344893 349132 351298 350802
64176 350802 347604 342002 334320 324985 314711 304382 294681 285907 278145 271479 265963 261542 258113 255591
64162 255591 253794 252399 251250 250594 250784 251787 253188 254556 255485 255480 254340 252654 251388 250829 250446 249921
64146 249921 249697 250144 250767 250811 250205 249305 248051 246167 244103 242950 243141 243769 243535 242080 240145 238684 238048
64129 238048 237986 238182 238704 239871 241743 243971 246216 248488 250874 253278 255767 258958 263584 269715 276819
64114 276819 284525 292905 301936 311170 320172 329015 338085 347434 356436 364079 369730 373778 377389 381402
64100 381402 385582 389244 392373 395720 399933 405143 411300 418288 425488 431833 436571 439687 441371 441553
64086 441553 440210 437674 434277 429988 424662 418387 411294 403389 394844 386091 377271 368014 358224 348746
64072 348746 340637 334013 328154 322602 317451 312677 307959 303391 299743 297591 296639 296271 296396 297325 299003
64057 299003 300847 302346 303565 305053 307414 310934 315437 320590 326445 333525 342144 351769 361433 370829
64043 370829 380719 392044 404863 418300 431403 443799 455545 466625 476704 485251 491824 496295
64031 496295 498817 499583 498642 496066 492145 487180 481115 473760 465584 457890 451828 447369 443613 439923 436261
64016 436261 432450 427809 421850 414900 407584 400073 392290 384664 378039 372850 368903 366061 364537 364228
64002 364228 364300 364018 363753 364531 366593 368936 370492 371283 372086 373302 374638 375776 376833 378060 379458 380977
63986 380977 382889 385748 389960 395483 401827 408377 414881 421708 429442 438171 447483 457289 468334 481463
63972 481463 496578 512716 529145 545996 563813 582919 603408 625454 649297 675046 702700
63961 702700 732394 764606 800091 839571 883390 931626 984752 1044173 1111855 1189463 1278067
63950 1278067 1378642 1492463 1620940 1765386 1927086 2107211 2306396 2524661 2761957
63941 2761957 3018464 3293934 3586778 3894016 4211906 4536256 4862254 5184542 5497737
63932 5497737 5796673 6075895 6328995 6548798 6728561 6863365 6950572 6989098 6978443 6918562
63922 6918562 6810506 6656799 6461079 6227663 5961607 5668893 5356181 5030382 4698413
63913 4698413 4366947 4041859 3727742 3427983 3145131 2881059 2637017 2413905 2212412
63904 2212412 2032613 1873502 1733247 1610001 1502318 1408907 1328256 1258522 1197613 1143495
63894 1143495 1094743 1050749 1011139 975028 941098 908413 876798 846387 817210 789278 762735
63883 762735 737691 714194 692527 673254 656731 642748 630838 620766 612565 606346 602341 600912
63871 600912 602210 605897 611398 618296 626329 635278 645185 656451 669269 683035 696731 709916 722962
63858 722962 736250 749559 762279 773779 783368 790389 794764 797216 798531 798684 796931 792660 785875
63845 785875 776950 766179 753553 738807 721849 703269 684135 664916 644878 623093 599897 576717
63833 576717 554394 532435 510178 488053 467102 447780 429903 413509 398971 386174 374216
63822 374216 362295 350578 339952 331072 323837 317632 311852 306227 300821 295880 291687 288408 285863
63809 285863 283487 280792 277934 275603 274217 273489 272876 272106 271097 269776 268308 267084 266029 264298 261191
63794 261191 257047 252636 248043 242993 238049 234361 232072 230031 227419 224749 222768 221258 219650 218097
63780 218097 217063 216307 215154 213561 212158 211357 210987 210710 210213 209151 207518 205997 205369 205578 205886 205845 205537
63763 205537 204967 203953 202737 201979 201893 201926 201560 200983 200662 200668 200800 201001 201346 201817 202400 203160 204009 204673 205128
63744 205128 205863 207366 209537 211944 214481 217384 220632 223769 226482 228988 231636 234299 236531 238241
63730 238241 239889 241875 244049 246016 247696 249193 250362 251032 251613 252892 255025 257298 259184 261043 263302
63715 263302 265513 266891 267433 267700 267714 266923 265280 263558 262399 261746 261421 261606 262346 263082 263094 262100 260275
63698 260275 258104 256455 256250 257619 259743 261866 264107 266908 270141 273258 276027 278547 280718 282279
63684 282279 283302 284120 284723 284676 283738 282243 280731 279480 278505 277818 277519 277736 278494 279636 280880 282024 282996
63667 282996 283664 283743 283015 281552 279608 277454 275355 273481 271670 269551 267147 265105 263942 263222 261864
63652 261864 259260 255754 252106 248877 246342 244586 243419 242429 241355 240333 239719 239771 240518 241780 243219
63637 243219 244531 245713 247093 249079 251960 255906 260909 266583 272168 277014 281141 285283 290326 296694
63623 296694 304174 312221 320392 328658 337462 347442 358972 371910 385923 401022 417492 435274 453811
63610 453811 472852 493037 515068 538453 561723 583976 605521 626716 646825 664500 678848
63599 678848 689466 695873 697767 695747 691007 684251 675504 665091 654070 643316 632682 621511 609639
63586 609639 597370 584643 570764 555088 537733 519539 501513 484416 468710 454685 442558
63575 442558 432454 424325 417923 412829 408567 404839 401789 400024 400208 402506 406446 411316 416737 422828
63561 422828 429839 437605 445452 452792 459815 467418 476427 487094 499414 513552 529566 546987 565220
63548 565220 584364 605193 628119 652537 677367 701912 725800 748300 768113 783859 794564
63537 794564 799705 799230 793781 784759 773834 762276 750735 739522 728798 718361 707447 695099
63525 695099 680833 664835 647417 628409 607291 583943 559222 534669 511560 490165 469970
63514 469970 450676 432827 417300 404325 393288 383497 374729 366930 359819 353125 347020 341923 337923
63501 337923 334626 331469 328025 324229 320627 318186 317351 317338 316823 315367 313697 312476 311443 310168 309182
63486 309182 309642 311922 315098 317975 320182 322025 323656 324866 325678 326644 328300 330486 332432 333459 333404
63471 333404 332442 330834 328946 327219 325830 324503 322885 321049 319402 318088 316783 315150 313350 311889
63457 311889 311061 310703 310531 310568 311107 312325 314162 316654 320134 324807 330299 335951 341559 347481 354028 361211
63441 361211 369149 378101 387720 396854 404771 412310 421145 432041 444467 457783 471966 487020 502559
63428 502559 518420 535007 552415 569675 585637 600369 615018 630453 646761 664068 682971
63417 682971 703775 725935 748777 772318 796729 821278 844461 865125 882736 896538 905267 908184
63405 908184 905831 899282 889166 876079 861478 847167 833772 820454 806204 790678 773669 754645
63393 754645 733359 710303 686066 660796 634798 609097 584694 561718 540023 520220 503278
63382 503278 489338 477857 468772 462549 459055 457380 457041 458438 461799 466548 472320 479795 489708 501465
63368 501465 513585 525345 537322 550350 564492 579154 593793 608374 623381 639466 656998
63357 656998 675942 696178 717742 740625 764446 788472 811835 833593 852736 868336 879623
63346 879623 885960 886986 882884 874342 862200 847391 831227 815253 800444 786746 773482 759869
63334 759869 745063 728327 709668 689960 669895 649154 627167 604511 582848 563449 546382
63323 546382 531243 518073 507203 498589 491721 486057 481236 476888 472451 467253 460786 452928 443939
63310 443939 434305 424679 415872 408614 403112 398949 395507 392433 389650 387215 385392 384629 385144 386608 388447
63295 388447 390310 391912 392554 391290 387728 382420 376296 369854 362994 355571 347917 340796 334793 329843
63281 329843 325491 321593 318457 316267 314696 313387 312498 312364 312822 313267 313358 313287 313331 313568 314091 315151 316798
63264 316798 318583 319897 320685 321723 324034 327967 332872 337768 342240 346470 350606 354631 358917 364229
63250 364229 370813 378014 385342 393383 402953 413705 424501 435107 446624 460040 475126 491082
63238 491082 507684 525401 544853 566547 590718 616992 644390 672024 699697 727720 756403
63227 756403 785900 816242 847281 878787 910691 942981 975276 1006855 1037357 1067131 1096692
63216 1096692 1126067 1154825 1182381 1208053 1231117 1251031 1267276 1278943 1284989 1285153 1280037 1269924
63204 1269924 1254223 1232678 1206499 1177446 1146206 1112716 1077853 1043707 1012015 983262 957605
63193 957605 935704 918062 904252 893447 885352 880058 877407 877177 879676 885536 894876 907113 921574
63180 921574 937828 955475 974080 993507 1013970 1035550 1057818 1080043 1101599 1122131 1141568
63169 1141568 1160120 1178004 1194919 1209849 1221486 1228791 1231096 1227985 1219374 1205658 1187418 1164897
63157 1164897 1137973 1106729 1071831 1034301 995122 955223 915595 877145 840485 806086 774515
63146 774515 746280 721458 699727 680737 664182 649535 636139 623788 612980 604369 598152 594114
63134 594114 591951 591182 590959 590495 589829 589861 591509 594958 599772 605471 611856 618926 626683 635011 643639 652181
63118 652181 660153 666953 671934 674697 675342 674339 672097 668719 664139 658431 651988 645498 639636 634638
63104 634638 630272 626346 623074 620655 618634 616248 613490 611353 610636 610801 610410 608612 605878 603422 602206
63089 602206 602449 603726 605431 607341 609779 613140 617337 621891 626516 631355 636679 642537 648726 654904
63075 654904 660831 666766 673518 681741 691212 701236 711787 723669 737360 752287 767715 783946
63063 783946 802057 822643 845458 870202 897113 926672 959211 994974 1034173 1076762 1122422
63052 1122422 1170941 1222412 1276915 1334299 1394412 1457286 1522832 1590553 1659786 1730144 1801486
63041 1801486 1873529 1945673 2017144 2087259 2155684 2222557 2288216 2352608 2415034 2474579 2530597
63030 2530597 2582453 2628881 2667874 2697339 2715665 2721655 2714247 2692670 2656944 2608072 2547609 2477159
63018 2477159 2398471 2313948 2226639 2139357 2053936 1971647 1894181 1823677 1761669 1708481 1663921
63007 1663921 1628183 1601703 1584401 1575520 1574093 1579297 1590567 1607765 1631079 1660266 1694063 1730824
62995 1730824 1769737 1810924 1854248 1898573 1942434 1985065 2026411 2066466 2104930 2141317 2174955
62984 2174955 2204906 2230157 2249859 2263111 2268567 2264600 2250107 2225062 2190172 2146101 2093209 2032058
62972 2032058 1963887 1890361 1812995 1733142 1652578 1573558 1497887 1426133 1358176 1294306 1235308
62961 1235308 1181472 1132162 1086543 1044284 1005252 969012 935048 903230 873634 846084 820288
62950 820288 796260 774142 753631 734041 715015 696830 679874 664138 649383 635584 622961
62939 622961 611723 601921 593478 586206 579858 574242 569252 564798 560820 557417 554754 552716 550773 548395
62925 548395 545513 542498 539791 537772 536818 537103 538121 538744 538014 535897 533105 530209 527113 523333 518594
62910 518594 513079 507269 501678 496663 492314 488452 484764 481052 477421 474255 471866 470065 468245 466067
62896 466067 463960 462640 462168 461783 460748 459059 457240 455758 454816 454428 454404 454448 454509 454841 455568 456452 457300 458215
62878 458215 459127 459479 458903 457913 457294 456999 456351 455216 454190 453546 452805 451617 450342 449404 448718 448203 448183 448676
62860 448676 448810 447722 445840 444602 444929 446442 448093 449143 449566 449933 450908 452608 454455 455837 456687 457224
62844 457224 457507 457645 458051 458899 459595 459433 458567 457672 456794 455393 453570 452324 452267 452823 453170 453338 453866 454852
62826 454852 455971 457153 458681 460689 462983 465262 467279 469010 470937 473930 478436 483960 489650 495184
62812 495184 500681 506024 510891 515420 520262 525771 531617 537452 543539 550471 558498 567463 577232 587870
62798 587870 599452 611993 625605 640543 657015 675080 694906 717086 742582 772271 806590
62787 806590 845648 889549 938434 992250 1050814 1114276 1183293 1258438 1339517 1425703 1516288
62776 1516288 1610985 1709426 1810672 1913360 2016092 2117374 2215227 2307082 2390103 2461544
62766 2461544 2518901 2560120 2583922 2589990 2578659 2550357 2505403 2444473 2369228 2282380 2187092
62755 2187092 2086291 1982415 1877420 1772774 1669645 1569355 1473563 1383668 1300065 1222322
62745 1222322 1150104 1083561 1022740 967200 916568 871095 831152 796358 765675 738284 713853
62734 713853 692031 672269 654359 638611 625182 613637 603523 595103 589042 585490 583825 583244 583340
62721 583340 584150 585942 589000 593414 599032 605757 613854 623840 636142 650974 668437 688591 711598
62708 711598 737968 768426 803275 842090 884379 930371 980670 1035360 1094063 1156877 1224569
62697 1224569 1297542 1375105 1456037 1539411 1624484 1710181 1795147 1877981 1956965 2029680 2093418
62686 2093418 2146013 2186095 2212698 2224995 2222341 2204327 2170918 2122859 2061864 1990112 1909641
62675 1909641 1822518 1731319 1638784 1546843 1456429 1368388 1284106 1204929 1131312 1062953 999639
62664 999639 941552 888830 841242 798434 760220 726367 696235 668947 643998 621494 601646
62653 601646 584199 568540 554217 541094 529053 517867 507423 497769 488865 480609 473228 467308
62641 467308 463162 460420 458375 456445 454126 450999 447256 443896 441804 440755 439797 438431 436857 435186
62627 435186 433157 430789 428726 427606 427544 428428 430244 432733 435172 437080 438992 442081 446971 453170 459693
62612 459693 466032 472504 479850 488571 498586 509400 520599 532275 545154 560351 578752 600364
62600 600364 624330 649774 676610 705515 737329 772717 811988 854752 899896 946453 994424
62589 994424 1044208 1095238 1145781 1194108 1239075 1279387 1313102 1338500 1354969 1362538 1361020 1350144
62577 1350144 1330196 1301939 1266191 1224055 1177342 1128146 1077978 1027691 978025 929729 883318
62566 883318 839242 798202 760807 726984 696272 668644 644487 623716 605467 588787 573263
62555 573263 558979 546404 536365 529432 524998 521438 517520 513335 509622 506668 504225 502112 500429
62542 500429 499332 498953 499369 500364 501450 502432 503781 506045 509035 511965 514402 516728 519604 523284 527612
62527 527612 532554 538618 546682 557391 570744 586443 604597 625794 650350 677786 707352 738869
62515 738869 772821 809778 850028 893531 939794 987775 1036300 1084699 1132796 1180223 1225951
62504 1225951 1268518 1306481 1338669 1364347 1383258 1395356 1400494 1398616 1390248 1376490 1358497 1337351
62492 1337351 1314585 1292321 1272486 1256057 1243420 1235276 1232748 1236620 1246777 1262426 1282586 1306293
62480 1306293 1332630 1360791 1390061 1419608 1448209 1474128 1495326 1510033 1517327 1517119 1509472 1494088
62468 1494088 1470627 1439323 1400953 1356299 1306086 1251511 1194417 1136673 1079509 1023657 969866
62457 969866 919032 871927 829045 790743 757329 728934 705366 686151 670760 658864 650326 644912
62445 644912 642056 641032 641342 642797 645314 648850 653521 659450 666335 673397 679942 685814 691202 696190
62431 696190 700653 704277 706422 706138 702759 696526 688419 679358 669671 659282 648204 636833 625799
62418 625799 615487 605673 595838 585899 576368 567615 559291 550892 542648 535368 529438 524385 519517 514597
62404 514597 509823 505540 502145 499993 499096 499013 499153 499137 498950 498896 499450 500864 502873 504947 506880 509000 511812
62387 511812 515491 519626 523273 525506 526378 527268 529817 534434 540200 546189 552366 559119 566548 574496 582741
62372 582741 590788 597972 604277 610786 618806 628719 640081 652622 666694 682819 701252 722029 745128
62359 745128 770583 798636 829666 863723 900306 938885 979445 1022069 1066007 1109601 1151168
62348 1151168 1189620 1224168 1253795 1277296 1293774 1303066 1305806 1303038 1295587 1283794 1267934 1248703
62336 1248703 1227043 1203642 1178981 1153806 1129125 1105607 1083311 1062110 1042095 1023433 1006084
62325 1006084 989942 975031 961315 948317 935113 920790 904936 887708 869424 850059 829276
62314 829276 807059 784202 761930 741040 721535 703070 685470 668831 653380 639435 627338
62303 627338 617262 609064 602397 596924 592488 589141 586995 585942 585598 585694 586418 588185 591093 594790 598823
62288 598823 602833 606479 609607 612659 616521 621604 627281 632570 637256 641986 647320 653158 659270 665956
62274 665956 673752 682686 692311 702491 713632 725873 738471 750480 761849 773360 785642 798919
62262 798919 813740 831233 852131 876012 901976 929817 960095 993399 1030005 1069951 1112762
62251 1112762 1157156 1201603 1245185 1287346 1326801 1361412 1389415 1410257 1423990 1430464 1429613 1422076
62239 1422076 1408854 1390404 1366571 1337366 1303384 1265389 1223935 1179682 1133903 1088390 1044797
62228 1044797 1004107 966637 932428 901575 874341 850978 831402 814972 800776 788306 777781
62217 777781 769528 763087 757352 751707 746535 742348 738895 735686 733081 732110 733256 735964 739424 743248
62203 743248 747246 751164 755010 759210 764050 769271 774571 780218 786727 793990 801120 807185 811944 815843
62189 815843 819480 823103 826525 829501 832130 834822 837888 841303 844851 848338 851673 854879 858058 861183
62175 861183 864004 866402 868801 871983 876451 882242 889335 897918 908239 920579 935466 953543 975019
62162 975019 999463 1026109 1054023 1081928 1108385 1132419 1153644 1171577 1185257 1193797 1196955 1194938
62150 1194938 1188059 1176937 1162569 1145664 1126115 1103521 1078086 1050652 1022157 993493 965699
62139 965699 939699 915787 893763 873563 855499 839877 826660 815482 805784 796975 788715 780976
62127 780976 773705 766558 759138 751308 743090 734545 726056 718450 712442 708028 704671 701853 699203 696442
62113 696442 693670 691392 689744 687853 684528 679484 673346 666631 659399 651905 644858 638771 633514 628635
62099 628635 623745 618569 613165 608157 604227 601247 598530 596067 594839 595517 597509 599796 602249 605509
62085 605509 609876 614979 620372 625946 631777 638104 645468 654411 664820 675924 687188 699069 712571
62072 712571 728087 744841 761590 777821 794020 810845 828321 846066 863996 882359 901211
62061 901211 920335 939701 959493 979472 998640 1015727 1029750 1039991 1045849 1047063 1043886 1036776
62049 1036776 1026069 1012020 994898 974864 952034 926793 899700 870879 839925 806836 772727
62038 772727 739162 706959 676093 646574 618869 593479 570581 550191 532296 516661 502812
62027 502812 490310 478858 468135 457825 447953 438944 431204 424751 419313 414601 410369 406351 402303
62014 402303 398143 394081 390631 388329 387234 386783 386356 385988 386213 387250 388624 389806 390926 392583 395094
61999 395094 398235 401705 405509 409765 414335 418885 423229 427386 431222 434259 436021 436430 435647 433648 430251
61984 430251 425621 420391 415101 409749 404129 398375 392842 387580 382365 377285 372934 369765 367481 365271
61970 365271 362641 359815 357304 355231 353226 351027 349017 347961 348139 348896 349205 348635 347684 347200 347610 348660
61954 348660 349774 350668 351644 353280 355761 358635 361320 363746 366361 369587 373459 377791 382534 387913 394225
61939 394225 401473 409170 416650 423703 430780 438395 446470 454462 462051 469362 476511 483205 488939 493456
61925 493456 496963 499923 502639 504936 506335 506626 506178 505511 504705 503529 502066 500846 500376 500877 502526 505518
61909 505518 509776 514899 520659 527254 534926 543561 552810 562253 571243 578990 585247 590749 596551 602999
61895 602999 609584 615650 620899 625371 629378 633502 638236 643511 648779 653620 657981 661804 664698 666100
61881 666100 665481 662330 656274 647543 637129 626144 615015 603494 591476 579591 568796 559519 551383
61868 551383 543836 536845 530750 525622 521140 517184 514159 512481 512059 512637 514408 517803 522734 528523 534675
61853 534675 541366 549122 558359 569296 581839 595305 608627 621135 632924 644217 654686 663808
61841 663808 671654 678869 685750 691685 695652 697184 696713 695040 692526 688964 684300 679343 675455 673546
61827 673546 673564 674955 677270 680235 683689 687732 692717 698746 705347 711741 717182 720925 722317 721312 718616
61812 718616 714904 710231 704609 698833 694091 690830 688573 686698 684742 681995 677539 670950 662481 652409
61798 652409 640780 627993 615079 603003 592038 582060 573064 565071 557898 551385 545599 540549 535946
61785 535946 531530 527385 523734 520684 518387 517087 516728 516870 517301 518385 520480 523473 527306 532419 538973
61770 538973 545958 552012 557143 562889 570622 580341 591275 602997 615534 628932 643206 658398 674218
61757 674218 689796 704232 717358 729596 741011 750709 757246 759493 757149 750599 740466 727328
61745 727328 711773 694536 676422 658083 639931 622326 605735 590628 577226 565383 554782
61734 554782 545239 536713 528950 521337 513441 505690 499153 494429 490955 487627 483891 480042 476677 474133
61720 474133 472329 470864 469338 467764 466604 466219 466456 466937 467497 468097 468553 468751 468891 469041 468641 467016 464308
61703 464308 461374 458664 455788 452349 448710 445616 443391 441729 440018 437600 434022 429272 423753 417920
61689 417920 412081 406515 401499 397169 393523 390551 388139 385965 383882 382273 381494 380964 379542 376966 374265
61674 374265 372373 370954 369124 366844 364941 364020 363966 364390 365035 365841 367005 368930 371740 374989 378236 381772
61658 381772 386350 392267 399112 406282 413268 419525 424680 428980 433009 436720 439198 439702 438624 437066
61644 437066 435726 434540 433285 432109 431379 431303 431894 433226 435527 438923 443205 447940 452787 457546 461930
61629 461930 465575 468360 470505 471998 472035 469408 463566 455250 446028 437273 429512 422522 415898 409538 403679
61614 403679 398557 394177 390390 387054 384047 381183 378226 374941 371173 367077 363257 360354 358355 356563
61600 356563 354439 352195 350335 348900 347526 346047 344604 343215 341633 339664 337362 334936 332700 331045
61586 331045 330048 329165 327674 325560 323611 322565 322426 322719 323093 323472 323919 324585 325653 327108 328654 329946
61570 329946 330796 331110 330848 330217 329744 329967 331091 332990 335433 338204 341148 344261 347636 351199 354637 357671
61554 357671 360292 362574 364403 365613 366341 366983 367738 368351 368435 367963 367316 366896 366857 367258 368265 369980 372063
61537 372063 373788 374588 374420 373603 372514 371618 371511 372529 374303 376017 377158 377814 378196 378163 377417 376016 374503
61520 374503 373577 373612 374410 375333 375856 376055 376499 377591 379183 380943 382974 385827 389878 394815 399827 404281
61504 404281 408168 411845 415474 418877 421961 425044 428539 432451 436446 440319 444170 448161 452362 456792
61490 456792 461269 465181 467816 469080 469651 470223 470875 471359 471717 472286 473299 474781 476700 478882 480875 482285
61474 482285 483268 484331 485617 486662 486900 486105 484287 481554 478342 475390 473116 471129 468706 465669 462412
61459 462412 459153 455650 451846 448363 445985 444815 444314 444076 444260 445229 447136 449957 453583 457645 461473
61444 461473 464586 467223 470077 473471 476970 479927 482186 484074 485824 487274 488210 488734 489133 489495 489689
61429 489689 489738 489944 490533 491332 491957 492214 492229 492347 493061 494880 497946 501810 505814 509647 513256 516372 518586
61412 518586 519955 521070 522265 523121 523012 521896 520276 518623 517135 515833 514490 512597 509814 506509 503541
61397 503541 501421 499848 498077 495618 492621 489762 487736 486768 486616 487028 487925 489048 489785 489722 489222 489130 489988
61380 489988 491805 494365 497387 500516 503612 506961 510788 514711 518173 521327 524775 528323 530742 531084
61366 531084 529635 527119 523641 519126 514388 510793 508763 507344 505479 503167 501039 499344 497918 496948
61352 496948 497051 498459 500537 502385 503661 504601 505495 506487 507732 509304 510931 512199 513071 513907 514890 515813
61336 515813 516547 517311 518314 519541 521065 523110 525485 527460 528616 529343 530062 530468 530242 530060 531025 533340
61320 533340 536364 539790 543810 548159 552102 555598 559556 564583 570331 576471 583470 591863 601533 612304
61306 612304 624504 638189 652355 665690 677764 688780 698605 706804 713315 718262 721257 721665 719486
61293 719486 715245 709043 700536 689945 678320 666468 654206 641048 627236 613707 601287 590219
61281 590219 580338 571442 563481 556524 550571 545474 541122 537580 534883 532809 531083 529775 529236 529588 530466
61266 530466 531323 531943 532617 533828 535716 537923 540165 542891 546972 552589 558814 564517 569339 573467 576911
61251 576911 579578 581785 584108 586737 589439 592090 594804 597561 600185 602703 605360 608224 611135 613967
61237 613967 616547 618333 618706 617737 616353 615636 616220 618326 621873 626395 631232 636061 641074 646607 652852
61222 652852 659934 667855 676223 684399 692090 699493 706683 713157 718250 721887 724707 727492 730504 733305
61208 733305 735291 736495 737743 739821 742661 745690 748727 752044 755717 759614 764048 769710 776671 784111
61194 784111 791420 798980 807345 816090 824004 830152 834252 836292 836337 834616 831306 826243 819258 810705 801244
61179 801244 791108 779985 767744 754908 742299 730419 719348 709051 699585 691009 683158 675587
61167 675587 667880 660020 652358 645198 638586 632471 626754 621107 615199 609382 604754 602082 600910 600266
61153 600266 600023 600951 603465 607047 611133 615908 621792 628574 635595 642476 649125 655177 660051 663744 667120
61138 667120 671217 676530 683130 691135 700708 711781 724175 738053 753915 772061 792207 813766
61126 813766 836368 860046 885022 911427 939155 967998 997946 1029255 1062016 1095679 1129267
61115 1129267 1162125 1194128 1225048 1254141 1280679 1304539 1325824 1344077 1358405 1368358 1374233 1376497
61103 1376497 1375352 1370903 1363270 1352319 1337654 1319168 1297293 1272550 1245123 1215159 1183256 1150351
61091 1150351 1117278 1084568 1052482 1020959 989739 958880 929087 901216 875485 851446 828730
61080 828730 807524 788162 770485 753893 738113 723711 711580 701807 693268 684560 675295 666301
61068 666301 658592 652474 647570 643326 639264 635093 630877 626965 623616 620860 618902 618270 619272 621450
61054 621450 623979 626519 629391 632970 637291 642303 648225 655437 664091 673947 684570 695702 707468
61041 707468 720160 733801 748105 762901 778425 794970 812396 830143 847683 864799 881592
61030 881592 898456 916005 934816 955215 977349 1001328 1027110 1054453 1083193 1113509 1145732
61019 1145732 1180126 1217232 1258298 1305044 1359121 1422270 1496963 1586384 1693594 1821156 1971683
61008 1971683 2148207 2353740 2591156 2864257 3178810 3542021 3961233 4443746 4997444
60999 4997444 5629943 6345892 7145073 8023306 8974265 9988853 11051311 12133538 13189047
60990 13189047 14149449 14930719 15455936 15688847 15657217 15445747 15159935 14884310 14658108
60981 14658108 14471695 14273080 13979415 13499737 12770845 11790420 10623730 9376698 8153885
60972 8153885 7028643 6037482 5189980 4479936 3892232 3407921 3009127 2681520 2413324
60963 2413324 2193536 2012033 1860697 1733409 1625040 1531140 1448532 1375422 1310620 1252943
60953 1252943 1201439 1155695 1115509 1080323 1049141 1021024 995507 972493 951714 932293 912959
60942 912959 892742 871450 849537 827702 806633 786825 768334 750742 733493 716264 699081
60931 699081 682383 667000 653632 642007 630919 619535 608421 598816 591036 584092 576852 569015
60919 569015 560895 552839 545197 538444 532879 528243 523885 519355 514856 511148 508888 507876 507020 505295
60905 505295 502679 499914 497496 495323 493254 491382 489610 487526 485029 482628 480653 478587 475673 471999
60891 471999 468437 465554 463057 460397 457567 455169 453838 453653 453953 453845 453099 452438 452636 453413 453621 452594
60875 452594 450945 449817 449679 450102 450463 450481 450103 449282 448139 447212 447316 448933 451687 454540 456689 458293
60859 458293 460188 462791 465486 467202 467522 467020 466559 466463 466356 465664 464143 462039 459873 458051 456642 455432
60843 455432 454107 452309 449641 445856 441112 435821 430148 423782 416399 408278 400326 393473 388095 383874
60829 383874 380082 376119 371997 368300 365540 363619 362045 360543 359166 357952 356825 355880 355382 355387 355645 356010
60813 356010 356598 357438 358326 359236 360469 362022 363222 363491 363268 363595 364862 366451 367594 368050 367915 367374 366898
60796 366898 367159 368290 369537 370013 369617 368877 368085 367004 365353 363106 360279 356866 353266 350429 349122
60781 349122 349060 349118 348489 347362 346319 345389 344069 342173 340160 338493 337094 335673 334274 333101 332048 330905
60765 330905 329942 329812 330784 332473 334429 336595 338945 341093 342625 343615 344451 345264 345888 346299 346743 347369 348071
60748 348071 348857 350110 352271 355354 358899 362324 365174 367164 368255 368743 369076 369452 369707 369634 369239 368528
60732 368528 367249 365187 362717 360744 360017 360619 362139 363962 365337 365628 364903 364056 363928 364406 364734 364573
60716 364573 364306 364226 363948 362880 361000 358919 357290 356322 355744 355028 353722 351713 349270 346818 344696 343030
60700 343030 341667 340235 338403 336164 333885 332109 331365 331926 333474 335081 335848 335656 335119 334841 334987 335460
60684 335460 336076 336463 336286 335864 336300 338582 342654 347584 352491 357037 361209 365029 368614 372248 376155
60669 376155 380149 383575 385715 386305 385682 384387 382729 380808 378782 376866 375186 373921 373436 373859 374556
60654 374556 374603 373924 373471 374001 375185 376347 377598 379642 382649 385910 388555 390121 390453 389600 387981 386284
60638 386284 384962 383949 382906 381513 379528 376880 373917 371397 370046 370026 370844 371735 372299 372843 373992 375904
60622 375904 378087 380050 381795 383388 384456 384629 384261 384141 384534 385056 385453 385902 386504 387091 387686 388510 389296
60605 389296 389307 388403 387483 387326 387566 387441 387073 387189 387896 388654 389372 390559 392228 393557 394092 394562 395909 397884
60587 397884 399246 399179 398071 396984 396724 397349 398269 398804 398829 398839 399275 400020 400776 401668 403099 405186 407774 410927
60569 410927 414907 419608 424493 429258 434166 439477 444892 449892 454388 458635 462630 465970 468344 469867
60555 469867 470824 471252 470883 469439 467017 464280 462292 461956 463477 466321 469740 473375 477441 482383 488372
60540 488372 495136 502329 509993 518507 528045 538277 548704 559136 569667 580353 591083 601714
60528 601714 612097 621954 630902 638574 644630 648644 650138 648755 644413 637418 628562 618952 609465 600329
60514 600329 591382 582718 574891 568489 563697 560328 558105 556874 556687 557813 560636 565504 572600 581828
60500 581828 592773 604917 618140 632886 649636 668275 688106 708377 728541 748145 766828
60489 766828 784442 800861 815665 828307 838712 847449 855266 862714 870160 877697 884890 891012 895726
60476 895726 899148 900937 899743 893990 883041 867221 846908 822131 793146 761022 727490 694319
60464 694319 662852 633902 607873 584901 564809 547064 530974 516101 502381 489878 478646
60453 478646 468899 460988 454880 449868 445093 440294 435877 432310 429685 427753 426144 424585 423035 421625
60439 421625 420355 419040 417655 416523 415865 415368 414558 413535 412945 413183 413968 414845 415776 416985 418380 419441
60423 419441 419758 419565 419587 420344 421651 422912 423823 424594 425532 426725 428248 430377 433296 436697 439942 442562
60407 442562 444453 445726 446584 447314 448160 449189 450341 451491 452451 453134 453909 455510 458327 461968 465759 469462
60391 469462 473168 476759 479902 482498 484695 486529 487943 489121 490298 491320 491812 491895 492262 493399 495044
60376 495044 496526 497357 497476 497299 497535 498558 499839 500493 500452 500599 501464 502412 502543 502016 501888 502866 504663 506547
60358 506547 508100 509441 510996 513098 515661 518282 520707 523055 525526 528164 531019 534160 537196 539151
60344 539151 539330 538212 537033 536461 536041 534915 532686 529525 525824 521984 518361 515195 512620 510691 509272
60329 509272 508037 506766 505603 504692 503658 501886 499380 496994 495595 495254 495424 495579 495521 495374 495630 496928
60313 496928 499435 502591 505839 509422 513993 519518 525130 530195 534921 539609 543781 546621 548095 549121
60299 549121 550616 552711 554864 556364 556691 555747 553897 551547 548596 544592 539536 534228 529574 525769 522338
60284 522338 518826 515195 511772 509012 507185 505995 504613 502350 499261 495928 492795 489956 487426 485213
60270 485213 483173 481161 479375 478189 477566 476876 475464 473173 470327 467487 465352 464563 465274 466980 468965
60255 468965 470829 472544 474188 475862 477806 480323 483461 486811 489675 491515 492291 492423 492439 492698 493335 494232
60239 494232 494917 494779 493669 492137 490778 489495 487799 485818 484493 484663 486403 489387 493466 498530 504174
60224 504174 509993 516069 522796 530282 538286 546682 555579 564906 574248 583309 592416 602256 613128 624553
60210 624553 635651 645823 655053 663668 671962 680046 687893 695395 702427 708966 715064 720670 725597 729782
60196 729782 733395 736459 738506 738865 737268 733968 729417 724185 719067 714775 711355 708157 704450 699839
60182 699839 694208 687776 681324 675836 671586 667948 664310 660783 657775 655343 653362 651889 650836 649558
60168 649558 647346 644220 640737 637112 633015 628223 623044 617996 613438 609581 606538 604242 602460 600907
60154 600907 599248 597223 595117 593916 594472 596441 598490 599719 600521 601842 603978 606391 608532 610451 612568
60139 612568 615045 617551 619705 621671 624134 627575 631743 635988 639953 643667 647156 650370 653481 656855
60125 656855 660592 664391 668007 671641 675690 680282 685170 690037 694939 700487 707441 715848 724725 732926
60111 732926 740293 747573 755183 762585 769008 774310 778845 782863 786462 789800 792871 795212 796256 795997
60097 795997 794988 793710 792161 790077 787242 783562 779018 773612 767244 759725 751037 741522 731643 721608
60083 721608 711466 701429 691812 682624 673557 664504 655862 648178 641665 636134 631236 626654 622283 618379
60069 618379 615338 613136 611152 608758 605967 603228 600699 598082 595234 592521 590361 588654 586983 585276
60055 585276 583948 583374 583456 583768 583962 583919 583740 583745 584314 585484 586797 587840 588914 590794 593736 597056 599972
60038 599972 602530 605292 608275 610763 612203 612754 612721 611976 610302 607955 605376 602591 599406 595983 592601
60023 592601 588972 584439 578913 572958 566781 559955 552482 545366 539538 534748 530247 526047 522644 519743
60009 519743 516292 511843 507108 502963 499602 496879 494748 492980 491014 488568 486073 484177 483156 483035
59995 483035 483837 485333 486989 488607 490701 493764 497463 501115 504746 509086 514483 520376 525904 530622
59981 530622 534475 537482 539721 541418 542747 543509 543174 541332 538110 534075 529713 525156 520591 516626 513833
59966 513833 511925 509913 507295 504674 502981 502444 502667 503316 504317 505632 507295 509493 512228 515029 517411
59951 517411 519534 521982 524970 528071 530754 532885 534747 536804 539353 542166 544615 546345 547695 549212
59937 549212 550947 552588 554047 555580 557487 560069 563648 568182 573047 577650 582089 586718 591258 594967
59923 594967 597643 599802 601840 603606 604982 606325 608144 610732 614267 618868 624438 630725 637514 644429
59909 644429 650628 655276 658308 660216 661140 660747 658955 656021 651918 646520 640558 635349 631102 626458 620514
59894 620514 614484 610458 609030 609106 609687 610771 612557 614746 616971 619326 622152 625621 629690 634226 639090
59879 639090 644221 649606 655005 659894 663949 667474 671016 674663 677974 680464 681896 682229 681603 680285 678395
59864 678395 675821 672638 669388 666573 664107 661671 659446 658006 657587 657911 658720 660029 661862 664146 666907
59849 666907 670137 673496 676615 679745 683638 688559 693888 698865 703363 707652 711747 715356 718242 720368
59835 720368 721811 722817 723813 725050 726297 727045 727024 726305 724962 722860 719842 716006 711684 707252 702993
59820 702993 699043 695375 691950 689062 687442 687731 689711 692323 694636 696598 698587 700495 701760 702159 701985
59805 701985 701383 700148 698392 696864 696176 696138 696213 696212 696053 695314 693691 691690 690149 689158 688027 686286 684063
59788 684063 681520 678601 675506 672714 670223 667289 663357 658859 654754 651505 648854 646304 643530 640525
59774 640525 637685 635630 634632 634351 634311 634525 635399 637197 639895 643400 647554 651948 656168 660426 665670 672770
59758 672770 681653 691432 701305 711162 721293 731769 742288 752447 761932 770471 777904 784396 790321
59745 790321 795685 799823 801890 801701 800024 798121 797030 797092 797926 798840 799411 799662 799723 799557 799123 798596 798209
59728 798209 798021 797987 798134 798476 798966 799639 800574 801561 802157 802384 802965 804429 806369 808142 809977 812619 816085
59711 816085 819690 823433 828475 835848 845311 855858 866889 878558 891407 906012 922589 940585
59699 940585 958938 976971 994708 1012140 1028724 1043917 1057764 1070560 1082383 1093358 1103832
59688 1103832 1113742 1122140 1128000 1131267 1132593 1132309 1130275 1126537 1121470 1115295 1108024 1099878 1091238 1082185
59674 1082185 1072626 1062828 1053333 1044324 1035651 1027545 1020740 1015694 1012224 1010121 1009653 1011173 1014599 1019632
59660 1019632 1026200 1034409 1044208 1055286 1067125 1079037 1090414 1101080 1111203 1120721 1129023 1135216
59648 1135216 1138502 1138346 1134648 1127825 1118305 1105809 1089575 1069502 1046668 1022540 998079 973926
59636 973926 950844 929399 909414 890314 871892 854472 838553 824691 813317 804056 795352 785396
59624 785396 773482 760029 745490 729973 713947 698487 684394 671588 659694 648777 639124 630719
59612 630719 623409 617334 612697 609249 606411 603883 601796 600295 599274 598534 597989 597709 597911 598875 600645
59597 600645 602782 604599 605699 606251 606709 607347 608057 608548 608718 608756 608776 608457 607347 605560 603800 602527 601403
59580 601403 599797 597510 594697 591401 587682 583980 580781 577909 574734 571200 568132 566301 565608 565463 565555
59565 565555 565886 566315 566587 566739 567071 567652 568128 568179 567948 567836 567914 567758 567011 566047 565888 567356 570478 574823
59547 574823 580177 586569 593759 601215 608763 616914 626306 637000 648527 660480 672872 685983 700027
59534 700027 714926 730213 744964 757700 766478 769646 767097 760752 753335 746474 740196 734049 728092
59521 728092 722609 717550 712707 708046 703440 698358 692287 685253 677635 669710 661676 653807 646167 638480
59507 638480 630693 623408 617251 612124 607611 603852 601302 599821 598843 598430 599347 601913 605531 609630 614360
59492 614360 619965 626103 632319 638724 645641 652862 659800 666262 672685 679623 687214 695002 702089 707657
59478 707657 711580 714389 716575 718269 719736 721586 723936 725754 725774 724042 722004 720933 720702 720231 718822
59463 718822 716853 715325 714892 715299 715836 716404 717856 721047 725759 731022 736359 742077 748190 753751 757756
59448 757756 760390 762790 765624 768357 769934 769739 767738 764159 759458 754429 749921 746267 743209 740401
59434 740401 737764 735376 733369 732192 732633 735139 739149 743513 747664 752097 757665 764748 773323 783495
59420 783495 795567 809599 825157 841563 858309 875272 892616 910474 928666 946775 964475
59409 964475 981637 997949 1012493 1023705 1029797 1029480 1022883 1012030 1000057 989417 980758 973638 968029
59396 968029 964609 963584 963668 962425 957376 946857 930450 909265 885711 862551 841808 824434 810675
59383 810675 800319 792653 786719 782048 779043 778377 780078 783436 787755 792864 798830 805454 812245 818783
59369 818783 824971 831095 837746 845485 854340 863645 872596 880907 888883 897019 905691 915027 924723 934126
59355 934126 942835 951205 959940 969222 978663 988071 997791 1008117 1018808 1029503 1040236 1051150 1061856
59342 1061856 1071518 1079580 1086192 1091889 1096940 1100953 1103042 1102413 1098890 1092897 1085036 1075844 1065773 1054981
59328 1054981 1043064 1029401 1014002 997717 981406 965227 948947 932563 916207 899734 882935
59317 882935 866101 849981 835156 821690 809283 797439 785632 773705 762170 751811 742981 735489
59305 735489 729100 723862 719945 717497 716646 717429 719659 723107 727713 733311 739175 744161 747318 748188 746643
59290 746643 742882 737636 731970 726747 722509 719823 719258 720903 724372 729460 736408 745325 755816 767449
59276 767449 780148 793801 807939 822361 837643 854381 872124 889774 906933 924063 941180
59265 941180 957176 970891 982260 991880 999831 1005531 1008552 1008967 1006961 1002650 996392 988758 980000 969893
59251 969893 958325 945752 932865 920070 907538 895465 883981 872951 862195 851827 842144 833332
59239 833332 825523 818917 813471 808568 803427 797840 792140 786504 780769 774999 769647 764962 760681 756599
59225 756599 752949 749878 746948 743661 740250 737438 735569 734379 733572 733166 733300 734069 735556 737724 740230
59210 740230 742604 744637 746354 747707 748579 749033 749207 749025 748375 747588 747281 747638 748253 748804 749459 750321 750909
59193 750909 750704 750077 750255 752214 755776 759821 763263 765804 767960 770447 773515 776733 779246 780246 779351
59178 779351 776807 773356 769705 765963 761638 756274 750048 743696 737831 732429 727071 721660 716772 713113
59164 713113 710724 708926 707097 705228 703596 702219 700852 699316 697492 695136 692070 688555 685134 682052
59150 682052 679042 675769 672301 669015 666123 663326 660020 655962 651719 648121 645172 641898 637566 632569
59136 632569 627631 622616 616983 611183 606597 603903 602411 601411 601364 603137 606662 611087 615934 621411 627734
59121 627734 634822 642671 651503 661406 672193 683629 695528 707597 719478 730953 741846 751797
59109 751797 760438 767761 773924 778721 781640 782603 782204 780951 778600 774632 769214 763261 757556 752140 746704
59094 746704 741254 736074 731143 726016 720429 714888 710448 707846 706951 707007 707339 707834 708803 710436 712439 714296
59078 714296 715786 716970 717578 716802 714126 710214 706464 703599 701100 698137 694613 690968 687313 683302 678803
59063 678803 674281 670403 667421 665008 662565 659670 656418 653401 651286 650334 650295 650710 651214 651611 651774 651582
59047 651582 650964 650021 649097 648656 648979 649912 650929 651504 651530 651376 651449 651683 651627 651059 650352 650085 650508 651578 653290
59028 653290 655691 658672 662052 665762 669641 673271 676463 679833 684299 689919 695766 701082 705950 710532
59014 710532 714274 716442 717092 716947 716543 715995 715409 714958 714592 714188 714036 714702 716284 718214 720028 722065 725192
58997 725192 729914 735876 742142 747929 753086 757869 762275 765829 768195 769807 771581 774016 776771 779117
58983 779117 780658 781766 783545 787256 793433 801599 811025 821654 833873 847577 862072 877025 892896
58970 892896 910028 927757 944871 960733 975434 989014 1001102 1011401 1020008 1026952 1031786 1033984
58958 1033984 1033616 1031211 1027041 1020874 1012506 1002195 990416 977467 963559 949094 934502 919871
58946 919871 905071 890300 876266 863723 852929 843583 835104 827039 819436 812884 807975 804719 802619
58933 802619 801236 800366 799740 799060 798474 798596 799831 802022 804857 808183 811696 814894 817766 821074 825414
58918 825414 830400 835394 840709 847293 855314 863834 871992 879933 888428 898141 909410 922203 936018
58905 936018 950157 964310 978531 992704 1006529 1020170 1034237 1048788 1062867 1075419 1086264
58894 1086264 1095788 1104160 1111429 1118059 1124766 1131935 1139689 1148361 1158365 1169646 1181822 1194843 1208926
58881 1208926 1223728 1238156 1251325 1263337 1274770 1285638 1295206 1302724 1308072 1311703 1314143 1315570
58869 1315570 1315735 1314248 1310952 1305935 1299172 1290294 1278843 1264636 1247794 1228493 1206928 1183549 1159148
58856 1159148 1134525 1110015 1085449 1060638 1035881 1011847 988971 967188 946377 926859 909059
58845 909059 892711 876836 860722 844670 829465 815325 801711 788089 774522 761525 749666
58834 749666 739366 730749 723486 717024 711121 706010 701940 698855 696734 695955 696980 699798 703927 708884
58820 708884 714385 720247 726427 733118 740391 747745 754381 760031 765132 770101 774735 778575 781483 783558
58806 783558 784679 784544 783129 780776 777736 773866 768935 763163 757266 751883 747022 742269 737536 733376
58792 733376 730392 728615 727788 728055 729837 732999 736734 740532 744873 750595 757897 766351 775642 785783
58778 785783 796639 807649 818147 827733 836297 843797 850006 854307 855752 853554 847624 838686 827865
58765 827865 816131 803935 791215 777875 764281 751112 738642 726441 714043 701728 690373
58754 690373 680577 672188 664640 657565 651056 645490 641123 637854 635461 633998 633792 635046 637720 641804
58740 641804 647300 653779 660450 667016 674069 682172 690841 698916 705725 711437 716455 721053 725502 729952
58726 729952 734130 737622 740506 743256 745998 748419 750541 753100 756825 761657 766858 771670 775751 779270
58712 779270 782700 786201 789095 790253 789076 785746 780448 772847 762607 749993 735584 719639 702149
58699 702149 683368 663938 644576 625841 608106 591487 575871 561222 547817 536043 526072 517861
58687 517861 511259 505859 500942 495962 491112 487102 484259 482099 479943 477794 476370 476309 477587 479721 482305
58672 482305 485108 487878 490379 492698 495193 498005 500901 503753 506852 510444 514196 517518 520215 522405
58658 522405 523834 523782 521702 517647 512065 505556 498878 492667 486965 481366 475823 470916 467073 463917 460784
58643 460784 457649 455167 453878 453682 454019 454325 454351 454312 454767 456193 458625 461726 465074 468331 471262 473824
58627 473824 476173 478389 480243 481400 481898 482292 483254 484998 487113 488966 490379 491935 494515 498469 503334
58612 503334 508437 513631 519223 525209 530892 535502 539041 542203 545486 548756 551892 555361 559614 564123
58598 564123 567724 570058 572040 574608 577560 580101 582110 584300 587402 591700 597216 603856 611467 620143
58584 620143 630232 641604 653260 664288 675045 686592 699012 711042 721517 730432 738369 745599
58572 745599 752232 758725 765764 773850 783273 794267 806997 821601 838288 857048 877205 897653
58560 897653 917644 936932 955170 971695 985999 997759 1006197 1010100 1008956 1003588 995336 985147
58548 985147 973867 962716 952715 943870 935520 927235 918804 909587 898537 884972 868920 850776
58536 850776 830929 809710 787379 764230 740904 718526 698248 680706 665939 653554 642792
58525 642792 632815 623353 614900 607929 602129 596779 591690 587346 584122 581713 579384 576639 573665 571251
58511 571251 570138 570280 570903 571310 571448 571584 571797 572025 572283 572522 572507 572140 571790 572034 573197 575274 578043 581074
58493 581074 583867 586335 589030 592783 598258 605791 615210 625702 636336 647015 658511 671356 685174
58480 685174 699393 714061 729476 745455 761430 776892 791273 803740 813565 820395 823835 823296
58468 823296 818859 811835 803879 795916 788515 782724 779617 779190 780614 783450 787901 793960 801154 809168
58454 809168 817926 826915 835050 841402 845572 847322 846397 842758 836491 827389 815197 800389 784230 767938
58440 767938 752174 737340 723929 712430 703233 696578 692293 689658 688016 687389 688065 689811 692137 695199
58426 695199 699628 705437 711831 718248 724801 731422 737291 741528 743928 744641 743648 740971 736978 732096 726500
58411 726500 720426 714450 709147 704670 700893 697674 694770 691825 688780 686084 684266 683519 683832 685194 687370
58396 687370 689830 692316 695286 699380 704552 710109 715596 721209 727167 733054 738131 742237 746008 750112
58382 750112 754537 758807 762708 766451 770242 774096 778032 782069 785957 789359 792439 795853 799953 804352
58368 804352 808549 812579 816891 821986 828383 836361 845350 854080 861862 869335 877452 886156 894501 901665
58354 901665 907265 911099 913285 914473 915345 916091 916793 917901 919831 922507 925877 930394 936286 942892 949568
58339 949568 956816 965531 975484 985617 995685 1006552 1018908 1032618 1047264 1062319 1076790 1089723
58327 1089723 1101193 1111944 1121962 1130302 1136413 1140700 1143658 1145441 1146587 1148235 1151153 1155225 1160099
58314 1160099 1165720 1172055 1179058 1187129 1196888 1208205 1220103 1231842 1243457 1255123 1266711 1278249
58302 1278249 1290214 1303071 1316928 1331633 1346684 1361217 1374804 1388204 1402549 1417907 1433452
58291 1433452 1448958 1465125 1482406 1500591 1519708 1540267 1562266 1584867 1607415 1630118 1653515
58280 1653515 1678019 1704019 1731641 1760366 1789724 1820313 1853186 1888269 1924432 1961060 1998422
58269 1998422 2036569 2075211 2114785 2156224 2199434 2243352 2287861 2334201 2383054 2433588 2484967
58258 2484967 2537457 2591445 2646583 2702605 2760009 2819324 2880616 2944095 3010241 3079150 3150984
58247 3150984 3227188 3309743 3398831 3492730 3590481 3693155 3802009 3917066 4038235 4166261
58237 4166261 4301750 4444729 4596005 4757560 4930780 5115657 5312398 5522431 5747100
58228 5747100 5986925 6242957 6517473 6812632 7129918 7471567 7841065 8241682 8676234
58219 8676234 9148874 9665421 10231446 10852022 11533996 12286758 13120655 14047408 15083170
58210 15083170 16249460 17571477 19079545 20814829 22833713 25209068 28031838 31409669
58202 31409669 35454451 40263675 45914009 52474204 60022871 68657322 78496670 89684799
58194 89684799 102386582 116768784 132966781 151042120 170939277 192461939 215284533
58187 215284533 238973780 262961279 286435250 308185163 326485578 339148275 343892051
58180 343892051 339059937 324404141 301417665 272886275 241909428 211033722 181939191
58173 181939191 155582692 132431545 112591195 95884459 81963660 70425503 60875126
58166 60875126 52950876 46342589 40800951 36127256 32158843 28765835 25849635 23332459
58158 23332459 21147851 19241373 17571908 16105182 14808516 13654363 12623716 11701496
58150 11701496 10871818 10120756 9439914 8823513 8264582 7756570 7295507 6877551 6496886
58141 6496886 6148538 5830644 5541374 5276028 5029507 4799347 4583976 4380350 4185886
58132 4185886 4000912 3826794 3663154 3508824 3363827 3228364 3101279 2981367 2868775
58123 2868775 2763501 2664085 2569442 2480409 2397766 2320307 2246615 2177171 2112713 2051950 1993023
58112 1993023 1936154 1882729 1832566 1784015 1736191 1689358 1643599 1598716 1555156 1513621 1474020
58101 1474020 1435831 1399112 1364265 1331356 1300515 1272301 1246768 1222919 1199917 1178027 1157477
58090 1157477 1137411 1117104 1097277 1078944 1061765 1044797 1028175 1012658 998043 983338 968129
58079 968129 952570 936417 919323 901847 885046 869113 853383 837556 821997 806977 792435
58068 792435 778447 765173 752490 740278 728889 718685 709254 699692 689592 679340 669607 660835
58056 660835 652941 645270 637174 628773 620600 612448 603526 593994 585245 578029 571447 564627 558286 553447
58042 553447 549502 544943 539488 534056 528954 523432 517032 510172 503310 496522 490029 484287 479321 474623
58028 474623 469726 464359 458156 450981 443567 437117 432107 427932 423740 419126 414114 409016 404314 400210
58014 400210 396333 392344 388714 386321 385271 384628 383399 381379 379052 377070 375904 375598 375754 375959 376251
57999 376251 376971 378236 379766 381144 382024 382114 381168 379075 375983 372390 368971 366013 363204 360323 357902
57984 357902 356597 356082 355473 354884 355512 357840 360781 363230 365618 369063 373627 378243 381997 384733 386780
57969 386780 388682 390885 393118 394465 394460 393604 392311 390032 386115 380937 375399 369856 364398 359570 355772
57954 355772 352381 348507 344353 340827 338058 335338 332363 329430 326520 323300 320169 318264 318165 319428 321515
57939 321515 324379 327925 331732 335628 339865 344498 349144 353593 358023 362476 366700 370564 373995 376357
57925 376357 376659 374673 371249 367256 362785 357705 352309 346991 341681 336092 330295 324815 320329 317378
57911 317378 316001 315538 315138 314573 314279 314547 315143 315752 316270 316453 315768 313900 311104 307798 304090 299964 295622
57894 295622 291410 287544 284157 281484 279848 279461 280154 281278 282026 282149 282237 282988 284338 285597 286289 286445
57878 286445 286182 285514 284622 283891 283602 283869 284827 286509 288594 290702 292897 295490 298441 301476 304776 308957
57862 308957 314234 320076 325833 331292 336423 341060 345115 348868 352842 357426 362561 367619 371743 374605
57848 374605 376650 378338 379487 379859 380021 380811 382096 382895 382688 381740 380074 377158 372980 368585 364996 362222
57832 362222 359710 357145 354276 350723 346591 342851 340445 339331 338943 339215 340455 342458 344439 345861 346833
57817 346833 347669 348477 349219 349930 350827 352253 354276 356174 356724 355321 352593 349505 346237 342366 337915 333560
57801 333560 329835 326751 324331 323022 323263 324867 327029 328825 329670 329565 329072 328894 329262 329739 329631 328523
57785 328523 326422 323596 320488 317659 315560 314238 313406 312883 312819 313334 314082 314468 314311 314002 313914 313947 313814 313484
57767 313484 313078 312465 311230 309071 306116 302947 300294 298456 296928 294939 292509 290582 289893 290160 290747
57752 290747 291626 293129 295201 297590 300516 304359 308831 313251 317569 322337 327640 332890 337821 342836
57738 342836 348028 352651 356099 358905 362214 366519 371225 375236 377797 379101 380216 382153 384836 387377
57724 387377 389226 390506 391250 391159 390361 389604 389167 388242 385952 382417 378350 374147 369993 366313 363326 360507
57708 360507 357205 353572 350196 347060 343639 339893 336402 333519 331120 329361 328943 330242 332607 334952
57694 334952 336835 338654 340854 343234 345053 345704 345258 344430 344151 345093 347368 350501 353921 357821 363437
57679 363437 372102 384096 398793 415855 435626 458387 484020 512761 545594 583269 625373 670887
57667 670887 719296 770562 824182 878617 931051 976906 1009809 1023185 1012833 978569 924172
57656 924172 856268 782666 710368 644110 586348 538056 499154 468536 444517 425633 410911
57645 410911 399499 390449 382899 376253 370268 365192 361543 359322 357544 354940 351123 346763 342756 339620
57631 339620 337583 336677 336620 336903 337075 336719 335303 332473 328536 324259 320126 316038 311771 307419 303325 299843
57615 299843 297165 295151 293332 291386 289532 288184 287271 286298 285047 283799 282786 281795 280507 278903 277175
57600 277175 275495 273982 272657 271271 269382 266831 264035 261653 259953 258586 256945 254731 252176 249706
57586 249706 247447 245216 242926 240759 238847 237046 235238 233540 231979 230135 227418 223597 218865 213568
57572 213568 208048 202580 197275 192210 187752 184334 181728 179045 175834 172673 170193 168085 165829 163884
57558 163884 163168 163519 163689 162899 161512 160119 158914 158188 158511 159910 161660 163367 165548 168587 171772 174026
57542 174026 175121 175471 175199 174243 173102 172563 172640 172538 171901 171464 172081 173517 174671 174829 174287 173733 173366 172874
57524 172874 172098 171389 171249 171890 173322 175628 178786 182348 185709 188747 191864 195282 198582 201119 202712
57509 202712 203760 204789 205963 206969 207367 207135 206785 206779 206959 206808 206174 205349 204422 203023 200820 197971 194935
57492 194935 192170 190082 188878 188213 187257 185427 182917 180384 178336 176896 175878 174828 173283 171217 169028
57477 169028 166864 164257 160700 156414 152170 148477 145225 142059 138758 135264 131644 128218 125540 124072
57463 124072 123769 124008 124010 123417 122477 121673 121213 120978 120760 120404 119805 119047 118545 118739 119583 120516 121002 120940 120654 120713
57443 120713 121712 123839 126588 129206 131456 133629 135838 137802 139445 141229 143550 146194 148668 150739
57429 150739 152339 153292 153566 153594 153890 154381 154506 153941 152970 152096 151476 150739 149325 147092 144629 142816 141966
57412 141966 141688 141661 142154 143435 144942 145570 144795 143207 141931 141691 142382 143268 143498 142670 140967 138830 136607
57395 136607 134622 133328 133065 133665 134474 134883 134774 134522 134622 135317 136484 137833 139167 140386 141376 142083 142616
57378 142616 143025 143031 142373 141443 141118 141717 142436 142121 140438 138028 135780 134134 132930 131585 129547 126773 123716
57361 123716 120788 118082 115703 113972 112961 112149 110967 109600 108848 109204 110318 111315 111486 110824 110102 110306
57345 110306 111737 113718 115289 115992 115850 114973 113571 112112 111058 110526 110507 111136 112355 113495 113791 113314
57329 113314 112878 112949 113095 112683 111768 111009 110886 111229 111500 111390 110995 110389 109284 107548 105969 105829 107368 109255
57311 109255 110166 110411 111276 113087 114803 115503 115365 114983 114511 113878 113295 113044 113115 113392 113899 114593 115170 115373
57293 115373 115333 115412 115936 117152 119150 121617 123937 125708 126962 127826 128315 128620 129217 130366 131778 133015
57277 133015 134000 134906 135796 136586 137167 137352 137071 136823 137567 139674 142320 144390 145861 147667 150257 152871
57261 152871 154476 154988 155252 155987 157075 157897 158180 158386 159185 160590 161843 162283 162123 162131 162685 163498 164232 164962
57243 164962 165865 166785 167399 167711 168104 168955 170377 172352 174938 178167 181833 185486 188739 191547 194150 196779
57227 196779 199453 202013 204305 206305 208136 209958 211822 213681 215630 218007 221092 224762 228694 232878
57213 232878 237611 242867 248002 252353 255922 259240 262759 266700 271250 276417 281756 286805 291910 298089
57199 298089 305756 313971 321458 328101 334945 342761 351180 359365 367122 375028 383657 392989 402572 412011
57185 412011 421248 430510 440105 450323 461392 473391 486175 499583 513889 529884 548216 568744
57173 568744 590854 614360 639649 666851 695403 724772 755138 786841 819453 852041 884249
57162 884249 916488 948998 981427 1013645 1046486 1081188 1118384 1158014 1200065 1245016 1293645
57151 1293645 1346662 1404461 1467042 1534172 1605734 1681776 1761998 1845312 1929940 2013673 2093745
57140 2093745 2166714 2228897 2277059 2308758 2322761 2320084 2304921 2283990 2264503 2252626 2253503 2271568
57128 2271568 2309662 2367501 2441302 2525096 2612369 2696843 2772848 2836388 2886724 2927013 2963128
57117 2963128 3001434 3046941 3102387 3168037 3242199 3322640 3408375 3500680 3602812 3718976 3853344
57106 3853344 4009644 4191730 4405122 4658431 4963332 5333223 5781925 6322858 6967828
57097 6967828 7725305 8599544 9591066 10696971 11910125 13218384 14605290 16051626 17536818
57088 17536818 19040199 20541504 22019161 23448863 24809378 26096343 27329996 28540523
57080 28540523 29736124 30881778 31909357 32746633 33334242 33618885 33542246 33048555 32108130
57071 32108130 30734786 28983810 26937756 24693354 22352868 20015506 17767456 15674009
57063 15674009 13776213 12091347 10616628 9336422 8230718 7280230 6466283 5768970
57055 5768970 5167783 4644520 4185241 3779868 3420816 3101974 2817978 2563718 2334595
57046 2334595 2127325 1940253 1772695 1624080 1493591 1380052 1281755 1196564 1122560 1058718
57036 1058718 1004789 960451 924611 895649 872360 854529 842402 835650 833120 833660 836880 842983
57024 842983 852091 863755 876392 886434 888378 876890 849900 809984 762779 713999 667466 625049
57012 625049 587573 555411 528354 505430 485420 467648 451958 437898 424569 411646 399909
57001 399909 390132 381840 373919 366169 359313 353567 348286 343292 339529 337788 337519 337653 338133 339795 342992
56986 342992 347089 351383 355914 361098 366911 372646 377350 380347 381315 379933 375658 368159 358038 346851
56972 346851 336222 326978 319168 312636 307320 303242 300569 299735 301295 305487 311881 319506 327503 335771
56958 335771 344895 355286 366495 377498 387328 395061 399372 398838 392860 382043 367639 351054 333848
56945 333848 317597 303350 291499 282254 275889 272399 271497 273243 278240 286924 298983 313688 330322
56932 330322 347992 365543 382116 397409 410981 421707 428264 429658 424866 412787 393578 369793
56920 369793 345139 322006 300750 281140 263402 247738 233906 221808 211809 203916 197257 190983
56908 190983 185285 180835 177576 174782 172232 170524 170084 170458 170991 171735 173207 175517 178264 181271 184885
56893 184885 189416 194738 200712 207633 215831 225029 234512 243852 253099 262360 271560 280487 288484 294127
56879 294127 295897 293521 288257 281689 274687 267768 261807 257809 256237 257049 260181 265617 273254 283147
56865 283147 295695 311186 329315 349589 371964 396482 422321 447734 470982 490893 506395
56854 506395 515987 518082 511914 498172 478952 457084 435259 415580 399688 388851 383687 384024 389360
56841 389360 399369 413832 432452 455126 482114 513450 548302 585397 623885 663206 701985
56830 701985 737414 765700 782871 785613 772415 744534 705654 660355 612919 567106 526032 491577
56818 491577 464191 443580 429492 421750 419994 423799 432863 446779 464754 485873 509573 535550
56806 535550 563088 590543 615478 635176 647079 648973 639235 617441 585106 545795 504122 464247
56794 464247 428893 399310 375753 357932 345222 336732 331519 329129 329935 334597 342951 353805 366073
56781 366073 379642 394613 410000 423832 434429 440871 442196 436985 424350 405081 381492 356291
56769 356291 331626 308806 288356 270272 254335 240252 227692 216460 206714 198696 192149 186254
56757 186254 180364 174612 169605 165680 162625 160073 157946 156467 155873 156093 156683 157043 156772 155860 154589 153202
56741 153202 151684 149920 148087 146648 145761 144931 143704 142553 142417 143273 143875 143294 142105 141493 141736 142259
56725 142259 142850 143921 145642 147526 149002 149920 150487 151115 152280 154005 155592 156351 156554 157086 158299 159832
56709 159832 161561 163880 166793 169455 171006 171494 171745 172700 174965 178472 182282 185132 186421 186422 185574 184114
56693 184114 182435 181117 180326 179726 179160 178880 178904 178886 178934 179810 181779 183938 185319 186103 186983 187828 187912 187278
56675 187278 186926 187516 188600 189315 189297 188686 187713 186613 185668 184960 184202 183073 181712 180673 180269 180138 179638
56658 179638 178628 177535 176598 175534 174253 173440 173826 175158 176579 177865 179480 181397 182816 183309 183386 183535
56642 183535 183555 183410 183917 185691 187926 189138 188880 187926 186960 185885 184415 182553 180324 177694 175017 173090
56626 173090 172418 172585 172599 171775 170300 169050 168831 169674 170896 171824 172300 172402 172029 171057 169725 168555 167988
56609 167988 168169 168960 169967 170770 171293 171817 172503 173193 173783 174435 175207 175896 176534 177620 179452 181538 183094
56592 183094 183865 184005 183453 182001 179876 177759 176223 175422 175266 175579 176144 176821 177566 178210 178513 178621 179123
56575 179123 180426 182394 184870 188033 191812 195444 198302 200790 203744 207256 210760 214047 217412 220899
56561 220899 224272 227787 232234 238021 244805 252116 259629 266584 271628 273698 272764 269504 264628 258800
56547 258800 252819 247454 243167 240094 238111 236854 235883 234929 233828 232322 230239 227882 225901 224705 224243
56532 224243 224307 224736 225285 225636 225569 224913 223465 221357 219422 218631 219020 219656 219751 219400 219074 218886 218646 218271 217741
56513 217741 216894 215561 213842 212037 210413 209090 208000 206853 205322 203393 201466 200069 199556 199995 201061
56498 201061 202074 202459 202297 202193 202538 203129 203629 204153 205124 206666 208298 209319 209424 208909 208241 207572 206849
56481 206849 206258 206140 206388 206409 205995 205773 206303 207098 207147 206280 205388 205339 206155 207262 208074 208304 208186 208401 209356
56462 209356 210598 211364 211672 212264 213464 214743 215560 215995 216282 216308 215976 215589 215455 215444 215341 215381 216006 217267
56444 217267 218825 220407 221898 223036 223404 222873 221886 221157 221003 221060 220763 220063 219472 219317 219275 218860 218135 217557
56426 217557 217285 217021 216444 215441 214039 212548 211683 212091 213658 215621 217338 218691 219824 220914 222106
56411 222106 223277 223967 223981 223919 224612 226058 227440 228095 227895 226869 225247 223913 223870 224936 225717 225287 224262
56394 224262 223824 224301 225234 226316 227619 229157 230758 232306 233787 235138 236159 236464 235681 234103 232991
56379 232991 233540 235409 236962 237258 237084 237727 239477 241907 244840 248172 251189 253053 253934 254923 256708 258839
56363 258839 260388 260918 260713 260364 260259 260408 260682 261185 262133 263410 264653 265881 267606 269990 272298 273588
56347 273588 273699 273243 272873 272936 273550 274626 275879 277165 278668 280576 282798 285208 287901 290887 293840 296531
56331 296531 299315 302739 306750 310607 313604 315707 317593 320138 323615 327255 329861 330992 331187 330986 330310
56316 330310 329215 328577 329301 331105 332850 333986 335094 337008 339979 343782 348087 352535 356765 360629 364238
56301 364238 367791 371557 375998 381596 388419 395964 403493 410407 416392 421481 426059 430685 435746 441268
56287 441268 447095 453248 460040 467761 476264 485109 494164 503843 514520 525936 537434 548526 558973
56274 558973 568702 578232 588849 601552 615941 630933 646530 663964 684011 706263 730461 757454
56262 757454 788081 821965 858331 897576 941192 990547 1046464 1109588 1180274 1258304 1343557
56251 1343557 1436954 1540103 1653943 1778226 1912252 2055466 2207260 2366676 2532459 2703143
56241 2703143 2876963 3051793 3225039 3393341 3552567 3698408 3826979 3934835 4018806 4076283
56231 4076283 4105664 4106438 4079095 4025067 3946406 3845250 3723944 3585815 3435290 3276729 3113401
56220 3113401 2947797 2782419 2619794 2462094 2311153 2168458 2034623 1909223 1791702
56211 1791702 1682176 1580982 1487894 1402327 1323928 1252441 1187242 1127602 1073094 1023283 977372
56200 977372 934704 895303 859360 826547 796423 769116 744979 723915 705681 690364 677694
56189 677694 666281 654623 642734 631868 622677 614614 607170 600658 595428 591142 587267 583717 580675
56176 580675 578242 576599 576099 576856 578498 580531 582775 585369 588528 592378 596878 601831 607037 612318 617409
56161 617409 622186 627106 632909 639608 646270 652288 658461 666246 676244 687944 700685 714407 729737
56148 729737 747821 769716 795459 824036 854758 888262 925717 967655 1014261 1066162 1123855
56137 1123855 1186607 1252759 1320913 1390052 1458759 1525224 1587873 1645278 1695772 1738161 1772807
56126 1772807 1801247 1824833 1844295 1860138 1872295 1879438 1879615 1871732 1855842 1832358 1801971 1766171
56114 1766171 1726700 1684223 1638139 1587583 1531976 1471083 1405770 1338756 1273561 1212548 1156698
56103 1156698 1106984 1064678 1030157 1002419 980030 961807 946709 934131 924353 917699 913197 909187
56091 909187 905384 903207 903742 906377 909767 913230 916835 921011 926339 933039 940397 947390 953990 961197
56077 961197 969817 979950 991510 1004264 1017460 1030411 1043421 1057145 1071275 1085004 1098647 1113320
56065 1113320 1129085 1144963 1160921 1178204 1197120 1216004 1233058 1248049 1261654 1274365 1286635
56054 1286635 1298963 1311118 1322245 1332324 1342616 1354275 1367424 1381938 1398014 1415549 1434023
56043 1434023 1453395 1474139 1496102 1518460 1541137 1565008 1590354 1616424 1643015 1671125 1701494
56032 1701494 1733710 1767330 1802705 1840131 1879322 1920160 1962736 2006283 2049405 2091853 2134710
56021 2134710 2178436 2222308 2266320 2312009 2360656 2412196 2466571 2524535 2586334 2651166 2718828
56010 2718828 2790338 2866131 2945301 3027564 3114312 3206654 3303950 3405283 3510874 3621052 3735542
55999 3735542 3854946 3981329 4116169 4259172 4410156 4570466 4741418 4922985 5115234
55990 5115234 5319515 5537158 5768683 6015342 6279708 6563751 6868306 7195491 7549525
55981 7549525 7933953 8350386 8801364 9292208 9828647 10415210 11057835 11765888 12550157
55972 12550157 13421601 14394351 15488064 16726332 18136563 19755137 21632623 23835165
55964 23835165 26445671 29564380 33299942 37751102 42995957 49100596 56136562 64191270
55956 64191270 73371177 83803744 95634043 109009528 124056335 140851397 159389636
55949 159389636 179554735 201110441 223704580 246841930 269790369 291436067 310153741
55942 310153741 323805950 330029290 326894496 313745532 291718282 263502607 232424707
55935 232424707 201428322 172515530 146741758 124476770 105656721 89963581 76966810
55928 76966810 66226413 57340550 49958102 43786336 38593533 34197600 30451735 27239677
55920 27239677 24472958 22081051 20002564 18186009 16592373 15190727 13952802 12853898
55912 12853898 11875164 11001061 10216487 9508563 8868534 8289355 7763365 7283924 6846804
55903 6846804 6447935 6081925 5744363 5433370 5147329 4883171 4638278 4411797 4202596
55894 4202596 4008041 3826215 3657185 3500664 3354452 3216635 3087385 2967140 2854845
55885 2854845 2749422 2651146 2560203 2475552 2396509 2323661 2256770 2193359 2130817 2068547 2006928
55874 2006928 1945838 1885562 1827562 1772733 1720028 1668152 1617475 1569087 1523099 1479143 1437471
55863 1437471 1398417 1361763 1327635 1296894 1269549 1243756 1217449 1189971 1161339 1131191 1099618
55852 1099618 1067993 1037740 1009010 981384 954904 929545 904660 879943 856075 833595 812073
55841 812073 791107 771111 752339 734293 716929 701188 687372 674286 661090 648691 637957
55830 637957 627845 616929 605841 596468 589322 583276 577475 571971 566632 560740 553762 545660 536618
55817 536618 527195 518407 510884 504296 498255 493197 489589 486968 484725 483325 483723 485960 489273 493181
55803 493181 497558 502012 506118 509978 513729 516835 518659 519341 519286 518163 515271 510518 504225 496337 486762
55788 486762 476217 465928 456727 449146 443924 441473 441122 441839 443468 446352 450008 453277 455857 458841
55774 458841 463622 470899 480693 492623 506113 520797 536602 552830 567284 576815 578663 571094 553580
55761 553580 527483 496401 464740 435512 409679 387167 367705 350846 336153 323615 313409
55750 313409 305244 298358 292054 285784 279012 271654 264564 258834 254552 250687 246225 241036 235753 231197
55736 231197 227729 224810 221439 217371 213520 210732 208679 206538 204178 201871 199345 196222 193094 191032
55722 191032 189996 188749 186519 183923 182021 181226 181303 181830 182436 183073 184153 185944 187934 189374 190382 191757
55706 191757 193726 195558 196483 196265 194812 192074 188586 185368 182858 180430 177279 173390 169453 166226 164108
55691 164108 162885 161749 159998 157834 156130 155433 155674 156772 158790 161404 163942 166214 168710 171648 174427
55676 174427 176323 177304 177871 178544 179758 181741 184111 185988 186790 186646 185878 184575 182962 181658 181175 181510
55660 181510 182537 184336 186711 188811 189821 189862 189732 189874 190040 189911 189610 189508 189761 190105 189965 188798 186464
55643 186464 183212 179250 174498 168906 162887 157133 152023 147406 143023 138951 135479 132641 130192 128194
55629 128194 127364 128333 130552 132472 133080 132891 133046 133836 134610 134844 134624 134107 133180 131797 130161 128392 126412
55612 126412 124305 122438 121056 120063 119317 118837 118602 118420 118157 117859 117574 117267 116952 116678 116384 115941 115301 114345
55594 114345 112785 110532 108060 105949 104209 102569 101305 101092 101990 103263 104364 105443 106611 107376 107291
55579 107291 106744 106713 107961 110641 114225 117703 120447 123164 127371 133462 139953 145210 149334 153553 158139
55564 158139 161928 163831 163897 162702 160359 156617 151600 146091 141147 137441 134825 132473 129602 126107 122493
55549 122493 119347 117033 115663 115023 114547 113656 112230 110623 109290 108474 108159 108110 108030 107750 107256 106528 105596
55532 105596 104784 104503 104578 104153 102614 100322 98066 96105 94247 92610 91598 91093 90331 88804 86802 84854
55516 84854 83097 81534 80461 80123 80058 79289 77328 74735 72567 71375 70952 70914 71224 71903 72508 72323 71170
55499 71170 69679 68642 68440 69243 71178 73795 75800 76086 74972 73809 73386 73451 73781 74841 76969 79626
55483 79626 82027 83999 85682 86870 87394 87797 88798 90154 90873 90551 89819 89315 88944 88355 87461 86140 84085
55466 84085 81451 79126 77753 76920 75880 74655 73705 72908 71802 70748 70786 72050 73240 73105 71845 70524
55450 70524 69677 69055 68271 67079 65352 63460 62461 63208 65272 67317 68495 68975 69188 69213 69043 68833 68639
55433 68639 68372 68282 68993 70735 72885 74616 75735 76525 77051 76987 76056 74318 72146 70103 68664 67807 67018
55416 67018 65990 65170 65307 66579 68451 70264 71638 72447 72814 73090 73458 73539 72882 71827 71322 71632 71785
55399 71785 70757 68867 67500 67605 68921 70585 72002 73051 73815 74368 74694 74751 74692 74897 75550 76251 76400
55382 76400 75943 75398 75150 75103 75141 75388 75811 76052 75989 76017 76357 76469 75750 74522 73658 73418 73324 73151 73284 73900
55362 73900 74481 74420 73623 72267 70553 69001 68431 69061 69955 69949 68984 68095 68201 69265 70567 71423 71617 71360
55344 71360 70940 70403 69684 68956 68476 68057 67198 65999 65391 66005 67226 67901 67711 67274 67125 67193 67223 67136 66906
55325 66906 66498 66024 65684 65592 65830 66467 67216 67404 66737 65854 65612 66012 66398 66473 66456 66406 66222 66308 67394 69468
55305 69468 71565 72895 73538 73791 73502 72445 70821 69010 67239 65761 64882 64459 63901 63090 62890 64254
55289 64254 67093 70404 73231 75157 76170 76494 76409 75950 74981 73758 73054 73300 73901 73862 72939 71826 71318
55272 71318 71601 72239 72572 72159 71056 69679 68384 67365 66847 66955 67282 67113 66334 65689 65825 66597 67637
55255 67637 69066 71060 73115 74422 74771 74559 74087 73405 72696 72243 72038 71900 71931 72442 73446 74614 75662
55238 75662 76429 76721 76478 75959 75369 74455 72963 71332 70347 70126 69983 69313 68139 66890 66142 66517 68163
55221 68163 70273 71757 72515 73412 74834 76006 76150 75628 75299 75212 74664 73374 71914 70899 70252 69512 68602
55204 68602 67979 68052 68637 69194 69578 70233 71442 72592 72646 71315 69367 67769 66949 66967 67832 69282 70668 71525
55186 71525 72095 72912 74013 74884 75134 74862 74400 73975 73688 73563 73490 73288 72932 72610 72488 72556 72776 73305 74374
55167 74374 75871 77215 77840 77817 77785 78188 78778 79063 79062 79294 80098 81284 82477 83419 83823 83301 81815 80070
55149 80070 79060 79154 79777 80063 79713 79165 79050 79600 80495 81155 81123 80320 79115 78135 77796 77935 77980 77550 76784
55130 76784 76103 75813 76034 76765 77757 78460 78394 77610 76649 76038 75904 76026 76118 76120 76246 76616 76861 76416 75382 74734
55110 74734 75315 76853 78389 79387 79908 79891 79042 77553 76300 76017 76741 78238 80389 82805 84647 85452 85821
55093 85821 86691 88030 88842 88416 87029 85361 83805 82623 82335 83363 85418 87632 89360 90624 91734
55078 91734 92810 93817 94741 95455 95632 95172 94633 94771 95612 96369 96387 95728 94706 93420 92162 91736 92691 94455
55060 94455 95898 96607 97011 97361 97410 97176 97221 97793 98242 97783 96415 94746 93275 92200 91587 91272 90856 90201
55042 90201 89762 90041 90878 91626 91860 91599 90995 90198 89497 89217 89435 89995 90740 91545 92246 92753 93086 93080 92307 90654
55022 90654 88790 87538 86877 86104 85011 84261 84322 84631 84277 83244 82356 82164 82442 82861 83570 84701 85690 85692
55004 85692 84696 83719 83678 84372 84907 84838 84492 84313 84414 84858 85850 87344 88773 89576 89822 90035 90498 91023 91300
54985 91300 91114 90277 88785 87242 86730 87857 89987 91713 92165 91644 90967 90491 90024 89453 89021 88875 88775
54968 88775 88533 88528 89379 91113 92938 93971 94041 93738 93798 94461 95340 95875 95978 96128 96816 98017 99271 100086 100145
54949 100145 99471 98689 98748 99923 101264 101642 101179 101046 101837 102872 103232 102812 102058 101306 100801 100928 101953 103760
54931 103760 106116 108893 111910 114965 118237 122156 126602 130801 134377 138016 142618 148332 154790 161686
54917 161686 168509 174321 178601 181881 184710 186366 185514 181926 176647 170621 164106 157437 151268 145803
54903 145803 140593 135389 130532 126282 122498 119173 116569 114487 112180 109445 107172 106325 106853 108088 109646
54888 109646 111457 113379 115437 118125 121851 126241 130545 134630 139121 144529 150635 156816 162745 168656
54874 168656 174903 181237 186650 190133 191528 191334 189803 186740 182151 176470 169983 162687 155014 148000
54860 148000 142263 137320 132449 127736 123719 120451 117592 115078 113010 111061 108700 105975 103450 101458
54846 101458 99938 98924 98561 98612 98516 98050 97503 97119 96841 96641 96641 96762 96673 96223 95612 95070 94663 94473 94631 95134
54826 95134 95899 96925 98056 98746 98602 98083 98020 98401 98312 97262 95865 94931 94527 94365 94459 94820 94966 94450 93633
54807 93633 93303 93650 94170 94440 94481 94419 94404 94834 96081 97830 99167 99585 99526 99700 100195 100589 100717 100952 101732
54788 101732 103084 104584 105645 105848 105214 104274 103730 103958 104849 106128 107691 109528 111478 113350 115311 117909
54772 117909 121497 125813 130324 134880 139818 145517 152126 159604 167703 175816 183208 189466 194454 197791
54758 197791 198808 197322 194060 189949 185181 179426 172787 166025 159773 153999 148408 143034 138113 133660
54744 133660 129527 125827 123002 121328 120547 120116 119708 119370 119224 119298 119702 120745 122606 124980 127372 129738
54728 129738 132571 136232 140468 144772 148993 153365 158092 163108 168198 173127 177695 181816 185428 188202
54714 188202 189407 188325 184768 179157 172206 164709 157439 150919 145223 140119 135382 130910 126713 123007
54700 123007 120103 117907 115737 113083 110463 108975 108874 109101 108440 106756 104824 103297 102266 101563 101008
54685 101008 100370 99451 98342 97400 96921 96934 97287 97761 98077 97983 97493 96950 96762 97041 97549 97997 98361 98781 99189
54666 99189 99214 98640 97804 97371 97686 98538 99456 100054 100142 99862 99733 100217 101074 101471 100962 100114 99913 100736 102151
54647 102151 103490 104302 104372 103755 102862 102310 102496 103349 104390 104969 104597 103279 101501 99802 98491 97842 98191
54630 98191 99471 100853 101391 101058 100689 100792 100945 100647 100347 101024 102805 104506 104784 103547 101933 100967 100530
54613 100530 99809 98529 97302 96761 96791 96943 97258 98163 99579 100735 101002 100565 100064 99873 99981 100239 100409 100193
54595 100193 99631 99323 99866 101050 102000 102215 102161 102658 103902 105336 106258 106369 105821 105044 104513 104445 104562 104319
54577 104319 103469 102359 101571 101314 101257 100936 100280 99787 100150 101649 103822 105766 106807 106852 106219 105355 104776 104955
54559 104955 105987 107429 108665 109312 109173 108174 106706 105811 106372 108051 109494 109660 108531 106549 104113 101909
54543 101909 101010 101949 104059 106257 108209 110174 112061 113376 114047 114578 115314 116047 116480 116582 116376 115777 114872
54526 114872 114003 113502 113547 114202 115195 115756 115236 113931 112800 112295 112036 111711 111535 111534 111134 110063 109096 109198 110235
54507 110235 111170 111358 111025 110563 109993 109200 108276 107452 106964 107019 107618 108454 109197 109886 110795 112007 113325 114502
54489 114502 115282 115369 114744 113989 113896 114761 116251 117868 119169 119701 119309 118645 118766 119907 121082 121260 120659 120405
54471 120405 121112 122276 123067 123249 123111 122888 122666 122734 123578 125218 126812 127320 126617 125690 125576 126324 127190 127593
54453 127593 127500 126994 125936 124256 122264 120398 118833 117596 116929 117179 118257 119437 119930 119592 118937 118532
54437 118532 118560 118898 119350 119666 119604 119201 118861 118928 119255 119390 119082 118402 117525 116740 116533 117186 118292 119122 119510
54418 119510 119860 120247 120197 119616 119232 119606 120262 120466 120360 120562 120975 120957 120609 120936 122455 124394 125624 125891
54400 125891 125793 126017 126926 128499 130244 131396 131565 131064 130413 129768 129049 128430 128310 128829 129677 130391 130790 131084
54382 131084 131616 132476 133453 134469 135850 137864 140076 141614 142105 141941 141566 141041 140550 140770 142253 144731
54366 144731 147503 150322 153419 156770 159834 162055 163272 163598 163235 162489 161636 160629 159149 157149 155154
54351 155154 153882 153578 153843 154071 153905 153255 152105 150517 148811 147423 146338 144874 142419 139351 136813
54336 136813 135464 134834 134108 133130 132279 131731 131352 131228 131720 132866 134111 134869 135095 135172 135405 135734 135789 135151
54318 135151 133748 132136 131160 131097 131290 130862 129733 128661 128292 128469 128616 128497 128334 128341 128466 128607 128776 128908
54300 128908 128757 128119 127043 125694 124167 122627 121450 121017 121382 122340 123700 125317 126983 128524 129941
54285 129941 131204 132048 132310 132410 133057 134379 135758 136639 137130 137591 138037 138251 138252 138312 138611 139152 139883 140682 141347
54266 141347 141813 142292 142976 143701 144122 144161 144095 144257 144795 145638 146531 147191 147568 147838 148026 147858 147208 146473 146161
54247 146161 146246 146251 145943 145548 145259 144894 144109 142730 140829 138720 136928 135839 135273 134642 133704 132882 132660 132900
54229 132900 133065 132943 132809 132898 133068 133113 133113 133243 133397 133313 133045 133028 133533 134282 134733 134580 133797 132434 130697 129184
54209 129184 128570 128963 129815 130571 131115 131469 131465 131015 130416 129979 129551 128768 127721 126928 126646 126574 126347 126030 125982 126462
54189 126462 127516 129029 130666 131864 132220 131961 131934 132912 134892 137168 139170 141084 143454 146218 148452
54174 148452 149291 148899 148374 148733 150055 151438 151644 149951 146686 142968 139844 137672 136261 135320 134645 134117
54158 134117 133779 133766 134008 134233 134388 134743 135334 135705 135660 135844 136945 138531 139405 139080 138186 137366 136563 135644 134985
54139 134985 134915 135122 135137 135042 135196 135599 136056 136778 138183 140112 141708 142208 141623 140671 140217 140719 141974 143434
54121 143434 144917 146803 149317 151898 153707 154585 155082 155656 156340 157197 158448 159897 160736 160327 158940 157393
54105 157393 156134 154987 153621 152052 150726 150277 151042 152595 153949 154494 154586 154888 155281 154915 153374 151331
54089 151331 149823 149207 149124 149245 149598 150241 150969 151547 152054 152836 154145 155875 157697 159473 161454 163933 166717
54072 166717 169180 170974 172465 174202 176104 177541 178215 178597 179363 180602 181799 182469 182640 182771 183251 183971
54056 183971 184449 184503 184695 185868 188311 191685 195684 200249 204972 208911 211514 213487 216249 220662 226599
54041 226599 233523 240963 248558 256213 264338 273471 283526 293771 303616 313014 321934 329988 336948 343289
54027 343289 349724 356350 362597 367882 371938 374506 375214 374013 371556 368908 366874 365609 364676 363258 360472
54012 360472 355795 349523 342656 336063 329690 322796 315024 306996 299621 293044 286596 279735 272695 266199
53998 266199 260781 256499 253021 249917 246991 244456 242592 241189 239562 237276 234650 232351 230661 229446
53984 229446 228747 229016 230556 232955 235378 237407 239321 241364 242992 243218 241673 238945 235785 232413 228866
53969 228866 225549 222853 220463 217714 214657 212182 210937 210655 210801 211337 212452 213927 215281 216441 217827
53954 217827 219809 222333 225046 227598 229925 232385 235487 239336 243506 247672 252112 257255 262914 268351
53940 268351 273176 277842 283178 289592 296794 304150 311218 318030 324887 331970 339257 346780 354653 362733
53926 362733 370611 378189 385974 394429 403271 411839 420024 428360 437297 446867 457049 467895 479175
53913 479175 490424 501519 512712 523826 533893 542029 548334 553485 557650 560233 560557 558429 554184
53900 554184 548577 542570 536754 530909 524430 517133 509304 500978 491654 480928 469008 456385 443317
53887 443317 429933 416594 403772 391699 380380 369801 359847 350192 340641 331534 323422 316290 309446
53874 309446 302318 295097 288429 282691 277680 272862 267774 262308 256761 251536 246778 242420 238549 235415
53860 235415 232958 230645 228036 225347 223145 221610 220359 218994 217585 216521 215980 215599 214702 213001 211059
53845 211059 209823 209562 209537 208963 208029 207645 208298 209483 210281 210197 209453 208675 208343 208427 208590 208743 209139 209812 210306
53826 210306 210321 210282 210821 211919 213100 214293 215860 217826 219771 221553 223557 226065 228920 231984 235405
53811 235405 239225 243262 247624 252790 258912 265507 272165 279075 286541 294511 302939 312046 321693 330958
53797 330958 338929 345600 351466 356659 361106 365182 369434 373738 377339 379749 381063 381523 381288 380578 379442
53782 379442 377352 373603 368193 361871 355237 348305 341020 333686 326528 319190 311062 302038 292846 284609
53768 284609 278053 273029 268841 264990 261391 257845 253837 249183 244456 240284 236584 233005 229772 227403
53754 227403 225782 224229 222368 220249 217768 214773 211747 209516 208162 206971 205601 204446 203626 202536
53740 202536 200760 198745 197111 195941 195161 194877 194877 194565 193916 193810 194719 195797 196025 195643 195552 195872 196132 196469
53722 196469 197491 199106 200584 201782 203233 204875 205828 205790 205713 206530 207981 209299 210442 211902 213747 215596
53706 215596 217373 219391 221693 223834 225467 226837 228552 231068 234433 238326 242229 245679 248509 250902
53692 250902 253215 255694 258297 260802 263088 265247 267331 269065 269932 269553 267961 265631 263328 261711 260822
53677 260822 260024 258683 256894 255333 254484 254311 254600 255239 256029 256586 256668 256441 256268 256383 256853 257671 258782 260138
53659 260138 261797 263847 266153 268320 269976 270952 271233 270955 270497 270311 270567 271158 272045 273295 274731 275882
53643 275882 276537 276995 277595 278266 278804 279331 280155 281390 283009 285020 287238 289062 289983 290252 290597 291290 291891
53626 291891 292007 291874 292012 292636 293666 295011 296551 297960 298883 299343 299847 300986 302965 305459 307907 309963
53610 309963 311682 313299 314960 316722 318722 321162 324152 327616 331265 334564 336981 338496 339745 341323
53596 341323 343025 344113 344294 344016 343777 343589 343270 342836 342365 341786 341107 340526 340043 339232 337739 335821 334036
53579 334036 332594 331302 330007 328729 327523 326563 326210 326572 327058 326826 325722 324384 323410 322834 322451 322241
53563 322241 322242 322341 322425 322531 322667 322710 322620 322590 322810 323262 323820 324360 324736 324885 325065 325719 326957 328384 329556 330400
53543 330400 331154 332172 333867 336460 339580 342466 344851 347292 350364 353954 357757 362092 367543 373958
53529 373958 380461 386559 392721 399726 407825 416716 425999 435488 445294 455761 467052 478699 489884
53516 489884 500398 511048 522869 536108 550321 565337 581657 599721 619110 638767 657969
53505 657969 676837 695875 715288 734911 754509 773840 792533 810307 827303 843851 859922
53494 859922 875195 889742 904178 918894 933583 947882 962063 976671 991784 1007113 1022595
53483 1022595 1038334 1054134 1069629 1084773 1099649 1113888 1126920 1138885 1150640 1162632 1174231
53472 1174231 1184406 1192599 1198754 1202937 1205300 1206113 1205466 1203172 1199107 1193406 1186150 1177217 1166730 1155363
53458 1155363 1143934 1132847 1122121 1111653 1101165 1090157 1078254 1065478 1051972 1037733 1022921
53447 1022921 1008227 994470 981870 970040 958623 947601 937026 926752 916619 906739 897606 889983
53435 889983 884551 881400 879859 879030 878495 878394 878914 879939 881280 883008 885520 889324 894812 902068 910781
53420 910781 920363 930253 940270 950799 962589 976154 991306 1007427 1024275 1042315 1062119 1083634
53408 1083634 1106278 1129681 1153973 1179288 1205304 1231584 1258314 1286353 1316403 1348349 1381672
53397 1381672 1416350 1452919 1491607 1531881 1573066 1614950 1657439 1700056 1742356 1784479 1826666
53386 1826666 1868492 1909339 1949431 1989465 2029129 2067000 2102200 2135255 2166783 2196208 2222485
53375 2222485 2245450 2265607 2283007 2297166 2307778 2314716 2317497 2315569 2309139 2299099 2286052 2269873
53363 2269873 2250158 2226569 2198796 2166816 2131377 2093882 2055756 2018025 1981226 1945184 1909103
53352 1909103 1872515 1836138 1801245 1768238 1736432 1705267 1675068 1646426 1619330 1593133 1566972
53341 1566972 1540170 1512666 1485213 1458757 1433589 1409477 1386495 1365087 1345311 1326756 1309395
53330 1309395 1293754 1279897 1266931 1253942 1240794 1227591 1213952 1199485 1184467 1169400 1154213
53319 1154213 1138590 1122825 1107684 1093521 1080092 1067164 1054750 1042884 1031735 1021867 1013784 1007196
53307 1007196 1001404 996483 993421 992765 993746 995235 997107 1000087 1004528 1010114 1016820 1025459 1036857 1050777
53293 1050777 1066141 1082182 1098943 1116584 1134680 1152515 1169828 1186883 1203849 1220422 1236136
53282 1236136 1250792 1264446 1277106 1288572 1298512 1306649 1312907 1317322 1319816 1320172 1318330 1314542 1309044
53269 1309044 1301752 1292480 1281313 1268471 1254040 1238193 1221476 1204369 1186656 1167873 1148334 1129019
53257 1129019 1110355 1091833 1073111 1054709 1037081 1019657 1001511 982567 963506 944787 926470
53246 926470 908733 891791 875350 858771 841820 824698 807414 789745 771890 754526 738123
53235 738123 722698 708368 695509 684096 673446 662982 652899 643727 635547 627968 620586 613098
53223 613098 605177 596581 587323 577495 567031 555825 543939 531515 518662 505601 492721 480209
53211 480209 467782 455084 442235 429804 418339 408138 399346 391872 385241 378801 372123 365047 357406
53198 357406 349022 340011 330880 322199 314294 307176 300608 294266 288062 282330 277465 273376 269524 265495
53184 265495 261233 256713 251824 246745 242102 238389 235422 232579 229460 226109 222795 219857 217627 216224
53170 216224 215516 215395 215875 216684 217152 216951 216710 217270 218427 219075 218625 217608 216663 215662 214270 212775 211736
53153 211736 211184 210721 210234 209963 209985 210106 210210 210290 210233 209990 209895 210397 211507 212883 214356 215926 217274 217800
53135 217800 217242 215925 214342 212868 211877 211634 211974 212531 213375 214919 217083 219121 220595 221960 223767 225729
53119 225729 227165 228068 229096 230601 232190 233354 234023 234336 234177 233349 232161 231486 231940 232934 232971 231161 228263
53102 228263 225831 224497 223590 222336 220644 218580 215958 213010 210796 210128 210423 210378 209594 208796 208490 208211
53086 208211 207322 206010 205151 205457 206890 208606 209415 208620 206620 204532 203209 202753 202807 202903 202605 201862 201321
53069 201321 201771 203029 203857 203333 201946 200889 200552 200255 199396 198314 197787 197948 198027 197147 195255 193213 192011
53052 192011 191956 192620 193485 194455 195768 197549 199560 201317 202332 202335 201406 200018 198886 198553 198945 199321 198852
53035 198852 197437 195890 195237 195833 197199 198581 199558 200146 200525 200728 200624 200200 199783 199868 200695 202118 203830
53018 203830 205532 206856 207469 207405 207095 206857 206591 206145 205734 205709 206148 206972 208253 209995 211763 212984 213566
53001 213566 213884 214194 214457 214682 215035 215529 215964 216199 216212 215950 215557 215733 217333 220422 224096 227357 229839
52984 229839 231691 233262 235021 237181 239085 239516 238070 235816 234165 233450 233128 232969 233325 234286 235270 235657
52968 235657 235456 235188 235350 236073 237127 238196 239193 240225 241154 241536 241253 240917 241169 241766 241880 241216 240232 239211
52950 239211 237802 235735 233426 231485 230068 229115 228821 229254 229770 229494 228418 227472 227369 227855 228312 228597 228895
52933 228895 229073 228752 227986 227351 227204 227187 226730 225788 224824 224208 223942 223931 224216 224817 225642 226661 227980 229509
52915 229509 230741 231176 230957 230785 231053 231352 231025 230032 228951 228191 227539 226638 225626 225031 225089 225454 225568 225156
52897 225156 224323 223398 222771 222682 222946 223010 222507 221779 221637 222514 223966 225152 225773 226406 227836 230121 232441 233905
52879 233905 234406 234574 235014 235792 236655 237470 238267 238999 239502 239762 240075 240899 242446 244380 245926 246440 245975 245188
52861 245188 244650 244381 244061 243482 242667 241754 240904 240187 239371 237995 235846 233259 230778 228666 226862 225213
52845 225213 223501 221496 219259 217154 215272 213151 210533 208097 206764 206420 206077 205343 204885 205179 205660 205659
52829 205659 205457 205672 206049 205762 204715 203712 203296 203137 202774 202353 202256 202398 202293 201698 200963 200763 201523 202980
52811 202980 204306 204864 204843 204917 205297 205522 205230 204705 204397 204273 204027 203591 202970 201794 199641 196844 194423 193051
52793 193051 192556 192600 193282 194676 196241 197291 197836 198413 199194 199886 200418 201058 201686 201622 200525 198980 197802
52776 197802 197200 197042 197437 198481 199684 200340 200393 200390 200589 200626 200066 198875 197320 195801 194833 194748 195395 196450
52758 196450 197873 199598 200936 201113 200485 200411 201600 203295 204494 205261 206233 207466 208594 209723 211310 213253
52742 213253 214932 216141 217329 218787 220194 221164 221748 222197 222618 223052 223558 224059 224453 224976 226045 227501
52726 227501 228445 228209 227187 226268 225616 224538 222574 220251 218530 217761 217453 216976 216218 215511 215126 215047 215162
52709 215162 215480 215996 216492 216728 216820 217219 218161 219381 220518 221575 222624 223221 222702 221256 220183 220598 222135
52692 222135 223388 223475 222610 221273 219553 217575 215910 215094 215056 215432 216047 216724 217003 216660 216211 216251 216450 215905
52674 215905 214485 213123 212662 213002 213605 214295 215239 216528 218106 219852 221533 222866 223754 224190 224026 223219
52658 223219 222313 222163 223034 224444 225994 227785 229806 231512 232431 232765 233010 233327 233599 233720 233525 232852 231938
52641 231938 231327 231104 230700 229828 229070 229051 229573 230079 230530 231238 232251 233524 235287 237617 239996 241938 243676
52624 243676 245564 247224 248101 248471 248930 249162 248311 246543 245117 244741 244831 244649 244270 244031 243866 243712 243899 244606
52606 244606 245403 245769 245742 245702 245852 246206 246757 247421 248107 249019 250513 252509 254367 255502 255799 255380 254424 253360
52588 253360 252739 252680 252808 252835 252799 252715 252493 252372 252853 253987 255158 255762 255653 254878 253607 252410 251861 251631 250752
52569 250752 249058 247556 246944 246661 246079 245751 246553 248201 249615 250357 250718 250648 249712 248150 247057 247182 248099
52552 248099 248748 248395 247059 245397 244245 243880 243739 243156 242253 241736 241950 242591 243214 243514 243196 242142 240808
52535 240808 239997 240137 241045 242327 243642 244668 245249 245650 246239 246979 247632 248338 249518 251118 252510 253249 253500
52518 253500 253616 253731 253919 254364 255136 256101 257220 258615 260230 261738 262970 264142 265511 266964 268115 268610
52502 268610 268284 267213 265672 263830 261473 258305 254531 250794 247471 244391 241381 238719 236842 235865 235573
52487 235573 235636 235664 235388 235024 235209 236301 237915 239398 240582 241754 243062 244327 245420 246486 247640 248700
52471 248700 249418 249889 250531 251639 253117 254743 256552 258752 261276 263703 265721 267428 269048 270580 271948
52456 271948 273234 274385 274830 273828 271227 267631 263861 260483 257770 255677 253822 251813 249732 248032
52442 248032 246956 246342 245964 245673 245218 244395 243461 242910 242696 242190 241153 240182 239846 239875 239735 239591 240054 241199
52424 241199 242437 243347 244054 244789 245614 246682 248250 250243 252183 253764 255209 256868 258792 260937 263456
52409 263456 266405 269366 271781 273670 275661 278271 281486 285109 289133 293412 297202 299479 299774 298467
52395 298467 296245 293520 290480 287354 284351 281532 279011 277109 276015 275361 274561 273556 272868 272911 273593 274749
52379 274749 276446 278576 280557 281981 283356 285670 289231 293391 297449 301322 305141 308761 312121 315675
52365 315675 319821 323971 326841 327861 327802 327744 327840 327549 326738 325982 325829 326295 327098 327937 328455 328528 328830 330588
52347 330588 334276 338894 343018 346368 349807 354001 358716 363527 368623 374582 381685 389688 398138 406743
52333 406743 415606 425303 436553 449671 464355 480091 496617 513953 532123 551089 570959 592134
52321 592134 615043 639561 664734 689368 713036 736271 759603 782790 805381 827672 850418
52310 850418 873680 896644 918711 940040 960733 980177 997737 1013672 1028761 1043238 1056630
52299 1056630 1068504 1078838 1087629 1094623 1099595 1102622 1103893 1103340 1100534 1094982 1086700 1076608 1066164
52286 1066164 1056373 1047227 1038239 1029345 1021037 1013825 1007904 1003330 1000216 998688 998842 1000783 1004573 1010198
52272 1010198 1017729 1027364 1039144 1052703 1067557 1083492 1100356 1117620 1134593 1151141 1167776 1184872
52260 1184872 1202112 1218879 1234861 1249960 1263904 1276390 1287563 1297986 1307999 1317339 1325429 1331889
52248 1331889 1336549 1339171 1339346 1336716 1331156 1322715 1311616 1298395 1283857 1268659 1252988 1236836 1220473
52235 1220473 1204367 1188661 1173077 1157488 1142297 1128072 1115085 1103400 1093129 1084259 1076410 1069170
52223 1069170 1062590 1057031 1052531 1048725 1045413 1042877 1041480 1041229 1041859 1043162 1045096 1047771 1051444 1056318
52209 1056318 1062162 1068276 1074023 1079342 1084654 1090354 1096542 1103139 1110062 1117246 1124566 1131718 1138246 1143885
52195 1143885 1148971 1154314 1160387 1166759 1172565 1177465 1181736 1185447 1188048 1189096 1189009 1188517 1187516 1185064 1180630
52180 1180630 1174799 1168384 1161331 1153027 1143444 1133416 1123829 1115111 1107573 1101612 1097204 1093567 1089772 1085610
52166 1085610 1081663 1078732 1077401 1077846 1079632 1081797 1083526 1084845 1086434 1088709 1091321 1093530 1094875 1095394
52152 1095394 1095378 1095047 1094444 1093571 1092553 1091581 1090751 1090136 1090088 1091167 1093545 1096673 1099777 1102604 1105466 1108726
52136 1108726 1112539 1117098 1122808 1130134 1139381 1150562 1163326 1177170 1192030 1208595 1227749 1249686
52124 1249686 1273860 1299722 1327098 1355770 1385171 1414834 1444887 1475722 1507173 1538196 1567419
52113 1567419 1593987 1617965 1640008 1660606 1679639 1696601 1711096 1723005 1732383 1739474 1744718 1748361
52101 1748361 1750120 1749571 1746921 1742914 1737837 1731012 1721576 1709497 1695459 1679933 1662712 1643417 1622328
52088 1622328 1600615 1579710 1560316 1542042 1524238 1507139 1491940 1479732 1470748 1464675 1461147 1459679
52076 1459679 1459695 1461195 1465014 1471770 1480822 1490927 1501893 1514789 1530383 1548059 1566625 1585638 1605422
52063 1605422 1626119 1647229 1667969 1687662 1705838 1722363 1737487 1751466 1764033 1774431 1781968
52052 1781968 1786329 1787372 1784957 1779134 1770234 1758448 1743456 1724758 1702373 1677069 1649897 1621728
52040 1621728 1593223 1564936 1537139 1509638 1482035 1454314 1427051 1400995 1376396 1352823 1329684
52029 1329684 1307005 1285630 1266520 1249784 1234542 1219787 1205207 1191013 1177286 1163853 1150718
52018 1150718 1138136 1126097 1114063 1101449 1088197 1074630 1060899 1046807 1032147 1016968 1001493
52007 1001493 985915 970276 954495 938450 922093 905460 888578 871426 854075 836835 820144
51996 820144 804211 788792 773439 758100 743472 730467 719100 708083 695837 681927 667169
51985 667169 652430 637775 622919 607985 593394 579299 565652 552643 540664 529813 519859 510690
51973 510690 502512 495570 490043 486177 484119 483513 483696 484486 486419 489884 494400 499113 503734 508450 513029
51958 513029 516681 518925 520065 520501 520094 518703 517108 516682 518141 521111 525070 530238 537236 546283 557073
51943 557073 569194 582186 595348 607854 619055 628357 634999 638451 639032 637614 634642 629910 623392
51930 623392 615726 607591 599061 589867 579829 568637 555699 540848 524962 509295 494371 480020
51918 480020 466317 453776 442648 432686 423814 416442 410822 406552 403009 399970 397561 395891 395022 395085
51904 395085 396156 398086 400540 403081 405247 406780 407760 408144 407208 404003 398601 392320 386290 380259 373315
51889 373315 365419 357517 350351 343954 338393 334287 332154 331702 332216 333483 335902 339724 344495 349360 353768
51874 353768 357717 361406 364865 368082 371313 374895 378611 381488 382531 381603 379441 376963 374800 373355
51860 373355 372904 373554 375290 378114 381838 385778 388996 391075 392443 393711 394830 395081 393753 390675 386187
51845 386187 380869 375242 369570 363924 358519 353876 350418 347936 345733 343406 341190 339420 337929 336360
51831 336360 334903 334228 334541 335122 335170 334812 334833 335485 336111 336014 335248 334257 333101 331481 329351 327070 324950 323067
51813 323067 321527 320609 320424 320673 320887 320869 320770 320833 321140 321566 321983 322503 323413 324767 326202 327359 328337 329466
51795 329466 330684 331566 331914 331894 331489 330381 328640 327090 326478 326519 326246 325211 323907 323051 322839 322949 322960 322680
51777 322680 322362 322585 323716 325490 327401 329478 332295 336161 340685 345226 349433 353215 356587 359759 362999
51762 362999 366087 368243 368896 368228 366618 363888 359640 354087 347906 341354 334211 326734 319984 314867 311297
51747 311297 308718 307011 306335 306315 306045 305060 303907 303509 304173 305365 306398 307184 308304 310400 313479 316859
51731 316859 319769 321921 323495 324747 325816 326780 327638 328211 328268 327889 327575 327865 328776 329687 329784 328727 326899
51714 326899 325025 323574 322530 321672 320888 320158 319446 318711 317897 316819 315331 313810 313211 314193 316244 318080
51698 318080 318968 319309 319814 320563 321126 321275 321113 320613 319472 317559 315308 313478 312529 312245 312010 311442 310688
51681 310688 310019 309270 307991 306188 304557 303734 303597 303541 303296 303155 303462 304229 305267 306483 307924 309625 311473
51664 311473 313231 314854 316829 319955 324484 329653 334287 337748 340027 341201 341331 340883 340737 341545 343407
51649 343407 346219 349948 354359 358844 362799 365956 368174 369202 368845 367116 363950 359046 352318 344370
51635 344370 336251 328851 322671 317855 314106 310775 307471 304604 302962 302779 303431 304004 303934 303173 302056 301014
51619 301014 300170 299259 298041 296649 295240 293542 291246 288700 286718 285612 284951 284352 284033 284373 285403 286965
51603 286965 288938 291003 292671 293984 295865 299205 303802 308662 313271 318014 323366 329116 334543 338977
51589 338977 341981 343289 342842 340844 337662 333691 329376 325287 322082 320312 320157 321319 323307 325948 329462
51574 329462 333974 339258 345200 352264 360917 370647 380127 388687 397253 407436 419823 433451 446933
51561 446933 459803 472767 486870 502575 519462 536591 553058 568301 582086 594290 604607
51550 604607 612362 616680 617034 613638 607172 598123 586610 572899 557795 542219 526472 510121 492678
51537 492678 474320 455918 438483 422647 408607 396380 385929 377052 369329 362375 356117 350675
51525 350675 346032 342023 338655 336170 334613 333534 332287 330510 328161 325227 321660 317594 313453 309767
51511 309767 306992 305432 305128 305747 306702 307457 307715 307418 306788 306363 306734 308050 309885 311680 313230 314695
51495 314695 316289 318142 320331 322778 325123 326877 327808 328097 328116 328131 328156 327945 327151 325640 323663 321561 319339
51478 319339 316745 313780 310873 308433 306446 304629 302765 300711 298354 295793 293386 291343 289470 287589
51464 287589 285997 285081 284648 284165 283569 283307 283504 283694 283630 283804 284746 286274 287893 289680 292318 296379 301896
51447 301896 308492 315561 322501 329127 335695 342251 348212 353039 357100 361205 365285 368079 368312 365819
51433 365819 361476 356466 351685 347426 343381 339204 335120 331676 328891 326129 322919 319435 316057 313017
51419 313017 310711 309738 310132 310942 311066 310283 309119 308110 307648 308135 309594 311331 312616 313632 315123 317205
51403 317205 319227 320865 322657 325192 328378 331866 335621 339608 343352 346418 349107 352177 355976 360348
51389 360348 365357 371531 379240 388281 398343 409613 422595 437541 454332 472755 492520 513110
51377 513110 534032 555276 577066 599004 619918 638871 655855 670908 682808 689383 689204 682436
51365 682436 670025 652791 631610 607800 582680 556972 531106 505842 482129 460482 440877
51354 440877 423152 407239 393160 381108 371317 363603 357297 351951 347730 344622 341766 338284 334525
51341 334525 331563 329529 327347 324283 320830 317754 315076 312475 310001 307802 305639 303294 301075 299449
51327 299449 298473 298053 298362 299464 300869 302013 302943 303926 304613 304325 303103 301853 301353 301605 302241 303075 304050
51310 304050 305073 306110 307262 308626 310203 311858 313206 313707 313259 312523 312176 311937 310934 309017 307074
51295 307074 305858 305118 304226 303064 301873 300718 299727 299535 300772 303142 305547 307248 308490 309889 311593
51280 311593 313320 314971 316881 319397 322371 325139 327051 328023 328508 328916 329191 329062 328577 328145 328017 327958 327590
51263 327590 327021 326922 327887 329760 331691 332853 333014 332418 331331 329828 327903 325601 323105 320821 319242 318500
51247 318500 318148 317648 316998 316624 316747 317221 317872 318457 318285 316521 313252 309667 306818 304618 302563 300945
51231 300945 300615 301772 303749 305947 308224 310318 311638 311961 311809 311780 311949 312175 312561 313209 313891 314311 314465
51214 314465 314456 314318 314377 315396 317819 321042 323953 326086 327752 329181 330200 330816 331467 332381 333139 333236 332823
51197 332823 332561 332871 333650 334624 335683 336806 337766 338035 337051 334752 331787 329058 326973 325307 323754 322389
51181 322389 321490 321158 321262 321562 321718 321320 320144 318345 316310 314401 312913 312084 311899 311973 311847 311436 311092
51164 311092 311238 311990 313099 314241 315375 316794 318696 320753 322414 323658 325086 327010 328813 329609 329416
51149 329416 329210 329823 331181 332688 333976 335029 335778 335884 334967 332957 330238 327456 325178 323691 323057 323212
51133 323212 324007 325296 327069 329335 331778 333777 335004 335781 336625 337658 338798 340267 342349 344658 346253
51118 346253 346682 346539 346757 347669 348954 350135 350837 350837 350245 349626 349647 350554 352062 353681 355056 356103 356979 357922
51100 357922 359092 360587 362513 364849 367325 369624 371679 373527 374948 375667 375931 376416 377352 378138 378095 377279
51084 377279 376246 375390 374856 374802 375282 376002 376564 376860 376949 376721 376079 375381 375302 376265 378251 381057 384448 388164
51066 388164 392144 396732 402313 408821 415883 423413 431716 441032 451273 462155 473232 483838 493363
51053 493363 501583 508355 513143 515361 515245 513860 512195 510624 509289 508345 507576 506321 504174 501350 498113
51038 498113 494340 490026 485695 481737 477770 473322 468892 465642 464099 463693 463500 462830 461188 458480 455512
51023 455512 453610 453339 454043 455036 456770 460277 465791 472524 479702 487186 494952 502558 509450 515493 520850
51008 520850 525517 529327 532357 534987 537469 539644 541220 542191 542853 543462 544015 544376 544553 544865 545871 548109
50992 548109 551799 556761 562650 569321 576991 586049 596717 608912 622415 637166 653318 671030 690250
50979 690250 710782 732491 755401 779602 805162 832072 860155 889146 919066 950662 985349
50968 985349 1024639 1069566 1120432 1176711 1237249 1301009 1367914 1438687 1513558 1591311 1669864
50957 1669864 1747665 1824269 1899739 1973838 2045643 2113517 2175386 2229466 2274934 2311910 2340868
50946 2340868 2362352 2377049 2385708 2388863 2386951 2380777 2371580 2360549 2348532 2336169 2323808 2311121
50934 2311121 2297239 2281612 2264449 2245967 2225460 2201525 2173116 2140055 2102602 2060921 2015033
50923 2015033 1964938 1910631 1852183 1790046 1725211 1658936 1592356 1526400 1461999 1400118 1341467
50912 1341467 1286346 1234962 1187810 1145430 1107739 1073891 1042911 1014249 987666 962996 940325
50901 940325 920001 902030 885690 870280 856053 843883 834120 826325 820049 815155 811318 807990 805127
50888 805127 803331 802882 803175 803552 804208 805775 808415 811841 816001 821179 827581 835236 844250 854765 866685
50873 866685 879680 893437 907837 923084 939785 958635 979828 1003027 1028047 1055155 1084507
50862 1084507 1115783 1148860 1184532 1224157 1268830 1319227 1375921 1439414 1510178 1589023 1677037
50851 1677037 1774699 1881440 1996695 2120997 2255322 2399622 2552694 2713242 2880206 3052143
50841 3052143 3227179 3403682 3580191 3754400 3922801 4081559 4227333 4357272 4468845
50832 4468845 4559946 4628943 4674844 4698101 4701234 4687959 4661541 4624558 4580100 4532154 4484390
50821 4484390 4439224 4398272 4362858 4333444 4309129 4288089 4267970 4245567 4216858 4178106 4126620
50810 4126620 4060281 3977241 3876826 3760242 3629710 3487279 3335012 3175668 3012229 2847025
50800 2847025 2682180 2520714 2366216 2221325 2087173 1964278 1853179 1754078 1666583 1590210
50790 1590210 1524615 1469043 1421962 1381651 1346994 1317538 1292984 1272790 1256071 1241714 1228770
50779 1228770 1216885 1206273 1197170 1189337 1182109 1174809 1167048 1158699 1149712 1140092 1130097 1120249 1110873
50766 1110873 1101653 1091963 1081633 1071033 1060381 1049513 1038574 1028365 1019542 1011862 1004785 998602
50754 998602 994380 992886 994065 997537 1003079 1010555 1019850 1031152 1045126 1062638 1084319 1110235 1139825
50741 1139825 1172361 1207724 1246697 1290313 1339043 1392797 1451460 1515098 1583792 1657574 1736395
50730 1736395 1819807 1906838 1996466 2088097 2181310 2275353 2369181 2461675 2551389 2636426 2715109
50719 2715109 2786526 2849805 2903114 2944160 2971607 2985301 2985241 2971328 2944425 2906923 2861916 2812494
50707 2812494 2762048 2714296 2672198 2637053 2608944 2587572 2572232 2561574 2554034 2548207 2542214 2533089
50695 2533089 2517507 2493208 2459266 2415160 2360206 2293994 2216930 2130244 2035971 1937227 1838065
50684 1838065 1742391 1652658 1569699 1493810 1425799 1366719 1316719 1274604 1238764 1208250 1182777
50673 1182777 1162131 1146155 1135061 1129060 1127620 1129640 1134315 1141225 1149579 1158206 1166702 1175828 1186265
50660 1186265 1197518 1208624 1219486 1230839 1243192 1256433 1270317 1284726 1299559 1314880 1331132
50649 1331132 1348688 1367211 1385987 1405021 1425362 1448237 1474169 1502982 1534301 1567819 1603342
50638 1603342 1640836 1680374 1721888 1764904 1808520 1851645 1893420 1933547 1972102 2008926 2043300
50627 2043300 2074318 2101469 2124773 2144584 2161358 2175328 2186026 2192197 2192459 2186175 2173791 2156746
50615 2156746 2137289 2118019 2101051 2087476 2077575 2071274 2068121 2067208 2067509 2068129 2067973 2065418 2058877 2047564
50601 2047564 2031265 2009478 1981285 1946087 1904078 1856013 1802926 1745989 1686196 1624093 1560229
50590 1560229 1495904 1433001 1373038 1316717 1264421 1216538 1173154 1133906 1098427 1066631 1038430
50579 1038430 1013626 992271 974668 960722 949700 940964 934535 930611 928983 929460 932466 938502 947082
50566 947082 956926 967315 978741 991980 1006997 1023128 1039960 1057607 1076212 1095631 1115645 1136094
50554 1136094 1156650 1176804 1196403 1216079 1236738 1258606 1281051 1303397 1325527 1347605 1369639
50543 1369639 1391719 1414352 1438111 1463085 1489169 1516901 1547594 1582538 1622389 1667306 1717252
50532 1717252 1772023 1831323 1895006 1962945 2034537 2108736 2184847 2263206 2344845 2430602 2520482
50521 2520482 2613503 2707918 2801744 2893298 2981141 3063569 3138492 3203932 3258355 3300493 3329233
50510 3329233 3343912 3344374 3330611 3302811 3262074 3210626 3150861 3084482 3013048 2938976 2865340 2794836
50498 2794836 2729586 2671802 2623797 2587016 2561508 2546522 2541157 2544242 2554146 2569134 2587539 2607181
50486 2607181 2624886 2637066 2640760 2633854 2614561 2581332 2533495 2471692 2397529 2313004 2220395 2122331
50474 2122331 2021513 1920304 1820766 1725020 1635150 1552472 1477092 1408477 1346445 1291369 1243448
50463 1243448 1202149 1166508 1135733 1109355 1087013 1068478 1053863 1043509 1037542 1035658 1037418 1042709
50451 1042709 1051843 1065092 1082067 1101554 1122193 1143464 1165920 1190365 1216894 1244794 1273124
50440 1273124 1301065 1327884 1352960 1375837 1395844 1411607 1421486 1424906 1423098 1418132 1411334 1403009
50428 1403009 1393573 1384346 1376815 1371405 1367475 1364504 1362801 1362946 1365000 1368760 1374597 1383459 1395928 1411758
50414 1411758 1430657 1453141 1480139 1511801 1547161 1585068 1625100 1667380 1711765 1757509 1803611
50403 1803611 1849182 1893363 1935159 1973572 2007851 2037384 2061287 2078389 2087850 2089661 2084243 2071569
50391 2071569 2051018 2022116 1985111 1940753 1890044 1834535 1776502 1718286 1661539 1607485 1557708
50380 1557708 1514048 1477666 1448678 1426765 1411648 1402825 1399465 1400952 1407078 1417186 1429417 1441404
50368 1441404 1451597 1459352 1463793 1463302 1456430 1442911 1423451 1398853 1369764 1337127 1302393 1266994
50356 1266994 1231661 1196316 1160548 1124144 1087183 1049800 1012174 974962 939614 907857 880648
50345 880648 857747 838388 822141 808949 798587 790544 784518 780717 779496 780799 784116 788940 795109
50332 795109 802642 811240 820029 828000 834845 841308 848528 857105 866935 877795 889700 902530 915693
50319 915693 928470 940634 952540 964646 977050 989376 1000963 1011309 1020440 1028737 1036309 1042798
50307 1042798 1048058 1052781 1058073 1064544 1072201 1081163 1091997 1105219 1120922 1139157 1160308 1184708
50295 1184708 1211987 1241078 1270835 1300479 1329411 1356682 1380503 1398078 1405951 1401060 1382241 1351402
50283 1351402 1313340 1273789 1236906 1204248 1175896 1152007 1132892 1118153 1106749 1098069 1092188 1088839
50271 1088839 1086903 1085492 1084994 1086406 1089877 1094540 1099604 1104998 1110924 1117324 1123927 1130472 1136799 1142987
50257 1142987 1149407 1156330 1163503 1170464 1177246 1184339 1191768 1198580 1203480 1205830 1205770 1203553 1199061 1192112
50243 1192112 1183148 1173452 1164517 1157120 1151084 1145837 1140947 1136028 1130559 1124188 1116952 1108831 1099177 1087095
50229 1087095 1072378 1055668 1037713 1018918 999679 980616 962188 944353 926925 910049 894078
50218 894078 879157 865133 851818 839207 827502 816975 807692 799336 791484 784105 777613 772370 768310
50205 768310 765078 762298 759624 756815 753915 751121 748339 745134 741295 737206 733378 729813 726096 721950
50191 721950 717361 712343 706976 701675 696957 692732 688207 682747 676715 671142 666693 663198 660144 657209
50177 657209 654108 650330 645557 640336 635848 632788 630736 628809 626669 624635 623034 621854 620982 620524 620835
50162 620835 622294 624931 628165 631171 633811 637037 642055 649244 658164 668414 679989 692974 707437
50149 707437 723672 742047 762530 784702 808217 832737 857413 881048 903026 923666 943612
50138 943612 963329 983197 1003302 1022826 1040333 1055084 1067452 1077501 1083801 1084408 1078687 1067482
50126 1067482 1051866 1032532 1010397 986982 963875 942097 922084 903984 887942 874241 863046
50115 863046 853915 845880 838347 831569 825892 820963 816222 811838 808385 805779 803374 801085 799619 799332
50101 799332 799563 799451 798863 798140 797351 796206 794499 792399 790468 789520 790200 792532 796085 800654 806484 813809
50085 813809 822477 832088 842115 851842 860677 868826 877228 886499 896204 905441 913850 921710 929338 936733
50071 936733 943666 949685 954132 956485 956751 955367 952795 949388 945528 941584 937704 933738 929337 924077
50057 924077 917698 910502 903473 897768 893906 891474 889592 887701 886055 885495 886661 889395 893080 897567
50043 897567 903461 911321 920845 931150 941772 953094 965780 980002 995230 1010601 1025405 1039324
50031 1039324 1052373 1064762 1076858 1089122 1101789 1114526 1126557 1137219 1146251 1153523 1158759 1161721
50019 1161721 1162508 1161548 1159393 1156613 1153602 1150187 1145466 1138242 1127559 1112824 1093737 1070505 1044033
50006 1044033 1015533 985908 955789 926170 898590 874420 854078 837081 822765 810878 801570
49995 801570 794946 790636 787789 785533 783405 781228 778628 774924 769558 762516 754249 745279 735887 725943
49981 725943 714934 702474 688992 675730 663738 652992 642837 633147 624544 617381 611098 604947
49969 604947 598930 593587 589103 585161 581567 578508 576129 574286 572843 571775 570869 569696 568162 566800
49955 566800 566345 567260 569817 574177 579959 586001 591046 594676 597324 599474 601155 602159 602471 602430 602538 603004
49939 603004 603399 602948 601311 598805 595722 591821 586855 581273 575840 570741 565559 560052 554479 549160 544164
49924 544164 539468 535075 530979 527311 524426 522573 521573 521138 521210 521643 521945 522021 522864 525613 530023 534732
49908 534732 539047 543495 548491 553612 558614 564177 570919 578376 585598 592165 597978 602665 605991 608394
49894 608394 610359 611595 611519 610270 608476 606235 603065 598786 593808 588548 583107 577469 571549 565119 558185
49879 558185 551353 545400 540554 536629 533671 531930 531258 531088 531054 531219 531717 532625 534121 536335 539040 541865
49863 541865 544796 548132 552078 556789 562595 569589 577011 583625 588868 593277 597799 603002 608823 614574
49849 614574 619229 622219 623928 625041 625581 625149 623900 622468 620863 618294 614338 609580 604791 600142 595568
49834 595568 591252 587281 583343 579315 575831 573758 573338 574163 575728 577618 579416 580868 582089 583377 584965
49819 584965 587095 590076 593997 598557 603335 608093 612691 616968 620854 624327 627159 629012 629998 630723 631483
49804 631483 631732 630653 628077 624533 620643 616772 613137 609897 607082 604532 601796 598169 593160 587083
49790 587083 580842 574936 569039 562786 556594 551292 547205 544068 541694 540254 539863 540236 540875 541473 542065
49775 542065 542864 544027 545611 547813 551010 555263 559888 563956 567314 570629 574307 577900 580914 583667
49761 583667 586847 590413 593474 595161 595283 594239 592577 590574 588067 584789 580924 577107 573736 570665
49747 570665 567814 565699 564942 565476 566563 567448 567708 567316 566702 566581 567349 568776 570513 572588 575165 578179
49731 578179 581637 585848 590860 596011 600673 605123 609991 615000 619108 621986 624663 628484 633956 640794
49717 640794 648521 656648 664612 671931 678354 683741 687842 690229 690325 687634 682221 675018 667458 660789 655661
49702 655661 652142 649888 648575 648377 649738 652446 655399 657710 659561 661343 662489 662107 660583 659443 659523
49687 659523 660217 660836 661882 664460 669057 675341 682696 690524 698491 706884 716434 727490 739690 752626
49673 752626 766346 780824 795297 808442 818896 825394 827045 824076 818096 811173 804737 799513 796022
49660 796022 794665 795491 798307 802749 807829 811696 812420 809112 802051 791970 779620 765917 751957 738743
49646 738743 727062 717567 710669 706309 703998 703073 702876 702946 703275 704207 705744 707076 707145 705652 703215 700511
49630 700511 697531 693772 688983 683565 678198 673125 667955 662363 656824 652258 648920 646163 643552 641722
49616 641722 641633 643242 645412 647017 647691 647640 647237 646858 646762 646950 647318 647870 648585 649206 649464 649486 649659 650188 651142
49597 651142 652801 655419 658559 661194 662735 663598 664481 665445 666134 666662 667741 669765 672186 674029 674903 675229
49581 675229 675550 675932 676244 676710 677780 679486 681336 683055 685087 688058 692031 696608 701607 707186 713387
49566 713387 719986 726898 734311 742217 750102 757351 763758 769391 774136 777661 779876 781113 781716 781607 780460
49551 780460 778244 775387 772408 769575 767066 765246 764569 765271 767315 770551 774663 779056 783177 787039 791195
49536 791195 796100 801786 808170 815335 823305 831920 841226 851689 863744 877285 891864 907187 923240
49523 923240 940230 958673 979217 1001841 1025299 1047661 1067242 1082780 1093218 1098129 1098527 1096641
49511 1096641 1094585 1093376 1093172 1093913 1095457 1097377 1098896 1099013 1096665 1091028 1081787 1069095 1053382 1035346
49497 1035346 1015996 996313 976873 958114 940847 926012 913762 903214 893376 884091 875885 869182
49485 869182 863935 859898 856892 854750 853190 851894 850678 849504 848292 846899 845478 844710 845262 846910 848672
49470 848672 849922 850910 851877 852393 852301 852739 855140 859301 863471 866514 869004 871872 874940 877416 879099 880342
49454 880342 881250 881649 881559 881055 879832 877486 874172 870594 867477 865375 864671 865174 865892 865877 865289 865132 865933
49437 865933 867272 868755 870912 874780 880933 889221 899165 910301 922264 934891 948295 962635 977736
49424 977736 992869 1006932 1019017 1029038 1037927 1047065 1057385 1068910 1080840 1091723 1099549 1102388
49412 1102388 1099740 1093447 1086851 1082701 1081914 1084327 1090073 1099602 1112638 1127951 1144532 1162388 1181789
49399 1181789 1202185 1222478 1242052 1260884 1278729 1294865 1308726 1320294 1329801 1337514 1343827 1348999
49387 1348999 1352628 1353921 1352615 1349140 1343734 1336068 1326099 1314729 1303138 1291790 1280549 1269365 1258419
49374 1258419 1247858 1237821 1228542 1220177 1212795 1206740 1202493 1199870 1197856 1195696 1193594 1191801 1189633
49361 1189633 1186179 1181532 1176420 1170886 1164255 1156258 1147301 1137685 1127517 1117410 1108264 1100085 1091896
49348 1091896 1083119 1074324 1066318 1059368 1053698 1049888 1048055 1047253 1046331 1045011 1043602 1042216 1040970 1040516 1041508
49333 1041508 1043682 1046200 1048890 1052504 1057677 1064114 1070834 1076692 1080537 1081389 1078895 1073528 1066204 1057817
49319 1057817 1049157 1040982 1033889 1028061 1023190 1018622 1013710 1008144 1002045 995828 990020 985097 981274 978380
49305 978380 976144 974665 974392 975558 977897 981086 985132 990081 995513 1000725 1005285 1009130 1012168 1014146
49291 1014146 1014980 1014953 1014382 1013227 1011135 1007924 1003981 1000173 997286 995482 994443 994029 994666 997018 1001424
49276 1001424 1007759 1015632 1024489 1033676 1042660 1051218 1059279 1066579 1072526 1076431 1077870 1076994 1074496 1071065
49262 1071065 1066694 1060692 1052582 1042919 1032988 1023808 1015586 1008107 1001376 995784 991767 989480 988755 989259
49248 989259 990430 991266 990511 987482 982705 977318 971807 965695 958596 951099 944357 939203 935993 934842 935509
49233 935509 937285 939588 942579 946774 952282 958963 967092 977071 988343 999404 1009261 1018348 1027584 1037045
49219 1037045 1046124 1054711 1063484 1073021 1083136 1093302 1103340 1113455 1123808 1134316 1144833 1155308
49207 1155308 1165838 1176722 1188498 1201657 1216216 1231756 1247984 1264996 1282686 1300221 1316706
49196 1316706 1332338 1348173 1364531 1380302 1394384 1407181 1419902 1432805 1445149 1456802 1468834
49185 1468834 1482117 1496205 1510221 1524234 1539021 1554805 1571063 1587607 1605228 1624939 1646916
49174 1646916 1670502 1695147 1721168 1749466 1780484 1813511 1847096 1880070 1911892 1941905 1968698
49163 1968698 1990637 2007027 2018521 2026483 2032247 2036946 2041612 2046979 2053194 2059868 2066512 2072921 2079209
49150 2079209 2085634 2092529 2100424 2110002 2121670 2135134 2149563 2164337 2179577 2195830 2213380 2232007
49138 2232007 2251394 2271504 2292425 2313995 2335777 2357384 2378643 2399438 2419667 2439559 2459793
49127 2459793 2480987 2503021 2525189 2547026 2568785 2591062 2614386 2639288 2666345 2695847 2727761
49116 2727761 2762458 2801208 2845493 2896015 2952855 3016472 3087921 3168104 3257379 3356001 3464350
49105 3464350 3582342 3708743 3840781 3973616 4100153 4212858 4307443 4385085 4449898 4502921
49095 4502921 4537824 4542636 4507012 4429897 4321577 4198117 4072434 3949024 3825800 3699985
49085 3699985 3572518 3448351 3333898 3234109 3150801 3082891 3027935 2983502 2947486 2918021 2893711
49074 2893711 2873686 2856937 2841856 2826960 2811949 2797503 2784082 2771449 2759354 2748032 2737697
49063 2737697 2727950 2717966 2707203 2695842 2684676 2674541 2665619 2657300 2648876 2640259 2631779 2623559 2615578
49050 2615578 2608228 2602144 2597355 2593096 2588629 2583817 2578727 2573216 2567214 2561001 2554853 2548681 2542374 2536251
49036 2536251 2530842 2526446 2523229 2521490 2521362 2522343 2523546 2524401 2524821 2524675 2523524 2521049 2517480 2513349 2508871
49021 2508871 2503819 2498092 2492242 2487141 2483053 2479329 2475289 2471258 2468346 2467205 2467380 2467923 2468256 2468252 2467892 2467241
49005 2467241 2466584 2466301 2466651 2467757 2469528 2471379 2472269 2471388 2468782 2465140 2461123 2457094 2453283 2449774 2446309
48990 2446309 2442352 2437423 2431427 2424777 2418327 2412833 2408161 2403203 2396971 2389751 2382844 2377173 2372413 2367521
48976 2367521 2361784 2355332 2348889 2343171 2338317 2333772 2328857 2323505 2318340 2314098 2311131 2309430 2308879 2309432
48962 2309432 2311289 2314991 2321191 2330172 2341631 2354882 2369177 2383924 2398925 2414539 2431394 2449731
48950 2449731 2469068 2488581 2507781 2526805 2546172 2566344 2587404 2609071 2631011 2653135 2675588
48939 2675588 2698557 2722254 2747083 2773655 2802576 2834224 2868687 2905815 2945335 2987078 3031022
48928 3031022 3077042 3124711 3173640 3224009 3276463 3331354 3388264 3446382 3505083 3563989 3622702
48917 3622702 3680808 3738127 3794678 3850287 3904378 3956242 4005513 4052309 4096886 4139165 4178673
48906 4178673 4214969 4248068 4278329 4305981 4330937 4353154 4372940 4390689 4406390 4419617 4430094
48895 4430094 4438092 4444093 4448162 4449870 4448966 4445879 4441342 4435618 4428353 4419181 4408096 4395135 4380067
48882 4380067 4362678 4343124 4321659 4298177 4272348 4244158 4213930 4181866 4147906 4112092 4074741
48871 4074741 4036171 3996454 3955502 3913184 3869401 3824314 3778569 3732968 3687920 3643477 3599915
48860 3599915 3557795 3517297 3477946 3439325 3401750 3365908 3332100 3300236 3270375 3242815 3217645
48849 3217645 3194599 3173456 3154328 3137478 3123032 3110958 3101233 3093945 3089241 3087105 3087170 3088889 3091973
48836 3091973 3096576 3102972 3111201 3121131 3132636 3145524 3159420 3174026 3189438 3205948 3223479 3241433
48824 3241433 3259173 3276516 3293652 3310683 3327388 3343554 3359434 3375674 3392576 3409591 3425835
48813 3425835 3441066 3455786 3470395 3484723 3498622 3512547 3527086 3542170 3557257 3572179 3587378
48802 3587378 3603350 3620237 3637991 3656494 3675423 3694257 3712543 3729981 3746276 3761172 3774641
48791 3774641 3786781 3797457 3806323 3813264 3818555 3822415 3824555 3824291 3821074 3814917 3806402 3796246 3784688
48778 3784688 3771311 3755602 3737586 3717662 3695914 3671953 3645464 3616605 3585722 3552937 3518218
48767 3518218 3481678 3443630 3404433 3364333 3323461 3282101 3241061 3201562 3164399 3129312 3095593
48756 3095593 3063281 3033250 3005997 2980878 2956888 2933800 2912187 2892621 2875289 2860163 2847136
48745 2847136 2836065 2827041 2820537 2817005 2816383 2818290 2822593 2829379 2838381 2848816 2859953 2871548 2883562
48732 2883562 2895742 2907752 2919528 2931207 2942712 2953730 2964211 2974660 2985641 2997036 3008027
48721 3008027 3017909 3026708 3034915 3042837 3050414 3057500 3063913 3069320 3073411 3076319 3078583 3080641 3082568 3084289
48707 3084289 3085737 3086715 3086997 3086732 3086468 3086570 3086882 3087065 3086987 3086616 3085951 3085382 3085705 3087391 3090103 3093256 3096747
48690 3096747 3100579 3104107 3106384 3107368 3108248 3110427 3114534 3120503 3128171 3137637 3149274 3163523 3180447 3199572
48676 3199572 3220567 3244105 3271609 3303951 3340842 3381600 3425996 3473889 3524341 3575551 3625368
48665 3625368 3671254 3709642 3735847 3745092 3733865 3700635 3645785 3571265 3480494 3378413 3271154
48654 3271154 3164839 3064035 2971030 2886400 2810122 2742208 2682734 2631675 2588593 2552249 2520658
$$ [...]
##END NTUPLES=NMR SPECTRUM
##END=
