##TITLE=AC1766_ROS_1_9683598_ZT42BX0wBU
##JCAMPDX= 6.0         $$ Bruker NMR JCAMP-DX V2.0
##DATA TYPE= NMR SPECTRUM
##DATA CLASS= NTUPLES
##ORIGIN= BRUKER
##OWNER= Administrator
$$ 1.72 TOPSPIN		Version 2.1
$$ 2016-04-17 00:03:29.189 -0700  Administrator@X
$$ Compression mode = diff/dup
##.OBSERVE FREQUENCY= 400.02188249412
##.OBSERVE NUCLEUS= ^1H
##.ACQUISITION MODE= SIMULTANEOUS (DQD)
##.ACQUISITION SCHEME= undefined
##.AVERAGES= 8
##.DIGITISER RES= 22
##SPECTROMETER/DATA SYSTEM= spect
##.PULSE SEQUENCE= zg30
##.SOLVENT NAME= COFFEE_meoh
##.SHIFT REFERENCE= INTERNAL, COFFEE_meoh, 1, 14.98509
##AUDIT TRAIL= $$ (NUMBER, WHEN, WHO, WHERE, PROCESS, VERSION, WHAT)
$$ ##TITLE= Audit trail, TOPSPIN		Version 2.1
$$ ##JCAMPDX= 5.01
$$ ##ORIGIN= Bruker BioSpin GmbH
$$ ##OWNER= Administrator
$$ $$ E:\/data/COFFEE/nmr/AC1766_ROS_1_9683598_ZT42BX0wBU/10/pdata/1/auditp.txt
$$ ##AUDIT TRAIL=  $$ (NUMBER, WHEN, WHO, WHERE, PROCESS, VERSION, WHAT)
(   1,<2016-04-17 00:03:22.033 -0700>,<Administrator>,<X>,<go>,<TOPSPIN 2.1>,
      <created by zg
	started at 2016-04-17 00:02:15.736 -0700,
	POWCHK enabled, PULCHK disabled,
       configuration hash MD5:
       21 0F 79 D6 B3 7B B4 F6 88 20 88 DB 03 48 BD 9F
       data hash MD5: 64K
       DF E6 10 A2 96 2B 8B D3 E9 47 47 6D 29 94 AA 99>)
(   2,<2016-04-17 00:03:25.158 -0700>,<Administrator>,<X>,<proc1d>,<TOPSPIN 2.1>,
      <Start of raw data processing
       efp LB = 0 FT_mod = 6 PKNL = 1 PHC0 = 0 PHC1 = 0 SI = 32K 
       data hash MD5: 32K
       CB 96 8A C9 31 B2 B5 17 8C 5B 4C 75 FD 13 A0 C1>)
(   3,<2016-04-17 00:03:25.439 -0700>,<Administrator>,<X>,<proc1d>,<TOPSPIN 2.1>,
      <pk PHC0 = 84.77051 PHC1 = 0 
       data hash MD5: 32K
       36 B1 45 EB F6 B3 CD EE BF 9E D5 7C 34 5D AE 52>)
(   4,<2016-04-17 00:03:25.564 -0700>,<Administrator>,<X>,<proc1d>,<TOPSPIN 2.1>,
      <abs ABSG = 1 
       data hash MD5: 32K
       4F 64 81 46 6F 07 4B CB 70 31 73 C0 EE 05 48 4F>)
(   5,<2016-04-17 00:03:25.626 -0700>,<Administrator>,<X>,<proc1d>,<TOPSPIN 2.1>,
      <abs ABSG = 2 
       data hash MD5: 32K
       7A E8 A0 F0 13 46 6A CB 02 D8 61 DB 2B 39 A7 3E>)
(   6,<2016-04-17 00:03:25.689 -0700>,<Administrator>,<X>,<proc1d>,<TOPSPIN 2.1>,
      <abs ABSG = 3 
       data hash MD5: 32K
       AB 3D E8 79 43 C0 CD 3B B7 2D 1D 19 0F 22 A7 FC>)
(   7,<2016-04-17 00:03:25.751 -0700>,<Administrator>,<X>,<proc1d>,<TOPSPIN 2.1>,
      <abs ABSG = 4 
       data hash MD5: 32K
       CC BF D2 B0 82 3E A7 3F 65 DC 0E F2 CB 09 1B 77>)
(   8,<2016-04-17 00:03:25.798 -0700>,<Administrator>,<X>,<proc1d>,<TOPSPIN 2.1>,
      <abs ABSG = 5 
       data hash MD5: 32K
       07 C5 90 9B 0A 78 F4 0E C5 02 14 FC 9B B2 1C 36>)
$$ ##END=
$$ 
$$ $$ hash MD5
$$ $$ 69 24 60 4E AC 36 A0 AA 45 92 EE 0E 3A 2B 59 79
##$RELAX= 
##$RELAX= 
##$RELAX= 
##$RELAX= 
##$RELAX= 
##$RELAX= 
##$RELAX= 
$$ Bruker specific parameters
$$ --------------------------
##$DU= <E:\>
##$EXPNO= 10
##$NAME= <AC1766_ROS_1_9683598_ZT42BX0wBU>
##$PROCNO= 1
$$ [...]
##$TP= (0..7)
150 150 150 150 150 150 150 150
##$TP07= 0
##$TPNAME0= <>
##$TPNAME1= <>
##$TPNAME2= <>
##$TPNAME3= <>
##$TPNAME4= <>
##$TPNAME5= <>
##$TPNAME6= <>
##$TPNAME7= <>
##$TPOAL= (0..7)
0.5 0.5 0.5 0.5 0.5 0.5 0.5 0.5
##$TPOFFS= (0..7)
0 0 0 0 0 0 0 0
##$TUNHIN= 0
##$TUNHOUT= 0
##$TUNXOUT= 0
##$USERA1= <user>
##$USERA2= <user>
##$USERA3= <user>
##$USERA4= <user>
##$USERA5= <user>
##$V9= 5
##$VALIST= <valist>
##$VCLIST= <CCCCCCCCCCCCCCC>
##$VD= 0
##$VDLIST= <DDDDDDDDDDDDDDD>
##$VPLIST= <PPPPPPPPPPPPPPP>
##$VTLIST= <TTTTTTTTTTTTTTT>
##$WBST= 2048
##$WBSW= 25
##$XGAIN= (0..3)
0 0 0 0
##$XL= 0
##$YL= 0
##$YMAX_a= 527396
##$YMIN_a= -474957
##$ZGOPTNS= <>
##$ZL1= 120
##$ZL2= 120
##$ZL3= 120
##$ZL4= 120
##$ABSF1= 14.98509
##$ABSF2= -5.573092
##$ABSG= 5
##$ABSL= 3
##$ALPHA= 0
##$AQORDER= 0
##$ASSFAC= 0
##$ASSFACI= 0
##$ASSFACX= 0
##$ASSWID= 0
##$AUNMP= <proc_prof1d_extract_pilot.lims>
##$AXLEFT= 0
##$AXNAME= <>
##$AXNUC= <1H>
##$AXRIGHT= 0
##$AXTYPE= 0
##$AXUNIT= <>
##$AZFE= 0.1
##$AZFW= 0.1
##$BCFW= 0
##$BC_mod= 0
##$BYTORDP= 0
##$COROFFS= 0
##$CY= 15
##$DATMOD= 1
##$DC= 0
##$DFILT= <>
##$DTYPP= 0
##$F1P= 0
##$F2P= 0
##$FCOR= 0.5
##$FTSIZE= 32768
##$FT_mod= 6
##$GAMMA= 0
##$GB= 0
##$INTBC= 1
##$INTSCL= 1
##$ISEN= 128
##$LB= 0
##$LEV0= 0
##$LPBIN= 0
##$MAXI= 10000
##$MC2= 0
##$MEAN= 0
##$ME_mod= 0
##$MI= 0
##$NCOEF= 0
##$NC_proc= -8
##$NLEV= 6
##$NOISF1= 0
##$NOISF2= 0
##$NSP= 0
##$NTH_PI= 0
##$NZP= 0
##$OFFSET= 14.98509
##$PC= 1
##$PHC0= 84.77051
##$PHC1= 0
##$PH_mod= 1
##$PKNL= yes
##$PPARMOD= 0
##$PPDIAG= 0
##$PPIPTYP= 0
##$PPMPNUM= 2147483647
##$PPRESOL= 1
##$PSCAL= 4
##$PSIGN= 0
##$PYNMP= <proc.py>
##$REVERSE= no
##$SF= 400.02
##$SI= 32768
##$SIGF1= 0
##$SIGF2= 0
##$SINO= 400
##$SIOLD= 32768
##$SPECTYP= <>
##$SREGLST= <1H.CDCl3>
##$SSB= 0
##$STSI= 32768
##$STSR= 0
##$SW_p= 8223.68421052631
##$SYMM= 0
##$S_DEV= 0
##$TDeff= 65536
##$TDoff= 0
##$TI= <>
##$TILT= no
##$TM1= 0
##$TM2= 0
##$TOPLEV= 0
##$USERP1= <user>
##$USERP2= <user>
##$USERP3= <user>
##$USERP4= <user>
##$USERP5= <user>
##$WDW= 1
##$XDIM= 32768
##$YMAX_p= 443334750
##$YMIN_p= -647104
##$CURPLOT= <Network HP LaserJet P1505>
##$CURPRIN= <$Network HP LaserJet P1505>
##$DFORMAT= <normdp>
##$LAYOUT= <+/1D_H.xwp>
##$LFORMAT= <normlp>
##$PFORMAT= <normpl>
##$SURQMSG= 1
$$ End of Bruker specific parameters
$$ ---------------------------------
##NTUPLES= NMR SPECTRUM
##VAR_NAME=  FREQUENCY,     SPECTRUM/REAL,   SPECTRUM/IMAG
##SYMBOL=    X,             R,               I
##VAR_TYPE=  INDEPENDENT,   DEPENDENT,       DEPENDENT
##VAR_FORM=  AFFN,          ASDF,            ASDF
##VAR_DIM=   32768,         32768,           32768
##UNITS=     HZ,            ARBITRARY UNITS, ARBITRARY UNITS
##FACTOR=    0.250966925370066, 1,           1
##FIRST=     8223.43324360094, -118357,      15758
##LAST=      0,             124283,          -98059
##MIN=       0,             -647104,         0
##MAX=       8223.43324360094, 443334750,    0
$$ Real data points
##PAGE= N=1
##DATA TABLE= (X++(R..R)), XYDATA
$$ [...]
19605A00621h1723n312b9133q9063j43944Q5651J5838d3171M9o7737A51629b87423
19592a55368G7433b89270a90r9546d1413A54306g8598D16276a53571A16954E1798
19580F670a92878l35973A1033Q5932E798J03958K6797a02680j62002K7428a2603
19568g1002c2128H6428J7293M530K1222c74528d1764j59678J6115e0118B67181
19556G5623g629q0100d2764q1256D3974a00348A18359B3203b3327A25602k4877
19545A00725a32662E0730c21741e0282j57515h193m0228j46281C978d1112j40375
19534a81487l7078F3200c10547a34559e8505o5690N7552M864o3338A99753a34455
19522b1353B1943a33555K3105l8158k887A23696K3052a99771A59801m607K4000
$$ plain form
19605 100621 -81723 -87035 -29133 -118196 -262140 -176489 -160651 -43171 -43122 -110859 151629 -287423
19592 -155368 77433 -289270 -190 -99736 -41413 154306 -78598 416276 -153571 116954 51798
19580 6670 -192878 -528851 11033 96965 5798 109756 136553 -102680 -264682 -237254 -12603
19568 -71002 -32128 86428 103721 108251 129473 -374528 -41764 -201442 -185327 -50118 267181
19556 75623 -7629 -87729 -42764 -124020 43974 -100348 118359 23203 -23327 125602 100725
19545 100725 -132662 50730 -321741 -50282 -207797 -8193 -48421 -194702 3978 -41112 -181487
19534 -181487 -218565 63200 -310547 -134559 -58505 -124195 -66643 -61779 -125117 199753 -134455
19522 -21353 21943 -133555 -110450 -148608 -151495 123696 146748 -199771 159801 155194 179194
19511A79194a87755e0524j57169C5424d1222F3524b3657F235a89091B18278a19244
19499a34088e5650B18396a31047L5140n8088m0232h3902G4737Q3578C092K32834
19488B35926A0662d8988j86676j59539A81823b29050F636O3243b4149G7655i9784
19476I5073e5776o7286E5669g5314b869A69284e2543A30351o727b4177k96166
19465c20343A53120C8440e6186l26002a59587k74481h5621l59061A02340f5689
19454b5555H3316b93191a00033E9644i4414j14772d068A18978a17238c3700l5360
19443f9060A4369a88099A86676H71a76196q5513B13698a88946f1045K6877l4305
19432f8473D6825i681A1929k788J82773a74066P0833q5400A27089a24868M0948
$$ plain form
19511 179194 -187755 -50524 -207693 35424 -41222 63524 -23657 6235 -189091 218278 -119244
19499 -134088 -55650 218396 -131047 -95907 -153995 -194227 -83902 74737 158315 3092 235926
19488 235926 10662 -48988 -235664 -395203 181823 -229050 6636 69879 -24149 77655 -99784
19476 95073 -55776 -123062 55669 -75314 -2869 169284 -52543 130351 123624 -24177 -320343
19465 -320343 153120 38440 -56186 -382188 -159587 -434068 -85621 -444682 102340 -65689
19454 -25555 83316 -293191 -100033 59644 -94414 -209186 -4068 118978 -117238 -33700 -69060
19443 -69060 14369 -188099 186676 871 -176196 -261709 213698 -188946 -61045 -34168 -68473
19432 -68473 46825 -9681 11929 9141 191914 -174066 -103233 -188633 127089 -124868 -83920
19421h3920K8381l2391l11247A43979b4193o6906A21086J20596a37327O7777r7439
19410a66989D9949B1886a81367a5816a166r3829E6270b24589J6750j14692g0025
19398f6109C2253j2394P6285a8442P228r0455j1064d833p2641D1558A9266b06379
19385A95616b98766N2715e0519C5328R1463B3621a96110A75509c51816B23580
19374a1955j88384m8372Q9528A34835E057g0228r0656F8309a27408m73306a82183
19362d7675B50725g2233C78462a6101j94896h3292H455d16730K05284B05179C4452
19350B7024a61318r1557C092c14687c8088m09717L2453A8886J28476h948o1535
19339g0483A02056K23171n3688K18842i30j47029I6317a41980k68286B54833a46226
$$ plain form
19421 -83920 -55539 -87930 -399177 143979 -24193 -91099 121086 241682 -137327 -69550 -166989
19410 -166989 49949 21886 -181367 -15816 -1166 -94995 56270 -224589 -207839 -322531 -70025
19398 -66109 32253 19859 96144 -18442 -11214 -101669 -112733 -4833 -77474 41558 19266 -206379
19385 195616 -298766 -246051 -50519 35328 126791 23621 -196110 175509 -351816 223580
19374 -11955 -200339 -248711 -159183 134835 5057 -70228 -160884 68309 -127408 -600714 -182183
19362 -47675 250725 -72233 378462 -16101 -210997 -83292 8455 -416730 -211446 205179 34452
19350 27024 -161318 -252875 3092 -314687 -38088 -447805 -415352 18886 147362 -8948 -70483
19339 -70483 102056 325227 271539 490381 -930 -147959 96317 -141980 -410266 254833 -146226
19327D1826Q9761h5292D6631a99996o7169F0905c9188k22842a06879l8224a3972
19315A43075d9596A05879l8741a68706o2936C8255a7296m5986A7715b43240m5786
19304b89026D2358c13543A01628b3652j07998A01126d9022k51234B88615a89974
19293D5579i9461A89249G6773a43030P0172l9281C74637a78949d0837A79910J55612
19282C35522a51071F9211A3799a48265l00506g8704n0211A31159m4313E926e8978
19270E0839a42803A18844e7081k02646e6344G0343h7667r2658C787f0241e256
19258B64870b21267j40016J18692A77850a67796k30179a18867j82809A33344c3236
19247a05213A06179E664K4140L6275j3605a50257f4499j62124A47037h6185k9666
$$ plain form
19327 41826 131587 -85292 46631 -199996 -267165 60905 -39188 -262030 -106879 -145103 -13972
19315 143075 -49596 105879 67138 -168706 -231642 38255 -17296 -63282 17715 -243240 -289026
19304 -289026 42358 -313543 101628 -23652 -131650 101126 -49022 -300256 288615 -189974
19293 45579 -99461 189249 76773 -143030 -72858 -112139 374637 -178949 -40837 179910 335522
19282 335522 -151071 69211 13799 -148265 -448771 -78704 -128915 131159 86846 5926 -58978
19270 50839 -142803 118844 -57081 -259727 -56344 70343 -87667 -180325 3787 -60241 -5256
19258 264870 -221267 -361283 -242591 177850 -167796 -397975 -118867 -301676 133344 -33236
19247 -105213 106179 5664 29804 66079 52474 -150257 -64499 -226623 147037 -86185 -115851
19236a15851A15684b18174a4983l60955E1669L38574j24717C1927J07707a23391
19225b76013A18972l9423a6857j84020J1477B16290a72012C30228d09645b0496
19214B08824a50283D9300b7174j87319R9994a3624o5436o9447C29156F3485M4966
19203A08451m6194a02022a9382k4282m6722r1436g2802B47696F4333L0885b91911
19191e0338L138r7359C18425j28079b23700a6816l0017l252f887j16831B83167
19179a45687A28523l3921a30231A15325b08904B30508b65469A36442J6028h106
19168A21303h119I2820L2886f7834j48174D9982a99663k9345L5733A19245b1127
19156a84860P6048j2383A95235a40723q3290j52307h0225j94527J08204A42839
$$ plain form
19236 -115851 115684 -218174 -14983 -375938 51669 390243 265526 31927 139634 -123391
19225 -276013 118972 79549 -16857 -200877 -189400 216290 -172012 330228 -409645 -20496
19214 208824 -150283 49300 -27174 -214493 -114499 -13624 -79060 -148507 329156 63485 108451
19203 108451 62257 -102022 -19382 -43664 -90386 -181822 -72802 247696 64333 95218 -291911
19191 -50338 -47200 -144559 318425 190346 -223700 -16816 -46833 -50085 -6887 -123718 283167
19179 -145687 128523 94602 -130231 115325 -208904 230508 -265469 136442 152470 -8106
19168 121303 -8119 92820 125706 -67834 -216008 49982 -199663 -229008 -193275 119245 -21127
19156 -184860 -108812 -121195 195235 -140723 -224013 -376320 -80225 -274752 -166548 142839
19145a26490e4006a672H0804b63288l2348o9269a33512L4584q0780A14745k2335
19134I2410M0013b86887F8181a96978H2001b77449E9630k1834g6501j24443F2691
19122G0403K00715A05841c2092j27976b4856A8915b998C491a33761F4985f2992
19110A28019a19738A96885a44355o9838p0375a14294A48886p1079b7085j9182
19100d6267j8771o5359a7564j40325H9390h5009a0026j7981j46500A51578b53514
19088H251L14614q9082F7878B8718M9643l7771b18597i6041L9755j2214A2065
19076h7250c3079q4036K2336b9892j323j80556j3946G911J61752R4690E4022a50666
19063c48942A47130b31669p48G07a24145a5653A21129a41108A13610a35707A26852
$$ plain form
19145 -126490 -54006 -1672 80804 -263288 -295636 -364905 -133512 -98928 -179708 114745 92410
19134 92410 132423 -286887 68181 -196978 82001 -277449 59630 37796 -76501 -200944 62691
19122 70403 271118 105841 -32092 -160068 -24856 18915 -2998 3491 -133761 64985 -62992
19110 128019 -119738 196885 -144355 -214193 -284568 -114294 148886 77807 -27085 -46267
19100 -46267 -65038 -130397 -17564 -157889 89390 -85009 -10026 -28007 -174507 151578 -253514
19088 8251 322865 233783 67878 28718 78361 40590 -218597 -96041 -56286 -68500 12065
19076 -87250 -33079 -117115 -94779 -29892 -31215 -211771 -225717 7911 169663 264353 54022 -150666
19063 -348942 147130 -231669 -232417 707 -124145 -15653 121129 -141108 113610 -135707 126852
19051A34624o5297Q6152g138A36K45228b99568e0512n3252j53918D6296e223k41642
19039b46865F6824a95980c8027B868K04358a05265Q608k72396E42545A41644E9396
19027A19174D1192Q0528J16997B8907a4636j92723A2118K49197P2700a73958A531
19015e4258H3958b68890d5499r6712F6808c6226f450j21001A72687a78132Q523
19004a69609F2642a40275A66932G7379a61226P0896C05956a94978G1873b11185
18993c14783A46952b16923A265g1159a4570G6359a94798l410l0745A26295f2534
18981g0253F8745f427j62375G4490j8530K12948a32404b8826A01647a04080M0988
18970f3092C2797a390A01289i2596j74316R2694L2161C60294C0818b421q7822
$$ plain form
19051 134624 69327 155479 -7138 136 245364 -299568 -50512 -103764 -257682 46296 -5223 -246865
19039 -246865 66824 -195980 -38027 2868 207226 -105265 -96657 -369053 542545 141644 59396
19027 119174 41192 121720 238717 28907 -14636 -207359 12118 261315 334015 -173958 1531
19015 -54258 83958 -268890 -45499 -142211 66808 -36226 -6450 -127451 172687 -178132 -169609
19004 -169609 62642 -140275 166932 77379 -161226 -90330 305956 -194978 71873 -211185
18993 -314783 146952 -216923 1265 -71159 -14570 76359 -194798 -198208 -228953 126295 -62534
18981 -70253 68745 -6427 -168802 74490 55960 268908 -132404 -28826 101647 -104080 -63092
18970 -63092 32797 -1390 101289 -92596 -266912 -174218 -142057 360294 30818 -2421 -90243
18959i0243j36490A42735a21332m0722K7413k43039J77287g1520G0901a86725
18948B7594J13933k8428D956R0873J8133d1748j58876b5091j70791j26014A7468
18936d1882j98465G8949M3370f604p3099k32559E4276c1637l28831J77943P4588
18925a07937p1391g8557B46431b75359a04206C01771a88664A09540D103a99790
18914B2074i9910A88838i8827j5610F2102a57959g3523H325Q7274b88686j31165
18903d19851N7256B55609A05036d9757A36279m5337Q2788n5496D4217L9848f9
18891e3399p0924J955L1947j6395n4006L7400B7931C910a65105b0757j98606q88
18879b20251P1945k44390J29710A20264i958B571b47536B49206f0946j24913R328
$$ plain form
18959 -90243 -226733 142735 -121332 -162054 -134641 -377680 -200393 -71520 70901 -186725
18948 27594 141527 113099 4956 95829 113962 -41748 -200624 -25091 -195882 -321896 17468
18936 -41882 -240347 78949 122319 -6604 -79703 -312262 54276 -31637 -360468 -182525 -107937
18925 -107937 -179328 -78557 246431 -275359 -104206 301771 -188664 109540 4103 -199790
18914 22074 -99910 188838 -98827 -114437 62102 -157959 -73523 8325 95599 -288686 -419851
18903 -419851 -362595 255609 105036 -49757 136279 90942 173730 118234 44217 84065 -69
18891 -53399 -124323 -122368 -90421 -106816 -160822 -123422 27931 3910 -165105 -20757 -219363 -220251
18879 -220251 -148306 -392696 -262986 120264 -9958 2571 -247536 249206 -60946 -185859 -176531
18868a76531b133B95214e7333B8463b12167B46403F2093P5662c4837j2506j59126
18857b06469O9230l747k40512a44579E4140L4785a11433B02517G0851g8945A10269
18845a53705N7026B52859a22043F7936M0583a04192b0248o6070j91526f4032C8244
18833d07896H2879f6D95221i2613A83736A822c20210c1946o1777C9762b09402
18821A30875K08939j04598a93910J2380f7750E77h1951A57981b62966A04838J82815
18810B87653G4869J9037c20929H9751a12084G0690c00310a9548j32345e4427G6743
18798c9650j22653r9791p6336B3561b29803J04892I2616b17650A62388F9631J0515
18787H0146K34095c63931a36348C158J90639L5886a47622b949B45352K10451A51569
$$ plain form
18868 -176531 -2133 295214 -57333 28463 -212167 246403 62093 137755 -34837 -47343 -206469
18857 -206469 -137239 -140986 -381498 -144579 54140 88925 -111433 202517 70851 -78945 110269
18845 -153705 -96679 252859 -122043 67936 108519 -104192 -20248 -86318 -277844 -64032 38244
18833 -407896 82879 -66 495221 -92613 183736 1822 -320210 -31946 -93723 39762 -209402
18821 130875 339814 235216 -193910 -181530 -67750 577 -81951 157981 -262966 104838 287653
18810 287653 74869 93906 -320929 89751 -112084 70690 -300310 -19548 -151893 -54427 76743
18798 -39650 -162303 -262094 -338430 23561 -229803 -124911 92616 -217650 162388 69631 80146
18787 80146 314241 -363931 -136348 3158 193797 229683 -147622 -2949 245352 455803 151569
18775a4033o5793F4513R0625c8823D2094k0602J58996b31938d6692C8541a59824
18763d973A9259P2870b71012B45606a39157j66902b7543A06037h100j06377A752
18751B71697b32035M8133Q4283d7358A93485a26070C7789b17943A1373d29625
18740a48402l35727H1881A1426e48A741b20598A35915D3138a54887j7066Q4590
18729h7363j81056Q0453N0897A26356m2489a50968o8042d8263m7199j31547Q1999
18718a45010G4412B0689J0340L5896K64843g3278m3285A14945i6268c9147j95877
18707b35024P7274P021j44684F0459a52126A21200a51050B06666m8486c50513
18696e607l17987A05284j553j4689c66201J68163i2518c8517A38663k0282e4315
$$ plain form
18775 -14033 -79826 64513 155138 -38823 42094 21492 180488 -231938 -46692 38541 -159824
18763 -4973 19259 92129 -271012 245606 -139157 -306059 -27543 106037 -8100 -114477 1752
18751 271697 -232035 -183902 -99619 -47358 193485 -126070 37789 -217943 11373 -429625
18740 -148402 -484129 81881 11426 -548 1741 -220598 135915 43138 -154887 -171953 -87363
18729 -87363 -268419 -187966 -137069 126356 83867 -150968 -219010 -48263 -95462 -227009 -145010
18718 -145010 74412 20689 31029 66925 331768 -73278 -116563 114945 -96268 -39147 -235024
18707 -235024 -157750 -150729 -295413 60459 -152126 121200 -151050 206666 158180 -350513
18696 -5607 -323594 105284 103731 89042 -366201 -198038 -92518 -38517 138663 118381 -54315
18684C5925I939J69666F6419a73681N8648H6838N1185a41086f7319k8148d7510
18672a04386k62090A82296a35209j20610i7588G5911j1070a30440m7488a9695
18661d1876j73203j18193Q2939i0717K3285B15983G1248b11872d9988k27829J32133
18650a45684O3155j59361n87K0216f9413H6091c6901C2021R7621b70135d6867
18638A07975a33761L2164d6103A8376b45699C9030a72881A17562b55016H4441
18627A38956d21712J59518A32815b99206B2312g5158j93429d875j23857d9845
18616B41565a78478I8702f0080A61504a04008M7491q1334j12134n472N3022j56958
18605c59393C53719a71712H4665a07337M9207D8156c954j16757l20385a69893
$$ plain form
18684 35925 9939 179605 66419 -173681 -115033 86838 138023 -141086 -67319 -95467 -47510
18672 -104386 -366476 182296 -135209 -255819 -97588 75911 64841 -130440 -177928 -19695
18661 -41876 -215079 -333272 -250333 -90717 -67432 215983 71248 -211872 -49988 -277817 -145684
18650 -145684 -82529 -241890 -242477 -222261 -69413 86091 -36901 32021 129642 -270135 -46867
18638 107975 -133761 -101597 -46103 18376 -245699 39030 -172881 117562 -255016 84441
18627 138956 -421712 -262194 132815 -299206 22312 -75158 -268587 -4875 -128732 -49845
18616 241565 -178478 98702 -60080 161504 -104008 -56517 -137851 -249985 -255457 -202435 -359393
18605 -359393 353719 -171712 84665 -107337 -58130 48156 -3954 -120711 -441096 -169893
18594g7448c916E0573b23345b1217E0278K37258j03794m9190f7812C0240c0252
18582f7182A18715h2270k3838b6352q8918a7183A52744a70203A12698j1546i514
18570a47308k7983j68123R1835i9349F9914M177l6932l488A0154K4313a57828
18558B175K50844c06522L8262b7984A7837J12196a05219c8949r0014c1630a1295
18546c06086A55230e39345a44001K4960o20r1479m2455I592b02603C00788a92637
18534e6969j31727d2382n9385A2786h5352n5816n130A83577B3448i7083B780d8214
18521b2843A22685c9844F7826c04819J45383d6663A63387a97336L0088o2992n319
18510b35559B29747e0069j91704g5163B9628J92247b92496F6981j5899a52936
$$ plain form
18594 -77448 -3916 50573 -223345 -21217 50278 287536 183742 134552 -67812 30240 -30252
18582 -67182 118715 -82270 -106108 -26352 -115270 -17183 152744 -170203 112698 101152 -9514
18570 -147308 -175291 -343414 -251579 -99349 69914 74091 37159 33671 10154 34467 -157828
18558 2175 253019 -306522 -268260 -27984 17837 130033 -105219 -38949 -128963 -31630 -11295
18546 -306086 155230 -539345 -144001 -119041 -119661 -211140 -253595 9592 -202603 300788 -192637
18534 -56969 -188696 -42382 -101767 12786 -85352 -141168 -146298 183577 23448 -97083 2780 -48214
18521 -22843 122685 -39844 67826 -304819 -159436 -46663 163387 -197336 -167248 -230240 -235559
18510 -235559 229747 -50069 -241773 -75163 29628 221875 -292496 66981 51082 -152936
18499f8702B14014a57043A6266d41952a07185j3325k39413D3681g2905A11618
18488i8576B23857f5749j985o7819b1477C1957a1845j27768f4003C142M4028a09129
18475b74753C815K49140c47095A10367d5525A13548c59841C14874a98049M9602
18465a48447C70139A58363J81292a61781D7115R2685F4053a31632k70081N8004
18455c43709b1639A48798b75212f7999k83529g5280k5248j12952d2288E557b80526
18443G8720b16059c1706A03759d4660L509G1488B3229a69684O4830j1932f832
18431a07934H2626b06676Q4542j69171J16531G4949L254K51951A6156K5905a77946
18419H1058A4872c54268B0192a07839P347p5460r702B72224C0288B063Q4302L6099
$$ plain form
18499 -68702 214014 -157043 16266 -441952 -107185 -120510 -359923 43681 -72905 111618
18488 -98576 223857 -65749 -67734 -135553 -21477 31957 -11845 -139613 -64003 3142 47170 -109129
18475 -274753 3815 252955 -347095 110367 -45525 113548 -359841 314874 -198049 -148447
18465 -148447 370139 158363 339655 -161781 47115 139800 64053 -131632 -401713 -343709
18455 -343709 -21639 148798 -275212 -67999 -351528 -75280 -100528 -213480 -42288 5557 -280526
18443 78720 -216059 -31706 103759 -44660 -41151 71488 23229 -169684 -104854 -116786 -6832
18431 -107934 82626 -206676 -122134 -291305 -174774 74949 78203 330154 16156 42061 -177946
18419 81058 14872 -354268 20192 -107839 -100492 -175952 -185654 272224 30288 2063 86365 122464
18407A22464a68258r282B42405e5403A8618P6500H368a20667J9879r2052a8827
18395E6995c16430J47153f399m3675A39078a06090r4545B65582a68625j55942
18385c24567f8168j9122j9108B81373I9485k8063J17301J20410r7903q3794a70186
18373A5667c39622A94596M5383a20446F2878M3061c19873A47152J2965p9251l2771
18362D8095i883j39222j2539f9338j92874A12639m9505c0206N260A26103b65461
18350a75709b8657B06628c45704a72222B05587a59567B0063b59319R4495A26277
18339I0320l7953b29676A19968J03285h3271j60618I5752b12873n2754J32606
18329a33021a7097l27l8840o4161D9063b27059h3315K2454A02612b67321a13313
$$ plain form
18407 122464 -168258 -177540 242405 -55403 18618 95118 8368 -120667 -100788 -192840 -18827
18395 56995 -316430 -169277 -6399 -50074 139078 -106090 -200635 265582 -168625 -324567
18385 -324567 -68168 -87290 -106398 281373 99485 71422 188723 309133 211230 127436 -170186
18373 15667 -339622 194596 239979 -120446 62878 105939 -319873 147152 160117 80866 48095
18362 48095 -9883 -149105 -161644 -69338 -262212 112639 63134 -30206 -24946 126103 -265461
18350 -175709 -28657 206628 -345704 -172222 205587 -159567 20063 -259319 -164824 126277
18339 90320 52367 -229676 119968 223253 -83271 -243889 95752 -212873 -265627 -133021
18329 -133021 -17097 -17424 -56264 -120425 49063 -227059 -83315 -60861 102612 -267321 -113313
18317a39409o2383L9611j3986A68787d05925A40957j284b86913b8979F4774J23452
18306A88226a4463I8677J97888A15494a5076l93159e9890l7939m3370d6403n5531
18295a01934c6542k9158K1707A2756J937M4176a04748B1668g3605l916k37478
18284c14999a27018A2575c22208A26209F0909a82753l0969A54903a07704c1360
18273A07054P023B7304M581B74i805j9035o4162m809k22624M5041a26273E921
18260i6361j57718b5402k52077P075J32151j9563A75310p8478a16975B7936K00255
18249B28191a99536A80698i8742C01059a46874c2835j35350P9580c7177m56296
18239d93473c1534k43981A66986b63813k0101Q1639F368b95251A04543d29187
$$ plain form
18317 -139409 -201792 -162181 -176167 168787 -405925 140957 139673 -286913 -28979 64774 188226
18306 188226 -14463 98677 296565 115494 -15076 -408235 -59890 -97829 -141199 -46403 -101934
18295 -101934 -36542 -65700 -43993 12756 14693 58869 -104748 21668 -73605 -77521 -314999
18284 -314999 -127018 12575 -322208 126209 60909 -182753 -213722 154903 -107704 -31360
18273 107054 114077 27304 31885 274 -9805 -28840 -93002 -97811 -320435 -275394 -126273 5921
18260 -96361 -254079 -25402 -277479 -270404 -138253 -157816 175310 96832 -116975 27936 228191
18249 228191 -199536 180698 -98742 301059 -146874 -32835 -168185 -88605 -37177 -493473
18239 -493473 -31534 -275515 166986 -263813 -283914 -202275 6368 -295251 104543 -429187
18228d2351k23050A75486a69881P8039C8669a22677A2983K42529C5421Q0978J0423
18217A26822a76971C07531A9339c51164A510a41548j68124H5680R4222K79a73438
18205A07088b64126A8440J6957H669A816J08854D8540d4435m1486J5321k72594
18194c43194C20249b48644f1331H6338j5734j9364c62168H5519M3934a36514q191
18183a44705d9029m202k04484r8686a4929B01982a07636F6633a10814A56373A5618
18171a37051B00406e1445H6692a68396B15427a34647a2131B5718J05537f8651
18160b7164G380J76664f9384j85085A17726g5863A95475b68915d4379B97848a82874
18148A08467f1489G2222f8984j83243h1013r1396N6089M5236k7637C23725j13680
$$ plain form
18228 -42351 -265401 175486 -169881 -91842 38669 -122677 12983 255512 35421 116399 126822
18217 126822 -176971 307531 19339 -351164 1510 -141548 -309672 85680 179902 180181 -173438
18205 107088 -264126 18440 35397 8669 1816 110670 48540 -44435 -85921 -70600 -343194
18194 -343194 320249 -248644 -61331 86338 70604 51240 -362168 85519 129453 -136514 -144705
18183 -144705 -49029 -53231 -257715 -356401 -14929 201982 -107636 66633 -110814 156373 15618
18171 -137051 200406 -51445 86692 -168396 215427 -134647 -12131 25718 131255 -68651
18160 -27164 7380 184044 -69384 -254469 117726 -75863 195475 -268915 -44379 297848 -182874
18148 108467 -61489 72222 -68984 -252227 -81013 -172409 -116320 -71084 -98721 323725 210045
18137B10045f929n7729n8611b4333q5012o4101B0851J12417D7127a40198E180
18125b19105e0550p1335l35745a59264j21778c0487m9994I9710e9683G4312K09877
18114B84189a29211G5629N9409b1454l87607a48941G3938D817e2202o214j17442
18103a75858D1874a34063o6012B2863a65750L3169p6340K3567D7705R0577a3346
18091c18033J3399A69237b15348j39173R574H1082K1096b9355B84258r192e0130
18079i3274r3123q0325C34637f6734H8144L1117B7656L876a25666M1083C8083
18067G1665b62305d4112A35148f2454o7736j5068m7421B01941a28645A59263b22737
18055h5797L4457B8973R3523b02062g3848H3130b46012a11360E7749g668A71373
$$ plain form
18137 210045 -6929 -64658 -123269 -24333 -109345 -173446 20851 133268 47127 -140198 5180
18125 -219105 -50550 -121885 -457630 -159264 -281042 -30487 -80481 99710 -59683 74312 284189
18114 284189 -129211 75629 135038 -21454 -409061 -148941 73938 4817 -52202 -58416 -175858
18103 -175858 41874 -134063 -200075 22863 -165750 -132581 -208921 -185354 47705 138282 -13346
18091 -318033 -304634 169237 -215348 -354521 -344947 81082 102178 -29355 284258 275066 -50130
18079 -93274 -186397 -266722 334637 -66734 88144 119261 27656 31532 -125666 -84583 38083
18067 71665 -262305 -44112 135148 -62454 -130190 -145258 -192679 201941 -128645 159263 -222737
18055 -85797 -51340 28973 122496 -202062 -73848 83130 -246012 -111360 57749 -7668 171373
18043g9542B5110J51285a05990J7380b1583p2181G651J67358q6317N4816a60184
18031A83908o4323l7227a0856F0830c5186K965A88185m8959a57166E0127a08367
18019d8465A52952k6706G606J21519K4493j4484h3186A39408B5332L4337P923
18008F7592i3783J7523h835A71275b10686g1745F3561k7733K05773Q441b29225
17996e8593M284k31071C79827a33186B40243B9384N2150c8985A63562A9392R9089
17985A18481C457b22873P3189k39667B24154o0217n2896a34981A41559a1810H1334
17973c69567B5623J49675b22163k05876A9823o741b47808q588c801D9959B2106
17961b53496q989A15797d7385l6398J549b636I3519J41331b50870R6023P4390
$$ plain form
18043 -79542 25110 176395 -105990 -88610 -21583 -93764 7651 175009 88692 143508 -160184
18031 183908 119585 82358 -10856 60830 -35186 -32221 188185 139226 -157166 50127 -108367
18019 -48465 152952 126246 7606 129125 153618 139134 -83186 139408 25332 59669 67592
18008 67592 -93783 -76260 -8835 171275 -210686 -71745 63561 35828 241601 250042 -229225
17996 -58593 -54309 -285380 379827 -133186 240243 29384 81534 -38985 163562 19392 118481
17985 118481 3457 -222873 -149684 -389351 224154 163937 111041 -134981 141559 -11810 81334
17973 -369567 25623 175298 -222163 -428039 19823 13082 -247808 -256396 -3801 49959 22106
17961 -253496 -262485 115797 -47385 -83783 -82234 -2636 93519 234850 -250870 -154847 -80457
17950h0457C3453a65324j56556G7460c68960B31669b99862k31790c6670B57953
17939A16868d585j44380n6938F5793h0218A39656a48450a204A59488j3374b30039
17927e3941j1871A51312a85491p0209A95341l6976h8740A02269a55346j1561A65083
17915A3570a65757A8626J72585R3218a8183o422g995A14003b91440c0045A45762
17903a7870m5465K4773j75658h8202B96653A0760K4322b71389g0835I4348a76935
17891b07500H1100J40400F5662N4699m8393h4983C17174j29007b43388B5328P2785
17880I8113P9122m3607m1630b33901j2901O3534k0016e0337j07457A92151C8563
17868f5056G0326a0817k24986J15290c4924m2350K8925C8552J09140C9356d2456
$$ plain form
17950 -80457 33453 -165324 -321880 77460 -368960 231669 -299862 -531652 -36670 257953
17939 116868 -4585 -148965 -205903 65793 -80218 139656 -148450 -1204 159488 146114 -230039
17927 -53941 -65812 151312 -185491 -255700 195341 158365 -88740 102269 -155346 -166907 165083
17915 13570 -165757 18626 191211 284429 -18183 -24605 -7995 114003 -291440 -30045 145762
17903 -17870 -63335 -38562 -214220 -88202 296653 10760 35082 -271389 -70835 94348 -176935
17891 -207500 81100 221500 65662 120361 71968 -84983 317174 188167 -243388 25328 98113
17880 98113 177235 133628 91998 -233901 -246802 -183268 -203284 -50337 -157794 192151 38563
17868 -65056 70326 -10817 -235803 -120513 -34924 -77274 -48349 38552 147692 39356 -42456
17856i2203D31963a072G316M9869a5298l522A07167f7885A8363a51750j42006
17845b93756B3580e56594h1698B12819n4808b89755h7282A50854c43352b8811
17834a56098C8167b01807N8249A13542b53266D9404b19211J7371B4434g3279d748
17822e6306j88613b9454j431j77352d4395A83707a13612L5648a6513l42295a61827
17810e3A09270n4475F317a72262k33960h5486F3981h6664C41144a94856B4575
17798d1553F9620e6413j18016A71604F7148J4057a18730F2259a18854m2067N3560
17787a07361j25434d1983l0896L5217C4286P8552J8642e0106k45650g1134F010
17775a00530B03460f1117J3507A4683a6264B35705n0553a32688A20432N235A7137
$$ plain form
17856 -92203 431963 -1072 7316 57185 -15298 -18820 107167 -67885 18363 -151750 -293756
17845 -293756 23580 -556594 -81698 212819 158011 -289755 -87282 150854 -343352 -28811
17834 -156098 38167 -201807 -143558 113542 -253266 49404 -219211 -201840 24434 -73279 -4748
17822 -56306 -244919 -29454 -30885 -208237 -44395 183707 -113612 -77964 -16513 -358808 -161827
17810 -53 109270 54795 6317 -172262 -406222 -85486 63981 -86664 341144 -194856 24575
17798 -41553 69620 -56413 -174429 171604 67148 81205 -118730 62259 -118854 -160921 -107361
17787 -107361 -232795 -41983 -72879 -37662 34286 112838 131480 -50106 -295756 -71134 6010
17775 -100530 203460 -61117 -47610 14683 -16264 235705 185152 -132688 120432 125667 17137
17763a23495C6186a49897H4407B9594J6876k2845b36836B54138A15056c22397
17752b52146h739j09480L3130A89781h0525A70955p8424J20104p099b19500A58704
17740h2696r8701I8506L033D8258a25388J5231N4946A02346j5380a13757j04405
17729b18162f4829C1966b65315A18290b35435l6889b8014l6335q0442B34175D6178
17717a37939n0897i2449k28605J52118M128B57186i6984B9637a31119b6317B57883
17705G4900N696a03327B20902m8585c27002I7857P9476a30501j32691A78765e3193
17693h9543r8254A00291c9729j70619d8265A76192B7395h6499A60125J922b3316
17681F2458M6989f8487C33828A46266b762A80365J11950p9950D9534J36014c981
$$ plain form
17763 -123495 36186 -149897 84407 29594 46470 23625 -236836 254138 115056 -322397
17752 -252146 -8739 -118219 -85089 189781 -80525 170955 92531 212635 205536 -219500 158704
17740 -82696 -181397 98506 101539 48258 -125388 -110157 -55211 102346 86966 -113757 -218162
17729 -218162 -64829 31966 -265315 118290 -235435 -272324 -28014 -64349 -144791 234175 46178
17717 -137939 -188836 -92449 -321054 -168936 -164808 257186 -96984 29637 -131119 -26317 257883
17705 74900 80596 -103327 220902 172317 -327002 97857 177333 -130501 -263192 178765 -53193
17693 -89543 -187797 100291 -39729 -210348 -48265 176192 27395 -86499 160125 162047 -23316
17681 62458 109447 -68487 333828 146266 -2762 180365 292315 212365 49534 185548 -3981
17669a65272r8066D1341a91632e6414k38944J24194B22200b04191B17979J98103
17659D16082g586A96271K03673B879a44210e6659h837j66116a2893k3253m5817
17648h1963l4749F0306a3936k60886e8075A40459b34206M0212h9766C8488f7538
17636F104b29048J04663B00043I4223H389h0967m5204A61495E4738c84901J33675
17625b51226A09929j9271l2900a14010I1075K50375M9734d5246A61384d8570B87695
17613G2757a13599A81351J64004E5489K5658a42788A78338c2033l8915I7024J30
17602I7154J7523a22270G057h3310k5520I7787O2939o1407a19462K9065C1642
17590B2901j1284b17997Q0942B15475d28779G355M3619g9249L0059A91621g2490
$$ plain form
17669 -165272 -263338 41341 -191632 -56414 -295358 -171164 222200 -204191 217979 416082
17659 416082 -7586 196271 399944 2879 -144210 -56659 -8837 -174953 -12893 -36146 -81963
17648 -81963 -116712 60306 -13936 -274822 -58075 140459 -234206 -193994 -89766 38488 -67538
17636 6104 -229048 -124385 200043 94223 8389 -80967 -126171 161495 54738 -384901 -251226
17625 -251226 109929 90658 57758 -114010 91075 341450 391184 -45246 161384 -48570 287695
17613 72757 -113599 181351 345355 55489 81147 -142788 178338 -32033 -70948 97024 97154
17602 97154 114677 -122270 7057 -83310 -108830 97787 160726 99319 -119462 -90397 31642
17590 22901 11617 -217997 -137055 215475 -428779 7355 50974 -79249 -49190 191621 -72490
17578D5426i7322n3315a196q8423L6868a8214E9886b55321a14226C51458a83534
17566A64188D2060Q7241f2885A3215P2595B123b44070A28646J12441a77736C7239
17554A34450i5189C430J1332a80862j8318A32826a53063A15689g740p2575j06205
17543a86520A68954e6215H7967J1558J18255o6624b32946O9428O867P5760A50060
17531a9236E7981J82594J3663I8558R3043e0801B74626J7717d848B03944i4529
17519c45486e7512E4915b80227C38992k4634n9088A15166J90863I4569J23307
17509B17876E6394C216J45656P404a4897o5706j48533O9994B5199a36390Q398
17498a27992D00148A03439b10255C64063p2093c0278B19994A7846J92069P3752
$$ plain form
17578 45426 -97322 -150637 -1196 -89619 -52751 -18214 59886 -255321 -114226 351458 -183534
17566 164188 42060 129301 -62885 13215 85810 2123 -244070 128646 241087 -177736 37239
17554 134450 -95189 3430 14762 -180862 -199180 132826 -153063 115689 -7740 -80315 -186520
17543 -186520 168954 -56215 87967 99525 217780 151156 -232946 -163518 -156651 -80891 150060
17531 -19236 57981 240575 254238 98558 191601 -50801 274626 292343 -4848 203944 -94529
17519 -345486 -57512 54915 -280227 338992 314358 255270 115166 306029 94569 217876
17509 217876 56394 3216 148872 156276 -14897 -80603 -229136 -159142 25199 -136390 -127992
17498 -127992 400148 103439 -210255 364063 291970 -30278 219994 17846 209915 283667
17488B83667I1836P0673a17949j61944H2712J02763A001J00147L6443L9561C3127
17476A34421a17215A92909a89830C2616a3901j33144E2605a11172c3153C34381
17465B39356E2479B6042M2485c56050B81251a28380A84200C9225c8576C86120
17454a37226B56707K34324B38872D3328N8815M038A4015a36010A25724F2429J87442
17443B49871I2607O5301J6392f295A80443a7854A92012L69339F8371l1495K86703
17432C23579E5829R3028J08472q0945M7728p4565h3076A74476e0480n575G1691
17420I5690K25108q4918l9521r1332N9155J91834J0193j62N1642n8899G3827J25811
17408A99638N7067g3053B6778J74863d8321D08341b4848C06794a49792B73771
$$ plain form
17488 283667 91836 162509 -117949 -279893 82712 185475 1001 101148 137591 177152 33127
17476 134421 -117215 192909 -189830 32616 -13901 -147045 52605 -111172 -33153 334381
17465 239356 52479 26042 68527 -356050 281251 -128380 184200 39225 -38576 386120
17454 -137226 256707 491031 238872 43328 102143 106181 14015 -136010 125724 62429 249871
17443 249871 92607 157908 174300 -6295 180443 -17854 192012 561351 68371 36876 323579
17432 323579 55829 148857 257329 176384 224112 149547 -83076 174476 -50480 -56055 71691
17420 95690 320798 235880 196359 105027 164182 356016 366209 366047 417689 358790 73827 199638
17408 199638 256705 -73053 26778 201641 -48321 408341 -24848 306794 -149792 273771
17397A69768O8212g5826A22307l5571a23993C49402a87970B53839h5798C9787
17386B8303A2508g8598A31887J28821I9746P1301b09212e7032A51920J29675f1006
17374A15715n2688K53310I2276b36864A48309L1137J52352j04361q4252L3408
17364A76593O5804f7390B24593H7216K6645R8956n2086m5175g2378A10092J34901
17353B44993D4650J03551E7228K34971I080J30284a9083a774j77255G2015k6922
17342D5093c1115A45941M6473a29745C75279c19503F0576f5215A72598F4224J64408
17331B28632d105o5777k6400B94798a63731f69B4086a17940j64091f520q8875
17320i5395B65996b0768A31522l8341b30317i0543B33430a16649M2088D3947e6508
$$ plain form
17397 169768 237980 -75826 122307 86736 -123993 349402 -187970 253839 -85798 39787
17386 28303 12508 -78598 131887 260708 99746 171047 -209212 -57032 151920 281595 -61006
17374 115715 63027 316337 92276 -236864 148309 179446 331798 227437 143185 176593
17364 176593 242397 -67390 224593 87216 113861 212817 160731 115556 -72378 110092 244993
17353 244993 44650 148201 57228 292199 9080 139364 -19083 -1774 -179029 72015 45093
17342 45093 -31115 145941 192414 -129745 375279 -319503 60576 -65215 172598 64224 228632
17331 228632 -4105 -69882 -96282 294798 -163731 -669 24086 -117940 -282031 -6520 -95395
17320 -95395 265996 -20768 131522 93181 -230317 -90543 233430 -116649 -74561 43947 -56508
17308A52903E5424J11598C0365a28540c8447j1146m7172o5092A28486C2226a12584
17296B05556o7573N3888q1996J80172R2666n9582e6059C37453j26332a99831A49297
17284B31811f0250F1210e228B07969r3755B5774h1355L8834A99690F8652J57167
17273B25819b71545B29075A9128J53866J04694a47166A26870M1265J3259N7565
17263B38959b48B68202M811P791c8620G8287P6475M21154A87522j1740g1383p5995
17251a47378D27803c35537A93325J0142M9833B9172L73274G0402J56023C066J40448
17240A43514b4187j21480J2358D5026J31965J02752a6114D13887A01048l6396
17230F4652e4273D58842j45451E7299i6945B68630f170D4676K34089p9720J46786
$$ plain form
17308 152903 55424 167022 30365 -128540 -38447 -49593 -96765 -161857 128486 32226 -112584
17296 205556 137983 191871 109875 290047 382713 323131 -56059 337453 211121 -199831 149297
17284 231811 -60250 61210 -5228 207969 114214 25774 -81355 -42521 199690 68652 225819
17273 225819 -271545 229075 19128 172994 277688 -147166 126870 168135 181394 238959
17263 238959 -248 268202 273013 280804 -38620 78287 154762 575916 187522 175782 -71383 -147378
17251 -147378 427803 -335537 193325 203467 253300 29172 402446 70402 226425 3066 143514
17240 143514 -24187 -145667 -133309 45026 176991 279743 -16114 413887 101048 64652
17230 64652 -54273 458842 313391 57299 -96945 268630 -6170 44676 278765 199045 345831
17219C45831d3895G3389J3063a1086m6055A39570j4059g0876D50244A70114J02841
17208B72955i741B35439k5537K33146D7487J65157G6235Q2319j8927b89522C45500
17196B58567I0715l1545J12708R5220R5124j04836o1316a78315D62075B10345
17185D37367H3272J63646J34819C8936M54404C2923K25910h1660C20119M4354
17175C64473A32707K53265g9865G9138K71283J81036B53249A10322J09002D1658
17164C12631n3569D1507K49286A09210N3659j0347N8571G7965j9274J10618J2478
17153A81787R1671H1795J53803a65507E02674j92312b46156A11086L23341Q582
17143D43009L0140J05730e7162l9422B39283J88430A97101q3134M653c6802R326
$$ plain form
17219 345831 -43895 73389 86452 -11086 -57141 139570 125511 -70876 450244 170114 272955
17208 272955 -9741 235439 209902 443048 47487 212644 76235 158554 139627 -289522 345500
17196 258567 90715 59170 171878 267098 362222 257386 196070 -178315 462075 210345
17185 437367 83272 246918 381737 38936 493340 32923 258833 -81660 320119 364473
17175 364473 132707 385972 -79865 79138 350421 531457 253249 110322 219324 41658
17164 312631 259062 41507 290793 109210 162869 152522 211093 77965 58691 169309 181787
17153 181787 273458 81795 235598 -165507 502674 310362 -246156 111086 434427 443009
17143 443009 473149 578879 -57162 -96584 239283 427713 197101 113967 118620 -36802 -27476
17132b7476k6161C72M9577K25239m4073K19645E1986R0998L08057A30195K27144
17121C57339F2667K91429P5773r370A20793O4584J50021C9509J56653J51898j10816
17110B37244K51437A02237K38287j38258J54408j8122A49244J04573j614J13118
17100C65321C2372K47079J53712A906J07631M378J61172K08777j85253L74284
17090F72895l03135D3613K13127k883A10514K21045K05886j33998j15713A37040
17079C55697J767A47631J58453I1654Q816N23234A13525J12357L22366j94845
17069C53403A07535K39778r3575J42529j62770Q5284m8749m9565Q2269n2914J84609
17058D34431j44255J27192j45887J5622J76483B3956N34645j94600H1220K87046
$$ plain form
17132 -27476 -53637 372 49949 275188 231115 450760 51986 142984 451041 130195 357339
17121 357339 62667 354096 429869 420499 120793 185377 335398 39509 196162 348060 237244
17110 237244 488681 102237 340524 202266 356674 338552 149244 253817 252203 365321
17100 365321 32372 279451 433163 1906 109537 113915 275087 483864 298611 672895
17090 672895 369760 43613 256740 253857 110514 331559 537445 403447 287734 137040
17079 355697 357464 147631 306084 91654 100470 623704 113525 225882 548248 353403
17069 353403 107535 347313 253738 396267 233497 318781 270032 220467 302736 249822 434431
17058 434431 290176 417368 271481 287103 463586 23956 558601 364001 81220 368266
17048C68266j23280Q3660j18921I5247L66508j23514K26969A17781M94098j23647
17038D88232B38127Q7568m6928R0673m369J88519j36625K50114B72129L4748J78854
17027D85731P1877j11528o7239p0884K02421p9151L7857P2207j76121K15696K75661
17016H56527D27250J41606N1185j85944J4336j42214L22100J17587k58232L79658
17006H67332l0030C69022j01458L19676j66772J8064J54555j88746L0179J27862
16996E62382K26471j16349k43335O3406j17910K5796p108K17929j59263K07511
16986F59530j31313j01185N54338l84570K99089l9957k69656j29179O7770j83292
16976C41575O92850l19427j92385n4618j9527M02053k90261L5368j90057M43118
$$ plain form
17048 368266 244986 328646 209725 95247 461755 338241 565210 117781 611879 488232
17038 488232 238127 325695 278767 369440 365071 553590 416965 667079 272129 306877 485731
17027 485731 557608 446080 378841 307957 510378 431227 469084 541291 365170 580866 856527
17016 856527 427250 568856 620041 434097 448433 306219 628319 745906 487674 867332
17006 867332 837302 369022 267564 587240 420468 438532 593087 404341 434520 562382
16996 562382 788853 672504 429169 492575 374665 400461 393353 611282 452019 659530
16986 659530 528217 427032 981370 596800 895889 855932 586276 457097 524867 341575
16976 341575 1034425 714998 522613 467995 448468 850521 560260 595628 405571 848689
16966H48689l06591L60706k29387J75414R9217j91850K92446j69139l3539o326
16956H39640Q8833k21341J11596k50226n1544J63288M94273k98606n6908R47n7356
16945G62596o4119K31990N340m61856L61791K34551J384l93516L63715K5277P4214
16934A141367P9489r146m0622j06737K2108n5824k2448q7349K40337l32144K31070
16923A060101L5670J07424l20047L10309J18570K832l49982J64475l4698j37059
16913I57595L21055j41563j46408O55551n55220K74652k77795J43227j75687K10536
16903A265943K3842r5922L3940K14538j38444J52954K98620l85982L5501j18807
16893A286183K19628j5780j73226J62538j73870J27969K53032k64391m8343J79630
$$ plain form
16966 848689 542098 902804 673417 848831 948048 756198 1048644 879505 845966 839640
16956 839640 928473 707132 818728 568502 516958 680246 1174519 875913 819005 819952 762596
16945 762596 698477 930467 935807 473951 835742 1070293 1071677 678161 1041876 1067153 1141367
16934 1141367 1220856 1211710 1171088 1064351 1086459 1030635 1008187 920838 1161175 829031 1060101
16923 1060101 1095771 1203195 883148 1193457 1312027 1314859 964877 1129352 1094654 957595
16913 957595 1278650 1137087 990679 1646230 1091010 1365662 1087867 1231094 1055407 1265943
16903 1265943 1289785 1193863 1227803 1442341 1303897 1456851 1755471 1369489 1404990 1286183
16893 1286183 1505811 1490031 1316805 1479343 1305473 1433442 1686474 1422083 1373740 1553370
16883A553370p1955K36879k06255K34678k91599M58193j53475J55939K67262j80031
16873B003006k62577L30867l32356K81715j41503L6833j16227K62088K21090j2334
16863B270602k78822O6562J35172j87418L01546K08993j99248j88818R9853R1632
16853B320054J73586J64282k93259K8516J39488N5359J28494J35946j56145J09906
16843B806227l78193L75159J44400J072M31654l20020j76114K96932N7003L7817
16833C275937M9008K46714m07889J40423K85754J39070l04733K44406K82026k95429
16823C655287K46578K75438J56009l45968K64717j50989O01721k09636Q5360J69968
16813D748485j2534O4117k782N58913r4428J92058r2258M10779j93195L11989
$$ plain form
16883 1553370 1481415 1718294 1512039 1746717 1455118 1913311 1759836 1915775 2183037 2003006
16873 2003006 1740429 2071296 1738940 2020655 1879152 1915985 1799758 2061846 2282936 2270602
16863 2270602 1991780 2058342 2193514 2006096 2307642 2516635 2317387 2128569 2228422 2320054
16853 2320054 2493640 2657922 2364663 2393179 2532667 2588026 2716520 2852466 2696321 2806227
16843 2806227 2428034 2803193 2947593 2948665 3380319 3060299 2884185 3181117 3238120 3275937
16833 3275937 3324945 3571659 3163770 3304193 3589947 3729017 3424284 3668690 3950716 3655287
16823 3655287 3901865 4177303 4333312 3987344 4252061 4101072 4702793 4493157 4578517 4748485
16813 4748485 4735951 4800068 4797286 5356199 5261771 5453829 5361571 5772350 5579155 5891144
16803E891144j15151L44844j65556K41835L16255J68925K22314Q4765Q9976N55398
16793G634749N8854j37598K41864O2876K97709L75329k0344L53431J16422P17534
16783I700826N7075Q3101N00788J15499J95819N69873L41683K51591N28962L66979
16773A2712196L30142J25662O69214M59973N07824R6580O88134R75430K83786
16764A6848941N44231J072218M91316Q39271Q19742Q66121O55082O96156J329921
16755B4162999R45945J239559J109135J403005R88306J600884J573985J689792
16747C4713610J640851J721367K029686K026172K251566K536609K346504K789536
16739E2055901K980056L379372L147857L927144L678946L981449M906419M565329
$$ plain form
16803 5891144 5775993 6120837 5955281 6197116 6513371 6682296 6904610 6989375 7079351 7634749
16793 7634749 7693603 7556005 7797869 7860745 8158454 8533783 8513439 8866870 8983292 9700826
16783 9700826 9757901 9841002 10341790 10457289 10653108 11222981 11564664 11816255 12345217 12712196
16773 12712196 13042338 13168000 13837214 14297187 14805011 14901591 15589725 16565155 16848941
16764 16848941 17393172 18465390 18956706 19795977 20615719 21481840 22136922 22833078 24162999
16755 24162999 25108944 26348503 27457638 28860643 29848949 31449833 33023818 34713610
16747 34713610 36354461 38075828 40105514 42131686 44383252 46919861 49266365 52055901
16739 52055901 55035957 58415329 61563186 65490330 69169276 73150725 78057144 82622473
16731H2622473N224065N335564N500361N887700O288893O498812O408736O626800
16723A30393404O487381O136611O264594N082160N290600L882265K894620K044624
16715A68476259J163226m44048j553651k174996l071443m412845n216159n792568
16707A46973775o044664o336893o592266o942502o158794o808188n727016o468615
16699I5894837n740642n430993n080454m737979m507777l773089m049975l788828
16691E8785100l158997l353266k769030k475898k761357k346062k175568k101962
16683C7642960j732540j961770j531712j721405j041823j585559j152156j379068
16675B5536927j278903q00117j063231q69832q11919p40606j072316l00157o79435
$$ plain form
16731 82622473 87846538 93182102 98682463 104570163 110859056 117357868 123766604 130393404
16723 130393404 136880785 143017396 149281990 154364150 159654750 163537015 166431635 168476259
16715 168476259 169639485 169195437 167641786 165466790 162395347 157982502 152766343 146973775
16707 146973775 140929111 134592218 127999952 121057450 114898656 108090468 102363452 95894837
16699 95894837 90154195 84723202 79642748 74904769 70396992 66623903 62573928 58785100
16691 58785100 55626103 52272837 49503807 47027909 44266552 41920490 39744922 37642960
16683 37642960 35910420 33948650 32416938 30695533 29653710 28068151 26915995 25536927
16675 25536927 24258024 23457907 22394676 21524844 20712925 19972319 18900003 18599846 17920411
16666A7920411p46735n67465o07939p81439p45888k88869k36113o90673m44316
16657A2810974l43328m86957k80609m87206k34328k84421n90704j03220o14016
16648I386185j16777l25588k14681j63020J4914p07635j54806n1192k79800m57940
16638F929660p7412R943j03068m38138Q1852p7978k16419J7192m92201O0304l2828
16627E660907k26751r7442j8697j21633J69217m48194l38261J98254O1062l97236
16617D441226l9616K6051k74627j0297K8698j03469k03848P0167J22580p03830
16607C353035p5319N11802j42858p8992k56289j11977n3950k6583j74966K81705
16597C225608j22055k66216R5092k21393J68169j48601M0159L43789l63329l45785
$$ plain form
16666 17920411 17173676 16606211 15998272 15216833 14470945 14182076 13945963 13255290 12810974
16657 12810974 12467646 11980689 11700080 11212874 10978546 10694125 10103421 10000201 9386185
16648 9386185 9269408 8943820 8729139 8566119 8581033 7873398 7718592 7667400 7387600 6929660
16638 6929660 6852248 6862191 6759123 6320985 6402837 6324859 6108440 6125632 5633431 5693735 5660907
16627 5660907 5434156 5336714 5318017 5196384 5365601 4917407 4579146 4777400 4838462 4441226
16617 4441226 4401610 4427661 4153034 4142737 4171435 4067966 3864118 3934285 4056865 3353035
16607 3353035 3277716 3789518 3646660 3567668 3311379 3199402 3145452 3118869 2943903 3225608
16597 3225608 3103553 2837337 2932429 2711036 2879205 2730604 2770763 3114552 2751223 2405438
16587B405438J26576j03278k42194L31346k0447p9363j924m13182J81478n407
16577B179043q2338K71471l10890j02394J09205J5378n73233K55013J16013J41180
16567B018448j17323R32l47214L75525l92334L65684l7866p7160N967o1777k50416
16556A482466K02559L05537l37142r2380J08245l13119J32405k42555M3705j9959
16546A269762j17022J43767k4136N2463K96297o44159L37042J49848k01487k22641
16536A039734K55686n3199k26268O8974J67214J84117l62744K76360n6162j51769
16526A141943r8717M1762P9848K0742m42197M85121p6058l83511L33633l3779
16516A068787l25982J20125L09996k93723K61320k42507R6220J56733l96749O9588
$$ plain form
16587 2405438 2532014 2428736 2186542 2517888 2497441 2418078 2416154 2002972 2184450 2179043
16577 2179043 2096705 2368176 2057286 1954892 2064097 2079475 1506242 1761255 1877268 2018448
16567 2018448 1901125 1902057 1554843 1930368 1538034 1903718 1865852 1788692 1794659 1732882 1482466
16556 1482466 1685025 1990562 1653420 1561040 1669285 1356166 1488571 1246016 1289721 1269762
16546 1269762 1152740 1296507 1272371 1324834 1621131 976972 1314014 1463862 1262375 1039734
16536 1039734 1295420 1242221 1015953 1084927 1252141 1436258 1073514 1349874 1293712 1141943
16526 1141943 1043226 1084988 1164836 1185578 743381 1228502 1152444 768933 1102566 1068787
16516 1068787 742805 862930 1172926 879203 1140523 898016 994236 1150969 754220 823808
16506H23808j02999K85097j48523j56214j67080L71685p0414L27616k97597k17650
16496F47729K20708K17905n21450M39813l10880J48820l14600K43597l9244J1728
16486G44126J73092k65608J57189k51967L0858m8443K48651O906j05248j047J15753
16475H04262l07594c92B81455M85640j07158r3380J33930k99150J44895J93888
16465G40120j21966J13608j41550J04208k96863P9082K35172m5804C07179K76215
16455E83394K02770C88241J20260J73988k07518O3941j99486L20734j02458N7518
16445F15220M3776k43911J09141j76957J97776K4853j48961m0112J62815j20574
16435D23066K05672j86018R5611r4640P8183P7452J63782C62598k7881J87823
$$ plain form
16506 823808 720809 1005906 857383 701169 534089 905774 835360 1162976 865379 647729
16496 647729 868437 1086342 564892 1004705 693825 842645 528045 771642 732398 744126
16486 744126 917218 651610 808799 556832 587690 539247 787898 794804 689556 688509 804262
16475 804262 496668 -392 281455 767095 659937 566557 700487 401337 546232 740120
16465 740120 618154 731762 590212 694420 397557 476639 711811 666007 307179 583394
16455 583394 786164 388241 508501 682489 474971 538912 339426 660160 557702 615220
16445 615220 658996 415085 524226 347269 545045 569898 420937 380825 543640 423066
16435 423066 628738 442720 538331 443691 521874 599326 763108 362598 334717 522540
16425E22540k03712R8002A63984L2686J83270L69021k09591k50687L49099o9600
16415E68182j74167L81118k03589j21995A50777K09997J51128j84348L32223C11421
16404A13204K66074N5338j99843J41142i294B81232r53J40505J742L4605f9852
16392B62649o2924M6041H9752N42544j56810j15689J3508J60451a29514B77300
16381C10467j30724K75647J49160k04857j20790k8060l5181J29206L0141A50947
16370A61143J65087j19666F0202P0073J38458p3072n7027L78821j20627E8038
16359A2246M17716q8133j57970Q1039M2720A20826L41060k29924M1781b5302C31611
16347D67383F3007J66547O6251J99065A21144O4025l3308f9201A76546l9720P5034
$$ plain form
16425 522540 318828 416830 163984 196670 379940 748961 539370 288683 637782 568182
16415 568182 394015 775133 571544 449549 150777 360774 511902 327554 659777 311421
16404 113204 379278 434616 234773 375915 -9294 281232 280279 420784 422526 457131 -69852
16392 262649 199725 245766 89752 632296 475486 359797 373305 533756 -129514 277300
16381 310467 179743 455390 604550 399693 278903 250843 215662 344868 375009 150947
16370 161143 326230 206564 60202 130275 268733 195661 138634 517455 396828 58038
16359 12246 429962 341829 183859 264898 307618 120826 461886 231962 273743 -25302 331611
16347 467383 63007 229554 295805 494870 121144 185169 151861 -69201 176546 136826 211860
16336B11860K8207I6564K84165C1285L52446j41234a23105A83288m0015C0169
16325A97032P2598K12391F4354J02389k1354o2148J27273J23141k3091A43019
16314B94613H8492k0577O4111g4606B24449G0083J73155d530A31021a10141A20750
16302h308A44894J1590J3559m2599b033A57205L12704C5420L04871E4927J28752
16291A83679J01487j04707K11666K9111A23286l506l3160K29419j07269K55629
16281D64399a01325q9626A70342A233K59373o8626D8040Q4768Q2368J7573c9669
16269D9720b08154f5019F4378m760J22413a46154O3218A67423K52617b6585C0731
16257D691O1011Q4238g0927A11747J28245J8988A21551d9452C32610r1445b0621
$$ plain form
16336 211860 240067 96564 380729 31285 383731 242497 -123105 183288 143273 30169
16325 197032 269630 482021 64354 166743 145389 83241 210514 333655 310564 143019
16314 294613 88492 67915 132026 -74606 224449 70083 243238 -4530 131021 -110141 120750
16302 -8308 144894 156484 170043 127444 -2033 157205 469909 35420 340291 54927 183679
16291 183679 285166 180459 392125 421236 123286 119780 86620 316039 208770 464399
16281 464399 -101325 -190951 170342 1233 260606 191980 48040 132808 215176 232749 -39669
16269 49720 -208154 -65019 64378 59618 182031 -146154 -82936 167423 420040 -26585 30731
16257 4691 65702 149940 -70927 111747 239992 258980 121551 -49452 332610 241165 -20621
16245e2806H7748J33504C4030P623Q7140l7378K53449j35656Q0153E7029J02306
16234A59335a24809j02526b5957B6595L8109o342K05915l2443J06317j28334a4507
16222i3493E6630K02834j11481m9403D3032f5580B18155K0326D8262c7914H1548
16210c63474a43137a1938A0280d1226G5464J90783J3585b9841r3729C14699a14355
16198E2028M2954J25946J24853H7977i6515H6455J83617b43338A08091f2864C0325
16186C19319a41156B12609F7131K14746A27238f137F6769a87484e8562D5290O107
16175E1397J02120K08930g500j41771C54953D4251b6078B93646F4847M04669F7451
16163B55183p1853a87118F6836J7501i4400A15155E6399b25263F395K52262a33360
$$ plain form
16245 -52806 87748 221252 34030 41653 128793 91415 344864 209208 289361 57029 159335
16234 159335 -124809 -227335 -25957 26595 64704 58362 264277 231834 338151 209817 -14507
16222 -93493 56630 259464 147983 98580 43032 -65580 218155 238481 48262 -37914 81548
16210 -363474 -143137 -11938 10280 -41226 75464 266247 279832 -29841 -123570 314699 -114355
16198 52028 94982 220928 345781 87977 -96515 86455 270072 -243338 108091 -62864 30325
16186 319319 -141156 212609 67131 281877 127238 -6137 66769 -187484 -58562 45290 51397
16175 51397 153517 362447 -7500 -149271 354953 44251 -26078 293646 64847 469516 67451
16163 255183 183330 -187118 66836 84337 -94400 115155 56399 -225263 6395 258657 -133360
16151A20187h9738A83823a15697j12295A36950b48134E5907a71265M2376A39653
16140b59859a1858A02535a58807A97471F249a59449g890j81233a6440D7589J76171
16129B23760C3472K13803o3180f4321B00546o8489d6840o1590p7909A07425J51989
16118B59414e1884A70367a00352C13507F3436K4646b93702C52786C903K26388
16108B30291e0422j34532B13110e6270B7909K91525e7296l12683A25045f268j51848
16097a58116L6747D7270o823a38230B2641P8189K623A6800h7482b5211g780k18959
16085b26739A27759Q69D8492a26015H387J6999c67k42861d9830n3794k54430f0216
16072A52492D7103O7167d7537l0337A22432J41828n8048L1274i527j23025H5692
$$ plain form
16151 120187 -89738 183823 -115697 -227992 136950 -248134 55907 -171265 -128889 139653
16140 -259859 -11858 102535 -158807 197471 6249 -159449 -7890 -189123 -16440 47589 223760
16129 223760 33472 247275 184095 -64321 200546 132057 -46840 -108430 -186339 107425 259414
16118 259414 -51884 170367 -100352 313507 63436 88082 -293702 352786 3903 230291
16108 230291 -50422 -184954 213110 -56270 27909 319434 -57296 -369979 125045 -6268 -158116
16097 -158116 -121369 47270 40447 -138230 22641 100830 103453 16800 -87482 -25211 -7780 -226739
16085 -226739 127759 128628 48492 -126015 8387 25386 -367 -243228 -49830 -103624 -358054 -60216
16072 152492 47103 114270 -47537 -77874 122432 264260 206212 237486 -9527 -132552 85692
16060a75094e1514r7510P207o6709N7651r3956H2637c3549B55505j27427C5538
16048A04455B9454b04732B36725a40805D5501A6476O5868a6854j79046k19293
16038d15193A13183K04172j46560a1962D0752O7949a49455c3181A44331a65078
16027c2939A92268a38282e1214a6289k9961H5603d3330F5834a49486C03079a38236
16015i8396a9878l2578H1948a08777J5238B3640K31605a10431J4997c7690I9421
16003i585A46335a51207g3447F2362K57876a93024J4025C9347K20482A0577L120
15992A3697R7342N5309m0531L52648d2302m9725b1256C22494D6698J93016O7161
15981C06875O6121A48181K17763q116D5290A9690a48613F5052M1128a79669A43001
$$ plain form
16060 -175094 -51514 -149024 -141817 -208526 -150875 -244831 82637 -33549 255505 128078 35538
16048 104455 29454 -204732 236725 -140805 45501 16476 82344 -16854 -195900 -415193
16038 -415193 113183 317355 170795 -11962 40752 108701 -149455 -33181 144331 -165078
16027 -32939 192268 -138282 -51214 -16289 -46250 85603 -43330 65834 -149486 303079 -138236
16015 -98396 -19878 -52456 81948 -108777 -93539 23640 255245 -110431 -95434 -37690 99421
16003 -9585 146335 -151207 -73447 62362 320238 -193024 -178999 39347 259829 10577 13697
15992 13697 111039 166348 125817 478465 -42302 -92027 -21256 322494 46698 239714 306875
15981 306875 372996 148181 365944 357828 45290 19690 -148613 65052 106180 -179669 143001
15969d5006A03074I225J28850m3342a71854B37765N6151b61964e1783k95825a18506
15957A7761c27439i5931E2339K82249A5309J81792a6911k5420B84298B2851c30913
15945a07164B1468a99177H8541J98992b7574o2184k0797A63149a06297m19726
15935e26023g1602k75288A06753a47019H7861K33484d2782j0059B14650j7445
15925A97205d0459A88808B5019a56496j54258L8619J04044a9854j17407H9736
15914A95796a21903B5560o779L7401K54412j34152a89010N543E8045b39793P994
15903b31799g1890j67627k23738c8147A35473d7512k99308J38601A38054K31619
15893C69673j80547m1381d8306H0109c75472i225D584a15734H8535a77835A01215
$$ plain form
15969 -45006 103074 9225 138075 94733 -171854 237765 293916 -261964 -51783 -347608 -118506
15957 17761 -327439 -95931 52339 334588 15309 197101 -16911 -42331 284298 22851 -330913
15945 -107164 21468 -199177 88541 287533 -27574 -89758 -110555 163149 -106297 -526023
15935 -526023 -71602 -346890 106753 -147019 87861 321345 -42782 -52841 214650 197205
15925 197205 -40459 188808 25019 -156496 -310754 -272135 -168091 -19854 -137261 89736
15914 195796 -121903 25560 18781 56182 310594 176442 -189010 -183467 58045 -239793 -231799
15903 -231799 -71890 -239517 -463255 -38147 135473 -47512 -346820 -208219 138054 369673
15893 369673 189126 147745 -48306 80109 -375472 -9225 4584 -115734 88535 -177835 101215
15881I9850a31082k62472D7862a52659k12045d0662n744j34846M3149D228M7131
15870E1359j7218a20722q8877l0335h4989B95965G1238i3046c0695j38007d1734
15858a24877l9367A49706n7800a11243A99718K19920C9214a59894I722d68B84637
15846a25014A65260c39712J68396B23333b12844d4934A85500F8593K1617a55653
15835a95472m857B8425Q5527a04522d2544A38959b26329Q1257B34215a48803J4576
15824a34227n3070j49897i5853A12476c85189C8786F048e3036j8039j52531o157
15813b29763A10566a97569R5779n0198J5103k41593A89109A8140J63574K3766
15803B05480E7996q263f6377o8735K6275A78601B5017R7036O7400C6315P9121
$$ plain form
15881 99850 -131082 -393554 47862 -152659 -364704 -40662 -46406 -181252 -138103 4228 51359
15870 51359 34141 -120722 -209599 -239934 -84989 295965 71238 -93046 -30695 -168702 -41734
15858 -124877 -164244 149706 91906 -111243 199718 419638 39214 -159894 9722 -468 284637
15846 -125014 165260 -339712 -171316 223333 -212844 -44934 185500 68593 90210 -155653
15835 -195472 -200329 28425 113952 -104522 -42544 138959 -226329 -145072 234215 -148803 -134227
15824 -134227 -187297 -337194 -95853 112476 -385189 38786 6048 -53036 -71075 -223606 -229763
15813 -229763 110566 -197569 -101790 -151988 -136885 -378478 189109 18140 181714 205480
15803 205480 57996 49733 -66377 -135112 -108837 178601 25017 122053 189453 36315 115436
15792A15436J03578g1257j83179C44399e3499j5373q4067L7108j42684B4996e4300
15780a79880K4621F91h7659A49084J6267f9155q2294N3623A59567h6906L8333
15769d8573o0770j11934j05474J02732b921j41799b9838k81498a32436a4577A64011
15757A68865p5002J53688q5943K04181j12656a70967A58336d9552i092G2106L51423
15746D23529A85413a1514j10060k98a2173k79840B32308b54466D1214J69325f9762
15734C17092b99506e3794k8034B0690J3212R0498P791F3864c32277f2296J9781
15723d2515j44712E6309c0789n1104j71658G8712J18237b04378o3740L0692K0883
15712b16543Q9104B0423a3435j05278r8203I546h45A21740m5894g9073j32733
$$ plain form
15792 115436 219014 -71257 -254436 344399 -53499 -68872 -152939 -115831 -258515 24996 -54300
15780 -179880 -155259 691 -87659 149084 165351 -69155 -151449 -97826 159567 -86906 -48573
15769 -48573 -109343 -221277 -326751 -224019 -2921 -144720 -29838 -311336 -132436 -14577 164011
15757 168865 93863 247551 161608 365789 253133 -170967 158336 -49552 -9092 72106 423529
15746 423529 185413 -11514 -121574 -121872 -12173 -292013 232308 -254466 41214 210539 -69762
15734 317092 -299506 -53794 -81828 20690 33902 124400 132191 63864 -332277 -62296 -42515
15723 -42515 -187227 56309 -30789 -81893 -253551 78712 196949 -204378 -268118 -237426 -216543
15712 -216543 -127439 20423 -13435 -118713 -216916 9546 -845 121740 75846 -79073 -211806
15701b11806q4897R1388n3529J02815H6285J36000i3518J1051C28914q8665C8509
15689f9630o9269d5039m9460o9309A30415c60514Q5927Q0259G605a52765A3405
15677H7827c05006C25288F6724P1346j864a26164M001C96108j16748a81875A69822
15665A39064l2760a37813E2725R0727b13199c6093p5126c9075B13613b54476B9426
15653b7026N075B51523a83949C32209e1164n1156j9933A28060B9163J57292a41383
15641g3567r2506f8715l9714E4767b8527j49103p5565Q7185B4706d4750I7634
15629G86R003J98546j9832q6767l7097P9298o5487a13413F93J8255R6281K2337
15617A37566m0156B8347K9951a38953A41668a01598M0422A72228a22126B12397
$$ plain form
15701 -211806 -296703 -205315 -258844 -156029 86285 222285 -93518 -82467 328914 240249 38509
15689 -69630 -138899 -45039 -94499 -163808 130415 -360514 -274587 -194328 7605 -152765 13405
15677 87827 -305006 325288 66724 138070 136206 -126164 -122163 396108 279360 -181875 169822
15665 139064 106304 -137813 52725 143452 -213199 -36093 -111219 -39075 213613 -254476 29426
15653 -27026 -21951 251523 -183949 332209 -51164 -102320 -122253 128060 29163 186455 -141383
15641 -73567 -166073 -68715 -108429 54767 -28527 -177630 -253195 -166010 24706 -44750 97634
15629 786 9789 208335 188503 101736 64639 143937 78450 -113413 693 18948 115229 137566
15617 137566 97410 28347 58298 -138953 141668 -101598 -61176 172228 -122126 212397
15606A20770c33035A69861a23723D8296K3416f8228q7033q953A54990b31846a09464
15594B14139b71287e0095D7234a65423E5228J3573h3330I462f8818E8579a47128
15582a21779d9969k88346l1688a10089N2603A86469a59028k2550k04729c9869
15571e22140A9787g1260j17210j09093E0026K46496b86055A36374a10957a3734
15560a26726l1600r7280F6207f8696I0584B5934p52b06551l8686a780B44018H9906
15547E1731L2209B7013c09756O48A3767J05558n2687a6540j67157o1903J0866
15536b34734A1188J10865c09625E0652J16774O740c12712a45146c975j17948n9911
15525a81834C6760a07383C8741a3072m9244o2550E5087a8768A71641c01073A58110
$$ plain form
15606 120770 -333035 169861 -123723 48296 71712 -68228 -155261 -164214 154990 -231846 -109464
15594 214139 -271287 -50095 47234 -165423 55228 68801 -83330 9462 -68818 58579 -147128
15582 -121779 -49969 -338315 -370003 -110089 -57486 186469 -159028 -181578 -386307 -39869
15571 -522140 19787 -71260 -188470 -297563 50026 296522 -286055 136374 -110957 -13734
15560 -126726 -158326 -255606 66207 -68696 90584 25934 25182 -206551 -245237 -1780 244018 89906
15547 51731 83940 27013 -309756 -309108 13767 119325 66638 -16540 -183697 -245600 -234734
15536 -234734 11188 122053 -309625 50652 167426 174166 -312712 -145146 -3975 -121923 -181834
15525 -181834 36760 -107383 38741 -13072 -62316 -124866 55087 -18768 171641 -301073 158110
15513C9981A7660Q0007b75296i9461A36177a25590A26597m4043a11700h460k65976
15502b74436g4338n5576f4426B2003d8511A07309c00187C46560d4269n4507B63291
15490b66610A10729a20550j23131J20703D054c0211j7853b0832j47792C1088J44139
15479A75227n2843g9542n8618n84b9182j55602n1446J0446n5574F2880K3253a47963
15466a08756d0670D4950L9660r188b01732B16950I1927d0815d558l0967A0439
15454A63495Q7421E2369a43281B74649I81K13565g7163A60308p761C0805r622
15443B1183c3677o7278A5518P5231f2233H2016k4154B3077K84749a76330c7406
15431B9969L2101f7080n9458N0993f158B296Q5394i6696b7513I632a13717j02245
$$ plain form
15513 39981 17660 97667 -275296 -99461 136177 -125590 126597 82554 -111700 -8460 -274436
15502 -274436 -74338 -129914 -64426 22003 -48511 107309 -300187 346560 -44269 -98776 263291
15490 -266610 110729 -120550 -243681 -122978 4054 -30211 -48064 -20832 -168624 31088 175227
15479 175227 122384 -79542 -138160 -138744 -29182 -184784 -236230 -225784 -281358 62880 86133 -147963
15466 -108756 -40670 44950 84610 75422 -201732 216950 91927 -40815 -4558 -35525 10439
15454 163495 250916 52369 -143281 274649 981 214546 -77163 160308 152547 30805 21183
15443 21183 -33677 -100955 15518 90749 -62233 82016 57862 23077 307826 -176330 -37406
15431 29969 62070 -67080 -126538 -75545 -6158 2296 87690 -96696 -27513 9632 -113717 -215962
15419b15962A62106e6668j02126g8172B98051E4733a89471B63380b73235f0801
15408f4782C7104a98998j4151c0113o3341A1775J00694J3654g2965a5934C0378
15396a96155o5279a10138N565j87354h5312E2984a97244A78068C647d6061m2225
15385h8286E5435g1389j02125A19833C6233K04581a3798A62910a36285A9173a36554
15373a4910j84681R0638I3295C6653b99208i1510j45599R7104B00147P53J6754
15362B17654i1020j00342A59258a81216O2852A28396D727J4459f3254a3746k55826
15351b69572d8106j24668A32415m1973d4514D05617A4356J01800n1491J30756
15341A95421J20348h1461K7498k00940B1564B767J66490K24332B4034c38126I4450
$$ plain form
15419 -215962 162106 -56668 -158794 -78172 298051 54733 -189471 263380 -273235 -60801
15408 -64782 37104 -198998 -213149 -30113 -93454 11775 112469 126123 -72965 -15934 30378
15396 -196155 -261434 -110138 -104573 -291927 -85312 52984 -197244 178068 3647 -46061 -88286
15385 -88286 55435 -71389 -173514 119833 36233 240814 -13798 162910 -136285 19173 -136554
15373 -14910 -199591 -108953 93295 36653 -299208 -91510 -237109 -140005 200147 200900 217654
15362 217654 -91020 -191362 159258 -181216 -118364 128396 4727 19186 -63254 -13746 -269572
15351 -269572 -48106 -172774 132415 90442 -44514 405617 14356 116156 64665 195421
15341 195421 315769 -81461 -53963 -254903 21564 2767 169257 393589 24034 -338126 94450
15329A662J13564b19402l41403A7306a53230O4235D21281A35986O516K05967A18039
15317A70088p2227r995c7633k12895b4810k14702G9382b67906H9256J78988a5363
15305i5087A85204p3707b08151f5223q9761K0568D346a43491A23855e2768B9892
15293A84545D9605a13217H1716b53250l1248C17909j35634o1615a44701G4461
15282A01478L4104m7192N3028a21272j85517A05946h1715C15336q9323c140C66169
15270B09167E6019a74129O6976j04587C43833G4343M0231L8262b186p1950B46660
15258D9025K39529H0436j300P160O0573C4750q143D691K28288J95650O33163J6744
15246A078536k38535j35147B75073K1958A36564B1357P0239d7776A78722C3042
$$ plain form
15329 1662 115226 -219402 -560805 17306 -153230 -88995 421281 135986 142502 348469 118039
15317 170088 97861 87866 -37633 -250528 -24810 -239512 79382 -267906 89256 268244 -15363
15305 -95087 185204 111497 -208151 -65223 -154984 -134416 4346 -143491 123855 -52768 29892
15293 184545 49605 -113217 81716 -253250 -284498 317909 182275 120660 -144701 74461
15282 101478 135582 88390 141418 -121272 -306789 105946 -81715 315336 226013 -3140 366169
15270 209167 56019 -174129 -107153 -211740 343833 74343 114574 152836 -2186 -74136 246660
15258 49025 288554 80436 79136 86296 146869 34750 26607 4691 232979 428629 1061792 1078536
15246 1078536 840001 704854 275073 297031 136564 21357 91596 -47776 178722 33042
15235B8918a35458A11460C8576K61600c43900f140A09858n0806a01618e890A40088
15223C9785a12841A60772a57766C3957M7671N0171e0080j88218C03921A33049
15212h5757d1964A71561J9202P3216A1667i4571C5454J35109D4700a18196e6993
15200A83137J77141b54077B02655E5864k7167J15882P3048G4740A9602a11973
15189B57062d9929r2293B16553A9552a44689A32243l2166g7751A65112b775k513
15178e288l07992a46200O0074o6310B4208e7867A54053M615e4964B28798A05509
15166h6408H8123M68087F4780K2408P5351i6646I7411F153J28699M9453k4912
15155A59393e7336G5554K41677j11182a10108D00682E515J66541p0948i7466A89370
$$ plain form
15235 28918 -135458 111460 38576 300176 -343900 -6140 109858 59052 -101618 -5890 140088
15223 39785 -112841 160772 -157766 33957 81628 131799 -50080 -238298 303921 133049
15212 -85757 -41964 171561 190763 263979 11667 -94571 35454 170563 44700 -118196 -56993
15200 183137 360278 -254077 202655 55864 28697 144579 217627 74740 19602 -111973
15189 257062 -49929 -142222 216553 19552 -144689 132243 100077 -77751 165112 -2775 -5288
15178 -5288 -313280 -146200 -86126 -152436 24208 -57867 154053 158668 -54964 228798 105509
15166 -86408 88123 556210 64780 87188 162539 -96646 97411 6153 134852 184305 159393
15155 159393 -57336 75554 317231 206049 -110108 400682 5515 172056 101108 -97466 189370
15143A34412L13433e1909A08673J01809n9164n1315c46728F5313N9914N8295K8121
15132B11643a42816H8315A7843J60172d125B44013M069g1l696C20735A10467J26920
15120B37387b4303j28701B4058O4109f4980A72567C3390J65768A1725P2244j5761
15109F8208k6778a46893n5967A6192h781B41485G4712A4114e6269q9795d7612
15097A13431J22987l6338c2278E7864b4825A72610c7960n4994B06015G8230b65209
15085I5926J81690r6472M1817c8528A10839K39904j54448D38b256j4646k46981
15074b63883A0614b90974A83581a7918q573A64209m5598c0011A80315c0788A395
15062B4205K0265a01463B14818A1551b30282I831J87274A6954J1171H718J42329
$$ plain form
15143 134412 447845 -51909 108673 210482 151318 100003 -346728 65313 125227 183522 211643
15132 211643 -142816 88315 17843 178015 -4125 244013 248082 -71 -3767 320735 110467 237387
15120 237387 -24303 -153004 24058 88167 -64980 172567 33390 199158 11725 83969 68208
15109 68208 41430 -146893 -202860 16192 -8781 241485 74712 14114 -56269 -146064 -47612
15097 113431 236418 200080 -32278 57864 -24825 172610 -37960 -92954 206015 78230 -265209
15085 95926 277616 181144 222961 -38528 110839 350743 196295 438 -2256 -16902 -263883
15074 -263883 10614 -290974 183581 -17918 -26491 164209 118611 -30011 180315 -30788 1395
15062 24205 44470 -101463 214818 11551 -230282 9831 197105 16954 28125 8718 151047
15051A51047a08736A69323a14849B23617G8429J62153b9356B38033g6261B81282
15040d7387F0312C0139K62313j3868B6107J70753J69291A62828J72294G4423P4661
15029A49084E6255O9603a64650D2383K33845D898K78041I9412K81854o1100f111
15017E883a052A50263A2582J80538K29857j18596J8688j44925J79887m1702f2996
15005A90334n3501Q4198j1795m1428o766J00004q1073Q8913E7148O3080Q0925
14994B01153k8048c5245p6780A87715E1450c6731B8952J96865c05040A75363m419
14983A70944J94371j62363l0094c302D5404J16837K84298C7158R8383K18132d3742
14971B25913G967h0535A37813L97985B17721j6834Q840r2134L3771A9750L83159
$$ plain form
15051 151047 -108736 169323 -114849 223617 78429 240582 -29356 238033 -76261 281282
15040 -47387 60312 30139 292452 278584 26107 196860 366151 162828 335122 74423 149084
15029 149084 56255 125858 -164650 42383 276228 4898 282939 99412 381266 320166 -6111
15017 5883 -1052 150263 12582 193120 422977 304381 323069 178144 358031 316329 -62996
15005 190334 136833 221031 209236 167808 161042 261046 179973 268886 57148 120228 201153
14994 201153 173105 -35245 -112025 187715 51450 -36731 28952 225817 -305040 175363 170944
14983 170944 365315 202952 172858 -3302 45404 162241 446539 37158 135541 353673 -43742
14971 225913 7967 -80535 137813 535798 217721 200887 209727 117593 151364 19750 402909
14960D02909p3192J54715d8191A3184J15869b1332A81427O0495N3898G0762L8785
14949A09547K09517A33572J62849B3361N0955J06861F6004J21643K60675k3145
14939D25177A83898j5900J0433e4620B09373K42496g1104l9791D41376A65967
14928A26709P7345L4252k2861C689L27063K14238B54435a24244A38727K16047
14918C54774a8964A27427e2217B06061R5677j44612M315K46315K0374p0344j63837
14907A93949o7039K74448D7625L73555C3870L10654j00039A07327C9736Q37435
14897H77171A27782J90656m2980H255K96417r3604n299B6776j824L08771j31136
14886B02587N0877A20992J15779L00750j43916m2223h46C27375k7170A23041J83099
$$ plain form
14960 402909 329717 484432 -48191 13184 129053 -21332 181427 241922 295820 70762 109547
14949 109547 319064 133572 296421 23361 74316 181177 66004 187647 448322 425177
14939 425177 183898 167998 178431 -54620 209373 451869 -71104 -110895 441376 165967
14928 126709 204054 238306 215445 3689 330752 544990 254435 -124244 138727 354774
14918 354774 -18964 127427 -52217 206061 301738 157126 161441 407756 428130 357786 193949
14907 193949 126910 401358 47625 421180 33870 344524 244485 107327 39736 877171
14897 877171 127782 318438 275458 8255 304672 211068 205769 26776 24952 333723 202587
14886 202587 253464 120992 236771 537521 393605 351382 -846 327375 300205 123041 306140
14875C06140J57018r5924r7710K65833o9608A45227R3225F2628K17338a43863
14864B43299A13089E1513K23995q5943L16640r7198j50252J23358A63142J29106
14854B92248l5520k309k1773J14175J01321K78618A26817K57892k6236q9017J0228
14843B79684O2543L7404G9842N13877G2751K97690j02514k8984o7028M4247M3967
14832B60129Q8139k4547o1123K07470J5900A43204J51627O1288C7268N57173k19322
14821C75119Q9475j35978A59281l4626J73891Q0554p4217L0556j38725J35169
14811C31883j04110J01722P8920j6332K1040k9115m3172A65171L37015J3194P8078
14800E93458A52108K25442J83835J73415B56389q286J9143J02811j17090O5631
$$ plain form
14875 306140 463158 367234 269524 535357 465749 145227 238452 62628 279966 -143863
14864 243299 113089 51513 275508 189565 506205 409007 258755 382113 163142 292248
14854 292248 256728 254419 232646 346821 448142 726760 126817 384709 358473 269456 279684
14843 279684 342227 379631 79842 593719 72751 370441 267927 238943 171915 216162 260129
14832 260129 348268 323721 262598 470068 485968 143204 294831 356119 37268 594441 375119
14821 375119 464594 328616 159281 124655 298546 379100 304883 335439 196714 331883
14811 331883 227773 329495 408415 392083 413123 384008 340836 165171 502186 515380 593458
14800 593458 152108 377550 561385 734800 256389 248103 267246 370057 252967 318598
14790C18598A17616K44919l2424q9356K81142o9984K87224k33881k00121K23130
14780E28265m5535H0851L87569k27390P2670M9127j0682j57322M63876k32752
14770D25947o1909M02229l81938A02981N29076j42605J40550k08407M3445j21409
14760C43631J44493j24261J71369j96357L04906k71910O5584n9139K03156K36086
14750H17558C06397J09971J14102n2565J80331m4171K19738C20968K85326j15266
14740D91028J3769K4335J88166O449B92797N0512j8690L27422q6263P1620K6829
14729F64227k94144N32755l14303j84256k8300J98838M9687j91353J47687q2465
14719D98373K880l1678j31345K93409K7146J01596o0196j40836q3793J61892J88123
$$ plain form
14790 318598 117616 362535 330111 240755 521897 451913 739137 505256 305135 528265
14780 528265 482730 80851 468420 241030 313700 362827 352145 194823 658699 425947
14770 425947 364038 766267 384329 102981 632057 489452 630002 421595 465040 343631
14760 343631 488124 363863 535232 338875 643781 371871 437455 378316 581472 817558
14750 817558 306397 416368 530470 477905 658236 614065 833803 320968 606294 491028
14740 491028 504797 529132 717298 723747 292797 343309 324619 652041 565778 637398 664227
14729 664227 370083 902838 588535 404279 375979 574817 624504 433151 580838 498373
14719 498373 501253 469575 338230 631639 658785 760381 700185 559349 475556 637448 825571
14708H25571L4060M9661l08324K51008k01349n0953J05013m506r6063l6088M15338
14697I83368l38229K62989C98886K61006q686j12280j4724M09950j67032j10732
14687F56388l7764L958J56318Q2258l59791l6482Q4485L71694k54074J02057j60800
14676F08247K68615Q1649k30771J01457k8185k49054L58611j14081M7913K3019
14666H67420j34629L40821l37310K8521q5431L39090D96185M41072k20038j29761
14656E87458L01732j92359j13943J14386L77788k17338k00441J36879K22631o7252
14646I49541k51493J72194L7246j40366K90056k15039m8713K99125k98709K49574
14636A043416j44502J42613k97508N03320l52573n7581K84541j65695J06883J19011
$$ plain form
14708 825571 859631 909292 600968 851976 650627 599674 704687 700181 604118 568030 983368
14697 983368 645139 908128 398886 659892 651206 538926 524202 934152 767120 656388
14687 656388 618624 622582 778900 861158 501367 464885 549370 921064 666990 769047 608247
14676 608247 876862 958511 727740 829197 801012 551958 910569 796488 844401 867420
14666 867420 732791 1073612 736302 764823 679392 1018482 496185 937257 717219 587458
14656 587458 889190 696831 582888 697274 1075062 857724 657283 794162 1016793 949541
14646 949541 698048 870242 907488 767122 1057178 842139 793426 1092551 793842 1043416
14636 1043416 898914 1041527 744019 1247339 894766 837185 1121726 956031 1062914 1181925
14626A181925l44409K22937k38118L05914O388J03274j82717k91963L90307k7361
14616A126177j42767o4260J66734L2906Q3332j75060o1372J42695k1085k82160
14606H05140J12353J06572J4296K95433m97051P09655l75770j59715L90841k93624
14596A108130L98305n4228l5837J00413k14801J61973j69167J65160m28790M39678
14586A470836k00347J73305J53270l90028M71689o8448k38503J14412j82497K77566
14576A581255J59243r6536j60683K59402j1378q658j09458K54338K868n04863
14566A365530L11629J0241K72341k83816N08124n68147N63783o9674L9917N9446
14556B209374K45172K26944M5540L36090L87115R9733J083154K341768M973224
$$ plain form
14626 1181925 837516 1060453 822335 1128249 1134637 1237911 1055194 763231 1153538 1126177
14616 1126177 983410 919150 1085884 1118790 1202122 1027062 965690 1108385 1087300 805140
14606 805140 917493 1024065 1038361 1333794 836743 1546398 1170628 1010913 1401754 1108130
14596 1108130 1506435 1452207 1416370 1516783 1301982 1463955 1294788 1459948 1031158 1470836
14586 1470836 1270489 1443794 1597064 1207036 1678725 1610277 1371774 1486186 1303689 1581255
14576 1581255 1740498 1643962 1483279 1742681 1731303 1722645 1613187 1867525 1870393 1365530
14566 1365530 1677159 1687400 1959741 1675925 2184049 1615902 2179685 2110011 2149928 2209374
14556 2209374 2454546 2681490 2727030 3063120 3450235 3549968 4633122 6974890 11948114
14547A1948114R942799P867888k94843p982120I710926D757831j983861m27953
14539B346017o85387L6502j20351k03961L01584k3247k05778K30134j19391J74662
14529A730784k8169j00984j9246L30046k7581O3188j3076L69920n22884n7471
14519A724527L61166l94091K79499j07581J24988Q2058K46904J77466j77333j00106
14509B217497J58543L7272l73540K53432L6932J27367j70574R4938K31483k27033
14499B386317j90132J83919k60811L44699l9527M2936K9419P3445L68887j82122
14489B757030l3191K28497q0050j95728m4595N6739J40340K37225m6524o4760
14479B954983k309K19861K29608m54663N2200K59402j52252M2677q4927J26354
$$ plain form
14547 11948114 21890913 29758801 29463958 21481838 9710926 4757831 2773970 2346017
14539 2346017 1660630 1697132 1576781 1372820 1674404 1651157 1445379 1675513 1556122 1730784
14529 1730784 1702615 1601631 1582385 1912431 1884850 1948038 1934962 2304882 1781998 1724527
14519 1724527 2085693 1691602 1971101 1863520 1988508 2070566 2317470 2494936 2317603 2217497
14509 2217497 2376040 2413312 2039772 2293204 2330136 2457503 2286929 2381867 2613350 2386317
14499 2386317 2196185 2380104 2119293 2463992 2424465 2467401 2496820 2570265 2939152 2757030
14489 2757030 2723839 2952336 2872286 2676558 2631963 2688702 2829042 3066267 3019743 2954983
14479 2954983 2952674 3172535 3402143 2947480 2999680 3259082 3106830 3149507 3064580 3190934
14469C190934M95683n13993L87171k92640J64018L19814j91901q0069j24328M92333
14459C847022o9107q3537R8855k82329J87755L69649j87451M07245m68781M40902
14449D260223L54416l18099J37266j87126K70301K27855l57189M24810o7376L34791
14439E079872l99221K0424k0193N25958O106J78863l54587K12018J63417k3085
14429E389572K20373j51971L72995K14935l24453L10588k792j88276J22999J93290
14419F157260J71400n6109M99407o5961k82334J07015K73837L81393l5777N9630
14409G209761m9273L51938k59970N49245q5009K983J2551M60535k62261K49512
14399H180012N0245J24283O01835k16926O2196J86292J35584K17506L06142K23530
$$ plain form
14469 3190934 3686617 3172624 3559795 3267155 3431173 3750987 3559086 3479017 3354689 3847022
14459 3847022 3777915 3694378 3793233 3510904 3698659 4068308 3880857 4288102 3819321 4260223
14449 4260223 4614639 4296540 4433806 4246680 4516981 4744836 4387647 4812457 4745081 5079872
14439 5079872 4680651 4701075 4680882 5206840 5212946 5391809 5037222 5249240 5412657 5389572
14429 5389572 5609945 5457974 5830969 6045904 5721451 6032039 6029247 5840971 5963970 6157260
14419 6157260 6328660 6272551 6771958 6705997 6423663 6530678 6804515 7185908 7150131 7209761
14409 7209761 7160488 7512426 7252456 7801701 7716692 7719675 7732226 8192761 7930500 8180012
14399 8180012 8230257 8354540 8956375 8739449 8801645 8987937 9123521 9341027 9647169 9870699
14389I870699k1827N79903k33830J74963L40950M07219j63038M97474M71265j65705
14379A1758073K65087j43161M72751L69824J79308J20214M90077J50717K77983
14370A3940873L47272L85616k71327P35139L35448J73259N61232L39175L30591
14361A6877278P08162j05103N32412M16745M44114K50057N89196O35999M88199
14352B0837059N02755M96699N02972O96392M68274M38386R33605N99022O68431
14343B6143595P86196N48929Q19534P57573R37760P53691R21262J088983P21951
14334C3479474Q89522J330146Q01241J414190J147400J211453J281003J413105
14326D2967534J607075J537727J361378J764650J774241K107663J668370J969807
$$ plain form
14389 9870699 9848872 10428775 10194945 10369908 10710858 11118077 10955039 11452513 11923778 11758073
14379 11758073 12023160 11879999 12352750 12722574 12901882 13022096 13512173 13662890 13940873
14370 13940873 14288145 14673761 14402434 15137573 15473021 15646280 16207512 16546687 16877278
14361 16877278 17585440 17480337 18012749 18429494 18873608 19123665 19712861 20348860 20837059
14352 20837059 21339814 21836513 22339485 23035877 23504151 23942537 24876142 25475164 26143595
14343 26143595 26929791 27478720 28298254 29055827 29993587 30747278 31668540 32757523 33479474
14334 33479474 34368996 35699142 36500383 37914573 39061973 40273426 41554429 42967534
14326 42967534 44574609 46112336 47473714 49238364 51012605 53120268 54788638 56758445
14318E6758445K386557K251512K409445K783158K720786K455751L363912L030436
14310G8160002L535126L879358L824867M126307M464546M508976N042945N379166
14302A12921293N175252O201907O455074O843196P345667P260640Q439719Q639096
14294A69281844R455968J0007562J0811873J1132445J1855209J2642880J3362448
14287B48550229J3862503J4522206J5401463J5226040J5980072J6069249J5967511
14280C55579273J5684409J5190269J4054261J3223914J1158130R427461O520826
14273D40838543K496207k237420n464706p145720q475152l69051n415185o470545
14265D07756971r996896j3912832j5472409j6601673j6754234j6515961j6427932
$$ plain form
14318 56758445 59145002 61396514 63805959 66589117 69309903 71765654 75129566 78160002
14310 78160002 81695128 85574486 89399353 93525660 97990206 102499182 107542127 112921293
14302 112921293 118096545 124298452 130753526 137596722 144942389 152203029 160642748 169281844
14294 169281844 178737812 188745374 199557247 210689692 222544901 235187781 248550229
14287 248550229 262412732 276934938 292336401 307562441 323542513 339611762 355579273
14280 355579273 371263682 386453951 400508212 413732126 424890256 434317717 440838543
14273 440838543 443334750 441097330 435632624 428486904 420011752 419642701 414227516 407756971
14265 407756971 397760075 383847243 368374834 351773161 335018927 318502966 302075034
14258C02075034j6304981j5243241j5077531j3698120j3582938j2643166j1962269
14251B03562788j1274819j0257588r896282r088051q870847p937730p647062o775263
14243A31815146o682460n865728n715861n514175n163914m741488l997469m574750
14235H9559301m039198l405632l879602k805295l071994k759142k974978k576275
14227F4047185k466048k608724j868603j898658k373114j791183j636742j964132
14219D7439981j362976j524952j294144j741111j108944j401090p53942j403791
14211C6849031j191832j078063r40421j027456q25042p61482j208987o94340p87313
14202B8334095r64372o58990n47765m85211r09387q32659q82618m1258p36701
$$ plain form
14258 302075034 285770053 270526812 255449281 241751161 228168223 215525057 203562788
14251 203562788 192287969 182030381 172134099 163046048 154175201 146237471 138590409 131815146
14243 131815146 125132686 119266958 113551097 108036922 102873008 98131520 94134051 89559301
14235 89559301 85520103 82114471 78234869 75429574 72357580 69598438 66623460 64047185
14227 64047185 61581137 58972413 57103810 55205152 52832038 51040855 49404113 47439981
14219 47439981 46077005 44552053 43257909 41516798 40407854 39006764 38252822 36849031
14211 36849031 35657199 34579136 33638715 32611259 31786217 31024735 29815748 29121408 28334095
14202 28334095 27369723 26710733 26162968 25677757 24768370 23935711 23053093 23011835 22275134
14193B2275134j62367o27545q20197n60938m02555m03938m76091k23980o75515
14184A7922008k99682n61591o7432m90974k63462j38334l97017l82763l76758
14175A4943995k54252m66408l5623o40841J32719l37498j51608k19422l48501
14166A2622561k36800l25478j85286l04354K25168n30897O6087o41025L51062
14157A1041038l50692m819o79051n128j90742k12481j34915j26158m6694l9501
14147I250857l79325j18175J8877n86k47174l38423k6654l02716j67253R3481
14137G782909J07981n18647J19302J33771l87256M5890k31010K59142k86956j65121
14127F860005k86490P1235l04292k4784j0305j70289k2737m60513N14557l71896
$$ plain form
14193 22275134 22112767 21485222 20665025 20104087 19701532 19297594 18821503 18597523 17922008
14184 17922008 17622326 17060735 16993303 16502329 16238867 16100533 15703516 15320753 14943995
14175 14943995 14689743 14223335 14187712 13546871 13679590 13342092 13190484 12971062 12622561
14166 12622561 12385761 12060283 11874997 11570643 11795811 11264914 11331001 10689976 11041038
14157 11041038 10690346 10685527 10006476 10001348 9810606 9598125 9463210 9337052 9290358 9250857
14147 9250857 8871532 8753357 8772234 8771648 8524474 8186051 8159397 7856681 7689428 7782909
14137 7782909 7890890 7372243 7491545 7625316 7238060 7283950 7052940 7312082 7025126 6860005
14127 6860005 6573515 6644750 6340458 6315674 6305369 6135080 6112343 5651830 6166387 5794491
14117E794491J21186k86408j89747m4524M54698k19913l24014m61016O81811l90092
14107E136472K93625l61930k62013P7106M8299J9068J03945k92676l4751k76784
14097D450361l61474L11147K35358l73681J27601k86719j02663J73082K3680n22830
14087C673862J31155O5483J62596l03052J96894J5845j58663L48843j90798N0566
14077C992731m48822M16052m27783J67762m54738K67661k30278J30125N0730J45045
14067C608485n09065m1108L70957j29878j72777n6554r6737K83254k44382R2374
14057C104569j07890R1775l0363l45890J95569L17160n62117L41054m47621K57532
14047B813778L7929l47675L09976j11962l28459O3852L66712m20977M8615J68818
$$ plain form
14117 5794491 5915677 5629269 5439522 5394998 5849696 5629783 5305769 4844753 5526564 5136472
14107 5136472 5430097 5068167 4806154 4883260 4931559 4950627 5054572 4761896 4727145 4450361
14097 4450361 4088887 4400034 4635392 4261711 4389312 4102593 3999930 4173012 4196692 3673862
14087 3673862 3805017 3870500 4033096 3730044 3926938 3942783 3784120 4132963 3942165 3992731
14077 3992731 3543909 3959961 3532178 3699940 3245202 3512863 3282585 3412710 3463440 3608485
14067 3608485 3099420 3058312 3429269 3299391 3126614 3070060 2973323 3256577 3012195 3104569
14057 3104569 2996679 3088454 3058091 2712201 2907770 3224930 2662813 3003867 2556246 2813778
14047 2813778 2851707 2504032 2814008 2702046 2373587 2437439 2804151 2383174 2431789 2600607
14037B600607k37691m2012K84364k58714K43956k23921L91507j91556O2001l40807
14027B287734j85279j56104K08904J2193r0804j04102m0343J4543K05180j4428
14017B137494j37168k4265P9220L5141k20481J74480j69546o2250r8138K68946
14007A983433N1452l58470K31255J10150p9941L2014j80961K07403l51854k51442
13997A393039K29956j82416L5595L99000l43754K55951M99144J70141J123703
13988C580359L823831R139179R396744K377203m302340j0550291n519970l157425
13980D787290r39586j96475j128371L96359l87633l38798K58280l21300J48073
13971B277839m86334L72037k29786j5040J74467l62296L10473k01672j54077L40780
$$ plain form
14037 2600607 2362916 2320904 2605268 2346554 2590510 2366589 2758096 2566540 2628541 2287734
14027 2287734 2102455 1946351 2155255 2167448 2076644 1972542 1932199 1946742 2151922 2137494
14017 2137494 2000326 1976061 2055281 2090422 1869941 2044421 1874875 1812625 1714487 1983433
14007 1983433 2034885 1676415 1907670 2017820 1937879 1969893 1788932 1996335 1644481 1393039
13997 1393039 1622995 1440579 1476174 1875174 1531420 1787371 2286515 2456656 3580359
13988 3580359 7404190 16543369 25940113 28317316 24014976 13464685 7944715 4787290
13980 4787290 3847704 3651229 2522858 2919217 2531584 2192786 2451066 2129766 2277839
13971 2277839 1791505 2163542 1933756 1918716 2093183 1730887 2041360 1839688 1685611 2026391
13961B026391n8395m67232J25461J39244J33465n59960O80035m26943k81399J60276
13951A470943p6374j40481K13245J68350j2520j11459K00861k65151m2074P5769
13941A481109k54883Q4874K5630o5236K84349l71031K79354m25524R174K14993
13931A262809J02757j23565l0896l2830Q1072J95070k07648o0590J85455l52063
13921A019571J61459p7380K67317j70188J99106k27528L6405q1815k57082K93718
13911A163583Q8233k94624L85105m13894l5641j299K10859K14586j55043j23783
13901A038082j38004L3285J45128J02036l74053J53996l7623m0833j34634K45070
13891I92450K9563l4110K48522l97492L32566k7056l02215J33575J69250q5860
$$ plain form
13961 2026391 1967996 1500764 1626225 1765469 1898934 1338974 2019009 1592066 1310667 1470943
13951 1470943 1394569 1254088 1467333 1635683 1623163 1511704 1712565 1447414 1405340 1481109
13941 1481109 1226226 1311100 1336730 1271494 1555843 1184812 1464166 1038642 1047816 1262809
13931 1262809 1365566 1242001 1211105 1178275 1259347 1454417 1246769 1186179 1371634 1019571
13921 1019571 1181030 1103650 1370967 1200779 1399885 1172357 1208762 1126947 869865 1163583
13911 1163583 1251816 957192 1342297 928403 892762 891463 1102322 1316908 1161865 1038082
13901 1038082 900078 933363 1078491 1180527 806474 960470 922847 882014 747380 992450
13891 992450 1022013 987903 1236425 838933 1171499 1144443 842228 975803 1145053 1059193
13881A059193j04858K43827k51419J94216j66929j74975L13332m14202K33962
13872I32147J77728o452k75476J17976n772J03706j98344k15450L79935k98584
13862G11414J82212R8434l33082K99283j23599l07321L45619J30067j07079n0009
13852H45939r8217j88801K11342M8028k95649N15957l04904N4348l0151O5579
13842H23471L03842l31388j32523k98152M66283k00516O0855J27331j85667J13505
13832G47041P5405l51344N74992n13085L52270j82518K02823l09953M28461j47816
13822H76276j94480J49593M9498J42391k66299J31226j88753O3124m6038k95415
13812D21123l8289L4929M30903R1083C24318L18053J26055k03452J18168J48679
$$ plain form
13881 1059193 954335 1198162 946743 1140959 974030 799055 1112387 698185 932147
13872 932147 1109875 1103423 827947 945923 940151 1043857 845513 630063 1009998 711414
13862 711414 893626 992060 658978 958261 834662 527341 872960 1003027 895948 845939
13852 845939 747722 558921 770263 818291 522642 1038599 733695 788043 757892 823471
13842 823471 1127313 795925 663402 365250 831533 631017 691872 819203 633536 747041
13832 747041 822446 471102 1046094 533009 885279 702761 905584 595631 1024092 876276
13822 876276 681796 831389 880887 1023278 756979 888205 699452 762576 716538 421123
13812 421123 382834 417763 848666 939749 324318 642371 768426 564974 683142 831821
13802H31821k67222l0584J56379j84350p925K22213C34898J27246p8964N14038
13792H97218M4669k59402j1361k46598K18051k77351L73571L058k55217k1924
13782D64714M4725p1037N7069K88229C56879J25567j29111K14384L0689n5506
13772E42902M6445j8373q1238K1667J32768K66757C52053j4993K50362p8757l7279
13761D71386j46053M86588C17045M4325K37702o310B54475J80642J7887J54045
13751F07049k87261J54092M2393L5612J4164k2130j53809A40005L40707B14226
13740C13391K91532p1967M4347k84851L16747n8J90782k30331l0497j14730L51562
13729G75927l22661N2739k48044M93501C1080M61572o2233j80296A13006N57759
$$ plain form
13802 831821 564599 534015 690394 506044 498119 720332 334898 462144 383180 897218
13792 897218 941887 682485 671124 424526 642577 365226 738797 741855 486638 464714
13782 464714 509439 438402 495471 783700 356879 482446 353335 567719 598408 542902
13772 542902 589347 570974 489736 511403 644171 910928 352053 337060 587422 508665 471386
13761 471386 325333 811921 317045 361370 599072 592762 254475 435117 453004 607049
13751 607049 319788 473880 516273 551885 566049 543919 390110 140005 480712 214226
13740 313391 604923 532956 577303 292452 609199 609141 799923 569592 539095 424365 775927
13729 775927 453266 506005 257961 751462 31080 492652 430419 250123 113006 670765
13719F70765B88628J23220p3719O5336R8394j47185o1517k7248J91956A05332
13708D37527K11467k65911m9507J24555l5799J49385P5036k39311J2925k001j69047
13697B49319J72580k02674K87072I1575L97395A56451N22527l29631J52321j36547
13687C65121P0555r0307P9954k07804Q3615K77116E5662L48289C5012J05143M39119
13676E79274E5362L57316Q7880j45657j02428L15241k80216K12211k09129Q8271
13666C78851J12448k16038K64402j91633j43284J81473E8371J10791L42222q392
13656E02992k46940J18697k8876J55620j09682M2928o3233N8783Q1958K96690
13646H08937B59815I0921M49623j2047l2670g906C63921l8390J16986B00122K78051
$$ plain form
13719 670765 288628 411848 338129 403465 501859 354674 293157 265909 457865 105332
13708 437527 648994 383083 333576 458131 422332 571717 646753 407442 420367 418366 249319
13697 249319 421899 219225 506297 91575 488970 156451 678978 349347 501668 365121
13687 365121 435676 345369 425323 217519 301134 578250 55662 403951 35012 140155 579274
13676 579274 55362 412678 500558 354901 252473 567714 287498 499709 290580 378851
13666 378851 491299 275261 539663 348030 204746 386219 58371 169162 511384 502992
13656 502992 256052 374749 345873 501493 391811 434739 371506 430289 512247 808937
13646 808937 259815 90921 540544 528497 495827 -7906 363921 325531 442517 200122 478173
13635D78173R0406l9118B53988P0208J24517j07505J2297J80550k23203j07849
13625B03003J65351J29244B45733J59865r6599m0538I4859L43023j9490j34692
13615B83700j02879b3357A78942L91173j23833j06663J83757B21636K32880Q6747
13605E41263j82249r2418J44934J04386k406F9341l72L33550j30B1941J09398
13594A31339L35617J14140B23113J98555l844j71239m0155P8357L8987B4438L14556
13583C38994A08272N3654J37732E8658N56283B69921J49120N0043r0238J36987
13573E15833j17676r1465J6279j12030M0565k1353P979L1709j20719J34481K40901
13562E24504I5799M28674j53129p993r0639G9272J46416K32407B18694j04197
$$ plain form
13635 478173 568579 529461 253988 324196 448713 341208 353505 534055 310852 203003
13625 203003 368354 497598 245733 405598 308999 268461 94859 437882 418392 283700
13615 283700 180821 -23357 178942 570115 446282 339619 523376 221636 454516 541263
13605 541263 359014 266596 411530 515916 513510 69341 68969 402519 402389 21941 131339
13594 131339 466956 581096 223113 421668 417824 246585 206430 284787 323774 24438 338994
13583 338994 108272 161926 299658 58658 614941 269921 419041 469084 378846 515833
13573 515833 398157 306692 322971 210941 251506 230153 238132 269841 149122 283603 524504
13562 524504 95799 524473 371344 363351 272712 79272 225688 458095 218694 114497
13552A14497L1748i07B14430M6999J44488J0666A95933M0183K7161r883m4751
13541B08643Q434N3240I5922L10722E5262K43683j3411m8413J2491N4145j50618
13530A53139Q9576o5965P2326K48852F17K65110j15766n5498K84938j11742N2284
13519C19943g8102c8187C86532M2660a2295B96305l6481q4064H3000P5230n7639
13508A00591L41626A35278R2763K05334j20024E0555O6519J81575j16148N8931
13498B41432A9544a31764A61816K616L9397j7083b10856A55130M0615q1802d6124
13486A05636l0457M1214J13419g5097B61298k2171a3792B89254M291a58600C77048
13474B13531K95678B06619L6928N522c4932E32464A85991o616K49196r4447A19765
$$ plain form
13552 114497 146245 -907 214430 261429 405917 416583 195933 236116 263277 253394 208643
13541 208643 217077 270317 95922 406644 55262 298945 285534 237121 249612 303757 153139
13530 153139 242715 176750 249076 497928 617 265727 149961 94463 379401 267659 319943
13519 319943 -78102 -38187 386532 429192 -12295 296305 259824 175760 83000 158230 100591
13508 100591 442217 135278 228041 433375 313351 50555 117074 298649 182501 241432
13498 241432 19544 -131764 161816 164432 203829 186746 -210856 155130 195745 113943 -46124
13486 105636 75179 116393 229812 -75097 261298 239127 -13792 289254 293545 -158600 377048
13474 213531 509209 206619 243547 249069 -34932 532464 185991 179375 428571 334124 119765
13462a96480B77792j7569n6946G8251L41057b6732B20049J68642j11923A21981
13451D93488D8313i1698L8464a5310j07772N5544B75696r3011K87253A65854K2705
13440A88559b64297B27506B5757J42762J24908O4248A59197j7217N3898D9258
13429a2486C00645A07594R2626k1004G9648B9293J17122J24420K93213E9821M7218
13418A07039C3908K48104K45527A50061A6288J11743K12714A11381k967i5444
13407A18109i3315B00001N2196j15205M3123J53268A60597h1697A26186P1434
13397A97620L13569A66406A0445f9591p8011E7402J14755N6757a59688K1128B37347
13385A9730K26837I1912J10966a82032A7168J42781a87708E2328J83772K08222
$$ plain form
13462 -196480 277792 260223 203277 78251 419308 -26732 220049 388691 276768 121981
13451 493488 48313 -91698 -53234 -15310 -123082 -67538 275696 182685 469938 165854 188559
13440 188559 -264297 227506 25757 168519 293427 357675 159197 141980 195878 49258
13429 -12486 300645 107594 200220 179216 79648 29293 146415 270835 564048 59821 107039
13418 107039 33908 282012 527539 150061 16288 128031 340745 111381 108414 -95444
13407 118109 -93315 200001 252197 136992 180115 333383 160597 -81697 126186 197620
13397 197620 511189 166406 10445 -69591 -147602 57402 172157 228914 -159688 -138560 237347
13385 19730 246567 91912 202878 -182032 17168 159949 -187708 52328 236100 444322
13375D44322j98578A7011K10412L23806I825K80955j29413Q7330O0283K57240
13365E66220j30598n10f3320A38238Q419D4150M55348B3001R0630D0017a97434
13353C02149I4960a58143E68901k60117P8947j62665I2077K41646l0681F9818
13342C03030I7083O2420R015J76089L13701B63417n8620F6828J62846J08997G1895
13330D4655a19755A46297C6520M0965N02663G4238C1646j2445a39376C28494A20986
13318A43224k7316Q5676E5905N06647a59764k791H3480N8938Q4317p1151i6777
13306f5947A13800j3978a46534B84869G2541j8197J53091r0058K18215q0105g5673
13294A42048E8409H586J52303P4827j944e960E6034d8566B06777J79345G8287
$$ plain form
13375 444322 245744 17011 227423 551229 9825 290780 161367 248697 308980 566220
13365 566220 435622 435112 -63320 138238 146657 44150 499498 23001 113631 40017 -197434
13353 302149 94960 -158143 568901 308784 387731 225066 92077 333723 303042 69818
13342 303030 97083 159503 168518 344607 658308 263417 204797 66828 229674 338671 71895
13330 44655 -119755 146297 36520 77485 580148 74238 31646 19201 -139376 328494 120986
13318 143224 115908 201584 55905 562552 -159764 -162555 83480 142418 226735 155584 -96777
13306 -65947 113800 99822 -146534 284869 72541 54344 207435 117377 335592 255487 -75673
13294 142048 58409 8586 160889 235716 233772 -5960 56034 -48566 206777 386122 78287
13282A72179a56586A57291e0600N61I2969J26450a7752B13098E477J95940n0691
13271A50726R6269A14788K92694c6243a1085A75630P6006j1957K05332A66387
13260A62045C3402b27898B82427J99240A4633K02492g9766H4489c3526k82422
13250c15948Q2247e7956l632C8602a03711A90483G7501J18760J02545j10946o4544
13239A23316g0775C47732k3007G7430L3364D1535a999I9772g2156B28204J13299
13228C41503I8173l6979a76437B21942O3002d583B41835E1058R3300A1732i9009
13216B34904R392d5110o8095B72819A9917M6372M9483c5463F0278P7517L6575
13205A74370i4280A77662J03908p7517K04645j68675A09636b27572A28469M326
$$ plain form
13282 172179 -156586 157291 -50600 -50039 92969 219419 -17752 213098 5477 201417 150726
13271 150726 246995 114788 407482 -36243 -11085 175630 251636 239679 445011 166387
13260 162045 33402 -227898 282427 481667 14633 217125 -79766 84489 -33526 -315948
13250 -315948 -233701 -57956 -61588 38602 -103711 190483 77501 196261 298806 187860 123316
13239 123316 -70775 347732 324725 77430 110794 41535 -1999 99772 -72156 228204 341503
13228 341503 98173 61194 -176437 221942 284944 -4583 241835 51058 144358 11732 -99009
13216 234904 244296 -45110 -113205 272819 19917 66289 115772 -35463 60278 137795 174370
13205 174370 -94280 177662 281570 204053 408698 240023 109636 -227572 128469 132795
13195A32795D1191P0650m4541K65c539A9496l870e1700A36661c9560A16218e6251
13182A5533i0612L9245B88433J0277J4020a3672G6516i813m0661B52235h835k80513
13170b89348c5834B01472R737M4393A384J35199a92426G8244a23365A62282K71415
13159D33697A3159J37241l5251C6961M2512a46137B66532e1012D5965J16075k505
13148A59535K40037A64342M6467p3547b9021A23854a81327k1176A469N2753j6977
13137C7245m02L06971e2271j45342e7926A02475J98083g009k93199A74219m2347
13126A31872a86661A47279d8797C53622j56304I1153P7142o3444b42086A42037
13115B59958B7162d07839J77350M6504f731B98300D2426J73365f4217A14856a54129
$$ plain form
13195 132795 41191 111841 67300 67565 -3539 19496 15626 -51700 136661 -39560 116218 -56251
13182 15533 -90612 -51367 288433 298710 312730 -13672 76516 -9813 -50474 252235 -8835 -289348
13170 -289348 -35834 201472 211209 255602 1384 136583 -192426 78244 -123365 162282 433697
13159 433697 13159 150400 115149 36961 79473 -146137 266532 -51012 45965 162040 159535
13148 159535 399572 164342 210809 137262 -29021 123854 -181327 -202503 1469 54222 37245
13137 37245 36843 343814 -52271 -197613 -57926 102475 300558 -7009 -300208 174219 131872
13126 131872 -186661 147279 -48797 353622 197318 91153 168295 104851 -242086 142037
13115 259958 27162 -407839 -230489 -183985 -6731 298300 42426 215791 -64217 114856 -154129
13103C0268J16702D8732a36864O766C59439M8009a12645A14095L28241a60171
13092b9570o3014k8318G9440d7608B80639p4992a58778B12984N6326E8853a29394
13080a49816f2849k5731E621K16688b71609E8540B8465P069b01155A67798K52802
13069D20600d2546k0371A0876N4772Q9042c7854A4397F663L1250J23873J22023
13058B83809b15787A29452J25630H9132d6621D9221Q5540b64372A96051A3483
13047A40150L4472K54686j20846c01661e5031D5951J9903J68944a93943i6733
13036d1964D12002k02568F6091K43867H1886B8653J80824q2688m2128a8358A76846
13024A42839J83267A13941a45453B0107L47986a04537n6448A35509b3552A2417
$$ plain form
13103 30268 146970 48732 -136864 -130098 359439 407448 -112645 114095 442336 -160171
13092 -29570 -92584 -120902 79440 -47608 280639 205647 -158778 212984 269310 58853 -129394
13080 -149816 -62849 -88580 5621 222309 -271609 58540 28465 35534 -201155 167798 420600
13069 420600 -42546 -62917 10876 65648 154690 -37854 14397 6663 37913 161786 283809
13058 283809 -215787 129452 255082 89132 -46621 49221 134761 -264372 196051 13483
13047 140150 174622 429308 308462 -301661 -55031 45951 65854 234798 -193943 -96733
13036 -41964 412002 209434 66091 309958 81886 28653 209477 126789 84661 -18358 176846
13024 142839 326106 113941 -145453 20107 368093 -104537 -160985 135509 -23552 12417
13013D5170K60249j27440n7139E8470M3485b95512h2121p8460I0618Q3916l8857
13002A35677e1226c525F355J04305B5353c7931F4513J76579D6104J83711I6202
12990B31995d8083G5828J35645C1691A3003N3876Q7148P8380o4099o8297J09742
12979B09753h9855K2259j54936e6013r6714g5064k39625g0309A07242b69734J34773
12968a34961J4471K1207B47953J3440G455c0546G0805c3084B62383j19378C4699
12956a36862b4571k79048M7876I2169D4500c01552j36610a6134E419K38017b604
12944A87751a87591j26807A28230k9639j2318b08255P1065A21456D4657b51171
12933d6453E2561N265f5340a9050B00864o9577a10627B5776J97899G5810A2434
$$ plain form
13013 45170 305419 177979 120840 58470 101955 -295512 -82121 -160581 90618 174534 135677
13002 135677 -51226 -3525 6355 110660 25353 -37931 64513 241092 46104 229815 96202
12990 231995 -48083 75828 211473 31691 13003 66879 154027 232407 168308 100011 209753
12979 209753 -89855 -67596 -222532 -56013 -152727 -75064 -314689 -70309 107242 -269734 -134961
12968 -134961 -120490 -99283 247953 261393 7455 -30546 70805 -33084 262383 143005 34699
12956 -136862 -24571 -303619 -255743 92169 44500 -301552 -438162 -16134 5419 243436 -2604
12944 187751 -187591 -314398 128230 98591 86273 -208255 -137190 121456 44657 -251171
12933 -46453 52561 57826 -65340 -19050 200864 131287 -110627 25776 223675 75810 12434
12921A9879h8276K4834n7891A79066i665l8072A26091g803A08534d0221D7276
12909A99096H8895N1300a41442j18107L7333A61701b40021F745L35649b8744j27462
12898a56206d2254n4019E7653K11653j05590a23451j54089a04604j5411A56583
12887b25164B29279j02920a90750f8647o4647L8973H8144a69296A53207p0420
12877H2787N0134a2021A23286b62499A39684F2902c6932A17130a7490C13057e6701
12865C0074Q3514k5745J68616f616m3631B60852j28754b6813A546K92701f9005
12853B58652b6989B53075h1695A78352k7855O5358b6596k44706C2293Q1055j0108
12842A03240A0904b2267A04469C4048b99136A85755b84995a18491G4692j0441
$$ plain form
12921 19879 -88276 -63442 -121333 179066 -9665 -47737 126091 -7803 108534 -40221 47276
12909 199096 88895 140195 -141442 -259549 -222216 161701 -240021 6745 342394 -28744 -156206
12898 -156206 -42254 -96273 57653 269306 163716 -123451 -277540 -104604 -120015 156583
12887 -225164 229279 126359 -190750 -68647 -133294 -94321 88144 -169296 153207 82787
12877 82787 132921 -12021 123286 -262499 139684 62902 -36932 117130 -17490 313057 -56701
12865 30074 113588 87843 256459 -6616 -50247 260852 132098 -26813 1546 294247 -69005
12853 258652 -26989 253075 -81695 178352 150497 215855 -26596 -271302 32293 113348 103240
12842 103240 10904 -22267 104469 34048 -299136 185755 -284995 -118491 74692 64251
12832F4251r958h7885j3244A4052e0809h674A81224q6329f308l4269J003j18559
12820a58133F2266K14840R8071a73686c7728A45133e8522a5217A25033n9333d7334
12808F5597J98465K5623B1341a0071A8640J01399D1078M2017l6831h3181A01554
12796c00048I4869e0069j09148c5313A60607a49009H9219b6973k03426N6934o723
12785a80188a5105H0890L6385K53432B9977b70973A70283I137J1732b9724B63622
12773i7792A29721L09589g0341K9961r825n3456l9465a5774m8575E4697L4473
12762H9170L02828B1912h922A5696K60712a95805K3756m5139A53982a4487A0126
12750E5538M8931i8662A87566c389p3914A65406p4990A3135J44082A5711J92920
$$ plain form
12832 64251 54293 -87885 -101129 14052 -50809 -8674 181224 94895 -6308 -40577 -39574 -158133
12820 -158133 62266 277106 375177 -173686 -37728 145133 -58522 -15217 125033 65700 -47334
12808 65597 264062 289685 21341 -10071 18640 120039 41078 83095 46264 -83181 101554
12796 -300048 94869 -50069 -159217 -35313 160607 -149009 89219 -26973 -230399 -173465 -180188
12785 -180188 -15105 80890 117275 370707 29977 -270973 170283 9137 20869 -29724 263622
12773 -97792 129721 439310 -70341 -40380 -50205 -103661 -143126 -15774 -64349 54697 89170
12762 89170 391998 21912 -8922 15696 276408 -195805 -172049 -217188 153982 -14487 10126
12750 55538 104469 -98662 187566 -3389 -77303 165406 90416 13135 157217 15711 208631
12739B08631D9907j1264J25450K53200j94020G8427J44109r8830Q5615h4774k62336
12728c47110D0425b6775d261j55295C13191q6255r353O2296a44880g0602A7714
12716b00741D0303J66644r6753J8139b00702C2083J0874d0649I6029a2187C17350
12704B26865F4007a22991J2930E5114H285B629f8261j10160A53939J34335L893
12693B92167c40563A38672h0866K9297J508k76394B64490f9534A48192n1625b94434
12681D8781a34122A44976R1995a32269H5325R0450o8183J21030I3326h8414H4982
12669A41023J7235m6505a4931A21849M17742a19048d8566A56405L7617H218h1534
12657B23274j11246b0859j94339a02344I4809a34208I9188g7610j66225I1625
$$ plain form
12739 208631 49907 38643 164093 417293 223273 78427 222536 123706 209321 -84774 -347110
12728 -347110 40425 -26775 -4261 -159556 313191 226936 217583 279879 -144880 -70602 17714
12716 -200741 40303 206947 110194 128333 -200702 32083 42957 -40649 96029 -12187 317350
12704 226865 64007 -122991 -110061 55114 8285 2629 -68261 -178421 153939 288274 292167
12693 292167 -340563 138672 -80866 -51569 -50061 -326455 264490 -69534 148192 96567 -294434
12681 48781 -134122 144976 236971 -132269 85325 175775 107592 228622 93326 -88414 84982
12669 141023 158258 111753 -14931 121849 539591 -119048 -48566 156405 194022 8218 -81534
12657 223274 112028 -20859 -215198 -102344 94809 -134208 99188 -77610 -243835 91625
12646b7344Q855o7037p5413j9436e7136l1385I0639a89752k63068A81609J24513
12635C06122a13685B25254O1775l2903J94371A49366K08443A26789J98856G4445
12624A43534o9142a35380C47125d2889B45827o8552g7719n3497g624A06775b11717
12612e0874A36290i3742K796A87192a45611H7430J47603J7209f4508B9171J1535
12601D0706a66010C57602f8239H9004O26h7746L9301G2554b5078k72976A73553
12589D84995A43961M8664c1799A40254c30967A56572a49999c8093A23739b80109
12578F4787k2851f8538A74879M893J43841j01827r9227a53971A26266M4414J11883
12567B82563G4068b0617A3206J07428N2880b3377B16410A3900J3164K0905a09473
$$ plain form
12646 -27344 -18489 -85526 -160939 -180375 -57136 -88521 90639 -189752 -452820 181609 306122
12635 306122 -113685 225254 287029 254126 448497 149366 357809 126789 325645 74445
12624 143534 74392 -135380 347125 -42889 245827 177275 -77719 -131216 -7624 106775 -211717
12612 -50874 136290 -93742 -90946 187192 -145611 87430 235033 252242 -64508 29171 40706
12601 40706 -166010 357602 -68239 89004 89630 -87746 -48445 72554 -25078 -298054 173553
12589 484995 143961 192625 -31799 140254 -330967 156572 -149999 -38093 123739 -280109
12578 64787 41936 -68538 174879 179772 323613 221786 122559 -153971 126266 170680 282563
12567 282563 74068 -20617 13206 120634 173514 -23377 216410 13900 27064 47969 -109473
12555A48617b8294j62450e1698B36084L9484O7229j26146b01530H0769C0108J76404
12544B06512g2623j16520A91244A3963L8909g0980K0193l07q6113B11931n9315
12533A52616G508J3225b80954C68419A48883h2246o2299l0110A49747F9517B1325
12521a11915j27145a4131D7563a04349k5347K5196F2927a96605N5925E6283b4502
12509H9122j8266B0819a07183D23034A09670Q5638a47963R173C56659h4014l3137
12498a17151q5038o5662D6747a80731B77276a83597C1309e0515j00413A54515
12487b15008I9232l9449c78875a66089B6992M1928k7286a76217A34314M6368a19089
12475a15197j06145B04039b30517P2401j63896J33043Q0163I8297e043A67754
$$ plain form
12555 148617 -28294 -190744 -51698 236084 275568 342797 216651 -201530 80769 30108 206512
12544 206512 -72623 -189143 191244 13963 52872 -70980 -50787 -51094 -137207 211931 152616
12533 152616 7508 20733 -280954 368419 148883 -82246 -144545 -174655 149747 69517 21325
12521 -111915 -239060 -14131 47563 -104349 -129696 -104500 62927 -196605 -140680 56283 -24502
12509 89122 70856 20819 -107183 423034 109670 195308 -147963 -138790 356659 -84014 -117151
12498 -117151 -202189 -267851 46747 -180731 277276 -183597 31309 -50515 -150928 154515
12487 -215008 99232 59783 -378875 -166089 26992 68920 41634 -176217 134314 180682 -119089
12475 -115197 -221342 204039 -230517 -158116 -322012 -188969 -108806 98297 -5043 167754
12464I235b65215A16119E5680g1923n2553E5481a61513d8823a5307E0695j719
12453D8976N922i8884B12491H4958a30505A02594R820C3167c55542I5718a57216
12441h6656C3173O8637f6739C1231e0469k40956a09104A77219B0193a2831F3139
12429a95517C5265e9011A12663A0382J7671J30617i3397m9844l3811B68793j25267
12418A43526a62097P370A26622b19066E3251a57475e9009b0490A0121J2509e1256
12406a104n0245H9535B568a61837A39022E6733A2930J56706A7524K8440a1381
12394b8708A34361h6412A7646J35077R3267b68243a5124A05741b24769C6082K34997
12383B71079A9667b71361A18160a80181d7739j10561E4204J79550a72741A53617
$$ plain form
12464 9235 -265215 116119 55680 -71923 -124476 55481 -161513 -48823 -15307 50695 48976
12453 48976 54898 -98884 212491 84958 -130505 102594 112414 33167 -355542 95718 -157216
12441 -86656 33173 101810 -66739 31231 -50469 -291425 -109104 177219 20193 -12831 63139
12429 -195517 35265 -59011 112663 10382 28053 158670 -93397 -143241 -177052 268793 143526
12418 143526 -162097 -154727 126622 -219066 53251 -157475 -59009 -20490 10121 22630 -51256
12406 -1104 -51349 89535 2568 -161837 139022 56733 12930 169636 17524 45964 -11381
12394 -28708 134361 -86412 17646 152723 245990 -268243 -15124 105741 -224769 36082 271079
12383 271079 19667 -271361 118160 -180181 -47739 -158300 54204 233754 -172741 153617
12372b79642h1769A16951B2013J12583e2603B02160K64095A70994b94497a45592
12361d88341J16332i4663k6483B86057j19213F4084J14932a25316N2078B10751
12350b98521C6673M5085J24728I2465p732K7890D9864f3446p9517c916j43293
12339a47209B6064a25950A05162J17041C8780J95798c368j50858r8304A68167
12328D27952j61927B0675L3814g360A50484b97658j21855a31996E6631L448a38964
12316b6536B76003r6967p4465J57827b5122n5787l51144i5543B63445I8489J38832
12305B37321c46200A3574K71109F1162J73183A14284P2514d6367j14151G6380
12294D52674a37670B6327a40499A52539a04209C8252J69228a33876A86295a18359
$$ plain form
12372 -279642 -81769 116951 22013 134596 -52603 202160 466255 170994 -294497 -145592
12361 -488341 -372009 -94663 -121146 286057 166844 64084 179016 -125316 -73238 210751
12350 -298521 36673 81758 206486 92465 84733 112623 49864 -63446 -142963 -3916 -147209
12339 -147209 26064 -125950 105162 222203 38780 234578 -3368 -154226 -252530 168167
12328 427952 266025 20675 54489 -7360 150484 -297658 -419513 -131996 56631 60079 -138964
12316 -26536 276003 179036 104571 262398 -25122 -80909 -432053 -95543 263445 98489 237321
12305 237321 -346200 13574 284683 61162 234345 114284 186798 -46367 -160518 76380
12294 452674 -137670 26327 -140499 152539 -104209 38252 207480 -133876 186295 -118359
12283D3853N8881A795J32596n4732J15452o0803J8613n2078J7044K9372K63454
12272D10713j0468a05132a6822D05781b68238A03718b55021B40121o8559G9807
12261H8244C2497J49647D8679a38149E1254K3976h3109l6564k94438d8184C3445
12249a5387F9939l493H948a06338C8290J47055i4526n584I6065D6618K02980c8337
12236A06777i7345G8633J33522F6667q155a89653F1125O5932j5831B0123K4944
12225D5067M00541a34461c6454A31487a65252A22366J38886B8923d7289F5566
12214A58549J37685A25226g8338b8738A19046k136J01231q467a07336L1005K0602
12203e5729C39154A58650g307A68456K323l9441a2889G2408D012J07475K09452
$$ plain form
12283 43853 102734 1795 134391 79659 195111 134308 152921 100843 117887 147259 410713
12272 410713 400245 -105132 -16822 405781 -268238 103718 -255021 240121 171562 79807
12261 88244 32497 182144 48679 -138149 51254 75230 -83109 -119673 -414111 -48184 33445
12249 -15387 69939 66446 8948 -106338 38290 185345 -94526 -100110 96065 46618 249598 -38337
12236 106777 -97345 78633 212155 66667 58512 -189653 61125 127057 111226 20123 45067
12225 45067 445608 -134461 -36454 131487 -165252 122366 261252 28923 -47289 65566
12214 158549 296234 125226 -78338 -28738 119046 116910 218141 209674 -107336 -76331 -55729
12203 -55729 339154 158650 -7307 168456 170779 131338 -12889 72408 4012 111487 320939
12192C20939I804N0938c0367k7829A16270i4126l2749D77224j21734H0900O1575
12181A42475h3204n2402a6192A85157F4176j8112a69356e2549l9036C7921K2948
12170F0869K77684e0770B06388d125j12072C59591f5387E6616J96090m1114A2852
12158A99100c9306q3879j6307A38326J41799j37327B476N057a37947K9278E9609
12146i2353H6758K29072e1785m3136B12798a39504A11884b40509a22o7685E8033
12134d28593e1112j94480d1954a1904j40546D8151a12350D8366g344k9592A51224
12122b16562B04898c2865r2891j27558A54648A214e4584J6102A48387c5612I1575
12110B13570l6771L413a99719H4364K6987J7338a30827B06788L4313E2105J08607
$$ plain form
12192 320939 9804 60742 -30367 -58196 116270 -94126 -126875 477224 355490 80900 142475
12181 142475 -83204 -135606 -16192 185157 64176 46064 -169356 -52549 -91585 37921 60869
12170 60869 338553 -50770 206388 -4125 -116197 359591 -65387 56616 252706 211592 12852
12158 199100 -39306 -123185 -139492 138326 280125 142798 2476 7533 -137947 -108669 59609
12146 -92353 86758 315830 -51785 -94921 212798 -139504 111884 -240509 -122 -67807 58033
12134 -428593 -51112 -245592 -41954 -11904 -152450 48151 -112350 48366 -7344 -36936 151224
12122 -216562 204898 -32865 -125756 -253314 154648 1214 -54584 -38482 148387 -35612 91575
12110 213570 176799 180212 -199719 84364 111351 128689 -130827 206788 241101 52105 160712
12099A60712G8766a2658A49672c63028A12844b10646A06018J11155B3610b80769
12088d34124B71635A28180N9572b48017A30725J26687C2886b6609j69181a5719
12077b56501B54259L18989K57566K36283r9049A01107d7810e47k47780J6839d9889
12065B97159b8164A21689d0487I9861J4650k7972P4971b68333a29597M5443J2050
12054g2104j93819N9537J7419B52414d1446C6664A1343e0132B42228b2172A21044
12042a73043C0711a21561A708e2571j18486c978k56421j46299R718J53306e2010
12030A26572b44732d910r530q7337D5358Q5381D7117O7856A9640K48061j12367
12019A55334k5469d1163B24888q1546a32045C4008a43143F8546p197R4148D7050
$$ plain form
12099 160712 78766 -12658 149672 -363028 112844 -210646 106018 217173 23610 -280769
12088 -434124 271635 128180 187752 -248017 130725 257412 32886 -26609 -195790 -15719
12077 -256501 254259 573248 830814 1067097 968048 101107 -47810 -547 -248327 -231488 -49889
12065 297159 -28164 121689 -40487 99861 114511 86539 161510 -268333 -129597 -84154 -72104
12054 -72104 -265923 -206386 -188967 252414 -41446 36664 11343 -50132 242228 -22172 121044
12042 -173043 30711 -121561 1708 -52571 -171057 -3978 -260399 -406698 -396980 -243674 -52010
12030 126572 -244732 -4910 -14440 -101777 45358 130739 47117 114973 19640 267701 155334
12019 155334 129865 -41163 224888 143342 -132045 34008 -143143 68546 61349 155497 47050
12007e5835j13653B7969a65041L2184M8654A64153a16212A80501b4196m4565F6989
11995c33912a4929E1534L14808I5999D7213d9745k62040c1463l39408B77040h3266
11983B63850A4353b83057A41365g3455E5014j9143g3033a5472k36707o067E0684
11971B08920J38233g4554q4697k0571J4490E7372k535a01509k68871A43657e5041
11959A34314b45134J21596J3182M4632A24222i9629E5861K10744a60935j17725
11949b78660A03791J0604L0884h5230J459l90123B7034J56871d2334r2304A60139
11937a26902A67472b45762A46501b01120j47074e3838N566B5544f3905A05828
11926A42603F4077b50175e9002B03172a04413p9343Q4571A25895a11817G8720
$$ plain form
12007 -55835 -169488 27969 -165041 -132857 -84203 164153 -116212 180501 -24196 -68761 66989
11995 -333912 -14929 51534 366342 95999 47213 -49745 -311785 -31463 -370871 277040 -83266
11983 263850 14353 -283057 141365 -73455 55014 35871 -73033 -15472 -252179 -258246 50684
11971 208920 347153 -74554 -159251 -179822 -165332 57372 54837 -101509 -370380 143657 -55041
11959 134314 -245134 -123538 -110356 -65724 124222 -99629 55861 266605 -160935 -278660
11949 -278660 103791 114395 145279 -85230 -83771 -473894 27034 183905 -42334 -134638 160139
11937 -126902 167472 -245762 146501 -201120 -348194 -53838 -48272 25544 -63905 105828
11926 142603 64077 -250175 -59002 203172 -104413 -183756 -99185 125895 -111817 78720
11915g6879A83697A9918K07425a09164m1129A67080b15086B735a72865B84915
11904a72137E6208k6894K52689a83258J5622A58320D7534a87209d2641C6470R3147
11893A29617a66685A17644n4993e8175j21869A50218a5679p3683I3616d7747B09306
11881C3877a84369P9399a431j0122k26961a8394E9234J89889m9499h9504n382
11870i4886A35904b32637A56424a62803C6206f0306A02996b9758p6710G1504R1768
11859A63272J1864F8802C3646a13653B11434i1727A37405a438D9657a60449d9241
11847B8416k884M0025L52562a31059N6736C22993b14870K1969h8528G5785J2637
11836H8422a74544j6620E1692a00824C6511J122b19101A47846o7792c41752J70558
$$ plain form
11915 -76879 183697 19918 227343 -109164 -150293 167080 -215086 2735 -172865 284915
11904 -172137 56208 29314 282003 -183258 -167636 158320 47534 -187209 -42641 36470 129617
11893 129617 -166685 117644 62651 -58175 -180044 150218 -15679 -89362 93616 -47747 209306
11881 33877 -184369 -104970 -1431 -11553 -238514 -18394 59234 249123 199624 -89504 -94886
11870 -94886 135904 -232637 156424 -162803 36206 -60306 102996 -29758 -106468 71504 163272
11859 163272 175136 68802 33646 -113653 211434 -91727 137405 -1438 49657 -160449 -49241
11847 28416 25532 65557 418119 -131059 -74323 322993 -214870 -192901 -88528 75785 88422
11836 88422 -174544 -191164 51692 -100824 36511 37633 -219101 147846 80054 -341752 -171194
11825a71194g6010A30232e3940D2452a65247F7887a36494N080C0720N2004l8590
11814D4134k656L3429b99794c2612l5205K7438C0839c39141B07497j7138e0509
11802I4280P1536l4835B4425b48791R3782k65908H5798d3343k8176j15750Q2876
11791a04393E7626a04490j05711B21889c50324E5602h209j33558j03708j79803
11781d25278g5140j5903E791b8920A90590i7722A0110b19091E861a32010B05229
11769B9145d3969j0628j6169K3338E7751b17447O061k2538a16324A26060h5011
11757A17459a55873E7135a54454e9637B74392d2374J0348B08284a67182C0550
11746C51768A10652l0196a04498G8146B0861a48172A00407d4707j34996M9277
$$ plain form
11825 -171194 -76010 130232 -53940 42452 -165247 67887 -136494 -131414 30720 82724 44134
11814 44134 41478 74907 -299794 -32612 -67817 -40379 30839 -339141 207497 190359 -50509
11802 94280 165816 130981 24425 -248791 -155009 -420917 85798 -43343 -71519 -187269 -104393
11791 -104393 57626 -104490 -210201 221889 -350324 55602 -8209 -141767 -245475 -425278
11781 -425278 -75140 -91043 5791 -28920 190590 -97722 10110 -219091 5861 -132010 205229
11769 29145 -43969 -54597 -70766 -47428 57751 -217447 -211386 -233924 -116324 126060 -85011
11757 117459 -155873 57135 -154454 -59637 274392 -42374 -32026 208284 -167182 30550
11746 351768 110652 80456 -104498 78146 20861 -148172 100407 -44707 -179703 -130426
11736a30426B3709g3411H0410b0030B15187g5553j04956M1260K4367B44680a94021
11724c131q7806B31112b87944A64777e2615F9909J48024a07192p8108f9023m6374
11713a15397d2266B00605a9821A57006L128a79316B60434j12990K18261c592j7512
11702b1104G228J10313L901a22203A26805H608K17487e7298F2956b52368J01244
11691a51124E6539N5163P6332K35115j18220a14833B54685j15508l8326j2836
11681H8015J49345p2054K2188B0607K02297a28413C7469J48132a32470C66992
11670H3959J75215a0103B64130j10833L6513K131f1126C3725K1751g4441k83987
11659c58428F8502a62955A6672J4822Q8383b79297f3001F0277K61110p4480c0728
$$ plain form
11736 -130426 23709 -73411 80410 -20030 215187 -75553 -180509 -139249 -114882 244680 -194021
11724 -3131 -90937 231112 -287944 164777 -52615 69909 217933 -107192 -185300 -69023 -115397
11713 -115397 -42266 200605 -19821 157006 160134 -179316 260434 147444 365705 -3592 -21104
11702 -21104 7228 117541 121442 -122203 126805 8608 226095 -57298 62956 -252368 -151124
11691 -151124 56539 111702 188034 423149 304929 -114833 254685 139177 100851 88015
11681 88015 237360 165306 187494 20607 222904 -128413 37469 185601 -132470 366992
11670 83959 259174 -10103 264130 153297 189810 191941 -61126 33725 55476 -74441 -358428
11659 -358428 68502 -162955 16672 31494 119877 -279297 -63001 60277 321387 246907 -30728
11647A5083K0768K02162j08385a02430i024r6026A91074a32194A10761C8785K43139
11636B81924a92068g985A98583k8740A5390i3535C7952d5468B02293a95739C00032
11624A06650a9104B16090a73231D6520b06516j00218A9117a21890L2756j21559
11614b10693i0703M127A03580K03628r3754l8348l0262L29429e2744B4722M1675
11603F6397J68087b7701A25480a21290m13A38478b8029k7384k4944m892B62450
11591B30079E6440o09a397k78699C00863a16464K8296k6818I4545c8599C2662
11579I038L82821a71068B68045r7343l3532P3052A0931d277A93327J95199i787
11567B1276L55082a42640d6229B5219L9750a47694A45801n3666O6304J12014I2092
$$ plain form
11647 15083 35851 238013 129628 -102430 -9024 -105050 191074 -132194 110761 38785 281924
11636 281924 -192068 -7985 198583 169843 15390 -93535 37952 -45468 202293 -195739 300032
11624 106650 -19104 216090 -173231 46520 -206516 -306734 19117 -121890 -89134 -210693
11614 -210693 -90703 -86576 103580 307208 213454 175106 144844 474273 -52744 24722 66397
11603 66397 234484 -27701 125480 -121290 -121703 138478 -28029 -55413 -80357 -85249 262450
11591 230079 56440 55831 -1397 -280096 300863 -116464 -88168 -114986 94545 -38599 32662
11579 9038 391859 -171068 268045 170702 137170 210222 10931 -4277 193327 388526 -9787
11567 21276 376358 -142640 -46229 25219 64969 -147694 145801 92135 158439 270453 92092
11555a6152k5699r4188B23060m8267c2273B23408G8509a90201i1575A77966c00648
11543b05504M4990C16221B8236j679J97631m7826o1705K0083a92429A47319R6902
11532B44221K1340a95461B20365a49620A94303J91172A35498A3211M007J4144
11522C1362a0623K559A09851C8998Q3165h2317h123D28359f9066k3468L2719A07643
11509a82783j3006c4836k6777c327C34623a10606A58910m2850J30898p1196p9277
11498I6485L8216K85104j53912b54277i4106I4666B8980k598d45096i4830A26893
11486b64323g5951L0058I7566O1845K39783A12913C7432K04847a45159B88708
11475D1649Q1160K20237K78526a08250A6775a08589B05003C5386J45496Q455Q5026
$$ plain form
11555 -16152 -41851 -136039 223060 174793 -32273 223408 78509 -190201 -91575 177966 -300648
11543 -205504 -160514 316221 28236 26557 224188 176362 114657 134740 -192429 147319 244221
11532 244221 265561 -195461 220365 -149620 194303 385475 135498 13211 17218 31362
11522 31362 -10623 -8064 109851 38998 122163 -82317 -8123 428359 -69066 -92534 -59815 107643
11509 -182783 -195789 -34836 -61613 -3327 334623 -110606 158910 116060 246958 175762 96485
11498 96485 134701 419805 265893 -254277 -94106 94666 28980 26382 -445096 -94830 126893
11486 -264323 -75951 -45893 97566 159411 399194 112913 37432 242279 -145159 288708
11475 41649 122809 343046 621572 -108250 16775 -108589 205003 35386 180882 189337 274363
11464B74363J04017h6339C83349B4493L71066A92259R599m7727a75580B04419
11453A2451c3123A47624J12406I6944f2151p84G9953a1267j940k18521A47842
11441f8748B30953e0472A71776B1258J5781K7067b7006F0915K01618a4691B9481
11429b24217i9045p0104a9243A41227f8009F2187J37556J42849A35010J47803
11419B82813j34610C0580I366a53476b5231B45995E4359d0291I2686c84276i5565
11407A18892C6088G693a96904B19724A8516O9511K97779A13192O5824f5704J9478
11396d6226A27184K05738b01874j43725g3572j31448k11392f224j64716j31521
11386c02461a22082D56904c2469k21108G9804b4179J1476D42233a27691H0016
$$ plain form
11464 274363 378380 -86339 383349 24493 395559 192259 201858 154131 -175580 204419
11453 12451 -33123 147624 260030 96944 -62151 -62935 79953 -11267 -13207 -231728 147842
11441 -68748 230953 -50472 171776 21258 37039 64106 -27006 60915 262533 -14691 29481
11429 -224217 -99045 -169149 -19243 141227 -68009 62187 199743 342592 135010 282813
11419 282813 148203 30580 9366 -153476 -25231 245995 54359 -40291 92686 -384276 -95565
11407 118892 36088 7693 -196904 219724 18516 88027 385806 113192 179016 -65704 -46226
11396 -46226 127184 332922 -201874 -345599 -73572 -205020 -416412 -6224 -170940 -302461
11386 -302461 -122082 456904 -32469 -253577 79804 -24179 -12703 442233 -127691 80016
11375B50659d2600a8332C56261a95187p496a5778F3541k6770L1478K77642A14766
11363A06051n1348d7138J8031B67977a26338A84613e4506B07159a18844B51068
11352E942a88737L9051f513A74636J6054G6838J30651m6876a01673C24a27990
11340I0378C1255Q8314a07764b4674k8147G1972c76980h6894j26754B9679L539
11329C3218g7343K9537m08263K11037h2064M634j43788A52767P0540a52388c246
11317a90333g6943j39356G1512J3061b81542h1003j60092d1428j58554l48443
11307e48425a72210D992L0018a78349l37097a48904A75812b91119g7128C0148
11296a29547b7750A6070i6463p0606C5003b29944Q2524g0265A17350a75032D65504
$$ plain form
11375 250659 -42600 -18332 356261 -195187 -202683 -15778 63541 36771 68249 345891 114766
11363 106051 54703 -47138 -29107 267977 -126338 184613 -54506 207159 -118844 251068
11352 5942 -188737 -149686 -6513 174636 190690 76838 207489 160613 -101673 324 -127990
11340 90378 31255 119569 -107764 -24674 -52821 71972 -376980 -86894 -213648 29679 33218
11329 33218 -77343 -47806 -456069 -245032 -82064 -77430 -221218 152767 223307 -152388 -3246
11317 -190333 -76943 -216299 71512 84573 -281542 -81003 -241095 -41428 -199982 -548425
11307 -548425 -172210 4992 35010 -178349 -515446 -148904 175812 -291119 -77128 30148
11296 -129547 -27750 16070 -96463 -167069 35003 -229944 -147420 -70265 117350 -175032 465504
11284A71187B9920p443J28899m4340c06673B46494a14677B53177b6755o3581C96913
11272a6948m8453k93129J46142e9517j92407i8554j4109j12904C1486O1995r000
11261H4481a42745n6493G9371b8973l06375A24431n0921a97557F4347c45295J43035
11250b02260O9510G9639b2017n0494j27013e7938j07734D1K96920a63046B03772
11238D3500J00168a32049j15884i0260l16907j6537a62619o8756j42476A54056
11227A58381L61267C1457a54353n7235K777F6557a07754l525j72933j9529A54174
11215d8243q7281N376C5200J5264A8020h6062L0584j94228e5876H1270K4784a52076
11202i8539l8895A60517p1178L9635K8521J28127A07439b40117j02700a4246k40582
$$ plain form
11284 171187 29920 22477 151376 107036 -306673 246494 -114677 253177 -26755 -90336 396913
11272 -16948 -65401 -358530 -212388 -59517 -251924 -98554 -112663 -225567 31486 93481 84481
11261 84481 -142745 -199238 79371 -28973 -335348 124431 73510 -197557 64347 -345295 -202260
11250 -202260 -132750 79639 -22017 -72511 -199524 -57938 -165672 41 296961 -163046 203772
11238 43500 143668 -132049 -247933 -90260 -407167 -423704 -162619 -231375 -373851 154056
11227 158381 519648 31457 -154353 -211588 -208811 66557 -107754 -111279 -284212 -303741 154174
11215 -48243 -135524 -130148 35200 50464 18020 -86062 -55478 -249706 -55876 81270 106054 -152076
11202 -98539 -137434 160517 89339 128974 157495 285622 107439 -240117 -342817 -14246 -254828
11191b54828A88618d45794b1408D3005a10463p8235c1645J0739j18689A62129
11180C2538P388i6275j82452B328L4719d8700F3559a38637q0117B46014C0745
11168b38364g551j6954k56402a28842A13061c75302g1951q8812E7162b10853n845
11157b16698E1433I287J68298a69651A08561d2971F1034J28935b10731A66725
11146B15010k1058A8922b24936D2657a52833B69852H8061d8917C99889j25403
11136B74486g4239c6544B4855h1799L9901A34389i4544A13680m6179g6487p7643
11125a54130M0193A89750a41254j08127A18192K57298q2097e5121C04328A1899
11114B6025O1615i1206J2916A11575J38262h5870d2525H097L01560A14114J25362
$$ plain form
11191 -254828 188618 -445794 -21408 43005 -110463 -188698 -31645 -20906 -139595 162129
11180 32538 39926 -96275 -278727 2328 37047 -48700 63559 -138637 -218754 246014 30745
11168 -238364 -7551 -24505 -280907 -128842 113061 -375302 -71951 -160763 57162 -210853 -216698
11157 -216698 51433 9287 177585 -169651 108561 -42971 61034 189969 -210731 166725
11146 215010 193952 18922 -224936 42657 -152833 269852 88061 -48917 399889 274486
11136 274486 -74239 -36544 24855 -81799 -41898 134389 -94544 113680 67501 -76487 -154130
11125 -154130 -113937 189750 -141254 -249381 118192 375490 293393 -55121 304328 11899
11114 26025 87640 -91206 -78290 111575 249837 -85870 -42525 8097 309657 114114 239476
11103B39476p5069E3317O809J59967H9317k4690F38O7967J56032O324n6257L2850
11091B07554i4297B90431p2196G7742M5589h2696B43595J4507e471A99996J16561
11080C16557p2005b24210I0178K46151J23653A68185N1966N6278J58079A50459
11069C77890p1900J63495M8370n6467q2300L9159J41928j29195j44000A41579
11058C41854N5477J2115J8229L52604k91249l2883K12296l06155K94024j69051
11048D87261m4938N8347J92582r2288k06963K2745C7238P20869o7460k6076J01309
11037G65880J69193B39687Q1726L07361j81261R8324J46251j21115j56018L47574
11027G62529l8048k05008K35654j5891j95255J58724k25343J07916K0720j50918
$$ plain form
11103 239476 164407 53317 60126 220093 89317 64627 638 68605 224637 230961 174704 207554
11091 207554 -94297 290431 218235 77742 123331 -82696 243595 258102 -5471 199996 316557
11080 316557 244552 -224210 90178 336329 459982 168185 220151 276429 434508 150459
11069 377890 305990 469485 517855 461388 379088 418247 560175 430980 286980 141579
11058 341854 397331 409446 427675 780279 489030 456147 668443 362288 656312 487261
11048 487261 442323 500670 693252 600964 394001 416746 37238 758107 690647 664571 765880
11037 765880 935073 239687 321413 628774 447513 545837 692088 570973 414955 762529
11027 762529 724481 519473 755127 739236 543981 702705 477362 585278 605998 455080
11017D55080L04539M1027C34100K96951B49457J50782j86518Q5951k5647J94734
11007D68759B33768J57895K69011r3289p1370j59857l7520L06590j30541k1244
10997D53443J5277J33838j25890m8114o7979L14723Q0242l6537k46633N82686
10987A055056k16685k49214K92433j05750N2094J56100l35305K44894K0976L26077
10977A240676R0322N07610J27101j82219N51547m22174P42825m02235k92171m1929
10967A919353q0464m39123M22337n13395J67710L11526j65511M950l5758J96482
10957A788107j02331J77043l88115J08995k40429k00988k35380J1557k31386R641
10947F96714k55404d3013D00596q9532o2348j08834C8156L7204L82248H2549J45225
$$ plain form
11017 455080 759619 800646 334100 631051 249457 400239 213721 299672 274025 468759
11007 468759 233768 391663 660674 567385 496015 336158 298638 605228 474687 453443
10997 453443 468720 602558 476668 428554 360575 675298 755540 719003 472370 1055056
10987 1055056 838371 589157 881590 775840 827934 984034 648729 893623 914599 1240676
10977 1240676 1330998 1838608 1965709 1783490 2335037 1912863 2655688 2253453 1961282 1919353
10967 1919353 1838889 1399766 1822103 1308708 1476418 1787944 1622433 1627383 1591625 1788107
10957 1788107 1685776 1862819 1474704 1583699 1343270 1142282 906902 918459 687073 696714
10947 696714 441310 -43013 400596 311064 248716 139882 38156 75360 457608 82549 227774
10936B27774a61787H3787K21033o5696b7188B77477C7761P1539j3008K0733c039
10924D8264K90478a28940e5362A11930D8453A7371R4405a91703E8748a97402A75915
10912A16667J02480a28056E6778R6571N7961a85723A80017G7527L2195d3666A21578
10900a34140B94434a64862c1552o225j05120H7791J73898b30026d4544j42149
10890a86693e2629p3885M6394k26691C28697A24237d4031B90742B070K23117a1096
10878A42296b02329f2046G0705A9532a19827a6378B06613h0515B50271B8818i2762
10866F0473k3944a20693e9358D4322a99689O1252c6234A5188a48654L9604B30358
10854a07761D50749b7785j43009p0848R1471A14556a85470B64227b6379E3658
$$ plain form
10936 227774 -161787 83787 304820 239124 -27188 277477 37761 109300 96292 117025 -3039
10924 48264 338742 -128940 -55362 111930 48453 17371 111776 -191703 58748 -197402 175915
10912 116667 219147 -128056 56778 153349 211310 -185723 180017 77527 109722 -43666 121578
10900 -134140 294434 -164862 -31552 -37777 -142897 87791 261689 -230026 -44544 -186693
10890 -186693 -52629 -126514 -80120 -306811 328697 124237 -44031 290742 2070 225187 -11096
10878 142296 -202329 -62046 70705 19532 -119827 -16378 206613 -80515 250271 28818 -92762
10866 60473 36529 -120693 -59358 44322 -199689 -138437 -36234 15188 -148654 -109050 230358
10854 -107761 450749 -27785 -170794 -241642 -150171 114556 -185470 264227 -26379 53658
10843a32210A03332d1629n5497K5267F6824R0504E8614a46932n7042f688j68099
10832a74787Q4874J170c1728k541C3887K53463e5443B07139k4752g4910J5419
10821e9491F1340c33799f0491l5980J8418p2517B30797B3998g2701A55658b46196
10809D5843O3698b9077j09122B15178F661a6347p6659a1729l0144P343j14681
10798a49211C5630a62146C4964f1216L337r36k05468B1592b40417e9203A1968
10786b74432J20852A1063K35655j08687D1485b68716d2489k27811C7322a76023
10775H1051b05022l209R4245n5130G2958K17102G8296K39946g8952j21877R9371
10764a01458r3290R6262C91818A8969Q6288E1309b35269R8071j9375N9712a9963
$$ plain form
10843 -132210 103332 -41629 -97126 -71859 66824 157328 58614 -146932 -203974 -6688 -174787
10832 -174787 -89913 -88743 -31728 -34269 33887 287350 -55443 207139 182387 -74910 -59491
10821 -59491 61340 -333799 -60491 -96471 -78053 -150570 230797 23998 -72701 155658 -246196
10809 45843 109541 -29077 -138199 215178 6661 -16347 -93006 -11729 -41873 -34530 -149211
10798 -149211 35630 -162146 34964 -61216 -57879 -58815 -264283 21592 -240417 -59203 11968
10786 -274432 -153580 11063 246718 138031 41485 -268716 -42489 -270300 37322 -176023
10775 81051 -205022 -208231 -113986 -169116 72958 290060 78296 318242 -78952 -200829 -101458
10764 -101458 -194748 -98486 391818 18969 105257 51309 -235269 -137198 -156573 -96861 -19963
10752e5644k53366B68832j20348b60810A45456O8476B1651h5517j72183h6378
10741i6148j734K831J4231j76238A95580H0124a2922k36279a02380b4066j79181
10730b03247i2101A83043p8411a41319E515k23a0704A55453a54303m072A1227
10718a05359A3887a29728K101q3047A21869A0968c0643A49859m6174J47338I8398
10706a46802B89287g8602D10161q1354J2752b09130j87685a35407j0008c6362
10695a15722C5296a60045B76675a56531K9183A01761b82344d3232j07909l9002
10685a90143F9559j3370K448a13934a5941j68538j5170l3178c2663C1082L9872
10674G0954a59870p8678h3664q0514N1598b2435j03109A14710a70472p6985j58216
$$ plain form
10752 -55644 -309010 268832 148484 -260810 145456 213932 21651 -85517 -257700 -86378
10741 -96148 -97882 -95051 -80820 -257058 195580 80124 -12922 -249201 -102380 -24066 -203247
10730 -203247 -92101 183043 104632 -141319 5515 5292 -10704 155453 -154303 -158375 11227
10718 -105359 13887 -129728 -127627 -210674 121869 10968 -30643 149859 103685 251023 98398
10706 -146802 289287 -78602 410161 328807 341559 -209130 -396815 -135407 -145415 -36362
10695 -115722 35296 -160045 276675 -156531 -127348 101761 -282344 -43232 -151141 -190143
10685 -190143 69559 56189 58637 -113934 -15941 -184479 -199649 -232827 -32663 31082 70954
10674 70954 -159870 -238548 -83664 -164178 -112580 -22435 -125544 114710 -170472 -247457 -405673
10663d05673C46328m3615A40029c20625N9353D9659a05336j54369J7002F7734
10652d5646A73836d5493p5723j20855J01278C1793J67143N1144b2193p9859j1630
10641a13682N4588j73120A32112a13773N4456n847i554l751j16007j83384A40868
10629C45149f1881k92122c9451G8398d2264C9929a58632P3754A29962j9272N7827
10618A68517E0376M2330c31534i7710r4758Q707A8249b9713B12123d5736j5835
10607f1571J3835A19300b40985h4706m8923B30627b07781f8444j6542A52360a47840
10595B32284d6623B09503a68137C42531h2990B29728G5828a71587B6136d22432
10584A87490H2547B4035c47372g9899B4149d67742A10033b9818I7688c992n8973
$$ plain form
10663 -405673 346328 302713 140029 -320625 -261272 49659 -105336 -259705 -242703 67734
10652 -45646 173836 -45493 -121216 -242071 -140793 31793 198936 250080 -22193 -102052 -113682
10641 -113682 -59094 -232214 132112 -113773 -59317 -65164 -9554 -13305 -129312 -312696 140868
10629 345149 -61881 -354003 -39451 78398 -42264 39929 -158632 -84878 129962 110690 168517
10618 168517 50376 92706 -331534 -97710 -192468 -183761 18249 -29713 212123 -45736 -61571
10607 -61571 -47736 119300 -240985 -84706 -133629 230627 -207781 -68444 -84986 152360 -147840
10595 232284 -46623 209503 -168137 342531 -82990 229728 75828 -171587 26136 -422432
10584 187490 82547 24035 -347372 -79899 24149 -467742 110033 -29818 97688 -3992 -62965
10573f2965A5411a72206e385G9350m577B0247b79090e5273A32184J31129F4735
10561a71956A16724E2581a32176A5180g373j20326n8897O3540B58676j07052a2651
10549b78212h8041a4550B48543q7245L9560J48973d4225A81542b60438A84305
10538A90204a48050D6872K42203A06612d28143C775b7322j03762p6186h5997C3895
10526A43017f1816j5838l29313a85553j10136a24635D8461a91796d2527n1670
10516i4197L2321l36982F3356b93547a28073A78441p0018b1135q7341A18223a7741
10504C36952F518O4074N4596a49532B39865c9405B04627c26702b9520A31454m1917
10493H9537a03024l3306b6299q6061A80362e560j69673E29093A12765g063E02501
$$ plain form
10573 -62965 15411 -172206 -5385 79350 74773 20247 -279090 -55273 132184 263313 64735
10561 -171956 116724 52581 -132176 15180 -7373 -127699 -186596 -123056 258676 151624 -12651
10549 -278212 -88041 -14550 248543 161298 200858 349831 -44225 181542 -260438 184305
10538 190204 -148050 46872 289075 106612 -428143 3775 -27322 -131084 -207270 -85997 33895
10526 143017 -61816 -77654 -406967 -185553 -295689 -124635 48461 -191796 -42527 -94197
10516 -94197 -61876 -398858 63356 -293547 -128073 178441 108423 -21135 -108476 118223 -17741
10504 336952 6518 70592 125188 -149532 239865 -39405 204627 -326702 -29520 131454 89537
10493 89537 -103024 -136330 -26299 -112360 180362 -5560 -175233 529093 112765 -7063 502501
10481D07462L3258j42217K7640J18158f885F6584J29657b20433A53914Q9564l5718
10470B07760a55505g7301j01913A34504b90120O2817E356a12692E3351J664a247
10458a01229n6164J2242j45294A51565a73975l1933E511c17026i2542L7128q3621
10447a39035f2032k80064I4189a17793b9426A02221b69335B28518a92896E0378
10436e5584Q229f703r0445A32857f9801A55697h9764n6099a8409A7481J94025
10425B11506a03981E8727J9462J05520F7707h5218B72679A16097a19903l42157
10415d62060a46706j27024c9535k15812f2227A42462c0866l92503a30090B14056
10404b3140A01463e4377A02485a13802E6540j2596a97098d8595A12972j1904a03524
$$ plain form
10481 407462 440720 298503 326143 444301 -6885 66584 196241 -220433 153914 243478 207760
10470 207760 -155505 -77301 -179214 134504 -290120 -227303 5356 -112692 53351 55015 -1247
10458 -101229 -157393 -145151 -290445 151565 -173975 -205908 5511 -317026 -92542 -55414 -139035
10447 -139035 -62032 -342096 94189 -117793 -29426 102221 -269335 228518 -192896 50378
10436 -55584 -47355 -6703 -97148 132857 -69801 155697 -89764 -145863 -18409 17481 211506
10425 211506 -103981 58727 78189 183709 67707 -85218 272679 116097 -119903 -462060
10415 -462060 -146706 -273730 -39535 -255347 -62227 142462 -30866 -423369 -130090 214056
10404 -23140 101463 -54377 102485 -113802 56540 43944 -197098 -48595 112972 101068 -103524
10392f2995H7827f039A68858m0479b30710b2390A70217J72436a28633d4219C25642
10380A24839j4623J55668e4737q6323B14191l9351B2923L56543f5416B45335J57697
10369D03032j53439c2942D25637J7392L5064j37032n7861a87269B84994n0652
10359B34342M8444N4065i4482B07632h2936B72720k3029M6626J30726K79097C41307
10347D64701B0146J88284A8141L40526M7492A21019i9119I5073K1235L1022m9601
10336I7729N4865a0843o9992j29086D51262i0286q9212A89970F7917c1437k06430
10325b37867f6978D4235K72602r2565J09021j58941d5540C38782j40665l5898
10315A62219Q870c03959b6351C03961A06006J1108b4139l52922A77480b2787j207
$$ plain form
10392 -62995 87827 -6039 168858 128379 -230710 -22390 170217 342653 -128633 -44219 325642
10380 124839 110216 265884 -54737 -141060 214191 174840 22923 379466 -65416 245335 403032
10369 403032 249593 -32942 425637 443029 478093 341061 283200 -187269 284994 234342
10359 234342 282786 336851 -94482 207632 -82936 272720 249691 296317 427043 706140 341307
10347 464701 20146 208430 18141 358667 406159 121019 -99119 95073 116308 147330 97729
10336 97729 152594 -10843 -80835 -209921 451262 -90286 -179498 189970 67917 -31437 -237867
10325 -237867 -66978 44235 316837 224272 333293 174352 -45540 338782 198117 162219
10315 162219 171089 -303959 -26351 303961 106006 117114 -24139 -377061 177480 -22787 -23994
10304b3994A4787a35368b896k0559j4624A58983a41012d2353l8976A84705d41735
10292b12504H5849L18507G8658l4389Q523K65114f8204B3685A6N7673h5768B9496
10279A05250i5434j7214A04189a63957f2332B4744a26420F7568B923b70236C32945
10267E3343a60826F1564J1832k4965E317N8743J27466J72042J68479A93182M6085
10256B39267k6698d23638B75310d753E3400b74440C62808a67666C6127J1894Q3431
10245A31452c45677I7342b67135A68273E3925h0400j60243R3728g1363g577o1843
10234f9420B56917b02873l5856B461N5424b64468J27662r047G2751r908J06498
10223A69341a30270e7718A00007m7180b98474a03199A55529h4837o2228A21077
$$ plain form
10304 -23994 14787 -135368 -2896 -23455 -38079 158983 -141012 -42353 -81329 184705 -441735
10292 -212504 85849 404356 78658 44269 52792 317906 -68204 23685 16 57689 -85768 29496
10279 105250 -95434 -112648 104189 -163957 -62332 24744 -126420 67568 2923 -270236 332945
10267 53343 -160826 61564 73396 48431 5317 64060 191526 363568 532047 193182 239267
10256 239267 212569 -423638 275310 -4753 53400 -274440 362808 -167666 36127 48021 131452
10245 131452 -345677 97342 -267135 168273 53925 -80400 -240643 -146915 -71363 -7577 -69420
10234 -69420 256917 -202873 -238729 2461 57885 -264468 -136806 -145853 72751 62843 169341
10223 169341 -130270 -57718 100007 52827 -298474 -103199 155529 -84837 -147065 121077
10212a15746j74507a01307D3091O2639c2443H3447f5156A52832i5538l9110d931
10200B4897J11768n1151b0050F455O336a17391j39766B68391B7078K7989J21777
10189A76844b81477i1408k2952D3500d06914a15137A50094a50546p8519R3196
10179a35869l40003K30814A51703a42512n1136c8026D3750J49319d0954A15211
10168B49656j15610a49808B7000a63195M4022p865E9271h1607j63196e907A52976
10156a65738L1981N1067b6931B47404g7443A2549a25354a2706a642l31212a00256
10144A18280d8093k5492j3449l4360r3488F1588d3263j80865C96909H8045C0916
10132d20859a16831E9957a8775A29181a63045f3066B92321k8319b44147g0900
$$ plain form
10212 -115746 -290253 -101307 43091 105730 -32443 83447 -65156 152832 -95538 -134648 -4931
10200 24897 136665 85514 -20050 6455 12791 -117391 -257157 268391 27078 55067 176844
10189 176844 -281477 -91408 -114360 43500 -406914 -115137 150094 -150546 -229065 -135869
10179 -135869 -475872 -245058 151703 -142512 -193648 -38026 43750 193069 -40954 115211
10168 249656 134046 -149808 27000 -163195 -119173 -127038 59271 -81607 -244803 -5907 152976
10156 -165738 -133757 -82690 -26931 247404 -77443 12549 -125354 -12706 -1642 -332854 -100256
10144 118280 -48093 -73585 -87034 -121394 -214882 61588 -43263 -224128 396909 88045 30916
10132 -420859 -116831 59957 -18775 129181 -163045 -63066 292321 264002 -244147 -70900
10121F2050c54762a30336B464b19072B05783K8972f5697H0620i4592C3214A5649
10109c54577K653E8522a66515A04820b52750Q9675k32320A68469e8580E5066J99055
10098B54121E9951J48996b86614a28509a7854I7597b21517a05892d3191q3580
10088a26771j26975J04313j03561E0133R9415a81221Q9865A70215a4133B48564
10077b02398A23797a02096E8719d02420A7648a08359B9330c85058G61d9673A61200
10065A11860c15588B59875A19458l9147M0469A3619b52238j83892B34615h4137
10054A0099L11155c18865k5127B55833a34372j58665B51572e9503j39468J455
10044a97516o3353B129J7739b23545A59998c0088k38229E3927h4089A61839f4041
$$ plain form
10121 62050 -354762 -130336 2464 -219072 205783 234755 -65697 80620 -94592 33214 15649
10109 -354577 -351924 58522 -166515 104820 -252750 -163075 -395395 168469 -58580 55066 254121
10098 254121 59951 208947 -286614 -128509 -17854 97597 -221517 -105892 -43191 -126771
10088 -126771 -253746 -149433 -252994 50133 149548 -181221 -91356 170215 -14133 248564
10077 -202398 123797 -102096 58719 -402420 17648 -108359 29330 -385058 761 -49673 161200
10065 111860 -315588 259875 119458 80311 120780 13619 -252238 -436130 234615 -84137
10054 10099 321254 -318865 -343992 255833 -134372 -293037 251572 -59503 -198971 -197516
10044 -197516 -260869 2129 19868 -223545 159998 -30088 -268317 53927 -84089 161839 -64041
10032a88216e7257k41128B25977o1689b02580B3374a5865B8975b48520p3098A38362
10020A46935a63675a5953q1272K1662D5011a52399A21190J17231h2761o3683D667
10008A85792g6776r2356A35728d1329k94652A7877B765c9912E8451M2081O4925
9997A65457E8851B4660a04833a1219D7602b50634B2589L01251E6491b55034i9490
9985a18811j35476G1049P6724e8164E9671a26602A56679a42792A11120c36091
9974c48459A70654b32588K6081H8695K44168A3327f9789B6574c42059a62374q235
9963a70609C4006n90e4453j21061A43447b23940B01856c23613A65625B6960c26501
9951a05248j02240f5805A93181e9961C1509a23916c5857j84548H1235a60713a1240
$$ plain form
10032 -188216 -57257 -298385 225977 164288 -202580 23374 -15865 28975 -248520 -321618 138362
10020 146935 -163675 -15953 -97225 -75563 45011 -152399 121190 238421 -82761 -146444 4667
10008 185792 -76776 -169132 135728 -41329 -335981 17877 2765 -39912 58451 100532 165457
9997 165457 58851 24660 -104833 -11219 47602 -250634 22589 323840 56491 -255034 -99490
9985 -118811 -254287 71049 147773 -58164 59671 -126602 156679 -142792 111120 -336091
9974 -348459 170654 -232588 -206507 88695 332863 13327 -69789 26574 -342059 -162374 -170609
9963 -170609 34006 33416 -54453 -175514 143447 -223940 201856 -323613 165625 26960 -326501
9951 -105248 -207488 -65805 193181 -59961 31509 -123916 -35857 -220405 81235 -160713 -11240
9939D8959a75024F197L07197i2584B85572g569j82374C8569J40947b10479k6033
9928b36512I1499J2424f0823g954j72464G6377b63147B82026f8360l66971e9477
9916f3867l1557r3635j5759n4782d8960l48229B26997j07777J34105b57408L5210
9905b22198H2041a29137G7428h7337A28315D6482g4272G8675f305j75131E6163
9893a22454B23189a36961b3330g922A81924a67634A17551e4686k72902H7097j2057
9882G5040a33708A39784J46412b81082a11023B7288L03172b98291A51902b9434
9871a13167d8762j98930c1942c332G2957k0678a35281C1013a38384D3980d81116
9859b34720A2665h6482k22227J20176a8181l80030a63337a1932A73037f7781n565
$$ plain form
9939 48959 -175024 6197 313394 -92584 285572 -7569 -189943 38569 179516 -210479 -236512
9928 -236512 91499 103923 -60823 -7954 -180418 76377 -263147 282026 -68360 -435331 -59477
9916 -63867 -95424 -189059 -204818 -259600 -48960 -397189 226997 119220 253325 -257408 -222198
9905 -222198 82041 -129137 77428 -87337 128315 46482 -74272 78675 -6305 -181436 56163
9893 -122454 223189 -136961 -23330 -7922 181924 -167634 117551 -54686 -327588 87097 75040
9882 75040 -133708 139784 286196 -281082 -111023 27288 330460 -298291 151902 -29434
9871 -113167 -48762 -247692 -31942 -3332 72957 52279 -135281 31013 -138384 43980 -481116
9859 -234720 12665 -86482 -308709 -188533 -18181 -398211 -163337 -11932 173037 -67781 -73346
9848g3346j27666A75157E4218d14240A28138c9668O391j6804J7837j84261C4771
9836b73958q5923a61104r0325N251R7014e3449A48662d56748e935j1319p8371
9825i5625j82671h3482o1981A35680O9459b35051F9208N0129i8897j78528B97554
9813d0465l71594J87290E3877c41736f8160G869h8392K6836q7130o6258C9380
9801i361m0079J5147o2856D3387M87806g7921L2849I9609D7219K1571A7620b53960
9788d7382k6483k0551j68335Q0185o053j12611i7244H6616b58433F7320c09457
9776e7755q7673A38168a80354r5162N7098b7778I534a4230k19044E8766A7775
9764a19404l03984H057a37997A29215L0173b3536o4401j96700A87213f7730J6819
$$ plain form
9848 -73346 -201012 175157 54218 -414240 128138 -39668 -33277 -50081 -32244 -216505 34771
9836 -273958 -359881 -161104 -251429 -246178 -149164 -53449 148662 -456748 -5935 -17254 -95625
9825 -95625 -278296 -83482 -145463 135680 205139 -235051 69208 119337 -98897 -277425 297554
9813 -40465 -412059 -224769 53877 -341736 -68160 7869 -88392 -61556 -148686 -214944 39380
9801 -9361 -49440 -34293 -97149 43387 531193 -77921 -45072 99609 47219 68790 17620 -253960
9788 -47382 -73865 -94416 -262751 -182566 -188619 -301230 -97244 86616 -258433 67320 -309457
9776 -57755 -145428 138168 -180354 -275516 -218418 -27778 9534 -14230 -233274 58766 17775
9764 -119404 -423388 8057 -137997 129215 159388 -23536 -87937 -284637 187213 -67730 -50911
9753e0911j00389f722k6109o2507j54133N3939e9536A34220C9919J14730d5809
9741a32755r797H4166i4287D1534C421b30820i9178d0758k59459A36919b27379
9729a0465p0503p5285d8797k70559a7986A1435P6556b09298N6258I1539a12494
9717e2047k1794B8217L33479f5836j52401j7006H4467a4248k24723a00862o3456
9706a64318k9431b3050q6119A94195L1734p9352i4589k1198B06934b1024A43725
9694b47582A48779n0947f796j88945P0238l3659C2222a83182C6163L31330c33061
9682a18929j738B11743r1786K20421A03668a17694J1567K0433c1877m21q7616
9671a19914r5342A85525L6239a2578j25307o4394K4970P2760A65681o3476a83271
$$ plain form
9753 -50911 -151300 -6722 -32831 -95338 -249471 -195532 -59536 134220 39919 154649 -45809
9741 -132755 -142552 84166 -94287 41534 3421 -230820 -99178 -40758 -300217 136919 -227379
9729 -10465 -80968 -156253 -48797 -319356 -17986 11435 87991 -209298 -153040 91539 -112494
9717 -52047 -73841 28217 361696 -65836 -218237 -235243 84467 -14248 -238971 -100862 -164318
9706 -164318 -193749 -23050 -109169 194195 225929 146577 -94589 -115787 206934 -21024 143725
9694 -247582 148779 97832 -6796 -195741 -125503 -159162 32222 -183182 36163 367493 -333061
9682 -118929 -120667 211743 119957 340378 103668 -117694 -106127 -85694 -31877 -32298 -119914
9671 -119914 -215256 185525 221764 -12578 -137885 -202279 -177309 -104549 165681 102205 -183271
9659g9845j13668j6352B26837o0320a36799E2288a1442j07753L8204L4773k6160
9648g2378j11871A83379D0919a15481L5712J2307r8218J8438p4617E4180K39800
9637B93980g8010k0499K6398k85662a78338J1455l91669g1572l57059P1398a0935
9625b05692I9011d7627j66953h6678A65765a12236n3177A29222c92022g5575r0732
9614a66307b322C2197a35450p8612g9379E4J17869J5138a55719E0233k1663a74458
9601G7260O9152G1246L7372h1577j22313c8523I7693a60093B62737D1989R9094
9590A41083d7693B56140h5799k31134a17118k62454K0937A26758a83659d7907
9579E6738K63446b02996A64834a509q6897F473L23606i195l05762R8906d2196
$$ plain form
9659 -79845 -193513 -209865 226837 166517 -136799 52288 -11442 -119195 -80991 -46218 -72378
9648 -72378 -184249 183379 40919 -115481 -79769 -67462 -165680 -147242 -221859 54180 293980
9637 293980 -78010 -98509 -72111 -357773 -178338 -166883 -558552 -71572 -428631 -357233 -10935
9625 -205692 99011 -47627 -214580 -86678 165765 -112236 -165413 129222 -392022 -75575 -166307
9614 -166307 -2322 32197 -135450 -214062 -79379 54 117923 133061 -155719 50233 28570 -174458
9601 77260 146412 71246 108618 -81577 -203890 -38523 97693 -160093 262737 41989 141083
9590 141083 -47693 256140 -85799 -316933 -117118 -379572 -358635 126758 -183659 -47907
9579 56738 320184 -202996 164834 -1509 -88406 6473 330079 -9195 -314957 -216051 -42196
9567a917j45825M3973j72577a01158B66232f5928k57555H0396L50326A50341o0605
9556H9736A9705c9263A69229e3043l13845D9858K75659a71641C9141c64903i1214
9544C8361b4590l44028a77765A47465b65788G9120f5255j79668c8985A35188M2206
9533A77394g614o2244G1518K89314h3628B4112a42446A36578A2240d1776j93889
9522b35665k69650K49897Q6486a1704q0290k0357M9150B24725A11879a03332n8987
9511a62319A47134b58662C44293A1903L37468b16590J08148d0494p5495m00708
9501e16697a51649l17857A69141p5086d11629a14407I2551a372A5266a67431A1048
9489B26133a46834M6784B09366a7053j10005r6782B29884B9957a88618k3795I3675
$$ plain form
9567 -1917 -147742 -103769 -276346 -101158 266232 -65928 -323483 80396 430722 150341 89736
9556 89736 19705 -39263 169229 -53043 -366888 49858 325517 -171641 39141 -364903 -91214
9544 38361 -24590 -368618 -177765 147465 -265788 79120 -65255 -244923 -38985 135188 177394
9533 177394 -7614 -69858 71518 360832 -83628 24112 -142446 136578 12240 -41776 -235665
9522 -235665 -505315 -255418 -168932 -11704 -91994 -112351 -63201 224725 111879 -103332 -162319
9511 -162319 147134 -258662 344293 11903 349371 -216590 -108442 -40494 -115989 -516697
9501 -516697 -151649 -469506 169141 94055 -411629 -114407 92551 -1372 15266 -167431 11048
9489 226133 -146834 -100050 209366 -17053 -127058 -223840 229884 29957 -188618 -212413 93675
9477b5160j03014L643d9260j13579A29848g779F9331d90907A3767K4098a87014
9465D7285c27620f1695D9649f0597p493j84116A51293k457L277R2208b25111F4412
9452a87088b353j64094D0987q743a09087m3138B09987c50140E6663M04330c28498
9440C03023D1331Q181a17197C7856h8587E7987d0405G4312a2830j66616j0073
9429a89519A3845b3058A68326a23376k5675B1286c21960c1889k44124B5968J20737
9418A46705c7465N430G5293g8542J6189E9263a86620K9059A14203C1848Q6753
9407A18601a65399E3902d2410A31860b77196r5835h800l0065A57156a43344r6369
9396b39713k66884F6646h8709P971j16196j3533j84057G2952j2287M8884g6802
$$ plain form
9477 -25160 -128174 -124531 -49260 -162839 129848 -7779 69331 -490907 13767 37865 -187014
9465 47285 -327620 -61695 49649 -60597 -68090 -252206 151293 148836 152113 244321 -225111 64412
9452 -187088 -2353 -166447 40987 32244 -109087 -152225 209987 -350140 56663 460993 -328498
9440 303023 41331 49512 -117197 37856 -88587 57987 -40405 74312 -12830 -179446 -189519
9429 -189519 13845 -23058 168326 -123376 -149051 21286 -321960 -31889 -276013 25968 146705
9418 146705 -37465 -32035 75293 -78542 -62353 59263 -186620 -157561 114203 31848 118601
9407 118601 -165399 53902 -42410 131860 -277196 -373031 -8800 -38865 157156 -143344 -239713
9396 -239713 -506597 66646 -88709 -80738 -196934 -210467 -394524 72952 60665 109549 -76802
9384b00721i5817D9010B1976a25342A73035F6187B7957M5698b89920J41773F3680
9372H4642a88167j10166a22818J7319p5978A19849e6016A16496R8759C0329a65031
9360c18244J10418a03039D9749a08411j47897j34744J77313A34656J08110a29571
9349A0489J37862a4936D03428j66749i8994o8601F8914g1411L4795l37676b9605
9337a93339j93798J67847b3823F2453d1943j6017h873C9591a09159j7859c0943
9325B39059d56558E4676b8200r0941p014J9671F5686K6064A3341a59186k60441
9314d19627g8224j04877D46461a91474o8356G4854L4694K775D2684a41507B40984
9302D511h7094B44451a64157o3272A08884R0143D4401J62767b20892A34206b56003
$$ plain form
9384 -200721 -95817 49010 21976 -125342 173035 66187 27957 73655 -289920 -148147 63680
9372 84642 -188167 -298333 -122818 -105499 -181477 119849 -56016 116496 215255 30329 -165031
9360 -318244 -207826 -103039 49749 -108411 -256308 -391052 -213739 134656 242766 -129571
9349 10489 148351 -14936 403428 236679 -98994 -167595 68914 -71411 -36616 -374292 -29605
9337 -193339 -387137 -219290 -23823 62453 -41943 -57960 -8873 39591 -109159 -127018 -30943
9325 239059 -456558 54676 -28200 -119141 -126155 -106484 65686 91750 13341 -159186 -419627
9314 -419627 -78224 -183101 446461 -191474 -259830 74854 109548 112323 42684 -141507 240984
9302 4511 -87094 244451 -164157 -227429 108884 199027 44401 207168 -220892 134206 -256003
9290f1908D8227c01294G678a62271a2996k99904R9157e6221A43106b51615A4112
9278c25012J41474I5492C9546K50499A8593b33477J12917j93337J00360j04808
9268c18345R4712A60323G600L7971c57212e4414L213j37811j18494a3738m8741
9257f2479l018j35643B7208J08436d48699B67695j7796b75916J11271K9357J6665
9246a18623a0041B0008b00771I8186c9257k5596a2228j31564m3035c5217m7559
9235h2776c3318m652k41170a35518j6238C1613c49340l1201A24366J20735a10898
9223a47612l0237A84136a62335e7029B20390B0484b9428F1136d23156G6978R2249
9212A69227p187b027A1978K34974B1001g6402j60616O2758E1670a11901j32684
$$ plain form
9290 -61908 48227 -301294 7678 -162271 -12996 -312900 -213743 -56221 143106 -251615 14112
9278 -325012 -183538 95492 39546 290045 18593 -233477 -120560 -313897 -213537 -318345
9268 -318345 -223633 160323 7600 45571 -357212 -54414 -51201 -189012 -307506 -13738 -62479
9257 -62479 -65497 -201140 27208 135644 -448699 267695 249899 -275916 -164645 -135288 -118623
9246 -118623 -10041 20008 -200771 98186 -39257 -64853 -12228 -143792 -186827 -35217 -82776
9235 -82776 -33318 -37970 -279140 -135518 -151756 31613 -349340 -380541 124366 245101 -110898
9223 -147612 -177849 184136 -162335 -57029 220390 20484 -29428 61136 -423156 76978 169227
9212 169227 162040 -2027 11978 246952 21001 -76402 -237018 -174260 51670 -111901 -244585
9201b44585R796c4898l9516l34243E8152g5480A16292a4136D3015J94441k8705
9190B08751e2502A94659a49724O62l1387o7841L7210m6456l0954A32245c46762
9178a36747A3904J1253N2072g6643H3864c7536j45305N9347A92522a3811n1904
9167f5715A82248b42717a06101I2448a02088F8706K10741I5515J7052J9447d3575
9155h2958j19839d1414q8163c6663m6229q9647P9710m7707c8884p0299a0815j34494
9143a45309I9371c49490A71076a03521d0324A94964a20702k26632K2389A39961
9132E8539c29626a1026k76593A4277P6248b59442G1250A1409M2765O7472c91804
9120a21356j9593e2795l5712q4773C8600A3334a56256L1276j13840E3327f2474
$$ plain form
9201 -244585 -234789 -34898 -74414 -408657 58152 -75480 116292 -14136 43015 237456 208751
9190 208751 -52502 194659 -149724 -149062 -180449 -248290 -211080 -257536 -288490 132245 -346762
9178 -136747 13904 25157 77229 -76643 83864 -37536 -182841 -123494 192522 -13811 -65715
9167 -65715 182248 -242717 -106101 92448 -102088 68706 279447 95515 112567 132014 -43575
9155 -82958 -202797 -41414 -129577 -36663 -82892 -172539 -92829 -140536 -38884 -109183 -10815 -145309
9143 -145309 99371 -349490 171076 -103521 -40324 194964 -120702 -347334 -324945 139961
9132 58539 -329626 -11026 -287619 14277 90525 -259442 71250 11409 54174 121646 -391804
9120 -121356 -140949 -52795 -88507 -173280 38600 13334 -156256 -124980 -238820 53327 -62474
9108g3706j46161M0942g214j22662a419A29177a77490j60153G7795B4796a89160
9096g3733j1747q8240b3121j33747A82086j9408A5724J1206L3871a04951m126
9085a09077j25334E5583K39672F5799R1048c51115A53092c16074a27620K096B94990
9073A70523J95900i7793A61878E2431J20904a5709A63703A6159b68747k4862O3089
9062b30520C5060Q0391A4094J47665m136g0909K1570B24438n3515L4230c72483
9050A42725a0481o4559j28160i6069A9449K1401O4970L89739a2614C7960a01826
9038c88700I1888J57799b26123n7034J07037A3064N25198G7013d67240f9083j8704
9027h7787A90420a14619B19571q0333o7320B7888b44679J00569G4110g969A34250
$$ plain form
9108 -73706 -219867 -178925 -7214 -129876 -1419 129177 -177490 -337643 77795 24796 -189160
9096 -73733 -85480 -173720 -23121 -156868 182086 162678 15724 26930 60801 -104951 -109077
9085 -109077 -234411 55583 295255 65799 156847 -351115 153092 -316074 -127620 -125524 294990
9073 170523 366423 -97793 161878 52431 173335 -15709 163703 16159 -268747 -293609 -230520
9062 -230520 35060 115451 14094 161759 157623 -70909 -49339 224438 170923 205153 -372483
9050 142725 -10481 -75040 -203200 -96069 19449 40850 105820 495559 -12614 37960 -101826
9038 -388700 91888 249687 -226123 -283157 -176120 13064 538262 77013 -467240 -69083 -87787
9027 -87787 190420 -114619 219571 139238 71918 27888 -244679 -144110 74110 -7969 134250
9015a76710j68006B6474J64421D6676a32455C3717Q7343i4768J8648H5044A9607
9003a54051H5851d30893c9074I6074i6308j43899A36684b12662A06721P0670a70983
8991d1453A06797J1395d5004o4445M9699K1357k66172g2869A44999B0329a16413
8979F2523g5674q4207k4281g5691p8137A63458j5649O8321c60230a63230k65017
8968d28247A20467c18351Q3359R2734j9740p1156C13593c71503D4836b70928c8213
8956b82866A06582g7776H6708c7748a6959D7239b94687B08043E1186a45792A057
8944F7199h190j63066B69498k3266N944I7538N3256J71912A46083P7266F1103
8932B36310b5153j15879B95336r2130j2843O8163M55207M73515J988830O242945
$$ plain form
9015 -176710 -344716 26474 190895 46676 -132455 33717 121060 -94768 -76120 85044 19607
9003 -154051 85851 -430893 -39074 96074 -96308 -240207 136684 -212662 106721 177391 -170983
8991 -41453 106797 118192 -45004 -109449 -59750 -38393 -304565 -72869 144999 20329 -116413
8979 62523 -75674 -159881 -184162 -75691 -153828 163458 147809 216130 -360230 -163230 -428247
8968 -428247 120467 -318351 -234992 -142258 -161998 -233154 313593 -371503 44836 -270928 -38213
8956 -282866 106582 -77776 86708 -37748 -16959 47239 -294687 208043 51186 -145792 1057
8944 67199 -8190 -171256 269498 246232 252176 97538 150794 322706 146083 223349 61103
8932 236310 -25153 -141032 295336 203206 190363 258526 713733 1187248 3176078 9419023
8922I419023K676059m22560D882414A968823F14958j16284k24075a75237N2169
8913a23068E6185J15777K243N2822Q2443J4719j38649a25671q1794A8099a94957
8901c28145A25028f6963B2725K0077g9026C3402h1679o2976d6189P275j92511
8890b31425A93226b0336D1551O167b75261I6278P0004a41117j0781Q316c6408
8878g1869j21790K6542A97234c3069k3131H1539k5997k4270K9343e0026m7716
$$ plain form
8922 9419023 12095082 11672522 4882414 1968823 614958 498674 274599 -175237 -123068
8913 -123068 56185 171962 174205 227027 309470 324189 185540 -125671 -207465 18099 -194957
8901 -328145 125028 -66963 22725 42802 -79026 33402 -81679 -144655 -46189 -38914 -231425
8890 -231425 193226 -20336 41551 47718 -275261 96278 166282 -141117 -151898 -143582 -36408
8878 -71869 -193659 -167117 197234 -33069 -56200 81539 55542 31272 60615 -50026 -97742
$$ [...]
##END NTUPLES=NMR SPECTRUM
##END=
