##TITLE=AC1766_ROS_1_9683598_ZT42BX0wBU
##JCAMPDX= 6.0         $$ Bruker NMR JCAMP-DX V2.0
##DATA TYPE= NMR SPECTRUM
##DATA CLASS= NTUPLES
##ORIGIN= BRUKER
##OWNER= Administrator
$$ 1.72 TOPSPIN		Version 2.1
$$ 2016-04-17 00:16:32.267 -0700  Administrator@X
$$ Compression mode = diff/dup
##.OBSERVE FREQUENCY= 400.02188249412
##.OBSERVE NUCLEUS= ^1H
##.ACQUISITION MODE= SIMULTANEOUS (DQD)
##.ACQUISITION SCHEME= undefined
##.AVERAGES= 64
##.DIGITISER RES= 22
##SPECTROMETER/DATA SYSTEM= spect
##.PULSE SEQUENCE= noesygpps1d.comp
##.SOLVENT NAME= COFFEE_meoh
##.SHIFT REFERENCE= INTERNAL, COFFEE_meoh, 1, 14.96086
##AUDIT TRAIL= $$ (NUMBER, WHEN, WHO, WHERE, PROCESS, VERSION, WHAT)
$$ ##TITLE= Audit trail, TOPSPIN		Version 2.1
$$ ##JCAMPDX= 5.01
$$ ##ORIGIN= Bruker BioSpin GmbH
$$ ##OWNER= Administrator
$$ $$ E:\/data/COFFEE/nmr/AC1766_ROS_1_9683598_ZT42BX0wBU/12/pdata/1/auditp.txt
$$ ##AUDIT TRAIL=  $$ (NUMBER, WHEN, WHO, WHERE, PROCESS, VERSION, WHAT)
(   1,<2016-04-17 00:16:27.126 -0700>,<Administrator>,<X>,<go>,<TOPSPIN 2.1>,
      <created by zg
	started at 2016-04-17 00:04:57.486 -0700,
	POWCHK enabled, PULCHK disabled,
       configuration hash MD5:
       21 0F 79 D6 B3 7B B4 F6 88 20 88 DB 03 48 BD 9F
       data hash MD5: 64K
       10 D0 CC EA C9 62 25 63 AD 04 B4 8E AD 47 85 AD>)
(   2,<2016-04-17 00:16:30.236 -0700>,<Administrator>,<X>,<proc1d>,<TOPSPIN 2.1>,
      <Start of raw data processing
       efp LB = 0.3 FT_mod = 6 PKNL = 1 PHC0 = 0 PHC1 = 0 SI = 128K 
       data hash MD5: 128K
       42 17 27 39 9C B8 A6 BF 73 40 23 DB 1E 91 88 23>)
(   3,<2016-04-17 00:16:31.095 -0700>,<Administrator>,<X>,<proc1d>,<TOPSPIN 2.1>,
      <pk PHC0 = 269.209 PHC1 = 0 
       data hash MD5: 128K
       2D A7 C8 13 B2 AF 87 CB 4C F2 83 61 77 63 00 08>)
(   4,<2016-04-17 00:16:31.470 -0700>,<Administrator>,<X>,<proc1d>,<TOPSPIN 2.1>,
      <abs ABSG = 1 
       data hash MD5: 128K
       5D B1 AF 81 F6 0F BD A2 57 19 C0 BA 9E E4 3E 29>)
(   5,<2016-04-17 00:16:31.564 -0700>,<Administrator>,<X>,<proc1d>,<TOPSPIN 2.1>,
      <abs ABSG = 2 
       data hash MD5: 128K
       C1 5D 82 CB F1 30 F6 FF 9F AE 43 8F 99 3B 54 DB>)
(   6,<2016-04-17 00:16:31.642 -0700>,<Administrator>,<X>,<proc1d>,<TOPSPIN 2.1>,
      <abs ABSG = 3 
       data hash MD5: 128K
       AE 4F ED 3A E3 B2 C6 67 6E 0A B2 0D E5 2B 6D 19>)
(   7,<2016-04-17 00:16:31.736 -0700>,<Administrator>,<X>,<proc1d>,<TOPSPIN 2.1>,
      <abs ABSG = 4 
       data hash MD5: 128K
       6C E5 FF 3C A7 87 2D 51 16 E0 B2 E8 F1 8E 69 72>)
(   8,<2016-04-17 00:16:31.829 -0700>,<Administrator>,<X>,<proc1d>,<TOPSPIN 2.1>,
      <abs ABSG = 5 
       data hash MD5: 128K
       1E 43 A7 4B AE 64 D5 AC ED 96 E1 1F A7 C8 8D B5>)
$$ ##END=
$$ 
$$ $$ hash MD5
$$ $$ 11 AD 5E D4 53 E1 84 F0 A9 FF 07 9F 97 D8 DC E3
##$RELAX= 
##$RELAX= 
##$RELAX= 
##$RELAX= 
##$RELAX= 
##$RELAX= 
##$RELAX= 
##$RELAX= 
$$ Bruker specific parameters
$$ --------------------------
##$DU= <E:\>
##$EXPNO= 12
$$ [...]
150 150 150 150 150 150 150 150
##$TP07= 0
##$TPNAME0= <>
##$TPNAME1= <>
##$TPNAME2= <>
##$TPNAME3= <>
##$TPNAME4= <>
##$TPNAME5= <>
##$TPNAME6= <>
##$TPNAME7= <>
##$TPOAL= (0..7)
0.5 0.5 0.5 0.5 0.5 0.5 0.5 0.5
##$TPOFFS= (0..7)
0 0 0 0 0 0 0 0
##$TUNHIN= 0
##$TUNHOUT= 0
##$TUNXOUT= 0
##$USERA1= <user>
##$USERA2= <user>
##$USERA3= <user>
##$USERA4= <user>
##$USERA5= <user>
##$V9= 5
##$VALIST= <valist>
##$VCLIST= <CCCCCCCCCCCCCCC>
##$VD= 0
##$VDLIST= <DDDDDDDDDDDDDDD>
##$VPLIST= <PPPPPPPPPPPPPPP>
##$VTLIST= <TTTTTTTTTTTTTTT>
##$WBST= 2048
##$WBSW= 25
##$XGAIN= (0..3)
0 0 0 0
##$XL= 0
##$YL= 0
##$YMAX_a= 5587264
##$YMIN_a= -10093162
##$ZGOPTNS= <>
##$ZL1= 120
##$ZL2= 120
##$ZL3= 120
##$ZL4= 120
##$ABSF1= 14.96086
##$ABSF2= -5.597322
##$ABSG= 5
##$ABSL= 3
##$ALPHA= 0
##$AQORDER= 0
##$ASSFAC= 0
##$ASSFACI= 0
##$ASSFACX= 0
##$ASSWID= 0
##$AUNMP= <proc_prof1d_extract.lims>
##$AXLEFT= 0
##$AXNAME= <>
##$AXNUC= <1H>
##$AXRIGHT= 0
##$AXTYPE= 0
##$AXUNIT= <>
##$AZFE= 0.1
##$AZFW= 0.1
##$BCFW= 0
##$BC_mod= 0
##$BYTORDP= 0
##$COROFFS= 0
##$CY= 15
##$DATMOD= 1
##$DC= 0
##$DFILT= <>
##$DTYPP= 0
##$F1P= 0
##$F2P= 0
##$FCOR= 0.5
##$FTSIZE= 131072
##$FT_mod= 6
##$GAMMA= 0
##$GB= 0
##$INTBC= 1
##$INTSCL= 1
##$ISEN= 128
##$LB= 0.3
##$LEV0= 0
##$LPBIN= 0
##$MAXI= 10000
##$MC2= 0
##$MEAN= 0
##$ME_mod= 0
##$MI= 0
##$NCOEF= 0
##$NC_proc= -2
##$NLEV= 6
##$NOISF1= 0
##$NOISF2= 0
##$NSP= 0
##$NTH_PI= 0
##$NZP= 0
##$OFFSET= 14.96086
##$PC= 1
##$PHC0= 269.209
##$PHC1= 0
##$PH_mod= 1
##$PKNL= yes
##$PPARMOD= 0
##$PPDIAG= 0
##$PPIPTYP= 0
##$PPMPNUM= 2147483647
##$PPRESOL= 1
##$PSCAL= 4
##$PSIGN= 0
##$PYNMP= <proc.py>
##$REVERSE= no
##$SF= 400.020009692613
##$SI= 131072
##$SIGF1= 0
##$SIGF2= 0
##$SINO= 400
##$SIOLD= 131072
##$SPECTYP= <>
##$SREGLST= <1H.CDCl3>
##$SSB= 0
##$STSI= 131072
##$STSR= 0
##$SW_p= 8223.68421052631
##$SYMM= 0
##$S_DEV= 0
##$TDeff= 65536
##$TDoff= 0
##$TI= <>
##$TILT= no
##$TM1= 0
##$TM2= 0
##$TOPLEV= 0
##$USERP1= <user>
##$USERP2= <user>
##$USERP3= <user>
##$USERP4= <user>
##$USERP5= <user>
##$WDW= 1
##$XDIM= 131072
##$YMAX_p= 317198496
##$YMIN_p= -11493
##$CURPLOT= <Network HP LaserJet P1505>
##$CURPRIN= <$Network HP LaserJet P1505>
##$DFORMAT= <normdp>
##$LAYOUT= <+/1D_H.xwp>
##$LFORMAT= <normlp>
##$PFORMAT= <normpl>
##$SURQMSG= 1
$$ End of Bruker specific parameters
$$ ---------------------------------
##NTUPLES= NMR SPECTRUM
##VAR_NAME=  FREQUENCY,     SPECTRUM/REAL,   SPECTRUM/IMAG
##SYMBOL=    X,             R,               I
##VAR_TYPE=  INDEPENDENT,   DEPENDENT,       DEPENDENT
##VAR_FORM=  AFFN,          ASDF,            ASDF
##VAR_DIM=   131072,        131072,          131072
##UNITS=     HZ,            ARBITRARY UNITS, ARBITRARY UNITS
##FACTOR=    0.0627417313425164, 1,          1
##FIRST=     8223.62146879497, 974,          -52736
##LAST=      0,             2495,            -53438
##MIN=       0,             -11493,          0
##MAX=       8223.62146879497, 317198496,    0
$$ Real data points
##PAGE= N=1
##DATA TABLE= (X++(R..R)), XYDATA
$$ [...]
68090 88052 90003 92362 94762 96977 98851 100287 101392 102459 103798 105648 108153 111115 113875 115817
68076 115817 117079 118447 120374 122400 123777 124518 125450 127248 129727 132243 134610 137342 140968 145376 150029
68061 150029 154638 159273 163800 167629 170249 171776 172722 173431 173991 174488 174912 174961 174388 173578 173329 173920 174766
68044 174766 175174 175115 175077 175493 176544 178166 179907 181073 181374 181280 181437 181949 182640 183719 185552 187854 189745
68027 189745 190742 191179 191467 191424 190664 189179 187250 185091 182989 181420 180594 180093 179382 178552 178080 177985 177734 176964
68009 176964 175830 174594 173329 172160 171376 171018 170683 169927 168652 166917 164617 161577 157816 153571 149188
67994 149188 145055 141412 138105 134734 131157 127624 124347 121256 118311 115712 113565 111682 109960 108601
67980 108601 107633 106604 105172 103682 102668 102070 101464 100764 100055 98954 96959 94376 92073 90263 88370
67965 88370 86262 84636 83720 82539 80222 77385 75322 74259 73287 71804 70107 68584 67165 65775 64653
67950 64653 63969 63543 63173 62899 62762 62710 62838 63382 64294 65170 65776 66331 67107 68007 68730 69078 68928 68163 66854
67931 66854 65306 63831 62723 62524 63813 66386 68962 70175 69776 68600 67549 66944 66733 66866 67386 68343
67915 68343 69643 70857 71350 70877 69902 69019 68184 66927 65262 63862 63234 63182 63239 63175 62839 61978 60717 59910
67897 59910 60408 62004 63568 64258 64227 64041 63912 63759 63721 64113 64905 65577 65647 65197 64759 64752 65082 65307 65069 64365
67877 64365 63448 62581 61936 61641 61759 62191 62735 63364 64387 66182 68674 71135 72597 72556 71341 69802 68606
67860 68606 67797 67002 65965 64757 63536 62285 60977 59841 59273 59448 60137 60915 61411 61399 60866 60113 59627
67843 59627 59672 60041 60274 60087 59489 58608 57590 56615 55861 55320 54793 54144 53556 53492 54397 56333 58844 61212
67825 61212 63001 64382 65851 67584 69164 69959 69705 68687 67497 66661 66393 66504 66547 66174 65442 64747 64438
67808 64438 64460 64333 63486 61698 59317 57052 55504 54810 54710 54856 55034 55162 55186 55040 54706 54274 53903 53689
67790 53689 53551 53302 52826 52198 51628 51382 51703 52674 54022 55190 55718 55616 55342 55454 56276 57686 59061 59568
67772 59568 58841 57420 56277 55799 55512 54969 54603 55300 57132 58973 59624 59079 58428 58565 59333 59987 60221 60419
67754 60419 60923 61396 61236 60524 60173 60972 62677 64285 65061 64995 64356 63278 61926 60676 59762 58918 57743
67737 57743 56300 55013 54000 52932 51672 50691 50584 51330 52300 52900 53041 53017 53101 53282 53299 52943 52344 51897
67719 51897 51834 51958 51881 51429 50738 50057 49597 49497 49719 49961 49833 49203 48321 47567 47109 46796 46366 45789 45373 45474
67699 45474 46098 46954 47921 49171 50649 51720 51732 50845 49951 49750 50212 50939 51612 51899 51353 49862 47997 46585
67681 46585 45908 45598 45284 45083 45406 46459 48047 49749 51175 52119 52544 52466 51944 51172 50513 50277 50490 50986
67663 50986 51753 53034 55002 57352 59340 60339 60397 60197 60287 60407 59734 57909 55607 53911 53231 53118 53025 52904
67645 52904 52960 53139 53187 53062 53050 53448 54299 55404 56437 57089 57266 57201 57215 57355 57420 57368 57466 57959 58793 59807 60992
67624 60992 62322 63490 64084 63960 63223 61984 60443 59101 58437 58321 58139 57593 56975 56628 56645 57271 58892
67607 58892 61153 62655 62339 60876 59976 60444 61626 62670 63386 63723 63282 61858 59960 58334 57335 57009
67591 57009 57306 57855 58028 57661 57294 57306 57266 56660 55743 55000 54149 52591 50628 49374 49375 50122 51046 52215 53702
67572 53702 55001 55546 55431 55135 54844 54410 53752 52938 52046 51247 50878 51113 51657 51987 51875 51567 51532 52115 53304
67553 53304 54725 55962 56904 57597 57880 57569 57041 57092 57972 59001 59452 59380 59156 58621 57392 55786 54717 54589
67535 54589 54912 55104 55112 54998 54431 53032 51016 49130 47965 47478 47111 46308 45003 43693 42942 42827 43043 43463
67517 43463 44224 45287 46319 47211 48305 49751 51017 51477 51297 51280 51857 52665 53096 52838 51834 50249 48673
67500 48673 47936 48346 49310 50030 50363 50693 51193 51625 51872 52196 52884 53917 55111 56330 57420 58144 58411 58407
67482 58407 58313 58009 57229 55943 54423 52951 51622 50409 49283 48272 47469 47032 47092 47672 48695 50034 51495
67465 51495 52800 53704 54127 54198 54171 54242 54319 54016 53126 52098 51768 52399 53267 53420 52656 51496 50449 49721 49502
67446 49502 49959 50883 51770 52401 52969 53485 53521 52901 52218 52227 52873 53431 53553 53713 54440 55493 56115 55959 55445 55148
67426 55148 55095 54879 54351 53898 53927 54297 54476 54123 53293 52186 50988 49953 49404 49526 50306 51605 53074 54133
67408 54133 54428 54338 54624 55464 56249 56474 56342 56193 55813 54837 53532 52618 52411 52623 52981 53539 54350 55212 55921
67389 55921 56493 57024 57484 57746 57703 57360 56880 56471 56086 55448 54596 54136 54587 55661 56647 57359 58091 58703 58516
67370 58516 57369 56126 55629 55578 55036 53779 52571 52210 52759 53737 54624 55072 54942 54385 53759 53363 53233 53182
67352 53182 52936 52328 51495 50857 50714 50883 50915 50684 50536 50813 51453 52217 53097 54181 55185 55491 54857 53834
67334 53834 53199 53116 53220 53408 54101 55528 57242 58655 59687 60457 60652 59825 58260 56978 56761 57571 58974
67317 58974 60551 61758 61995 61293 60560 60690 61630 62667 63379 63856 64180 64204 63893 63508 63407 63841 64910 66407
67299 66407 67769 68518 68746 68886 69071 69097 69025 69302 70071 70733 70550 69530 68385 67711 67499 67444 67454 67654 67991
67280 67991 68085 67591 66627 65672 65050 64731 64692 65182 66373 67935 69348 70508 71658 72725 73186 72782 71983 71482
67262 71482 71473 71732 72115 72621 73053 73082 72679 72214 71980 71874 71706 71597 71830 72373 72810 72824 72635 72784 73433 74046
67242 74046 73857 72708 71261 70329 70058 69907 69350 68413 67521 67038 67105 67759 68868 69964 70459 70238 69859 69974
67224 69974 70660 71536 72406 73433 74685 75908 76935 77991 79296 80543 81113 80779 79935 79173 78825 78852 78917
67207 78917 78582 77676 76560 75895 76103 77121 78541 79729 79991 79122 77867 77414 78179 79359 79897 79610 79145
67190 79145 79096 79543 80236 80887 81326 81663 82233 83165 84079 84516 84552 84665 85011 85224 85009 84564 84326 84522 85095 85891
67170 85891 86788 87817 89118 90550 91442 91241 90465 90460 91810 93470 93980 93246 92523 92827 93997 95327 96472
67153 96472 97500 98592 99954 101674 103352 104207 103914 103096 102629 102651 102667 102444 102326 102620 103148 103671 104432 105934
67135 105934 108157 110249 111159 110595 109324 108484 108583 109208 109628 109488 108915 108248 107857 108067 108929 110151 111456
67118 111456 112890 114554 116160 117218 117654 117852 118052 118107 118002 118191 119116 120608 122044 122974 123406 123696 124341
67101 124341 125648 127301 128455 128604 128206 128075 128249 127991 126964 125906 125811 126751 127903 128599 129019 129870 131647
67084 131647 134256 137089 139365 140629 141148 141698 142736 143867 144351 144127 143966 144469 145312 145801 145921 146387 147726
67067 147726 149781 152058 154088 155418 155798 155600 155607 156086 156527 156574 156749 157745 159451 161265 163108 165415 168169
67050 168169 170636 172184 172912 173332 173807 174380 174817 174804 174421 174379 175355 177140 178954 180572 182551 185241 188222
67033 188222 190898 193050 194499 194921 194462 194052 194549 195958 197889 200281 203060 205521 206910 207502 208374 210080
67017 210080 212190 214145 215937 217767 219587 221328 223170 225271 227451 229346 230760 231811 232923 234679
67003 234679 237327 240345 242840 244584 246375 249144 252893 256750 259890 262149 263850 265384 267073 269199
66989 269199 271895 274933 277824 280301 282684 285528 288884 292171 294929 297374 299985 302819 305654 308642
66975 308642 312285 316812 321938 327275 332527 337276 341105 344199 347421 351483 356303 361418 366707 372360
66961 372360 378349 384374 390295 396270 402444 408716 414879 420854 426741 432731 438968 445447 452056 458723
66947 458723 465424 472073 478608 485278 492679 501319 511092 521240 530826 539365 547174 555127 563829 573026
66933 573026 582029 590758 599998 610472 621988 633785 645463 657202 669268 681689 694389 707234
66921 707234 719945 732336 744796 758197 773062 788947 804874 820320 835619 851482 868365
66910 868365 886363 905381 925137 945134 965000 984971 1005701 1027419 1049540 1071418 1093256
66899 1093256 1115855 1139611 1164230 1189377 1215061 1241211 1267439 1293539 1319880 1346965 1374870
66888 1374870 1403375 1432337 1461573 1490680 1519372 1547877 1576704 1606153 1636298 1667161 1698524
66877 1698524 1729729 1760094 1789419 1817819 1845316 1872043 1898639 1925805 1953407 1980414 2005743
66866 2005743 2028835 2049598 2068386 2086029 2103238 2119800 2134853 2148082 2160032 2170988 2180113
66855 2180113 2186132 2188584 2188064 2185522 2181638 2176553 2169849 2160983 2150028 2137793 2124950 2111264 2095941
66842 2095941 2078485 2058965 2037707 2015066 1991295 1966319 1939898 1912286 1884429 1857000 1829489
66831 1829489 1800817 1770736 1740096 1709743 1679704 1649545 1618990 1587970 1556537 1525031 1494025
66820 1494025 1463832 1434250 1404972 1375947 1347163 1318345 1289292 1260439 1232701 1206619 1181770
66809 1181770 1157061 1131625 1105542 1079807 1055512 1032943 1011441 990186 968994 948312 928597
66798 928597 909883 891874 874185 856389 838075 819102 799800 780809 762652 745512 729376
66787 729376 714263 700233 687224 674990 663160 651326 639151 626577 613918 601632 590017
66776 590017 579175 569164 559946 551241 542695 534207 525850 517409 508366 498590 488752 479750 471774 464179
66762 464179 456268 448072 440385 434043 429054 424349 418688 411872 404769 398067 391413 384122 376264 368585
66748 368585 361660 355718 351016 347621 344872 341759 337941 333834 329627 324910 319465 313783 308477 303739
66734 303739 299645 296375 293626 290398 285978 280841 276024 271890 267963 263791 259420 255211 251642 249073
66720 249073 247270 245326 242529 239151 235920 233013 230139 227360 224997 222817 220179 217141 214594 212977
66706 212977 211554 209447 206779 204308 202365 200678 198894 196763 194060 190904 187973 185926 184601 183177
66692 183177 181092 178507 175944 173764 171970 170285 168493 166910 166271 166822 167742 167897 167057 165856 164632
66677 164632 162957 160467 157580 155017 152972 151129 149261 147407 145602 143803 142108 140766 139890 139258 138422
66662 138422 136974 134865 132595 130994 130604 131229 132158 132770 132758 131964 130330 128183 126278 125263 125071 125048 124710
66645 124710 124216 123962 123883 123423 122201 120522 119086 118354 118277 118482 118489 117843 116448 114816 113765 113619 113804 113377
66627 113377 111942 109956 108202 107061 106326 105646 105016 104733 104895 105163 105169 105009 105059 105357 105478 105104 104435 103854
66609 103854 103430 102948 102240 101317 100310 99440 98847 98271 97099 95045 92639 90741 89694 89297 89481 90456 92054
66592 92054 93419 93711 92922 91750 90839 90386 90326 90561 90935 91157 90904 90036 88751 87527 86801 86674 86927 87269
66574 87269 87428 87068 85930 84128 82143 80380 78917 77698 76744 76059 75628 75679 76603 78317 79917 80402 79634
66557 79634 78263 76849 75480 74228 73405 73185 73314 73470 73587 73619 73249 72232 70932 70106 70090 70403 70295 69529
66539 69529 68495 67627 66935 66208 65524 65305 65738 66386 66601 66244 65812 65825 66330 67028 67679 68204 68553 68667 68571
66520 68571 68403 68287 68188 67922 67379 66762 66509 66842 67517 68118 68468 68577 68349 67699 66919 66543 66805 67516 68457
66501 68457 69519 70403 70711 70588 70777 71656 72553 72511 71474 70245 69424 68901 68328 67569 66582 65299 63828 62542
66483 62542 61818 61796 62362 63140 63604 63526 63237 63133 62963 62088 60500 59064 58551 58850 59407 60031 60805 61498 61605
66464 61605 60973 60078 59609 59963 61055 62382 63304 63503 63259 63143 63362 63501 62966 61676 60272 59505 59371 59019
66446 59019 57768 56109 55262 55658 56368 56319 55676 55489 56241 57343 58058 58326 58469 58523 58269 57753 57436 57769 58727
66427 58727 59801 60433 60481 60256 60113 60090 60019 59845 59676 59540 59354 59129 59049 59244 59642 60053 60320 60330 60047 59574
66407 59574 59096 58710 58341 57861 57223 56536 56064 56091 56595 57152 57345 57258 57346 57808 58360 58662 58686 58496 57970 57020
66387 57020 55967 55371 55482 56000 56405 56379 55920 55231 54610 54358 54634 55331 56125 56781 57411 58345 59638 60774
66369 60774 61068 60401 59406 58835 58847 58978 58706 57904 56790 55603 54449 53431 52756 52521 52430 51941 50851 49587
66351 49587 48750 48543 48801 49402 50340 51467 52559 53630 54798 55821 56137 55571 54653 54082 54088 54443 54768 54716
66333 54716 54214 53696 53743 54261 54448 53867 53088 52865 53152 53506 54037 55179 56690 57760 58097 58166 58240 58020 57445
66314 57445 57116 57419 57794 57490 56603 55814 55378 54988 54499 54151 54033 53794 53099 52079 51204 50858 51103 51721 52463
66295 52463 53303 54383 55580 56329 56167 55402 54915 55227 55966 56363 56078 55410 54878 54746 54905 55014 54728 53929
66277 53929 52879 52106 51979 52324 52575 52404 52116 52234 52815 53367 53421 52991 52521 52638 53861 56153 58647 60262
66259 60262 60765 60866 61078 60948 59818 57940 56262 55376 55262 55888 57318 59082 60110 59663 58056 56243
66243 56243 54955 54403 54451 54769 55037 55218 55510 55857 55804 55049 53972 53345 53619 54638 55904 56854 57088 56680
66225 56680 56261 56444 57031 57043 55700 53302 50987 49661 49345 49550 50063 51065 52522 53803 54177 53535 52388
66208 52388 51248 50336 49836 50001 50833 51957 53007 53949 54809 55368 55421 55198 55229 55772 56627 57440 57976 58050 57485
66189 57485 56333 55068 54380 54699 55877 57342 58547 59294 59678 59841 59826 59592 59017 58004 56730 55736 55510
66172 55510 55973 56578 56962 57208 57458 57590 57448 57115 56813 56718 56990 57701 58518 58839 58453 57827 57464 57303 57101
66153 57101 57049 57498 58273 58790 58817 58612 58320 57754 56846 55853 55007 54345 53993 54201 54960 55919 56872 57891 58816
66134 58816 59047 58249 57011 56354 56653 57377 57879 58120 58495 59131 59598 59449 58960 59026 60131 61682 62680 62885
66116 62885 62856 62970 63016 62825 62642 62606 62449 62093 61957 62229 62297 61553 60378 59696 59794 60249 60815 61639 62680 63702
66096 63702 64891 66679 68701 69760 69228 67853 66731 66083 65652 65739 66893 68747 70053 70107 69527 69317 69608
66079 69608 69655 68868 67486 66309 65920 66145 66230 65648 64706 64166 64266 64403 63939 63020 62339 62363 63116 64517 66406
66060 66406 68231 69249 69275 68847 68417 67739 66455 64961 64093 64037 64129 63863 63553 63744 64413 65222 66269 68047
66042 68047 70609 73212 74914 75346 74782 73709 72536 71648 71495 72450 74456 76889 78917 80087 80516 80487
66026 80487 80078 79345 78638 78422 78757 79213 79306 78878 78052 77146 76662 77096 78451 80062 81087 81181 80648 80047 79816
66007 79816 80186 81248 82966 85180 87593 89827 91578 92833 93910 95178 96767 98619 100779 103399 106394
65992 106394 109266 111496 113061 114374 115711 116921 117751 118193 118342 118116 117390 116259 114907 113324 111475
65977 111475 109661 108252 107096 105629 103672 101560 99358 96652 93562 91267 90694 91041 90542 88614 86419
65962 86419 85196 84973 85220 85925 87294 88912 89933 90002 89494 88929 88558 88463 88688 89268 90291 91823 93599
65945 93599 94999 95632 95804 96138 96892 97979 99412 101282 103367 105233 106755 108156 109489 110529 111290 112193
65929 112193 113511 114942 116001 116619 117169 118144 119928 122593 125615 128047 129341 129931 130703 131973 133318
65914 133318 134379 135448 137065 139289 141654 143700 145305 146490 147214 147569 148015 149116 150922 152826 154125
65899 154125 154614 154518 154057 153332 152527 151854 151300 150714 150147 149739 149181 147722 144984 141461 137952 134748 131689
65882 131689 128689 125717 122510 118884 115307 112504 110423 108193 105373 102655 100914 100000 99030 97613 96173
65867 96173 95160 94558 94246 94330 94871 95604 96189 96530 96672 96585 96201 95585 94957 94666 95079 96221 97418 97610 96344
65848 96344 94328 92835 92631 93628 95318 97167 98664 99395 99319 98909 98866 99612 100959 102222 102750 102450 101789
65831 101789 101291 101196 101615 102731 104599 106944 109399 111828 114198 116325 118076 119732 121771 124246 126712
65816 126712 128820 130697 132694 134972 137316 139153 139808 139091 137603 136162 134926 133490 131774 130221 128996
65801 128996 127653 125943 124314 123090 121656 119183 115936 113167 111704 111199 110792 109993 108857 107782 107355
65786 107355 108027 109676 111639 113293 114526 115660 117177 119455 122475 125752 128810 131713 134847 138206
65772 138206 141321 143923 146200 148167 149211 148668 146608 143734 140672 137623 134534 131265 127722 124111
65758 124111 121046 119117 118304 118019 117735 117456 117664 118939 121605 125469 129940 134530 139255 144363 149741
65743 149741 154919 159766 164823 170575 176511 181295 184007 184989 185281 185413 185081 183865 181790 178959 175041
65728 175041 169665 163235 156880 151403 146533 141387 135476 129107 123041 117925 113900 110528 107180 103683
65714 103683 100489 98088 96380 94821 93086 91280 89596 88136 87153 87062 87852 88694 88586 87413 86070 85385
65698 85385 85257 85074 84665 84370 84293 84165 84118 85011 87414 90564 92895 93573 93102 92551 92685 93792 95699 97783
65680 97783 99481 101020 103188 106217 109477 112563 116015 120426 125460 130473 135615 141446 147735 153691
65666 153691 159363 165731 173152 180644 187208 193072 198965 204767 209700 213509 216684 219560 221906 223457
65652 223457 224397 225196 226282 227889 229874 231652 232646 232856 232713 232385 231627 230349 228904 227492 225636 222588
65636 222588 218166 212899 207386 201689 195339 187824 179098 169700 160403 151702 143689 136365 129847 124240
65622 124240 119542 115808 113145 111283 109383 106701 103409 100399 98273 96934 96172 96138 96851 97681 97873 97435
65606 97435 97014 96891 96659 95994 95176 94560 93946 93027 92141 92016 92737 93489 93455 92648 91706 91183 91233 91709 92293 92697
65586 92697 93002 93700 95196 97339 99624 101767 103903 106332 109323 113111 117794 123198 129050 135313 142090
65571 142090 149197 156085 162334 167989 173258 178116 182424 186279 189868 192998 195052 195602 194920 193717 192333
65556 192333 190281 186701 181253 174522 167462 160604 153940 147492 141637 136715 132586 128820 125188 121727
65542 121727 118455 115368 112709 110913 110166 110174 110464 110733 110911 111050 111228 111423 111503 111510 111882 113019 114512 115209
65524 115209 114373 112516 110776 109706 108990 108073 106623 104504 101905 99548 98232 97945 97823 97205 96327 95724
65508 95724 95378 94874 94127 93451 93018 92748 92705 93124 93922 94569 94646 94320 94161 94642 95852 97412 98631 99056 99053
65489 99053 99564 101101 103319 105764 108599 112109 115804 118684 120423 121679 123078 124441 125289 125657 125930
65474 125930 126115 125742 124423 122250 119697 117419 115958 115260 114479 112683 109876 107066 105291 104787 105122 105740
65458 105740 106194 106197 105739 105027 104088 102621 100538 98494 97538 98134 99706 101130 101585 101005 99987 99363 99704
65441 99704 101041 102912 104658 105777 106212 106416 107028 108377 110331 112594 114956 117197 119001 120119 120465
65426 120465 120004 118829 117459 116671 116675 116796 116301 115274 114196 113050 111500 109803 108686 108296 108069 107858 108341
65409 108341 109824 111361 111768 111079 110328 110215 110684 111622 113212 115445 117834 119793 121035 121566 121600 121503 121520
65392 121520 121603 121764 122428 123959 125881 127134 127211 126577 125830 124975 123832 122642 121798 121233 120654 120244 120612 121878
65374 121878 123256 123811 123484 123103 123405 124335 125383 126349 127470 128839 130144 131175 132307 134143 136864 140240
65358 140240 144154 148715 153862 159265 164692 170159 175600 180718 185290 189310 192741 195375 197140 198250
65344 198250 198890 199024 198712 198252 197694 196448 193767 189597 184649 179719 175168 170928 166717 162258 157546
65329 157546 152937 148857 145454 142642 140341 138440 136674 134789 132795 130852 129008 127303 126047 125612
65315 125612 125931 126426 126457 125653 123895 121347 118571 116257 114693 113694 113093 112922 113008 112818 112073 111306 111431 112818
65297 112818 115061 117557 120006 122251 123986 124889 125058 125142 125908 127571 129563 131007 131443 131062 130299 129384
65281 129384 128369 127396 126682 126237 125758 124919 123771 122745 122246 122221 122212 121870 121335 120997 120957 120873 120314 119142 117587
65262 117587 116166 115477 115716 116276 116114 114798 112960 111500 110561 109650 108579 107784 107634 107870 107953 107675 107172
65245 107172 106557 105821 105053 104455 104145 104043 103989 103806 103273 102220 100757 99371 98646 98822 99633 100612 101560 102694
65227 102694 104274 106156 107797 108733 108966 108883 108834 108898 108992 109157 109609 110423 111201 111299 110562 109686 109553 110200 110789
65208 110789 110635 109918 109220 108745 108342 108008 107871 107799 107531 107236 107465 108368 109374 109880 109918 109838 109685 109319 108954
65189 108954 109042 109576 109935 109668 109172 109335 110563 112341 113746 114358 114671 115601 117547 120015 122200 123831 125237
65172 125237 126636 127661 127770 126979 125965 125456 125629 126144 126682 127422 128948 131708 135559 139874 144021 147727
65156 147727 151106 154508 158356 162885 167978 173346 178914 184924 191651 199245 207879 217777 228852 240567
65142 240567 252522 265094 279102 294738 311130 327101 342095 356138 369187 380923 391166
65131 391166 400147 408192 415299 421099 425088 426796 425931 422593 417260 410379 402011 392077 380913 369268
65117 369268 357585 345484 332210 317576 302315 287469 273573 260458 247753 235390 223576
65106 223576 212373 201597 191280 182030 174572 168915 164359 160404 157226 154962 152935 150194 146668
65093 146668 143238 140613 138623 136720 134691 132717 131145 130382 130653 131568 132301 132497 132596 132971 133189 132695 131906
65076 131906 131843 132770 133841 134242 134057 133773 133462 132907 132215 131841 132056 132647 133147 133216 132860 132402 132178 132200 132168 131820
65056 131820 131151 130293 129392 128627 128113 127712 127142 126400 125846 125757 126043 126525 127164 127805 128005 127538 126842 126586 126780
65037 126780 126710 125756 124020 122177 120914 120477 120498 120246 119316 118017 116870 115877 114659 113230 112088 111446 110906
65020 110906 110148 109505 109481 110012 110599 110978 111283 111712 112387 113439 114849 116201 116954 117025 116936 117425 119005 121743
65002 121743 125088 127995 129636 130126 130352 131049 132250 133542 134521 134946 134799 134363 134027 133990 134361 135428 137343
64985 137343 139525 140966 141447 141880 143045 144479 145190 145147 145368 146563 148336 149721 150040 149162 147485 145821
64969 145821 144847 144387 143554 141775 139394 137051 134850 132474 129899 127614 126137 125541 125431 125229 124520 123290
64953 123290 121862 120578 119590 118936 118681 118928 119741 120980 122096 122294 121265 119767 119059 119564 120445 120623 119882
64936 119882 118765 117811 117260 117169 117343 117349 117054 117022 117905 119521 120988 121765 122115 122481 122843 122854 122226 120828 118776
64917 118776 116637 115203 114827 115177 115836 116792 118054 119107 119321 118838 118586 119286 120775 122483 124181 125986
64901 125986 127917 129943 132397 135823 140186 144627 148386 151753 155666 160466 165521 170082 174074 177859
64887 177859 181638 185358 188844 191669 193172 193027 191687 189971 188326 186703 184917 182797 180208 177379
64873 177379 175021 173680 173046 172396 171551 170838 170208 169111 167364 165438 163656 161749 159549 157486 155976
64858 155976 154817 153697 152790 152251 151516 149819 147205 144391 141773 139182 136537 134048 131734 129412 127322
64843 127322 126099 125886 125993 125852 125825 126569 127896 128806 128606 127586 126525 125864 125509 125274 125283 125869 127066 128328
64825 128328 128988 129052 129308 130453 132308 134137 135600 137039 138796 140717 142543 144496 147069 150371 154129
64810 154129 158324 163388 169489 175976 181952 187231 192302 197386 201995 205541 208001 209734 210921 211447
64796 211447 211103 209665 206955 203195 199123 195403 191910 187963 183356 178775 175034 172121 169272 165917
64782 165917 162264 158982 156531 155040 154666 155687 158023 160874 163265 165015 166882 169627 173196 176926
64768 176926 180245 182957 185150 187241 189900 193521 197763 201995 206072 210294 214583 218215 220579 221869
64754 221869 222862 224203 226004 227868 229163 229532 229295 229115 229206 229100 228296 226725 224367 220896 216170 210820
64738 210820 205852 201724 198178 194847 191579 188213 184636 181167 178406 176454 174667 172491 170193 168364
64724 168364 167035 165760 164470 163639 163530 163788 164080 164697 166076 167939 169416 170078 170413 171119 172237 173248
64708 173248 173865 174348 175057 175918 176517 176627 176532 176755 177450 178104 177940 176645 174610 172398 170153 167678 164982
64691 164982 162511 160790 159915 159447 158777 157694 156675 156515 157553 159339 161187 162917 164834 167039 169155
64676 169155 170868 172524 174967 178782 183784 189213 194439 199461 204668 210080 215087 219150 222525 225827
64662 225827 228873 230473 229587 226412 222103 217705 213564 209460 205002 200056 195079 190917 188001 185925
64648 185925 184091 182580 181977 182468 183561 184788 186280 188500 191675 195701 200377 205509 210901 216457 222326
64633 222326 228845 236253 244330 252249 258985 264088 267996 271390 274325 276275 276900 276339 274721 271889 267851
64618 267851 263077 257992 252492 246383 240018 234048 228691 223773 219426 216096 213727 211580 209243 207346
64604 207346 206747 207261 207813 207759 207391 207105 206705 205932 205160 204955 205152 204960 204023 202836 201957 201249 200206 198710
64586 198710 197072 195497 193911 192304 190929 190032 189609 189532 189763 190363 191370 192741 194321 195849 197090 198000
64570 198000 198684 199132 199099 198266 196499 193960 191031 188146 185577 183289 181057 178722 176309 173914 171555
64555 171555 169135 166493 163538 160407 157448 154932 152872 151298 150558 150922 151927 152537 152239 151621 151596 152372
64539 152372 153536 154807 156150 157256 157583 157053 156276 155840 155701 155472 154977 154294 153549 152956 152838 153262 153826
64522 153826 154099 154129 154212 154300 154088 153682 153705 154600 156141 157870 159683 161673 163569 164821 165353 165939 167565 170487
64504 170487 174153 178076 182515 188052 194696 201741 208547 215057 221357 227129 231913 235674 238671 240864
64490 240864 241941 241902 241139 239868 237971 235584 233253 231168 228660 225016 220532 216266 212863 210056 207224
64475 207224 203968 200173 196017 192053 188888 186599 184731 182929 181251 179756 178262 176794 175965 176437 178085
64460 178085 180024 181463 182322 183002 183792 184654 185505 186569 188278 190743 193434 195603 197042 198204 199542
64445 199542 201022 202449 203953 205861 208233 210859 213685 216968 220979 225725 231060 236949 243642 251638
64431 251638 261438 273205 286791 302174 319759 339999 362896 388225 416218 447688 483268 522842
64419 522842 565868 612079 661613 714556 770507 828452 886851 943823 997502 1046417 1089628
64408 1089628 1126613 1157064 1180644 1196788 1204690 1203575 1193055 1173306 1145057 1109509 1068159 1022459
64396 1022459 973509 922051 868702 814139 759112 704471 651251 600592 553389 510029 470561
64385 470561 435068 403700 376334 352479 331723 314072 299591 287783 277673 268583 260482 253455
64373 253455 247155 241109 235317 230143 225604 221195 216547 211996 208295 205844 204248 202607 200253 197328
64359 197328 194583 192489 190649 188417 186054 184798 185639 188320 191756 195098 198138 201028 204028 207383
64345 207383 210994 214333 217035 219468 222210 224994 226756 226913 226100 225316 224734 223751 221970 219667 217359
64330 217359 215350 213727 212482 211472 210468 209378 208343 207539 206941 206407 205939 205759 205973 206194 205698 204189
64314 204189 202309 201065 200707 200507 199758 198627 197729 197163 196394 194929 192735 190053 187170 184340 181568 178546
64298 178546 175190 172177 170425 169972 169936 169797 170067 171301 173010 174201 174722 175325 176543 178190 180116 182767
64282 182767 186561 191076 195316 198756 201810 205271 209510 214305 219299 224407 229707 235040 239933 243977
64268 243977 247142 249622 251532 252854 253568 253688 253271 252575 252063 252048 252332 252341 251606 250080 248145 246447 245430
64251 245430 244731 243141 239598 234174 227871 221539 215391 209459 204000 199267 195288 192049 189618 187965
64237 187965 186888 186190 185667 184935 183776 182729 182754 183966 185207 185292 184286 183096 182211 181482 180846 180485 180281
64220 180281 179786 178886 177968 177213 176193 174447 172165 170037 168649 168171 168357 168619 168353 167538 166905 167235 168501
64203 168501 169846 170438 170247 170000 170510 172061 174335 176894 179626 182738 186388 190506 194999 200000 205828
64188 205828 212718 220627 229265 238274 247373 256215 264171 270496 274935 277987 280221 281385 280623 277673
64174 277673 273425 268980 264438 259010 252217 244547 236889 229730 223078 216856 211015 205409 199956 194973
64160 194973 191072 188543 187036 185984 185162 184596 184115 183365 182333 181576 181787 183250 185706 188549 191089 192866
64144 192866 193910 194634 195418 196432 197813 199699 201932 203988 205389 205993 205723 204392 202102 199598 197761
64129 197761 196843 196466 196317 196482 197174 198436 200099 201821 203259 204466 206033 208564 212141 216562 221853
64114 221853 228039 234598 240816 246737 253134 260330 267571 273867 278994 283379 287392 291176 294915 298812
64100 298812 302822 306575 309588 311667 313337 315742 319618 324302 328252 330738 332453 334209 335603 335453
64086 335453 333106 328786 323055 316486 309649 302793 295701 288257 280975 274469 268619 262831 257008 251681
64072 251681 247220 243470 240206 237375 234880 232636 230899 230010 229745 229441 228928 228802 229550 230860 232048 232815
64056 232815 233372 234184 235789 238513 242130 246103 250263 254775 259355 263267 266530 270508 276560 284508 293124
64041 293124 301810 310936 320536 329639 337240 343374 348756 353739 358050 361374 363792 365635 367072 367869
64027 367869 367514 365639 362443 358689 355235 352560 350627 349060 347450 345637 343714 341708 339279 335935
64013 335935 331540 326504 321393 316459 311573 306490 301216 296220 292199 289451 287452 285302 282664 280107
63999 280107 278489 278154 278737 279496 279805 279644 279801 281284 284242 287695 290590 292918 295471 298714 302396 306182
63983 306182 310158 314544 319372 324723 330952 338322 346557 355050 363528 372298 381845 392292 403263 414297
63969 414297 425422 437278 450470 464879 479921 495589 512810 532519 554744 578971 605152
63958 605152 633869 665692 700998 740474 785288 836551 895032 961639 1037774 1124875 1223814
63947 1223814 1335026 1459032 1596457 1747598 1912239 2089780 2279268 2479256 2687807
63938 2687807 2902573 3120636 3338219 3550856 3754049 3943815 4116688 4269411 4398741
63929 4398741 4501523 4575027 4617444 4628233 4607926 4557510 4477943 4370321 4236471 4079352
63919 4079352 3902894 3711505 3509647 3301574 3091105 2881478 2675494 2475824 2284991
63910 2284991 2104921 1936713 1781040 1638632 1510025 1394920 1292150 1200422 1118884 1046920
63900 1046920 983731 928288 879525 836454 798228 764193 733681 705753 679475 654541 631279
63889 631279 609898 590086 571553 554465 538960 524683 511400 499757 490684 484112 479087 475190
63877 475190 473122 473562 476095 479756 484192 489745 496658 504857 514440 525785 538837 552615 565778
63864 565778 577707 588900 600304 612373 624801 636952 648241 658081 665845 671207 674402 675850
63852 675850 675589 673386 669319 663858 657260 649256 639487 627911 614600 599474 582639 564743 546557
63839 546557 528218 509321 489807 470385 451824 434134 416803 399725 383519 368856 355798
63828 355798 343972 333053 322762 312628 302306 292170 283115 275515 268757 262044 255316 249104 243815
63815 243815 239541 236241 233616 230987 227920 224894 222782 221633 220529 218766 216615 214706 213159 211643
63801 211643 209932 208072 206278 204850 203948 203247 202105 200243 198017 195886 194007 192443 191255 190122 188393
63786 188393 185972 183680 182283 181521 180679 179725 179236 179434 179951 180449 180800 180732 179961 178744 177710 177026 176287
63769 176287 175337 174611 174475 174746 175154 175774 176720 177773 178608 179089 179074 178320 176846 175099 173529 172264 171436
63752 171436 171387 172212 173429 174545 175629 176930 178254 179220 179903 180622 181289 181663 182217 184003 187394 191525
63736 191525 195259 198230 200668 202761 204721 207056 210100 213409 216189 218365 220656 223527 226565 229147
63722 229147 231306 233557 236131 238812 241393 243897 246258 248141 249272 249770 249946 249838 249139 247669 245817
63707 245817 244293 243389 242593 241178 239097 237073 235678 234709 233672 232603 232001 232071 232525 233189 234325 236127
63691 236127 238309 240556 243095 246353 250125 253530 255988 257924 260293 263455 266683 268805 269273 268588 267720
63676 267720 267265 267205 267312 267478 267611 267521 267153 266765 266666 266858 267103 267271 267408 267475 267209 266317 264749 262760 260717
63657 260717 258737 256536 253761 250485 247156 244002 240816 237488 234413 232020 230241 228839 228013 228096 228729
63642 228729 229057 228894 229141 230661 233115 235279 236356 236689 237328 239197 242598 247266 252759 258754 264976
63627 264976 271041 276693 282203 288224 295138 302789 310949 319793 329731 341054 353901 368364 384351
63614 384351 401517 419464 437937 456769 475946 495826 516886 538917 560763 581237 600101
63603 600101 617774 634270 648898 660930 670046 676042 678568 677461 673164 666631 658851 650439 641458
63590 641458 631587 620572 608478 595402 581120 565344 548303 530748 513309 496121 479171 462677
63578 462677 447045 432705 420125 409728 401580 395260 390158 385845 382270 379924 379790 382622 387999
63565 387999 394437 400718 406833 413377 420492 427953 435981 445209 455737 466915 478328 490552 504585
63552 504585 520860 539171 559305 581224 604581 628460 651865 674380 696229 717693 738469
63541 738469 757570 773739 785934 793500 796162 794082 787964 778990 768547 757914 747884 738373 728458
63528 728458 717182 704398 690554 675663 658956 639793 618509 595939 572442 547997 523129
63517 523129 499074 476788 456191 436656 417947 400384 384330 369884 357021 345725 335895 327212
63505 327212 319247 311776 305073 299740 296022 293305 290579 287490 284657 282836 282067 281882 281995 282398 282962
63490 282962 283405 283690 284126 284948 286111 287519 289235 291320 293679 296222 299024 302148 305357 308175 310326
63475 310326 312084 314045 316375 318335 318817 317421 314726 311396 307445 302762 297924 293828 290573 287429
63461 287429 283979 280669 277998 275803 273800 272353 272164 273409 275633 278261 280859 283164 285367 288254
63447 288254 292523 297986 303975 310417 317916 326668 336071 345762 356472 369183 383713 398807 413665
63434 413665 428837 445391 463601 482734 501864 520524 538494 555336 570460 583725 595755
63423 595755 607550 619834 632963 647425 664076 683605 705812 729625 753846 777696 800651
63412 800651 822065 841225 857605 870783 880179 885218 885828 882510 875854 866288 854415 841160 827155
63399 827155 812245 796033 778768 761081 742867 723051 700776 676405 651097 625785 600892
63388 600892 576623 553071 530239 508451 488592 471547 457492 446076 437108 430532 425908 422574
63376 422574 420482 420313 422577 427028 433138 440557 448848 457307 465699 474880 486091 499679 514959 531290
63362 531290 548782 567882 588665 610818 634061 658306 683390 708791 733638 757096 778772
63351 778772 798657 816585 831904 843858 852140 856758 857550 854351 847685 838764 828516 816949 803772
63338 803772 789214 773733 757205 739076 719351 698762 677805 656180 633583 610598 588267
63327 588267 567129 547261 529061 513208 499698 487645 476390 466286 457907 450854 444001 436755
63315 436755 429470 422535 415613 408016 399495 390335 380905 371395 361913 352678 344094 336679 330775 326256
63301 326256 322644 319603 317142 315195 313269 310831 308007 305572 304053 303053 301628 299303 296541 294169
63287 294169 292450 290833 288597 285612 282435 279767 277975 276970 276318 275464 274097 272419 270898 269722 268658
63272 268658 267530 266549 266022 265999 266486 267747 269946 272547 274599 275767 276747 278400 280760 283170 285198 287066
63256 287066 289231 291917 295147 298999 303623 309099 315420 322537 330313 338471 346761 355205 364090 373692
63242 373692 384127 395502 408110 422304 438169 455446 473808 493200 513829 535832 558942
63231 558942 582480 605811 628896 652344 676694 701645 726205 749707 772472 795336 818725
63220 818725 842433 866092 889444 912076 933255 952215 968435 981475 990757 995786 996545 993427
63208 993427 986710 976212 961480 942327 919242 893404 866185 838505 810684 783024 756359 731740
63196 731740 709598 689616 671614 656219 644311 636012 630632 627549 626728 628266 631864 637047 643656
63183 643656 651818 661579 672830 685489 699407 714135 729094 744052 759178 774533 789769 804412
63171 804412 818171 830715 841344 849195 853824 855408 854380 850943 844952 836101 824182 809233 791514
63158 791514 771391 749298 725782 701454 676830 652263 628041 604461 581812 560458 540918
63147 540918 523622 508462 494861 482477 471577 462451 454734 447757 441445 436349 432749 430158 427879
63134 427879 425664 423594 421724 420173 419336 419610 420971 423074 425697 428817 432313 435873 439286 442632 446146
63119 446146 449970 454020 457984 461461 464219 466349 468136 469854 471688 473702 475700 477269 478192 478789 479671
63104 479671 481143 482993 484776 486158 487052 487667 488399 489454 490572 491329 491656 491741 491484 490560 489208 488498 489303
63087 489303 491257 493210 494685 496377 499111 502802 506745 510613 514707 519320 524348 529647 535444 542025
63073 542025 549189 556368 563360 570720 579303 589535 601178 613701 626780 640659 656224 674580
63061 674580 696292 720973 747812 776560 807879 842653 881059 922383 965695 1010694 1057869
63050 1057869 1107764 1160081 1213686 1267627 1321926 1377181 1433630 1490969 1548859 1607034 1664863
63039 1664863 1721504 1776769 1831349 1885713 1939064 1989772 2036553 2078738 2115641 2146193 2169148
63028 2169148 2183252 2187295 2180608 2163589 2137287 2102289 2058411 2005663 1945199 1879185 1810091 1740201
63016 1740201 1671332 1604605 1540680 1480464 1425314 1376278 1333446 1296516 1265871 1242498 1226787
63005 1226787 1217849 1214255 1215184 1220574 1230333 1243760 1259820 1277801 1297559 1319153 1342414 1366961
62993 1366961 1392443 1418575 1444918 1470850 1495795 1519240 1540456 1558447 1572414 1582148 1587681 1588607
62981 1588607 1583982 1572897 1554984 1530448 1499855 1463960 1423559 1379394 1332266 1283177 1233226
62970 1233226 1183325 1134075 1085927 1039310 994633 952291 912667 875998 842253 811289 783096
62959 783096 757683 734699 713410 693179 673845 655615 638753 623401 609415 596220 583085
62948 583085 569766 556695 544336 532516 520720 508911 497673 487529 478439 470074 462299 455222
62936 455222 448934 443365 438295 433434 428670 424310 420814 418104 415365 411864 407820 404135 401343 399230
62922 399230 397429 395917 394660 393300 391594 389915 388723 387682 385854 382913 379644 376971 374923 372989
62908 372989 371165 370030 369802 369873 369506 368581 367358 365863 363920 361719 359865 358795 358430 358530 359094 360180
62892 360180 361512 362544 362859 362331 361067 359479 358280 357958 358130 357869 356889 356020 356231 357500 359081 360548
62876 360548 361909 362845 362739 361691 360817 360969 361641 361708 360896 359852 358939 357808 356372 355461 356005 357842 359828
62859 359828 361013 361397 361557 361907 362426 362936 363448 364144 365077 366017 366734 367393 368445 370058 371860 373404 374686
62842 374686 375956 377121 377702 377465 376844 376518 376742 377278 377875 378509 379127 379437 379196 378558 377958 377720 377926 378585
62824 378585 379658 380919 382109 383384 385366 388550 392724 397171 401337 405163 408876 412694 416747 421090
62810 421090 425728 430688 436028 441700 447509 453348 459422 466074 473426 481360 489863 499256 510069 522765
62796 522765 537458 553819 571391 590148 610566 632986 657264 683499 712846 746918 786326
62785 786326 830435 878711 931739 990504 1055279 1125618 1200970 1280675 1363630 1448562 1534506
62774 1534506 1620451 1704645 1784844 1859343 1927225 1987493 2038444 2078149 2105151 2118522 2117621 2102210
62762 2102210 2072700 2030174 1976314 1913335 1843561 1768729 1689873 1608030 1524785 1441841 1360372
62751 1360372 1281204 1205417 1134235 1068248 1007153 950383 897705 849148 804750 764573 728693
62740 728693 696808 668030 641420 616759 594556 575255 558610 543882 530452 518148 507164
62729 507164 497808 490293 484546 480204 476828 474202 472411 471683 472142 473642 475778 478185 481016 485047 491091
62714 491091 499220 508758 519141 530676 544305 560751 580092 602201 627343 656152 688970 725364
62702 725364 764460 805810 849848 897325 948307 1001912 1057032 1113064 1169721 1226411 1282115
62691 1282115 1335816 1386561 1432995 1473170 1505206 1528059 1541476 1545320 1539297 1523395 1498257 1464913
62679 1464913 1424242 1376957 1324132 1267520 1209155 1150614 1092664 1035550 979514 925123 873222
62668 873222 824620 779728 738440 700428 665532 633793 605141 579266 555879 534969 516617
62657 516617 500605 486389 473460 461622 450927 441411 432923 425126 417767 410980 405149 400291 395764
62644 395764 390921 385992 381898 379110 377063 374920 372576 370588 369379 368864 368729 368693 368476 367893 367072 366337
62628 366337 365824 365392 364938 364531 364180 363757 363345 363460 364683 367164 370579 374493 378632 382953 387648 393063
62612 393063 399464 406870 415141 424123 433706 443891 454922 467193 480871 495741 511661 529081
62600 529081 548908 571906 598351 628116 660804 695853 732799 771506 811899 853439 895032
62589 895032 935465 973722 1008870 1039944 1066068 1086566 1100918 1108744 1109776 1103719 1090321 1069979
62577 1069979 1044121 1014385 981345 944678 904849 863948 824301 786703 750586 715551 681989
62566 681989 650347 620617 592749 566999 543601 522450 503319 486168 471096 458161 447229
62555 447229 437777 428971 420343 412386 406047 401554 398095 394733 391239 387927 385120 383000 381638 380931
62541 380931 380702 380951 381724 382676 383194 383089 382809 382833 383311 384429 386551 389623 392986 396301 400219 405613 412512
62524 412512 420442 429569 440817 454869 471687 491015 512803 536926 562939 590314 618735 648163
62512 648163 678853 711172 744913 778786 811010 840591 867718 892767 915269 933990 947796
62501 947796 956332 960121 960085 956785 950028 939407 925292 909081 892481 876794 862887 851451 843046
62488 843046 838015 836474 838295 843212 851236 862906 878784 898641 921484 946467 973373 1002130
62476 1002130 1032221 1062714 1092388 1119545 1142197 1158965 1169625 1174456 1173324 1165827 1152090 1132755
62464 1132755 1108110 1077811 1041780 1001176 958149 914681 871740 829472 787992 747876 709958
62453 709958 674825 642680 613642 587964 565815 546933 530682 516504 504276 494202 486375 480462
62441 480462 475840 472088 469273 467680 467368 468048 469258 470457 471121 471029 470420 469532 468029 465258 461179 456585
62425 456585 452194 447835 442858 437086 431004 425154 419681 414427 409158 403696 398031 392408 387154 382401
62411 382401 377996 373689 369340 365043 361133 357975 355644 353856 352264 350755 349438 348481 348047 348247 349032
62396 349032 350197 351553 352997 354433 355834 357454 359623 362195 364435 365783 366571 367711 369719 372290
62382 372290 374784 376971 379298 382493 386871 392019 397309 402744 408991 416475 424860 433700 443251 454146
62368 454146 466518 480010 494640 511079 529850 550674 572953 596735 622956 652699 686237
62357 686237 722736 760894 799917 839870 881045 923098 964829 1004636 1040967 1072536 1098466
62346 1098466 1118284 1131656 1138217 1137914 1131420 1119885 1104222 1084784 1061667 1035056 1005360 973391
62334 973391 940525 908315 877682 848568 820484 793286 767448 743716 722559 703763 686523
62323 686523 670047 654083 638751 623982 609433 594887 580413 566027 551533 536867 522367
62312 522367 508544 495699 483829 472719 462038 451588 441686 433089 426404 421590 418112 415377 412958
62299 412958 410659 408613 407188 406564 406457 406408 406290 406369 406948 408078 409585 411205 412740 414237 416028 418418
62283 418418 421299 424154 426578 428812 431634 435631 440610 445887 451121 456647 462913 469914 477417 485491
62269 485491 494435 504424 515668 528818 544583 562863 582831 604124 627473 653871 683621 716577
62257 716577 752813 792489 835260 880375 927132 974670 1021480 1065818 1106688 1143796 1176421
62246 1176421 1202995 1222135 1233539 1237409 1233519 1221622 1202582 1178326 1150339 1118607 1082320 1041396
62234 1041396 997052 951082 904932 859497 815463 773490 734051 697270 663133 631861 603943
62223 603943 579690 558796 540432 523775 508397 494198 481197 469541 459583 451675 445756 441181
62211 441181 437066 432887 428791 425353 422974 421477 420334 419347 418884 419335 420479 421765 423192 425459 429086
62196 429086 433733 438700 443782 449252 455194 461371 467727 474573 482178 490489 499323 508465 517469 525787
62182 525787 533346 540694 548351 556241 564016 571623 579158 586407 593149 599938 608093 618626 631472 646034
62168 646034 662250 680745 702044 726004 752167 780295 810206 841192 871966 901305 928470
62157 928470 952876 973644 989827 1000948 1007034 1008202 1004512 996314 984425 969808 953108 934465
62145 934465 913602 890270 864888 838766 813351 789278 766458 745066 725862 709389 695385
62134 695385 683329 673140 664934 658513 653612 650334 648769 648356 648335 648714 650200 653086 656793 660656 664583
62119 664583 668707 672899 676948 680782 684111 686226 686630 685712 684352 682963 681217 678633 675063 670600 665298
62104 665298 659100 651932 643948 635821 628692 623479 620140 617784 615576 613468 612154 612455 614630 618071
62090 618071 621653 624666 627455 630949 635598 641013 646713 652919 660367 669489 679918 690743 701185
62077 701185 711120 721103 731902 744073 757973 773877 791636 810291 828601 846238 864077 883039
62065 883039 903028 923377 943883 964813 986059 1006939 1026860 1045602 1062826 1077741 1089401
62054 1089401 1097058 1100193 1098635 1092715 1082919 1069352 1052014 1031587 1009258 985472 959482 930587
62042 930587 899375 867323 835630 804903 775499 747528 720773 695218 671431 649910 630332
62031 630332 612044 595038 579695 565754 552462 539740 528325 518479 509350 500051 490760 482259
62019 482259 474787 467897 461212 454841 449087 443984 439170 434243 429297 424973 421737 419283 417089 415294
62005 415294 414471 414613 415154 416038 417893 420853 424011 426552 428728 431139 433622 435571 436857 437739 438186 437991
61989 437991 437264 436118 434053 430362 425111 419063 412711 405976 398867 391823 385242 379100 373169 367259
61975 367259 361226 355128 349420 344644 340850 337589 334522 331796 329874 329124 329411 329863 329352 327632 325751
61960 325751 324912 325207 325991 327108 328902 331165 333058 334299 335597 337648 340359 343470 347270 352185 358079
61945 358079 364514 371409 379089 387865 397895 409217 421631 434706 448123 461792 475520 488851
61933 488851 501452 513403 524886 535871 546293 556234 565643 574086 581056 586338 589917 591762 591948
61920 591948 590710 588203 584449 579780 575047 571072 568165 566443 566297 568099 571681 576528 582435 589568
61906 589568 597917 607073 616504 625691 633994 640744 645565 648399 649190 647804 644344 639245 632878 625246
61892 625246 616222 606005 595173 584293 573653 563375 553679 544834 536815 529160 521313 513083 504625
61879 504625 496079 487409 478610 469867 461491 453755 446718 440061 433224 425993 418909 412895 408544 406007
61865 406007 405364 406586 409156 412323 415899 420378 426148 433067 441006 450181 460658 472079 484397 498392
61851 498392 514836 533405 553050 573214 594094 615711 637298 657720 676120 692156 705929
61840 705929 717741 727649 735214 739860 741441 740295 736926 731915 726027 720077 714707 710510 708193 708296
61826 708296 710774 715066 720519 726567 732727 738708 744352 749226 752457 753205 751044 745649 736565 723837
61812 723837 708482 691718 673916 655000 635580 616804 599058 581694 564273 547324 531597
61801 531597 517268 504250 492683 482554 473291 464186 455038 446079 437591 429812 422877 416568 410491
61788 410491 404760 400079 396788 394285 391804 389400 387617 386476 385382 383944 382379 381096 380262 379801 379507
61773 379507 379187 378955 379300 380621 382744 385125 387352 389241 390668 391729 392961 394922 397563 400392 403278
61758 403278 406677 410968 415899 420842 425344 429276 432678 435598 437939 439404 439781 439322 438561 437626 435959
61743 435959 432934 428616 423707 418905 414571 410951 408348 406838 405962 404963 403408 401531 399943 399119 399143
61728 399143 399775 400583 401129 401305 401487 402202 403606 405399 407321 409454 411979 414784 417454 419526 420699 421002
61712 421002 420843 420711 420660 420275 419288 417984 416799 415690 414172 411874 408844 405442 402177 399487 397414 395562
61696 395562 393681 392176 391662 391964 391938 390431 387297 383443 380059 377791 376421 375221 373702 371998 370442
61681 370442 368994 367367 365616 364196 363399 363067 362855 362468 361597 360070 358211 356663 355674 354938 354316 354201
61665 354201 354755 355210 354588 353026 351764 351714 352526 353273 353676 354329 355864 358234 360775 362805 364149 365201
61649 365201 366578 368617 371056 373185 374437 374881 375124 375661 376523 377648 379328 381835 384704 386961 388246
61634 388246 389171 390193 390656 389605 387297 385197 384382 384489 384348 383110 380606 377201 373749 371216 369806
61619 369806 368603 366541 363613 360719 358401 356265 353697 350687 347675 344887 342092 338799 334498 328942
61605 328942 322602 316717 312445 309772 307558 304833 301829 299446 297864 296147 293333 289564 285842 282877
61591 282877 280510 278245 275969 274017 272735 272123 271760 270980 269308 266885 264389 262391 260951 259903 259252
61576 259252 259012 258800 258107 256961 255977 255546 255349 254932 254468 254594 255545 256792 257682 258196 258907 260214 261808
61559 261808 262993 263493 263757 264334 265106 265474 265253 265003 265254 265778 265991 265882 266063 266907 268106 269256 270484
61542 270484 272158 274172 275868 276725 276901 277033 277614 278593 279507 279920 279779 279420 279262 279478 279893 280163 280073 279684
61524 279684 279167 278518 277558 276283 275081 274417 274297 274229 273722 272751 271735 271201 271424 272198 272895 272998 272705 272850
61506 272850 274024 275838 277187 277267 276197 274673 273171 271630 269939 268539 268227 269277 271024 272598 273863
61491 273863 275246 276801 278044 278810 279714 281377 283653 285986 288150 290165 291811 292864 293690 294966 296734
61476 296734 298310 299248 299925 300913 302133 302955 302943 302274 301522 301111 300883 300252 298937 297476 296658 296565 296565 296234 295779
61457 295779 295466 295242 295154 295552 296522 297592 298463 299552 301257 303065 304058 304086 303838 303875 304226 304823 305714 306798
61439 306798 307936 309350 311368 313749 315837 317511 319344 321617 323809 325357 326364 327134 327531 327289 326613
61424 326613 325913 325192 324192 323018 322135 321788 321827 322085 322605 323468 324600 325770 326586 326612 325774 324601 323773 323389
61406 323389 322856 321521 319357 317013 315282 314411 313891 313003 311565 309979 308592 307456 306785 307079 308428 310082
61390 310082 311201 311762 312286 312955 313541 314029 314711 315715 316901 318194 319605 321059 322656 324927 328152 331580
61374 331580 334097 335685 337386 339675 341762 342901 343469 344142 344697 344512 343806 343542 344218 345473 346852 348362
61358 348362 350231 352668 355958 360368 365809 371773 377682 383152 388071 392724 397711 403331 409105 414306
61344 414306 418915 423578 428512 432915 435765 436955 437337 437792 438525 439225 439597 439533 438866 437302 434838 432105
61328 432105 429930 428436 426922 424795 422317 420189 418699 417643 416896 416577 416679 416957 417244 417630 418382 419948
61312 419948 422961 427770 433889 440292 446404 452520 459161 466344 473722 481072 488285 495006 500691 505061
61298 505061 508292 510603 511805 511406 509197 505623 501433 497007 492198 486863 481271 475839 470663 465613
61284 465613 460777 456476 452857 449785 447186 445256 444187 443887 444119 444817 446180 448473 451744 455679 459757
61269 459757 463538 466804 469532 471943 474589 478064 482370 486787 490579 493711 496795 500594 505690 512139
61255 512139 519026 524759 528393 530466 532099 533517 534091 533613 532731 532107 531833 531779 531849 531726 530988 529646 528050
61238 528050 526138 523471 520199 517231 515078 513209 510952 508383 505825 503151 500279 497901 496964 497629 499303
61223 499303 501423 503672 505657 507079 508119 509185 510409 511797 513604 516007 518643 521055 523420 526204
61209 526204 529217 531723 533551 535402 537857 540638 543154 545400 548023 551720 556722 562741 569342 576442
61195 576442 584376 593330 602965 612853 623014 633586 644149 653865 662180 668939 673946 677038 678515
61182 678515 678898 678218 676114 672715 668779 664837 660762 656390 651921 647400 642384 636539 630154 623695 617185
61167 617185 610361 603044 595075 586289 576954 567903 559769 552398 545380 538837 533177 528330 523749 519079
61153 519079 514332 509498 504527 499761 495926 493477 492207 491597 491322 491208 490856 489514 486433 481427 475102
61138 475102 468485 462386 457164 452904 449514 446608 443736 441016 439290 439338 441077 443798 447029 450929 455905
61123 455905 462180 469688 478237 487751 498441 510563 523924 537874 552014 566675 582450 599451
61111 599451 617292 635501 653536 670666 686367 700831 714540 727387 738698 748195 756307 763290
61099 763290 768490 770876 770032 766341 760466 752913 743931 733491 721454 707955 693510 678609 663392
61086 663392 647973 632855 618640 605412 592769 580497 568868 558220 548580 539867 532158 525465
61074 525465 519462 513703 508088 502879 498391 494908 492773 492183 492800 493927 495234 497002 499453 502208 504846
61059 504846 507776 511983 517900 524932 532225 539472 546919 554991 564252 575324 588455 603297 619368
61046 619368 636499 654584 673257 692268 711998 733097 755667 779238 803502 828591 854631
61035 854631 881558 909532 939040 970282 1002874 1036427 1071132 1107492 1145700 1185582 1226980
61024 1226980 1269970 1315041 1363325 1416429 1475676 1541767 1615538 1698767 1793801 1902712 2027692
61013 2027692 2172522 2343352 2548193 2796332 3098512 3467084 3915127 4454020 5088952
61004 5088952 5813343 6607201 7444948 8309851 9202242 10131590 11098485 12082730 13044673
60995 13044673 13931649 14682086 15234004 15547385 15630784 15546236 15379752 15196944 15016760 14815592
60985 14815592 14546324 14154360 13590628 12829545 11887105 10822502 9716727 8642620 7646878
60976 7646878 6750155 5956159 5259927 4653122 4127529 3676192 3291992 2966318 2690089
60967 2690089 2455581 2256465 2086583 1939958 1812051 1700098 1601938 1515211 1437917 1368985
60957 1368985 1307746 1253180 1204090 1159596 1119037 1081652 1046803 1014345 984350 956493 930063
60946 930063 904574 880043 856614 834205 812612 791776 771791 752756 734652 717342 700638
60935 700638 684395 668557 653108 638032 623348 609165 595599 582716 570543 559113 548440
60924 548440 538497 529278 520872 513437 507048 501522 496372 491133 485906 481448 478459 476791 475642 474485
60910 474485 473464 472872 472692 472874 473579 474756 475881 476596 477351 478858 481056 483179 484818 486261 487664 488499
60894 488499 488188 486866 485171 483523 481954 480350 478440 475695 471708 466764 461719 457173 452910 448188
60880 448188 442468 435830 428840 422099 415913 410314 405261 400667 396251 391689 387093 383106 380212 378098
60866 378098 376041 373858 372094 371267 371340 371969 372786 373199 372480 370594 368644 367922 368557 369593 370340 371061 372251
60849 372251 373829 375424 377045 379065 381723 384866 387989 390336 391335 391255 391132 391659 392373 392372 391519 390417 389400
60832 389400 388224 386719 385062 383286 381195 378966 377281 376496 376168 375732 375224 374926 374706 374176 373220 371918
60816 371918 370214 368129 366102 364638 363684 362713 361330 359422 356895 353762 350458 347592 345270 342997 340333
60801 340333 337340 334312 331357 328362 325226 322098 319462 317843 317179 316645 315408 313458 311420 309739 308436
60786 308436 307465 306769 306063 305130 304402 304632 305787 306831 306826 305856 304689 304063 304595 306731 310208 313895 316713
60769 316713 318598 320242 322147 324382 326976 329955 332973 335390 336856 337549 337894 338330 339247 340756 342462
60754 342462 343800 344642 345272 345799 345927 345429 344493 343437 342418 341580 341136 340937 340230 338299 335359 332372 329857
60737 329857 327252 323702 319267 314882 311235 308106 304982 301925 299474 297897 296935 296176 295328 294155 292554
60722 292554 290770 289153 287656 285960 284217 283147 283117 283583 283832 283882 284152 284640 285065 285620 286780 288317 289248
60705 289248 289060 288434 288400 289248 290646 292415 294648 297244 299880 302430 305035 307664 309926 311459 312357 313181
60689 313181 314596 316955 320058 323300 326160 328532 330525 332127 333306 334324 335532 336800 337507 337347 336892
60674 336892 336980 337724 338467 338675 338407 337803 336529 334177 331043 328076 325973 324575 323268 321735 320127 318639
60658 318639 317161 315402 313228 310847 308728 307365 307040 307735 309195 311079 313116 315182 317220 319060 320393
60643 320393 321085 321428 321848 322313 322274 321367 319929 318583 317412 315860 313450 310331 307069 304120 301648 299638
60627 299638 298022 296785 296125 296430 297878 300047 302055 303247 303702 304037 304775 305932 307121 307929 308207 308198 308425
60610 308425 309267 310513 311439 311467 310653 309389 307842 306042 304433 303779 304356 305625 307005 308572 310622 312833
60594 312833 314448 315165 315366 315434 315412 315402 315782 316690 317734 318550 319346 320464 321695 322569 323270 324731 327599 331465
60576 331465 335338 338679 341720 344906 348361 351987 355926 360689 366777 374190 382373 390519 397888 403951
60562 403951 408573 412130 415166 417643 418720 417675 415017 412318 410784 410276 409901 409253 408777 409113 410556
60547 410556 413202 417247 422921 430269 439176 449446 460709 472388 484028 495673 507693 520125
60535 520125 532321 543339 552557 559757 564719 567058 566554 563492 558503 552126 544723 536739 528785 521301
60521 521301 514321 507692 501439 495745 490713 486417 483143 481284 480915 481712 483492 486598 491512 498209 506187
60506 506187 515146 525431 537745 552661 570493 591489 615896 643801 674970 708827 744530 781128
60494 781128 817671 853225 886858 917679 944872 967605 984861 995523 998672 993846 981063 960763
60482 960763 933813 901432 864949 825631 784762 743741 703868 666003 630559 597850 568237
60471 568237 541811 518102 496444 476702 459407 445034 433296 423379 414708 407169 400681 394968
60459 394968 389849 385344 381234 376951 372322 368083 365120 363266 361481 359171 356751 354733 352919 350877
60445 350877 348697 346751 344990 343063 341014 339311 338221 337559 337087 336755 336412 335682 334305 332441 330544
60430 330544 329052 328257 328233 328772 329545 330372 331130 331457 330874 329421 327900 327171 327306 327655 327683 327492 327504 327992 329068
60411 329068 330885 333467 336295 338456 339560 340335 341941 344661 347612 349833 351230 352199 352851 353177 353727
60396 353727 355343 358057 360854 362815 364053 365261 366714 368172 369517 371004 372868 375057 377403 379844
60382 379844 382381 384955 387368 389329 390705 391816 393322 395610 398307 400596 401986 402657 403130 403733 404423
60367 404423 404986 405396 405973 407102 408775 410546 412020 413229 414395 415616 416997 418833 421341 424350 427650
60352 427650 431537 436563 442668 448926 454198 457751 459297 458960 457422 455606 453837 451579 448334 444487
60338 444487 440848 437566 434047 429950 425838 422655 420815 419953 419390 418612 417349 415334 412170 407715 402619
60323 402619 398215 395518 394377 393850 393335 393062 393542 394956 397223 400325 404258 408847 413904 419614 426554
60308 426554 435210 445452 456462 467229 477212 486541 495500 503906 511067 516311 519385 520328 519137 515638
60294 515638 509659 501385 491640 481593 471960 462642 453455 444976 438157 433191 429384 426198 423695 421762
60280 421762 419711 417279 415319 414667 414739 414125 412366 410255 408417 406521 404075 401157 397985 394469 390663
60265 390663 387130 384382 382279 380412 378694 377196 375704 373885 371758 369735 368355 368102 369021 370239 370378
60250 370378 369045 367579 367722 369742 372392 374497 375913 377059 378316 380008 382293 384783 386764 388033
60236 388033 389050 390072 390699 390618 390250 390147 390173 389906 389634 390251 392141 394749 397372 399925 402684 405692 408775
60219 408775 411957 415508 419630 424317 429441 434781 440029 445087 450401 456636 463821 471021 477179 482220
60205 482220 487092 492730 499235 506076 512775 519200 525361 531148 536278 540453 543644 546237 548684 550955
60191 550955 552544 553036 552485 551132 549035 546227 542985 539679 536455 533225 529783 525844 521309 516774 513325
60176 513325 511353 509868 507599 504564 501838 499895 498053 495784 493677 492506 491925 490805 488636 485938
60162 485938 483370 480965 478400 475682 473325 471923 471615 471953 472316 472441 472448 472464 472491 472663 473187 473957 474603 475168
60144 475168 476287 478377 481066 483925 487354 492076 497873 503564 508326 512439 516553 520894 525562 531032
60130 531032 537673 544894 551365 556237 559888 563361 567256 571247 574562 576789 578230 579525 580983 582349
60116 582349 583215 583537 583669 584018 584798 586007 587410 588524 588847 588204 586735 584474 581172 576777 571931 567586
60100 567586 564078 560901 557519 554062 550969 548304 545840 543661 542099 541039 539805 538008 536147 535054
60086 535054 534968 535458 536025 536426 536517 536233 535822 535781 536373 537339 538218 538835 539318 539673 539498 538179 535337 531026 525535
60067 525535 519188 512420 505829 499810 494100 488013 481330 474740 469122 464539 460231 455592 450873 446812
60053 446812 443741 441294 438965 436813 435459 435422 436636 438725 441544 445143 449253 453253 456815 460290 464178
60038 464178 468430 472531 476133 479293 482177 484798 487027 488591 489102 488330 486534 484307 482049 479690 476942
60023 476942 473660 469946 466017 461968 457656 452907 447903 443135 438776 434285 428961 422819 416566 410821
60009 410821 405736 401388 398004 395563 393585 391656 389968 388997 388767 388716 388318 387584 386934 386747 387122 388030 389521
59992 389521 391651 394180 396550 398404 400076 402274 405266 408633 411916 415166 418622 422108 425123 427370
59978 427370 428883 429664 429618 428962 428294 427929 427391 425934 423591 421305 419892 419194 418549 417853 417718 418604 420347
59961 420347 422707 425850 429814 433884 437148 439638 442299 445698 449230 451792 452856 452620 451518 449972
59947 449972 448340 446704 444789 442438 440004 437992 436405 434788 432834 430577 428089 425429 423002 421489
59933 421489 421168 421606 422280 423264 425000 427583 430665 433979 437610 441645 445919 450284 454906 460029 465480
59918 465480 470675 475099 478606 481253 483115 484457 485897 488006 490706 493360 495659 498185 501724 506072
59904 506072 509898 512020 512644 513092 514422 516593 518917 520905 522494 523747 524774 525873 527359 529104 530509
59889 530509 531169 531475 532362 534497 537827 541862 546153 550411 554339 557623 560250 562738 565802 569624 573521
59874 573521 576592 578709 580571 582671 584486 585050 584171 582680 581384 580174 578434 576065 573672 571749 570095
59859 570095 568297 566506 565328 564927 564692 564057 563394 563646 565150 567238 569109 570725 572621 575100 577892
59844 577892 580402 581975 582063 580507 577710 574354 570951 567807 565168 563007 560703 557398 552866 547794 543057
59829 543057 538943 535233 531750 528551 525707 523206 521096 519482 518347 517485 516692 515915 515111 513979 512032
59814 512032 509087 505598 502263 499278 496225 492784 489227 486013 483199 480584 478195 476193 474490 472951
59800 472951 471909 471847 472547 473126 473130 472989 473128 473217 472798 472145 471946 472338 472802 472879 472519 471882 471272 471141 471636 472171
59780 472171 471926 470822 469549 468648 468016 467406 466901 466740 467108 468266 470415 473141 475461 476799 477620 478749
59764 478749 480398 482276 484378 487080 490598 494887 500082 506468 513860 521534 529024 536568 544523 552729
59750 552729 560881 569130 577788 586618 595049 603110 611509 620468 628988 635723 640336 643610 646418 649057
59736 649057 651515 653811 655796 656979 656889 655544 653345 650587 647262 643349 639122 635058 631434 628033 624328
59721 624328 620021 615351 610823 606670 602675 598537 594237 590032 586197 582839 579855 577025 574244 571659
59707 571659 569482 567724 566297 565376 565380 566475 568289 570315 572430 574933 578206 582473 587657 593220 598256
59692 598256 602074 604718 606733 608459 609723 610245 610101 609636 609006 607951 606125 603574 600726 597794 594437
59677 594437 590323 585838 581741 578031 573816 568613 563236 558843 555484 552294 548892 545816 543526 541773
59663 541773 540188 538915 538284 538289 538783 539883 541807 544537 547867 551615 555492 559027 561932 564377 566652
59648 566652 568776 570679 572543 574514 576137 576450 574692 570775 565209 558789 552250 545875 539430 532691
59634 532691 525940 519740 514388 509839 505965 502460 498682 494222 489701 486336 484488 483082 480793 477376
59620 477376 473456 469434 465140 460403 455426 450548 445969 441763 437969 434648 432021 430441 430015 430351 430888
59605 430888 431372 431878 432533 433517 435114 437313 439450 440681 440833 440396 439731 438853 438077 438242 439847 442342 444688
59588 444688 446372 447507 448173 448145 447241 445620 443730 442090 440992 440184 439042 437252 435147 433099 430863
59573 430863 428011 424814 422102 420193 418524 416520 414394 412814 412122 412191 412738 413456 413949 413877 413232 412354 411737
59556 411737 411784 412595 413863 415108 416140 417168 418428 419932 421714 424123 427588 432249 438027 444977 453237
59541 453237 462558 472143 481166 489486 497725 506547 515882 524944 532972 539633 544508 546646 545256 540900
59527 540900 535401 530330 526008 522154 518895 516589 515080 513876 512910 512468 512328 511619 509767 507063 504062
59512 504062 500797 496906 492236 486946 481223 475265 469485 464428 460384 457148 454154 450858 447218 443852
59498 443852 441524 440259 439179 437470 435347 433746 433142 433157 433360 433972 435489 437862 440456 442763 444895
59483 444895 447401 450797 455217 460306 465426 470146 474597 479191 484037 488783 492989 496425 498984 500663
59469 500663 501707 502524 503231 503545 503290 502753 502278 501772 501010 500260 500215 501326 503552 506670 510500 514859 519718
59452 519718 525347 531885 538692 544660 549347 553364 557419 561353 564462 566305 566840 566041 563893 560641 556633
59437 556633 551985 546737 541228 535964 531161 526803 523107 520443 518675 517049 515098 513421 513237 515209
59423 515209 519020 524070 530234 537773 546781 557181 569135 582903 598050 613252 627389 640633
59411 640633 653974 667751 681175 693097 702611 708790 710734 708438 703296 697311 692090 688712 687888
59398 687888 689545 692571 695528 697432 697410 694034 685920 673130 657404 640877 624859 609808 595869
59385 595869 583261 572422 563845 557539 552777 548769 545486 543426 542645 542647 543219 544733 547420 550921 554816
59370 554816 559059 563588 567951 571824 575518 579588 584110 588812 593751 599363 605755 612316 618253 623478
59356 623478 628776 635018 642254 649777 657185 665095 674380 684834 695086 704011 711883 719947 729146 739423
59342 739423 749976 759845 768373 775338 780716 784415 786398 786988 786643 785308 782373 777452 770925 763472
59328 763472 755383 746626 737427 728391 720124 712920 706759 701371 696336 691310 686218 681194 676398 671980
59314 671980 668132 665112 663254 662903 664128 666445 669034 671355 673523 676027 679217 683028 686930 690045
59300 690045 691483 690734 687657 682199 674344 664345 652733 640091 627040 614422 603031 593078 584223
59287 584223 576228 569200 563146 557795 553120 549585 547540 546727 546711 547432 549008 551353 554446 558699 564554
59272 564554 571835 579902 588262 596669 604853 612634 620180 627678 634771 640711 645011 647609 648588 648181 646961
59257 646961 645425 643339 640001 635267 629880 624636 619710 614963 610454 606314 602438 598703 595350 592907
59243 592907 591763 591916 592936 594030 594447 594088 593637 593848 594780 595875 596643 597013 597078 596774 595946 594583 592897
59226 592897 591142 589363 587357 584944 582271 579646 577040 573960 570121 566115 563104 561756 561696 562060 562311
59211 562311 562388 562322 562094 561799 561647 561742 562041 562499 562986 563165 562769 562051 561587 561477 561154 560162 558755 557464 556422
59192 556422 555544 554999 555031 555596 556638 558457 561210 564335 567185 570099 573952 578654 583008 586333 589351
59177 589351 593077 597587 602432 607506 612778 617687 621577 624521 627103 629675 632423 635852 640404 645634
59163 645634 650400 654007 656712 659059 661067 662149 661592 659203 655688 652214 649279 646239 642230 637182
59149 637182 631509 625239 618186 610749 603637 596838 589648 581877 574274 567511 561438 555664 550244 545330
59135 545330 540641 535827 531079 526941 523680 521183 519259 517809 516883 516790 517910 520095 522530 524598 526712
59120 526712 529884 534563 540319 546603 553333 560548 567939 575096 582036 589132 596490 603629 609810 614528
59106 614528 617721 619772 621442 623486 626072 628674 630756 632431 634147 635853 636851 636549 635034 632857 630559
59091 630559 628442 626465 624227 621403 618302 615637 613662 611978 610301 608882 607793 606311 603471 598971
59077 598971 593223 586896 580743 575357 570582 565580 560006 554699 550550 547109 543132 538250 533253 528833
59063 528833 524882 521096 517446 513954 510657 507923 506111 504770 502803 499615 495598 491421 487490 484171
59049 484171 481792 480107 478431 476622 475383 475217 475728 476333 477108 478395 480020 481450 482484 483384 484491
59034 484491 486065 488270 491012 494030 497351 501430 506594 512670 519438 527144 536238 546819 558607 571220
59020 571220 584135 596602 607940 617921 626699 634410 640936 645945 649110 650445 650390 649347 647131 643230
59006 643230 637625 631121 624874 619863 616555 614554 612713 610274 607866 606700 606789 606884 606291 605691 605679 605612 604701
58989 604701 603405 602671 602285 601050 598406 595001 591711 588881 586530 584631 583106 582035 581921 583352 586406
58974 586406 590678 595753 601279 606886 612549 618901 626608 635431 644342 652521 659848 666598 673109 679700
58960 679700 686357 692411 696883 699235 699545 698130 695353 691709 687583 682789 676681 668799 659333 649057
58946 649057 638971 629750 621254 612739 603799 594902 586824 579988 574643 571074 569049 567483 565444 563178
58932 563178 561485 560419 559433 558543 558276 558530 558524 558067 557880 558389 559103 559536 559817 559923 559176 557218 554819 553016
58914 553016 551959 551279 551086 551819 553401 555366 557680 560765 564718 569105 573557 578114 582992 588524 595279
58899 595279 603641 613090 622386 630750 638564 646672 655294 663945 672209 680314 688919 698530 709132 720291
58885 720291 731599 743018 754630 766011 776150 784282 790719 796454 801863 806097 808031 807552 805577
58872 805577 802904 799495 794971 789422 783451 777573 771853 766111 760285 754560 749152 744008 738784 733210
58858 733210 727373 721426 715129 708047 700228 692277 684651 677297 670201 663810 658438 653582 648343 642411
58844 642411 636237 630313 624652 618914 612635 605355 596866 587467 577784 568393 559710 552005 545173 538689
58830 538689 532257 526387 521891 518892 516738 514869 513262 511999 510959 510080 509574 509694 510619 512539 515428
58815 515428 518648 521336 523414 525768 529131 533186 537049 540224 542738 544676 546084 547108 547772 547729 546629
58800 546629 544694 542539 540450 538182 535456 532343 529087 525869 522876 520367 518438 516866 515349 513889
58786 513889 512839 512629 513504 515416 518065 521116 524485 528396 533027 538086 542913 546992 550264 552901 555007
58771 555007 556563 557399 557030 554857 550878 546008 541299 536970 532591 528101 524064 520924 518646 517230 516954
58756 516954 517788 519094 520285 521346 522412 523318 523988 524697 525421 525449 524340 522879 522349 523102 524611 526656
58740 526656 529531 533057 536334 538795 540874 543350 546543 550386 554738 559294 563513 566960 569632 571915
58726 571915 574437 577823 582154 586667 590454 593441 596281 599403 602779 606558 611137 616357 621426 625982
58712 625982 630570 635603 640434 644012 645993 646633 645951 643660 639733 634452 627940 620118 611117 601315 590957
58697 590957 580056 568691 557097 545474 533937 522689 512029 502136 493017 484658 477076 470206
58685 470206 463903 458124 453003 448636 444879 441463 438386 436019 434657 433991 433288 432208 431191 430891 431502
58670 431502 432883 435045 438094 441839 445872 450019 454409 459186 464444 470306 476556 482220 485985 487165
58656 487165 486005 483161 479288 475090 471145 467483 463707 459707 455960 453024 450967 449329 447429 444831
58642 444831 441869 439518 438329 437708 436803 435858 435845 436866 437940 438562 439438 441154 443083 444331 445127 446408
58626 446408 448369 450217 451202 451267 450848 450554 451029 452609 454993 457470 459488 460944 462064 463198 464611 466378
58610 466378 468602 471634 475703 480339 484635 488222 491503 494741 497483 499235 500238 501161 502292 503389
58596 503389 504037 503928 503091 502114 501796 502357 503407 504868 507358 511279 516127 521290 527038 534006 541931 549699
58580 549699 556667 563408 570915 579427 588145 596062 603030 609978 617944 626988 636448 646194 657040 669723
58566 669723 684072 699522 715882 733172 751167 769625 788623 808110 827365 845285 861075
58555 861075 874397 885193 893672 900192 904785 907057 906872 904788 901524 897340 892173 885956 878538 869794
58541 869794 860047 849836 838907 826133 810945 794177 776963 759501 741633 723980 707459 692134
58529 692134 677523 663788 651715 641629 633104 625628 618864 612503 606624 601943 598882 596530 593433
58516 593433 589345 585347 582274 579891 577685 575547 573407 571023 568513 566582 565858 566311 567388 568397 568770
58501 568770 568426 567887 567694 567800 567942 568301 569180 570259 570936 571347 572234 573877 575978 578684 582746 588370 594728
58484 594728 601084 607818 615905 625834 637347 649830 662594 675145 687457 699700 711524 721977
58472 721977 730299 736402 740449 742427 742406 740794 737996 734111 729274 724065 719295 715527 713023 712029 712848
58457 712848 715608 720017 725424 731203 737161 743429 749922 756110 761440 765683 768614 769692 768470 765121
58443 765121 760252 754407 748041 741671 735549 729453 723249 717477 712910 709717 707578 706383 706283 707212 708994
58428 708994 711830 716035 721276 726617 731468 736090 741132 746952 753257 759074 763217 765139 765236 764082 761686
58413 761686 757840 752731 746676 739702 732001 724352 717360 710678 703791 697231 692049 688351 685396 683043
58399 683043 682061 682913 685177 688354 692363 696982 701576 705657 709219 712382 715243 718092 721186 724265 726836
58384 726836 728891 730787 732597 734249 736139 738801 742078 745416 748871 752985 757796 762845 768146 774174
58370 774174 780901 787849 795154 803566 813194 823197 832900 842351 851612 860512 869380 879056 889774 900784
58356 900784 911358 921363 930652 938715 945222 950258 953856 956096 957732 959801 962499 965296 968263 972222
58342 972222 977404 983087 988932 995653 1003941 1013642 1024414 1036206 1048615 1060745 1072258 1083816 1095990
58329 1095990 1108432 1120516 1132025 1142804 1152532 1161258 1169489 1177369 1184385 1190135 1194767 1198590 1202007
58316 1202007 1205887 1211066 1217322 1223767 1230284 1237636 1246173 1255640 1266286 1278752 1292672 1306797 1320906
58303 1320906 1336079 1352625 1369257 1385076 1400970 1418112 1436255 1454423 1472269 1489938 1507540
58292 1507540 1525567 1545000 1566242 1588641 1611506 1634814 1658617 1682902 1708402 1736366 1766943
58281 1766943 1798854 1831121 1863875 1897159 1930392 1963655 1998076 2034088 2070581 2106610 2142735
58270 2142735 2179950 2218455 2258281 2299921 2343588 2388925 2436036 2485659 2537874 2591967 2647956
58259 2647956 2706762 2768351 2831356 2895155 2960670 3028444 3097627 3167661 3239328 3313390 3389787
58248 3389787 3468824 3551500 3638167 3728733 3824528 3927709 4038289 4154218 4275095 4403198
58238 4403198 4540026 4684654 4836588 4997352 5167976 5347891 5537809 5740777 5958823
58229 5958823 6191513 6439388 6705630 6992643 7300412 7630232 7986539 8372892 8789815
58220 8789815 9239220 9727301 10260305 10841245 11473988 12167128 12930809 13773578 14705966
58211 14705966 15743740 16904576 18205752 19669180 21325392 23209933 25361419 27828817
58203 27828817 30678649 33994675 37879804 42466817 47925470 54458261 62299430 71725872
58195 71725872 83056385 96605950 112583810 130953229 151316192 172939859 194995401
58188 194995401 216874783 238288076 258997470 278414908 295430463 308569065 316276927
58181 316276927 317198496 310519235 296380403 276084180 251796911 225860574 200163977
58174 200163977 175902937 153680269 133712293 116000780 100450647 86932725 75293331
58167 75293331 65346953 56889334 49721623 43658799 38527099 34170030 30457847 27284630
58159 27284630 24558956 22203217 20157224 18373855 16811428 15433804 14213732 13129819
58151 13129819 12161632 11291331 10506911 9799130 9157378 8572089 8038213 7552169 7107661
58142 7107661 6698064 6320307 5972555 5650474 5349585 5069176 4810129 4570635 4347487
58133 4347487 4139744 3947602 3769169 3601777 3445150 3300129 3165388 3038303 2917995
58124 2917995 2804878 2698359 2597476 2502633 2414236 2330826 2250922 2175365 2105397 2039762 1976272
58113 1976272 1915031 1857438 1803029 1750016 1698199 1648800 1601948 1556658 1512839 1471159 1431342
58102 1431342 1392499 1354604 1317921 1281766 1245716 1211245 1180151 1151943 1124709 1097887 1072322
58091 1072322 1048310 1025652 1005091 987548 972204 957271 942439 928790 916578 904787 892684
58080 892684 880144 866713 852005 836837 822370 808341 793562 777966 762628 748078 734103
58069 734103 720991 709411 699154 689429 680281 672259 664850 656740 647666 638681 630554 623047 615768
58056 615768 608562 601111 593223 585394 578066 570583 562036 552825 544190 536489 529256 522655 517390 513236
58042 513236 509060 504453 499992 495771 490968 485200 479189 473662 468439 462875 456554 449430 441961 435071
58028 435071 429322 424204 418842 413122 407369 401382 394766 387900 381561 375831 370388 365535 361792 358702
58014 358702 355302 351697 348938 347324 346045 344581 343269 342279 341156 339696 338320 337311 336529 336040 336178
57999 336178 336757 337030 336624 335852 335028 334246 333814 334066 334639 334726 334111 333211 332086 330300 327843 325367 323351
57982 323351 321758 320551 319750 318917 317422 315332 313333 311742 310361 309297 309031 309556 310275 310839 311332 311657
57966 311657 311623 311636 312335 313451 313971 313523 312659 311637 310083 308127 306701 306195 305775 304620 303005 301596 300413
57949 300413 299091 297591 296130 294873 294058 293940 294406 295214 296783 299956 304701 309881 314769 320005 326472
57934 326472 333859 341013 347209 352504 357242 361702 365931 369479 371565 371847 370657 368266 364456 359219
57920 359219 353342 347759 342615 337434 331891 326055 320162 314600 309947 306609 304480 303135 302154 301159 299853
57905 299853 298344 297198 296887 297268 297807 298191 298609 299547 301395 304121 307315 310601 313906 317235 320463 323658
57889 323658 327276 331526 335723 338851 340717 341998 343162 343838 343277 341042 337322 333042 329479 327196 325403
57874 325403 322858 319226 315024 310584 305980 301734 298516 296101 293661 291303 290231 291012 292630 293777
57860 293777 294370 295301 297435 301275 306929 313787 320734 327053 332794 338104 342919 347498 352391 357439 361558
57845 361558 364025 365290 366035 366237 365747 365013 364439 363590 361824 359244 356318 353039 349228 345241 341619 338283
57829 338283 334805 331264 328164 325720 323788 322219 320703 318624 315814 313244 312152 312481 312824 311954 309808
57814 309808 306960 303749 300190 296314 292261 288145 283868 279051 273342 266977 260812 255602 251395 247820
57800 247820 244624 241665 238754 236019 234177 233977 235384 237623 239889 241749 243125 244337 245997 248428
57786 248428 251264 253980 256717 260136 264516 269448 274529 279952 286115 292843 299307 304846 309732 314869
57772 314869 320680 326583 331748 335961 339336 341592 342371 342134 341827 341535 340351 337787 334462 331040 327397
57757 327397 323412 319720 316902 314563 311984 309205 306696 304525 302649 301572 301736 302586 303202 303652 304769
57742 304769 306673 308482 309570 310186 310663 310884 310835 311043 312012 313611 315278 316558 317325 317791 318399 319452 320825
57725 320825 322264 323826 325631 327353 328443 328833 328967 329241 329843 331007 332819 334829 336410 337470 338235
57710 338235 338379 337188 334658 331674 328794 325576 321580 317363 313884 311331 309127 306891 304814 303132
57696 303132 301667 300026 298014 295733 293306 290603 287387 283865 280850 279032 278127 277201 275894 274885 274978
57681 274978 276271 278581 282341 288529 297818 310216 325593 344212 366528 392574 421651 452633
57669 452633 484568 516915 549210 580561 609616 634876 654730 667148 669740 660713 640124 610301
57657 610301 574989 537900 501714 467995 437589 410817 387479 367095 349453 334772 323245
57646 323245 314536 307902 302633 298226 294349 290954 288357 286876 286340 286168 285951 285770 285884 286325 286900 287486
57630 287486 288115 288757 289095 288674 287345 285411 283260 280956 278474 276132 274407 273313 272373 271270 270114
57615 270114 268951 267581 266113 265170 265091 265309 264999 264055 262982 262115 261489 261230 261478 261988 262337 262425 262341 261834
57597 261834 260459 258246 255728 253177 250327 246986 243531 240532 238123 235936 233586 231135 229065 227707
57583 227707 226752 225583 224124 222902 222094 221126 219645 218255 217570 217035 215648 213606 212192 212016 212332 212250
57567 212250 211663 210700 209216 207399 206110 205971 206580 207205 207784 208686 209846 210814 211447 211981 212538 213071 213728
57550 213728 214803 216292 217912 219577 221537 223948 226542 228864 230649 231908 232762 233258 233373 233132 232727
57535 232727 232488 232698 233415 234427 235334 235808 235859 235801 235853 235933 235976 236285 237267 238902 240716 242291 243544 244591
57517 244591 245568 246612 247738 248740 249441 250098 251306 253461 256381 259402 261738 262919 263165 263205 263517 263904
57501 263904 263964 263739 263527 263356 263092 262815 262556 261834 260115 257704 255594 254395 253973 254075 254642 255418 255951 256165
57483 256165 256378 256592 256393 255684 254905 254257 253459 252536 252157 252720 253657 254153 254039 253557 252789 251856 251242 251295 251758
57464 251758 252237 252845 253825 254924 255693 256151 256614 257074 257312 257468 257982 259070 260654 262616 264667 266186 266759
57447 266759 266780 267035 267750 268587 269442 270643 272277 273906 275174 276291 277706 279542 281596 283665 285759 288078
57431 288078 290776 293614 295930 297237 297836 298578 299918 301458 302548 303130 303816 305112 306762 308025 308650
57416 308650 309353 311041 313733 316619 319185 321763 324784 328030 331039 333836 336736 339621 341951 343471
57402 343471 344516 345563 346749 347896 348811 349601 350710 352518 354799 356915 358728 360987 364413 368638 372534
57387 372534 375468 377860 380525 383902 387921 392320 396915 401677 406479 410812 414084 416397 418662 421571
57373 421571 424723 427181 428659 429677 430770 432120 433833 435943 438132 440034 441951 444672 448378 452223
57359 452223 455320 457776 460449 463983 468367 473236 478257 483200 487855 491949 495227 497685 499730 501974
57345 501974 504818 508276 512124 516054 519848 523622 527835 532741 537904 542566 546547 550473 555001 560090
57331 560090 565187 569908 574315 578637 583005 587544 592563 598389 604904 611422 617258 622345 627061 631565
57317 631565 635797 640121 645335 651696 658490 665011 671479 678405 685525 692179 698487 705254 712662 719915
57303 719915 726376 732349 738442 744807 751406 758475 766233 774419 782549 790433 798158 805813 813535 821651
57289 821651 830434 839811 849527 859490 869758 880262 890768 901083 911228 921442 932039 943186
57277 943186 954755 966484 978220 989882 1001265 1012186 1022842 1033842 1045812 1059054 1073464
57266 1073464 1088456 1103073 1116621 1129322 1142048 1155346 1169071 1183034 1197504 1212769 1228550
57255 1228550 1244245 1259612 1274921 1290539 1306610 1323074 1339862 1357014 1374645 1392691 1410772
57244 1410772 1428512 1445950 1463308 1480389 1496693 1512345 1528416 1545874 1564502 1583305 1601901
57233 1601901 1621020 1641523 1663242 1684962 1705467 1724515 1742904 1761726 1781579 1802416 1823894
57222 1823894 1845697 1867627 1889659 1911907 1934365 1956692 1978520 1999960 2021523 2043552 2066005
57211 2066005 2088832 2112197 2136229 2160901 2186288 2212501 2239153 2265325 2290433 2314826 2339152
57200 2339152 2363429 2387231 2410544 2433849 2457329 2480564 2503258 2525868 2549138 2573124 2597044
57189 2597044 2620214 2642952 2666305 2690876 2716180 2741401 2766513 2792147 2818431 2844579 2869947
57178 2869947 2894936 2920405 2946514 2972762 2998939 3025386 3052226 3078953 3104960 3130068 3154294
57167 3154294 3177492 3199591 3220942 3242080 3263244 3284416 3305744 3327547 3349852 3372191 3394043
57156 3394043 3415290 3436165 3456873 3477425 3497688 3517335 3535742 3552228 3566597 3579346 3591158
57145 3591158 3602239 3612267 3621012 3628881 3636761 3645323 3654567 3664186 3674389 3686135 3700334 3716994
57133 3716994 3735542 3755968 3779061 3805271 3833787 3863301 3893486 3925244 3959618 3996995 4037460
57122 4037460 4081442 4129680 4182747 4240860 4304164 4373134 4448592 4531193 4620891 4717250 4820580
57111 4820580 4932534 5055379 5190957 5340837 5507326 5693950 5905061 6145450 6420281
57102 6420281 6735051 7095873 7510526 7989554 8546506 9197885 9963548 10866276 11928858
57093 11928858 13170093 14602797 16233797 18063012 20081136 22269134 24601657 27052839
57085 27052839 29602294 32239386 34960701 37755001 40579657 43344788 45918796 48151901
57077 48151901 49902816 51059526 51554904 51376518 50564015 49191958 47347567 45115600
57069 45115600 42573468 39791653 36835860 33770824 30664362 27587767 24611054 21795916
57061 21795916 19190072 16824257 14711749 12850560 11227817 9824445 8618401 7586440
57053 7586440 6705421 5953601 5311465 4761840 4289607 3881616 3526923 3216907 2944806
57044 2944806 2704865 2491806 2300985 2128837 1973011 1832055 1704933 1590646 1488081
57035 1488081 1396206 1314465 1242882 1181573 1129988 1086575 1049083 1015117 982355 948407 910795
57024 910795 867511 817903 763103 705509 647713 591714 538761 489569 444531 403794 367228
57013 367228 334367 304579 277467 253148 232020 214258 199564 187328 176864 167484 158633 150104
57001 150104 142080 134876 128702 123636 119669 116605 114032 111637 109597 108484 108645 109795 111405 113487
56987 113487 116707 121627 127967 134834 141519 147777 153397 157853 160478 160693 157966 151960 143024 132281
56973 132281 120935 109598 98518 88214 79454 72615 67515 63962 62201 62704 65731 71201 78840
56960 78840 88298 99190 111039 123226 135054 145941 155398 162718 166928 167334 163985 157353 147778
56947 147778 135700 122274 109161 97504 87598 79680 74443 72357 72992 75599 80184 87446 97770
56934 97770 110779 125891 142724 160687 178586 194965 208669 218846 224597 224992 219497 208334
56922 208334 192498 173567 153321 133175 113808 95368 78009 62104 47984 35726 25307
56911 25307 16828 10383 5744 2301 -597 -3188 -5141 -5951 -5661 -5132 -5316 -6226 -6861 -6271 -4389 -1613
56894 2017 6822 12911 20179 28681 38417 48709 58484 67453 76471 86339 96642 106157 114014 119962
56880 119962 123770 125076 123871 120662 116034 110441 104622 99865 97488 98013 101026 105876 112472 121342
56866 121342 133027 147629 165032 185348 208674 234395 261156 287753 313686 338485 360683
56855 360683 377937 388196 390576 385306 373327 356155 335853 314801 295316 279261 267758 261154
56843 261154 259381 262497 270982 285571 306740 334185 366741 402889 441332 481058 520993 559866
56831 559866 596245 628232 653033 667404 668948 657001 632487 597615 555930 511838 469167 430141
56819 430141 395915 367553 345896 330911 322093 319465 323418 333539 348311 366277 386908 409999
56807 409999 434664 459300 482269 502169 517497 526286 526304 515917 495160 466126 432183 396660
56795 396660 362049 329925 301116 275962 254780 238136 226542 219974 217983 220067 225646 233834
56783 233834 243753 255053 267718 281244 294336 305387 312994 316089 314031 306693 294233 276921
56771 276921 255546 231889 208252 186317 166633 149022 133131 118713 105827 94709 85158 76316
56759 76316 67597 59541 53065 48075 43637 39361 35661 32620 29746 27109 25554 25283 25188 24329 23189
56744 23189 22676 22600 22063 20873 19648 18794 18203 17769 17509 17333 17319 17962 19488 21143 21869 21529 20825 20164
56726 20164 19397 18591 18261 18649 19495 20670 22375 24423 25981 26428 26111 25894 26299 27346 28885 30640 32144
56709 32144 33056 33576 34321 35757 37877 40270 42369 43728 44353 44802 45814 47630 49699 51113 51390 50796
56693 50796 49988 49481 49495 50103 51301 52937 54753 56460 57696 58091 57648 57021 57137 58447 60699 63291 65546
56676 65546 66790 66746 65990 65567 65951 66639 66902 66553 65873 65231 64981 65309 65921 66241 66226 66564 67794 69550 71041
56657 71041 71868 72051 71632 70807 70186 70357 71234 72213 72837 73044 72933 72640 72316 71964 71432 70767 70263 69963 69483
56638 69483 68719 68327 68960 70256 71142 70985 70061 69089 68744 69322 70358 70760 69944 68674 68232 68859 69675 69997
56620 69997 70001 69975 69698 68929 68000 67475 67459 67522 67191 66392 65470 64777 64229 63425 62311 61441 61265 61503 61644 61797
56600 61797 62463 63616 64593 64931 64811 64704 65061 66292 68459 70882 72563 73156 73154 73091 73023 72852 72676 72644 72839
56581 72839 73386 74271 75085 75372 75310 75572 76441 77517 78395 79167 80091 81279 82897 85263 88528 92574 97305
56564 97305 102651 108234 113564 118710 124267 130430 136607 142183 147185 151867 156045 159228 161030 161195 159592
56549 159592 156562 152987 149628 146564 143501 140428 137677 135573 134216 133463 132981 132497 132052 131743 131267 130179
56533 130179 128621 127220 126101 124672 122672 120729 119348 118015 116107 114216 113650 114696 116206 117031 117164
56518 117164 117214 117318 117062 116155 114750 113119 111287 109137 106759 104544 102848 101671 100756 99956 99287 98671
56502 98671 97905 96997 96260 95967 96076 96436 97000 97730 98477 99164 99898 100738 101457 101683 101238 100311 99439 99223 99839
56483 99839 100827 101604 102151 102888 103905 104806 105379 105906 106625 107362 107971 108655 109531 110318 110903 111773 113355 115186
56465 115186 116339 116557 116461 116666 117163 117613 117836 117917 118112 118695 119665 120587 120947 120711 120341 120269 120566 121059 121570
56446 121570 121974 122232 122400 122516 122488 122289 122173 122465 123088 123498 123244 122510 121978 122129 122803 123464 123790 123867 123893 123980
56426 123980 124275 124942 125742 125930 124965 123251 121825 121415 122120 123765 125976 127972 128972 129042 129039 129525 130209 130690
56408 130690 131115 131744 132391 132861 133539 134900 136575 137520 137170 136031 135058 134807 135298 136444 138285 140688 142953
56391 142953 144078 143744 142837 142599 143256 143960 144059 143872 143971 144325 144559 144672 145006 145732 146753 147908 148993 149799
56373 149799 150476 151577 153376 155334 156608 156962 156861 156812 157006 157543 158607 160330 162650 165332 168024 170328
56357 170328 171912 172586 172376 171669 171152 171313 172027 172870 173677 174377 174537 173739 172437 171675 171921 172901 174640 177623
56339 177623 181575 185157 187612 189763 192556 195485 197526 198973 201012 203815 206341 208017 209408 211087
56325 211087 212905 214711 216841 219435 221936 223786 225115 226338 227446 228073 228014 227441 226820 226778 227746 229511
56309 229511 231301 232484 233101 233652 234616 236221 238461 241160 244147 247450 251281 255736 260440 264533 267213
56294 267213 268560 269706 271879 275266 279170 283140 287345 291801 295958 299452 302681 306215 310111 314239
56280 314239 318723 323616 328577 333445 338710 344926 352058 359862 368354 377393 386403 395249 404841 416107
56266 416107 428836 442341 456701 472422 489359 507187 526699 549419 575919 605560 637905
56255 637905 673346 712211 754384 800172 850740 907275 970222 1039420 1114336 1194033 1277535
56244 1277535 1364287 1453720 1544525 1635132 1724724 1812811 1897727 1976599 2046953 2107480 2157035
56233 2157035 2194019 2217191 2226313 2221573 2203132 2171658 2128571 2075363 2013347 1944336 1870751 1794483
56221 1794483 1716236 1636399 1555971 1476265 1398317 1323067 1251491 1184134 1121010 1062199 1007897
56210 1007897 957584 909996 864560 822202 784113 750214 719438 691012 664753 640523 618155
56199 618155 597783 579671 563735 549566 536774 525107 514451 504974 496990 490504 485131 480534
56187 480534 476531 472716 468594 464343 460858 458669 457336 456228 455344 454943 454897 454986 455420 456568 458404 460627
56171 460627 463006 465285 467144 468713 470813 474229 478969 484591 490976 498365 506855 516290 526509 537413
56157 537413 548862 560823 573573 587556 603111 620359 639316 660168 683653 711023 743345
56146 743345 780964 824013 873242 929744 993871 1064887 1141613 1222921 1307781 1395542 1486118
56135 1486118 1579115 1672668 1763761 1849653 1928324 1997899 2057045 2106281 2147842 2183662 2214166
56124 2214166 2239004 2257646 2268674 2269737 2259325 2238011 2207343 2168235 2121123 2066837 2006167
56113 2006167 1938915 1864373 1782783 1695923 1606442 1516997 1429796 1346517 1268642 1197769 1135142
56102 1135142 1080942 1034611 995758 963982 937948 915816 896898 881848 870862 862800 856545 852061
56090 852061 849432 847926 846908 846805 848310 851327 855419 860470 866159 871588 876351 881317 887511 894786
56076 894786 902353 910021 918140 926905 936457 947171 959193 972129 985621 999588 1013575 1026889
56064 1026889 1039976 1054521 1071351 1089160 1106222 1122444 1138774 1155449 1171989 1188249 1204435
56053 1204435 1220621 1237116 1254702 1273609 1292869 1311521 1329888 1348952 1369178 1390637 1413486
56042 1413486 1437544 1462199 1487486 1514312 1542932 1572268 1601556 1631479 1662729 1694672 1726594
56031 1726594 1759017 1792568 1826747 1861126 1896533 1933641 1971655 2010009 2050164 2093857 2140527
56020 2140527 2188363 2237111 2288002 2341537 2397200 2454983 2515503 2578933 2645175 2714705 2787966
56009 2787966 2864473 2943698 3026166 3112611 3203003 3297579 3397626 3503896 3615471 3731631
55999 3731631 3853561 3982695 4118854 4261783 4413002 4574184 4745106 4925250 5116025
55990 5116025 5319392 5535842 5765892 6011982 6276589 6560230 6863773 7190943 7545858
55981 7545858 7929980 8344444 8793547 9282855 9815876 10396180 11031120 11730050 12500875
55972 12500875 13352380 14298382 15355979 16542007 17875982 19385249 21103679 23068407
55964 23068407 25324039 27930034 30961971 34511689 38695766 43665356 49605636 56732038
55956 56732038 65295786 75585737 87895026 102436925 119225378 137970794 158080180
55949 158080180 178829813 199632686 220164971 240183249 259164969 276099298 289592102
55942 289592102 298150266 300467317 295716115 283887578 266002851 243935268 219848953
55935 219848953 195599840 172437959 151042677 131699736 114464058 99273279 86016292
55928 86016292 74556208 64728450 56347739 49227599 43191831 38074998 33726780 30020295
55920 30020295 26851276 24130091 21780086 19741178 17966786 16415880 15051914 13847184
55912 13847184 12781201 11834083 10985877 10221568 9531477 8906516 8337105 7816386 7340120
55903 7340120 6903187 6499727 6126551 5782800 5466332 5173649 4903091 4654635 4426591
55894 4426591 4215706 4020437 3840959 3675877 3521962 3377394 3242474 3116858 2998737
55885 2998737 2887081 2782192 2683522 2589131 2497720 2409392 2324211 2241834 2162606 2087247 2015385
55874 2015385 1946084 1879653 1817176 1758439 1702236 1648576 1598690 1552760 1509475 1467913 1428191
55863 1428191 1390205 1353434 1318110 1284962 1253580 1222420 1190518 1157948 1124825 1091395 1058973
55852 1058973 1029124 1001805 975743 950632 927404 906239 885905 865470 845318 826130 807959
55841 807959 790585 773764 757027 740160 723856 708911 694958 681035 667221 654482 643065
55830 643065 632257 621659 611509 601839 592505 583930 576615 570005 563051 555721 548608 541280 532637
55817 532637 522972 514071 506782 499939 492216 483920 476355 470432 466363 463886 462307 460952 459857 459466
55803 459466 459723 460261 461407 464029 468173 472746 476696 479792 482209 484064 485468 486344 486253 484991 483103
55788 483103 481098 478516 474708 470146 465863 461862 457304 452147 447390 443761 441343 440452 441635 444654
55774 444654 448608 453177 458747 465329 472455 480041 488003 494883 498109 495881 487882 474329 455863 434506
55760 434506 413142 393420 375188 358211 343088 330072 318401 307472 297586 288990 281265 274164
55748 274164 267959 262430 256676 250452 244548 239261 233681 227213 220674 215059 210227 205677 201625 198395
55734 198395 195548 192546 189594 186977 184280 181137 178123 176018 174686 173458 172182 171102 170111 168851
55720 168851 167326 165850 164690 164126 164437 165458 166640 167866 169591 171880 174052 175671 177109 178572 179422
55705 179422 179131 178130 176957 175287 172672 169616 166988 164799 162475 159921 157497 155154 152472 149413
55691 149413 146365 143580 141148 139356 138537 138694 139654 141327 143407 145198 146280 147091 148412 150508 153144
55676 153144 156082 159123 161979 164503 166705 168261 168463 167133 165116 163470 162567 162365 162936 164184 165540
55661 165540 166529 167182 167493 167074 165974 165200 165666 167073 168536 169775 170945 171798 171977 171771 171707 171634 171054 170050
55643 170050 169041 167860 165965 163368 160417 156843 152042 146308 140840 136361 132546 128997 125907 123492
55629 123492 121452 119375 117217 115123 113129 111268 109695 108637 108345 108937 109926 110264 109315 107563 105849
55614 105849 104273 102517 100869 99953 99608 99059 98163 97452 96843 95453 93088 90801 89352 88041 85880 83183
55598 83183 81085 79965 79322 78917 79077 79791 80347 80190 79566 79016 78646 78298 78157 78636 79673 80546 80692 80443
55580 80443 80650 81677 83209 85098 87922 92289 97860 103491 108269 112050 115047 117345 119000 120357 121912
55565 121912 123808 125473 125918 124569 121852 118743 115680 112222 107937 103230 98956 95478 92483 89591
55551 89591 86720 83976 81582 79870 78985 78592 78166 77540 76906 76375 75892 75558 75654 76257 77091 77797 78146 78032
55533 78032 77521 76937 76677 76899 77487 78253 79011 79606 80015 80304 80280 79470 77697 75449 73349 71472 69562 67681
55515 67681 66162 65060 64153 63452 63205 63363 63462 63077 62059 60412 58346 56487 55504 55398 55496 55227 54630 54084
55497 54084 53887 54117 54602 54997 55178 55524 56377 57330 57523 56687 55450 54514 54012 53767 53699 53753 53841 53990 54263 54445
55477 54445 54302 54214 54993 56804 58787 60071 60630 60749 60186 58537 56207 54312 53575 53769 54213 54422 54184
55460 54184 53472 52516 51768 51585 51961 52615 53255 53708 53866 53648 53053 52263 51613 51383 51584 51953 52146 51969 51554
55441 51554 51327 51648 52375 52938 53002 52871 52989 53257 53221 52867 52850 53777 55554 57513 58960 59546 59334 58663 57844
55422 57844 57011 56335 56215 56880 57869 58360 58094 57597 57347 57162 56674 55978 55372 54727 53696 52504 51941 52375
55404 52375 53104 53019 51728 49750 47763 46102 44993 44732 45275 45956 46172 46177 46693 47767 48643 48902 49070 49774
55386 49774 50908 52056 53169 54214 54667 54116 53063 52344 51906 51017 49627 48700 48968 50073 51138 51579
55370 51579 51154 49872 48237 47069 46734 46834 46868 46766 46643 46558 46742 47513 48590 49021 48262 46919 45994 45740
55352 45740 45757 45821 46012 46259 46345 46330 46493 46856 47135 47202 47210 47229 47047 46426 45373 44089 42787 41591 40536 39675
55332 39675 39208 39411 40349 41756 43257 44651 45936 47168 48316 49103 49089 48097 46569 45262 44625 44732 45595
55315 45595 47038 48275 48335 47192 45946 45578 45968 46407 46534 46306 45550 44187 42639 41473 40796 40481 40757
55298 40757 41956 43765 45279 45869 45602 44885 44122 43692 43738 43854 43407 42369 41508 41557 42468 43642 44702 45774
55280 45774 47052 48290 48915 48679 48026 47613 47578 47645 47890 48778 50249 51389 51514 51097 50997 51151 50785 49781
55262 49781 48990 49068 49656 49978 49689 48903 47851 46851 46267 46177 46262 46216 46092 46132 46412 46791 47052 47055 46936 47116 47838
55241 47838 48763 49325 49497 49726 50112 50178 49700 49240 49454 50184 50662 50448 49823 49383 49527 50223 51069 51641 51894
55222 51894 52077 52234 52174 52083 52604 53863 54862 54518 53088 51892 51630 51697 51289 50518 50070 50293 50980 51743 52195
55203 52195 52090 51696 51754 52688 53977 54746 54772 54481 54092 53370 52315 51522 51550 52223 52842 52895 52414 51886 51945 52934
55183 52934 54557 56146 57355 58328 59053 58988 57699 55648 53928 53313 53829 55051 56424 57472 58054 58426
55167 58426 58712 58503 57421 55932 55012 54980 55253 55363 55566 56172 56852 57146 57269 57899 59308 61030 62324 62678
55149 62678 62066 60988 60095 59501 58592 56787 54391 52382 51436 51355 51424 51098 50441 50051 50560 52070 54126 56199
55131 56199 57992 59195 59414 58654 57582 56924 56742 56659 56517 56422 56280 55890 55468 55577 56369 57296 57769 57769 57644
55112 57644 57604 57639 57783 58172 58920 59983 61102 61846 61896 61380 60832 60722 61082 61588 61943 62059 61948 61532 60711
55093 60711 59666 58937 58982 59616 60230 60647 61419 62981 64842 66026 66122 65490 64565 63527 62655 62418 62953 63830
55075 63830 64595 65315 66318 67631 68827 69320 68711 67087 65139 63788 63437 63698 63948 63986 63994 64097 64257 64451
55057 64451 64654 64705 64496 64344 64822 66077 67489 68233 68068 67385 66566 65600 64409 63292 62773 63052 63808 64564
55039 64564 65048 65227 65141 64846 64393 63831 63279 62972 63051 63290 63272 62963 62888 63579 64957 66456 67570 68119 68106 67610
55019 67610 66907 66499 66858 67988 69263 69887 69730 69535 69996 70746 70763 69752 68469 67557 66774 65829 65267 65770
55001 65770 66985 67861 68020 68065 68631 69770 71246 72739 73713 73769 73260 72959 72984 72690 71757 70682 69906 69159
54983 69159 68190 67535 67925 69245 70702 71827 72743 73567 74142 74443 74821 75629 76805 77951 78675 78754 78087 76665
54965 76665 74708 72774 71540 71268 71606 72079 72643 73513 74554 75294 75518 75479 75431 75393 75473 75956 76804 77448 77362
54946 77362 76623 75680 74876 74398 74364 74630 74769 74543 74197 74077 74226 74626 75474 76818 78209 79141 79664 80123 80577
54927 80577 81053 82166 84760 88772 93049 96541 99312 102123 105474 109347 113555 117844 121747 124840 127201
54912 127201 129293 131182 132170 131484 129192 126068 122597 118598 114055 109744 106461 103853 100733 96590 92174
54897 92174 88459 85696 83773 82838 82960 83571 83916 83872 83809 83842 83758 83582 83641 84037 84573 85236 86357 88207 90819
54878 90819 94221 98398 102895 106970 110398 113740 117523 121439 124706 127012 128692 129961 130358 129169 126336
54863 126336 122731 119395 116576 113726 110486 107356 105070 103518 101728 98998 95680 92689 90505 88849
54849 88849 87156 85130 82868 80620 78522 76613 75075 74249 74181 74267 73644 72036 70066 68691 68465 69255
54833 69255 70430 71231 71202 70492 69666 69179 69065 69142 69292 69517 69854 70321 70833 71202 71336 71433 71770 72360 73006 73692
54813 73692 74586 75600 76280 76352 76111 76023 76063 75742 74791 73630 73078 73529 74411 74607 73643 72377 72187 73463 75262
54794 75262 76489 76941 76995 76824 76415 76036 76089 76550 77009 77234 77305 77275 77157 77223 77846 78914 79880 80576 81579 83454
54774 83454 85994 88564 90948 93446 96221 98979 101401 103653 106285 109732 113982 118681 123433 127939
54760 127939 131922 135176 137809 140187 142309 143382 142482 139634 135767 131481 126453 120434 114283 109370
54746 109370 106166 103956 101835 99427 96735 93914 91309 89255 87740 86685 86474 87614 89731 91596
54732 91596 92451 92761 93354 94356 95465 96735 98498 100815 103575 106854 110619 114311 117390 120126 123250
54717 123250 126839 130205 132813 134653 135677 135606 134521 132953 131081 128389 124523 120015 115699 111840 108276
54702 108276 105106 102625 100738 98966 97076 95269 93691 92088 90165 88080 86348 85236 84417 83332
54688 83332 81920 80747 80283 80228 79821 78712 77270 76120 75745 76369 77741 78978 79175 78361 77410 76874 76416
54671 76416 75580 74546 73768 73408 73571 74542 76181 77497 77558 76633 75805 75562 75443 74966 74206 73373 72450 71523
54653 71523 70936 70897 71237 71733 72363 73095 73792 74516 75595 77140 78706 79664 79784 79318 78679 78221 78215 78850 80176
54634 80176 82042 84021 85504 86016 85466 84108 82391 80925 80314 80659 81343 81627 81452 81382 81821 82569 83171
54617 83171 83357 83188 83003 83289 84253 85489 86329 86572 86545 86446 86021 85079 83981 83340 83384 83830 84251 84406 84261
54598 84261 83866 83204 82205 80942 79734 78885 78366 77955 77629 77582 77883 78381 78966 79633 80273 80705 80974 81307 81698
54579 81698 81825 81482 80799 79891 78661 77180 76010 75807 76706 78254 79890 81330 82601 83868 85178 86323
54563 86323 86979 87050 86779 86516 86484 86684 86875 86664 85896 84949 84439 84606 85195 85884 86528 87020 87326 87791 89034
54544 89034 91316 94131 96572 97940 98081 97476 97052 97504 98616 99509 99647 99229 98574 97630 96389 95271 94700
54527 94700 94518 94200 93466 92424 91349 90569 90334 90539 90784 90889 91050 91335 91446 91284 91294 91769 92198 91870 90918
54508 90918 90134 89919 89992 90099 90411 91076 91864 92410 92586 92518 92500 92790 93279 93465 93130 92849 93339 94346 94767 93952
54488 93952 92411 91038 90189 89851 90206 91464 93290 94878 95661 95662 95133 94198 93054 92267 92453 93579 94886
54471 94886 95753 96461 97742 99695 101617 102962 103974 105128 106391 107357 107704 107199 105708 103678 102204 101976
54455 101976 102392 102387 101914 101834 102396 102706 101916 100197 98228 96418 95062 94624 95231 96166 96438 95821 94971 94580
54437 94580 94680 94741 94290 93396 92621 92435 92790 93385 94155 95141 96056 96505 96665 97148 98047 98681 98500 97788 97243
54418 97243 97398 98606 100879 103298 104318 103310 101359 99960 99493 99644 100572 102513 104618 105559 105368 105476
54402 105476 106555 107477 106988 105498 104419 104354 104777 105119 105299 105356 105306 105421 106080 107239 108425 109285 109803 109967
54384 109967 109596 108620 107301 106106 105503 105777 106733 107571 107438 106284 104997 104585 105379 106982 108766 110309
54368 110309 111561 112722 113888 114834 115373 115907 117262 119751 122705 125170 126881 128262 129699 131220 132801
54353 132801 134468 135900 136283 134940 132088 128780 126055 124203 122806 121333 119630 117853 116130 114450
54339 114450 112846 111479 110347 109118 107507 105756 104451 103838 103630 103583 103936 105018 106613 108047 108852 109106
54323 109106 109144 109192 109358 109696 110135 110448 110469 110255 109951 109529 108793 107651 106294 105093 104359 104182 104460 104989 105558
54304 105558 105962 105996 105522 104615 103611 102906 102672 102817 103226 103839 104435 104534 103859 102860 102489 103244 104663 105935
54286 105935 106833 107809 109259 111000 112463 113192 113124 112588 112083 111934 112123 112480 112913 113281 113230 112523 111468 110687
54268 110687 110456 110603 111084 112109 113529 114568 114572 113731 112759 112086 111707 111600 111852 112515 113628 115212 116890
54251 116890 117788 117348 116211 115709 116417 117646 118483 118801 118998 119178 119008 118257 117115 116057 115528 115615 115886 115689
54233 115689 114760 113501 112539 112135 112149 112394 112780 113192 113418 113310 112949 112638 112708 113227 113833 113946 113254 112031 110966
54214 110966 110643 111113 111883 112364 112404 112347 112473 112510 111895 110528 109033 108182 108195 108700 109177 109332 109146 108732 108212
54195 108212 107713 107434 107579 108048 108371 108170 107728 107776 108659 109949 111050 111907 112885 114067 115019 115343 115285 115582
54177 115582 116655 118050 118823 118534 117670 116981 116663 116444 116244 116282 116541 116589 116096 115155 113930 112377 110600 109185
54159 109185 108743 109218 109951 110374 110446 110480 110771 111362 112012 112419 112534 112560 112604 112550 112446 112687 113530 114623 115360 115571
54139 115571 115483 115131 114268 112935 111709 111189 111494 112372 113549 114781 115821 116543 117023 117330 117387 117165 116904 116893
54121 116893 117084 117166 117049 117104 117802 119186 120842 122331 123522 124506 125367 126206 127275 128744 130286 131062 130445
54104 130445 128714 126904 125918 125892 126374 126993 127823 129170 131082 133170 134956 136350 137674 139187 140804 142413
54088 142413 144260 146664 149316 151214 151587 150764 149852 149569 149676 149573 149132 148652 148283 147876 147364 146846 146262
54071 146262 145509 145018 145618 147374 149056 149434 148822 148564 149140 149695 149556 149279 149703 150754 151854 152972 154482
54054 154482 156310 158026 159656 161661 164081 166452 168724 171636 175754 180584 185081 188923 192925 198177
54040 198177 204891 212140 218698 224106 228877 233686 238598 243246 247454 251318 254844 257944 260775 263670
54026 263670 266628 269241 271257 272907 274460 275703 276122 275531 274287 272864 271273 269027 265755 261757 257697
54011 257697 253695 249107 243469 237336 231754 227146 223162 219439 215903 212438 208827 205120 201536 198021
53997 198021 194425 191104 188619 186721 184382 181163 177856 175413 173873 172797 172044 171498 170650 169251 167949
53982 167949 167466 167431 166876 165676 164600 164034 163566 162977 162742 163164 163675 163450 162327 160888 159984 160326 162025
53965 162025 164266 165886 166600 167286 168799 170972 173157 175274 177743 180682 183820 187155 191102 195888 201165
53950 201165 206376 211232 215739 219981 224072 228182 232471 236925 241208 244717 246957 248003 248517 249242 250553
53935 250553 252563 255371 258929 262838 266640 270317 274284 278829 283789 288793 293631 298334 303123 308378
53921 308378 314434 321257 328411 335447 342312 349316 356772 364670 372592 379881 386039 391041 395250 398974
53907 398974 402149 404418 405374 404695 402264 398336 393546 388589 383887 379512 375257 370652 365116 358407 350922
53892 350922 343355 336001 328596 320840 312809 304730 296634 288474 280429 272828 265796 259231 253076 247377
53878 247377 242061 236907 231814 226884 222225 217963 214508 212397 211526 210800 209007 205963 202508 199450 196930
53863 196930 194830 193286 192455 192021 191287 189770 187591 185343 183625 182581 181800 180727 179238 177658 176240
53848 176240 174858 173316 171712 170316 169289 168657 168365 168128 167525 166520 165733 165802 166614 167454 167811 167651 167053
53831 167053 166168 165547 165922 167356 168985 169887 169929 169610 169515 170180 172031 174865 177652 179387 180134 180858 182307
53814 182307 184477 187058 189871 192756 195571 198513 202050 206320 210880 215297 219633 224124 228717 233355
53800 233355 238451 244488 251196 257593 262999 267633 272042 276313 280094 283162 285600 287473 288626 288889
53786 288889 288295 287036 285276 283026 280150 276510 272203 267615 263117 258723 254187 249424 244612 239824
53772 239824 234869 229733 224957 221178 218300 215510 212216 208662 205365 202267 198835 194903 191005 187748
53758 187748 185176 182953 180956 179424 178538 178045 177341 175829 173285 170045 166873 164508 163212 162740 162749 163105
53742 163105 163737 164385 164677 164497 164089 163781 163754 164108 164929 166089 167071 167340 166950 166620 167052 168211 169414 170123
53724 170123 170576 171527 173348 175441 176709 176686 176075 176020 176980 178537 180229 182137 184538 187317 190024 192386
53708 192386 194468 196430 198378 200460 202809 205268 207349 208671 209427 210301 211844 213965 216100 217883 219526
53693 219526 221458 223726 226032 228295 230830 233793 236726 238854 239682 239160 237548 235436 233645 232712 232419
53678 232419 232093 231295 230013 228316 226284 224221 222536 221276 220074 218672 217247 216135 215523 215510 216158 217303
53662 217303 218528 219486 220084 220323 220252 220179 220562 221465 222388 222906 223194 223613 224060 224180 224124 224600 226052 228092 229930
53643 229930 231138 231828 232250 232455 232456 232604 233511 235404 237662 239308 240054 240567 241582 243117 244821 246774 249436
53626 249436 252868 256496 259754 262661 265581 268706 271980 275412 279245 283765 288994 294487 299450 303216
53612 303216 305796 307923 310408 313355 316082 317882 318808 319618 320911 322506 323806 324555 324981 325285 325395 325327
53596 325327 325381 325763 326253 326562 326780 327164 327620 327751 327393 326740 325976 325080 324066 323067 322092 320925 319466 317935
53578 317935 316584 315334 313922 312297 310658 309129 307664 306247 304973 303721 302052 299729 297271 295590
53564 295590 295005 294984 294998 295212 295945 296834 297123 296668 296013 295513 295061 294813 295410 297027 298777 299637 299623 299575 300160
53545 300160 301617 304147 307773 311853 315401 318051 320287 322677 325351 328353 332072 337085 343679 351595
53531 351595 360062 368208 375707 382997 390676 398869 407469 416686 426788 437456 448076 458694 470034
53518 470034 482370 495026 507307 519495 532557 547182 563373 580649 598397 616299 634640
53507 634640 653954 674100 694057 712883 730667 748279 766404 785017 803535 821213 837603
53496 837603 852872 867556 881872 895591 908702 921792 935388 949260 962795 975879 988944
53485 988944 1002247 1015536 1028427 1040757 1052492 1063553 1073857 1083453 1092514 1101133 1109009 1115373
53473 1115373 1119553 1121674 1122483 1122332 1120713 1117047 1111559 1105003 1097782 1089769 1080758 1070621 1059187 1046540
53459 1046540 1033438 1020904 1009237 997727 985443 971983 957472 942264 926901 911996 897870
53448 897870 884339 871022 857820 844999 832982 822093 812424 803882 796407 790119 785117 781230 778164
53435 778164 775916 774771 774805 775598 776663 778027 780210 783624 788154 793392 799164 805730 813509 822775 833630
53420 833630 846098 860048 875123 890988 907642 925245 943657 962416 981325 1000850 1021797
53409 1021797 1044700 1069557 1095945 1123259 1151065 1179485 1209154 1240716 1274433 1310239 1347850
53398 1347850 1386730 1426270 1466247 1506848 1548035 1589214 1629787 1669795 1709681 1749682 1789735
53387 1789735 1829697 1869159 1907224 1942977 1976183 2007153 2035962 2062217 2085592 2106172 2124139
53376 2124139 2139439 2151808 2160822 2165968 2167004 2164335 2158645 2149993 2137512 2120172 2097678 2070633
53364 2070633 2040057 2006883 1971698 1934839 1896714 1857975 1819222 1780694 1742523 1705127 1668976
53353 1668976 1634012 1599755 1566078 1533479 1502428 1472745 1443839 1415340 1387278 1359846 1333195
53342 1333195 1307434 1282714 1259223 1236992 1215703 1194961 1174977 1156656 1140646 1126487 1113210
53331 1113210 1100600 1089225 1079291 1070156 1061118 1051971 1042464 1032008 1020448 1008687 997863 988181
53319 988181 979050 970141 961735 954175 947498 941629 936497 931959 927979 924941 923405 923508 924923 927456
53305 927456 931347 936760 943255 950061 956890 964281 973109 983770 995927 1009021 1022898 1037844 1054119
53292 1054119 1071626 1090018 1108879 1127738 1146133 1163803 1180658 1196505 1210946 1223612 1234294
53281 1234294 1242829 1249093 1253302 1255991 1257456 1257428 1255472 1251500 1245580 1237543 1227183 1214812 1201123 1186454
53267 1186454 1170532 1153108 1134552 1115541 1096302 1076430 1055522 1033813 1012019 990623 969512
53256 969512 948408 927469 907220 887936 869289 850643 831536 811943 792294 773222 755053
53245 755053 737535 720301 703493 687517 672274 657209 642244 628053 615094 602977 591257
53234 591257 580317 570834 562731 555364 548505 542354 536602 530245 522615 514075 505477 497244 489111 480438
53220 480438 470669 459831 448667 437926 427553 416940 405980 395383 385868 377544 370199 363617
53208 363617 357342 350700 343495 336270 329448 322613 315108 307029 299030 291405 283920 276519 269556 263297
53194 263297 257653 252484 247788 243497 239496 235920 233067 230914 229022 227043 224931 222604 219842 216756
53180 216756 213869 211390 208768 205492 201997 199220 197375 195822 194160 192783 192097 191755 191182 190490 190300
53165 190300 190773 191380 191705 191978 192543 193174 193269 192626 191658 190868 190325 189785 189127 188502 188135 188065 188141 188255 188519 189103
53145 189103 189847 190208 189830 189154 189079 189854 190606 190344 189248 188539 189035 190281 191218 191329 190863 190378 190423 191405 193209
53126 193209 195135 196670 198204 200461 203244 205416 206308 206505 206925 207683 208370 208918 209541 210066 210054 209475 208663
53109 208663 207575 205752 203154 200468 198314 196587 194919 193391 192366 191889 191621 191296 190875 190301 189443 188424
53093 188424 187749 187898 188777 189698 189975 189507 188761 188237 188135 188535 189515 190843 191750 191451 189912 187848 185966
53076 185966 184493 183374 182583 182115 181965 182166 182644 183023 182886 182289 181644 181094 180412 179660 179465 180306 181918 183673
53058 183673 185268 186665 187680 188114 188123 188068 188082 188073 188081 188269 188628 188931 188956 188528 187519 186088 184828 184287 184350 184388
53038 184388 184015 183416 182906 182474 181876 181021 180137 179650 179885 180764 181830 182635 183035 183085 182868 182573 182541 182940 183554
53019 183554 184198 185158 186821 188903 190485 190954 190641 190425 190876 191830 192573 192399 191207 189676 188752 188885 189823
53002 189823 191002 191935 192344 192300 192285 192779 193610 193923 193000 190987 188728 187036 186249 186312 187010 188064 189163 190061
52984 190061 190727 191407 192476 194153 196377 198893 201376 203481 205034 206280 207756 209737 211881 213594 214641
52969 214641 215271 215852 216550 217232 217491 216923 215620 214265 213549 213580 214062 214816 215756 216472 216337 215168 213506 212049
52951 212049 210967 209844 208200 206021 203824 202168 201094 200130 198924 197630 196608 196019 195903 196302 196997
52936 196997 197451 197402 197163 196980 196440 195162 193716 193078 193308 193591 193572 193743 194349 194774 194446 193658 193011 192604 192273
52917 192273 192160 192484 193079 193608 193973 194112 193694 192470 190794 189412 188825 189075 189896 190851 191584 192144 192810 193420
52899 193420 193416 192842 192723 193824 195484 196399 196384 196553 197758 199545 200835 201047 200301 198986 197547 196460 196070
52882 196070 196361 196951 197387 197519 197605 197872 198034 197601 196788 196639 197819 199638 200871 201331 201960 203439 205406
52865 205406 207173 208532 209528 209971 209722 209143 208775 208652 208317 207511 206517 205717 205024 203957 202272 200364 198879
52848 198879 197931 196893 195085 192536 189869 187564 185567 183599 181580 179693 178250 177509 177486 177889 178347 178693
52832 178693 178870 178666 177836 176507 175121 173881 172539 170900 169253 168052 167386 167107 167327 168349 170011 171490
52816 171490 172058 171854 171661 172003 172737 173503 174225 175026 175907 176769 177575 178246 178588 178618 178786 179388 179822 179048 176932
52797 176932 174647 173418 173300 173521 173605 173633 173729 173874 174154 174631 175030 175025 174860 175169 176075 176923 177106 176779 176557 176824
52777 176824 177602 178724 179825 180343 179999 179316 179336 180573 182296 183059 182030 179778 177616 176235 175284 174311
52761 174311 173634 173822 174573 174765 173804 172445 172029 173089 174914 176325 176746 176626 176955 178288 180230 181950
52745 181950 183094 183968 184946 186076 187335 188823 190440 191762 192573 193294 194574 196534 198718 200631 202059
52730 202059 202890 202995 202394 201385 200399 199764 199550 199520 199250 198481 197373 196347 195706 195461 195444 195413 195081 194304 193308
52711 193308 192611 192533 192861 193036 192658 191751 190669 189869 189723 190311 191244 191815 191586 190888 190577 191175 192283 192992
52693 192992 192805 192062 191449 191284 191359 191360 191222 191046 190825 190388 189628 188668 187771 187163 187006 187402 188325 189546 190713
52674 190713 191506 191737 191424 190902 190682 191008 191599 192024 192204 192299 192265 191978 191785 192375 193905 195723 197204 198428
52656 198428 199688 200788 201329 201478 201875 202863 204154 205142 205250 204194 202337 200576 199435 198484 197167 195871
52640 195871 195478 195972 196383 196211 196071 196595 197499 198200 198739 199560 200814 202427 204458 206841 209009 210333 210799
52623 210799 210938 211234 211885 212822 213548 213308 211960 210382 209440 208729 207065 204219 201453 200113 200284 201146 202137
52606 202137 203236 204395 205222 205348 204866 204326 204254 204689 205147 205154 204765 204437 204377 204294 203873 203269 202937 203145 203894 205191
52586 205191 207061 209158 210640 210744 209497 207709 206205 205238 204715 204740 205550 206940 208098 208280 207520 206513
52570 206513 205912 205855 206059 206077 205479 204088 202261 200839 200577 201451 202596 203015 202373 201049 199534 198071 196912
52553 196912 196515 197066 197969 198303 197841 197304 197504 198605 200229 201851 202895 202957 202368 202213 203281 205099 206386
52536 206386 206369 205363 204196 203507 203568 204296 205257 205923 206127 206163 206418 207047 207930 208723 208983 208553 207935 208033 209377
52517 209377 211671 214113 216071 217449 218598 219899 221363 222681 223743 224954 226787 229205 231752 234140
52503 234140 236273 237727 237724 235932 232988 229987 227534 225440 223129 220227 216967 214151 212508 211906 211395
52488 211395 210191 208365 206412 204518 202665 201227 200872 201769 203309 204790 206081 207430 208914 210406 211935
52473 211935 213723 215747 217511 218513 218907 219528 221086 223386 225560 227081 228382 230228 232620 234685 235772
52458 235772 236319 237288 238857 240078 239927 238378 236205 233992 231662 228959 225966 223018 220346 218018 216118
52443 216118 214795 214126 214037 214358 214900 215489 215982 216293 216401 216334 216077 215479 214486 213604 213814 215527 217736 218793
52425 218793 218235 217300 217335 218264 219126 219586 220118 220932 221633 222063 222678 223841 225338 226965 229075 232138 236115
52408 236115 240671 245656 251001 256412 261553 266273 270308 273106 274379 274579 274254 273207 270939 267746 264618
52393 264618 261961 259263 256273 253687 252106 250945 249194 246953 245385 245170 245733 246195 246488 247141 248394
52378 248394 249944 251445 252929 254776 257441 261094 265399 269774 274027 278520 283480 288317 292091 294597
52364 294597 296575 298706 300787 302180 302769 303082 303593 304281 304926 305430 305698 305487 304734 304001 304239 305944 308668
52347 308668 311555 314303 317357 321161 325537 330042 334698 339965 346043 352642 359587 367298 376393 386990
52333 386990 398624 410777 423311 436531 450890 466493 482847 499434 516618 535467 556290
52322 556290 577826 598522 618327 638387 659155 679696 699056 717391 735253 752527 768796
52311 768796 784233 799311 813813 826946 838454 848975 859095 868533 876592 883127 888749 894083
52299 894083 898915 902154 902775 900872 897584 893888 889737 884601 878401 871379 863406 854224 844409 835279
52285 835279 827609 821103 815538 811736 810693 812136 814750 817785 821809 827809 836129 846457 858359 871387
52271 871387 884964 898611 912307 926348 940806 955263 969145 982189 994480 1006059 1016680
52260 1016680 1026107 1034569 1042613 1050360 1057099 1061945 1064873 1066806 1068590 1070060 1070268 1068396 1064238 1057938
52246 1057938 1049646 1039559 1028043 1015474 1002035 987845 973237 958653 944142 929210 913432
52235 913432 897239 881827 868184 856366 845830 836334 828215 821815 816911 812861 809232 806074 803627
52222 803627 801920 800782 800169 800257 801160 802659 804411 806357 808768 811833 815405 819221 823192 827303 831375
52207 831375 835169 838702 842250 845971 849645 852885 855536 857816 860112 862672 865512 868649 872317 876737
52193 876737 881654 886337 890262 893581 896684 899449 901284 901858 901426 900372 898813 896717 894060 890690 886285
52178 886285 880639 873847 866130 857793 849416 841788 835387 830152 825869 822499 819989 818194 817268 817663 819338
52163 819338 821351 822842 824132 826244 829450 832951 835997 838638 841226 843762 846022 847920 849499 850884
52149 850884 852394 854398 856904 859609 862424 865601 869297 873430 878077 883477 889411 895172 900516 906181
52135 906181 913053 921249 930551 941321 954336 969846 987418 1006591 1027178 1048951 1071592 1095090
52123 1095090 1119762 1145752 1172776 1200363 1228000 1255031 1280746 1304702 1326741 1346739 1364569
52112 1364569 1380255 1393852 1405197 1414044 1420385 1424254 1425344 1423283 1418378 1411625 1403858 1395344 1386332
52099 1386332 1377436 1369030 1360675 1351550 1341264 1329843 1317182 1303079 1287831 1272370 1257626 1243929
52087 1243929 1231071 1218715 1206667 1195028 1184353 1175612 1169766 1167194 1167523 1170080 1174488 1180778 1188974
52074 1188974 1198827 1210092 1222851 1237261 1253008 1269231 1285064 1300107 1314421 1328379 1342476
52063 1342476 1356933 1371207 1384125 1394755 1403032 1409411 1414040 1416546 1416581 1414330 1410394 1405250 1398871
52050 1398871 1390813 1380659 1368347 1354060 1337888 1319706 1299386 1277029 1253031 1228090 1203127
52039 1203127 1178909 1155610 1132844 1110329 1088469 1068159 1050065 1034103 1019562 1005717 992440
52028 992440 980266 969802 960997 953048 945014 936443 927462 918441 909652 901092 892514 883627 874275 864417
52014 864417 854097 843594 833415 823781 814158 803695 792180 780155 768002 755431 742143 728565
52002 728565 715478 703137 691195 679319 667517 655935 644756 634276 624769 616232 608483 601414
51990 601414 594870 588433 581697 574721 567827 560969 553738 545992 537972 529635 520437 510143 499474 489483
51976 489483 480475 472027 463901 456421 449937 444441 439970 436929 435619 435647 436240 437144 438867 441935 446198
51961 446198 451001 455693 459705 462390 463311 462716 461403 459938 458273 456176 453732 451133 448289 445056 441819
51946 441819 439458 438633 439308 441150 444187 448894 455619 464061 473411 482958 492564 502550 513254 524726
51932 524726 536685 548487 559115 567497 573066 575945 576632 575665 573615 570944 567487 562251 554125 542828
51918 542828 528988 513401 496590 479082 461724 445490 431083 418773 408441 399719 392269 386095
51906 386095 381466 378509 377016 376670 377297 378774 380823 383002 384803 385726 385478 384220 382409 380183 377059
51891 377059 372452 366449 359819 353369 347503 342337 337906 334177 331197 329306 328920 329872 331279 332403 333478
51876 333478 335344 338380 342230 346516 351204 356069 360320 363258 365056 366457 367822 368853 369084 368263 366351
51861 366351 363660 361058 359532 359358 360032 361141 362872 365451 368440 370966 372421 372732 372178 371252 370429 369666
51845 369666 368261 365510 361451 356687 351707 346747 342184 338509 335795 333582 331484 329627 328253 327140
51831 327140 325697 323602 321162 319024 317625 317006 317033 317589 318418 319003 318873 317974 316444 314136 310885 307328
51815 307328 304815 304024 304094 303674 302528 301541 301385 301936 302903 304248 305806 307129 307987 308548 308831 308463 307311
51798 307311 305899 304886 304416 304310 304509 304998 305536 305840 305807 305329 304209 302640 301434 301253 301802 302273 302432
51781 302432 302721 303405 304225 304984 305829 306808 307716 308711 310597 313957 318383 323042 327778 333034 338823 344478
51765 344478 349608 354609 359839 364784 368563 370973 372374 372775 371712 369040 365200 360428 354415 347180
51751 347180 339719 333191 327731 322631 317497 312624 308380 304869 302218 300580 299747 299314 299403 300671 303272
51736 303272 306369 309099 311609 314617 318213 321716 324674 327440 330566 333900 336541 337660 337275 336243
51722 336243 335481 335180 334787 333659 331653 329117 326614 324665 323477 322726 321804 320379 318561 316526 314290
51707 314290 312015 310152 309009 308425 308192 308593 310128 312843 316191 319509 322350 324492 325998 327200 328301
51692 328301 328985 328669 327161 324865 322386 320161 318411 317131 316101 315131 314275 313600 312852 311687 310218 308952
51676 308952 308155 307646 307352 307611 308678 310262 311935 313822 316487 320158 324407 328652 332682 336481 339811
51661 339811 342280 343870 345111 346551 348204 349685 350771 351524 351945 351889 351466 351158 351259 351410 350976 349729
51645 349729 347858 345449 342302 338250 333380 327965 322424 317330 313180 310075 307740 305828 304132 302714
51631 302714 302098 303027 305609 308810 311362 313100 314836 316830 318089 317567 315510 313085 311036 309182 307077
51616 307077 304606 301965 299463 297418 295930 294642 292952 290538 287647 284889 282821 281657 281259 281454 282404
51601 282404 284512 287907 292160 296702 301346 306262 311602 317344 323228 328569 332305 333681 332897 330812
51587 330812 328079 324882 321496 318585 316695 315769 315463 315779 317077 319548 323035 327495 333338 341020 350319
51572 350319 360346 370443 380797 391912 403708 415693 427987 441499 456767 473195 489898
51561 489898 506840 524461 542514 560124 576980 593660 610546 627088 642330 655481 665568
51550 665568 671205 671411 666438 657338 644984 629919 612789 594225 574411 553380 531814 511037
51538 511037 492116 475273 460239 446775 434782 424263 415401 408373 402953 398507 394519 390972 388105
51525 388105 385941 384111 382063 379442 376357 373171 369824 365608 359983 353504 347384 342147 337294 332415
51511 332415 327963 324484 321641 318683 315617 313233 311919 311040 309695 307689 305462 303343 301277 299326
51497 299326 298032 297928 298725 299372 299136 298353 297877 298155 299184 300984 303306 305057 305056 303583 302250 301869 301363
51480 301363 299424 296397 293638 291694 290211 289109 288528 287788 285769 282524 279344 276984 274885 272521 270331
51465 270331 268714 267175 265320 263872 263706 264486 265236 265840 266924 268536 269954 270832 271628 272799 274370 276431
51449 276431 279367 283306 287903 292958 298665 305011 311345 316939 321653 325809 329750 333791 338206 342823
51435 342823 346746 348923 349047 347768 346091 344753 344051 343933 344062 343942 343146 341531 339246 336579 333846 331413
51419 331413 329652 328654 327953 326743 324522 321481 318257 315438 313342 311990 311092 310241 309264 308236 307093
51404 307093 305575 303887 303031 303919 306224 308626 310193 311148 312220 313764 315685 317883 320503 323972 328907
51389 328907 335777 344520 354703 366125 379034 393725 410270 428823 449871 473824 500465 529003
51377 529003 558611 588771 619185 649373 678304 704399 726113 742577 753518 758637 757480 750015
51365 750015 736959 719244 697422 671912 643579 613761 583748 554410 526162 499062 473061
51354 473061 448414 425758 405622 387992 372566 359226 347935 338295 329635 321614 314484 308687
51342 308687 304405 301521 299728 298510 297137 294938 291723 287990 284642 282282 280687 279134 277335 275800
51328 275800 275101 275139 275511 276342 278124 280735 283197 284643 285090 285025 284701 284217 283927 284188 284845 285419 285789 286230
51310 286230 286758 286947 286571 285991 285547 284946 283693 282011 280769 280428 280441 279903 278542 276830 275321 274131 273000
51293 273000 271671 270196 269001 268595 269099 270133 271254 272422 273863 275639 277585 279568 281518 283279 284820
51278 284820 286631 289423 293229 297172 300392 302874 305058 306988 308381 309325 310262 311225 311703 311527 311387 312093
51262 312093 313566 314946 315515 315126 313881 311871 309351 306812 304639 302805 301020 299056 296890 294609 292288
51247 292288 289832 286966 283622 280317 277798 276108 274362 271890 269363 268200 268837 270092 270472 269695 268645
51232 268645 268213 268583 269406 270183 270522 270465 270613 271637 273540 275691 277588 279317 281131 282973 284611 286050
51216 286050 287482 288885 289939 290395 290425 290480 290840 291391 291921 292613 293963 296051 298117 299235 299449 299788 301043
51199 301043 302809 304016 304083 303275 302083 300761 299452 298372 297631 297054 296399 295672 295084 294752 294585 294494 294557 294924
51181 294924 295590 296346 296907 296991 296348 294876 292777 290498 288465 286948 286215 286584 288130 290453 292903 294995
51165 294995 296538 297585 298504 299877 301949 304236 306028 307290 308615 310301 311887 312768 312762 311865 309961 307205
51149 307205 304363 302202 300654 299004 296837 294452 292418 291090 290508 290365 290125 289502 288821 288506 288309 287653
51133 287653 286818 287038 288998 291804 294061 295532 297012 298843 300548 301980 303835 306535 309374 311519 313308
51118 313308 315645 318398 320386 320997 320914 320965 321112 321050 321020 321385 321914 322242 322664 323673 324969 325757 325955 326321
51100 326321 327338 328753 330275 331988 333786 335186 336039 336792 337624 337932 337160 335673 334354 333736 333955 335069
51084 335069 336854 338681 340145 341503 342988 344107 344313 344007 344089 344739 345468 346263 347739 349994 352226 353880
51068 353880 355549 358267 362358 367417 373062 379266 386175 393947 402655 412115 421943 431921 442154 452719
51054 452719 463315 473457 482866 491552 499654 507361 514840 522042 528591 533886 537316 538512 537600 535143
51040 535143 531606 526868 520518 512637 504020 495611 488006 481514 476216 471759 467353 462312 456468 450001
51026 450001 443162 436401 430465 425986 422997 421103 420074 420059 421254 423545 426590 430142 434252 439169 445003
51011 445003 451513 458255 464901 471402 477904 484609 491637 498900 506135 513188 520125 526906 533132 538442
50997 538442 543032 547414 551666 555304 557970 559879 561536 563349 565657 568800 572973 578251 584847 593031
50983 593031 602672 613231 624366 636257 649139 662902 677423 693018 710219 729329 750461 773851
50971 773851 799875 828896 861262 897270 937001 980401 1027628 1078963 1134188 1192437 1252935
50960 1252935 1315493 1379930 1445325 1510307 1573730 1634645 1691905 1744428 1791654 1833204 1868221
50949 1868221 1895769 1915917 1929857 1938773 1943039 1942639 1937868 1929391 1917973 1904399 1889420 1873553
50937 1873553 1857053 1840102 1822797 1804877 1785787 1765158 1743057 1719682 1694942 1668327 1639058
50926 1639058 1606445 1570414 1531658 1491010 1448730 1404695 1359242 1313336 1267860 1223138 1179297
50915 1179297 1136670 1095666 1056563 1019619 985093 953029 923294 895982 871397 849483 829733
50904 829733 811866 796160 782756 771054 760261 750220 741234 733351 726376 720405 715707 712062 708786
50891 708786 705516 702599 700538 699441 699166 699681 701048 703188 705831 708636 711412 714389 718241 723572 730368
50876 730368 738150 746602 755721 765396 775317 785516 796642 809409 824026 840445 858886 879712
50864 879712 902920 928183 955461 985298 1018457 1055482 1096705 1142445 1193114 1249280 1311751
50853 1311751 1381461 1459078 1544712 1638146 1739332 1848590 1966204 2091835 2224405 2362552
50843 2362552 2505018 2650422 2796776 2941502 3082061 3216248 3341779 3455891 3555822 3639638
50833 3639638 3706320 3755179 3785686 3798076 3793792 3775094 3744412 3704263 3657467 3606988 3555459
50822 3555459 3504995 3457243 3413230 3373085 3336159 3301536 3268226 3234804 3199135 3158762 3111609
50811 3111609 3056352 2992326 2919365 2837726 2748070 2651413 2549118 2442797 2334036 2224191
50801 2224191 2114636 2007226 1904250 1807615 1718141 1635867 1561037 1494452 1436733 1387541 1345803
50790 1345803 1310538 1281148 1257092 1237761 1222667 1211268 1202445 1194688 1187262 1180848 1176477 1173950
50778 1173950 1171734 1168352 1163438 1157418 1150694 1143397 1135514 1126912 1117292 1106384 1094176 1080892 1066822
50765 1066822 1052190 1037001 1021007 1004058 986586 969581 953961 940045 927606 916223 905605
50754 905605 895923 887971 882719 880479 880779 883207 888012 895544 905531 917488 931748 949482 971607
50741 971607 998080 1028435 1062563 1100709 1143032 1189513 1240165 1295021 1353963 1416780 1483350
50730 1483350 1553492 1626644 1701977 1778922 1857243 1936254 2014132 2088515 2157882 2221949 2280467
50719 2280467 2332043 2374654 2407023 2428863 2439846 2439228 2426898 2404231 2373401 2336289 2294597 2250620
50707 2250620 2207062 2166016 2128646 2095772 2068081 2045477 2026799 2010541 1995547 1980782 1964814
50696 1964814 1946031 1923234 1895705 1862758 1823616 1777937 1726375 1670543 1612357 1553339 1494570
50685 1494570 1437197 1382732 1332529 1287089 1246270 1210265 1179998 1156405 1139602 1128989 1123910
50674 1123910 1123921 1128634 1137608 1150332 1166125 1184159 1203861 1225178 1248127 1272093 1295827 1318197
50662 1318197 1338716 1357413 1374533 1390525 1405961 1421090 1435566 1448836 1460829 1472102 1483335
50651 1483335 1494905 1506991 1519856 1533807 1549022 1565659 1584127 1604912 1628050 1653057 1679565
50640 1679565 1707813 1738166 1770357 1803648 1837717 1872850 1909001 1945149 1979987 2012904 2043709
50629 2043709 2071527 2094741 2112378 2125127 2134444 2140711 2142556 2137938 2125660 2105859 2079608 2048544
50617 2048544 2014978 1981919 1952384 1928295 1909917 1896363 1886585 1879861 1875567 1872846 1870667 1867975
50605 1867975 1863552 1855948 1843915 1826998 1805351 1778909 1747011 1709078 1665430 1617211 1565761 1512433
50593 1512433 1458817 1406457 1356116 1307667 1260915 1216201 1174069 1134739 1098285 1064909 1034578
50582 1034578 1006631 980319 955746 933782 915032 899349 886393 876113 868411 862828 858935 856775
50570 856775 856571 858261 861633 866696 873528 881947 891743 903165 916670 932120 948728 966082 984867
50557 984867 1006151 1030035 1055369 1080895 1106367 1132332 1158996 1185749 1211974 1237965 1264593
50546 1264593 1292152 1320067 1347940 1376409 1406482 1438338 1471452 1505991 1543491 1585730 1633179
50535 1633179 1684952 1740166 1799009 1862492 1931424 2005771 2084781 2167523 2253331 2341887 2433016
50524 2433016 2526451 2621739 2718184 2814599 2909038 2998960 3081934 3156283 3220981 3274919 3316436
50513 3316436 3343714 3355617 3352050 3333586 3300919 3254846 3196708 3128630 3053209 2972976 2890302
50502 2890302 2807817 2728706 2656237 2592859 2539792 2497508 2466459 2447135 2439450 2442194 2453121 2469482
50490 2469482 2488552 2507870 2525193 2538241 2544379 2540638 2524274 2493646 2448721 2390676 2321054 2241465
50478 2241465 2154098 2062092 1968749 1876273 1785655 1697816 1614302 1536470 1464484 1397754 1336168
50467 1336168 1280227 1229965 1184454 1142712 1104667 1070892 1041650 1016510 994645 975246 957832
50456 957832 942496 929761 920005 913113 908811 907166 908496 912935 920244 929908 941163 953116 965140
50443 965140 977138 989253 1001473 1013741 1026154 1038610 1050332 1060255 1068048 1074382 1080106 1085494
50431 1085494 1090520 1095524 1101214 1108110 1116244 1125372 1135302 1146006 1157635 1170494 1184922 1201133 1219154
50418 1219154 1238940 1260604 1284626 1311839 1343138 1379120 1419895 1465029 1513505 1563863 1614742
50407 1614742 1665448 1715891 1765851 1814470 1860537 1903100 1941544 1975206 2003234 2024897 2039754
50396 2039754 2047290 2046547 2036476 2016757 1988124 1951750 1908487 1858961 1804376 1746964 1689477 1634271
50384 1634271 1582820 1535928 1494273 1458758 1430356 1409519 1395805 1388238 1385970 1388261 1393848 1400893
50372 1400893 1407894 1414231 1419298 1421470 1418583 1409415 1394073 1372957 1346189 1314344 1278946 1241588
50360 1241588 1202952 1163245 1123223 1084092 1046639 1011165 978248 948776 923025 900315 879918
50349 879918 861775 846022 832310 820166 809640 800993 793874 787411 781106 775019 768964 762129 753929
50336 753929 744947 736575 729801 724636 720574 717258 714648 712889 712216 712870 714906 718052 721814 725782 729855
50321 729855 734217 739035 744192 749359 754313 759029 763344 766750 768820 769874 770946 772931 775876 779134
50307 779134 782125 784895 788125 792698 799056 806721 814515 821564 828157 835464 844324 854528 865383 876825
50293 876825 889729 905153 923498 944310 966548 988825 1009744 1028528 1045454 1061428 1076999
50282 1076999 1091838 1104944 1114894 1119778 1117568 1107254 1089701 1067136 1041849 1015591 989888 966180
50270 966180 945369 927515 912190 898970 887580 877933 870237 864822 861726 860740 861950 865827 872486
50257 872486 881199 891056 901970 914588 929330 945875 963562 981860 1000367 1018680 1036498 1053660
50245 1053660 1069974 1085097 1098678 1110501 1120413 1128172 1133442 1135890 1135303 1131615 1124871 1115169 1102673
50232 1102673 1087621 1070235 1050687 1029354 1007102 985008 963691 943193 923532 904913 887132
50221 887132 869263 850464 830848 811015 790948 770130 748720 727903 708785 691486 675682
50210 675682 661568 649795 640648 633682 628045 622978 618161 613824 610456 608179 606479 604620 602212 599274
50196 599274 595989 592580 589212 585718 581578 576477 570806 565301 560219 555166 549794 544400 539622 535732
50182 535732 532423 529242 526006 522723 519318 515689 512034 508887 506661 505326 504645 504534 504999 505906 507167
50167 507167 508966 511403 513983 515988 517413 519051 521555 524944 529236 534841 541861 549463 556656 563382
50153 563382 570334 577923 586137 595177 605430 616718 628347 640177 653030 667642 683770 700790
50141 700790 718774 738377 759963 783409 808736 836347 866454 898643 932144 966332 1000806
50130 1000806 1035289 1069641 1103732 1136967 1168051 1195645 1219374 1239856 1257438 1271105 1278982
50119 1278982 1279904 1274070 1262133 1244230 1220386 1191547 1159505 1125686 1090542 1054451 1018800 985634
50107 985634 956243 930409 907038 885236 864737 845626 828042 812156 798193 786245 775971
50096 775971 766554 757107 747306 737765 729738 724278 721511 720667 720885 722029 724659 729176 735070 741101 746128
50081 746128 749696 751917 753058 753349 752997 752203 751160 750097 749213 748377 746905 743915 739081 733034 726830
50066 726830 721015 715317 709257 702908 696900 691803 687714 684378 681540 679130 677354 676714 677666 679996 682705
50051 682705 684799 686293 688219 691614 696682 702917 709732 716781 723843 730731 737382 743922 750565 757458
50037 757458 764582 771726 778561 784831 790571 796131 801872 807683 812841 816588 819103 821723 825871 831709
50023 831709 838187 844479 851007 858820 868346 879183 890832 903073 915683 928370 941152 954283
50011 954283 967518 979874 990487 999360 1006946 1013336 1018399 1022369 1025536 1027323 1026440 1022171 1014924 1005146
49997 1005146 992315 975608 955268 932732 909503 886359 863510 840908 818320 795631 773284
49986 773284 752120 732547 714142 696230 678578 661381 644876 629245 614671 601182 588535
49975 588535 576558 565566 556194 548793 543092 538402 534005 529392 524426 519414 514957 511545 509171 507296
49961 507296 505318 503172 501426 500633 500693 501116 501840 503426 506298 510192 514628 519615 525476 532144 539068
49946 539068 545805 552324 558657 564564 569641 573522 575908 576657 575997 574485 572577 570280 567209 562879 556900
49931 556900 549148 539883 529744 519514 509921 501512 494484 488553 483177 478061 473413 469738 467427 466564
49917 466564 466937 468187 470050 472488 475524 478978 482541 486109 489819 493733 497730 501836 506455 512018
49903 512018 518502 525411 532179 538569 544814 551394 558480 565448 571212 575264 578170 580777 583087 584279
49889 584279 583732 581587 578219 573607 567577 560443 552987 545729 538484 530780 522611 514534 507010 499843
49875 499843 492495 484960 478023 472541 468590 465536 462872 460803 459919 460459 461995 463821 465614 467683 470574
49860 470574 474521 479423 485297 492401 500719 509615 518323 526673 534992 543401 551593 559309 566527 573008
49846 573008 578064 581112 582229 581901 580429 577865 574310 569955 564917 559309 553380 547280 540807 533797
49832 533797 526725 520527 515737 512176 509548 507930 507478 507963 508901 509971 511075 512176 513368 514980 517412
49817 517412 520942 525742 531801 538603 545176 550847 555831 560704 565445 569452 572450 574806 576829 578253
49803 578253 578716 578321 577341 575588 572528 568034 562692 557344 552490 548088 543682 538663 532603 525554 518063
49788 518063 510887 504596 499320 494805 490712 486886 483304 479967 477036 474982 474212 474478 475034 475565 476567
49773 476567 478463 480764 482677 484392 487079 491448 496881 502249 507119 511701 515915 519215 521431 523262
49759 523262 525484 527913 529544 529764 529025 528097 526978 524925 521464 516876 511638 505928 500015 494705 490829
49744 490829 488343 486401 484343 482193 480170 478180 476075 474121 472876 472714 473625 475331 477407 479462 481471
49729 481471 483867 487104 491111 495326 499289 503066 507134 512019 518118 525615 534331 543609 552525 560362
49715 560362 566946 572491 577213 581133 584086 585721 585552 583322 579382 574495 569180 563530 557759 552513
49701 552513 548319 545084 542530 540827 540239 540316 540059 538916 537059 534698 531793 528645 526092 524738 524440
49686 524440 524917 526407 529317 533648 539269 546424 555325 565430 575747 585863 596212 607253 618797
49673 618797 630203 640878 650436 658615 665172 669802 672277 672799 672063 670797 669393 668181 667672 668032 668538
49658 668538 668136 666543 664278 661600 657920 652338 644333 633890 621554 608540 596270 585470 576068
49645 576068 568078 561977 557871 554831 551664 548067 544612 541917 540338 540120 541116 542381 542686 541597 539728
49630 539728 537865 536249 534651 532648 529672 525292 519812 514283 509643 505993 502944 500429 498787 498191
49616 498191 498317 498644 498801 498613 498054 497415 497288 498138 499866 501922 503909 505891 508111 510546 512915 514974
49600 514974 516657 518055 519405 521020 522954 524804 526107 526941 527778 528727 529327 529273 528961 529033 529698 530776 532137
49583 532137 533684 535114 536133 536780 537208 537314 537069 537102 538357 541064 544512 548005 551633 555957 561284 567476
49567 567476 574159 580903 587471 594087 601147 608501 615289 620696 624578 627165 628543 628743 627986 626453 624050
49552 624050 620841 617472 614705 612653 610998 609836 609731 610792 612231 613088 613130 612857 612932 613801 615601 618141
49536 618141 621093 624335 628077 632611 638131 644868 653117 662894 673683 684759 695812 707151 719309
49523 719309 732476 746251 759898 772807 784609 794847 802894 808565 812617 816143 819473 822207 824440
49510 824440 827237 831430 836498 841293 845448 849246 852155 852429 848549 840512 829430 816330 801789 786312
49496 786312 770497 754919 740181 726968 715658 705923 697055 688688 680931 673904 667569 662034 657608
49483 657608 654365 651982 650198 649137 648922 649242 649597 649818 650002 650089 649884 649499 649411 650012 651326 653205 655454
49466 655454 657685 659410 660522 661476 662722 664122 665187 665824 666532 667821 669602 671257 672181 672204 671501 670194
49450 670194 668151 665226 661615 657790 654097 650622 647431 644655 642312 640373 639177 639423 641481 645014
49436 645014 649646 655669 663559 672966 682853 692717 703124 714896 728248 743040 759396 777545 797090
49423 797090 816859 835657 853171 870072 887130 904079 919423 931439 939214 942482 940902 934301
49411 934301 923768 911785 900811 892058 885851 882649 883066 887136 894127 903117 913495 925022 937702
49398 937702 951509 966000 980317 993785 1006288 1017781 1027817 1036001 1042676 1048508 1053418 1056516
49386 1056516 1057192 1055739 1052725 1048220 1041969 1034049 1025043 1015658 1006354 997290 988570 980546 973776 968487
49372 968487 964248 960529 957548 956130 956627 958314 959975 960764 960411 959036 957084 955131 953349 951202 947946
49357 947946 943307 937514 930827 923363 915385 907524 900610 895262 891582 889124 887196 885319 883465 881918
49343 881918 880951 880564 880341 879580 877747 874922 871721 868722 866136 863997 862439 861523 860911 859955 858255 856196
49327 856196 854891 855433 858068 862179 867116 872880 879857 888129 897389 907347 917756 928087 937740 946686
49313 946686 955396 963841 970935 975267 976184 973958 969163 962276 953723 944053 933981 924276 915430 907424
49299 907424 900032 893328 887577 882631 878016 873814 870932 870077 870831 872108 873118 873455 872704 870719 868111
49284 868111 865779 863899 861913 859471 856831 854393 852424 851360 851731 853504 855987 858678 861799 865680
49270 865680 869974 873861 876764 878508 879026 878384 877046 875670 874544 873447 872122 870611 869084 867637 866492
49255 866492 866236 867507 870428 874550 879333 884427 889337 893221 895459 896278 896305 895534 893229 888990 883357
49240 883357 877033 870090 862494 855020 848872 844457 841242 838869 837741 838212 839830 841829 844057 846963
49226 846963 850822 855397 860276 865199 870018 874674 879373 884602 890757 897711 904858 911646 918059 924522
49212 924522 931320 938264 945017 951673 958858 967250 977033 987800 998954 1010274 1022112 1034932 1048582
49199 1048582 1062236 1075126 1087221 1099060 1111141 1123638 1136431 1149064 1160860 1171435 1181077
49188 1181077 1190325 1199285 1207727 1215756 1223960 1232835 1242498 1252964 1264357 1276762 1290288 1305428 1322899
49175 1322899 1342907 1364845 1387925 1411816 1436543 1462097 1488337 1514885 1540809 1564659 1585154
49164 1585154 1601692 1614115 1622363 1626789 1628495 1628902 1628983 1629177 1629896 1631705 1635005 1639819 1645906 1652885 1660342
49149 1660342 1668107 1676385 1685380 1694857 1704384 1714034 1724521 1736486 1749822 1763804 1777732 1791379
49137 1791379 1804974 1818937 1833603 1849058 1865159 1881679 1898440 1915376 1932485 1949689 1966765
49126 1966765 1983522 2000069 2016736 2033723 2050951 2068316 2085919 2104021 2123140 2144379 2169344
49115 2169344 2199349 2234788 2275597 2322201 2375580 2436494 2505220 2582359 2669422 2767820 2876715
49104 2876715 2991738 3106040 3213173 3309671 3395399 3471568 3538202 3592899 3631114 3647285 3636529
49093 3636529 3596938 3531594 3448300 3356284 3261872 3166480 3068435 2966842 2864089 2765116 2674654
49082 2674654 2595133 2526636 2468094 2418250 2375969 2340302 2310470 2285655 2264863 2247163 2231929
49071 2231929 2218586 2206153 2193472 2180070 2166553 2153947 2142755 2132759 2123496 2114694 2106411 2098976
49059 2098976 2092716 2087502 2082590 2077215 2071354 2065715 2060936 2057059 2053917 2051711 2050885 2051464 2052885 2054506
49045 2054506 2056076 2057617 2059144 2060730 2062625 2064978 2067438 2069329 2070292 2070528 2070318 2069534 2067804 2065007 2061377
49030 2061377 2057258 2053031 2049199 2046174 2043779 2041237 2037986 2034375 2031240 2028802 2026424 2023693 2021297 2020323
49016 2020323 2020814 2021682 2022170 2022859 2024841 2028315 2032525 2036821 2041200 2045869 2050837 2056086 2061720 2067729 2073851
49001 2073851 2079694 2084755 2088440 2090538 2091719 2092939 2094153 2094181 2092154 2088535 2084265 2079539 2074103 2068342
48987 2068342 2063103 2058476 2053618 2047981 2042065 2036686 2032096 2028202 2025151 2023158 2021976 2020982 2019722 2018102
48973 2018102 2016154 2013952 2011715 2009691 2007851 2005914 2003775 2001769 2000338 1999471 1998640 1997449 1996293 1996144 1997581
48958 1997581 2000267 2003597 2007616 2012910 2019755 2027904 2037333 2048525 2061654 2075955 2090484 2105294 2121291
48945 2121291 2138970 2157892 2177518 2198037 2220030 2243659 2268552 2294335 2321018 2348979 2378812
48934 2378812 2410994 2445440 2481468 2518529 2556882 2597172 2639470 2683173 2727913 2773899 2821086
48923 2821086 2868550 2915332 2961635 3008513 3056359 3104341 3151463 3197623 3243224 3288126 3331490
48912 3331490 3372568 3411243 3447782 3482374 3515025 3545754 3574728 3602239 3628521 3653552 3677067
48901 3677067 3698839 3718935 3737563 3754619 3769569 3781930 3791866 3800102 3807104 3812463 3815365 3815610 3813776
48888 3813776 3810273 3804647 3796226 3785057 3771646 3755958 3737431 3716068 3692790 3668298 3642150 3613440
48876 3613440 3582068 3548861 3514649 3479632 3443431 3405345 3364724 3321614 3277079 3232561 3188910
48865 3188910 3146221 3104380 3063380 3023214 2983990 2946239 2910670 2877510 2846389 2817023 2789731
48854 2789731 2765140 2743632 2725191 2709549 2696302 2685075 2675763 2668588 2663891 2661853 2662366 2665049 2669430
48841 2669430 2675257 2682575 2691423 2701655 2713233 2726444 2741428 2757653 2774282 2791032 2808232 2825970
48829 2825970 2843697 2860820 2877292 2893431 2909479 2925539 2941648 2957675 2973392 2988846 3004371
48818 3004371 3020101 3035721 3050980 3066121 3081506 3097064 3112424 3127438 3142250 3157047 3172007
48807 3172007 3187449 3203674 3220707 3238408 3256741 3275632 3294703 3313491 3331941 3350341 3368757
48796 3368757 3386863 3404406 3421496 3438202 3454154 3468807 3481970 3493764 3504127 3512603 3518707 3522297
48784 3522297 3523539 3522674 3519898 3515276 3508517 3498886 3485552 3468137 3446838 3422137 3394565 3364703 3333042
48771 3333042 3299640 3264231 3226958 3188722 3150444 3112161 3073296 3033737 2994177 2955336 2917425
48760 2917425 2880588 2845350 2812163 2780799 2750699 2721875 2695033 2670768 2648945 2629008 2610619
48749 2610619 2593866 2578981 2566064 2555026 2545674 2537851 2531578 2527077 2524553 2523868 2524532 2526118 2528656
48736 2528656 2532383 2537069 2541833 2545828 2548917 2551499 2553895 2556255 2558876 2562108 2565868 2569637 2573053 2576202
48722 2576202 2579170 2581608 2582985 2583081 2582116 2580519 2578670 2576694 2574461 2571967 2569695 2568258 2567650 2567296 2566957
48707 2566957 2567115 2568165 2569671 2570850 2571498 2571975 2572529 2573133 2573910 2575200 2577189 2579783 2582766 2585800 2588365
48692 2588365 2590192 2591673 2593464 2595681 2597962 2600255 2602970 2606208 2609449 2612356 2615400 2619227 2623706 2628111
48678 2628111 2632079 2636026 2640657 2646390 2653141 2660213 2666459 2671020 2674126 2676867 2679927 2682663 2683532 2681143
48664 2681143 2674750 2663939 2648260 2627261 2600730 2568939 2532765 2493515 2452465 2410516 2368370
48653 2368370 2326888 2287032 2249417 2214118 2180978 2149949 2121141 2094739 2070894 2049467 2029796
48642 2029796 2011008 1992695 1975100 1958507 1942730 1927339 1912057 1896757 1881391 1866226 1851825
48631 1851825 1838387 1825369 1812233 1799227 1786907 1775159 1763433 1751832 1741213 1732105 1724246 1717322
$$ [...]
##END NTUPLES=NMR SPECTRUM
##END=
