##TITLE=AC1767_ROS_6_9683651_yFpQTs1wg7
##JCAMPDX= 6.0         $$ Bruker NMR JCAMP-DX V2.0
##DATA TYPE= NMR SPECTRUM
##DATA CLASS= NTUPLES
##ORIGIN= BRUKER
##OWNER= Administrator
$$ 1.72 TOPSPIN		Version 2.1
$$ 2016-04-16 18:21:44.376 -0700  Administrator@X
$$ Compression mode = diff/dup
##.OBSERVE FREQUENCY= 400.02188249412
##.OBSERVE NUCLEUS= ^1H
##.ACQUISITION MODE= SIMULTANEOUS (DQD)
##.ACQUISITION SCHEME= undefined
##.AVERAGES= 64
##.DIGITISER RES= 22
##SPECTROMETER/DATA SYSTEM= spect
##.PULSE SEQUENCE= noesygpps1d.comp
##.SOLVENT NAME= COFFEE_meoh
##.SHIFT REFERENCE= INTERNAL, COFFEE_meoh, 1, 14.96119
##AUDIT TRAIL= $$ (NUMBER, WHEN, WHO, WHERE, PROCESS, VERSION, WHAT)
$$ ##TITLE= Audit trail, TOPSPIN		Version 2.1
$$ ##JCAMPDX= 5.01
$$ ##ORIGIN= Bruker BioSpin GmbH
$$ ##OWNER= Administrator
$$ $$ E:\/data/COFFEE/nmr/AC1767_ROS_6_9683651_yFpQTs1wg7/12/pdata/1/auditp.txt
$$ ##AUDIT TRAIL=  $$ (NUMBER, WHEN, WHO, WHERE, PROCESS, VERSION, WHAT)
(   1,<2016-04-16 18:21:39.189 -0700>,<Administrator>,<X>,<go>,<TOPSPIN 2.1>,
      <created by zg
	started at 2016-04-16 18:10:09.564 -0700,
	POWCHK enabled, PULCHK disabled,
       configuration hash MD5:
       21 0F 79 D6 B3 7B B4 F6 88 20 88 DB 03 48 BD 9F
       data hash MD5: 64K
       CF 1C 79 99 82 2F 03 81 15 E4 BF 36 95 0F BE CA>)
(   2,<2016-04-16 18:21:42.329 -0700>,<Administrator>,<X>,<proc1d>,<TOPSPIN 2.1>,
      <Start of raw data processing
       efp LB = 0.3 FT_mod = 6 PKNL = 1 PHC0 = 0 PHC1 = 0 SI = 128K 
       data hash MD5: 128K
       EB F7 F0 40 6B E8 0A 04 1C 1D 1C 75 3C B9 C0 E0>)
(   3,<2016-04-16 18:21:43.189 -0700>,<Administrator>,<X>,<proc1d>,<TOPSPIN 2.1>,
      <pk PHC0 = 269.9451 PHC1 = 0 
       data hash MD5: 128K
       20 19 6E B5 2B 6C 68 30 A6 6E EC B3 FA F8 2B 9D>)
(   4,<2016-04-16 18:21:43.579 -0700>,<Administrator>,<X>,<proc1d>,<TOPSPIN 2.1>,
      <abs ABSG = 1 
       data hash MD5: 128K
       71 1D 22 95 7B F0 5A B3 54 94 DF 28 E4 49 BF 55>)
(   5,<2016-04-16 18:21:43.673 -0700>,<Administrator>,<X>,<proc1d>,<TOPSPIN 2.1>,
      <abs ABSG = 2 
       data hash MD5: 128K
       EC DE 90 8B 47 C4 92 63 A0 57 1A 98 01 DA CC 11>)
(   6,<2016-04-16 18:21:43.751 -0700>,<Administrator>,<X>,<proc1d>,<TOPSPIN 2.1>,
      <abs ABSG = 3 
       data hash MD5: 128K
       39 87 93 1A EE FF C3 C8 0B 21 6C 0B 1F 1C 5D 05>)
(   7,<2016-04-16 18:21:43.861 -0700>,<Administrator>,<X>,<proc1d>,<TOPSPIN 2.1>,
      <abs ABSG = 4 
       data hash MD5: 128K
       94 10 93 20 70 23 EC FC F1 2C F8 54 73 6A 94 82>)
(   8,<2016-04-16 18:21:43.939 -0700>,<Administrator>,<X>,<proc1d>,<TOPSPIN 2.1>,
      <abs ABSG = 5 
       data hash MD5: 128K
       A2 CD CE BC 65 F1 49 FB CE E4 7E 8A 13 CB 8B D8>)
$$ ##END=
$$ 
$$ $$ hash MD5
$$ $$ 12 03 AE 4F 5A CE 9B 75 C3 F1 20 B6 D9 D3 E9 85
##$RELAX= 
##$RELAX= 
##$RELAX= 
##$RELAX= 
##$RELAX= 
##$RELAX= 
##$RELAX= 
##$RELAX= 
$$ Bruker specific parameters
$$ --------------------------
##$DU= <E:\>
##$EXPNO= 12
$$ [...]
##$TP07= 0
##$TPNAME0= <>
##$TPNAME1= <>
##$TPNAME2= <>
##$TPNAME3= <>
##$TPNAME4= <>
##$TPNAME5= <>
##$TPNAME6= <>
##$TPNAME7= <>
##$TPOAL= (0..7)
0.5 0.5 0.5 0.5 0.5 0.5 0.5 0.5
##$TPOFFS= (0..7)
0 0 0 0 0 0 0 0
##$TUNHIN= 0
##$TUNHOUT= 0
##$TUNXOUT= 0
##$USERA1= <user>
##$USERA2= <user>
##$USERA3= <user>
##$USERA4= <user>
##$USERA5= <user>
##$V9= 5
##$VALIST= <valist>
##$VCLIST= <CCCCCCCCCCCCCCC>
##$VD= 0
##$VDLIST= <DDDDDDDDDDDDDDD>
##$VPLIST= <PPPPPPPPPPPPPPP>
##$VTLIST= <TTTTTTTTTTTTTTT>
##$WBST= 2048
##$WBSW= 25
##$XGAIN= (0..3)
0 0 0 0
##$XL= 0
##$YL= 0
##$YMAX_a= 5463965
##$YMIN_a= -10475526
##$ZGOPTNS= <>
##$ZL1= 120
##$ZL2= 120
##$ZL3= 120
##$ZL4= 120
##$ABSF1= 14.96119
##$ABSF2= -5.596992
##$ABSG= 5
##$ABSL= 3
##$ALPHA= 0
##$AQORDER= 0
##$ASSFAC= 0
##$ASSFACI= 0
##$ASSFACX= 0
##$ASSWID= 0
##$AUNMP= <proc_prof1d_extract.lims>
##$AXLEFT= 0
##$AXNAME= <>
##$AXNUC= <1H>
##$AXRIGHT= 0
##$AXTYPE= 0
##$AXUNIT= <>
##$AZFE= 0.1
##$AZFW= 0.1
##$BCFW= 0
##$BC_mod= 0
##$BYTORDP= 0
##$COROFFS= 0
##$CY= 15
##$DATMOD= 1
##$DC= 0
##$DFILT= <>
##$DTYPP= 0
##$F1P= 0
##$F2P= 0
##$FCOR= 0.5
##$FTSIZE= 131072
##$FT_mod= 6
##$GAMMA= 0
##$GB= 0
##$INTBC= 1
##$INTSCL= 1
##$ISEN= 128
##$LB= 0.3
##$LEV0= 0
##$LPBIN= 0
##$MAXI= 10000
##$MC2= 0
##$MEAN= 0
##$ME_mod= 0
##$MI= 0
##$NCOEF= 0
##$NC_proc= -2
##$NLEV= 6
##$NOISF1= 0
##$NOISF2= 0
##$NSP= 0
##$NTH_PI= 0
##$NZP= 0
##$OFFSET= 14.96119
##$PC= 1
##$PHC0= 269.9451
##$PHC1= 0
##$PH_mod= 1
##$PKNL= yes
##$PPARMOD= 0
##$PPDIAG= 0
##$PPIPTYP= 0
##$PPMPNUM= 2147483647
##$PPRESOL= 1
##$PSCAL= 4
##$PSIGN= 0
##$PYNMP= <proc.py>
##$REVERSE= no
##$SF= 400.020009561738
##$SI= 131072
##$SIGF1= 0
##$SIGF2= 0
##$SINO= 400
##$SIOLD= 131072
##$SPECTYP= <>
##$SREGLST= <1H.CDCl3>
##$SSB= 0
##$STSI= 131072
##$STSR= 0
##$SW_p= 8223.68421052631
##$SYMM= 0
##$S_DEV= 0
##$TDeff= 65536
##$TDoff= 0
##$TI= <>
##$TILT= no
##$TM1= 0
##$TM2= 0
##$TOPLEV= 0
##$USERP1= <user>
##$USERP2= <user>
##$USERP3= <user>
##$USERP4= <user>
##$USERP5= <user>
##$WDW= 1
##$XDIM= 131072
##$YMAX_p= 369141774
##$YMIN_p= -11996
##$CURPLOT= <Network HP LaserJet P1505>
##$CURPRIN= <$Network HP LaserJet P1505>
##$DFORMAT= <normdp>
##$LAYOUT= <+/1D_H.xwp>
##$LFORMAT= <normlp>
##$PFORMAT= <normpl>
##$SURQMSG= 1
$$ End of Bruker specific parameters
$$ ---------------------------------
##NTUPLES= NMR SPECTRUM
##VAR_NAME=  FREQUENCY,     SPECTRUM/REAL,   SPECTRUM/IMAG
##SYMBOL=    X,             R,               I
##VAR_TYPE=  INDEPENDENT,   DEPENDENT,       DEPENDENT
##VAR_FORM=  AFFN,          ASDF,            ASDF
##VAR_DIM=   131072,        131072,          131072
##UNITS=     HZ,            ARBITRARY UNITS, ARBITRARY UNITS
##FACTOR=    0.0627417313425164, 1,          1
##FIRST=     8223.62146879497, 3150,         -53654
##LAST=      0,             4336,            -53394
##MIN=       0,             -11996,          0
##MAX=       8223.62146879497, 369141774,    0
$$ Real data points
##PAGE= N=1
##DATA TABLE= (X++(R..R)), XYDATA
$$ [...]
61705D96165l201m052m130l557l022l046l346l259k687k179k134k318k377k385
61691D54472k663l275l933m221l900l200k776l066l640l594k727j801j542j809
61677D12325k049k057j913j602j115p27o53p20o75o09o62n82j4R16J709K113K264
61660D05949K367K552K965L592M142M349M330M293M123L613K976K643K523K014
61646D52431Q49m37j126j155j132j471j762j172M71K199K890K549K245K743L750
61631D61872M594M952M617L306J231o71j841k905m670o739p989q140p863p539
61617D32215o903n977n323n121m892m423m142m239m204l712l238l207l252k938
61603C70644k674l062l751l740k752j582j035j156j613k261l029l598l572k931
$$ plain form
61705 496165 492964 488912 484782 481225 478203 475157 471811 468552 465865 463686 461552 459234 456857 454472
61691 454472 451809 448534 444601 440380 436480 433280 430504 427438 423798 420204 417477 415676 414134 412325
61677 412325 410276 408219 406306 404704 403589 402862 402209 401489 400814 400205 399543 398961 398947 399863 401572 403685 405949
61660 405949 408316 410868 413833 417425 421567 425916 430246 434539 438662 442275 445251 447894 450417 452431
61646 452431 453280 452843 451717 450562 449430 447959 446197 445025 445496 447695 450585 453134 455379 458122 461872
61631 461872 466466 471418 476035 479341 480572 479901 478060 475155 470485 463746 455757 447617 439754 432215
61617 432215 425312 419335 414012 408891 403999 399576 395434 391195 386991 383279 380041 376834 373582 370644
61603 370644 367970 364908 361157 357417 354665 353083 352048 350892 349279 347018 343989 340391 336819 333888
61589C33888k131j705j798k101k207j958j456r16n97o78r32p52J52J209J542J032
61573C20592L72J02J66M12Q81J357J320P06J85K68O25P71Q47J172J492J354R48
61556C33570Q36J043J119R83J014J265J259O93j14o07n17O5P33R36N14K0Q8N81
61538C43481Q61Q26R89J494J830J750J808K465L229L208K221R20j9m13m22k15
61522C64013J20M85O17J84p57j525j460p11j8K39K58J15l93j114j455j180o75
61505C56743j25P31J696J880J003J18K22R05J271J504K295L281L456K899K758
61490C80637L375L745L202K396K173K390K398J964J274P06Q92K249M056M894M391
61475D20742L644L454L146J936M33l01m78j146k385l154k892k223j912j926j820
$$ plain form
61589 333888 331757 330052 328254 326153 323946 321988 320532 319616 319019 318341 317409 316657 316809 318018 319560 320592
61573 320592 320964 321066 321232 321644 322525 323882 325202 325908 326093 326361 326986 327757 328604 329776 331268 332622 333570
61556 333570 334406 335449 336568 337551 338565 339830 341089 341782 341668 341061 340544 340609 341342 342278 342792 342812 342900 343481
61538 343481 344342 345168 346157 347651 349481 351231 353039 355504 358733 361941 364162 365082 365063 364650 364228 364013
61522 364013 364133 364618 365235 365419 364662 363137 361677 360966 360948 361187 361445 361560 361167 360053 358598 357418 356743
61505 356743 356618 357349 359045 360925 361928 362046 362268 363173 364444 365948 368243 371524 374980 377879 380637
61490 380637 384012 387757 390959 393355 395528 397918 400316 402280 403554 404260 405152 407401 411457 416351 420742
61475 420742 424386 427840 430986 432922 433355 433054 432576 431430 429045 425891 422999 420776 418864 416938 415118
61460D15118j495j299j617k387k895k396j113j78j54k40M51J415J520Q02M05Q70
61444D06807J595K110K800L961M988M987L742J811Q5o09jJ278K232K478K316J986
61428D42566J479J010R11J010Q23M66N70J165J547J445J469J966K343K080J602
61413D62452J512J563J141K05q91k051l236m004l927l227k485k024j939k277k689
61398D38123k479j531p60r66j759k316k629l078l277k490j017p6j73o29p93p75
61382D13375p22l25M93J207J450J578K005K545K869L097L416L583L345L031L089
61367D44036L263K860J770P02K80L85N39O07Q30J303J731J800J617J657K210L023
61351D68613L653M065M650N558O288O185N244M091L226K571J946J534J528J524
$$ plain form
61460 415118 413623 412324 410707 408320 405425 403029 401916 401738 401584 401344 401795 403210 404730 405532 405937 406807
61444 406807 408402 410512 413312 417273 422261 427248 430990 432801 432886 432277 432276 433554 435786 438264 440580 442566
61428 442566 444045 445055 445966 446976 447799 448265 448835 450000 451547 452992 454461 456427 458770 460850 462452
61413 462452 463964 465527 466668 466873 465982 463931 460695 456691 452764 449537 447052 445028 443089 440812 438123
61398 438123 435644 434113 433353 432387 430628 428312 425683 422605 419328 416838 415821 415745 415572 414943 414150 413375
61382 413375 412653 412328 412821 414028 415478 417056 419061 421606 424475 427572 430988 434571 437916 440947 444036
61367 444036 447299 450159 451929 452631 452911 453296 453835 454442 455272 456575 458306 460106 461723 463380 465590 468613
61351 468613 472266 476331 480981 486539 492827 499012 504256 508347 511573 514144 516090 517624 519152 520676
61337E20676R01j75p47l79J32j50j016j584j690j903k318k355j946j919k697l438
61321D99392l136j953p80L2Q09J771K838M004N218O089O342O475P310Q917J0479
61306E53807J1299J1445J1411J1543J1810J1810J0971R080O500L704Q55j821l713
61293F48701m464m669n268o432p667q731r655j0091r604q674q349q690q501p009
61279E40897m976l624l165k923k394j548n62K46N34M41O60J575K741L567M149
61264E35618M843N433N405M809M321M460N219O293P228P482O809N626M592L874
61250F12012L134K138J017j4q09j228j204q81l80L78J299J818J474O51J66J12
61234F19683j98j054j766j567n45P17J829K586K793K735L284M771O141O180N348
$$ plain form
61337 520676 521577 521402 520655 520276 520408 520258 519242 517658 515968 514065 511747 509392 507446 505527 502830 499392
61321 499392 496256 494303 493523 493555 494364 496135 498973 502977 508195 514284 520626 527101 534411 543328 553807
61306 553807 565106 576551 587962 599505 611315 623125 634096 643176 649676 653380 654235 652414 648701
61293 648701 644237 639568 634300 627868 620201 611470 601815 591724 582120 573446 565097 556407 547906 540897
61279 540897 535921 532297 529132 526209 523815 522267 521705 521951 522485 522926 523586 525161 527902 531469 535618
61264 535618 540461 545894 551299 556108 560429 564889 570108 576401 583629 591111 597920 603546 608138 612012
61250 612012 615146 617284 618301 618287 617478 616250 615046 614165 613785 614163 615462 617280 618754 619405 619571 619683
61234 619683 619485 618431 616665 615098 614553 615270 617099 619685 622478 625213 628497 633268 639409 645589 650937
61219F50937N312O470P237O313M600L849M253M599M370M249M579M712M280L946
61205G19706M206M413L819K957L006M266O006P608R029J0331J1459J2506J3568
61192H12880J4400J4675J4427J3773J2458J0345Q099O532N404L800J654p3r04
61179I17470j517k510l479l937m280n042n869o094n898o024o590o996o928o685
61165H45621o518o284n846n259m439l202j705m30M87J508L014M780O366P742R245
61150H45080J1020J2820J4277J5236J5816J6188J6289J5774J4423J2543J0846
61139A000312R836R569R930J0861J2128J3259J4020J4743J5751J6637J6668J5879
61127A159593J5162J5101J5273J5107J4834J4941J5096J4528J3292J2300J1921
$$ plain form
61219 650937 656249 662719 669956 676269 680869 684718 688971 693570 697940 702189 706768 711480 715760 719706
61205 719706 723912 728325 732144 735101 738107 742373 748379 755987 765016 775347 786806 799312 812880
61192 812880 827280 841955 856382 870155 882613 892958 901057 907589 912993 916793 918447 918374 917470
61179 917470 915953 913443 909964 906027 901747 896705 890836 884742 878844 872820 866230 859234 852306 845621
61165 845621 839103 832819 826973 821714 817275 814073 812368 811938 812425 813933 816947 821727 828093 835835 845080
61150 845080 856100 868920 883197 898433 914249 930437 946726 962500 976923 989466 1000312
61139 1000312 1010148 1019717 1029647 1040508 1052636 1065895 1079915 1094658 1110409 1127046 1143714 1159593
61127 1159593 1174755 1189856 1205129 1220236 1235070 1250011 1265107 1279635 1292927 1305227 1317148
61116A317148J1440J0292Q979Q242P944P449O640N814M888L483J608l67k312m274
61102A386974o012p351q933j1667j5323j8487k0318k1573k3412k5806k7756k8722
61090A171614k9135k9609l0186l0417k9888k8554k6799k5160k3875k2747k1436
61079H73808j9872j8276j6908j5830j4849j3690j2302j0948r835q807p643o533
61067G18315n864n537m989l958k859k180j887j670j441j259r47k10R08J988K757
61052F91167L460M547O037P418Q248Q747R490J0599J1658J2466J3411J4763J6081
61039H18092J6799J7078J7448J7894J7963J7704J7834J8789K0223K1572K2692
61028A024088K3717K4686K5575K6437K7377K8487K9816L1235L2556L3972L6160
$$ plain form
61116 1317148 1328588 1338880 1347859 1356101 1364045 1371494 1378134 1383948 1388836 1392319 1393927 1393560 1391248 1386974
61102 1386974 1380962 1373611 1364678 1353011 1337688 1319201 1298883 1277310 1253898 1228092 1200336 1171614
61090 1171614 1142479 1112870 1082684 1052267 1022379 993825 967026 941866 917991 895244 873808
61079 873808 853936 835660 818752 802922 788073 774383 762081 751133 741298 732491 724848 718315
61067 718315 712451 706914 701925 697967 695108 692928 691041 689371 687930 686671 685724 685514 686422 688410 691167
61052 691167 694627 699174 705211 712629 720877 729624 739114 749713 761371 773837 787248 802011 818092
61039 818092 834891 851969 869417 887311 905274 922978 940812 959601 979824 1001396 1024088
61028 1024088 1047805 1072491 1098066 1124503 1151880 1180367 1210183 1241418 1273974 1307946 1344106
61017A344106L9575M3993M9109N5208O2661P1179Q0336R0693J03671J20479J41968
61006B202978J69491K05320K52392L13942L92461M87976N98106P20670Q54709
60997F198045R96982J139150J271081J383637J460708J469190J370584J156432
60989A6445809Q71462N90347L66182K05509R2339K1333p369k0891p9487k33955
60979A8251279m78870p56070j003597j194703j331408j414801j433995j381393
60971I256442j267691j117744r56521q01516o63165n45969m48975l68798l03339
60962B782724k51731k11755j79658j52717j30368j12643r8770q7487p7655o8407
60952A411533n9514n1625m5394m0498l6201l2604l0384k9524k9139k8519k7549
$$ plain form
61017 1344106 1383681 1427674 1476783 1531991 1594652 1665831 1746167 1836860 1940531 2061010 2202978
61006 2202978 2372469 2577789 2830181 3144123 3536584 4024560 4622666 5343336 6198045
60997 6198045 7195027 8334177 9605258 10988895 12449603 13918793 15289377 16445809
60989 16445809 17317271 17907618 18273800 18479309 18571648 18592981 18585612 18564721 18485234 18251279
60979 18251279 17772409 17016339 16012742 14818039 13486631 12071830 10637835 9256442
60971 9256442 7988751 6871007 5914486 5112970 4449805 3903836 3454861 3086063 2782724
60962 2782724 2530993 2319238 2139580 1986863 1856495 1743852 1645082 1557595 1479940 1411533
60952 1411533 1352019 1300394 1255000 1214502 1178301 1145697 1115313 1085789 1056650 1028131 1000582
60941A000582k6382k5369k5037k5305k5093k3592k1556k0306j9876j9316j8432
60930G50318j7868j7586j6679j4846j2795j1056r580q645q834r779j0149r407
60918F03094q433q021p840p392o878o430n563m118k926k688k897k645j894j215
60904E34154p90l95n6o7n64j467k501l118k903k308k357l285m142m132l587l158
60888D99324k800k250j829j937k241k206k063k441l229l593l089k146j418j087
60874D66995q94n70k03k18q27j469j270k09P62J010R98J387J988K258K261K407
60858D74406K618K512K152J909J674J015j9q59j229j370j425j189o02r4k00j135
60842D78164k662m199n098n177m944n032n480n881o027o039n998n813n446m960
$$ plain form
60941 1000582 974200 948831 923794 898489 873396 849804 828248 807942 788066 768750 750318
60930 750318 732450 714864 698185 683339 670544 659488 649908 641263 632429 622650 612501 603094
60918 603094 594661 586640 578800 571408 564530 558100 552537 548419 545493 542805 539908 537263 535369 534154
60904 534154 533364 532969 532913 532846 532282 530815 528314 525196 522293 519985 517628 514343 510201 506069 502482 499324
60888 499324 496524 494274 492445 490508 488267 486061 483998 481557 478328 474735 471646 469500 468082 466995
60874 466995 466101 465531 465328 465110 464283 462814 461544 461335 462097 463107 464105 465492 467480 469738 471999 474406
60858 474406 477024 479536 481688 483597 485271 486286 486267 485408 484179 482809 481384 480195 479593 479499 479299 478164
60842 478164 475502 471303 466205 461028 456084 451052 445572 439691 433664 427625 421627 415814 410368 405408
60828D05408m399l911l773l947l800k787j259j03L17L15R1m68j111j171n56j24
60812C78722n90j524j979j714j216q00l61Q9L58N66J036J583J521O67k41n47n73
60795C74997r24j350j100k07L82J12n08p92p41p11p34o59n77n97n77m54n72j183
60777C63805j940k344k391k336k114j609j209j403j946k135j775j308r71n77j07
60762C39640J80L06N98J045J276J296J536J969K008J542J303J743K243K068J567
60747C60320J636K340K857K672K205K137K524K772K286J077k34j077j506j993
60733C78016k636k959k573j747j070p61n07L3P28J005M80m25p78l13J19l19j259
60716C65034j720j562j475j671j598j072p10q64j073r79r28j210j444j323j242
$$ plain form
60828 405408 401009 397098 393325 389378 385578 382791 381532 381429 381746 382061 382152 381684 380573 379402 378846 378722
60812 378722 378132 376608 374629 372915 371699 370899 370538 370627 370985 371551 372587 374170 375691 376358 376117 375570 374997
60795 374997 374073 372723 371623 371416 371798 371910 371402 370610 369869 369158 368424 367765 367188 366591 366014 365560 364988 363805
60777 363805 361865 359521 357130 354794 352680 351071 349862 348459 346513 344378 342603 341295 340324 339747 339640
60762 339640 339820 340126 340724 341769 343045 344341 345877 347846 349854 351396 352699 354442 356685 358753 360320
60747 360320 361956 364296 367153 369825 372030 374167 376691 379463 381749 382826 382592 381515 380009 378016
60733 378016 375380 372421 369848 368101 367031 366270 365763 365796 366524 367529 368009 367584 366806 366493 366612 366293 365034
60716 365034 363314 361752 360277 358606 357008 355936 355226 354362 353289 352310 351382 350172 348728 347405 346163
60701C46163j589j981j887j470j193j130j203j591k236k444j698n16K29M94Q37
60686C28785J356J564J163L34n17q34j23J371K596K869K697K804K958K668K410
60671C52101K950L795L571J986J54j064j810k160j685o00j14q18j656j394l53
60656C52903K78K15J66M63P52Q78J136J467J371Q53P07J392K217K208J382N00
60640C68888j20q73j915k703k782k477k402k574k512j998j287o59j92M5l9k92
60624C46108l95k49o3j5p7j12Q3P16J557J825J063j6k45L91P44J82n14m50J56
60605C50689N67P15R47J112P18j26p32p25m18k65l42m13k24K29O20P22Q94J743
60587C55711L068L783L218J993J088O05R9l57k05O73J807K754L337L451L187K991
$$ plain form
60701 346163 344574 342593 340706 339236 338043 336913 335710 334119 331883 329439 327741 327225 327454 327948 328785
60686 328785 330141 331705 332868 333202 332685 331851 331728 333099 335695 338564 341261 344065 347023 349691 352101
60671 352101 355051 358846 362417 364403 364557 363493 361683 359523 357838 357238 357124 356306 354650 353256 352903
60656 352903 353181 353396 353562 354025 354777 355655 356791 358258 359629 360482 361189 362581 364798 367006 368388 368888
60640 368888 368768 367895 365980 363277 360495 358018 355616 353042 350530 348532 347245 346586 346394 346439 346400 346108
60624 346108 345713 345464 345401 345386 345309 345197 345280 345996 347553 349378 350441 350425 350180 350571 351315 351497 350983 350533 350689
60605 350689 351256 351971 352918 354030 354748 354622 353890 353165 352747 352482 352140 351727 351503 351732 352352 353074 353968 355711
60587 355711 358779 362562 365780 367773 368861 369466 369565 369208 369003 369676 371483 374237 377574 381025 384212 387203
60571C87203L238L770M343N202O588P962Q529Q364Q319Q802R304R137Q021N938
60557D84720L117L34j474k184k585l299l959l748k484r08Kk6k88J36J429L043
60541D71826M660O521Q600J0180J0839J1308J2569J4479J6091J6959J7298J7112
60529F18442J6141J4514J2520R757N608O60l377n613o978q796j1079j2780j3237
60516F15782j2731j1870j0917r680p942n969m474l729k950j089J748M329N836
60503E56344O881Q675J1672J5292J8728K1721K4684K8165L2127L5835L8573M0274
60491H38971M1190M1249M0171L8018L5097L1470K7006K1751J5802Q940R24p955
60479A132634j7069k5908l3934m0308m4486m6836m8035m8095m6685m4013m0586
$$ plain form
60571 387203 390441 394211 398554 403756 410344 418306 426835 435199 443518 452320 461624 470761 478782 484720
60557 484720 487837 488171 486697 484513 481928 478629 474670 470922 468438 467530 467532 467506 467218 467354 468783 471826
60541 471826 476486 483007 491607 501787 512626 523934 536503 550982 567073 584032 601330 618442
60529 618442 634583 649097 661617 671374 676982 677642 674265 668652 661674 652878 641799 629019 615782
60516 615782 603051 591181 580264 570584 562642 556673 552199 548470 545520 544431 546179 550508 556344
60503 556344 563225 571900 583572 598864 617592 639313 663997 692162 724289 760124 798697 838971
60491 838971 880161 921410 961581 999599 1034696 1066166 1093172 1114923 1130725 1139665 1140589 1132634
60479 1132634 1115565 1089657 1055723 1015415 970929 924093 876058 827963 781278 737265 696679
60468F96679l6446l1659k7165k3944k1513j8558j5069j2428j1260j0618r728r089
60456D69202r173r300q716p741o951o097m793l527l092l473l994m156l741k665
60442C91783j342o56r03j321j167o85m40l65j98k20p43j376j561j425j378j298
60426C76705q40j98J54J82J56J54K46O90J319J376O73K61J003K116K242J488J135
60409C88862J583J996J963K117K719K940K204J192Q66J118J177Q71P42J180K026
60394D13556K909L545L729L371K590J664R31P17J193K095K701K327R98l89p38
60379D41199K00J493J942J336N42L78P91J255J486J468J219Q77P60Q82P60N9p97
60362D55850j116p59p9O90J450J921J871J617J726K276K869L302L673L864L532
$$ plain form
60468 696679 660233 628574 601409 577465 555952 537394 522325 509897 498637 488019 478291 469202
60456 469202 460029 450729 442013 434272 427321 421224 416431 412904 409812 406339 402345 398189 394448 391783
60442 391783 390441 389785 388882 387561 386394 385709 385269 384904 384706 384486 383743 382367 380806 379381 378003 376705
60426 376705 375865 375667 375821 376003 376159 376313 376559 377249 378568 379944 380617 380878 381881 383997 386239 387727 388862
60409 388862 390445 392441 394404 396521 399240 402180 404384 405576 406442 407560 408737 409608 410350 411530 413556
60394 413556 416465 420010 423739 427110 429700 431364 432295 433012 434205 436300 439001 441328 442326 441937 441199
60379 441199 441399 442892 444834 446170 446712 447090 447881 449136 450622 452090 453309 454186 454946 455828 456588 456647 455850
60362 455850 454734 453975 453896 454586 456036 457957 459828 461445 463171 465447 468316 471618 475291 479155 482687
60347D82687K713J909J362P18l50j555k295k307j835j340j215j514j827j613q59
60332D72679k64n48j656k821l420l512l479l394l037k428j933j632j051J25J340
60317D44969J769J488J353J704J956J765J772K614L819M458M543M961O031O939
60303D90141O846O055N648O203P130P350O459N083L967L041J655l01k111l113
60289E44053l411l439l361l227l280l574l657l127k380k247k970l937m391m104
60275D96948l414k943l199m159n189n603n277m632m117l822l550l125k670k474
60261D42774k475k181j399p53q14j031m12P84J247O70L39J086J932J716R59Q87
60245D43329J430J631J456J730K449K628J878Q88J78m46r94r63k70M08O72R17
$$ plain form
60347 482687 485400 487309 488671 489389 489039 487484 485189 482882 481047 479707 478492 476978 475151 473538 472679
60332 472679 472415 471867 470211 467390 463970 460458 456979 453585 450548 448120 446187 444555 443504 443629 444969
60317 444969 446738 448226 449579 451283 453239 455004 456776 459390 463209 467667 472210 477171 483202 490141
60303 490141 496987 503042 508690 514893 522023 529373 535832 540915 544882 547923 549578 549277 547166 544053
60289 544053 540642 537203 533842 530615 527335 523761 520104 516977 514597 512350 509380 505443 501052 496948
60275 496948 493534 490591 487392 483233 478044 472441 467164 462532 458415 454593 451043 447918 445248 442774
60261 442774 440299 438118 436719 435966 435152 434121 433709 434493 435740 436410 436749 437835 439767 441483 442442 443329
60245 443329 444759 446390 447846 449576 452025 454653 456531 457419 457597 457151 456157 455194 454924 455332 456004 456921
60229D56921J468K019K377K959M033N117N675N851O028O202O319O689P472Q143
60215E27273Q149P831Q060R071J0165J0642J0530J0335J0401J0649J0775J0581
60203F44462J0123R583Q990Q140O938N692M948M901N092M807L825K589J490K78
60189G21858j461l406m687n068n333o185p354q176q513q599q406p856p252o924
60175F32638o620n889m847l981l387k781k119j583j168q86j104j999k870k827
60161E90577k026j408j282j111o31k46j54k5K19J83j41j37M70J182J634K109K773
60144E91986L222L273L431L952M212L802L556M570O562Q139Q574Q461Q593Q877
60130F71210Q676P782O761O357O701P092O723N562M285L381K688J965J461J589
$$ plain form
60229 456921 458389 460408 462785 465744 469777 474894 480569 486420 492448 498650 504969 511658 519130 527273
60215 527273 535422 543253 551313 560384 570549 581191 591721 602056 612457 623106 633881 644462
60203 644462 654585 664168 673158 681298 688236 693928 698876 703777 708869 713676 717501 720090 721580 721858
60189 721858 720397 716991 712304 707236 701903 695718 688364 680188 671675 663076 654670 646814 639562 632638
60175 632638 626018 620129 615282 611301 607914 605133 603014 601431 600263 599377 598273 596274 593404 590577
60161 590577 588551 587143 585861 584750 584119 583873 583719 583694 583913 584096 583955 583818 584288 585470 587104 589213 591986
60144 591986 595208 598481 601912 605864 610076 613878 617434 622004 628566 636705 645279 653740 662333 671210
60130 671210 679886 687668 694429 700786 707487 714579 721302 726864 731149 734530 737218 739183 740644 742233
60116G42233K312L072L240K542J325M01K47L61q4j007j462j124q92j648l016m016
60100G42484m338m364m385m433m607m808m439l067j301k99m78j201j691j726j452
60085F99895j135j134j598k102k014j294n34j86k53p61j917l548m968n757o289
60070F66405p106q117q841r185r490r888j0064r687q724p343n869m841m629m834
60056E57787m505l310k066j639j674j061M53J927K579K757L185L887M486N057
60042E67863O006P273Q321Q859R014Q878Q339P416O264M866L183J579N58n2j069
60027F47298k938n184p085q465r511j0236j0524j0467j0322j0157r813r175q340
60014E35081p550o973o501n832m948m303m263m453m139l212k314j912j743j384
$$ plain form
60116 742233 744545 747617 750857 753399 754724 755125 755372 755733 755649 754642 753180 752056 751164 749516 746500 742484
60100 742484 738146 733782 729397 724964 720357 715549 711110 708043 706742 706443 705965 704764 703073 701347 699895
60085 699895 698760 697626 696028 693926 691912 690618 690084 689898 689645 688884 686967 683419 678451 672694 666405
60070 666405 659299 651182 642341 633156 623666 613778 603714 594027 585303 577960 572091 567250 562621 557787
60056 557787 553282 549972 547906 546267 544593 543532 543985 545912 548491 551248 554433 558320 562806 567863
60042 567863 573869 581142 589463 598322 607336 616214 624553 631969 638233 643099 646282 647861 648419 648367 647298
60027 647298 644360 639176 632091 623626 614115 603879 593355 582888 572566 562409 552596 543421 535081
60014 535081 527531 520558 514057 508225 503277 498974 494711 490258 486119 482907 480593 478681 476938 475554
60000D75554q67m66j58K93Q91J390J653J888K519L818N479O632O607N708M954
59985E15895M959N362N445M928M039L090K200J360N21l00j066j936l147m468n018
59970E31864m152k420j052n73m39m4N92J283K149L327M659N930P023P673P535
59955E63355O632N319L734J851J34o06l41p4n54j359j739j706j703j754j620j418
59939E68151j428j551j479j172o82J46J335K476L270M019M969N561N019L450J719
59924E93803L78n97j260j557j703j992k179j722o30N40J578K822M336N549O029
59909F03395O033O011O019N943N916O000N757M606K584L76j437k866m189n362
59895F38786o022n965n414m684l775k552j176n2P33J478K292K831K884K869L310
$$ plain form
60000 475554 474687 474221 474063 474356 475247 476637 478290 480178 482697 486515 491994 498626 505233 510941 515895
59985 515895 520854 526216 531661 536589 540628 543718 545918 547278 547799 547499 546433 544497 541350 536882 531864
59970 531864 527712 525292 524240 523667 523228 523184 523776 525059 527208 530535 535194 541124 548147 555820 563355
59955 563355 569987 575306 579040 580891 581025 580419 580078 580004 579450 578091 576352 574646 572943 571189 569569 568151
59939 568151 566723 565172 563693 562521 561839 561985 563320 565796 569066 573085 578054 583615 588634 592084 593803
59924 593803 594181 593584 592324 590767 589064 587072 584893 583171 582541 583081 584659 587481 591817 597366 603395
59909 603395 609428 615439 621458 627401 633317 639317 645074 649680 652264 652640 651203 648337 644148 638786
59895 638786 632764 626799 621385 616701 612926 610374 609198 609146 609879 611357 613649 616480 619364 622233 625543
59880F25543M053M525M632M882N530O109O061N531N162N220N189M353K675R27
59866F90392r3l71n61j113j784k124k190k508l386m544n444n783n555m846l745
59851F46345k504j526r64m20O86K359L909M719M878M801M573M049L358K849K548
59836F79660K239K041K413L462M664N416N558N219M533L512K012j72k823n060
59822G12674o104o187o132o102n530m357l413l173k947j928m74K98j06j183k108
59807F63228k395k071j718k039l049l895l822l054k404k282k478k724k961l139
59793F25197l123k889k611k540k756k932k527j472n25m29r03j036o39m39q11j208
59777E98357j115p15k30N72J685K480K594K524K716K800K430K174K679L523L864
$$ plain form
59880 625543 629596 634121 638753 643635 649165 655274 661335 666866 672028 677248 682437 686790 689465 690392
59866 690392 690299 689928 689367 688254 686470 684346 682156 679648 676262 671718 666274 660491 654936 650090 646345
59851 646345 643841 642315 641351 640931 641617 643976 647885 652604 657482 662283 666856 670905 674263 677112 679660
59836 679660 681899 683940 686353 689815 694479 699895 705453 710672 715205 718717 720729 720557 717734 712674
59822 712674 706570 700383 694251 688149 682619 678262 674849 671676 668729 666801 666327 666625 666519 665336 663228
59807 663228 660833 658762 657044 655005 651956 648061 644239 641185 638781 636499 634021 631297 628336 625197
59793 625197 622074 619185 616574 614034 611278 608346 605819 604347 603822 603393 602490 601454 600815 600376 599565 598357
59777 598357 597242 596527 596297 596869 598554 601034 603628 606152 608868 611668 614098 616272 618951 622474 626338
59762F26338L768M006M804N721O506P286P988Q397Q702R291J0109J0840J1523
59749G25279J2343J2965J2762J1674J0265R035Q145P574P001N837L949K097J006
59736H29932L51o56j997l035l620m107m440m148l335k751k782l091l309l430l453
59721G86129l303l176l361l700l802l678l573l331k674j982j912k202j789k82
59707G47364J469K463K558K276K287L141M839O478P027O596O226O463O853O989
59693H13029P154P592P942P729O827N224L113J356R85J857K534J954N17q60j922
59678H65031k795l311l424l665m414n156n214m940n271o290o957o433n024l616
59664G98521k662k018j434q39j19R93K577M216N343N929O449P049P201O547N625
$$ plain form
59762 626338 630106 634112 638916 644637 651143 658429 666417 674814 683516 692807 702916 713756 725279
59749 725279 737622 750587 763349 775023 785288 794323 802468 810042 817043 822880 826829 828926 829932
59736 829932 830283 829627 827630 824595 820975 816868 812428 808280 804945 802194 799412 796321 793012 789582 786129
59721 786129 782826 779650 776289 772589 768787 765109 761536 758205 755531 753549 751637 749435 747646 747364
59707 747364 748833 751296 753854 756130 758417 761558 766397 772875 779902 786498 792724 799187 806040 813029
59693 813029 820183 827775 835717 843446 850273 855497 858610 859966 860951 862808 865342 867296 867813 866953 865031
59678 865031 862236 858925 855501 851836 847422 842266 837052 832112 826841 820551 813594 807161 802137 798521
59664 798521 795859 793841 792407 791568 791449 792442 795019 799235 804578 810507 816956 824005 831206 837753 843378
59649H43378N128M810L816J937j99k212m505p466j0769j3668j5630j6480j6315
59636G71825j5437j4159j2627j1069r970r545r279q562p652p360p872q564q949
59623F40780r102r115q904q618q516q421p922p213o846o700o078m953m120l822
59609E40450l238j822k07P68J179J508J767J764J600J370R11M16O21J681K553
59594E51321K267J290P70Q46O59j64j007j269j070p87n59m94r09j923l011l392
59578E42568k938k451k788l753m307l998l595l838m094l216j387n5N5k59q5M00
59562E06259O19N18K12m20j144j099Q8J472J881J371R16J039J545K171K762L024
59546E21214K873K854L543M699N640O340P437R186J1027J2377J3345J4443J5739
$$ plain form
59649 843378 848506 853316 857132 859069 858870 856658 852153 844687 833918 820250 804620 788140 771825
59636 771825 756388 742229 729602 718533 708563 699018 689739 681177 673525 666165 658293 649729 640780
59623 640780 631678 622563 613659 605041 596525 588104 580182 572969 566123 559423 553345 548392 544272 540450
59609 540450 537212 535390 535183 535951 537130 538638 540405 542169 543769 545139 546050 546466 547087 548768 551321
59594 551321 553588 554878 555648 556494 557153 556989 555982 554713 553643 552856 552297 551803 550894 548971 545960 542568
59578 542568 539630 537179 534391 530638 526331 522333 518738 514900 510806 507590 506203 506148 506203 505944 505859 506259
59562 506259 506878 507396 507608 507188 506044 504945 505033 506505 508386 509757 510673 511712 513257 515428 518190 521214
59546 521214 524087 526941 530484 535183 540823 547163 554600 563786 574813 587190 600535 614978 630717
59533F30717J6386J5072J1250O088J718p29k037l518n171n838m872k918j116r5
59519F54937J77l4n37j348k598m217n805o984p703q119q333q406q399q309q048
59504E76274p693p377o932n968m526l206k403j796q92K73J288J884K001J679J298
59489E43904J523K592L830M330L974L406L147L164L245L392L712M027L864K941
59475E91051J710J100J566K581L408L886L995L138R58j452k342j493m48k64k69
59460F07125M23J432K093K832M398O316P334P135O602O496O714O746O172M845
59446F76663L128J770J079M73o45j968k844l325l916m595m874m699m407l927k825
59431F45088j207J09N48M06L92Q82J778K826L961N396P331R534J1534J3240J4950
$$ plain form
59533 630717 647103 662175 673425 679513 681231 680502 678465 674947 669776 663938 659066 656148 655032 654937
59519 654937 655114 655080 654543 653195 650597 646380 640575 633591 625888 617769 609436 601030 592631 584322 576274
59504 576274 568581 561204 554272 548304 543778 540572 538169 536373 535481 535754 537042 538926 540927 542606 543904
59489 543904 545427 548019 551849 556179 560153 563559 566706 569870 573115 576507 580219 584246 588110 591051
59475 591051 592761 593861 595427 598008 601416 605302 609297 612435 613393 611941 609599 608106 607658 607394 607125
59460 607125 607548 608980 611073 613905 618303 624619 631953 639088 645690 652186 658900 665646 671818 676663
59446 676663 679791 681561 682640 683113 682468 680500 677656 674331 670415 665820 660946 656247 651840 647913 645088
59431 645088 643881 643990 644538 644944 645336 646218 647996 650822 654783 660179 667510 677044 688578 701818 716768
59416G16768J6634J7822J8496J9379K0923K2597K3645K3792K2668J9420J3967
59405I36111P981L452O61j410k998l234j760O47L241N858P832P503L725k599r216
59390I55794j4499j8326k1191k3070k3347k1699j8775j5763j3269j0977q455n955
59378G60468m092l062k532k074j428n35L63Q91R58Q09N28rn76n56K10J144J824
59361G52331K522L441M176M533N138O517Q167R353J0192J1153J2070J2608J3167
59348H55368J4319J5722J6611J6991J7331J7410J6572J4915J3152J1436R341O815
59336A025983M142J153k445o050q648j0291j1968j3929j5378j5921j6184j6625
59324I13839j6835j6379j5467j4381j3072j1677j0700j0342j0277j0278j0419
$$ plain form
59416 716768 733402 751224 769720 789099 810022 832619 856264 880056 902724 922144 936111
59405 936111 944092 947544 948205 946795 943797 940563 938803 939450 942691 948549 956381 963884 967609 965010 955794
59390 955794 941295 922969 901778 878708 855361 833662 814887 799124 785855 774878 766423 760468
59378 760468 756376 753314 750782 748708 747280 746745 747108 747999 748957 749766 750294 750285 749709 749153 749363 750507 752331
59361 752331 754853 758294 762470 767003 772141 778658 786825 796178 806370 817523 829593 842201 855368
59348 855368 869687 885409 902020 919011 936342 953752 970324 985239 998391 1009827 1019168 1025983
59336 1025983 1030125 1031278 1028833 1022783 1014135 1003844 991876 977947 962569 946648 930464 913839
59324 913839 897004 880625 865158 850777 837705 826028 815328 804986 794709 784431 774012
59313G74012j0465r886q678p491o778o408o139n788m909l198j244R7J029K482
59299G06636M399N619N793N998O835P119N376J715k593o523r482j0953j0988j0574
59285F98377j0475j0095q348n305k146L19K272M104N816P335Q837J0493J2168
59272G13352J3476J4108J4115J3988J4239J4820J5165J4830J3875J2549J0995
59261H65512R296P548N696L673J730K81o77j614k785l858m397m364m028l710l683
59246H64620m036m507m778m913n198n609n831n762n561n286m916m619m546m493
59232G94565m370m675n801p075p489p258p544q561r135q594p855p950q438q156
59218F91664o913n566m799m517m233l508k246q92r9O9K36P76J347J591J792K267
$$ plain form
59313 774012 763547 753661 744983 737492 730714 724306 718167 712379 707470 704272 703028 703125 704154 706636
59299 706636 711035 716654 722447 728445 735280 742399 747775 749490 746897 740374 730892 719939 708951 698377
59285 698377 687902 677807 669459 664154 662008 662327 664599 668703 674519 681854 690691 701184 713352
59272 713352 726828 740936 755051 769039 783278 798098 813263 828093 841968 854517 865512
59261 865512 874808 882356 888052 891725 893455 893736 893059 891445 888660 884802 880405 876041 872013 868303 864620
59246 864620 860584 856077 851299 846386 841188 835579 829748 823986 818425 813139 808223 803604 799058 794565
59232 794565 790195 785520 779719 772644 765155 757897 750353 741792 732657 724063 716208 708258 699820 691664
59218 691664 684751 679185 674386 669869 665636 662128 659882 658990 658891 658960 659196 659972 661319 662910 664702 666969
59202F66969K685K502J831J362J556K325L183L496K858J558M87K86Q19J564K242
59187F95723K782L096L106K851K410J904J552J408J119L64m97q44p81j093k115
59172G10985l285l983m153l914l292k578k304k501k609k327j988j815j589j284
59158F73363j375k063k836l273l685m523n652o615p111o967o214n410n267n674
59144F06698n755n166m512m203l908l523l666m463m953m516l976m196m416l304
59130E46141j090P28J523K102L130M225M918N482O337P262P750P796P959Q703
59116F12966R827J0599J0533R938R479R265Q852Q178P782P758P248N560L245J394
59102G22624K57o92j685k399k700k865l092l274l363l548l883m142m071l705l318
$$ plain form
59202 666969 669654 672156 673987 675349 676905 679230 682413 685909 688767 690325 690812 691098 691917 693481 695723
59187 695723 698505 701601 704707 707558 709968 711872 713424 714832 715951 716315 715818 714974 714193 713100 710985
59172 710985 707700 703717 699564 695650 692358 689780 687476 684975 682366 680039 678051 676236 674647 673363
59158 673363 671988 669925 667089 663816 660131 655608 649956 643341 636230 629263 623049 617639 612372 606698
59144 606698 600943 595777 591265 587062 583154 579631 575965 571502 566549 562033 558057 553861 549445 546141
59130 546141 545051 545779 547302 549404 552534 556759 561677 567159 573496 580758 588508 596304 604263 612966
59116 612966 622793 633392 643925 653863 663342 672607 681459 689637 697419 705177 712425 717985 721230 722624
59102 722624 722881 722189 720504 718105 715405 712540 709448 706174 702811 699263 695380 691238 687167 683462 680144
59087F80144l191l326l372l028k473k186k328k616k872l194l585l836l960m287
59073F35890m944n589n763n238m029k554j683j923k674k957k838l177l982m204
59059E84335l487k857l130l697l678l282l157l208l041k846k899k709j695l23
59045E44326L72J37l15k77M42J560K362K087R33K29R44K462L426L398L040L142
59029E68268M085N900Q135J0008J1236J2262J3306J3885J3832J3884J4399J4318
59017G03518J2548R695P132M927K023j731n126p233q294q836q952q635p996o958
59003F76082n377l607k254j363n18L16P50P55P39Q72R77J061J241J143K44j146
58987F69915k020j967j584j346q50M02J986K946K961K763L309M818O661Q183R429
$$ plain form
59087 680144 676953 673627 670255 667227 664754 662568 660240 657624 654752 651558 647973 644137 640177 635890
59073 635890 630946 625357 619594 614356 610327 607773 606090 604167 601493 598536 595698 592521 588539 584335
59059 584335 580848 577991 574861 571164 567486 564204 561047 557839 554798 551952 549053 546344 544649 544326
59045 544326 544698 544835 544520 544243 544685 546245 548607 550694 551627 551856 552800 555262 558688 562086 565126 568268
59029 568268 572353 578253 586388 596396 607632 619894 633200 647085 660917 674801 689200 703518
59017 703518 716066 725761 732893 737820 739843 738112 732986 725753 717459 708623 699671 691036 683040 676082
59003 676082 670705 667098 664844 663481 662963 663279 664029 664784 665523 666395 667372 668433 669674 670817 671061 669915
58987 669915 667895 665928 664344 662998 662148 662550 664536 667482 670443 673206 676515 681333 687994 696177 705606
58972G05606J0818J2214J2863J2413J1541J1244J1789J2605J2910J2222J0633
58961H36858Q770P109N374L043M59j444k600m002o096q074r343j0553j2320j3925
58947G93256j4298j3583j2728j2127j1642j1388j1403j1023r594p448n393l677
58935F68952k162r79j79O14J411J491P64N64J880L587L861K663J406P42K28k32
58919F84611l87p50k068l678m020k894j711j345j212o00M04J612L026M227M689
58904F79904M887N850P458Q585R063J0024J1833J3195J3090J2265J1943J2097
58892H00194J1908J1231J0717J0962J2054J3625J4953J5436J5206J4834J4487
58881I45607J3884J3026J2105J0782Q482N489K861J122j37j311k388l529m979
$$ plain form
58972 705606 716424 728638 741501 753914 765455 776699 788488 801093 814003 826225 836858
58961 836858 845628 852737 858111 861154 861613 860169 857569 853567 847471 839397 830054 819501 807181 793256
58947 793256 778958 765375 752647 740520 728878 717490 706087 695064 685470 678022 672629 668952
58935 668952 666790 665811 665632 666246 667657 669148 669912 670476 672356 675943 679804 682467 683873 684615 684843 684611
58919 684611 684224 683474 681406 677728 673708 670814 669103 667758 666546 665946 666350 667962 670988 675215 679904
58904 679904 684791 690641 698099 706684 715747 725771 737604 750799 763889 776154 788097 800194
58892 800194 812102 823333 834050 845012 857066 870691 885644 901080 916286 931120 945607
58881 945607 959491 972517 984622 995404 1003886 1009375 1012236 1013358 1013221 1011910 1009522 1005993 1001014
58868A001014o236o385n566n045n503o246o512o575p013p803q654r475j0071j0009
58854H99921r313q605q238p894p303o704o324o093o126o764p929r093j0171j1684
58840G87680j3699j5393j5989j5528j4484j3268j2304j1895j1671j0800r028o984
58828F36637n337m215l443k725j581J82J926K873L200L651M200M196L716L576
58814F46856L896L890L319K913K996K910K266J586J237P57p2o09n23o49j821l579
58798F65373m786n030m767m531m501m545m290l481k421j632j111n23RJ19K28J319
58782F25430L503N761P283Q126Q430Q011P173O745O871O593N190L110J162n18
58768G02870k195l996n912p785r043r129q344p515o818n743m273l095k522k175
$$ plain form
58868 1001014 994778 988393 982827 977782 972279 966033 959521 952946 945933 938130 929476 920001 909930 899921
58854 899921 890608 882003 873765 865871 858568 851864 845540 839447 833321 826557 818628 809535 799364 787680
58840 787680 773981 758588 742599 727071 712587 699319 687015 675120 663449 652649 643621 636637
58828 636637 631300 627085 623642 620917 619336 619518 621444 624317 627517 631168 635368 639564 643280 646856
58814 646856 650752 654642 657961 660874 663870 666780 669046 670632 671869 672626 672554 671945 671422 670773 668952 665373
58798 665373 660587 655557 650790 646259 641758 637213 632923 629442 627021 625389 624278 623755 623764 623883 624111 625430
58782 625430 628933 634694 641977 650103 658533 666544 673717 680462 687333 693926 699116 702226 703388 702870
58768 702870 700675 696679 690767 682982 673939 664810 656466 648951 642133 636390 632117 629022 626500 624325
58754F24325j802j524j264r18j002j949k952k835j978j785k294k023m59J173K061
58739F04774K906M233N355N726N776N665M830L530L142M049M792M353L602L475
58725F66208L396K682J970J902J897J550J807L344N102N888O136O633O837O114
58711G21466N350N535N794M644K378L12j493l898o698q865j0370j2053j3942j5267
58697F72893j5953j6528j6787j6018j4487j3286j2708j2018j0841r612q652p806
58685E18197p004o282n380m118l006k668k879k941k634k158j487o30l8M2K16J085
58669D78315K204K756K846L272M376N933P654R100R510Q561O895N214L380J115
58655E51131j147k863m227n610o786p453p831p986p341n770m331l991m270m124
$$ plain form
58754 624325 622523 620999 619735 618817 617815 615866 612914 610079 608101 606316 604022 601999 601540 602713 604774
58739 604774 607680 611913 617268 622994 628770 634435 639265 642795 645937 649986 654778 659131 662733 666208
58725 666208 669604 672286 674256 676158 678055 679605 681412 684756 689858 695746 701882 708515 715352 721466
58711 721466 726816 732351 738145 742789 745167 745479 743986 740088 733390 724525 714155 702102 688160 672893
58697 672893 656940 640412 623625 607607 593120 579834 567126 555108 544267 534655 526003 518197
58685 518197 511193 504911 499531 495413 492407 489739 486860 483919 481285 479127 477640 477010 476972 477014 477230 478315
58669 478315 480519 483275 486121 489393 493769 499702 507356 516456 525966 534527 541422 546636 550016 551131
58655 551131 549984 547121 542894 537284 530498 523045 515214 507228 499887 494117 489786 485795 481525 477401
58641D77401l397k540j628o41L1K76O74J418J732J237P79R00P62k85j318j445
58625D73956j421k107k537j468K36Q44N41Q58J884K290J833J707K480L514M400
58610D87010N287N762N191M108L698L910L751L278L520M308M114K440P03K05O10
58595E37895R24P87K90l98p73k32J098K484L617M733N858O794P702Q796R711J0084
58579E99370J0442J1338J2010J1231R307P843P578P792P961Q643J0368J2779J5243
58566G31905J7550J9818K2331K5435K8959L1910L3433L3727L3283L1738K8429
58555A038518K3626J8197J2470O485R44l230n941p562q008p225o051n425n301
58542A051497n457o674r741j3876j7559k0513k3423k6169k7920k8519k8412k7543
$$ plain form
58641 477401 474004 471464 469836 469195 469226 469502 470176 471594 473326 474563 475342 476242 477004 476719 475401 473956
58625 473956 472535 470428 467891 466423 466659 467503 468044 468902 470786 473076 474909 476616 479096 482610 487010
58610 487010 492297 498059 503250 507358 511056 514966 518717 521995 525515 529823 533937 536377 537080 537285 537895
58595 537895 538819 539606 539896 539498 538725 538493 539591 542075 545692 550425 556283 563077 570779 579575 589286 599370
58579 599370 609812 621150 633160 644391 653698 661541 669119 676911 684872 693515 703883 716662 731905
58566 731905 749455 769273 791604 817039 845998 877908 911341 945068 978351 1010089 1038518
58555 1038518 1062144 1080341 1092811 1099296 1100240 1097010 1091069 1083507 1075499 1068274 1062223 1056798 1051497
58542 1051497 1046040 1039366 1029625 1015749 998190 977677 954254 928085 900165 871646 843234 815691
58530H15691k5746k3706k2061k0086j6925j3538j1635j1120j0397q925p586o747
58518F37219n919n244n415o007n691m262k836j994j362r60j261j826j564n20J57
58503E92515Q0o6p6m35r53p91J1N84P93J263J914K059J894K317L374M465N826
58486F14774Q081J0542J1934J2691J4486J7486K0101K1492K2320K2780K2138K0500
58474H19325J8932J7350J4292R386M126l39m427q494j1790j3719j4609j4635j3340
58461H02058j0704p382l656N44M551P481R736J2421J5269J6916J7052J6426J4754
58448H95466J0841M951j072o270j1121j5528j8442j9779k0520k0577j8840j5674
58436G63435j2985j1293r107n874l104j749o78J178L236M804O283P856Q747Q701
$$ plain form
58530 815691 789945 766239 744178 724092 707167 693629 681994 670874 660477 651552 643966 637219
58518 637219 631300 626056 620641 614634 608943 604681 601845 599851 598489 597529 596268 594442 592878 592358 592515
58503 592515 592595 592529 592453 592018 591065 590274 590285 590869 591662 592925 594839 596898 598792 601109 604483 608948 614774
58486 614774 622855 633397 645331 658022 672508 689994 710095 731587 753907 776687 798825 819325
58474 819325 838257 855607 869899 879285 883411 883072 878645 870151 858361 844642 830033 815398 802058
58461 802058 791354 783972 780316 780860 785411 792892 802628 815049 830318 847234 864286 880712 895466
58448 895466 906307 911258 910186 903916 892795 877267 858825 839046 818526 797949 779109 763435
58436 763435 750450 739157 730050 724176 721072 719323 718645 719823 723059 727863 734146 742002 750749 759450
58422G59450Q512Q405P544N688L674J709r17m037o456q022r846j1956j2887j2140
58408G28721j0975j0169r128p733o904o639n671l695j919q83J75J299J568J255
58394F69302J825L233L766L152L116M130M407L094J800J792K232K313K680L619
58380G10461M240M406N107O111N880M627M541O023O766N760N094O317Q011Q636
58366G91980Q969R950J0826J1101J1833J3399J4447J4457J4665J5149J3976J0717
58354I41469P760O386M684J305j857k866k783l182l363k312r69l04N64K315L797
58339I50644M288M948O403P493Q025R834J3304J5898J6095J5696J6200J6136J4246
58326A099210J2070J0878R151N705K307N44p83k632l222j436M22L11q6J450L814
$$ plain form
58422 759450 767962 776367 783911 789599 793273 794982 794065 790028 783572 775550 765704 753748 740861 728721
58408 728721 717746 707577 698449 690716 683812 677173 671502 667807 665888 665005 665180 666479 668047 669302
58394 669302 671127 674360 678126 681278 684394 688524 692931 696025 697825 699617 701849 704162 706842 710461
58380 710461 714701 719107 724214 730325 736205 740832 745373 751396 758162 763922 769016 775333 783344 791980
58366 791980 800949 810899 821725 832826 844659 858058 872505 886962 901627 916776 930752 941469
58354 941469 949229 955615 960299 961604 959747 956881 954098 950916 947553 945241 944272 943968 944532 946847 950644
58339 950644 954932 959880 966283 973776 981801 991635 1004939 1020837 1036932 1052628 1068828 1084964 1099210
58326 1099210 1111280 1122158 1131309 1137014 1139321 1139865 1139082 1136450 1133228 1131792 1132214 1132525 1132439 1133889 1137703
58311A137703N044N874P681R398R600R385J0291J1580J2164J2806J4054J4500
58299A260080J3513J2934J3842J4563J4080J4123J5556J6289J5241J4679J6015
58288A420915J7174J6807J7033J9057K0393J9598J9297K1105K2164K0563J9398
58277A633504K1265K3366K2660K1441K2998K5928K7652K9439L3073L6461L7528
58266A935315L8596M2083M5829M7367M8647N1741N4322N4226N3947N5572N6239
58255B483884N3844N1943N3424N4834N3004N1609N4583N8747N9997O1161O6320
58244C103350P2792P6510P9924Q6651R3756R7541J01484J09974J19605J25446
58234D067033J30354J39139J49214J56405J64112J77017J91624K03046K15041
$$ plain form
58311 1137703 1142747 1148621 1156302 1165700 1175300 1184685 1194976 1206556 1218720 1231526 1245580 1260080
58299 1260080 1273593 1286527 1300369 1314932 1329012 1343135 1358691 1374980 1390221 1404900 1420915
58288 1420915 1438089 1454896 1471929 1490986 1511379 1530977 1550274 1571379 1593543 1614106 1633504
58277 1633504 1654769 1678135 1700795 1722236 1745234 1771162 1798814 1828253 1861326 1897787 1935315
58266 1935315 1973911 2015994 2061823 2109190 2157837 2209578 2263900 2318126 2372073 2427645 2483884
58255 2483884 2537728 2589671 2643095 2697929 2750933 2802542 2857125 2915872 2975869 3037030 3103350
58244 3103350 3176142 3252652 3332576 3419227 3512983 3610524 3712008 3821982 3941587 4067033
58234 4067033 4197387 4336526 4485740 4642145 4806257 4983274 5174898 5377944 5592985
58225E592985K32935K53106K70277K88538L13695L41802L67265L94972M31747
58216H487322M73453N13924N58523O14973O79321P45965Q22364R18056J029083
58207A4842984J150264J292182J468289J677539J919786K215821K592318L063546
58199C0222729L651849M409422N396833O663183Q270554J0295346J2756039J5571808
58191I7237763J8638471K1888195K5192808K8265931L0769076L2423422L2790012
58184B87205678L0975601K5973390J7654320P332785k956156j1816277j9028034
58177C35341307k4856199k9188567l1533854l1651092k9909233k7046252k3746122
58170A37409988k0447170j7372578j4611695j2189447j0116005q391278o982370
$$ plain form
58225 5592985 5825920 6079026 6349303 6637841 6951536 7293338 7660603 8055575 8487322
58216 8487322 8960775 9474699 10033222 10648195 11327516 12073481 12895845 13813901 14842984
58207 14842984 15993248 17285430 18753719 20431258 22351044 24566865 27159183 30222729
58199 30222729 33874578 38284000 43680833 50344016 58614570 68909916 81665955 97237763
58191 97237763 115876234 137764429 162957237 191223168 221992244 254415666 287205678
58184 287205678 318181279 344154669 361808989 369141774 366185618 354369341 335341307
58177 335341307 310485108 281296541 249762687 218111595 188202362 161156110 137409988
58170 137409988 116962818 99590240 84978545 72789098 62673093 54281815 47299445
58163D7299445n830972m888310m123641l503874k991676k564690k214851j928235
58155A9253196j684455j474438j299953j156032j030624r20065q28387p52271
58147A0106971o81984o16031n60290n13661m68457m23958l86242l55313l25086
58138E775949k95382k71846k54480k37643k20874k08654k00065j89357j76363
58129C721285j66186j58876j49390j37539j28301j22249j14884j05654r8798r4954
58119B444454r0237q4012p9667p7289p3191o7041o2399n9905n6619n2162m9006
58108A692926m6904m3428l9549l8354l8769l7007l3595l2367l3125l2053k9102
58097A288673k8162k9787l0422k9133k8775k9907k9672k7410k5714k5207k3650
$$ plain form
58163 47299445 41468473 36580163 32456522 28952648 25960972 23396282 21181431 19253196
58155 19253196 17568741 16094303 14794350 13638318 12607694 11687629 10859242 10106971
58147 10106971 9424987 8808956 8248666 7735005 7266548 6842590 6456348 6101035 5775949
58138 5775949 5480567 5208721 4954241 4716598 4495724 4287070 4087005 3897648 3721285
58129 3721285 3555099 3396223 3246833 3109294 2980993 2858744 2743860 2638206 2539408 2444454
58119 2444454 2354217 2270205 2190538 2113249 2040058 1973017 1910618 1850713 1794094 1741932 1692926
58108 1692926 1646022 1602594 1563045 1524691 1485922 1448915 1415320 1382953 1349828 1317775 1288673
58097 1288673 1260511 1230724 1200302 1171169 1142394 1112487 1082815 1055405 1029691 1004484 980834
58086I80834k0715j8591j7498j5608j3525j3748j5660j6084j4854j4689j5672
58075H04190j5185j3323j2968j4173j3968j2164j1815j3320j3461j1317r784j0023
58063F52689r564p369n895o392o673n427m613n711p276p930q455r391r670q910
58049E49413q192p720o518n025m937o010o202n323n257o232o343n152m400m610
58035D67492m438l810m197n336n284m224m484o302p267o727o843q326r011p887
58021C83356o834o997o906n730m961n311n131l619k527l006l509k641j481j424
58007C23279k000k381k877l516l271j932p76l47L92J794K589K146J540J476J245
57992C17361M81q8l77j227k416k535j532j009j419j368l56K55k33p87q06j023
$$ plain form
58086 980834 960119 941528 924030 908422 894897 881149 865489 849405 834551 819862 804190
58075 804190 789005 775682 762714 748541 734573 722409 710594 697274 683813 672496 662712 652689
58063 652689 643125 635756 629861 623469 616796 611369 606756 601045 593769 585839 577384 567993 558323 549413
58049 549413 541221 533501 526983 521958 517021 511011 504809 499486 494229 487997 481654 476502 472102 467492
58035 467492 463054 459244 455047 449711 444427 440203 435719 429417 422150 415423 408580 400254 391243 383356
58021 383356 376522 369525 362619 356889 351928 346617 341486 337867 335340 332334 328825 326184 324703 323279
58007 323279 321279 318898 316021 312505 309234 307302 306526 306179 306571 308365 310954 313100 314640 316116 317361
57992 317361 317842 317754 317377 316150 313734 311199 309667 308658 307239 305871 305515 305770 305537 304750 303944 302921
57976C02921j415p48R98K122J966J861K535L018K893L147L842L484J755M03L29
57961C29111J71j114k595l342l818m216l702k424j983k834l470l147l064l769
57947B89804l879k619j266p25l9J381K393K419K770M146N125M706M163M707N462
57932C18548N401N308N996O498N796M590L693K396P3k276l686m824o405p674p942
57917C25492p981q345q076o580n088m632m348l387k680l020l176j964n32n58j543
57902B63582k066k332l333m481m331k935j575p53j33J74j18m56n6R44J998L045
57886B47174L931L915K856J793J417J015K8p49o71n96j354k187k110j600j425
57871B51437j110q7P85N18k22j71O19J389K177L251M108M484N269O961Q283Q033
$$ plain form
57976 302921 301506 300758 301756 303878 305844 307705 310240 313258 316151 319298 323140 326624 328379 328782 329111
57961 329111 329282 328168 325573 322231 318413 314197 310495 308071 306088 303254 299784 296637 293573 289804
57947 289804 285925 283306 282040 281315 281276 282657 285050 287469 290239 294385 299510 304216 308379 313086 318548
57932 318548 323949 329257 335253 341751 347547 352137 355830 358226 358299 356023 352337 347513 341108 333434 325492
57917 325492 317511 309166 301090 294510 289422 284790 280442 277055 274375 271355 268179 266215 265683 265125 263582
57902 263582 261516 259184 255851 251370 247039 244104 242529 241776 241643 241817 241699 241243 241187 242131 244129 247174
57886 247174 251105 255020 257876 259669 261086 262101 262129 261380 260709 260113 258759 256572 254462 252862 251437
57871 251437 250327 250240 251025 251543 251321 251150 251769 253158 255335 258586 262694 267178 272447 279408 287691 295724
57855B95724P099O961P245O770N997O283P333P522O422N084M002K638R27l70r74
57840C68663j452k185k923l406l630l729m098n059n867n119k894j337j882l111
57826C21971k848j269k47l91o52l84n7k0o2j20k32l3O82J221R39L89M06N79r5
57807C19777j448k406k659k814l057k881k103j153m52k27o57j434j685j033k67
57792B95501k05n61p01p32r16p68J42J095J016p6j292j949j742n39J087J984J817
57775B93161J555J813J879J229O59P68O93l21j420j706j950l043m096m005l692
57760B81524m618o053o193n268n067n781n719m150k190p46M42J503K001K070K426
57745B44181L069L369L372L618L825L267K301J927J984J485N96N25J405K084K131
$$ plain form
57855 295724 302823 309784 317029 323799 329796 336079 343412 350934 357356 362440 366442 369080 370007 369637 368663
57840 368663 367211 365026 362103 358697 355067 351338 347240 342181 336314 331195 328301 326964 325082 321971
57826 321971 319123 317854 317607 317216 316564 316180 316123 316103 316041 315921 315689 315656 316338 317559 318498 318887 319293 319872 319777
57807 319777 318329 315923 313264 310450 307393 304512 302409 301256 300804 300577 299920 298486 296801 295768 295501
57792 295501 295296 294735 294034 293302 292386 291618 291760 292855 293871 293795 292503 290554 288812 288273 289360 291344 293161
57775 293161 294716 296529 298408 299637 300296 301064 301757 301436 300016 298310 296360 293317 289221 285216 281524
57760 281524 276906 270853 264660 259392 254325 248544 242825 238675 236485 235739 236181 237684 239685 241755 244181
57745 244181 247250 250619 253991 257609 261434 264701 267002 268929 270913 272398 272994 273519 274924 277008 279139
57730B79139K327K934L199K901K816L268L668L793M126M618M536L836L249K856
57716C27266J980P71L30R01J325P59m13j721l258m720n217m642m012l952l937
57701C01460l558l304l524l739l537l204k925k340j366n76l19k81k55m46p19m63
57685B70904L70R85R05N94P17J471K859M808O879Q682J0715J3878J8133K2616
57671C64516K7131L2424L8719M5010N0147N3728N5614N5246N1650M3642L0431
57660H48258J3025n330k1349l4206m4781n2908n7097n6862n3473m8149m1192l3414
57648D12522k6622k1846j8388j5302j2637j0592q797p053n739m828l700k448k055
57635B72515k653k904j974q76q94j713k184k039j846j905k105k405k756k890k737
$$ plain form
57730 279139 281466 284400 287599 290500 293316 296584 300252 304045 308171 312789 317325 321161 324410 327266
57716 327266 329246 330017 330347 331248 332573 333332 332919 331198 327940 323220 318003 313361 309349 305397 301460
57701 301460 297902 294598 291074 287335 283798 280594 277669 275329 273963 273387 273068 272787 272532 272086 271367 270904
57685 270904 271274 272259 273164 273758 274475 275946 278805 283613 290492 299174 309889 323767 341900 364516
57671 364516 391647 424071 462790 507800 557947 611675 667289 722535 774185 817827 848258
57660 848258 861283 855953 834604 800398 755617 702709 645612 588750 535277 487128 445936 412522
57648 412522 385900 364054 345666 330364 317727 307135 298338 291285 285546 280718 277018 274570 272515
57635 272515 269862 266958 264984 264108 263214 261501 259317 257278 255432 253527 251422 249017 246261 243371 240634
57620B40634k598k651k795l083l537l570k565j136o43j229j665j411j366j995
57606B10390k291j482m59l85j020j442j480j339p49L40R79K20j503k952l546l500
57590A89781l077k488k064j831j348n47j69p04j559j836j479j063j002j404k149
57575A67061k662k350j662j880l327m743m955m283l579k890j910r45m62l66m73
57560A30574j054k108k770k283j055n1L19J54l79q11m24P73J832K174K288K532
57544A29711K356J518R49J363J907J443M07N3N40R67R16O69L00l25q38p61l58
57527A40817k82n65p47o49l52Q6K24p48k637l636k223Q23L347M248L912K897J583
57510A46098P77J139K039K198J448P55N48K30n71j419j908k164k316k274k159
$$ plain form
57620 240634 238036 235385 232590 229507 225970 222400 219835 218699 218056 216827 215162 213751 212385 210390
57606 210390 208099 206617 206158 205773 204753 203311 201831 200492 199743 200083 201062 201282 199779 196827 193281 189781
57590 189781 186704 184216 182152 180321 178973 178426 178257 177553 175994 174158 172679 171616 170614 169210 167061
57575 167061 164399 162049 160387 158507 155180 150437 145482 141199 137620 134730 132820 131875 131413 131047 130574
57560 130574 129520 127412 124642 122359 121304 121253 121572 121726 121347 120536 120112 120885 122717 124891 127179 129711
57544 129711 132067 133585 134534 135897 137804 139247 139654 139707 140247 141214 142130 142799 143099 142774 141936 141175 140817
57527 140817 140535 139970 139223 138574 138222 138308 138532 137784 135147 131511 129288 130111 133458 137706 141618 144515 146098
57510 146098 146875 148014 150053 152251 153699 154454 155002 155232 154661 153242 151334 149170 146854 144580 142421
57495A42421k245k378k169j705j402j261r97p65r37j298j291q68l38L60J314J763
57479A28204P91j108k311k061j233q61r65j183j603k394l289l934m324m525m374
57464I4830l752k826j883j152q27q63q41m32N8J24r2J4N90J130J215Q40O5r79
57446H5219j713j454k70R79J585J508J034M79K99Q15J632J869J212K90j34M8M66
57429I3864Q51J181J500J737J667J148M77K67P27J320J421J013M34k26r36j338
57413A05107j114m87J58R33K047L074L244K465J410O75L15J46k8k99m45j06M15
57396A17510R1j446k987l105k024j110q61n94J9L86K44K89J097K246K990L162
57380A15907K990K618K138J705J359J059Q89Q03K82j041k533l042k411j712j768
$$ plain form
57495 142421 140176 137798 135629 133924 132522 131261 130264 129499 128562 127264 125973 125105 124767 125127 126441 128204
57479 128204 128995 127887 125576 123515 122282 121421 120456 119273 117670 115276 111987 108053 103729 99204 94830
57464 94830 91078 88252 86369 85217 84390 83527 82686 82254 82312 82436 82344 82358 82948 84078 85293 86133 86198 85219
57446 85219 83506 82052 81782 82761 84346 85854 86888 87367 87666 88481 90113 91982 93194 93484 93350 93398 93864
57429 93864 94715 95896 97396 99133 100800 101948 102425 102692 103419 104739 106160 107173 107607 107381 106445 105107
57413 105107 103993 103506 103664 104597 106644 109718 112962 115427 116837 117512 117827 117973 117945 117646 117201 117095 117510
57396 117510 117601 116155 113168 110063 108039 106929 106068 105474 105493 105879 106123 106412 107509 109755 112745 115907
57380 115907 118897 121515 123653 125358 126717 127776 128665 129468 129750 128709 126176 123134 120723 119011 117243
57365A17243k227k354k070j811j831k004k018j579p64j55k14n78n43j35k7l73
57349I8560n85m60o25j513k562k915k459j735j312j569k590l855m366l557j865
57334F6592k51O90R30P32L76k7n14j009j194q94m24j32J58P19J133P58j33n07
57316F7003l4M66L19n5M2M72N60Q2m94o01r3O36R03L31o55j288j329j215j297
57297F3753j390j165n20M68J501K003J591O63k0k96m96n16J60J352K073J838J295
57280G2294J089R69N51K87P84J687K044J573R06O76R50J485K071K525K702K578
57264I5171K217J676J055M55r5n38o13j41N07O05m3p56p95k86Jl81j067j349j024
57245I4599o20p23j138j053j51Q53J113O94K34m1l26n03k17M05Q29R43J050J137
$$ plain form
57365 117243 115016 112662 110592 108781 106950 104946 102928 101349 100585 100430 100216 99638 99095 98960 98933 98560
57349 98560 97975 97515 96890 95377 92815 89900 87441 85706 84394 82825 80235 76380 72014 68457 66592
57334 66592 66341 67031 67961 68693 69069 69042 68528 67519 66325 65431 65007 64875 65033 65752 66885 67643 67510 67003
57316 67003 66969 67435 67754 67699 67741 68213 68773 68855 68361 67760 67667 68303 69206 69537 68882 67594 66265 65050 63753
57297 63753 62363 61198 60678 61146 62647 64650 66241 66904 66884 66588 66092 65576 65736 67088 69161 70999 72294
57280 72294 73383 74352 74903 75190 75974 77661 79705 81278 82184 82860 83810 85295 87366 89891 92593 95171
57264 95171 97388 99064 100119 100574 100479 99941 99328 99187 99694 100299 100256 99500 98705 98419 98420 98039 96972 95623 94599
57245 94599 93979 93256 92118 91065 90914 91767 92880 93574 93808 93767 93441 92938 92721 93126 93955 94898 95948 97085
57227I7085Q47L26K64Q90J620J884J718J346Q70N69Q29J494J927J931J940K148
57211A17688K207K046K141K601K754K167J406J174J386J596J788K072K207J998
57197A45231J780J847J859J458J071J407K380L216L456L296L029K742K568K718
57183A78058L173L647L941M152M456M826N009M765M302M233M978O272P539Q563
57169B47914R375R733R468R199R898J1579J3154J3854J4003J4179J4446J4885
57157C91687J6037J8112K0338K1737K2230K2402K2632K2943K3420K4134K4952
57146F30624K5783K6806K8112K9540L1180L3543L6789M0212M2997M5056M6601
57135A017243M7498M7852M8756N1422N5476N8977O0357N9724N8104N6088N3727
$$ plain form
57227 97085 97932 98258 98522 99412 101032 102916 104634 105980 106850 107419 108248 109742 111669 113600 115540 117688
57211 117688 119895 121941 124082 126683 129437 131604 133010 134184 135570 137166 138954 141026 143233 145231
57197 145231 147011 148858 150717 152175 153246 154653 157033 160249 163705 167001 170030 172772 175340 178058
57183 178058 181231 184878 188819 192971 197427 202253 207262 212027 216329 220562 225540 231812 239351 247914
57169 247914 257289 267022 276490 285689 295587 307166 320320 334174 348177 362356 376802 391687
57157 391687 407724 425836 446174 467911 490141 512543 535175 558118 581538 605672 630624
57146 630624 656407 683213 711325 740865 772045 805588 842377 882589 925586 970642 1017243
57135 1017243 1064741 1112593 1161349 1212771 1268247 1327224 1387581 1447305 1505409 1561497 1615224
57124A615224N1385N0100N1025N4697O0662O7512P3361P6762P7659P7507P8290
57113B334184Q1215Q6276R2730R9823J07261J15469J25372J37678J52580J70518
57103C503106J92869K21271K56810L01081L57900M32757N30879O57586Q20518
57094G274777J028824J288441J598948J954457K343735K747409L138644L491360
57086B4866595L788811M024258M196964M309900M365709M356003M252779M015342
57078E8176361L609318L021436K264399J377976M23815n35376j461826k344555
57070F4531548l170073l895735m458795m810183m936427m856104m607393m239954
57062B9556884l806937l353752k911253k497893k124388j795448j511233j270368
$$ plain form
57124 1615224 1666609 1716709 1767734 1822431 1883093 1950605 2023966 2100728 2178387 2255894 2334184
57113 2334184 2415399 2501675 2594405 2694228 2801489 2916958 3042330 3180008 3332588 3503106
57103 3503106 3695975 3917246 4174056 4475137 4833037 5265794 5796673 6454259 7274777
57094 7274777 8303601 9592042 11190990 13145447 15489182 18236591 21375235 24866595
57086 24866595 28655406 32679664 36876628 41186528 45552237 49908240 54161019 58176361
57078 58176361 61785679 64807115 67071514 68449490 68873305 68337929 66876103 64531548
57070 64531548 61361475 57465740 53006945 48196762 43260335 38404231 33796838 29556884
57062 29556884 25749947 22396195 19484942 16987049 14862661 13067213 11555980 10285612
57054A0285612j070932r08509p76174o67729n79228n06936m46368l94496l50648
57045D584592l14088k82564k54221k28958k06754j86376j66882j48808j32765
57036B663176j18291j04963r3151q2767p2753o2634n3118m4364l5321k5664j6549
57025A953601q476n06O804R560L834j0019k7962m6146o2555p5809q4605q8474
57013A569247q7830q3327p6040o7800o0187n3432m7033m1039l5856l1458k7764
57002I57481k5275k4263k3842k2968k1894k1498k1562k1039j9828j8943j8788
56991G17581j8440j7028j4819j2497j0156p502m540j591J084L282M598M475K580
56978F47027q55n031r007j2244j4747j6729j8282j9280j9367j8081j5313j1697
$$ plain form
57054 10285612 9214680 8306171 7529997 6862268 6283040 5776104 5329736 4935240 4584592
57045 4584592 4270504 3987940 3733719 3504761 3298007 3111631 2944749 2795941 2663176
57036 2663176 2544885 2439922 2346771 2264004 2191251 2128617 2075499 2031135 1995814 1970150 1953601
57025 1953601 1945125 1944619 1951423 1960983 1964817 1954798 1926836 1880690 1818135 1742326 1657721 1569247
57013 1569247 1481417 1398090 1322050 1254250 1194063 1140631 1093598 1052559 1016703 985245 957481
57002 957481 932206 907943 884101 861133 839239 817741 796179 775140 755312 736369 717581
56991 717581 699141 682113 667294 654797 644641 637139 632599 631008 632092 635374 639972 644447 647027
56978 647027 646172 641141 632134 619890 605143 588414 570132 550852 531485 513404 498091 486394
56966D86394q199n285k725j24K771O186J0151J4096J7209J9254K0491K0683J8885
56953E99787J4536Q179Q28o801j4098k0206k4391k6470k6615k5051k2192j8625
56941D38881j4711j0523o299k513P23L874P417J1422J5799K0352K4485K7387K8624
56928E44918K7996K4720J7739P344m279j4646k2717k8644l2528l4168l3690l1676
56916D20369k8711k5196k1530j8110j5192j2827j0890r129p463o177n484n029
56904B54631m266l250k541k301k081j498n80N51J724K525K733K862L609M891O227
56889B63236P847J0324J3149J5001J5605J5936J6190J5029J1525O647J884k515
56877C89858o871j0667j2947j3601j3215j2037r956p054l494O93N124Q969J2042
$$ plain form
56966 486394 478195 472910 470185 470061 472832 479018 489169 503265 520474 539728 560219 580902 599787
56953 599787 614323 622502 623330 616529 602431 582225 557834 531364 504749 479698 457506 438881
56941 438881 424170 413647 407348 404835 405558 409432 416849 428271 444070 464422 488907 516294 544918
56928 544918 572914 597634 615373 622717 618438 603792 581075 552431 519903 485735 452045 420369
56916 420369 391658 366462 344932 326822 311630 298803 287913 278784 271321 265144 259660 254631
56904 254631 250365 247115 244574 242273 240192 238694 238114 238665 240389 242914 245647 248509 252118 257009 263236
56889 263236 271083 281407 294556 309557 325162 341098 357288 372317 383842 390489 392373 389858
56877 389858 382987 372320 359373 345772 332557 320520 310564 303510 300016 300709 305833 314802 326844
56864C26844J5413K0042K5329K9905L3377L6319L8615L8783L5119K7177J6232
56853F43155M545n992j4875k2463k8525l1904l1844k8898k4193j8446j2086n556
56841D22918J083Q257J6078K4050L1891L9816M7511N3761N7719N9484N8606N3150
56829H74324M1583K5111O946j0321k5725l8880m9233n6285n9673n9014n4431m7039
56817E47363l8340k9245k0136j1336k937N389J3672K1241K7595L3183L8453M2531
56805F27433M3559M0137L2006K0051O251p081j8834k9382l8757m5459m7973m6643
56793E35308m2948l7734l1341k4712j8839j3521p946k235K850P308J1657J5595
56781C93442J8336J9981K1142K1260J8727J2944N055l404j1492j8484k3766k7392
$$ plain form
56864 326844 342257 362299 387628 417533 450910 487229 525844 564627 599746 626923 643155
56853 643155 647700 641708 626833 604370 575845 543941 512097 483199 459006 440560 428474 422918
56841 422918 424001 432258 448336 472386 504277 544093 591604 645365 703084 762568 821174 874324
56829 874324 915907 941018 947964 937643 911918 873038 823805 767520 707847 648833 594402 547363
56817 547363 509023 479778 459642 448306 445369 450758 464430 485671 513266 546449 584902 627433
56805 627433 670992 711129 743135 763186 769437 762356 743522 714140 675383 629924 581951 535308
56793 535308 492360 454626 423285 398573 379734 366213 358267 356032 358882 366190 377847 393442
56781 393442 411778 431759 452901 474161 492888 505832 510887 507483 495991 477507 453741 426349
56769D26349k9706l0417k9010k6068k2994k0364j7713j4973j2833j1438j0015
56758B00818q187o551n505m603l487k493j915j489j088j059j468j783j666j376
56744A58148j071n58j5j27j001j756j638q87j75J85J20l81r10p74J30J105J583
56727A51978J680J623J392J205J556K329K612J892Q40L75N33P86R37J077J066
56712A71881P04K10N6M16J038J570J785J641J278R14O79O94J092J734K061J673
56696A89426Q73K34k60j037k039k602k327j526p41k86k68n48o87l34K93P72J124
56679A80067J680K390K844K827K347J292k33j510j805j376j114j264j235o87p6
56664A84147L0l84q93j039o54j33j42o43p31N5Q67Q19M15O00J023O61k00j98Q73
$$ plain form
56769 426349 396643 366226 337216 311148 288154 267790 250077 235104 222271 210833 200818
56758 200818 192631 186080 180575 175972 172485 169992 168077 166588 165500 164441 162973 161190 159524 158148
56744 158148 157077 156519 156504 156377 155376 153620 151982 151095 150920 151105 151225 150844 149934 149160 149290 150395 151978
56727 151978 153658 155281 156673 157878 159434 161763 164375 166267 167107 167482 168015 168801 169738 170815 171881
56712 171881 172585 172795 172851 173267 174305 175875 177660 179301 180579 181493 182172 182866 183958 185692 187753 189426
56696 189426 190299 190533 190273 189236 187197 184595 182268 180742 180001 179715 179447 178899 178212 177878 178171 178943 180067
56679 180067 181747 184137 186981 189808 192155 193447 193214 191704 189899 188523 187409 186145 184910 184223 184147
56664 184147 184177 183793 182900 181861 181207 181074 180932 180289 179558 179613 180480 181299 181714 182314 183337 183998 183798 183600 184473
56645A84473J631J248N16L94O80P14M19M0l42n80m73k58l52n80l94M7N2l85n45
56626A86305k97k66n69n53j07j0n91j173j308j397j678j698j268r08q20m75K81
56609A73468P68O13L03J51j85o89o29J35O42K70l79o45p27q29n97r0j60r42j208
56590A69270j91J116J506J330J493J754J322M02j55j94p1K99J056J610J327O63
56574A82537N19R49J387J740K234K629K621K646L301M262M791N046N871P454R094
56559B37081J0282J1140J1756J1717J0537Q191N218K493N77q06k293l726m244
56546B97923l715l207l515m105m143l749l427l040k273j517j344j625j961k477
56532B57825l341m012l910l343k984k793k311j615j141q77n55l29n51j082j520
$$ plain form
56645 184473 186104 187352 187868 188262 188942 189656 190075 190115 189773 189193 188720 188462 188110 187530 187136 187183 187235 186850 186305
56626 186305 186008 185742 185173 184620 184513 184503 183912 182739 181431 180034 178356 176658 175390 174482 173662 173187 173468
56609 173468 174236 174849 175152 175303 175118 174429 173800 173935 174577 174847 174468 173823 173096 172267 171670 171580 171420 170478 169270
56590 169270 169079 170195 171701 173031 174524 176278 177600 178002 177847 177653 177582 177881 178937 180547 181874 182537
56574 182537 183056 184005 185392 187132 189366 191995 194616 197262 200563 204825 209616 214662 220533 227987 237081
56559 237081 247363 258503 270259 281976 292513 300704 305922 308415 308992 308186 305893 302167 297923
56546 297923 294208 291001 287486 283381 279238 275489 272062 269022 266749 265232 263888 262263 260302 257825
56532 257825 254484 250472 246562 243219 240235 237442 235131 233516 232375 231498 230943 230614 230063 228981 227461
56517B27461j751j744j281n54m57j416k467k369j301n70q44j541j815j422o71
56502B07258n3J45J30K68M21J23m53n82k60l43r87j150l68K68n0l52M06J318Q62
56483B06601n39j106m46J15j86o66p01o26p23n73J11R27J438J675J695J307N11
56466B08814k55n55l10K03N00J80n45r60p38l05o6J66N37P06N40N23Q51R78O85
56447B10949P50J598K272J796P65M21P93R99Q11O75O41M28J79O1l37j196j690
56430B19915j223o63r61j295k99J411J882P90j81l9L05l0m71j92N51J070J285
56413B21855J427J425J156Q10O16N91O53O37L56o9j80R2J25l94q30n64N3N18J067
56394B29344J791J798N59p78q86l84o54j236m50J561K593J498l49j184q97k97
$$ plain form
56517 227461 225710 223966 222685 222131 221674 220258 217791 215422 214121 213551 212707 211166 209351 207929 207258
56502 207258 207205 207350 207480 207748 208169 208292 207839 207257 206997 206654 205667 204517 204149 204417 204367 204015 204421 205739 206601
56483 206601 206062 204956 204510 204625 204439 203773 203072 202446 201723 201150 201261 202188 203626 205301 206996 208303 208814
56466 208814 208559 208004 207694 207897 208397 208577 208032 207072 206334 206029 205963 206129 206666 207372 207912 208435 209286 210264 210949
56447 210949 211699 213297 215569 217365 218130 218551 219344 220343 221154 221829 222470 222898 223077 223138 222801 221605 219915
56430 219915 218692 218029 217068 215773 215474 216885 218767 219557 219376 219337 219642 219612 219141 218949 219500 220570 221855
56413 221855 223282 224707 225863 226673 227289 227880 228533 229170 229526 229457 229277 229369 229494 229100 228270 227706 227759 228277 229344
56394 229344 231135 232933 233492 232714 231828 231444 230790 229554 229104 230665 233258 234756 234407 233223 232326 232029
56378B32029L02J005J752K387K613J939M73m44M41K362L246K367R87K69nl25m80
56361B50918k81j43l21m58k73K8L10P46J263J526J510J426J168O23L22Q18J597
56344B60779J664J020N61O62J002J576K590L487L369K413J732J781K106K454K922
56329B90118L115K541J829K117L275M046L945L645L495L131K566K240J907R00
56315C28870m36j008p38n87p68n17L83J304K098L054L649L076K077K346L895M974
56299C51672M837M549M680M348L283K713L279L928L866L823M414M937M882N028
56285D10239N885O533O232N878O613Q033Q886Q676P663O346N623O524Q834J0976
56271E12941J1836J1871J1933J2132J2496J3535J5448J7620J9519K1252K3025
$$ plain form
56378 232029 232331 233336 235088 237475 240088 242027 242500 242056 242497 244859 248105 250472 251459 251728 251723 251398 250918
56361 250918 250637 250494 250173 249715 249442 249470 249780 250526 251789 253315 254825 256251 257419 258042 258364 259182 260779
56344 260779 262443 263463 264024 264686 265688 267264 269854 273341 276710 279123 280855 282636 284742 287196 290118
56329 290118 293233 295774 297603 299720 302995 307041 310986 314631 318126 321257 323823 326063 327970 328870
56315 328870 328434 327426 326688 326101 325333 324816 325199 326503 328601 331655 335304 338380 340457 342803 346698 351672
56299 351672 356509 361058 365738 370086 373369 376082 379361 383289 387155 390978 395392 400329 405211 410239
56285 410239 416124 422657 428889 434767 441380 449413 458299 466975 474638 480984 486607 493131 501965 512941
56271 512941 524777 536648 548581 560713 573209 586744 602192 619812 639331 660583 683608
56260F83608K4982K7666L1492L5788L9705M3967N0033N7587O4873P1696P9781
56249A211178Q9645R9440J07879J16039J25042J33866J40879J45801J48866J49521
56239B468156J47282J42516J35163J24069J08665R0086O9607M7419K3817J63k2456
56228C334487m4132o4702q2838r7572j09336j18536j24630j27578j28587j28332
56218B308244j25994j21188j15251j09431j03374r6678r0310q5060q0067p4319
56208A306572o8375o3196n8554n3840m9318m5341m1538l7780l4730l2394k9642
56197G91864k6110k3013k1034j9081j6405j4110j3126j2394j0696q744p771p379
56185F12001o508n317m558m109l524l007k672k019j106r09j508j497j87J226J856
$$ plain form
56260 683608 708590 736256 767748 803536 843241 887208 937241 994828 1059701 1131397 1211178
56249 1211178 1300823 1400263 1508142 1624181 1749223 1883089 2023968 2169769 2318635 2468156
56239 2468156 2615438 2757954 2893117 3017186 3125851 3215937 3285544 3332963 3356780 3356943 3334487
56228 3334487 3290355 3225653 3142815 3045243 2935907 2817371 2692741 2565163 2436576 2308244
56218 2308244 2182250 2061062 1945811 1836380 1733006 1636328 1546018 1460958 1380891 1306572
56208 1306572 1238197 1175001 1116447 1062607 1013289 967948 926410 888630 853900 821506 791864
56197 791864 765754 742741 721707 702626 686221 672111 658985 646591 635895 627151 619380 612001
56185 612001 605493 600176 595618 591509 587985 584978 582306 580287 579181 578272 576764 575267 575080 576306 578162
56170E78162K540L878M734M283L694M220N252N825O364P350Q051Q086Q525R821
56156F60785J0544R818R136R968J1439J2270J3113J4997J7264J9152K1743K6318
56144H36547L2300L8686M5828N4041O2223O9676P7367Q5519R2051R5394R6611
56133A586243R6618R3718Q6470P6786O7499N8942N0540M3564L9121L5260K9278
56122B264039K1421J3469N376l741j2858k0504k7600l5977m5374n4669o4398p5075
56110A964109q4562r0322r2945r4405r4239r0605q3797p5581o6366n6061m6356
56099A088870l8966l2898k6526k0874j7678j5691j2455q395n695m360k836j346
56087I01150j080j183NJ778K412K497L583M909M900M527N577P012O817O057P149
$$ plain form
56170 578162 580702 584580 589314 593597 597291 601511 606763 612588 618952 626302 634353 642439 650964 660785
56156 660785 671329 681147 690283 700251 711690 723960 737073 752070 769334 788486 810229 836547
56144 836547 868847 907533 953361 1007402 1069625 1139301 1216668 1302187 1394238 1489632 1586243
56133 1586243 1682861 1776579 1863049 1939835 2007334 2066276 2116816 2160380 2199501 2234761 2264039
56122 2264039 2285460 2298929 2304305 2300564 2287706 2267202 2239602 2203625 2158251 2103582 2039184 1964109
56110 1964109 1879547 1789225 1696280 1601875 1507636 1417031 1333234 1257653 1191287 1135226 1088870
56099 1088870 1049904 1017006 990480 969606 951928 936237 923782 915387 909692 905332 902496 901150
56087 901150 900070 898887 898892 900670 903082 905579 909162 914071 918971 923498 929075 936087 942904 948961 956110
56072I56110R399J0265R943J0668J2430J3441J3859J5140J6639J6687J6111J6814
56060A117506J8011J7607J6110J5355J4806J3100J1588J2122J3046J1928J0365
56049A271544J1297J3369J3257J1944J3022J6063J7488J7073J7814J9943K0765
56038A443579K0053K0139K1061K0921K0534K2379K5498K6779K6589K7877L0551
56027A705960L2261L3556L6567L9718L9841L8334L8974M0925M0605L9185M1043
56016B126969M5712M8700M9623N2041N5897N7744N8106O0835O5487O8032O8881
56005B758027P2240P7860Q1573Q3694Q8525R5726J00829J04127J10224J18882
55995C691707J25392J29875J37016J46723J54637J61616J72810J87546K00392
$$ plain form
56072 956110 965509 975774 985717 996385 1008815 1022256 1036115 1051255 1067894 1084581 1100692 1117506
56060 1117506 1135517 1153124 1169234 1184589 1199395 1212495 1224083 1236205 1249251 1261179 1271544
56049 1271544 1282841 1296210 1309467 1321411 1334433 1350496 1367984 1385057 1402871 1422814 1443579
56038 1443579 1463632 1483771 1504832 1525753 1546287 1568666 1594164 1620943 1647532 1675409 1705960
56027 1705960 1738221 1771777 1808344 1848062 1887903 1926237 1965211 2006136 2046741 2085926 2126969
56016 2126969 2172681 2221381 2271004 2323045 2378942 2436686 2494792 2555627 2621114 2689146 2758027
56005 2758027 2830267 2908127 2989700 3073394 3161919 3257645 3358474 3462601 3572825 3691707
55995 3691707 3817099 3946974 4083990 4230713 4385350 4546966 4719776 4907322 5107714
55986E107714K11838K27318K46279K63536K80650L03928L31932L57762L82980
55977G713937M15666M55441M94969N35597N86069O46381P09472P78433Q64540
55968A3200505R68709J083673J214236J375637J572747J802853K078964K428403
55960B5725727K871081L425202M132556N052002O234367P732448R616183J1924800
55952G6714366J4608639J7566303K0714207K3936221K6982676K9532603L1328297
55945B41383312L2028691L0857506K6722765J9109449Q909160j901359j1549591
55938C45559933j9358647k5420926k9745394l2006438l2004882l0064608k6897352
55931A50061686k3224469j9569728j6249292j3402514j1033673r089616p517880
$$ plain form
55986 5107714 5319552 5546870 5793149 6056685 6337335 6641263 6973195 7330957 7713937
55977 7713937 8129603 8585044 9080013 9615610 10201679 10848060 11557532 12335965 13200505
55968 13200505 14169214 15252887 16467123 17842760 19415507 21218360 23297324 25725727
55960 25725727 28596808 32022010 36154566 41206568 47440935 55173383 64789566 76714366
55952 76714366 91323005 108889308 129603515 153539736 180522412 210055015 241383312
55945 241383312 273412003 304269509 330992274 350101723 359010883 357109524 345559933
55938 345559933 326201286 300780360 271034966 239028528 207023646 176959038 150061686
55931 150061686 126837217 107267489 91018197 77615683 66582010 57492394 49974514
55924D9974514o262675n253140m427993l754363l208063k756855k376060k059184
55916A9876181j799567j579004j384687j219370j084372r68574q63302p72508
55908A0204797o99085o35215n74727n21768m79270m40997m02421l68138l41476
55899E741700l17422k92166k69512k51922k34936k16031j99666j88203j76818
55890C595024j62416j49015j39454j30160j18806j08995j02827r6577q8110q1100
55880B417564p7727p4548o9562o6142o6009o5419o2246n9909o0403o0204n7013
55869A698382n3920n2988n1107m6311m1961m0504l8990l4796l0312k8051k6427
55858A253015k4192k3757k6380k8935k9206k9526l1747l3357l2167l0266k9831
$$ plain form
55924 49974514 43711839 38458699 34030706 30276343 27068280 24311425 21935365 19876181
55916 19876181 18076614 16497610 15112923 13893553 12809181 11840607 10977305 10204797
55908 10204797 9505712 8870497 8295770 7774002 7294732 6853735 6451314 6083176 5741700
55899 5741700 5424278 5132112 4862600 4610678 4375742 4159711 3960045 3771842 3595024
55890 3595024 3432608 3283593 3144139 3013979 2895173 2786178 2683351 2586774 2498664 2417564
55880 2417564 2339837 2265289 2195727 2129585 2063576 1998157 1935911 1876002 1815599 1755395 1698382
55869 1698382 1644462 1591474 1540367 1494056 1452095 1411591 1372601 1337805 1307493 1279442 1253015
55858 1253015 1228823 1205066 1178686 1149751 1120545 1091019 1059272 1025915 993748 963482 933651
55847I33651k9350k7323k5464k5046k4218k1928k0360k0626k0262j7841j5743
55836F85490j5498j4902j2744j1770j3583j4977j3034r856q510q067o412m536
55824E51601m246m626m253m169n405o442o091o105p905r600r135p682o985o127
55810D62830l841j388l02L16J592K557K506L098N380P389P255O212N985N707M098
55795E09394K196J224M7k638n805q113j0130j2197j2619j0503p958o982o484m951
55781D24481l588m030n176n109m207l667k827n87K260M517O744R714J2491J4006
55767D45022J4558J3863J0083L038m058q578j1797j5714j9134j9938j8956j8306
55755C70083j7693j5654j2925j1409j0918r952q546p692p000n597m205l920m041
$$ plain form
55847 933651 904301 876978 851514 826468 802250 780322 759962 739336 719074 701233 685490
55836 685490 669992 655090 642346 630576 616993 602016 588982 579126 570616 562549 556137 551601
55824 551601 547355 542729 538476 534307 528902 522460 516369 510264 502359 492759 483624 475942 468957 462830
55810 462830 458989 457601 457299 457615 459207 461764 464270 467368 472748 480137 487392 493604 499589 505296 509394
55795 509394 511590 512814 512861 510223 504418 496305 486175 473978 461359 450856 442898 435916 429432 424481
55781 424481 420893 416863 411687 406578 402371 398704 395877 395290 397550 402067 408811 418525 431016 445022
55767 445022 459580 473443 483526 486564 482506 473928 462131 446417 427283 407345 388389 370083
55755 370083 352390 336736 323811 312402 301484 291532 282986 275294 268294 262697 258492 254572 250531
55742B50531l439k873l535m620m703m271m471m639l620k285k146k593k048q52
55728B04436m93r34j158j358k213k933k473j712k042k735k226j044q97j588j498
55713A79132n09P9J28P07J863K627K908L326L490K530R28j14o73j612k571k550
55697A89689j974k182l186l821l739l463k919j720n03j85l19J96J270K069K613
55682A71826L320L645K988K153K160K441J973J331J572K026J357P5l02K6l99j583
55666A94609k175j923j816j956j472m60J16L09J063K266K906K991L366L828L391
55651B05043K317J858K066J757O60l75j193k445l894m528m433m751n665o196o017
55636A74204n769n529m813l972l816l875k961j414q00j256j257k16P09P71O59
$$ plain form
55742 250531 247092 244219 240684 236064 231361 227090 222619 217980 214360 212075 209929 207336 205288 204436
55728 204436 203943 203009 201851 200493 198280 195347 192874 191162 189120 186385 184159 183115 182218 180630 179132
55713 179132 178623 178702 178830 179537 181400 184027 186935 190261 193751 196281 197209 197095 196422 194810 192239 189689
55697 189689 187715 185533 182347 178526 174787 171324 168405 166685 166182 165997 165678 165874 167144 169213 171826
55682 171826 175146 178791 181779 183932 186092 188533 190506 191837 193409 195435 196792 196867 196565 196591 196192 194609
55666 194609 192434 190511 188695 186739 185267 184807 184923 185232 186295 188561 191467 194458 197824 201652 205043
55651 205043 207360 209218 211284 213041 213701 213326 212133 209688 205794 201266 196833 192082 186417 180221 174204
55636 174204 168435 162906 158093 154121 150305 146430 143469 142055 141255 139999 138742 138526 139235 140006 140665
55621A40665Q04O11m1k41L13O63J16r04j950l111m114m231l493k664j858n85P08
55604A20688Q82Q3k79P5k24j660k705k142r29n99j124j493j387j140p66p4P05
55587A07911J083P82j74j375j986j447k64O45J211J924K545K347J602J424K036
55572A18264K565K714L214M215M743M327L849M063M369L893K768J590M14r30k110
55557A57948k619k483k175k161k603l205l326k677j811j354j131p60o03j075j486
55542A28479q19M84J019O25O22J604K440J991N96o57j226j205r97j171j876k363
55526A27546j926j233j529k640l119k541k104k565l046k562j545j022j196j557
55512I8961j731j598j218r22j001j182j085r96j372j740j291l82j25m65k76N20
$$ plain form
55621 140665 141469 142080 142039 141798 142111 142774 142890 141986 140036 136925 132811 128580 125087 122423 120565 119980 120688
55604 120688 121570 121653 121374 121449 121225 119565 116860 114718 113789 113190 112066 110573 109186 108046 107280 107206 107911
55587 107911 108994 109776 109602 108227 106241 104794 104530 105175 106386 108310 110855 113202 114804 116228 118264
55572 118264 120829 123543 126757 130972 135715 140042 143891 147954 152323 156216 158984 160574 160988 160058 157948
55557 157948 155329 152846 150671 148510 145907 142702 139376 136699 134888 133534 132403 131643 131040 129965 128479
55542 128479 127660 128144 129163 129788 130410 132014 134454 136445 137041 136384 135158 133953 132956 131785 129909 127546
55526 127546 125620 124387 122858 120218 117099 114558 112454 109889 106843 104281 102736 101714 100518 98961
55512 98961 97230 95632 94414 93492 92491 91309 90224 89228 87856 86116 84825 84443 84318 83853 83577 84097
55496H4097N97n05j414j011J1N47P37J189J623J401O50pk17J69J192K179K035
55479I3273P32l19l7R73J538J436J113O83R3l72n09o99j296k027k501k766k862
55462H6453k460j484n10m3J19L36N28N31M75M03O0n12p92n51k54l23n78o67n11
55443H0220r4N62J097J142J008J261J639J359N20P5K46K50j28r2N81R31N27L51
55425I1455J052J584P83p41j535j353j059j064r97o18q7M32P61O57K51Q7K92K80
55407I0180j77m42j26J29k95r60j185j081r83o21J21M36k83j185j013PO27N56
55389H3705O89J390J859J472P65O21J109J543J321M38n92j191j189q73n95m62
55373I0010m91o48p23n06k01j82k83R2R55J456R59j55j087j454j314r32p92j231
$$ plain form
55496 84097 84694 84189 82775 81764 81775 82322 83059 84248 85871 87272 87922 87915 87698 87867 89059 91238 93273
55479 93273 94005 93686 93649 94622 96160 97596 98709 99392 99485 99113 98604 97905 96609 94582 92081 89315 86453
55462 86453 83993 82509 81999 81956 82075 82411 82939 83470 83945 84348 84408 83896 83104 82553 82299 81976 81398 80731 80220
55443 80220 80126 80688 81785 82927 83935 85196 86835 88194 88714 88789 89035 89285 89157 89065 89646 90577 91104 91455
55425 91455 92507 94091 94874 94133 92598 91245 90186 89122 88125 87507 87420 87852 88613 89270 89521 89608 89900 90180
55407 90180 90003 89561 89435 89564 89269 88309 87124 86043 85060 84439 84560 84996 84713 83528 82515 82522 83149 83705
55389 83705 84394 85784 87643 89115 89880 90501 91610 93153 94474 94912 94320 93129 91940 91067 90472 90010
55373 90010 89519 88871 88148 87642 87441 87259 86976 87068 88023 89479 90438 90283 89196 87742 86428 85496 84704 83473
55355H3473j776j544m66M93O46L05o3m27o38k59M89O03k12q95n76J91M74M00N78
55336H0796Q85Q37N43L47J30k56l96m5J94j98p12o92n49r45j438j079k2P26Q39
55317G8965Q14P55K28o51j024m75L92P24K55o21j131o84M21J104P96K10K44O63
55299H0985O08L5k93M3P71J452J664J008k99j201r64k39p7l30p2P38J188R50O93
55280H6660Q60J084R62N82P9n43j010r23m10k3N3J07J98R2j65k49j68j73j65J68
55260H7016O34P48N67N45O23L54j16j72J53J43l53o75n62n30o87l03P89J390M90
55241I0054j157k013j801j474j470j141r6R02R30J73l28k4O04Q22N15J29N1K92
55223H4968O31P78N02j20n98n61k91l31o11n45o9J13l74q63n74K78Q98J032J042
$$ plain form
55355 83473 81697 80153 79687 80180 80826 81131 81068 80641 80003 79744 80233 80836 80624 79729 79153 79344 79818 80218 80796
55336 80796 81681 82518 83061 83408 83538 83282 82886 82841 83035 82837 82125 81433 80884 79939 78501 77422 77400 78126 78965
55317 78965 79779 80534 80762 80111 79087 78612 79004 79728 79983 79362 78231 77547 77968 79072 79868 80078 80322 80985
55299 80985 81593 81628 81335 81378 82149 83601 85265 86273 85974 84773 83809 83570 83493 83163 83091 83829 85017 85967 86660
55280 86660 87520 88604 89566 90148 90227 89684 88674 87751 87341 87318 87371 87478 87676 87768 87603 87354 87186 87013 86848 87016
55260 87016 87650 88398 88965 89510 90133 90487 90371 90199 90352 90495 90142 89467 88905 88375 87688 87385 88174 89564 90054
55241 90054 88897 86884 85083 83609 82139 80998 80902 81804 82734 82907 82579 82555 83159 83981 84496 84625 84676 84968
55223 84968 85599 86377 86879 86759 86161 85600 85309 84978 84367 83822 83753 83866 83492 82629 82055 82333 83231 84263 85305
55204H5305J117J061P54L07j63n00m16J10N11K67l13m47PL77J84k20k37J58M05
55185H8267O4o61j150j032n18K9N89J221J517R69j89j116j424j403j177m46O12
55168H4152J186J059J049J611J907J121j25o53l89j14rL54R43J215J085R37Q30
55151I6159N05N8j57k15m16n94m40k57n62j070j045n18k43m45n56l01p9j25r2
55132H9607L09R09J478J869J755Q97k07o58k78J84R3m03p81p12j74M71N43k51
55114I4651j270j616j224p25m19j89j00k33r7Q07J872J931J007M13Q76J532J279
55097I8495K10p79j146r59n75m26o48o94J16J449K064J322Rp05n32N5O17R39Q82
55078I9694N39L16N31J035J394J301Q27M30N61J079J219N65l50q35j028j416j761
$$ plain form
55204 85305 86422 87483 88237 88544 88381 87881 87465 87575 88086 88353 88040 87593 87600 87977 88161 87941 87704 87862 88267
55185 88267 88331 87670 86520 85488 84970 84999 85588 86809 88326 89295 89106 87990 86566 85163 83986 83540 84152
55168 84152 85338 86397 87446 89057 90964 92085 91960 91307 90918 90804 90795 91149 92092 93307 94392 95329 96159
55151 96159 96664 96722 96565 96350 95934 95340 94900 94643 94081 93011 91966 91448 91205 90760 90204 89903 89824 89699 89607
55132 89607 89916 90825 92303 94172 95927 96824 96617 95959 95681 95865 95958 95555 94774 94062 93888 94359 94902 94651
55114 94651 93381 91765 90541 89816 89397 89208 89108 88875 88778 89585 91457 93388 94395 94808 95684 97216 98495
55097 98495 98705 97926 96780 95821 95246 94820 94172 93478 93594 95043 97107 98429 98438 97733 97201 97256 97873 98812 99694
55078 99694 100233 100549 101080 102115 103509 104810 105637 106067 106628 107707 108926 109491 109141 108306 107278 105862 104101
55061A04101j413m96J55K08O9k5k23l69j02K86K8q49j466j401j109q21j64P84
55043I7193J151N44k58m22j06J59K90L38Q6m64q19o93l88j53J58M42K21l80l90
55024I6509N79J566J563Q98N29N99N31P8m72q76j018p38r8M98P90R46R84N46l90
55005A03024j118j050m29K01O65Q81O38J82K97J131J674J189M24M75J074J049
54989A10307R6r49j412j361r66k70M47P88P82P12N05n2o95r49q75q44o69J88J519
54970A06302K276J819O68j95l07J05N32N65K30J8L03P97Q79L96k92r55j637k151
54952A09353j959q59N97J595J749J211L91l03n29j75N51J155J160M89l74p46m20
54935A12886J92N61N70M48M27N72Q67J298J900K685L411L641L338L230M064N577
$$ plain form
55061 104101 102688 102192 102347 102555 102624 102599 102376 102007 101905 102191 102219 101370 99904 98503 97394 96573 96409 97193
55043 97193 98344 98888 98630 98208 98102 98261 98551 98889 98975 98511 97692 96999 96611 96458 96616 97058 97279 96899 96509
55024 96509 97088 98654 100217 101115 101644 102243 102774 102852 102380 101504 100486 99748 99650 100148 100938 101884 102868 103414 103024
55005 103024 101906 100856 100427 100628 101293 102174 102812 102994 103291 104422 106096 107285 107709 108184 109258 110307
54989 110307 110403 109454 108042 106681 105715 105445 105892 106680 107462 108174 108679 108627 107932 106983 106108 105264 104595 104783 106302
54970 106302 108578 110397 111065 110870 110563 110668 111200 111765 111995 112013 112316 113113 113992 114388 114096 113141 111504 109353
54952 109353 107394 106535 107132 108727 110476 111687 112078 111775 111246 111071 111622 112777 113937 114426 114052 113306 112886
54935 112886 113078 113639 114209 114657 115084 115656 116523 117821 119721 122406 125817 129458 132796 136026 140090 145667
54919A45667O717O931O649O343N778M531K716P92r53k434l624m619n533o127o009
54904A56825n285m507l845l073k473k799l860m137k630l32R91R35L98l0m90r08
54888A24780p71RQ38J247J337J449J881K889M381N673O137O067O312O985P237
54873A76451O369M668K891J399L5j443l012m303m905m844m671m826n097m978m410
54858A49324l765l299l012k876k824k631k182j738j560j441j070o81p61j217j400
54843A18867j021n55n33r31j382j693j870j929j846j575j033j93P65J463J590
54828A08124J144M70K7L8K90M07K65Jk41k79J76J082J658J124j33q43m64K45M97
54809A13588M69N31M28o0l87j8N91O11M4m95p78r69r40m74K01P42J283J910K002
$$ plain form
54919 145667 152384 159315 165964 172307 178085 182616 185332 186124 185171 182737 179113 174494 168961 162834 156825
54904 156825 151540 147033 143188 140115 137642 134843 130983 126846 124216 123884 124875 125810 126208 126178 125688 124780
54888 124780 124009 124018 124856 126103 127440 128889 130770 133659 138040 143713 149850 155917 162229 169214 176451
54873 176451 182820 187488 190379 191778 191813 190370 187358 183055 178150 173306 168635 163809 158712 153734 149324
54858 149324 145559 142260 139248 136372 133548 130917 128735 126997 125437 123996 122926 122245 121484 120267 118867
54843 118867 117846 117291 116758 115827 114445 112752 110882 108953 107107 105532 104499 104306 105071 106534 108124
54828 108124 109268 109738 109765 109803 110093 110500 110765 110766 110525 110246 110422 111504 113162 114286 114153 113310 112846 113091 113588
54809 113588 114057 114588 115016 114956 114569 114551 115142 115753 115797 115302 114524 113555 112615 112141 112342 113084 114367 116277 118279
54790A18279J011m04j025o68j55J47N60J038J036O12N60J111J526J311R37R70
54774A26846J280J593K027K663L170L394L681M254M797N091N425N953O166N536
54760A81876M281K989J870P50m80j845l367m814n684n764n440n160m925m528l980
54745A45779l315k356j142k69l70j325k314k538j712j67J236J549N96p14j283
54730A31655r42l09K65J126K588M329N766O700P210P171O388N206M425M286L935
54715A89799K433L9k074l259l922m527m912m921m944n289n544n265m820m783m773
54700A33238l848j963k13M76K57k03n43p17p14n42l10j41j99o86j442j772j166
54683A19512j37K94o5l82j00K80Jq44j514j558j164p41m57j86K24O72Q83Q02P09
$$ plain form
54790 118279 119290 118886 117861 117193 117038 117185 117745 118783 119819 120431 120991 122102 123628 124939 125876 126846
54774 126846 128126 129719 131746 134409 137579 140973 144654 148908 153705 158796 164221 170174 176340 181876
54760 181876 186157 189146 191016 191766 191286 189441 186074 181260 175576 169812 164372 159212 154287 149759 145779
54745 145779 142464 140108 138966 138697 138327 137002 134688 132150 130438 130271 131507 133056 133652 132938 131655
54730 131655 130713 130404 130669 131795 134383 138712 144478 151178 158388 165559 171947 177153 181578 185864 189799
54715 189799 192232 192271 190197 186938 183016 178489 173577 168656 163712 158423 152879 147614 142794 138011 133238
54700 133238 129390 127427 127214 127690 127947 127744 127201 126484 125770 125228 124918 124777 124578 123892 122450 120678 119512
54683 119512 119375 119669 119604 119222 119122 119402 119403 118559 117045 115487 114323 113582 113125 112939 113163 113835 114718 115520 116229
54664A16229P66O23r6j102j672j498r36m53k31k33k63l0N19R90J012P24M58J29
54646A14936m17q08n52M4J43l83p33l50L94Q35P79M41J35J85O67J130J032M82
54628A17960P3j2j03l02k59J78P68J333J816J820R07n57j572j667j252p62k28
54611A18141K05K63J94N26R86O70m00r89m16M17M10k82q40r63p48j93M21M25k38
54592A17589o64l50r8o27j157n19R43J790J434N69j12n48q35j047j372j706j338
54575A11952P7J578J919J259P80Q17N81k55r29q23k79J37L55M12K10pL50J237
54557A19371J691J031j81q40n68J55P27Q84O66L63L57P68J344J745J775J353N95
54540A31236r4l18k09k14l68k25L33P14L75m11r44r50p03m68k25J5P9q6j58K42
$$ plain form
54664 116229 116995 117618 117522 116420 114748 113250 112314 111861 111630 111397 111134 111104 111623 112613 113625 114349 114807 114936
54646 114936 114519 113711 113159 113203 113346 112963 112230 111880 112274 113109 113888 114329 114464 114649 115316 116446 117478 117960
54628 117960 118033 118021 117918 117616 117357 117535 118303 119636 121452 123272 124179 123622 122050 120383 119131 118369 118141
54611 118141 118346 118609 118803 119329 120315 120985 120585 119596 119180 119597 120007 119725 118885 117922 117174 116981 117402 117827 117589
54592 117589 116925 116575 116477 115850 114693 114174 115117 116907 118341 118910 118798 118250 117415 116368 114996 113290 111952
54575 111952 112029 113607 115526 116785 117565 118382 118963 118708 117779 116956 116677 116814 117169 117581 117791 117784 118134 119371
54557 119371 121062 122093 121912 121072 120504 120659 121386 122270 122936 123299 123656 124424 125768 127513 129288 130641 131236
54540 131236 131142 130824 130615 130401 130033 129808 130141 130855 131230 130819 129875 128925 128222 127754 127529 127544 127623 127537 127379 127621
54520A27621R41J173L84r31j543q27N06J183P32j91o48k93M79R69P39j1o78r29
54502A28676r54r85q80m65M4L62N76Q47R36N91J37J40N40P65O05L53J03l53q29
54483A30209p13M5O10L87p6J28R55J490J186M53M4K50P77J128J023N93L02N99
54465A39390J597K947L931L830K529Q57JL37R69O60q75k654l461k960j896j264
54449A43938j342j582j370p24j27J69L00K92j78j253k310k323r91P00J329M89
54433A35017p96j264p75k05j53k98j49K12M28N69R22J363J480J195Q00L92j66
54416A38572p31q17l13K34K63j03k70M6M90M84q7o48m98L44J072J086Q12J105
54398A41041K017K712K587J914J227O70K02k0J48N56R64J254J178L02j267k496
$$ plain form
54520 127621 128562 129735 130119 129188 127645 126818 127324 128507 129239 129048 128400 128107 128586 129555 130294 130283 129605 128676
54502 128676 127722 126737 125857 125392 125436 125798 126374 127221 128157 128748 128885 129025 129565 130330 130935 131288 131391 131038 130209
54483 130209 129496 129541 130151 130538 130462 130590 131545 133035 134221 134674 134718 134968 135745 136873 137896 138489 138791 139390
54465 139390 140987 143934 147865 151695 154224 155081 155082 155419 156388 157048 156173 153519 150058 147098 145202 143938
54449 143938 142596 141014 139644 138920 138793 138962 139262 139554 139376 138123 135813 133490 132499 133199 134528 135017
54433 135017 134221 132957 132182 131977 131824 131526 131377 131589 132017 132586 133508 134871 136351 137546 138346 138738 138572
54416 138572 137841 137024 136711 136945 137208 137105 136835 136881 137371 137855 137768 137120 136622 136966 138038 139124 139936 141041
54398 141041 143058 145770 148357 150271 151498 152168 152370 152350 152498 153054 154018 155272 156450 156752 155485 152989
54382A52989k308q73N54J027P58M56L72K97K04L77Q98J343J259Q04O61J228K092
54365A62138K507K209J580J004M56j66o11n29L6O93J161J401J346Q42k4q75j457
54348A71711j905k393k724k609k176j883j887j908j713j444j258j030o98n98r96
54333A46489j483j293k55R67J640J630J168M52l13q30r39q06o09l02J49N12N42
54316A46719K97k5l27n12l82J7K06k09r35j337j229r40o85l26J85O28P87O84L70
54297A42986j73q14j236j235q58k58L75P06N20J39K17Q79J441J271O25L27P20
54280A45632J362J642J363P22N3k76l4O62J286J342Q22J65k19k87j85O7N32J024
54262A55673J097N05m01r32o71J97J101J515J267O02j3k69k09j4L19Q83J481J621
$$ plain form
54382 152989 150681 149808 150362 151389 152147 152603 152975 153272 153476 153853 154751 156094 157353 158157 158818 160046 162138
54365 162138 164645 166854 168434 169438 169894 169728 169117 168588 168624 169317 170478 171879 173225 174067 174043 173168 171711
54348 171711 169806 167413 164689 162080 159904 158021 156134 154226 152513 151069 149811 148781 148083 147485 146489
54333 146489 145006 143713 143458 144425 146065 147695 148863 149315 149002 148172 147233 146427 145818 145516 145665 146177 146719
54316 146719 147016 146991 146664 146152 145770 145787 145993 145784 144849 143512 142283 141343 140658 140332 140517 141145 141932 142616 142986
54297 142986 142813 141999 140763 139528 138670 138412 138787 139493 140013 140152 140369 141248 142689 143960 144585 144912 145632
54280 145632 146994 148636 149999 150721 150774 150498 150464 151126 152412 153754 154576 154741 154522 154235 154050 154117 154649 155673
54262 155673 156770 157275 156874 155942 155271 155468 156569 158084 159351 159953 159940 159671 159462 159448 159767 160650 162131 163752
54244A63752J041P2o64q97q47q04p91o73m34j84j2Mk77q13j154q05N1N89K97l74
54224A57077o48l86jL06O34Q53O22M5l73n29q84j532j735q52O68J715J704R17
54206A57601l0o38o77l59k45o51j207j311q87l71j08j01k27l94m71l37J01R16
54188A50604K010K836K748J831R54O80O39L54J29M37R42R74P08Q66J464J757J513
54171A71446J269J211O97n95j922k340j849j183r20j211j907k474k219j069O9
54156A57003L06k07n87m30j33j55l93m33j25K70L86Q6m34q89j218j514j714j517
54138A48302p79K41J074J443J387J158J057J232J530J619J343Q76N58O05R12J073
54122A63631P58K20J92R81J906K134J824J898K580K889J917J05j251j494j154
$$ plain form
54244 163752 164793 164865 164201 163304 162457 161653 160862 160189 159755 159571 159559 159563 159286 158473 157319 156514 156565 157154 157451 157077
54224 157077 156429 156043 156042 156348 156982 157835 158457 158502 158129 157600 156716 155184 153449 152597 153265 154980 156684 157601
54206 157601 157571 156933 156256 155897 155652 155001 153794 152483 151596 151225 151117 151016 150789 150395 149924 149587 149688 150604
54188 150604 152614 155450 158198 160029 160983 161663 162302 162656 162785 163222 164164 165138 165846 166712 168176 169933 171446
54171 171446 172715 173926 174623 174028 172106 169766 167917 166734 165814 164603 162696 160222 158003 156934 157003
54156 157003 157309 157102 156515 156085 155952 155797 155404 154971 154846 155116 155502 155588 155154 154265 153047 151533 149819 148302
54138 148302 147523 147764 148838 150281 151668 152826 153883 155115 156645 158264 159607 160483 161041 161646 162558 163631
54122 163631 164389 164609 164801 165782 167688 169822 171646 173544 176124 179013 180930 181035 179784 178290 177136
54107A77136j086j444j676j327o71l84o79r84o76Q9O07N06L7m53q80j228j333
54090A65554j077m80L41J098J296O54l97j053j066q90q33n66L31J705K974L658
54074A71249L578K890K071J637J645J693J485J110P17L49J95N29J188J476R45
54059A92757m5q25j118j040o55lO36Q81O90M56O50J317J981K100J803J852K680
54042B04117L724M215M326M844N850O599O777O933P427P803P703P506P555P445
54028B92824O768N935N477N110M258L120K342J946J416O55O2k62o39j154j567
54013C26291j885k440l314m221m973n583n924n832n516n353n277m895m273l989
53999B62816m268m573m306l541k830k574k715k838k541j897j528j855k395k201
$$ plain form
54107 177136 176050 174606 172930 171603 170932 170548 169869 168885 168209 168298 168905 169411 169448 168995 168115 166887 165554
54090 165554 164477 163997 164338 165436 166732 167386 166989 165936 164870 163980 163147 162581 162912 164617 167591 171249
54074 171249 174827 177717 179788 181425 183070 184763 186248 187358 188075 188424 188619 189148 190336 191812 192757
54059 192757 192712 191887 190769 189729 189074 189071 189707 190588 191278 191734 192384 193701 195682 197782 199585 201437 204117
54042 204117 207841 212056 216382 221226 227076 233675 240452 247385 254812 262615 270318 277824 285379 292824
54028 292824 299592 305527 311004 316114 320372 323492 325834 327780 329196 329851 329913 329651 329012 327858 326291
54013 326291 324406 321966 318652 314431 309458 303875 297951 292119 286603 281250 275973 271078 266805 262816
53999 262816 258548 253975 249669 246128 243298 240724 238009 235171 232630 230733 229205 227350 224955 222754
53985B22754j010M84J620K454L253L716L196J593k77j387j495j398k029l342m312
53970B23820m165l269k517k221k020j632j123n38J38O76Q02P11Q84J316J466J124
53954B13452P59Q02J093J301J425J594J758J951K463L397M339M765M657M336M003
53939B52095L780L953M703N630N964N291L913K512J687J695K310K994L420L829
53925C03776M586N518O016N827N358N106N163N485O214P356Q478R090R262R321
53911C96556R214Q625P750P242P193O830N585L956K761J978R81l59j558k409l188
53896D51157l932m284m290m606n581o705p353p641q111q892r658j0035r766q801
53882C51502p539o663o375o237n993o011o473o712o059m901m139l914l732l564
$$ plain form
53985 222754 221744 222228 223848 226302 229555 233271 236467 238060 237783 236396 234901 233503 231474 228132 223820
53970 223820 219655 216386 213869 211648 209628 207996 206873 206335 206473 207149 207951 208662 209546 210862 212328 213452
53954 213452 214211 215013 216106 217407 218832 220426 222184 224135 226598 229995 234334 239099 243756 248092 252095
53939 252095 255875 259828 264531 270161 276125 281416 285329 287841 289528 291223 293533 296527 299947 303776
53925 303776 308362 313880 319896 325723 331081 336187 341350 346835 353049 360405 368883 377973 387235 396556
53911 396556 405770 414395 422145 429387 436580 443410 448995 452951 455712 457690 458671 458312 456754 454345 451157
53896 451157 447225 442941 438651 434045 428464 421759 414406 406765 398654 389762 380104 370069 360303 351502
53882 351502 343963 337300 330925 324688 318695 312684 306211 299499 293440 288539 284400 280486 276754 273190
53868B73190l857m441m428l478k406k151k706l383l667l459k877k180j663j379
53854B31115j165j015j174j699k255k501k440k281k167k087j882j291l19M76M38
53839B09753l09q50n11L58Q29M62l04o53j86P23J341J341J015O83K58l73q73q66
53821B11838n51l62j91L93J287J949K273K607K903K696K168K243L230M202M321
53806B41006M033M250M899N157M742M236M250M915O017P052P296O474N327M927
53792C14581N421N952N786N005M025L042K151J579J408J314Q59m6j160k304l564
53777C44049n038o503p466p653p337o978o628o006n186m733m929n267n091m459
53763B60775l936l729l466k788j795r13o36j213k304k983k589j536q79j078j560
$$ plain form
53868 273190 269333 264892 260464 256986 254580 252429 249723 246340 242673 239214 236337 234157 232494 231115
53854 231115 229950 228935 227761 226062 223807 221306 218866 216585 214418 212331 210449 209158 208839 209315 209753
53839 209753 209444 208594 208083 208441 209270 209732 209428 208775 208589 209312 210653 211994 213009 213692 213950 213577 212704 211838
53821 211838 211287 210925 210734 211127 212414 214363 216636 219243 222146 224842 227010 229253 232483 236685 241006
53806 241006 245039 249289 254188 259345 264087 268323 272573 277488 283505 290557 297853 304327 309654 314581
53792 314581 320002 325954 331740 336745 340770 343812 345963 347542 348950 350264 351123 351077 349917 347613 344049
53777 344049 339011 332508 325042 317389 310052 303074 296446 290440 285254 280521 275592 270325 265234 260775
53763 260775 256839 253110 249644 246856 245061 244148 243512 242299 239995 237012 234423 232887 232008 230930 229370
53748B29370j575j081o48p50j333j832j651p82O3K42j7qL82N14L4n57o55k99J33
53729B19550N33R25J118R92Q30R50J224J438J739K201K323J669Q56R17J743K122
53713B41130J511P88P75R90P19M53J187K636L393K861K008J939K563L051K968
53698B68972K559K322K672L592M423M449L839L491L629L330J896Q8q12o89n23
53683C03238q54j272j398j462j660j690j293p55m57l55k70l11n94q46p61n56o92
53666B88012j100j180o53LJ82o6k35j43j26l95o42m99j25R1J83M96R77J127P54
53647B86661K98J73L00N32J042J806K196J716Q43N01Q58J305J492J720K197K595
53631C06235K579K236J852J549J390J417J485J403J324J645K346K832K548J537
$$ plain form
53748 229370 227795 226714 226066 225316 223983 222151 220500 219718 219781 220023 220006 219998 220380 220894 220928 220371 219716 219417 219550
53729 219550 220083 221008 222126 223118 223948 224898 226122 227560 229299 231500 233823 235492 236348 237265 239008 241130
53713 241130 242641 243429 244204 245194 245913 246366 247553 250189 253582 256443 258451 260390 262953 266004 268972
53698 268972 271531 273853 276525 280117 284540 288989 292828 296319 299948 303278 305174 305262 304450 303761 303238
53683 303238 302384 301112 299714 298252 296592 294902 293609 292854 292397 292042 291772 291461 290867 290021 289260 288704 288012
53666 288012 286912 285732 285079 285082 285264 285198 284963 284820 284694 284299 283657 283158 283033 283124 283307 283803 284780 285907 286661
53647 286661 286959 287132 287432 287964 289006 290812 293008 294724 295567 296068 296926 298231 299723 301443 303640 306235
53631 306235 308814 311050 312902 314451 315841 317258 318743 320146 321470 323115 325461 328293 330841 332378
53617C32378L24m28k08Q95K027K377K211K500L406L886L196K066J761K409L033
53602C61833K989K683K804L406L943L888L197K252J465R11L72l36j217k147k867
53587C83176k978k316j332o88m28o5M58N23k14j248j978k458k897k992k447j752
53571C60364j697k217k492k111j520j180r30m19K49O15M12j50o08o51m28l34m45
53554C46458l87N6M69L31j58k82K10P79R31R33J420K457L261L041J961J115J381
53537C63976K434L210L305L449M379N693O321N898N166N046N750O806P717Q349
53523D37499Q871R380R675R551R198R129R596J0402J1333J2427J3631J4721J5723
53510E81136J7053J8769K0228K0905K1143K1522K1846K1452K0343J9296J8817
$$ plain form
53617 332378 332702 332274 332066 332961 334988 337365 339576 342076 345482 349368 352564 354630 356391 358800 361833
53602 361833 364822 367505 370309 373715 377658 381546 384743 386995 388460 389371 389743 389407 388190 386043 383176
53587 383176 380198 377882 376550 375862 375434 375369 375827 376350 376136 374888 372910 370452 367555 364563 362116 360364
53571 360364 358667 356450 353958 351847 350327 349147 348217 347798 348047 348662 349074 348924 348316 347665 347237 346903 346458
53554 346458 346071 346127 346596 346927 346769 346487 346697 347476 348407 349340 350760 353217 356478 359519 361480 362595 363976
53537 363976 366410 369620 372925 376374 380753 386446 392767 398665 403831 408877 414627 421433 429150 437499
53523 437499 446370 455750 465425 474976 484174 493303 502899 513301 524634 537061 550692 565413 581136
53510 581136 598189 616958 637186 658091 679234 700756 722602 744054 764397 783693 802510
53499H02510J8611J8146J7280J6248J5368J4839J4530J4083J3437J3074J3346
53488I71472J3921J4277J4424J4550J4412J3796J3266J3527J4242J4410J3872
53477A126169J3361J3059J2334J1060J0025R497Q562O538M104K178N65j420l674
53464A212358n636p329r049j0500j1227j1577j2200j2901j3039j2954j3736j5473
53452A076737j6860j6933j6251j5894j6050j6225j6157j5939j5525j4830j3986
53441I02087j3182j2355j1421j0559r905r175p978o327m516k697r51L43Q10P42
53427H14916J034K230L934N353O153O673P464Q823J0631J2452J3826J4639J5182
53414I23310J5837J6768J7988J9505K1173K2553K3263K3526K4043K5219K6719
$$ plain form
53499 802510 821121 839267 856547 872795 888163 903002 917532 931615 945052 958126 971472
53488 971472 985393 999670 1014094 1028644 1043056 1056852 1070118 1083645 1097887 1112297 1126169
53477 1126169 1139530 1152589 1164923 1175983 1186008 1195505 1204067 1210605 1214709 1216887 1217452 1216032 1212358
53464 1212358 1206722 1199393 1190344 1179844 1168617 1157040 1144840 1131939 1118900 1105946 1092210 1076737
53452 1076737 1059877 1042944 1026693 1010799 994749 978524 962367 946428 930903 916073 902087
53441 902087 888905 876550 865129 854570 844665 835490 827512 821185 816669 813972 813021 813364 814174 814916
53427 814916 815950 818180 822114 827467 833620 840293 847757 856580 867211 879663 893489 908128 923310
53414 923310 939147 955915 973903 993408 1014581 1037134 1060397 1083923 1107966 1133185 1159904
53403A159904K8018K9087L0220L1402L2293L2923L3899L5673L7909L9886M1374
53392A532588M2736M4204M5414M5832M5467M4932M4788M4930M4682M3529M1633
53381B020735L9548L7538L5403L3079L0929K9143K7027K3547J8694J3740R856
53370B319239O749L217j272o079j0486j4618j9036k3857k8676l3073l6800l9646
53358B115662m1523m2682m3549m4287m4814m5066m4981m4288m2786m0832l9104
53347A641750l7760l6323l4546l2991l2362l2608l3019l2922l2023l0342k8294
53336A278560k6578k5467k4384k2607k0300j8306j6963j5710j3973j1980j0447
53325A071845r785r859j0201j0378j0296j0251j0441j0474r798q615p784p665
$$ plain form
53403 1159904 1187922 1217009 1247229 1278631 1310924 1343847 1377746 1413419 1451328 1491214 1532588
53392 1532588 1575324 1619528 1664942 1710774 1756241 1801173 1845961 1890891 1935573 1979102 2020735
53381 2020735 2060283 2097821 2133224 2166303 2197232 2226375 2253402 2276949 2295643 2309383 2319239
53370 2319239 2325988 2329205 2327933 2321854 2311368 2296750 2277714 2253857 2225181 2192108 2155308 2115662
53358 2115662 2074139 2031457 1987908 1943621 1898807 1853741 1808760 1764472 1721686 1680854 1641750
53347 1641750 1603990 1567667 1533121 1500130 1467768 1435160 1402141 1369219 1337196 1306854 1278560
53336 1278560 1251982 1226515 1202131 1179524 1159224 1140918 1123955 1108245 1094272 1082292 1071845
53325 1071845 1062060 1052201 1042000 1031622 1021326 1011075 1000634 990160 980362 971747 963963 956298
53313I56298p551o719n401m231l137j578L04J578J741J424J599K594M169O127
53299I47217Q333J0411J2010J3316J4878J6821J8572J9608K0086K0499K0932K1026
53287A143709K0690K0375K0468K0694K0396J9266J7539J5577J3517J1425R465
53276A333121P743O074M056J408j744m883p443r299j0914j2863j5147j7142j8295
53263A254672j8695j8928j9471k0354k1258k1825k1945k1894k2104k2756k3617
53252A021825k4304k4588k4424k3875k3175k2622k2229k1629k0610j9595j9216
53241G75558j9481j9703j9372j8683j8076j7570j6872j5904j4853j3811j2706
53230E88527j1547j0404r196p792o395n473n162n059m861m880n547o629p383p543
$$ plain form
53313 956298 948747 942028 936627 932396 929259 927681 927985 929563 931304 932728 934327 936921 941090 947217
53299 947217 955550 965961 977971 991287 1006165 1022986 1041558 1061166 1081252 1101751 1122683 1143709
53287 1143709 1164399 1184774 1205242 1225936 1246332 1265598 1283137 1298714 1312231 1323656 1333121
53276 1333121 1340864 1346938 1350994 1352402 1350658 1345775 1338332 1329033 1318119 1305256 1290109 1272967 1254672
53263 1254672 1235977 1217049 1197578 1177224 1155966 1134141 1112196 1090302 1068198 1045442 1021825
53252 1021825 997521 972933 948509 924634 901459 878837 856608 834979 814369 794774 775558
53241 775558 756077 736374 717002 698319 680243 662673 645801 629897 615044 601233 588527
53230 588527 576980 566576 557380 549588 543193 537720 532558 527499 522638 517758 512211 505582 498199 490656
53216D90656p669q349r362j0001j0004r813r877j0036r796r039q170p548p002
53203C73990o112m859l756l357l814m865o021o746o793o513o511o792o602n488
53189B95761m150l706m272m887m780m132l449k849k268j802j500j172p80o32r37
53174B54445j429j788k010k049j543m70L13m0j125j665j161l92j98m26m64k34
53158B39764j00j41r1L0k17j068k063k446j970j125n53l63k49j16k64q07j231
53141B26990q71K34J324J689J282N44n8l05k27J1K32L54L76L83O20J306K216K608
53123B38708J968P48Q5O10J776K451K110J338J203K124L456M198L992L234K312
53108B70313J293K93l37o21j167k287l314l391k711k231k316k368j914j336j186
$$ plain form
53216 490656 482987 474638 465276 455275 445271 435458 425581 415545 405749 396710 388540 380992 373990
53203 373990 367878 363019 359263 355906 352092 347227 341206 334460 327667 321154 314643 307851 301249 295761
53189 295761 291611 287905 283633 278746 273966 269834 266385 263536 261268 259466 257966 256794 256014 255382 254445
53174 254445 253016 251228 249218 247169 245626 245156 245469 245429 244304 242639 241478 241086 240888 240462 239998 239764
53158 239764 239664 239523 239432 239462 239245 238177 236114 233668 231698 230573 230020 229657 229408 229292 229028 228221 226990
53141 226990 226119 226353 227677 229366 230648 231192 231134 230829 230602 230613 230845 231199 231575 231958 232578 233884 236100 238708
53123 238708 240676 241424 241509 242119 243895 246346 248456 249794 250997 253121 256577 260775 264767 268001 270313
53108 270313 271606 271899 271562 270941 269774 267487 264173 260782 258071 255840 253524 251156 249242 247906 246720
53093B46720j333j180n74p6l71j446k473k594j888j223j103j061n48Q6J24l53
53077B30707o49n16k83J0O35J298J223L49m53o34o51r43j132q23m49o00j104j430
53059B24555j467j317p60K52J043J020O79R35J625J644N90o30j001n17J94O93
53043B27538Q20N57J10j38j32k77q22j380j407q83k75J42M71P51O95J58m06l01
53025B25221M78J119R74M09K59O31Q17M18o5l9L27M51K04n3o0Q2J73N7k66m53
53005B30684L4J185K100J931J001M24O36R19N32k63o48l25K53N99P62J071J591
52988B42486J941J759J210R07J236J849K060J625R24M01N7l97r92j317j018l57
52972B52374o0m15q03m08O69J444J262M79j67m15l93j11M62J068J318J178Q93
$$ plain form
53093 246720 245387 244207 243633 243557 243186 241740 239267 236673 234785 233562 232459 231398 230850 230936 231060 230707
53077 230707 230058 229542 229259 229269 229904 231202 232425 232774 232321 231687 231036 230093 228961 228138 227689 227089 225985 224555
53059 224555 223088 221771 221011 221263 222306 223326 224005 224940 226565 228209 228799 228169 227168 226651 226845 227538
53043 227538 228358 228915 229025 228887 228755 228478 227656 226276 224869 223986 223711 223853 224324 225075 225770 225928 225522 225221
53025 225221 225699 226818 227792 228201 228460 229091 229908 230326 230261 230222 230549 231000 231204 231151 231091 231173 231346 231403 231137 230684
53005 230684 230718 231903 234003 235934 236935 237359 237995 238914 239446 239183 238535 238210 238463 239062 239824 240895 242486
52988 242486 244427 246186 247396 248303 249539 251388 253448 255073 255997 256398 256455 256058 255066 253749 252731 252374
52972 252374 252314 251899 251096 250688 251357 252801 254063 254542 254375 253960 253567 253456 253918 254986 256304 257482 258375
52955B58375N69J46l23o63q14q74r40j156j694k411k743k286j375o97m35k01K39
52938B42717O46P25N16K22rm7J82N32O89M96O0m42p99p53k17M53P26N24K73K65
52918B46759K72om87q86j197j593j945j783r15J51O26K76l91p82p86n72j65M07
52900B36983P77N75Q2k2L91P33O55N22O84Q14N21P2ML14N98P22P62O25K45r7j16
52879B45844k0p8j0N48J299J660J749K133K698K702K013J479J793K652L315L333
52863B73110K603J296qp66j289k368l895m690m140l206l096l636l730k976j961
52848B41248j286j036j175j653k131k158j717j195q05m65j72n5MK93P55Q98L67
52831B29717o62j628j910j107N43J969K050Q21m93q66n24l48n97p63m89q3J8j38
$$ plain form
52955 258375 258944 259090 258767 258104 257290 256416 255476 254320 252626 250215 247472 245186 243811 243114 242679 242478 242717
52938 242717 243363 244088 244604 244826 244817 244770 244952 245484 246173 246669 246729 246287 245488 244735 244518 244971 245697 246221 246494 246759
52918 246759 247031 247025 246538 245652 244455 242862 240917 239134 238219 238370 238996 239272 238881 238099 237313 236741 236576 236983
52900 236983 237760 238335 238417 238395 238786 239519 240174 240696 241380 242194 242715 242787 242791 243105 243703 244425 245187 245812 246057 245960 245844
52879 245844 245824 245746 245736 246284 247583 249243 250992 253125 255823 258525 260538 262017 263810 266462 269777 273110
52863 273110 275713 277009 277001 276235 274946 272578 268683 263993 259853 256647 253551 249915 246185 243209 241248
52848 241248 239962 238926 237751 236098 233967 231809 230092 228897 228092 227627 227455 227400 227404 227697 228452 229350 229717
52831 229717 229055 227427 225517 224410 224953 226922 228972 229793 229300 228434 227910 227562 226965 226202 225713 225630 225648 225510
52813B25510j55K07Q40J406J539J151O38N56Q81R21K33o93j078r55r61j188j010
52796B27842j93M83J89r09j982k452k194j284q8P16Q29P08Q84J189J235J222J538
52779B27733J840J435M56k44l75m71p86q22k57M68Q85J049J032N32m72j357j643
52762B29003j594j566j271l97N81R42Q17J000J776K510K503J767R38O46Q91J001
52746B39547M07m24l53R37K340K714K290K077K309K323J701P45j48p57p70k6Q46
52729B55758P95l64j569j751r29M1M25K6p85j252q70r1M7p88j764k031j720j345
52711B41833q37J33J182J509J047N14K84J3m49n51K3O16M13l38o67k23L88N89
52693B45479M45K29o5m60p36p40o78p63q66p72n78n20o44q74j133j203p63R6P04
$$ plain form
52813 225510 225355 225562 226402 227808 229347 230498 231136 231692 232573 233494 233727 233034 231956 231001 230040 228852 227842
52796 227842 227649 228132 228321 227412 225430 222978 220784 219500 219412 220128 220957 221665 222549 223738 224973 226195 227733
52779 227733 229573 231008 231464 231220 230845 230374 229588 228766 228509 228977 229862 230911 231943 232475 232003 230646 229003
52762 229003 227409 225843 224572 224175 224756 225698 226515 227515 229291 231801 234304 236071 237009 237655 238546 239547
52746 239547 239954 239530 239177 240114 242454 245168 247458 249535 251844 254167 255868 256613 256465 255708 254938 254912 255758
52729 255758 256553 256189 254620 252869 251940 251981 252406 252432 251647 250395 249525 249434 249481 248693 246929 244898 243178 241833
52711 241833 240996 241129 242311 243820 244867 245381 245665 245678 245229 244678 244701 245317 245730 245392 244725 244502 244890 245479
52693 245479 245924 246153 246088 245628 244892 244152 243474 242711 241845 241073 240495 239975 239331 238457 237324 236121 235358 235454 236158
52674B36158N81J08m0J65K47J20R0P8l62j156j494q59L41J375J984K269K332K399
52656B44336K794L383L460K646J584J153J296J185M54l56o65o73j025j909k768
52641B54895k914k268j390q03m47J6N71Q33O25K58J25L27P70J337J822J989J864
52624B57610J702J628J474J090M98l19j394k432k912k680k114j532q96k54P0L8
52608B49577J40P12J403J737J750J647J272M92k81n15l01p7Q5L60N34K26l26l61
52590B58074L65J214J446R91L06j37j87q7k40o75q27k06Q45J393R85O7n92o22
52572B62113j99K06J90j91m27j70K87M45K82J51J71J89J88K42J42l86j130j570
52554B60533j602j578j616j430r38m43j00K55O18P45P89J339K409L023K339P85
$$ plain form
52674 236158 236739 236847 236807 236972 237219 237339 237429 237507 237145 235989 234495 233636 233977 235352 237336 239605 241937 244336
52656 244336 247130 250513 253973 256619 258203 259356 260652 261837 262291 261935 261270 260597 259572 257663 254895
52641 254895 251981 249713 248323 247520 247073 247089 247660 248493 249118 249376 249501 249828 250598 251935 253757 255746 257610
52624 257610 259312 260940 262414 263504 264002 263683 262289 259857 256945 254265 252151 250619 249723 249469 249539 249577
52608 249577 249717 250429 251832 253569 255319 256966 258238 258730 258449 257934 257633 257556 257641 258001 258535 258761 258435 258074
52590 258074 258439 259653 261099 262090 262396 262259 262072 261985 261745 261070 260243 260037 260882 262275 263260 263327 262735 262113
52572 262113 261914 262120 262310 262119 261692 261522 261809 262254 262536 262687 262858 263047 263235 263477 263619 263233 262103 260533
52554 260533 258931 257353 255737 254307 253369 252926 252826 253081 253699 254444 255233 256572 258981 262004 264343 265128
52538B65128m55q56q30q58r12p72l92J95Q69J259R44R7m07J54J476K537K736K348
52520B72261J859J284M35l87n68K2Q27J360J680K025K336K485K607K880L199L359
52504B97664L309K923J882J91j463k357k607k858l292l422k966k283j858j752
52490B81111j698j466j011m98k12k58m15m87o35j033j355j084k89L75M53J56j1
52473B71643K60Q96J491J617J387J501K344L319L633L463L619M235M614M389L901
52458C12312L255K023K45j137j466j325j655k466l121l434l724l951l644k702
52444B89210j724j369j656k016j873j174m67l50q33j339j370r65n13l49o05j065
52428B71542j158m71O34J346J417J359J470J355P05j9j73J95O41J016J361J459
$$ plain form
52538 265128 264673 263817 262987 262129 261217 260445 260053 260248 261117 262376 263320 263417 263010 263164 264640 267177 269913 272261
52520 272261 274120 275404 275839 275452 274884 274906 275733 277093 278773 280798 283134 285619 288226 291106 294305 297664
52504 297664 300973 303896 305778 305969 304506 302149 299542 296684 293392 289970 287004 284721 282863 281111
52490 281111 279413 277947 276936 276438 276226 275968 275553 275066 274431 273398 272043 270959 270670 271045 271498 271654 271643
52473 271643 271903 272799 274290 275907 277294 278795 281139 284458 288091 291554 295173 299408 304022 308411 312312
52458 312312 315567 317590 317835 316698 315232 313907 312252 309786 306665 303231 299507 295556 291912 289210
52444 289210 287486 286117 284461 282445 280572 279398 278931 278581 277748 276409 275039 274074 273561 273212 272607 271542
52428 271542 270384 269913 270547 271893 273310 274669 276139 277494 278199 278180 278007 278202 278843 279859 281220 282679
52412B82679J147Q64J281K390L487M051M277M675N500O502P044O560N164L620
52398C39241K441J331j63j785k880l385l860m564n072m924m172l179k229j503
52384C05297j108r44p13k19M87J231J828K132K168K274K840L868M908N446N304
52369C34799M745M276M233M421M296L601K603J574M15r16j976k330k233k224k254
52354C53030j812r31l09k97m01j44J65om97o98m46r8K18Q29J876K899L410L554
52336C60342L917M762N748O347O370O075N942O382P453Q777R923J0882J1959J3130
52322D68009J3859J3832J3530J3667J4247J4673J4649J4407J4046J3375J2589
52311F20883J2447J3280J4321J4654J4445J4610J5370J5904J5504J4530J3852
$$ plain form
52412 282679 283826 284690 285971 288361 291848 295899 300176 304851 310351 316853 323897 330457 335621 339241
52398 339241 341682 343013 342850 341065 338185 334800 330940 326376 321304 316380 312208 309029 306800 305297
52384 305297 304189 303245 302532 302313 302800 304031 305859 307991 310159 312433 315273 319141 324049 329495 334799
52369 334799 339544 343820 348053 352474 356770 360371 362974 364548 364963 364047 362071 359741 357508 355284 353030
52354 353030 351218 350287 349978 349681 349280 349136 349301 349295 348798 348100 347654 347556 347774 348603 350479 353378 356788 360342
52336 360342 364259 369021 374769 381116 387486 393561 399503 405885 413338 422115 432038 442920 454879 468009
52322 468009 481868 495700 509230 522897 537144 551817 566466 580873 594919 608294 620883
52311 620883 633330 646610 660931 675585 690030 704640 720010 735914 751418 765948 779800
52300G79800J3714J3569J2935J2000J1222J0529R260O947L949J062j279l169m715
52287H65824n796o356o572o606o510o449o607o808o584n820m894m019k951j571
52273G88281j88J106K766M981O983P885P876P867Q204Q473Q456Q527R019R811
52259H80047J0701J1688J2722J3580J4207J4740J5126J5034J4273J3028J1581
52248A026727J0047Q398O502M184J478j165l301n033o813q763j0529j1799j2570
52235I97363j2983j3207j3477j3783j3654j2687j1270j0256r945r814r368q686
52223H58233q014p370o677n914m950l666k368j549j183p07J24R34J429J843K386
52208H22551K851L081L316L653L734L373L043L189L506L520L490M034N150O210
$$ plain form
52300 779800 793514 807083 820018 832018 843240 853769 863029 869976 873925 874987 873708 870539 865824
52287 865824 860028 853672 847100 840494 833984 827535 820928 814120 807536 801716 796822 792803 789852 788281
52273 788281 788093 789199 791965 796946 803929 811814 819690 827557 835761 844234 852690 861217 870236 880047
52259 880047 890748 902436 915158 928738 942945 957685 972811 987845 1002118 1015146 1026727
52248 1026727 1036774 1045172 1051674 1055858 1057336 1056171 1052870 1047837 1041024 1032261 1021732 1009933 997363
52235 997363 984380 971173 957696 943913 930259 917572 906302 896046 886101 876287 866919 858233
52223 858233 850219 842849 836172 830258 825308 821642 819274 817725 816542 815835 815959 816893 818322 820165 822551
52208 822551 825402 828483 831799 835452 839186 842559 845602 848791 852297 855817 859307 863341 868491 874701
52194H74701O843P186P378P415P469P724P861P246N756L917K105J19k254m654
52180I38812o467p445p860q187q760r543j0065r865r028q019o927n276k914o35
52166H37821N61O78O87J313K363L303L992M507M644M119L115K158J502J020O87
52151H72470O38O76K72o47j340j170m05L28J018J992K918K932J866O02RJ21N75
52134H82855J242K025K661L217M293O176Q229R711J0864J2554J4985J7449J9313
52121I95574K0591K1561K2368K3077K3599K3510K2422K0703J9322J8731J8354
52110A229812J7355J5596J3498J1433R594Q165P211O533N968N612N479N115M016
52097A345387K265L63j547l792o453r057j1209j3111j5091j6919j8012j8256j8117
$$ plain form
52194 874701 881544 888730 896108 903523 910992 918716 926577 933823 939579 943496 945601 945720 943466 938812
52180 938812 932345 924900 917040 908853 900093 890550 880485 870620 861592 853573 846646 841370 838456 837821
52166 837821 838382 839060 839747 841060 843423 846726 850718 855225 859869 863988 867103 869261 870763 871783 872470
52151 872470 873108 873784 874056 873409 872069 870899 870494 870822 871840 873832 876750 879682 881548 882150 882159 882280 882855
52134 882855 884097 886122 888783 892000 896293 902469 910698 920409 931273 943827 958812 976261 995574
52121 995574 1016165 1037726 1060094 1083171 1106770 1130280 1152702 1173405 1192727 1211458 1229812
52110 1229812 1247167 1262763 1276261 1287694 1297288 1305453 1312664 1319197 1325165 1330777 1336256 1341371 1345387
52097 1345387 1347652 1348015 1346468 1342676 1336223 1327166 1315957 1302846 1287755 1270836 1252824 1234568 1216451
52084A216451j7961j7591j6617j4977j2950j0884r112p883p109o306n034l325
52072A086702j474M71K611M734O409P669R091J0956J2668J3492J3581J3792J4560
52059A195262J5413J5705J5349J4686J3900J2922J1717J0374Q921P214N062K374
52047A328899p43l955o885r419j1769j4074j6087j7397j7938j8031j7967j7781
52035A176853j7454j7035j6471j5572j4387j3376j2948j2924j2719j2027j1088
52024A020852j0331r975r979j0107j0051r692r292r215r462r658r545r160q607
52011H95778q027p809q308r193r594r234q930r497j0640j1432j1532j1267j0836
51998G69479j0145r329q602p706o320m999m780n600o176n904n886p270r423j0807
$$ plain form
52084 1216451 1198490 1180899 1164282 1149305 1136355 1125471 1116359 1108476 1101367 1095061 1090027 1086702
52072 1086702 1085228 1085699 1088310 1093044 1099453 1107122 1116213 1127169 1139837 1153329 1166910 1180702 1195262
52059 1195262 1210675 1226380 1241729 1256415 1270315 1283237 1294954 1305328 1314249 1321463 1326525 1328899
52047 1328899 1328156 1324201 1317316 1307897 1296128 1282054 1265967 1248570 1230632 1212601 1194634 1176853
52035 1176853 1159399 1142364 1125893 1110321 1095934 1082558 1069610 1056686 1043967 1031940 1020852
52024 1020852 1010521 1000546 990567 980460 970409 960717 951425 942210 932748 923090 913545 904385 895778
52011 895778 887751 879942 871634 862441 852847 843613 834683 825186 814546 803114 791582 780315 769479
51998 769479 759334 750005 741403 733697 727377 722378 717598 711998 705822 699918 694032 686762 677339 666532
51984F66532j1136j1486j2468j3467j3840j3797j3694j3276j2263j1043j0213
51973E29849r689q872p469n757m049k332l83J930M478O743P972P781O672N710
51959E32584N571N921N820M740L156K144K328L286M133M628N396O936Q779R963
51945F05385J0160R829R303Q234O218L613J398J97k13n07j093j837k361k498k509
51930F43319k884l896n418p113q756j0298j1719j3023j4266j5412j6178j6156
51918E18200j5201j3628j2006j0768r924r077p745n855l869k343j342m91N42J848
51904D28341L413N052O204O279N425M490L865K880P54k178m773o460p644q762
51890D36886r616r806r317q391p220n957m733l403j677K59J671K231K680L994
$$ plain form
51984 666532 655396 643910 631442 617975 604135 590338 576644 563368 551105 540062 529849
51973 529849 520160 511288 503819 498062 494013 491681 491298 493228 497706 504449 512421 520202 526874 532584
51959 532584 538155 544076 549896 554636 557792 559936 562264 565550 569683 574311 579707 586643 595422 605385
51945 605385 615545 625374 634677 642911 649129 652742 654140 654337 654124 653617 652524 650687 648326 645828 643319
51930 643319 640435 636539 631121 624008 615252 604954 593235 580212 565946 550534 534356 518200
51918 518200 502999 489371 477365 466597 456673 447596 439851 433996 430127 427784 426442 425951 426493 428341
51904 428341 431754 436806 443010 449289 454714 459204 463069 465949 466703 464525 459752 453292 445648 436886
51890 436886 427270 417464 408147 399756 392536 386579 381846 378443 376766 377025 378696 380927 383607 387601
51876C87601O038P647Q049P667P310P054O303M734K775J174L32Q7J1j82m42n82
51860D45576n74n30l87J61J227K423L245L592L602L066J576o39k632l852m791
51845D51063o078p409q091q274q676r177q806p323n767m937m267k937j265r0N67
51830C68533J199J667J436P45L78L30j56j164j806j688j559k049k688k810k527
51815C57841k237j789r21J1M89O13P51Q30O84O84J226J907J968J476J215J486
51799C66234J763J672J516J613J725J464Q24O3n80q81o98k81j48m52p84q13q04
51782C71433j107j478j342p01k94o42j232r23Q05L279N332O335O494O379O469
51767C98807O976P730Q189P906P020N977M800L077P69j492l203m581o021p337
$$ plain form
51876 387601 393639 401286 409335 417002 424312 431366 437669 442403 445178 446352 446684 446771 446782 446600 446158 445576
51860 445576 445002 444472 444085 444246 445473 447896 451141 454733 458335 461401 462977 462338 459706 455854 451063
51845 451063 444985 437576 429485 421211 412535 403358 394552 387229 381462 376525 372258 369321 368056 367966 368533
51830 368533 369732 371399 372835 373580 373958 374288 374132 372968 371162 369474 367915 365866 363178 360368 357841
51815 357841 355604 353815 352894 352905 353394 354007 354758 355588 356272 356956 358182 360089 362057 363533 364748 366234
51799 366234 367997 369669 371185 372798 374523 375987 376811 376874 376294 375413 374715 374434 374286 373834 373050 372237 371433
51782 371433 370326 368848 367506 366805 366511 365869 364637 363714 364519 367798 373130 379465 385959 392338 398807
51767 398807 405783 413513 421702 429608 436628 442605 447405 450482 451251 449759 446556 441975 435954 428617
51753D28617q059q192q229q482q796q752p977o414m609l406l046k839k112j059
51739C46645k55L21J055J851K293K464K886L636M179M161L681K834J665O31L92
51724C78439Q92J373J451J478J662J572R61L43K38L53Q4n87j221j609j815j836
51708C81778j613j254q53l62J13K78J69K92Q63J310J105N71K79Qq42k030k499
51691C77313j760n23K42L00ol98q05j204j552j759j609j000k79n7n18j230j719
51674C63436j925j967j739j038M7J128J843K138K290K670L412M335N270O328P437
51659C93665P837O600L926J339K23M75J066J519K214L301M214M494M442M433L982
51644D43730K168j080m700p574r424j0482j0757j0134q932p871p323o915o028
$$ plain form
51753 428617 420558 412366 404137 395655 386859 378107 370130 363716 359107 355701 352655 349816 347704 346645
51739 346645 346390 346711 347766 349617 351910 354374 357260 360896 365075 369236 372917 375751 377416 378047 378439
51724 378439 379331 380704 382155 383633 385295 386867 387828 388171 388409 388762 388846 388259 387038 385429 383614 381778
51708 381778 380165 378911 378058 377696 377809 378087 378256 378548 379411 380721 381826 382397 382676 382684 381842 379812 377313
51691 377313 375553 375030 375272 375572 375566 375168 374363 373159 371607 369848 368239 367239 366960 366903 366385 365155 363436
51674 363436 361511 359544 357805 356767 356814 357942 359785 361923 364213 366883 370295 374630 379900 386228 393665
51659 393665 401502 408102 412028 413367 413590 414065 415131 416650 418864 422165 426379 430873 435315 439748 443730
51644 443730 445898 444818 440118 432544 423120 412638 401881 391747 382815 374944 367621 360706 354678
51631C54678m543k983j970j651j541j031JJ040J505J278N80l91j358j767j287
51616C40560n51o93j875k894k694j749j248j384j331q10n93j132j590q78Q82K605
51600C24625L679M461N408O406P128P575Q016Q575R117R297Q661O832L862L13
51586D13955l061n646p075p205o199m469k482o15Q61J880K747L880N275O437P068
51571D05351P490Q167R046R786J0446J1371J2474J3205J3475J4065J5740J8288
51559E48904K0817K2783K4335K5756K6986K7695K7472K5892K2724J8302J3450
51548H05116Q828M342o23o361j2378j7805k2180k5656k8429l0255l0743k9924
51536F13932k8189k5823k3017k0313j8439j7409j6312j4385j1928r788q293p224
$$ plain form
51631 354678 350135 347152 345182 343531 341990 340959 340960 342000 343505 344783 345363 344972 343614 341847 340560
51616 340560 340009 339316 337441 334547 331853 330104 328856 327472 326141 325331 324738 323606 322016 321138 322020 324625
51600 324625 328304 332765 338173 344579 351707 359282 367298 375873 384990 394287 402948 409780 413642 413955
51586 413955 410894 405248 398173 390968 384769 380300 377818 377203 378064 379944 382691 386571 391846 398283 405351
51571 405351 412841 421008 430054 439840 450286 461657 474131 487336 500811 514876 530616 548904
51559 548904 569721 592504 616839 642595 669581 697276 724748 750640 773364 791666 805116
51548 805116 813944 818286 817663 811302 798924 781119 758939 733283 704854 674599 643856 613932
51536 613932 585743 559920 536903 516590 498151 480742 464430 450045 438117 428329 420036 412812
51524D12812o479o123n868n205m173l414l251l271k973k486k244k314k344k013
51510C60654j338n99j64k12n51q28r56j033r28l73M63R64R65J144K057L149L307
51493C65721K283R38J16k31o19j272k013k577k692k122j046k64n27j622k479k378
51477C49216j775j588k005k397k371k256k473k841k935k765k645k603k357j833
51463C16372j328j066r55p55k97M96J452K192K528K852L638M668N220N101N027
51448C45145N743P134Q400Q805Q155O851N667N133M980M471L343K025Q10n41k069
51433D14052l098k983k144j764k554m152n623o206n770m893m378m454m576m163
51419C57294l316k527k004j594j123m88L54J117J249O24k7R8R01J629J894J915
$$ plain form
51524 412812 406333 400210 394342 389137 384964 381550 378299 375028 372055 369569 367325 365011 362667 360654
51510 360654 359316 358717 358553 358341 357790 356962 356006 354973 354045 353672 354135 355099 356064 357208 359265 362414 365721
51493 365721 368004 368942 369058 368827 368208 366936 364923 362346 359654 357532 356486 356222 355695 354073 351594 349216
51477 349216 347441 345853 343848 341451 339080 336824 334351 331510 328575 325810 323165 320562 318205 316372
51463 316372 315044 313978 313023 312268 311971 312467 313919 316111 318639 321491 325129 329797 335017 340118 345145
51448 345145 350888 358022 366422 375227 383382 390233 395900 401033 406013 410484 413827 415852 416662 416121 414052
51433 414052 410954 407971 405827 404063 401509 397357 391734 385528 379758 374865 370487 366033 361457 357294
51419 357294 353978 351451 349447 347853 346730 346242 346596 347713 348962 349586 349559 349657 350558 352187 354081 355996
51403C55996J914J893J914K088K241K121J898J987K367K598K529K506K813L423
51389C88288M369N796P540R121J0363J1616J3226J5231J7633K0535K3784K6965
51377E54467K9909L2795L5555L7656L8597L8085L5550L0288K2567J4014O113j262
51365H74334r074j7200k4119k8617l1036l2566l3810l4466l4054l2546l0288k7650
51353E38908k4863k2151j9755j7733j5874j3956j2117j0686r609q434o988n758
51341C70984n284n374n320m782m081l580l187k645k040j746j893k111j927j292
51327C25722o03j71J07M14N53J76n32q34l04O24J265J569K067K951L704L719L082
51310C43509K468K368K607K667K311J703R89J4j304k582l226l084k568k113j814
$$ plain form
51403 355996 357910 359803 361717 363805 366046 368167 370065 372052 374419 377017 379546 382052 384865 388288
51389 388288 392657 398453 405993 415114 425477 437093 450319 465550 483183 503718 527502 554467
51377 554467 584376 617171 652726 690382 728979 767064 802614 832902 855469 869483 875596 874334
51365 874334 865260 848060 823941 795324 764288 731722 697912 663446 629392 596846 566558 538908
51353 538908 514045 491894 472139 454406 438532 424576 412459 401773 392164 383730 376742 370984
51341 370984 365700 360326 355006 350224 346143 342563 339376 336731 334691 332945 331052 328941 327014 325722
51327 325722 325119 324948 325055 325469 326022 326198 325666 324832 324528 325152 326417 327986 330053 333004 336708 340427 343509
51310 343509 345977 348345 350952 353619 355930 357633 358622 358636 357332 354750 351524 348440 345872 343759 341945
51295C41945j565j347j172j009q21n58j37L86O30K61l96n49J06J038J699K234
51279C40745L027L933M440M370L944L325K548J761J077K76q58j936k201j416j40
51264C62895R85J782K305K498K320J936J515J051N00r5p32j488k228k599k462
51249C68183k162k179k606l188l617l668l233k537k151k436k994l038k330j451
51235C30593j008r20o80j44L41M67K80o4m66p19n44m8K05k3o3Q75K411L211K651
51216C36355J630J339J769K038J775J473J584J911K021J775J297Q14O20Q33J122
51201C58356J011O47P89J802L027L430K655J179k81j244j535j389j357j819k512
51186C62759k768k258j305n09k75o60j411j997j928j221n14m32r02j254j045m79
$$ plain form
51295 341945 340380 339033 337861 336852 336031 335473 335336 335722 336352 336613 336217 335668 335774 336812 338511 340745
51279 340745 343772 347705 352145 356515 360459 363784 366332 368093 369170 369446 368588 366652 364451 363035 362895
51264 362895 363880 365662 367967 370465 372785 374721 376236 377287 377787 377692 376960 375472 373244 370645 368183
51249 368183 366021 363842 361236 358048 354431 350763 347530 344993 342842 340406 337412 334374 332044 330593
51235 330593 329585 328665 327985 327841 328182 328649 328929 328865 328399 327680 327136 327088 327293 327270 327207 328082 330493 333704 336355
51216 336355 337985 339324 341093 343131 344906 346379 347963 349874 351895 353670 354967 355781 356401 357234 358356
51201 358356 359367 360014 360803 362605 365632 369062 371717 372896 372615 371371 369836 368447 367090 365271 362759
51186 362759 359991 357733 356428 355919 355644 354984 353573 351576 349648 348427 347913 347481 346579 345325 344280 343801
51170C43801J3L23N42N05M7m03n7J160K283K463K069K085K734L347L441L264L119
51153C70736K791J953P62k86q58j002j043j282j594j445o99k14r25k385l060k318
51137C59131j206p71o08Q0Q21N29o27j293q92k66j29L8R48K282L157L299L071
51120C67564K649J893Q98J14j81j36l3O3L02Q33J596K295K617K535K238J867J478
51103C88592J226J290J516J530J296J241J517J606R73n0n55j72N18P62M62Q1n1
51086D01782q2k98o63q37o40l06j53j32J07O87J281J484J267R69R63J334J853
51069D08616K281K741L673N259P035Q397R327J0260J1337J2252J2884J3467J3989
51056E21518J3951J2951J1128Q746N826K571k76j937k290j806j035m35k69l49
$$ plain form
51170 343801 343814 344137 344679 345184 345231 344828 344771 345931 348214 350677 352746 354831 357565 360912 364353 367617 370736
51153 370736 373527 375480 376242 375956 375098 374096 373053 371771 370177 368732 368033 367819 366894 364509 361449 359131
51137 359131 357925 357154 356546 356626 357447 357976 357349 356056 355164 354898 354769 354807 355755 358037 361194 364493 367564
51120 367564 370213 372106 373004 373118 372937 372801 372768 372831 373133 373966 375562 377857 380474 383009 385247 387114 388592
51103 388592 389818 391108 392624 394154 395450 396691 398208 399814 400787 400737 400182 400010 400528 401290 401752 401833 401782
51086 401782 401700 401402 400739 399902 399262 398956 398803 398671 398778 399465 400746 402230 403497 404466 405429 406763 408616
51069 408616 410897 413638 417311 422570 429605 438002 447329 457589 468926 481178 494062 507529 521518
51056 521518 535469 548420 559548 568294 574120 576691 576415 574478 572188 570382 569347 568912 568643 568294
51042E68294k26N3k37j482l097m326n189n909n983m797k990k065k587l637m266
51027E21556m601n142n718n685m744l105j129Q90K769M444N665N844M654K882
51013E18580K019K732M130M788M144K680J204K64j24m00r27j441j449j191j498
50998E33511k543l356l020j779m77N21J364K146K884L727M723N627O387P409Q971
50983E66095J0714J2264J3836J5661J7208J7650J6829J5194J3178J1328J0584
50972G20541J1475J3287J4968J6700J9561K3672K7829L1261L4612L8633M2890
50961I95429M6444M9176N1607N3807N5268N5682N5204N3944N1687M8219M3644
50950A560111L8365L2862K7469K2249J7170J2438Q466N463L240J472pj274k434
$$ plain form
51042 568294 568068 568121 567884 566402 563305 558979 553790 547881 541898 537101 534111 532046 529459 525822 521556
51027 521556 516955 511813 506095 500410 495666 492561 491432 492322 495091 499535 505200 511044 515698 518580
51013 518580 520599 523331 527461 532249 536393 539073 540277 540541 540417 540017 539090 537649 536200 535009 533511
50998 533511 530968 527612 524592 522813 522336 522857 524221 526367 529251 532978 537701 543328 549715 557124 566095
50983 566095 576809 589073 602909 618570 635778 653428 670257 685451 698629 709957 720541
50972 720541 732016 745303 760271 776971 796532 820204 848033 879294 913906 952539 995429
50961 995429 1041873 1091049 1142656 1196463 1251731 1307413 1362617 1416561 1468248 1516467 1560111
50950 1560111 1598476 1631338 1658807 1681056 1698226 1710664 1719130 1724593 1727833 1729305 1729298 1728024 1725590
50937A725590l592m820o225p820r418j0806j2144j3803j5866j7994j9927k1836
50925A581339k4150k7167l0816l4571l7687l9874m1570m3198m4313m4097m2614
50914A171282m0865l9435l7846l5466l2443k9400k6710k4496k2760k1191j9310
50903H41360j7229j5735j5133j4647j3503j2069j1135j0583r574p845n942m308
50891G03657k957k026j854k318k743k631k040j110J84J728L123M116M794N312
50877G05235N780O412P338Q234Q640Q715R117R994J0702J0826J0883J1598J2877
50864H26351J4053J4867J5765J7298J9571K2231K4833K7318L0231L4296L9608
50853A086422M5511N1390N7283O3593P0526P8066Q6130R4322J01796J07894J12773
$$ plain form
50937 1725590 1721998 1717178 1710953 1703133 1693715 1682909 1670765 1656962 1641096 1623102 1603175 1581339
50925 1581339 1557189 1530022 1499206 1464635 1426948 1387074 1345504 1302306 1257993 1213896 1171282
50914 1171282 1130417 1090982 1053136 1017670 985227 955827 929117 904621 881861 860670 841360
50903 841360 824131 808396 793263 778616 765113 753044 741909 731326 721752 713907 707965 703657
50891 703657 700700 698674 696820 694502 691759 689128 687088 685978 686162 687890 691013 695129 699923 705235
50877 705235 711015 717427 724765 732999 741639 750354 759471 769465 780167 790993 801876 813474 826351
50864 826351 840404 855271 871036 888334 907905 930136 954969 982287 1012518 1046814 1086422
50853 1086422 1131933 1183323 1240606 1304199 1374725 1452791 1538921 1633243 1735039 1842933 1955706
50842A955706J17056J20951J24048J25795J25650J22854J16636J06903R4434Q0230
50832C090263O4946M9008L2938J7357K859r974k0589k8610l3755l5674l4220l0076
50820C064473k4754j9603j5008j0829p393n687o665j0676j7529k6695l7357m8638
50808B833639n9911p0805q0865q9591r6783j02594j06983j09437j09425j06948
50798A900297j02429r6315q9021q1068p2886o4638n6486m8872m2131l5984k9885
50787A180582k3862j8530j4211j0621p574n433m420l988l353k426j696j456j611
50774A081401k099k941l931m809n769p253r110j0541j1078j1205j1641j2424j3063
50761I75537j3280j3174j2838j2274j1573j0761r531p617n404l719k732j571O48
$$ plain form
50842 1955706 2072762 2193713 2317761 2443556 2569206 2692060 2808696 2915599 3010033 3090263
50832 3090263 3155209 3204217 3237155 3254512 3257371 3247397 3226808 3198198 3164443 3128769 3094549 3064473
50820 3064473 3039719 3020116 3005108 2994279 2986886 2981199 2974534 2963858 2946329 2919634 2882277 2833639
50808 2833639 2773728 2702923 2622058 2532467 2435684 2333090 2226107 2116670 2007245 1900297
50798 1900297 1797868 1701553 1612532 1531464 1458578 1393940 1337454 1288582 1246451 1210467 1180582
50787 1180582 1156720 1138190 1123979 1113358 1105784 1100351 1095931 1091943 1088590 1086164 1084468 1083012 1081401
50774 1081401 1079302 1076361 1072430 1067621 1061852 1054599 1045489 1034948 1023870 1012665 1001024 988600 975537
50761 975537 962257 949083 936245 923971 912398 901637 892106 884489 879085 875366 872634 871063 871711
50748H71711L661O381Q217R647J1418J3686J6166J8751K1561K4499K7322L0151
50736A063171L3509L7589M1850M5654M9017N2358N5704N8715O1360O3935O6204
50725A629066O7211O6462O4773O3220O1501N8125N2317M4829L6651K7692J7413
50714B189260O269m430j3899k2332k9778l5364l8107l8059l6127l2930k8317k2082
50702A894104j4827p964k890o0J157J529Q00k244q322j6557k5183l3205m0826
50689A745512m8273n4832n9375o1473o1595o0368n7969n4252m9234m3375l7410
50678A157356l1832k6506k0951j5049r306m309q9L771P513J0944J3770J5958J7634
50665A118904J8807J9281J8921J7896J6684J5721J5092J4621J4226J4119J4527
$$ plain form
50748 871711 875372 881753 889970 899617 911035 924721 940887 959638 981199 1005698 1033020 1063171
50736 1063171 1096680 1134269 1176119 1221773 1270790 1323148 1378852 1437567 1498927 1562862 1629066
50725 1629066 1696277 1762739 1827512 1890732 1952233 2010358 2062675 2107504 2144155 2171847 2189260
50714 2189260 2195529 2191099 2177200 2154868 2125090 2089726 2051619 2013560 1977433 1944503 1916186 1894104
50702 1894104 1879277 1871313 1868423 1868363 1869520 1871049 1871849 1869605 1861283 1844726 1819543 1786338 1745512
50689 1745512 1697239 1642407 1583032 1521559 1459964 1399596 1341627 1287375 1238141 1194766 1157356
50678 1157356 1125524 1099018 1078067 1063018 1053712 1049403 1049314 1053085 1060598 1071542 1085312 1101270 1118904
50665 1118904 1137711 1156992 1175913 1193809 1210493 1226214 1241306 1255927 1270153 1284272 1298799
50654A298799J5312J6019J6339J6566J7319J8758K0171K0746K0843K1943K4918
50643A507733K8713L1418L2523L3371L5265L8000M0595M2668M4370M5440M5263
50632A925359M3761M1495L8912L6075L3118L0309K7484K4063J9821J5077R833
50621B245307L412m531j3005k0299k5435k8492k9669k8720k5507k0587j4861q913
50609B028700l043K164N737P014O205M071J018l280r300j6869k5122l3218m0916
50596A923161m8267n4942o0095o3051o4028o3943o3479o2419o0103n6393n2017
50585A274424m7901m4372m1063l7489l3549k9594k6101k3243k0701j7939j4713
50574I37759j1215p701m218q05K259M677O480P914R103J0080J1069J2374J3932
$$ plain form
50654 1298799 1314111 1330130 1346469 1363035 1380354 1399112 1419283 1440029 1460872 1482815 1507733
50643 1507733 1536446 1567864 1600387 1633758 1669023 1707023 1747618 1790286 1834656 1880096 1925359
50632 1925359 1969120 2010615 2049527 2085602 2118720 2149029 2176513 2200576 2220397 2235474 2245307
50621 2245307 2248719 2244188 2231183 2210884 2185449 2156957 2127288 2098568 2073061 2052474 2037613 2028700
50609 2028700 2025657 2027821 2033558 2040572 2046777 2050848 2051866 2048586 2039286 2022417 1997295 1964077 1923161
50596 1923161 1874894 1819952 1759857 1696806 1632778 1568835 1505356 1442937 1382834 1326441 1274424
50585 1274424 1226523 1182151 1141088 1103599 1070050 1040456 1014355 991112 970411 952472 937759
50574 937759 926544 918843 914625 913820 916079 920756 927236 935150 944253 954333 965402 977776 991708
50561I91708J5261J5986J6263J6587J7305J8364J9421K0203K0807K1635K2909
50550A196449K4288K5157K5225K4659K3776K2863K2295K2415K3193K4260K5474
50539A460054K7198K9850L3383L7418M1776M6581N1943N7698O3467O8868P3727
50528A991963P8253Q2952Q8197R3815R9143J03566J06866J09093J10121J09416
50518B973385J06364J00745R2813Q2888P0970N7007M1345K4737P824r097k5812
50507C523169m1899n6843p0284q1844r0743r5832r6268r2200q4719p5041o3696
50496B673800n0644l6154k1267p183N537J6851K6353L3038L6045L5269L0996K3301
50484B765942J2117k156j8448l5461n2134o7700q1536r3063j01696j06939j08678
$$ plain form
50561 991708 1006969 1022955 1039218 1055805 1073110 1091474 1110895 1131098 1151905 1173540 1196449
50550 1196449 1220737 1245894 1271119 1295778 1319554 1342417 1364712 1387127 1410320 1434580 1460054
50539 1460054 1487252 1517102 1550485 1587903 1629679 1676260 1728203 1785901 1849368 1918236 1991963
50528 1991963 2070216 2153168 2241365 2335180 2434323 2537889 2644755 2753848 2863969 2973385
50518 2973385 3079749 3180494 3273307 3356195 3427165 3484172 3525517 3550254 3558078 3548981 3523169
50507 3523169 3481270 3424427 3354143 3272299 3181556 3085724 2989456 2897256 2812537 2737496 2673800
50496 2673800 2623156 2587002 2565735 2558552 2564089 2580940 2607293 2640331 2676376 2711645 2742641 2765942
50484 2765942 2778059 2775903 2757455 2721994 2669860 2602160 2520624 2427561 2325865 2218926 2110248
50473B110248j07476j04387j00241r5116q8683q1115p3410o6586o0662n4768m8329
50462A229475m1774l5918l0918k6279k1675j7308j3376r614n634j433K680O528
50450A034754J0140J3465J6318J8698K0900K3163K5382K7297K8883L0215L0932
50439A280147L0128K7098K2036J5843R383L200k188o286r031j0762j1660j1482
50427A336426j0072p712m874j998L22J549J981K830M925P875J0978J4489J9049
50414A375768K4320K9212L3428L7683M2301M6651N0192N3165N5732N7349N7565
50403A863366N6705N5132N2452M8157M2546L6258K9292K1273J2369L171o272j6490
50391B197959k7607l8808m8886n6921o2464o5530o6462o5521o2665n7939n1856
$$ plain form
50473 2110248 2002772 1898385 1798144 1703028 1614345 1533230 1459820 1393234 1332572 1277804 1229475
50462 1229475 1187701 1151783 1120865 1094586 1072911 1055603 1042227 1032613 1026979 1025546 1028226 1034754
50450 1034754 1044894 1058359 1074677 1093375 1114275 1137438 1162820 1190117 1219000 1249215 1280147
50439 1280147 1310275 1337373 1359409 1375252 1384635 1387835 1385647 1379361 1370330 1359568 1347908 1336426
50427 1336426 1326354 1318642 1313768 1311770 1312092 1313641 1315622 1318452 1323377 1331252 1342230 1356719 1375768
50414 1375768 1400088 1429300 1462728 1500411 1542712 1589363 1639555 1692720 1748452 1805801 1863366
50403 1863366 1920071 1975203 2027655 2075812 2118358 2154616 2183908 2205181 2217550 2220721 2214449 2197959
50391 2197959 2170352 2131544 2082658 2025737 1963273 1897743 1831281 1765760 1703095 1645156 1593300
50380A593300m4957l7260k8648j9647j1143l372M014J0762J5673J7889J7968J7121
50368A531700J5623J2636P515P69o362j2932j8649k3543k7685l1256l4544l7674
50356A375598m0474m2774m4681m6308m7357m7311m6032m3793m0828l7216l3269
50345I05555k9451k5742k1609j6957j2557r145o534m085j664L76J904L013L551
50332G86655L291K477J652J038O44Q41K033L770M911M992M788N314O732Q506J0032
50317H47676J0795J0448R234Q004P410P297P195P040P051P202P350P749Q937J1116
50303I64504J4053J7593K1810K6679L1925L7379M3096M8854N3836N7066N7894
50292A374689N5566M8574L5416J6652m285k3146l7822m8759n6646o0815o0350
$$ plain form
50380 1593300 1548343 1511083 1482435 1462788 1451645 1448273 1452287 1463049 1478722 1496611 1514579 1531700
50368 1531700 1547323 1559959 1567474 1568243 1561881 1548949 1530300 1506757 1479072 1447816 1413272 1375598
50356 1375598 1335124 1292350 1247669 1201361 1154004 1106693 1060661 1016868 976040 938824 905555
50345 905555 876104 850362 828753 811796 799239 790094 783560 779475 777811 778187 780091 783104 786655
50332 786655 789946 792423 794075 795113 795757 796598 798631 802401 807312 812304 817092 822406 829138 837644 847676
50317 847676 858471 868919 878153 886157 893567 900864 908059 915099 922150 929352 936702 944451 953388 964504
50303 964504 978557 996150 1017960 1044639 1076564 1113943 1157039 1205893 1259729 1316795 1374689
50292 1374689 1430255 1478829 1514245 1530897 1526612 1503466 1465644 1416885 1360239 1299424 1239074
50281A239074n5897m9381m2298l5136k8273k2368j7625j3449r238n105j549J132
50269I59887K954M162N209O386P364P577P237P288Q081Q694Q141O705N507N140
50255A050332N399N914O267N670L522L98k275l779m725n883p025p389o750n528
50241A034148m145k803j727j149j111j674l167n843r301j2673j5343j7127j7880
50228I40205j7518j6603j6099j6181j5859j4392j2579j1845j2299j2672j2148
50217G82010j1316j0970j0829j0143q954q036p776p790p571o990o127n107m099
50204F76302l247k504j774j205j102j549k264k773k684k027j408j519k265k751
50190F47230k471k049k319l083l490l322l139l172k939k114j121n78o85j298k150
$$ plain form
50281 1239074 1183177 1133796 1091498 1056362 1028089 1005721 988096 974647 965409 960304 958755 959887
50269 959887 962841 967003 972212 978598 985962 993539 1000776 1008064 1016145 1024839 1032980 1039685 1045192 1050332
50255 1050332 1055731 1061645 1067912 1073582 1077104 1077502 1075227 1071448 1066723 1060840 1053815 1046426 1039676 1034148
50241 1034148 1030003 1027200 1025473 1024324 1023213 1021539 1018372 1012529 1003228 990555 975212 958085 940205
50228 940205 922687 906084 889985 873804 857945 843553 830974 819129 806830 794158 782010
50217 782010 770694 759724 748895 738752 729798 721762 713986 706196 698625 691635 685508 680401 676302
50204 676302 673055 670551 668777 667572 666470 664921 662657 659884 657200 655173 653765 652246 649981 647230
50190 647230 644759 642710 640391 637308 633818 630496 627357 624185 621246 619132 618011 617433 616748 615450 613300
50175F13300k821k963k728k555k452k047j398j087j267j290n81O06J751K824M026
50160F01318N203O016O472O950P940R957J3199J6975J9954K1480K2301K3508K5101
50147G86374K6169K6179K5482K4596K3642K2478K1045J9417J7762J6164J4467
50136A023775J2365R757O800L490l64m624q714j2378j5996j9738k2894k4605k4871
50123I22003k4198k2706k0303j7532j5342j3929j2587j0874r252q355q072p723
50111G51130o881n786m999m771m648l934k502j020j25J90J25m64j651k884l604
50096G08176m056m781n518n523m856m387m324l741j958L86K186L215L958M647
50082F83424N031N037N046N437O139O662O637O241O042O253O336N718M626L764
$$ plain form
50175 613300 610479 607516 604788 602233 599781 597734 596336 595249 593982 592692 592111 592717 594468 597292 601318
50160 601318 606521 612537 619009 625959 633899 643856 657055 674030 693984 715464 737765 761273 786374
50147 786374 812543 838722 864204 888800 912442 934920 955965 975382 993144 1009308 1023775
50136 1023775 1036140 1045897 1052697 1056187 1055823 1051199 1042485 1030107 1014111 994373 971479 946874 922003
50123 922003 897805 875099 854796 837264 821922 807993 795406 784532 775280 766925 758853 751130
50111 751130 744249 738463 733464 728693 724045 720111 717609 716589 716464 716654 716779 716315 714664 711780 708176
50096 708176 704120 699339 693821 688298 683442 679055 674731 670990 669032 669418 671604 674819 678777 683424
50082 683424 688455 693492 698538 703975 710114 716776 723413 729654 735696 741949 748285 754003 758629 762393
50068G62393L288K778K160J920K166K192J355j16j477k230k274j847j598k158
50054G66552l271l834l213k018j218r48o97j67O06J634K872M028N038O411Q514
50039G80289J0769J2237J2887J3588J4948J6791J8741K0606K2024K2404K1576
50028I66860K0187J9155J8780J8455J7211J4637J1441Q865P364O189M579K803
50016A116526J319o09m351r905j5492j9547k2269k4749k7303k9355l0415l0422
50004I03428k9357k7243k4425k1324j7932j4075j0107o853m750l432k289j176
49992G40465l34R4K81M33M20k52j999m634p373r458j0696j1277j1409j1278j1193
49977F61790j1280j1161j0361r052p923p231o432n072l574k735k655k760k702
$$ plain form
50068 762393 765681 768459 770619 772539 774705 776897 778252 778136 776659 774429 772155 770308 768710 766552
50054 766552 763281 759447 756234 754216 752998 752050 751353 751186 751792 753426 756298 760326 765364 771775 780289
50039 780289 791058 803295 816182 829770 844718 861509 880250 900856 922880 945284 966860
50028 966860 987047 1006202 1024982 1043437 1060648 1075285 1086726 1095591 1102955 1109144 1113723 1116526
50016 1116526 1117845 1117236 1112885 1102980 1087488 1067941 1045672 1020923 993620 964265 933850 903428
50004 903428 874071 846828 822403 801079 783147 769072 758965 752112 747362 743930 741641 740465
49992 740465 740131 740225 740506 740939 741359 741107 739108 734474 727101 717643 706947 695670 684261 672983 661790
49977 661790 650510 639349 628988 619936 612013 604782 598350 593278 589704 586969 584314 581554 578852
49964E78852k706k947l141k969k530k024j274Q7K006L991N547O431O607O323O201
49949E98454O736P586P800O942N700N013M939M749L974K824J630M00q70j911k527
49934F51439l023l951n413o900p820q067q024q119q393q528q183p258n797l886
49920E58077j856m22j33o06p50L0J158J734J660J568J877K515L401M542N665O381
49904E84841O807P475Q438R082R107R028R225R194Q318O919N719M625K978Q47
49890F82603q81j805k535l681n071o313p438q473q983q593p660o841o288n637
49876F02404m712l774l203l195l643m125m171l685k904j877m82R97J854J978K181
49861E73643L118M349N195N854O936Q231R010R263R627J0053R677Q189O430N177
$$ plain form
49964 578852 576146 573199 570058 567089 564559 562535 561261 561348 563354 567345 572892 579323 585930 592253 598454
49949 598454 605190 612776 620576 627518 633218 638231 643170 647919 651893 654717 656347 656747 655877 653966 651439
49934 651439 648416 644465 639052 632152 624332 616265 608241 600122 591729 583201 575018 567760 561963 558077
49920 558077 556221 555799 555666 555060 554310 554340 555498 557232 558892 560460 562337 564852 568253 572795 578460 584841
49904 584841 591648 599123 607561 616643 625750 634778 644003 653197 661515 668434 674153 678778 681756 682603
49890 682603 681722 679917 677382 673701 668630 662317 654879 646406 637423 628830 621170 614329 608041 602404
49876 602404 597692 593918 590715 587520 583877 579752 575581 571896 568992 567115 566633 567630 569484 571462 573643
49861 573643 576761 581110 586305 592159 599095 607326 616336 625599 635226 645279 654956 663145 669575 674752
49847F74752M235L207K389K137J883O17j745m088n328n544n727o567p660q099
49833F44462p744p392p493p268n819l646k133j641j185j54P63Q15M05M09J050
49818F03429K100L604N546P262P951P650P065O667O293N511M043K084M47o2K87
49803F69877K56p90k074k665k764l043l396l443l576m460n763o537o632o724p030
49788F11236p128o955o876o708n769m136k772k173j836j354r52o07K45J571K376
49773E68162K164J926K840M680O274O987O974O502N804N272N082M878M338L683
$$ plain form
49847 674752 678987 682194 684583 686720 688603 689220 687475 683387 678059 672515 666788 660221 652561 644462
49833 644462 636718 629326 621833 614565 608746 605100 602967 601326 600141 599987 600750 601565 601970 602379 603429
49818 603429 605529 609133 614679 621941 629892 637542 644607 651274 657567 663078 667121 669205 669652 669590 669877
49803 669877 670133 669343 667269 664604 661840 658797 655401 651958 648382 643922 638159 631622 624990 618266 611236
49788 611236 604108 597153 590277 583569 577800 573664 570892 568719 566883 565529 564577 563970 564215 565786 568162
49773 568162 570326 572252 575092 579772 586046 593033 600007 606509 612313 617585 622667 627545 631883 635566
$$ [...]
##END NTUPLES=NMR SPECTRUM
##END=
